
##TITLE=AC1173_Tolima-ibage-TDOAH12007_5898460_lYcPF7r5ge
##JCAMPDX= 6.0         $$ Bruker NMR JCAMP-DX V2.0
##DATA TYPE= NMR SPECTRUM
##DATA CLASS= NTUPLES
##ORIGIN= BRUKER
##OWNER= Administrator
$$ 1.72 TOPSPIN		Version 2.1
$$ 2012-04-03 21:29:36.203 -0500  Administrator@TOPSPIN
$$ Compression mode = diff/dup
##.OBSERVE FREQUENCY= 400.13188235
##.OBSERVE NUCLEUS= ^1H
##.ACQUISITION MODE= SIMULTANEOUS (DQD)
##.ACQUISITION SCHEME= undefined
##.AVERAGES= 64
##.DIGITISER RES= 22
##SPECTROMETER/DATA SYSTEM= spect
##.PULSE SEQUENCE= noesygpps1d.comp
##.SOLVENT NAME= COFFEE_meoh
##.SHIFT REFERENCE= INTERNAL, COFFEE_meoh, 1, 14.96867
##AUDIT TRAIL= $$ (NUMBER, WHEN, WHO, WHERE, PROCESS, VERSION, WHAT)
$$ ##TITLE= Audit trail, TOPSPIN		Version 2.1
$$ ##JCAMPDX= 5.01
$$ ##ORIGIN= Bruker BioSpin GmbH
$$ ##OWNER= Administrator
$$ $$ C:\Bruker\TOPSPIN/data/COFFEE/nmr/AC1173_Tolima-ibage-TDOAH12007_5898460_lYcPF7r5ge/12/pdata/1/auditp.txt
$$ ##AUDIT TRAIL=  $$ (NUMBER, WHEN, WHO, WHERE, PROCESS, VERSION, WHAT)
(   1,<2012-04-03 21:29:31.312 -0500>,<Administrator>,<TOPSPIN>,<go>,<TOPSPIN 2.1>,
      <created by zg
	started at 2012-04-03 21:17:59.703 -0500,
	POWCHK enabled, PULCHK disabled,
       configuration hash MD5:
       1A 1E CE 29 27 FD 77 03 67 4E F0 E3 C4 B2 CB 90
       data hash MD5: 64K
       23 AA 9D AC D0 F3 5A 46 FD 52 C0 B4 2F 2E C0 0E>)
(   2,<2012-04-03 21:29:34.234 -0500>,<Administrator>,<TOPSPIN>,<proc1d>,<TOPSPIN 2.1>,
      <Start of raw data processing
       efp LB = 0.3 FT_mod = 6 PKNL = 1 PHC0 = 0 PHC1 = 0 SI = 128K 
       data hash MD5: 128K
       27 E3 49 12 45 9E FC B9 1A AA 77 75 4F B4 59 37>)
(   3,<2012-04-03 21:29:35.437 -0500>,<Administrator>,<TOPSPIN>,<proc1d>,<TOPSPIN 2.1>,
      <pk PHC0 = 36.68884 PHC1 = 0 
       data hash MD5: 128K
       3E 17 9D 46 EA 4F 23 E0 6E 16 7E 7A 81 8D 34 52>)
(   4,<2012-04-03 21:29:35.875 -0500>,<Administrator>,<TOPSPIN>,<proc1d>,<TOPSPIN 2.1>,
      <abs ABSG = 1 
       data hash MD5: 128K
       58 D8 83 57 3F 5E 93 99 D0 4F EB 6E CB 40 44 F1>)
(   5,<2012-04-03 21:29:35.953 -0500>,<Administrator>,<TOPSPIN>,<proc1d>,<TOPSPIN 2.1>,
      <abs ABSG = 2 
       data hash MD5: 128K
       18 A2 66 4C 19 75 A7 12 82 9B 67 09 2D 1E C7 1C>)
(   6,<2012-04-03 21:29:36.000 -0500>,<Administrator>,<TOPSPIN>,<proc1d>,<TOPSPIN 2.1>,
      <abs ABSG = 3 
       data hash MD5: 128K
       59 4A B2 9B F2 9C 06 2E A7 54 EC 20 57 1A 8C AA>)
(   7,<2012-04-03 21:29:36.062 -0500>,<Administrator>,<TOPSPIN>,<proc1d>,<TOPSPIN 2.1>,
      <abs ABSG = 4 
       data hash MD5: 128K
       D2 67 A2 A5 79 2C BB 31 05 F2 87 D0 CC 70 23 C8>)
(   8,<2012-04-03 21:29:36.109 -0500>,<Administrator>,<TOPSPIN>,<proc1d>,<TOPSPIN 2.1>,
      <abs ABSG = 5 
       data hash MD5: 128K
       55 49 3B 25 0D D0 AB BE 27 7F F4 BE 64 38 CA 5C>)
$$ ##END=
$$ 
$$ $$ hash MD5
$$ $$ 80 ED B2 ED DA 9B 9A E3 E7 22 2F 54 8D F2 6E DD
##$RELAX= 
##$RELAX= 
##$RELAX= 
##$RELAX= 
##$RELAX= 
##$RELAX= 
##$RELAX= 
##$RELAX= 
$$ [...]
##$TP07= 0
##$TPNAME0= <>
##$TPNAME1= <>
##$TPNAME2= <>
##$TPNAME3= <>
##$TPNAME4= <>
##$TPNAME5= <>
##$TPNAME6= <>
##$TPNAME7= <>
##$TPOAL= (0..7)
0.5 0.5 0.5 0.5 0.5 0.5 0.5 0.5
##$TPOFFS= (0..7)
0 0 0 0 0 0 0 0
##$TUNHIN= 0
##$TUNHOUT= 0
##$TUNXOUT= 0
##$USERA1= <user>
##$USERA2= <user>
##$USERA3= <user>
##$USERA4= <user>
##$USERA5= <user>
##$V9= 5
##$VALIST= <valist>
##$VCLIST= <CCCCCCCCCCCCCCC>
##$VD= 0
##$VDLIST= <DDDDDDDDDDDDDDD>
##$VPLIST= <PPPPPPPPPPPPPPP>
##$VTLIST= <TTTTTTTTTTTTTTT>
##$WBST= 2048
##$WBSW= 25
##$XGAIN= (0..3)
0 0 0 0
##$XL= 0
##$YL= 0
##$YMAX_a= 14524208
##$YMIN_a= -6352142
##$ZGOPTNS= <>
##$ZL1= 120
##$ZL2= 120
##$ZL3= 120
##$ZL4= 120
##$ABSF1= 14.96867
##$ABSF2= -5.58386
##$ABSG= 5
##$ABSL= 3
##$ALPHA= 0
##$AQORDER= 0
##$ASSFAC= 0
##$ASSFACI= 0
##$ASSFACX= 0
##$ASSWID= 0
##$AUNMP= <proc_prof1d_extract.lims>
##$AXLEFT= 0
##$AXNAME= <>
##$AXNUC= <1H>
##$AXRIGHT= 0
##$AXTYPE= 0
##$AXUNIT= <>
##$AZFE= 0.1
##$AZFW= 0.1
##$BCFW= 0
##$BC_mod= 0
##$BYTORDP= 0
##$COROFFS= 0
##$CY= 15
##$DATMOD= 1
##$DC= 0
##$DFILT= <>
##$DTYPP= 0
##$F1P= 0
##$F2P= 0
##$FCOR= 0.5
##$FTSIZE= 131072
##$FT_mod= 6
##$GAMMA= 0
##$GB= 0
##$INTBC= 1
##$INTSCL= 1
##$ISEN= 128
##$LB= 0.3
##$LEV0= 0
##$LPBIN= 0
##$MAXI= 10000
##$MC2= 0
##$MEAN= 0
##$ME_mod= 0
##$MI= 0
##$NCOEF= 0
##$NC_proc= -3
##$NLEV= 6
##$NOISF1= 0
##$NOISF2= 0
##$NSP= 0
##$NTH_PI= 0
##$NZP= 0
##$OFFSET= 14.96867
##$PC= 1
##$PHC0= 36.68884
##$PHC1= 0
##$PH_mod= 1
##$PKNL= yes
##$PPARMOD= 0
##$PPDIAG= 0
##$PPIPTYP= 0
##$PPMPNUM= 2147483647
##$PPRESOL= 1
##$PSCAL= 4
##$PSIGN= 0
##$PYNMP= <proc.py>
##$REVERSE= no
##$SF= 400.130004777315
##$SI= 131072
##$SIGF1= 0
##$SIGF2= 0
##$SINO= 400
##$SIOLD= 131072
##$SPECTYP= <>
##$SREGLST= <1H.CDCl3>
##$SSB= 0
##$STSI= 131072
##$STSR= 0
##$SW_p= 8223.68421052632
##$SYMM= 0
##$S_DEV= 0
##$TDeff= 65536
##$TDoff= 0
##$TI= <>
##$TILT= no
##$TM1= 0
##$TM2= 0
##$TOPLEV= 0
##$USERP1= <user>
##$USERP2= <user>
##$USERP3= <user>
##$USERP4= <user>
##$USERP5= <user>
##$WDW= 1
##$XDIM= 131072
##$YMAX_p= 531935989
##$YMIN_p= -419176598
##$CURPLOT= <Network HP LaserJet P1505>
##$CURPRIN= <$Network HP LaserJet P1505>
##$DFORMAT= <normdp>
##$LAYOUT= <+/1D_H.xwp>
##$LFORMAT= <normlp>
##$PFORMAT= <normpl>
##$SURQMSG= 1
$$ End of Bruker specific parameters
$$ ---------------------------------
##NTUPLES= NMR SPECTRUM
##VAR_NAME=  FREQUENCY,     SPECTRUM/REAL,   SPECTRUM/IMAG
##SYMBOL=    X,             R,               I
##VAR_TYPE=  INDEPENDENT,   DEPENDENT,       DEPENDENT
##VAR_FORM=  AFFN,          ASDF,            ASDF
##VAR_DIM=   131072,        131072,          131072
##UNITS=     HZ,            ARBITRARY UNITS, ARBITRARY UNITS
##FACTOR=    0.0627417313425165, 1,          1
##FIRST=     8223.62146879498, -500,         -104418
##LAST=      0,             630,             -105471
##MIN=       0,             -419176598,      0
##MAX=       8223.62146879498, 531935989,    0
$$ Real data points
##PAGE= N=1
##DATA TABLE= (X++(R..R)), XYDATA
$$ [...]
60664A689367q040p167p304p685o634m427k943k552j675L90K320K809J973M55
60650A648887j208k160j867j309k001l930o094q580j1806j4017j2433p421k888
60637A573173j562k224k521k110j741j542j742l258n934p900q171q372j0218j2815
60623A503063j4267j4645j5454j7015j8231j8335j7360j5499j3392j2433j3227
60612A333205j4320j3821j1822r834q331o456l905j468K93J646K820L673M352
60599A276032N225N962N728M485L353L322M197N023N128M626M249M684N796O697
60585A344507O866O790P075P450P297O705O130N434M363L693M614O864Q693R174
60571A435655R436J0962J3672J6530J9067K1182K2164K1531K0631K1626K4463
$$ y = [1689367, 1681327, 1674160, 1666856, 1659171, 1652537, 1648110, 1645167, 1642615, 1640940, 1641330, 1643650, 1646459, 1648432, 1648887, 1647679, 1645519, 1643652, 1642343, 1640342, 1636412, 1630318, 1621738, 1609932, 1595915, 1583482, 1576061, 1573173, 1571611, 1569387, 1566866, 1564756, 1563015, 1561473, 1559731, 1556473, 1550539, 1542639, 1534468, 1526096, 1515878, 1503063, 1488796, 1474151, 1458697, 1441682, 1423451, 1405116, 1387756, 1372257, 1358865, 1346432, 1333205, 1318885, 1305064, 1293242, 1283408, 1275077, 1268621, 1264716, 1263248, 1263541, 1265187, 1268007, 1271680, 1276032, 1281257, 1287219, 1292947, 1297432, 1300785, 1304107, 1308304, 1313327, 1318455, 1323081, 1327330, 1332014, 1337810, 1344507, 1351373, 1358163, 1365238, 1372688, 1379985, 1386690, 1392820, 1398254, 1402617, 1406310, 1410924, 1417788, 1426481, 1435655, 1445091, 1456053, 1469725, 1486255, 1505322, 1526504, 1548668, 1570199, 1590830, 1612456, 1636919]
60560A636919K6486K5952K4445K4306K4929K3637J9871J6139J4476J4023J2965
60549A864148J1057Q920O373L177L82p94q77j359k585l967n864r377j4252j8686
60535A836296k1496k3065k3922k3867k2883k1521j9853j7293j3994j1169r382
60524A627851p808n813m129l503l265k328p70N85J461J956J704M42r82j302m30
60509A603669O46J393K177L144L746L841M438O633J0052J2949J3846J2731J0681
60496A689946Q800P722P660Q286Q696Q133O927O236O699P999R843J2407J5385
60483A804739J7743J9409K2288K8139L5905M2627M7034N0824N6172O3060O9391
60472B257331P2759P1847O6870N8981M8724L5316J8440N26j4222k3467k8245l0564
$$ y = [1636919, 1663405, 1689357, 1713802, 1738108, 1763037, 1786674, 1806545, 1822684, 1837160, 1851183, 1864148, 1875205, 1884125, 1890498, 1893675, 1894057, 1893263, 1892386, 1891027, 1888442, 1884475, 1878611, 1869234, 1854982, 1836296, 1814800, 1791735, 1767813, 1743946, 1721063, 1699542, 1679689, 1662396, 1648402, 1637233, 1627851, 1620043, 1614230, 1610101, 1606598, 1603333, 1601005, 1600235, 1600820, 1602281, 1604237, 1605941, 1606383, 1605401, 1604099, 1603669, 1604315, 1605708, 1607885, 1611029, 1614775, 1618616, 1623054, 1629687, 1639739, 1652688, 1666534, 1679265, 1689946, 1698746, 1706468, 1714128, 1722414, 1731110, 1739243, 1746170, 1752406, 1759105, 1767104, 1776947, 1789354, 1804739, 1822482, 1841891, 1864179, 1892318, 1928223, 1970850, 2017884, 2068708, 2124880, 2187940, 2257331, 2330090, 2401937, 2468807, 2527788, 2576512, 2611828, 2630268, 2630794, 2616572, 2593105, 2564860, 2534296]
60460B534296l0905k8840k4717j9399j2975m995M216J3352K1220K7512L2498L6439
60448B547702L9472M1841M4067M6711M9974N3869N8848O5641P4028Q2662R1036
60437C195851J00891J14393J31250J49161J66919J85528K06073K28091K50588
60428D728745K73386K96841L21500L48536L79432M14496M52673M92989N34301
60419H242899N72214N97217N97429N63518M91286L81643K40171P6741r5633k62277
60409A1405208m08397n21809n96829o35923o46751o37248o13229n79082n38711
60400F227229m95348m51332m08541l68513l31846k97882k65546k34693k06569
60391C166959j82604j62817j45652j29563j14242j00205q8029p8457p2168o8319
$$ y = [2534296, 2503391, 2474551, 2449834, 2430435, 2417460, 2412465, 2416681, 2430033, 2451253, 2478765, 2511263, 2547702, 2587174, 2629015, 2673082, 2719793, 2769767, 2823636, 2882484, 2948125, 3022153, 3104815, 3195851, 3296742, 3411135, 3542385, 3691546, 3858465, 4043993, 4250066, 4478157, 4728745, 5002131, 5298972, 5620472, 5969008, 6348440, 6762936, 7215609, 7708598, 8242899, 8815113, 9412330, 10009759, 10573277, 11064563, 11446206, 11686377, 11763118, 11667485, 11405208, 10996811, 10475002, 9878173, 9242250, 8595499, 7958251, 7345022, 6765940, 6227229, 5731881, 5280549, 4872008, 4503495, 4171649, 3873767, 3608221, 3373528, 3166959, 2984355, 2821538, 2675886, 2546323, 2432081, 2331876, 2243847, 2165390, 2093222, 2024903]
60381B024903o4299n8452n2341m8652m7249m5372m1588l7417l4575l2749l0871
60370A531338k8829k6911k5014k3209k1779k0118j7117j3325j0895j0555j0409
60359A323177q838o780n764n490m975m514m530l820j098K521M564M243K878J818
60345A293392J505J984K816K942K018J388K445M533N847N826N319N045N281O394
60331A346735Q103Q929P993O704O838P564O439L105j03j372j268j151j535k383
60317A394598l434l757k452k60Q68K30q37j000n58m61q86j269r51N78L196N664
60301A389269O491N564M196L540L828N008O853Q396Q586P871P936R597J2038J4377
60287A493550J6588J8408J8772J7363J5577J4931J5147J4768J3230J1394J0352
$$ y = [2024903, 1960604, 1902152, 1849811, 1801159, 1753910, 1708538, 1666950, 1629533, 1594958, 1562209, 1531338, 1502509, 1475598, 1450584, 1427375, 1405596, 1385478, 1368361, 1355036, 1344141, 1333586, 1323177, 1314339, 1307559, 1301795, 1296305, 1291330, 1286816, 1282286, 1278466, 1277368, 1279889, 1284453, 1288696, 1291574, 1293392, 1294897, 1296881, 1299697, 1302639, 1304657, 1306045, 1308490, 1313023, 1318870, 1324696, 1330015, 1335060, 1340341, 1346735, 1354838, 1363767, 1371760, 1378464, 1385302, 1392866, 1399305, 1402410, 1402307, 1400935, 1399667, 1398516, 1396981, 1394598, 1391164, 1387407, 1384955, 1384695, 1385563, 1385793, 1384956, 1383956, 1383398, 1382937, 1382051, 1380782, 1379831, 1380409, 1383605, 1389269, 1395760, 1401324, 1405520, 1409060, 1412888, 1417896, 1424749, 1433145, 1441731, 1449602, 1457538, 1467135, 1479173, 1493550, 1510138, 1528546, 1547318, 1564681, 1580258, 1595189, 1610336, 1625104, 1638334, 1649728, 1660080]
60276A660080J0348J0773J0771J0004Q984Q542Q931R710J0414J1025J1967J4047
60264A785596J7887K2602K5505K4298J9525J3727Q318K672l726j0013j5412k0221
60252A870758k4333k6225k4910k1860j9413j7879j5823j2800j0113q691p787o377
60240A674547m666l502l087l038l128l154k543r28J047K352K989L872N161N732
60226A671654M937M003M627O630Q125Q008P213P308Q697J0618J2086J2485J1884
60213A778275J1251J1862J4108J7189K0156K2629K4419K5363K5932K7233K9838
60202B008255L3250L6858M0619M4445M7897N1099N5024O0089O5362O9974P4460
60191B587332P9774Q5845R2180R9102J07274J16519J26172J36010J45846J54849
$$ y = [1660080, 1670428, 1681201, 1691972, 1701976, 1710960, 1719502, 1728433, 1738143, 1748557, 1759582, 1771549, 1785596, 1803483, 1826085, 1851590, 1875888, 1895413, 1909140, 1917458, 1920130, 1916404, 1906391, 1890979, 1870758, 1846425, 1820200, 1795290, 1773430, 1754017, 1736138, 1720315, 1707515, 1697402, 1688711, 1680924, 1674547, 1669881, 1666379, 1663292, 1660254, 1657126, 1653972, 1651429, 1650501, 1651548, 1653900, 1656889, 1660761, 1665922, 1671654, 1676591, 1680594, 1685221, 1691851, 1699976, 1707984, 1715197, 1722505, 1731202, 1741820, 1753906, 1766391, 1778275, 1789526, 1801388, 1815496, 1832685, 1852841, 1875470, 1899889, 1925252, 1951184, 1978417, 2008255, 2041505, 2078363, 2118982, 2163427, 2211324, 2262423, 2317447, 2377536, 2442898, 2512872, 2587332, 2667106, 2752951, 2845131, 2944233, 3051507, 3168026, 3294198, 3430208, 3576054, 3730903]
60181C730903J62438J69312J76393J83149J87949J89658J87946J82776J74701
60172E345225J64905J53761J40093J23223J04748Q6691O8713M9169K8337Q502
60162F273367q817k3610l5495m3373m7276m8576m7857m4335l7593k8286j6883
60151E891266l464J0985K5118L9385N5597P3799R1594J07373J22165J37292J52123
60140F703233J65196J75729J82719J84296J79514J69579J56050J39130J18779
60131H174225R6003P1663M5506J7866r110l3638n6410p8648r9112j15021j25211
60120G888113j30364j30764j26014j16792j04841r0790p3637n2899l0068p434
60110G024510J3775L3868N3886P4326R4185J11513J25184J35343J41575J42057
$$ y = [3730903, 3893341, 4062653, 4239046, 4422195, 4610144, 4799802, 4987748, 5170524, 5345225, 5510130, 5663891, 5803984, 5927207, 6031955, 6118646, 6187359, 6236528, 6264865, 6273367, 6264550, 6240940, 6205445, 6162072, 6114796, 6066220, 6018363, 5974028, 5936435, 5908149, 5891266, 5887802, 5898787, 5923905, 5963290, 6018887, 6092686, 6184280, 6291653, 6413818, 6551110, 6703233, 6868429, 7044158, 7226877, 7411173, 7590687, 7760266, 7916316, 8055446, 8174225, 8270228, 8341891, 8387397, 8405263, 8396153, 8362515, 8306105, 8227457, 8128345, 8013324, 7888113, 7757749, 7626985, 7500971, 7384179, 7279338, 7188548, 7114911, 7062012, 7031944, 7024510, 7038285, 7072153, 7126039, 7200365, 7294550, 7406063, 7531247, 7666590, 7808165, 7950222]
60100G950222J35985J25667J14205J01741Q6293O8139N0707L6463K4374J2927
60090H706723L787L84L858J2270K3643L7892N5549P6056R8202J21431J45763J70693
60078I456251J95172K18918K43086K69153K97422L27246L58471L91675M26653
60069A2184047M61316M92781N19275N40627N57183N68526N72882N67387N49610
60060A7013634N19475M79376M31750L77011L14645K45701J72773R7473J9494o1163
60050A9610169j42091k19550k90907l54882m09782m52850m81906m96918m99330
60041A6261953m90278m70145m39820m01668l58758l13315k66176k17435j67159
60032A3137199j15651o3842j3862L1223O8836R8069J19182J32146J36187J30827
$$ y = [7950222, 8086207, 8211874, 8326079, 8427820, 8514113, 8582252, 8632959, 8669422, 8693796, 8706723, 8710510, 8710894, 8714752, 8727022, 8750665, 8788557, 8844106, 8920162, 9018364, 9139795, 9285558, 9456251, 9651423, 9870341, 10113427, 10382580, 10680002, 11007248, 11365719, 11757394, 12184047, 12645363, 13138144, 13657419, 14198046, 14755229, 15323755, 15896637, 16464024, 17013634, 17533109, 18012485, 18444235, 18821246, 19135891, 19381592, 19554365, 19651838, 19671332, 19610169, 19468078, 19248528, 18957621, 18602739, 18192957, 17740107, 17258201, 16761283, 16261953, 15771675, 15301530, 14861710, 14460042, 14101284, 13787969, 13521793, 13304358, 13137199, 13021548, 12957706, 12943844, 12975067, 13043903, 13141972, 13261154, 13393300, 13529487, 13660314]
60022A3660314J16881R6061O9769L8748M001l2293o7346r9371j28465j55767j81891
60011A3320641k06326k28059k46379k61090k72376k80493k85440k86794k84079
60002A0969605k77259k66638k52369k34464k13445j90538j66827j42334j16305
59993I109426q8446n9640l1290m034K2724M9881P7309J03545J26689J45487J59608
59982I611259J69224J74283J73979J66926J52281J30866J04851P6104M5252J2436
59972A0817461k1617n5733q8913j20213j48342j72051j90744k04214k12054k13963
59962I389617k10398k02256j89882j73178j52736j30172j07005q3510n8988l3006
59952H048486o199K0328M6310P2732J00460J28686J55513J80084K03127K25058
$$ y = [13660314, 13777195, 13873256, 13943025, 13981773, 13985774, 13953481, 13886135, 13786764, 13658299, 13502532, 13320641, 13114315, 12886256, 12639877, 12378787, 12106411, 11825918, 11540478, 11253684, 10969605, 10692346, 10425708, 10173339, 9938875, 9725430, 9534892, 9368065, 9225731, 9109426, 9020980, 8961340, 8930050, 8926016, 8948740, 8998621, 9075930, 9179475, 9306164, 9451651, 9611259, 9780483, 9954766, 10128745, 10295671, 10447952, 10578818, 10683669, 10759773, 10805025, 10817461, 10795844, 10740111, 10651198, 10530985, 10382643, 10210592, 10019848, 9815634, 9603580, 9389617, 9179219, 8976963, 8787081, 8613903, 8461167, 8330995, 8223990, 8140480, 8081492, 8048486, 8042287, 8062615, 8108925, 8181657, 8282117, 8410803, 8566316, 8746400, 8949527, 9174585]
59942I174585K44548K59628K69074K71977K67113K54133K34597K10341J81342
59933A1367338J46670J07234O6002K5504j3530n1008q6385j18890j47675j71378
59923A1123882j88516j98428k00978j95729j82682j63738j41851j18499r3205
59914I640256o5606l6390o034K5519N7157Q6205J10714J30939J47714J60622J68833
59903A0419929J72659J73057J70375J64632J56520J47047J36486J24467J11007
59894A1776179R7024Q3982P3111O4493N7048N0257M5860M6831N4468O7580Q4772
59883A2501605J06226J32776J64521K00983K41534K85119L30538L77470M25998
59874A4766770M74586N19916N59327N91944O16491O29506O26865O05811N64560
$$ y = [9174585, 9419133, 9678761, 9947835, 10219812, 10486925, 10741058, 10975655, 11185996, 11367338, 11514008, 11621242, 11687244, 11712748, 11699218, 11648210, 11561825, 11442935, 11295260, 11123882, 10935366, 10736938, 10535960, 10340231, 10157549, 9993811, 9851960, 9733461, 9640256, 9574650, 9538260, 9532226, 9557745, 9614902, 9701107, 9811821, 9942760, 10090474, 10251096, 10419929, 10592588, 10765645, 10936020, 11100652, 11257172, 11404219, 11540705, 11665172, 11776179, 11873203, 11957185, 12030296, 12094789, 12151837, 12202094, 12247954, 12294785, 12349253, 12416833, 12501605, 12607831, 12740607, 12905128, 13106111, 13347645, 13632764, 13963302, 14340772, 14766770, 15241356, 15761272, 16320599, 16912543, 17529034, 18158540, 18785405, 19391216, 19955776]
59865A9955776N01619M17288L14980J99613P5734n1477j74739k86449l81826m59106
59855B0111413n17602n57270n79546n86754n80746n63265n36788n03322m63052
59846A5223068m16118l65152l13930k63599k12520j59823j06795n4526k813M7497
59836A3375289R3490J33165J67540J97747K21500K34642K35447K25017K03720
59827A5087557J69675J21596O1310p587q2129j59607k35823l05731l66049m16019
59817A3867193m55455m83449m99591n05155n02027m91265m73731m51278m25842
59808I579400l97792l66761l34005l02254k72941k45062k17327j90139j64791
59799G088328j42051j22491j07078r6264q9070q3982q0243p7637p5805p4419p3366
$$ y = [19955776, 20457395, 20874683, 21189663, 21389276, 21465010, 21413533, 21238794, 20952345, 20570519, 20111413, 19593811, 19036541, 18456995, 17870241, 17289495, 16726230, 16189442, 15686120, 15223068, 14806950, 14441798, 14127868, 13864269, 13651749, 13491926, 13385131, 13330605, 13327792, 13375289, 13468779, 13601944, 13769484, 13967231, 14188731, 14423373, 14658820, 14883837, 15087557, 15257232, 15378828, 15440138, 15432551, 15350422, 15190815, 14954992, 14649261, 14283212, 13867193, 13411738, 12928289, 12428698, 11923543, 11421516, 10930251, 10456520, 10005242, 9579400, 9181608, 8814847, 8480842, 8178588, 7905647, 7660585, 7443258, 7253119, 7088328, 6946277, 6823786, 6716708, 6620444, 6531374, 6447392, 6367149, 6289512, 6213707, 6139288, 6065922]
59788F065922p1893o8330o1621n2715m3738l6187l0582k7162k6197k7856l2279
59777E587362l9157m6973n3637n8456o2374o5616o6549o4021n9384n4498m8836
59766D967861m0663l0319k0065j0724p78J0788K2670L3155M2220N0669N8327O4437
59754E147578O9344P4710Q1892R0638R9375J06484J11217J13488J13037J09197
59744F116960J01648R1117P9065O7001N6190M7479M0936L6026L2664L1721L4136
59733F734943L9886M8312N9080P2232Q7573J04542J22702J42076J63203J86876
59723G761425K13556K43042K75147L10355L48931L89600M30410M70936N11798
59714A0955200N51263N83633O01724N99254N70053N07797M10181K83799J43319
$$ y = [6065922, 5994029, 5925699, 5864078, 5811363, 5767625, 5731438, 5700856, 5673694, 5647497, 5619641, 5587362, 5548205, 5501232, 5447595, 5389139, 5326765, 5261149, 5194600, 5130579, 5071195, 5016697, 4967861, 4927198, 4896879, 4876814, 4866090, 4865312, 4876100, 4898770, 4931925, 4974145, 5024814, 5083141, 5147578, 5216922, 5291632, 5373524, 5464162, 5563537, 5670021, 5781238, 5894726, 6007763, 6116960, 6218608, 6309725, 6388790, 6455791, 6511981, 6559460, 6600396, 6636422, 6669086, 6700807, 6734943, 6774829, 6823141, 6882221, 6954453, 7042026, 7146568, 7269270, 7411346, 7574549, 7761425, 7974981, 8218023, 8493170, 8803525, 9152456, 9542056, 9972466, 10443402, 10955200, 11506463, 12090096, 12691820, 13291074, 13861127, 14368924, 14779105, 15062904, 15206223]
59705A5206223N356j16966k15728k88017l35078l60328l67270l59265l40346l14728
59695A2513853k85248k52977k18247j81435j43231j04941o8181l3413O49L5340
59685A1262169P0193J03748J35670J67000J98726K31158K64435K98645L33577
59676A3065321L69142M05762M43865M83579N25507N70887O20161O72204P25817
59667A7882245P80958Q37479Q93777R47997R99496J047505J089267J121000J140042
59658B6739766J144767J133740J107038J067901J021328R71759R23687Q83180
59650C4993166Q55876Q43501Q44205Q55841Q76633R03028R29434R50293R60462
59641D3012439R53809R24254Q68925P88691O85747N63041M26323K84175J44945
$$ y = [15206223, 15211579, 15094613, 14878885, 14590868, 14255790, 13895462, 13528192, 13168927, 12828581, 12513853, 12228605, 11975628, 11757381, 11575946, 11432715, 11327774, 11259593, 11226180, 11226829, 11262169, 11332362, 11436110, 11571780, 11738780, 11937506, 12168664, 12433099, 12731744, 13065321, 13434463, 13840225, 14284090, 14767669, 15293176, 15864063, 16484224, 17156428, 17882245, 18663203, 19500682, 20394459, 21342456, 22341952, 23389457, 24478724, 25599724, 26739766, 27884533, 29018273, 30125311, 31193212, 32214540, 33186299, 34109986, 34993166, 35849042, 36692543, 37536748, 38392589, 39269222, 40172250, 41101684, 42051977, 43012439, 43966248, 44890502, 45759427, 46548118, 47233865, 47796906, 48223229, 48507404, 48652349]
59632D8652349J5190r8953j91447k58496k99220l13595l01720k65751k10219j38955
59622D6589183n3034M7252J59837K81265M08361N38722O70720Q03442R35170J061022
59612E1441940J173117J263193J323572J345672J319749J237253J092401Q82202
59604F1079099O08430K81504p9272m50883q11305j140208j419729j638285j792925
59595E4636426j886499j923982j912693j863388j787733j695051j593463j493396
59587D0480221j407580j347320j319307j324124j354984j398247j438155j463191
59579B9427313j468368j452777j417025j363237j295691j219937j141036j062313
59571A9006929r85094r09495q35749p64864o97982o35693n78159n25345m76751
$$ y = [48652349, 48667539, 48568586, 48377139, 48118643, 47819423, 47505828, 47204108, 46938357, 46728138, 46589183, 46536149, 46583401, 46743238, 47024503, 47432864, 47971586, 48642306, 49445748, 50380918, 51441940, 52615057, 53878250, 55201822, 56547494, 57867243, 59104496, 60196897, 61079099, 61687529, 61969033, 61889761, 61438878, 60627573, 59487365, 58067636, 56429351, 54636426, 52749927, 50825945, 48913252, 47049864, 45262131, 43567080, 41973617, 40480221, 39072641, 37725321, 36406014, 35081890, 33726906, 32328659, 30890504, 29427313, 27958945, 26506168, 25089143, 23725906, 22430215, 21210278, 20069242, 19006929, 18021835, 17112340, 16276591, 15511727, 14813745, 14178052, 13599893, 13074548, 12597797]
59562A2597797m31433l88808l49120l12964k80774k52787k28796k07833j88859
59553I956423j71951j57995j47322j39694j35617j36061j40419j46219j51602
59544H629543j56842j62579j67811j70745j70674j68074j63540j57611j50904
59535G160763j43501j34668j23790j11190r7681q4070p1203n9480m7949l5112
59525F252119k1207q479J538R793J8016K6385L3948M0306M5870N0998N5772O0047
59513F565106O3284O5137O6540O9259P3960P9929Q6903R5657J06273J17635J29506
59502G519189J43287J59531J76413J92245K07970K25483K44822K64829K85464
59493I419233L07517L30782L54424L78532M03410M27645M48572M64542M75487
$$ y = [12597797, 12166364, 11777556, 11428436, 11115472, 10834698, 10581911, 10353115, 10145282, 9956423, 9784472, 9626477, 9479155, 9339461, 9203844, 9067783, 8927364, 8781145, 8629543, 8472701, 8310122, 8142311, 7971566, 7800892, 7632818, 7469278, 7311667, 7160763, 7017262, 6882594, 6758804, 6647614, 6549933, 6465863, 6394660, 6335180, 6287231, 6252119, 6230912, 6222433, 6223971, 6233764, 6251780, 6278165, 6312113, 6352419, 6398289, 6449287, 6505059, 6565106, 6628390, 6693527, 6760067, 6829326, 6903286, 6983215, 7070118, 7165775, 7272048, 7389683, 7519189, 7662476, 7822007, 7998420, 8190665, 8398635, 8624118, 8868940, 9133769, 9419233, 9726750, 10057532, 10411956, 10790488, 11193898, 11621543, 12070115, 12534657, 13010144]
59484A3010144M81655M83171M80503M73763M61682M42761M17677L89486L61133
59475A7001975L33341L04805K73737K39558K03902J70105J41139J18231J01450
59466A8888243R0839Q6415Q7803R4419J05275J18109J29578J36812J37670J29143
59456B0004306J07251O9902J8729m3104j13573j90899k71519l51028m26544m96233
59446A8307288n57066o05112o38161o56672o62153o55965o39705o15363n84683
59437A2692408n48990n09695m68307m26141l84359l43840l04685k66503k29694
59428I210194j95476j64058j34029j04370p5761m8791k2309M897L1929N7141Q0858
59417H640225J04999J30406J56173J81268K05589K29595K53916K78712L02580
$$ y = [13010144, 13491799, 13974970, 14455473, 14929236, 15390918, 15833679, 16251356, 16640842, 17001975, 17335316, 17640121, 17913858, 18153416, 18357318, 18527423, 18668562, 18786793, 18888243, 18979082, 19065497, 19153300, 19247719, 19352994, 19471103, 19600681, 19737493, 19875163, 20004306, 20111557, 20181459, 20200188, 20157084, 20043511, 19852612, 19581093, 19230065, 18803521, 18307288, 17750222, 17145110, 16506949, 15850277, 15188124, 14532159, 13892454, 13277091, 12692408, 12143418, 11633723, 11165416, 10739275, 10354916, 10011076, 9706391, 9439888, 9210194, 9014718, 8850660, 8716631, 8612261, 8536500, 8487709, 8465400, 8470297, 8502226, 8559367, 8640225, 8745224, 8875630, 9031803, 9213071, 9418660, 9648255, 9902171, 10180883, 10483463]
59408A0483463L22989L38721L50503L58026L57952L46836L24565K92755K51159
59399A3426969J98420J35611O6139p456q3750j59571k29861k91067l42562l84270
59389A2328602m15203m35024m44977m46461m40321m28164m12537l95033l75475
59380H535407l53614l30159l05806k80681k55356k30992k07941j85585j63972
59371F221301j44231j26822j10691r4742p9073o4277n0668l8416k7274j6044l743
59360E465320Q460J8162K5044L1609L9942M9283N7662O4508P0735P7363Q4853
59349E992941R2568R8153R8716R3892Q7007Q2513Q3044Q9192J00530J15761J33168
59338G067485J52186J73579J96804K18416K34837K46441K57472K72239K92647
$$ y = [10483463, 10806452, 11145173, 11495676, 11853702, 12211654, 12558490, 12883055, 13175810, 13426969, 13625389, 13761000, 13827139, 13819683, 13735933, 13576362, 13346501, 13055434, 12712872, 12328602, 11913399, 11478375, 11033398, 10586937, 10146616, 9718452, 9305915, 8910882, 8535407, 8181793, 7851634, 7545828, 7265147, 7009791, 6778799, 6570858, 6385273, 6221301, 6077070, 5950248, 5839557, 5744815, 5665742, 5601465, 5550797, 5512381, 5485107, 5469063, 5465320, 5473780, 5491942, 5516986, 5548595, 5588537, 5637820, 5695482, 5759990, 5830725, 5908088, 5992941, 6085509, 6183662, 6282378, 6376270, 6463277, 6545790, 6628834, 6718026, 6818556, 6934317, 7067485, 7219671, 7393250, 7590054, 7808470, 8043307, 8289748, 8547220, 8819459, 9112106]
59329I112106L19002L51239L88696M29965M73974N20697N70095O20926O71397
59320A3458097P20676P68705Q14256Q53910Q83559R00526R03668Q92009Q64493
59311B1059899Q21397P65311P00352O30714N59761M89630M21272L55350K92807
59302B6096493K33739J76064J16896N5268q107p3806j43866k17959k91747l60687
59292B5582288m23260m78420n22383n51566n67733n76826n82980n86742n89043
59283B0703335n93120o01181o11834o22311o31247o37928o40697o37778o28719
59274A5098520o13820n93106n66899n36532n03548m68813m33023l97306l62559
59265A0622914l28792k95597k62818k30733k00258j72949j49660j29106j08933
$$ y = [9112106, 9431108, 9782347, 10171043, 10601008, 11074982, 11595679, 12165774, 12786700, 13458097, 14178773, 14947478, 15761734, 16615644, 17499203, 18399729, 19303397, 20195406, 21059899, 21881296, 22646607, 23346959, 23977673, 24537434, 25027064, 25448336, 25803686, 26096493, 26330232, 26506296, 26623192, 26678460, 26670353, 26596547, 26452681, 26234722, 25942975, 25582288, 25159028, 24680608, 24158225, 23606659, 23038926, 22462100, 21879120, 21292378, 20703335, 20110215, 19509034, 18897200, 18274889, 17643642, 17005714, 16365017, 15727239, 15098520, 14484700, 13891594, 13324695, 12788163, 12284615, 11815802, 11382779, 10985473, 10622914, 10294122, 9998525, 9735707, 9504974, 9304716, 9131767, 8982107, 8853001, 8744068]
59256H744068q8551o9677n3650l9530k5522j1166K855J6234K9344M2443N5351
59245H602199O7737P9311Q9850R9257J07357J13720J17931J19929J19691J16980
59235I633962J11887J05221R7598Q8694P8273O7502N8156N0905M5518M2345M2209
59224A0422270M5086N0218N7597O7963Q1342R6723J13136J29864J45810J59845
59214A1369854J71685J81099J86641J86697J81505J72327J58615J37911J08842
59205A2855176P2567L1246j2812n6065r3976j23689j45309j59891j67478j67721
59195A2032048j61129j48977j32984j15374r7960q0794o2965m5054k9344j7231
59185A1140236p934j73O510J2454J8249K3801K8609L3501M0307M9350N9438P1144
$$ y = [8744068, 8655517, 8585840, 8532190, 8492660, 8467138, 8455972, 8458827, 8475061, 8504405, 8546848, 8602199, 8669936, 8749247, 8839097, 8938354, 9045711, 9159431, 9277362, 9397291, 9516982, 9633962, 9745849, 9851070, 9948668, 10037362, 10115635, 10183137, 10241293, 10292198, 10337716, 10380061, 10422270, 10467356, 10517574, 10575171, 10643134, 10724476, 10821199, 10934335, 11064199, 11210009, 11369854, 11541539, 11722638, 11909279, 12095976, 12277481, 12449808, 12608423, 12746334, 12855176, 12927743, 12958989, 12946177, 12890112, 12796136, 12672447, 12527138, 12367247, 12199769, 12032048, 11870919, 11721942, 11588958, 11473584, 11375624, 11294830, 11231865, 11186811, 11157467, 11140236, 11132302, 11132129, 11138639, 11151093, 11169342, 11193143, 11221752, 11255253, 11295560, 11344910, 11404348, 11475492]
59173A1475492Q7668J10893J38727J68193J99351K34000K71921L10979L50007
59164A3347231L88882M25610M55557M74122M78875M68628M41720L96095L30701
59155A7207421K46625J47273L7581p7336j93067l05610m10493n02721n77870o33590
59145A4938213o70101o89038o91864o80001o56437o25748n91409n54064n13586
59136I265965m71820m31487l93272l56209l20883k89827k64247k42197k20912
59127F275111j99651j79650j62419j48462j36686j24981j12324j00037q9781q0899
59117D940221p1528o1812n3609m7154m0449l2317k3708j5517p399P20Q367J6379
59105D612194K6407L7714M6991N2679N7008O2432O8531P4116P9967Q7319R5456
$$ y = [11475492, 11563160, 11674053, 11812780, 11980973, 12180324, 12414324, 12686245, 12997224, 13347231, 13736113, 14161723, 14617280, 15091402, 15570277, 16038905, 16480625, 16876720, 17207421, 17454046, 17601319, 17638900, 17561564, 17368497, 17062887, 16652394, 16149673, 15571803, 14938213, 14268112, 13579074, 12887210, 12207209, 11550772, 10925024, 10333615, 9779551, 9265965, 8794145, 8362658, 7969386, 7613177, 7292294, 7002467, 6738220, 6496023, 6275111, 6075460, 5895810, 5733391, 5584929, 5448243, 5323262, 5210938, 5110901, 5021120, 4940221, 4868693, 4806881, 4753272, 4706118, 4665669, 4633352, 4609644, 4594127, 4586728, 4587448, 4595815, 4612194, 4638601, 4676315, 4723306, 4775985, 4832993, 4895425, 4963956, 5038072, 5118039, 5205358, 5300814]
59094E300814J02948J09861J16922J23822J30136J36615J43809J50466J55006
59085F470399J57584J59223J59800J58290J54134J47314J37911J26441J13486
59076G784582R8576Q0928O1959M4970L1481K0014R485J272l621o550q169n833
59064H109094L037J6749L1304M5190N9687P5734R3341J13081J35429J59058J82075
59053I023779K04355K26554K47866K66910K83979K99841L13109L21368L24240
59044A1512001L22565L14827K97220K67538K26747J76646J18549N5067r044o9037
59034A3213079j22418j68715k08041k40172k64511k81077k91830l00034l07386
59025A1028895l12901l15639l17097l19254l21615l22197l20395l16724l10935
$$ y = [5300814, 5403762, 5513623, 5630545, 5754367, 5884503, 6021118, 6164927, 6315393, 6470399, 6627983, 6787206, 6947006, 7105296, 7259430, 7406744, 7544655, 7671096, 7784582, 7883158, 7964086, 8026045, 8071015, 8102496, 8122510, 8131995, 8133267, 8129646, 8123096, 8114927, 8109094, 8112131, 8128880, 8160184, 8205374, 8265061, 8340795, 8434136, 8547217, 8682646, 8841704, 9023779, 9228134, 9454688, 9702554, 9969464, 10253443, 10553284, 10866393, 11187761, 11512001, 11834566, 12149393, 12446613, 12714151, 12940898, 13117544, 13236093, 13291160, 13282116, 13213079, 13090661, 12921946, 12713905, 12473733, 12209222, 11928145, 11636315, 11336281, 11028895, 10715994, 10400355, 10083258, 9764004, 9442389, 9120192, 8799797, 8483073, 8172138]
59016H172138l02821k94020k86259k78211k66981k52672k38711k27276k16979
59007E808208k05721j93407j80773j67538j53162j38218j23994j11427j00722
58998D433246r1123q0913o8959n6424m5919l8732l4054l0968k9855l1486l5893
58987C888920m2535n0732n9532o7856p4962q0208q2700q2044p9292p6138p3252
58976C119669p0070o5937o0638n4098m6643l9329l3184k8212k3784j9537j5285
58965B662952j0743o193k753j096o07o02j346k833l704k912j505j146j594j242
58951B624676M46K688N055P697J0341J2520J4457J6397J7634J7532J6785J6173
58939B762401J4959J2329R573Q685R269R030P147N101M346N126P619J2006J7054
$$ y = [8172138, 7869317, 7575297, 7289038, 7010827, 6743846, 6491174, 6252463, 6025187, 5808208, 5602487, 5409080, 5228307, 5060769, 4907607, 4769389, 4645395, 4533968, 4433246, 4342123, 4261210, 4192251, 4135827, 4089908, 4051176, 4017122, 3986154, 3956299, 3924813, 3888920, 3846385, 3795653, 3736121, 3668265, 3593303, 3513095, 3430395, 3348351, 3269059, 3192921, 3119669, 3049599, 2983662, 2923024, 2868926, 2822283, 2782954, 2749770, 2721558, 2697774, 2678237, 2662952, 2652209, 2646016, 2643263, 2642167, 2641560, 2640958, 2639612, 2636779, 2633075, 2630163, 2628658, 2627512, 2625918, 2624676, 2625122, 2627810, 2632865, 2640562, 2650903, 2663423, 2677880, 2694277, 2711911, 2729443, 2746228, 2762401, 2777360, 2789689, 2799262, 2807947, 2817216, 2826246, 2833393, 2838494, 2842840, 2847966, 2855585, 2867591, 2884645]
58926B884645K0488K1423K1123K1180K2242K4560K8125L1953L4641L6095L7585
58915C184060L9876M2417M4589M6789M9909N4382N9860O5323O9776P3287P6859
58904C807127Q0889Q4716Q8101R1804R5742R8237R8457R8074R8710R9305R8140
58893D839302R6259R6355R9015J02532J05966J10144J15811J22930J31665J42278
58883E962257J54218J66877J80655J95791K11079K25618K40846K58670K78515
58874G874526K98568L19083L41817L66915L92956M19717M48194M78376N09813
58865A1449965N44056N83435O27262O72084P16127P60942Q08337Q58108R09141
58856A7929457R60286J009506J054071J091903J120939J137370J136491J114835
$$ y = [2884645, 2905133, 2926556, 2947679, 2968859, 2991101, 3015661, 3043786, 3075739, 3110380, 3146475, 3184060, 3223936, 3266353, 3310942, 3357731, 3407640, 3462022, 3521882, 3587205, 3656981, 3730268, 3807127, 3888016, 3972732, 4060833, 4152637, 4248379, 4346616, 4445073, 4543147, 4641857, 4741162, 4839302, 4935561, 5031916, 5130931, 5233463, 5339429, 5449573, 5565384, 5688314, 5819979, 5962257, 6116475, 6283352, 6464007, 6659798, 6870877, 7096495, 7337341, 7596011, 7874526, 8173094, 8492177, 8833994, 9200909, 9593865, 10013582, 10461776, 10940152, 11449965, 11994021, 12577456, 13204718, 13876802, 14592929, 15353871, 16162208, 17020316, 17929457, 18889743, 19899249, 20953320, 22045223, 23166162, 24303532, 25440023, 26554858]
58848B6554858J069458R96086Q91130P55509N93767M10049K08380l230k13005
58839C1263002m10914n91141p49000q79379r79835j052193j099349j122846j124720
58830B3253625j109078j080265j041148r94099r41571q84961q25072p64260p05829
58821A4907342o50805n97913n47371n01969m63761m32375m07201l88026l72516
58812A0545405l56480l38260l20037l03404k86763k68718k50729k34077k17100
58803G969837j98149j78911j62054j47321j32589j17379j02836q9339p6291o3534
58793F701434n1248l9091k6722j4424k360R753K1743L3096M4528N7627P2335Q6747
58781F893418R9978J13203J27082J40753J54334J69710J87272K04487K19694K35016
$$ y = [26554858, 27624316, 28620402, 29511532, 30267041, 30860808, 31270857, 31479237, 31476007, 31263002, 30852088, 30260947, 29511947, 28632568, 27652733, 26600540, 25501191, 24378345, 23253625, 22144547, 21064282, 20023134, 19029035, 18087464, 17202503, 16377431, 15613171, 14907342, 14256537, 13658624, 13111253, 12609284, 12145523, 11713148, 11305947, 10917921, 10545405, 10188925, 9850665, 9530628, 9227224, 8940461, 8671743, 8421014, 8186937, 7969837, 7771688, 7592777, 7430723, 7283402, 7150813, 7033434, 6930598, 6841259, 6764968, 6701434, 6650186, 6611095, 6584373, 6569949, 6567589, 6577342, 6599085, 6632181, 6676709, 6734336, 6806671, 6893418, 6993396, 7106599, 7233681, 7374434, 7528768, 7698478, 7885750, 8090237, 8309931, 8544947]
58771H544947K53334K74257K95348L15859L37182L60685L86803M15260M44973
58762A1628648M74913N06153N41518N82171O26166O71435P18187P67140Q17349
58753A7333680Q67370R16584R63681J005512J038985J062347J072956J065462
58745B5326577J034109R75627Q88647P72254O27044M56491K65973O1945j46832
58736C0261835l49353n35827p00325q39449r50631j033366j090045j123572j135486
58727B2503781j127812j104936j071786j031525r86308r38601q89936q40105p89236
58718A3723536p39300o92045o47051o03377n61568n22508m85920m51494m20061
58709H600212l92223l67287l44584l24106l04949k85327k65304k47063k31226
$$ y = [8544947, 8798281, 9072538, 9367886, 9683745, 10020927, 10381612, 10768415, 11183675, 11628648, 12103561, 12609714, 13151232, 13733403, 14359569, 15031004, 15749191, 16516331, 17333680, 18201050, 19117634, 20081315, 21086827, 22125812, 23188159, 24261115, 25326577, 26360686, 27336313, 28224960, 28997214, 29624258, 30080749, 30346722, 30408667, 30261835, 29912482, 29376655, 28676330, 27836881, 26886250, 25852884, 24762839, 23639267, 22503781, 21375969, 20271033, 19199247, 18167722, 17181414, 16242813, 15352877, 14512772, 13723536, 12984236, 12292191, 11645140, 11041763, 10480195, 9957687, 9471767, 9020273, 8600212, 8207989, 7840702, 7496118, 7172012, 6867063, 6581736, 6316432, 6069369, 5838143]
58700E838143k15533j98757j83011j70138j58609j46394j34290j23800j14195
58691D393416j04510r6099r0284q5416p9247p2459o6930o2251n6977n1793m8384
58680C579066m6421m4503m2845m2335m2144m1010l9761l9883m0720m0661l9965
58669C118818l9886m0137l9789l9545m0599m2257m3197m4003m6025m8783n0791
58658B643806n1876n2482n2069n0444m9187m9255m8827m6131m2716m1095m0623
58647B119101l8891l5746l2838l0384k7626k5328k4653k4503k3108k1315k1067
58636A813642k1783k1496k0723k1508k3222k3067k0569j8184j7284j6700j5400
58625A593706j3786j2048r869p885p163p207o678n773n671o159o025n351n070
$$ y = [5838143, 5622610, 5423853, 5240842, 5070704, 4912095, 4765701, 4631411, 4507611, 4393416, 4288906, 4192807, 4102523, 4017107, 3937860, 3865401, 3798471, 3736220, 3679243, 3627450, 3579066, 3532645, 3488142, 3445297, 3402962, 3360818, 3319808, 3280047, 3240164, 3199444, 3158783, 3118818, 3078932, 3038795, 2999006, 2959461, 2918862, 2876605, 2833408, 2789405, 2743380, 2694597, 2643806, 2591930, 2539448, 2487379, 2436935, 2387748, 2338493, 2289666, 2243535, 2200819, 2159724, 2119101, 2080210, 2044464, 2011626, 1981242, 1953616, 1928288, 1903635, 1879132, 1856024, 1834709, 1813642, 1791859, 1770363, 1749640, 1728132, 1704910, 1681843, 1661274, 1643090, 1625806, 1609106, 1593706, 1579920, 1567872, 1558003, 1550118, 1542955, 1535748, 1529070, 1523297, 1517626, 1511467, 1505442, 1500091, 1495021]
58612A495021m876l813k227j003J15J204O78k000l638p53N223R619J0515R648
58598A513713Q205N748L172K835N116P931J0015J2016J4191J5973J7804K0790
58586A637509K4461K7437K9957L3258L6952L9872M2759M6957N1184N3118N3820
58575B077284N6779O2602O8408P2761P7527Q4165R1648R8956J06681J15359J24774
58564C036944J35322J47611J60645J73000J85615K00601K17627K34623K51592
58555D743580K70167K89491L06399L19768L30539L36913L33807L18183K91154
58546G540001K53605K03835J41643P1518l73o9895j34271j90492k36385k71364
58536G307822k94980l06747l08330l03549k95178k83670k69510k54296k38600
$$ y = [1495021, 1490145, 1486332, 1484105, 1483102, 1483217, 1484421, 1485099, 1483099, 1479461, 1478708, 1483931, 1493550, 1504065, 1513713, 1521918, 1527666, 1530838, 1533673, 1538789, 1546720, 1556735, 1568751, 1582942, 1598915, 1616719, 1637509, 1661970, 1689407, 1719364, 1752622, 1789574, 1829446, 1872205, 1919162, 1970346, 2023464, 2077284, 2134063, 2196665, 2265073, 2337834, 2415361, 2499526, 2591174, 2690130, 2796811, 2912170, 3036944, 3172266, 3319877, 3480522, 3653522, 3839137, 4039738, 4257365, 4491988, 4743580, 5013747, 5303238, 5609637, 5929405, 6259944, 6596857, 6930664, 7248847, 7540001, 7793606, 7997441, 8139084, 8210602, 8210229, 8140334, 8006063, 7815571, 7579186, 7307822, 7012842, 6706095, 6397765, 6094216, 5799038, 5515368, 5245858, 4991562, 4752962]
58527D752962k21415k02755j84548j68045j52640j38114j25663j15586j06200
58518C337996r6099q5724p6036o7586o1379n8492n8170n8101n7007n5174n2628
58507B611600m9125m5888m4722m5183m5169m4435m4796m6613m7953m7658m6540
58496B103518m5137m3021m0831m0121m0603m0093l7715l4676l1594k7857k3940
58485A697930k1533k0832k0246j9056j7889j6656j4825j3490j3995j4812j3228
58474A511368r932p995p469n448j921q75m138q490j0720j1676j3371j5451j6693
58461A397189j7254j7681j8018j8933k1167k3187k2385j9157j6522j5220j2948
58450A194717r287p150p988r432r454r075r144q111n219k628k116k505k191j602
$$ y = [4752962, 4531547, 4328792, 4144244, 3976199, 3823559, 3685445, 3559782, 3444196, 3337996, 3241897, 3156173, 3080137, 3012551, 2951172, 2892680, 2834510, 2776409, 2719402, 2664228, 2611600, 2562475, 2516587, 2471865, 2426682, 2381513, 2337078, 2292282, 2245669, 2197716, 2150058, 2103518, 2058381, 2015360, 1974529, 1934408, 1893805, 1853712, 1815997, 1781321, 1749727, 1721870, 1697930, 1676397, 1655565, 1635319, 1616263, 1598374, 1581718, 1566893, 1553403, 1539408, 1524596, 1511368, 1501436, 1493441, 1485972, 1480524, 1478603, 1477728, 1473590, 1465100, 1454380, 1442704, 1429333, 1413882, 1397189, 1379935, 1362254, 1344236, 1325303, 1304136, 1280949, 1258564, 1239407, 1222885, 1207665, 1194717, 1185430, 1178280, 1170292, 1160860, 1151406, 1142331, 1133187, 1125076, 1119857, 1117229, 1115113, 1112608, 1110417, 1108815]
58436A108815j488j432j442k360l598l295j619p55r55j70J590J614n34j674k78
58421A092419J054K72r08o24J01K43J020L064M626M726M756N212M455K545K320
58406A125281M527N841M182K084K189L121K662J448P25l19k268l766m532o659
58392A134516j0466j2630j1214q934q648r159q569q161r484j0732r625p318o160
58379A013416n829m716k906j346pJ028R72L34P86J859J223n70M4L376M898K397
58363A014959j28J161M308N784O007O789P194N974M853N645P106P872R198J1751
58349A098473J3283J2658J2477J4433J6032J5216J4171J4854J4811J1551P166
58338A245125M529K666q8k151k117k316m645o633n980n159o841q628p247m463
$$ y = [1108815, 1107327, 1105895, 1104453, 1102093, 1098495, 1095200, 1093581, 1092826, 1091871, 1091701, 1093291, 1094905, 1094371, 1092697, 1092419, 1093473, 1093745, 1092837, 1092213, 1092314, 1092557, 1093577, 1096641, 1101267, 1105993, 1110749, 1115961, 1120416, 1122961, 1125281, 1129808, 1135649, 1139831, 1141915, 1144104, 1147225, 1149887, 1151335, 1152060, 1151741, 1149473, 1145707, 1141175, 1134516, 1124050, 1111420, 1100206, 1091272, 1082624, 1073465, 1064896, 1056735, 1047251, 1036519, 1026894, 1019576, 1013416, 1007587, 1002871, 999965, 998619, 998612, 999640, 1000612, 1000946, 1001732, 1003591, 1004814, 1004244, 1004288, 1007664, 1012562, 1014959, 1014831, 1015992, 1020300, 1026084, 1032091, 1038880, 1046074, 1052048, 1056901, 1062546, 1069652, 1077524, 1086722, 1098473, 1111756, 1124414, 1136891, 1151324, 1167356, 1182572, 1196743, 1211597, 1226408, 1237959, 1245125, 1249654, 1252320, 1252232, 1250081, 1247964, 1245648, 1241003, 1234370, 1228390, 1223231, 1216390, 1207762, 1200515, 1196052]
58324A196052l769m411l766k498k325j654J431M600M701L216L562N458O642P532
58310A214771R540J1228J0742R605R895J0358R438R121J1348J3674J3054J0931
58298A343705J0164J0046Q849Q032R216J0191Q591O389O189O487N232M406O195
58285A443692Q258P746O389O658O839N010L756N532P539O817O148Q985J2781J3665
58271A549815J3500J5819J8765J8806J7561J8272J9400J8398J7817K0652K3701
58260A752506K2761K0322K0740K2091K0653J9195K2237K6846K7082K4273K3990
58249B002696K5742K4802K1840K1627K4093K5192K4957K6511K8924K8982K8077
58238B283443K9757L2698L3605L4296L8118M2422M2645M0778M1693M4357M5042
$$ y = [1196052, 1192283, 1187872, 1184106, 1181608, 1179283, 1177629, 1179060, 1183660, 1188361, 1191577, 1195139, 1200597, 1207239, 1214771, 1224311, 1235539, 1246281, 1255886, 1265781, 1276139, 1285577, 1294698, 1306046, 1319720, 1332774, 1343705, 1353869, 1363915, 1372764, 1380796, 1390012, 1400203, 1408794, 1415183, 1421372, 1427859, 1433091, 1437497, 1443692, 1451950, 1459696, 1466085, 1472743, 1479582, 1484592, 1488348, 1493880, 1501419, 1508236, 1514384, 1523369, 1536150, 1549815, 1563315, 1579134, 1597899, 1616705, 1634266, 1652538, 1671938, 1690336, 1708153, 1728805, 1752506, 1775267, 1795589, 1816329, 1838420, 1859073, 1878268, 1900505, 1927351, 1954433, 1978706, 2002696, 2028438, 2053240, 2075080, 2096707, 2120800, 2145992, 2170949, 2197460, 2226384, 2255366, 2283443, 2313200, 2345898, 2379503, 2413799, 2451917, 2494339, 2536984, 2577762, 2619455, 2663812, 2708854]
58227B708854M5534M9306N3328N2901N1004N3398N8247O0286O1273O5958P1663
58216C331752P2784P2123P6578Q4809R0222R2907R7380J02048J02619J02549J08090
58205D333861J16164J19341J19381J23427J30401J34305J37387J46299J58501
58196E519067J66488J72240J83140J96942K05807K12059K24336K40957K53172
58187G374208K62364K77666K98866L18229L36978L63064L94890M24290M53098
58178A0503653M89053N28333N60696N88854O23375O61729O92972P19944P55247
58169A6123856P98313Q39107Q81178R36532J000227J055707J103490J158648J222389
58160B5119447J284410J351181J441552J554648J672521J793516J931007K081348
$$ y = [2708854, 2754388, 2803694, 2857022, 2909923, 2960927, 3014325, 3072572, 3132858, 3194131, 3260089, 3331752, 3404536, 3476659, 3553237, 3638046, 3728268, 3821175, 3918555, 4020603, 4123222, 4225771, 4333861, 4450025, 4569366, 4688747, 4812174, 4942575, 5076880, 5214267, 5360566, 5519067, 5685555, 5857795, 6040935, 6237877, 6443684, 6655743, 6880079, 7121036, 7374208, 7636572, 7914238, 8213104, 8531333, 8868311, 9231375, 9626265, 10050555, 10503653, 10992706, 11521039, 12081735, 12670589, 13293964, 13955693, 14648665, 15368609, 16123856, 16922169, 17761276, 18642454, 19578986, 20579213, 21634920, 22738410, 23897058, 25119447, 26403857, 27755038, 29196590, 30751238, 32423759, 34217275, 36148282, 38229630]
58152C8229630K229139K383622K571594K793606L027000L272479L554389L875129
58144F1936588M218262M599112N059314N606701O217331O902985P716822Q690055
58136A10947170R834945J1213370J2911019J4920886J7137262J9485287K1986022
58129B18435961K4746526K8044671L2282539L7292564M1314673M1078380L3792190
58122D56987504J9584700J925719j4527983k6590221l3494728l6079465l5657558
58115C32147968l3477556l0559954k7564592k4769065k2233764j9954164j7875910
58108A55712963j5905504j3998289j2197078j0553802r066143p717541o519634
58101G9754972n474414m539009l668709k863264k138108j481797q74270l08517
$$ y = [38229630, 40458769, 42842391, 45413985, 48207591, 51234591, 54507070, 58061459, 61936588, 66154850, 70753962, 75813276, 81419977, 87637308, 94540293, 102257115, 110947170, 120782115, 131995485, 144906504, 159827390, 176964652, 196449939, 218435961, 243182487, 271227158, 303509697, 340802261, 382116934, 423195314, 456987504, 476572204, 478497923, 463969940, 437379719, 403884991, 367805526, 332147968, 298670412, 268110458, 240545866, 215776801, 193543037, 173588873, 155712963, 139807459, 125809170, 113612092, 103058290, 93992147, 86274606, 79754972, 74280558, 69741549, 66072840, 63209576, 61071468, 59589671, 58715401, 58406884]
58093E8406884K57287R34689J791224K649051L052660K547389J065647r53802
58085F9751029k849289m156080m788757m907532m705766m329777l898057l496968
58077C6618803l152206k846702k569510k324287k103178j888435j679802j492834
58069A8561849j330509j181264j043843r29301q37790p56476o81926o22814n78755
58060A0599171n37455m95402m61694m38341m15508l89443l67367l51273l33746
58051F808942l13221k97150k86609k73405k55733k41730k34123k26020k14895
58042D466056k06217j99893j87784j68613j51628j41423j32213j20960j12918
58033C044407j10020j06398r9746r5088r3257q7688p6988o8878o7177o5996o1333
$$ y = [58406884, 58664171, 59598860, 61390084, 64039135, 67091795, 69639184, 70704831, 69751029, 66901740, 62745660, 57956903, 53049371, 48343605, 44013828, 40115771, 36618803, 33466597, 30619895, 28050385, 25726098, 23622920, 21734485, 20054683, 18561849, 17231340, 16050076, 15006233, 14076932, 13239142, 12482666, 11800740, 11177926, 10599171, 10061716, 9566314, 9104620, 8666279, 8250771, 7861328, 7493961, 7142688, 6808942, 6495721, 6198571, 5911962, 5638557, 5382824, 5141094, 4906971, 4680951, 4466056, 4259839, 4059946, 3872162, 3703549, 3551921, 3410498, 3278285, 3157325, 3044407, 2934387, 2827989, 2728243, 2633155, 2539898, 2452210, 2375222, 2306344, 2239167, 2173171, 2111838]
58022B111838n7357n6714n5315n1466m9849n1787n1431m6204m1525m0662l9380
58011A570148l4984l1433l0993k9753k5800k3183k3678k3179k0191j9102k1036
58000A286816k0572j5822j2891j5484j8584j7457j4774j3968j3368j1819j2424
57989A119653j5711j6506j2611r353j0627j2526j0923q375q247q558o925n609
57977I93682o377o207k910M02J059J511L901N415L450K26j801l907o759p517n155
57962I69013l291m048m579l144k832n546q125q262q319r496q468m171j685m458
57948H92589q458q892p242o809o778n785o036q708j0143p735m724m328m283k343
57934H00325j856n938j0869j1422q675o603m878j199K698L551K534L033M794N221
$$ y = [2111838, 2054481, 1997767, 1942452, 1890986, 1841137, 1789350, 1737919, 1691715, 1650190, 1609528, 1570148, 1535164, 1503731, 1472738, 1442985, 1417185, 1394002, 1370324, 1347145, 1326954, 1307852, 1286816, 1266244, 1250422, 1237531, 1222047, 1203463, 1186006, 1171232, 1157264, 1143896, 1132077, 1119653, 1103942, 1087436, 1074825, 1065472, 1054845, 1042319, 1031396, 1023021, 1014774, 1006216, 999291, 993682, 987305, 981098, 978188, 978590, 979649, 981160, 985061, 990476, 993926, 994152, 992351, 988444, 981685, 974168, 969013, 965722, 961674, 957095, 953951, 951119, 945573, 937448, 929186, 920867, 911371, 902903, 898732, 897047, 892589, 884131, 875239, 867997, 861188, 854410, 848625, 842589, 833881, 823738, 816003, 811279, 806951, 802668, 800325, 798469, 792531, 781662, 770240, 761565, 754962, 750084, 748885, 751583, 755134, 757668, 760701, 765495, 770716]
57920G70716M189K977J018j997l560k118m67j152j911r7J866M92k451k978j464
57905G63063j004j681j699k084m963q761j0005q607p117o275n334n100o511p808
57891F86114o996n369n046n036l535j974k588l993l233p07R39J176J189Q73j45
57876F51669k94J510L051J886p15k269l237n135o953p281p571r245j0039p533
57862E97844l935k768l128k073n13j445l919m218j974N0J310L558O230O989O514
57847E98522P779J0464J1002Q540O272O113O297N204L788L081K463J454O09mr14
57832F70670j714j700j809l560o435q606r657j0112r245o342l231k469l560m042
57818E98188l663m198n667o191n516n345n952n552l351o20J554L209M246M447
$$ y = [770716, 774905, 777882, 778900, 776903, 773343, 771225, 770758, 769606, 767695, 767598, 769464, 769956, 767505, 764527, 763063, 762059, 760378, 758679, 756595, 751632, 742871, 732866, 724259, 717142, 710867, 705533, 700433, 693922, 686114, 679118, 673749, 668703, 663667, 660132, 658158, 655570, 651577, 648344, 647637, 648576, 649752, 650941, 651814, 651669, 651375, 652885, 655936, 657822, 657107, 654838, 651601, 646466, 639513, 632232, 624661, 615416, 605377, 597844, 593909, 591141, 588013, 585940, 585427, 583982, 580063, 575845, 573871, 573921, 575231, 578789, 585019, 592008, 598522, 606301, 616765, 627767, 636307, 642579, 648692, 654989, 660193, 663981, 667062, 669525, 670979, 671588, 671584, 670670, 668956, 667256, 665447, 661887, 655452, 646846, 637189, 627077, 617832, 611490, 608259, 605790, 602230, 598188, 594525, 590327, 584660, 578469, 572953, 567608, 561656, 556104, 552753, 552133, 553687, 556896, 561142, 565589]
57804E65589M635N669O669O285N147M883N434N694N786O197N599K466j855m473
57790F23725m773m387m117l637l449m298n346n570o070q261j0785j1325j0424
57777E41283j0163j0138q484o121o040q410j0168r596p931o356m862m215n539
57764D43260p621p874o394n857p119q132p739p293p776q313q335q506q775q094
57750C35432o597n586n019l575j482o20j397k166k061j765j168Q25L607M832L767
57735C17027K258J815K252L471N812Q019P677M606J439J81M36J387K870M063L785
57720C67098K801L183M766M981K957Q47J83k76j671k807k435j502j433j864j723
57705C73105j106p94r32j141j014j43J244J835R07J25J750N180P562P734P137
$$ y = [565589, 570224, 575893, 582562, 588847, 593994, 598877, 604311, 610005, 615791, 621988, 627587, 630053, 628198, 623725, 618952, 614565, 610448, 606811, 603362, 599064, 593718, 588148, 582078, 573817, 563032, 551707, 541283, 531120, 520982, 512498, 506377, 500337, 491927, 481759, 472163, 464232, 457876, 453014, 448799, 443260, 435639, 427765, 421371, 415514, 408395, 400263, 392524, 385231, 377455, 369142, 360807, 352301, 343526, 335432, 328835, 323249, 318230, 314655, 313173, 312553, 311156, 308990, 306929, 305164, 303996, 304821, 308428, 313260, 317027, 319285, 321100, 323352, 326823, 332635, 340654, 348331, 352937, 354376, 354557, 354993, 356380, 359250, 363313, 367098, 369899, 373082, 377848, 382829, 385786, 386633, 386816, 386540, 384869, 382062, 379627, 378125, 376692, 374828, 373105, 371999, 371205, 370273, 369132, 368118, 367975, 369219, 371054, 371961, 372086, 373836, 379016, 386578, 394312, 401449]
57690D01449O775O017M854M656N776O805P074P707R339J0872J1388J1399J1446
57677E05557J1301J1038J1153J1247J0520R737J0624J3081J5153J5974J6487J7137
57665F59009J7430J7898J9808K2577K4187K4643K6096K9072L1614L2978L4898
57654I40210L8145M0824M1585M1661M2253M2554M1984M1801M2886M4251M5373
57643A403527M7820N2819N9164O5164P0834P6860Q3037Q8991R4849J00429J05448
57632B248942J10961J18445J27115J34910J42615J53760J69428J86440K02138
57623C594754K17570K34022K49590K61555K69464K73265K70774K59518K39208
57614E869720K10432J73168J28946Q2519L9083J330k9271n1137o5503p8860r9203
$$ y = [401449, 408224, 414241, 419095, 423751, 429527, 436332, 443406, 451113, 460452, 471324, 482712, 494111, 505557, 516858, 527896, 539049, 550296, 560816, 570553, 581177, 594258, 609411, 625385, 641872, 659009, 676439, 694337, 714145, 736722, 760909, 785552, 811648, 840720, 872334, 905312, 940210, 978355, 1019179, 1060764, 1102425, 1144678, 1187232, 1229216, 1271017, 1313903, 1358154, 1403527, 1451347, 1504166, 1563330, 1628494, 1699328, 1776188, 1859225, 1948216, 2043065, 2143494, 2248942, 2359903, 2478348, 2605463, 2740373, 2882988, 3036748, 3206176, 3392616, 3594754, 3812324, 4046346, 4295936, 4557491, 4826955, 5100220, 5370994, 5630512, 5869720, 6080152, 6253320, 6382266, 6464785, 6503868, 6505198, 6475927, 6424790, 6359287, 6280427, 6181224]
57603F181224j29961j68557k08943k43810k66819k75917k74046k65184k50920
57594D097067k32020k10924j90253j70360j50548j31304j13488r6803q0954o6821
57584B653592n4799m3665l2650k2658j3794m080P279J7866K5792L2981M1921N1545
57572B659330N9722O7629P7787Q9420R9982J10253J23559J40037J55807J68366
57562C751892J79285J90546K01078K08171K10157K06361J95820J77235J49705
57553E470250J13459P0412K3599k4525p2581j18483j58758j90762k14381k30286
57543D667944k38166k38377k33627k26919k18907k09050j97925j86391j74027
57534B744555j60667j48018j37321j26875j14633j02048r2369q5999q0501p4520
$$ y = [6181224, 6051263, 5882706, 5673763, 5429953, 5163134, 4887217, 4613171, 4347987, 4097067, 3865047, 3654123, 3463870, 3293510, 3142962, 3011658, 2898170, 2801367, 2720413, 2653592, 2598793, 2555128, 2522478, 2499820, 2486026, 2481946, 2489225, 2507091, 2532883, 2565864, 2607785, 2659330, 2719052, 2786681, 2864468, 2953888, 3053870, 3164123, 3287682, 3427719, 3583526, 3751892, 3931177, 4121723, 4322801, 4530972, 4741129, 4947490, 5143310, 5320545, 5470250, 5583709, 5654121, 5677720, 5653195, 5580614, 5462131, 5303373, 5112611, 4898230, 4667944, 4429778, 4191401, 3957774, 3730855, 3511948, 3302898, 3104973, 2918582, 2744555, 2583888, 2435870, 2298549, 2171674, 2057041, 1954993, 1862624, 1776625, 1696124, 1621604]
57524A621604o8745o3423n7878n2308m7577m3375l8958l5210l3362l2118k8843
57513A119807k3429j8292j4785j2275j0636j0641j1570j1245r032o468m470k219
57501I84745P07L411N507P796J0546J2935J4689J6512J8564K0186K1442K3307
57489A140347K6030K8910L1745L4978L8408M1301M3670M6104M8778N2155N7680
57478A590106O5743P3812P9159Q2798Q8054R5739J03713J10931J18696J27593
57468B536344J36401J44635J53132J61196J65889J65157J59323J48565J31519
57459C902161J07422P7462M3140N530l2944o8399r8374j22915j42157j55179j62180
57448C353567j65252j65715j62765j56004j47077j37466j26836j15066j03814
$$ y = [1621604, 1552859, 1489436, 1431558, 1379250, 1331673, 1288298, 1249340, 1214130, 1180768, 1148650, 1119807, 1096378, 1078086, 1063301, 1051026, 1040390, 1029749, 1018179, 1006934, 997902, 991434, 986964, 984745, 985452, 988863, 994370, 1002166, 1012712, 1025647, 1040336, 1056848, 1075412, 1095598, 1117040, 1140347, 1166377, 1195287, 1227032, 1262010, 1300418, 1341719, 1385389, 1431493, 1480271, 1532426, 1590106, 1655849, 1729661, 1808820, 1891618, 1979672, 2075411, 2179124, 2290055, 2408751, 2536344, 2672745, 2817380, 2970512, 3131708, 3297597, 3462754, 3622077, 3770642, 3902161, 4009583, 4087045, 4130185, 4135715, 4102771, 4034372, 3935998, 3813083, 3670926, 3515747, 3353567, 3188315, 3022600, 2859835, 2703831, 2556754, 2419288, 2292452, 2177386, 2073572]
57439B073572r4335q5561p6090o6538n8202n0811m3322l5750k8779k2552j7048
57428A494584j2557q661m019J833P752J3027J8596K5067L1151L5567L9229M3966
57416A685535N0142N6925O3894P1149P8759Q7205R7222J08078J17407J24141J30241
57405B670698J37805J45605J50248J49847J44530J33954J16570R1525N9855K3631
57395C824268j4919n3393q9407j21161j47253j66332j77785j82747j83558j82020
57385B505693j78467j72347j63316j51949j39791j28581j19155j11149j03680
57376A237258r6048q7971p9728p2085o5476n9406n3333m7963m4646m3436m2674
57365E44492m0762l7572l4006l0970k8855k7266k5260k2509j9985j8724j8398
$$ y = [2073572, 1979237, 1893676, 1817586, 1751048, 1692846, 1642035, 1598713, 1562963, 1534184, 1511632, 1494584, 1482027, 1473366, 1469347, 1471180, 1478932, 1491959, 1510555, 1535622, 1566773, 1602340, 1641569, 1685535, 1735677, 1792602, 1856496, 1927645, 2006404, 2093609, 2190831, 2298909, 2416316, 2540457, 2670698, 2808503, 2954108, 3104356, 3254203, 3398733, 3532687, 3649257, 3740782, 3800637, 3824268, 3809349, 3755956, 3666549, 3545388, 3398135, 3231803, 3054018, 2871271, 2687713, 2505693, 2327226, 2154879, 1991563, 1839614, 1699823, 1571242, 1452087, 1340938, 1237258, 1141210, 1053239, 973511, 901426, 835950, 776544, 723211, 675248, 630602, 587166, 544492, 503730, 466158, 432152, 401182, 372327, 345061, 319801, 297292, 277307, 258583, 240185]
57354B40185j8073j7834j8210j8532j7528j5384j3581j2700j2086j1531j1516
57343G3210j1704j1098r842r138r178q979D934c044p692o532n041m882n840n822
57329c8853m454l922n211o295n670m964o085p974q509p910p925q765r068q170
57315a33775o713n501m970n120n065l592j046M46l68k202l088k683j808j061r33
57300a77479j906l335l499j886k35k73j634k931l521l302k197q30l30o04l46N50
57284b03758N03q91j764j000j98r66k386l022l438m565n291l981j098J739M108
57269b26008O163P038O039M420L963M536M828M492L921K868J110m27q14n06l34
57254a78711q5N68J143J616L008N261O413N601M988O581R125J0566J1687J4429
$$ y = [240185, 222112, 204278, 186068, 167536, 150008, 134624, 121043, 108343, 96257, 84726, 73210, 61506, 50408, 40566, 31428, 22250, 13271, 4934, -3044, -10736, -17268, -22309, -27191, -33031, -38853, -43307, -47229, -52440, -58735, -64405, -69369, -75454, -83428, -91937, -99847, -107772, -116537, -125605, -133775, -140488, -145989, -150959, -156079, -161144, -164736, -165782, -165336, -165704, -167906, -170994, -173677, -175485, -176546, -177479, -179385, -182720, -186219, -188105, -188340, -188613, -190247, -193178, -196699, -200001, -202198, -203028, -203358, -203962, -204308, -203758, -203255, -204146, -205910, -206910, -207108, -208074, -210460, -213482, -216920, -221485, -226776, -230757, -231855, -230116, -226008, -219845, -212807, -206768, -202348, -198385, -193849, -189021, -184529, -180608, -177740, -176630, -177057, -177871, -178377, -178711, -178796, -178228, -177085, -175469, -172461, -167200, -160787, -155186, -150198, -143617, -134492, -123926, -112239, -97810]
57240i7810J7955J9560J8751J7649f051A3112K0973K2450K2328K0403J8602J8594
57228A36462J9460J9748K0391K2841K5645K6022K4157K2918K3715K5589K8061
57217C95009L1824L6405L9785M0862M0165L8051L4202K8950K3096J6431Q261o26
57205G32415q343j4103j8473k1780k4007k5738k7528k8737k8519k7383k6213k4665
57193D56926k2214j9679j7818j5619j2032q307o318n673m793l669l122k438m21
57180C34823K114L449L616L512K669O34o08J300N547R512J2523J5245J6710J5557
57166D26603J3346J2946J4215J4703J3961J3559J3484J2373J0987J1766J5061
57155E73004J9299K4446L1623L9711M6286N1805N8800O6985P3248P6706P9732
$$ y = [-97810, -79855, -60295, -41544, -23895, -6051, 13112, 34085, 56535, 78863, 99266, 117868, 136462, 155922, 175670, 196061, 218902, 244547, 270569, 294726, 317644, 341359, 366948, 395009, 426833, 463238, 503023, 543885, 584050, 622101, 656303, 685253, 708349, 724780, 733041, 732415, 724072, 709969, 691496, 669716, 645709, 619971, 592443, 563706, 535187, 507804, 481591, 456926, 434712, 415033, 397215, 381596, 369564, 361257, 354939, 349266, 344473, 340804, 337682, 335244, 334823, 336937, 340386, 344002, 347514, 350183, 350817, 350209, 351509, 357056, 366568, 379091, 394336, 411046, 426603, 439949, 452895, 467110, 481813, 495774, 509333, 522817, 535190, 546177, 557943, 573004, 592303, 616749, 648372, 688083, 734369, 786174, 844974, 911959, 985207, 1061913, 1141645]
57144A141645Q3532Q6488Q7432Q6971Q5137Q1171P5868P0788O5361N8300N1471
57133A974164M8281M8648M9822N1635N5972O1312O3303O1273N8754N6778N2186
57122B582128M4001L5866L0284K5448J9795J4876J1466P414J784k972n127o137
57110B758826p162p065n610m713m878m291k862l126n672p898q598r495j1042j1347
57096B665067j0645j2154j6960k2622k7987l4612m2495m9739n7409o8987q3872
57085B237585r7447j08733j21488j36460j49829j61026j74509j91324k06753k19206
57075F70810k33502A85464h3989k83131k96339l11889l27327l41961l60435l84761
57065b389832m10617m36030m65448n00659n36809n72645o15531o70361p32724
$$ y = [1141645, 1225177, 1311665, 1399097, 1486068, 1571205, 1652376, 1728244, 1799032, 1864393, 1922693, 1974164, 2022445, 2071093, 2120915, 2172550, 2228522, 2289834, 2353137, 2414410, 2473164, 2529942, 2582128, 2626129, 2661995, 2692279, 2717727, 2737522, 2752398, 2763864, 2771278, 2773062, 2770090, 2764963, 2758826, 2751664, 2744599, 2738989, 2734276, 2729398, 2725107, 2722245, 2719119, 2713447, 2705549, 2696951, 2687456, 2676414, 2665067, 2654422, 2642268, 2625308, 2602686, 2574699, 2540087, 2497592, 2447853, 2390444, 2321457, 2237585, 2140138, 2031405, 1909917, 1773457, 1623628, 1462602, 1288093, 1096769, 890016, 670810, 437308, 185464, -83989, -367120, -663459, -975348, -1302675, -1644636, -2005071, -2389832, -2800449, -3236479, -3701927, -4202586, -4739395, -5312040, -5927571, -6597932, -7330656]
57056g330656p99069q74049r61132j055770j154891j263564j385687j518962j666063
57047a8009843j838923k043968k275437k531394k822422l155782l527342l941280
57039d0146391m422247m995984n674200o469585p403609q482352r683715j0981645
57031i8259728j2357725j3777460j5193066j6580545j7908053j9043277j9823641
57024b12943495k0364658k1213912k2920430k5291271k7178876k7170340k4527852
57017c81610834j9484472j2806612n274680K453406R753293J6043376K0910141
57010c70016382K4185562K5934078K6410243K5990278K5053878K3872419K2581640
57003a95988284K1225562J9803860J8302627J6725246J5110722J3516912J1990050
$$ y = [-7330656, -8129725, -9003774, -9964906, -11020676, -12175567, -13439131, -14824818, -16343780, -18009843, -19848766, -21892734, -24168171, -26699565, -29521987, -32677769, -36205111, -40146391, -44568638, -49564622, -55238822, -61708407, -69112016, -77594368, -87278083, -98259728, -110617453, -124394913, -139587979, -156168524, -174076577, -193119854, -212943495, -233308153, -254522065, -277442495, -302733766, -329912642, -357082982, -381610834, -401095306, -413901918, -419176598, -416723192, -406969899, -390926523, -370016382, -345830820, -319896742, -293486499, -267496221, -242442343, -218569924, -195988284, -174762722, -154958862, -136656235, -119930989, -104820267, -91303355, -79313305]
56996g9313305J0557587R239163Q048372O987004O049769N233413M534091L940194
56988b4723712L435976L008659K645955K332140K054561J810275J599948J419101
56980f417097J261010J123474J006110R04659Q13754e76062H3484N93937N33644
56971A211065M81089M37511L98655L60069L22562K87834K53330K16789J81884
56962D150788J53802J32536J15542J03535R8107R6624R4947R2827R1498Q8351
56952E218557P9107O3575M4550K2740k673k9942n5460p7592r6314j10097j16459
56941D939992j14887j07328r7095q7630p8652o2868l3321J364J5127j4354q3729
56930D276619j67132k37934k82963l00863k96640k78836k55193k28529j99487
$$ y = [-79313305, -68755718, -59516555, -51468183, -44481179, -38431410, -33197997, -28663906, -24723712, -21287736, -18279077, -15633122, -13300982, -11246421, -9436146, -7836198, -6417097, -5156087, -4032613, -3026503, -2121844, -1308090, -576062, 83484, 677421, 1211065, 1692154, 2129665, 2528320, 2888389, 3210951, 3498785, 3752115, 3968904, 4150788, 4304590, 4437126, 4552668, 4656203, 4754310, 4850934, 4945881, 5038708, 5130206, 5218557, 5297664, 5361239, 5405789, 5428529, 5425856, 5395914, 5340454, 5262862, 5166548, 5056451, 4939992, 4825105, 4717777, 4620682, 4533052, 4454400, 4391532, 4358211, 4359575, 4374702, 4360348, 4276619, 4109487, 3871553, 3588590, 3287727, 2991087, 2712251, 2457058, 2228529, 2029042]
56921B029042j72042j51678j38791j28873j19084j10154j02038r2782q2309p2829
56911H58462o4720n6007m6574l8885l3596k8342k1917j6081j1890p654k036L784
56899E34544Q544J2928J7616K1438K2561J9898J2958K512q183j5323j8492k0473
56887E90528k2770k3742k1861j8098j4109j0349p069m913l378o32M056R460J4611
56874D91734J9847K4962K8623L0668L2661L4814L4478K9178J9487P610m918j6576
56862G32568k4972k8780k9406k9116k8474k7018k5084k3286k1274j8715j6494
56851D59949j5271j3860j0866p176m857m138l527k563k354l160l527k577j595
56838C84478k246m222n709n629m556l637l366l431l264k590j622p90r0J284M213
$$ y = [2029042, 1857000, 1705322, 1566531, 1437658, 1318574, 1208420, 1106382, 1013600, 931291, 858462, 793742, 737735, 691161, 652276, 618680, 590338, 568421, 552340, 540450, 532796, 530760, 534544, 543088, 556016, 573632, 595070, 617631, 637529, 650487, 652999, 644816, 629493, 611001, 590528, 567758, 544016, 522155, 504057, 489948, 479599, 472530, 467617, 464239, 463607, 467663, 477123, 491734, 511581, 536543, 565166, 595834, 628495, 663309, 697787, 726965, 746452, 754062, 749144, 732568, 707596, 678816, 649410, 620294, 591820, 564802, 539718, 516432, 495158, 476443, 459949, 444678, 430818, 419952, 412776, 407919, 403781, 400254, 397691, 395337, 392177, 388650, 386073, 384478, 382232, 378010, 372301, 366672, 362116, 358479, 355113, 351682, 348418, 345828, 344206, 343416, 343326, 344610, 348823]
56823C48823Q211J0943J0073N920J799J058M056Q549J2514J5726J8785K1765K4230
56810D92452K5887K6805K7460K8546L0333L2145L3140L3715L5462L9551M5575
56799H51071N1785N5676N4508M6591L2721J5881o25j4307k3370k7160k7140k5935
56787I89696k4580k1834j6846j1022o020j377M371J1145J7819K4659L3108M3107
56775A042226N2468N9529O4683O8411O8821O2490M7584K5772J342k1160l8835
56764A433331n0693n6665n7058n3108m7188m1406l6159l0824k5254j9552j2912
56753A002512m488M677J2373J8251K4269L1377L7721M1201M1888M0044L3582K0167
56741A303574J362j7733l2809m2436m6452m5242m1174l7898l6596l4683k9713
$$ y = [348823, 357034, 367977, 378050, 383970, 385769, 386827, 390883, 399432, 411946, 427672, 446457, 468222, 492452, 518339, 545144, 572604, 601150, 631483, 663628, 696768, 730483, 765945, 805496, 851071, 902856, 958532, 1013040, 1059631, 1092352, 1108233, 1107608, 1093301, 1069931, 1042771, 1015631, 989696, 965116, 943282, 926436, 915414, 909394, 908017, 912388, 923533, 941352, 966011, 999119, 1042226, 1094694, 1154223, 1218906, 1287317, 1356138, 1418628, 1466212, 1491984, 1493326, 1472166, 1433331, 1382638, 1325973, 1268915, 1215807, 1168619, 1127213, 1091054, 1060230, 1034976, 1015424, 1002512, 998024, 1002701, 1015074, 1033325, 1057594, 1088971, 1126692, 1167893, 1209781, 1249825, 1283407, 1303574, 1304936, 1287203, 1254394, 1211958, 1165506, 1120264, 1079090, 1041192, 1004596, 969913, 940200]
56730I40200k2906j7232j3413r820n426p96L411P197J0524J3378J6368J9706K1646
56717I62837J9560J2868L663n736j4355k1592k6459k8741k9524k9652k8681k6346
56705G87842k3796k2112k0499j7555j3786j1299j1008j1566j1308j0052q504o974
56693F19383n426m247m091m971n909n687m061k223j784k997m366m408l442k883
56679E62888l083l022k180j546k163l612m704m975m715m109l340l097l888m992
56665E13462n057l786k186j129o90r34k120l699m201k915r15K98M29K6o39j358
56649D84586j441n71K12l92k152l684m409m806m971m461l712l914n020n392m285
56634D35588l230l793n131n289m105l209l430l734k875q34J692M265O493P621
$$ y = [940200, 917294, 900062, 886649, 876829, 871403, 870607, 874018, 881215, 891739, 905117, 921485, 941191, 962837, 982397, 995265, 998928, 993192, 978837, 957245, 930786, 902045, 872521, 842869, 814188, 787842, 764046, 741934, 721435, 703880, 690094, 678795, 667787, 656221, 644913, 634861, 626357, 619383, 613957, 609710, 605619, 600648, 594739, 589052, 584991, 582768, 580984, 577987, 573621, 569213, 565771, 562888, 559805, 556783, 554603, 553057, 550894, 547282, 542578, 537603, 532888, 528779, 525439, 522342, 518454, 513462, 508405, 504619, 502433, 501304, 500614, 499680, 497560, 493861, 489660, 486745, 485830, 486128, 486557, 486583, 485944, 484586, 483145, 482574, 482786, 482394, 480242, 476558, 472149, 467343, 462372, 457911, 454199, 450285, 445265, 439873, 435588, 432358, 428565, 423434, 418145, 414040, 410831, 407401, 403667, 400792, 399958, 401650, 405915, 412408, 420029]
56620D20029P060N409M339N064O828P445N742L078J667J666J295r0q07L83J912
56605D71020J453o60k034j768j416k345l888m647m148k583k17K259L719L799L240
56590D61784K593J471j80j123l02J330J649j17k576l803l031r17J020J258o81
56575D58375l613n566n450l689j404N41J709K021J875J829J911J640J047J111
56561D52337K514M286M555K745L49p60j51J260K408K586J411p59k518k518j110
56546D66635j77r85k707l515k735j502j396k704m114m032k311m34J20n62j178
56531D38403q47J96J286J935J894J316Q76J075J511J515J346J723K349K153J233
56516D57964J081K313L527L409K741L130M538N456N120M260L841M104M997O587
$$ y = [420029, 427089, 432498, 436837, 441901, 448729, 456174, 461916, 464994, 466661, 468327, 469622, 469532, 468725, 469108, 471020, 472473, 471813, 469779, 468011, 466595, 464250, 460362, 455715, 451567, 448984, 448767, 451026, 454745, 458544, 461784, 464377, 465848, 465668, 464545, 464243, 465573, 467222, 467105, 464529, 460726, 457695, 456778, 457798, 459056, 458375, 454762, 449196, 443746, 440057, 438653, 439194, 440903, 442924, 444799, 446628, 448539, 450179, 451226, 452337, 454851, 459137, 463692, 466437, 466786, 466026, 465875, 467135, 469543, 472129, 473540, 472781, 470263, 467745, 466635, 466458, 465473, 462766, 459251, 456516, 455014, 453618, 450914, 446800, 442768, 440457, 440023, 440143, 439581, 438403, 437556, 437752, 439038, 440973, 442867, 444183, 445059, 446134, 447645, 449160, 450506, 452229, 454578, 456731, 457964, 459045, 461358, 464885, 468294, 471035, 474165, 478703, 484159, 489279, 493539, 497380, 501484, 506481, 513068]
56502E13068Q694J0570J1334J0681R267Q259Q197Q474Q259P734P669P988P781
56489F27975O684N210L659J858K25l89j86l94j417k526l730o006q954j0343r264
56474F02402p741p740q406q108p369p570q189p772o634o201o435o207n546n270
56460E03214m942l571j885j610k701l517l543l649l840l178j977j699k369k373
56446D62360j253m57q70j578j739j748j825j336j95O25O12L11p3j039k418l213
56430D46164l177k970k508j023R38J687J152J315L000M352L695K072J538K380
56416D58615L516M322M703M324L199K346K673L720M390M460M638N360O069N615
56402E17950L534J186R75L571O663P625O607N407M348K618J008J364L234L999
$$ y = [513068, 521762, 532332, 543666, 554347, 563614, 571873, 580070, 588544, 596803, 604537, 612206, 620194, 627975, 634659, 639869, 643528, 645386, 645611, 645222, 645036, 644642, 643225, 640699, 636969, 630963, 622009, 611666, 602402, 594661, 586921, 578515, 570407, 563038, 555468, 547279, 539507, 532873, 526672, 520237, 514030, 508484, 503214, 498272, 494701, 492816, 491206, 488505, 484988, 481445, 477796, 473956, 470778, 468801, 467102, 464733, 462360, 461107, 460650, 459780, 458202, 456463, 454715, 452890, 451554, 451359, 451984, 452596, 452907, 452834, 451795, 449377, 446164, 442987, 440017, 437509, 436486, 437424, 439111, 440263, 441578, 444578, 448930, 452625, 454697, 456235, 458615, 462131, 466453, 471156, 475480, 478679, 481025, 483698, 487418, 491808, 496268, 500906, 506266, 512335, 517950, 521484, 522670, 523645, 527216, 533879, 541504, 548111, 553518, 557866, 560484, 561492, 562856, 566090, 570089]
56388E70089K906K038K437K213L9k196k179o00L15J10l8L71P39N46l41j921l641
56371E70887m581m545m058l096j294K40o07l903o920p423n978m231k837k026k222
56356E17406k906k750j910k075l286l175q46J139O09q96r25N6K55l8M53J103N95
56339E02809j73N49K066K278J347J311K372K552J261M03J331L006L970M230M268
56324E33580L853K781J739J474J760J786J275P90J024J945K725K815K706K981
56310E63234L033J976N86N85J795K074P18j94J046L310M728N415O319P011O595
56295F08231N607N137N039M698M505M904N001L924K714L052M755O159O273N218
56281F75217L346J454R77K413M231M765M443M720N742O579P046P613Q176Q304
$$ y = [570089, 572995, 575033, 577470, 579683, 579722, 577526, 575347, 574747, 575062, 575172, 575134, 575505, 576244, 576790, 576449, 574528, 570887, 566306, 561761, 557703, 554607, 553313, 553553, 552946, 549043, 542123, 534700, 528722, 524491, 521654, 519628, 517406, 514500, 511750, 509840, 507765, 504479, 501304, 500458, 501597, 502206, 501310, 500385, 500441, 500696, 500658, 501111, 502214, 502809, 502636, 503185, 505251, 507529, 508876, 510187, 512559, 515111, 516372, 516775, 518106, 521112, 525082, 529312, 533580, 537433, 540214, 541953, 543427, 545187, 546973, 548248, 549038, 550062, 552007, 554732, 557547, 560253, 563234, 566267, 568243, 568829, 569414, 571209, 573283, 574001, 573807, 574853, 578163, 582891, 588306, 594625, 601636, 608231, 613838, 618975, 624014, 628712, 633217, 638121, 643122, 647046, 649760, 652812, 657567, 663726, 669999, 675217, 678563, 680017, 680994, 683407, 687638, 692403, 696846, 701566, 707308, 713887, 720933, 728546, 736722, 745026]
56267G45026Q243Q490R023R876J1562J3762J4830J3753J1693J0417J0343J1178
56255H78196J3075J5711J7619J7836J7061J5939J3823J0631Q109P459P314O016
56243A028789M358L992M575M689M392M685N467O140P174R188J1411J2909J4199
56230A121968J5970J7562J8470J9900K2901K6383K8905L0755L2502L3463L3814
56219A402593L5993M1308M7227N0987N3805N8267O3571O7282P0166P5084Q1939
56208B048222Q8020R2945R9273J08096J17714J27074J37206J48772J60987J73357
56198C301666J86164J99275K12676K27557K44247K59886K71126K78381K84079
56189E465057K87422K84858K75580K62433K46661K25667J97242J62850J25307
$$ y = [745026, 753269, 761759, 770782, 780658, 792220, 805982, 820812, 834565, 846258, 856675, 867018, 878196, 891271, 906982, 924601, 942437, 959498, 975437, 989260, 999891, 1008000, 1015459, 1022773, 1028789, 1033147, 1037139, 1041714, 1046403, 1050795, 1055480, 1060947, 1067087, 1074261, 1083449, 1094860, 1107769, 1121968, 1137938, 1155500, 1173970, 1193870, 1216771, 1243154, 1272059, 1302814, 1335316, 1368779, 1402593, 1438586, 1479894, 1527121, 1578108, 1631913, 1690180, 1753751, 1821033, 1891199, 1966283, 2048222, 2136242, 2229187, 2328460, 2436556, 2554270, 2681344, 2818550, 2967322, 3128309, 3301666, 3487830, 3687105, 3899781, 4127338, 4371585, 4631471, 4902597, 5180978, 5465057, 5752479, 6037337, 6312917, 6575350, 6822011, 7047678, 7244920, 7407770, 7533077]
56180G533077Q6021M5967P002k9297o2433r1651j15394j32889j44994j53148j58742
56169F783519j63259j67418j70217j70610j69797j70167j72368j75280j78342
56160E246061j81787j84915j86398j86213j85390j84115j81697j77967j73034
56151C604545j66473j58446j50585j43880j36956j28549j20037j12999j05914
56142B380706r6422q5520p6345o9791o4510o0204n7433n4891n0392m4341l9159
56131A681698l5691l2841l0011k7119k3256j8244j4288j2992j2127q829m444k323
56119A459533k227j172J277K930L454M560O331P573R174J2798J6919J8541J8215
56106A557906J8909K0537K0408J8534J7558J7605J6226J3389J1716J1699J1452
$$ y = [7533077, 7619098, 7665065, 7672067, 7642770, 7580337, 7488686, 7373292, 7240403, 7095409, 6942261, 6783519, 6620260, 6452842, 6282625, 6112015, 5942218, 5772051, 5599683, 5424403, 5246061, 5064274, 4879359, 4692961, 4506748, 4321358, 4137243, 3955546, 3777579, 3604545, 3438072, 3279626, 3129041, 2985161, 2848205, 2719656, 2599619, 2486620, 2380706, 2284284, 2198764, 2122419, 2052628, 1988118, 1927914, 1870481, 1815590, 1765198, 1720857, 1681698, 1646007, 1613166, 1583155, 1556036, 1532780, 1514536, 1500248, 1487256, 1475129, 1466300, 1461856, 1459533, 1457306, 1456134, 1457411, 1460341, 1463795, 1468355, 1474686, 1482259, 1491433, 1504231, 1521150, 1539691, 1557906, 1576815, 1597352, 1617760, 1636294, 1653852, 1671457, 1687683, 1701072, 1712788, 1724487, 1735939]
56095A735939J0997J1952J3283J2599J1479J3873J9108K2299K2258K3231K7921
56084A924939L4330M0494M6783N2544N6077N9204O6323P7616Q8589R7547J07845
56073B652291J21295J35210J47785J60553J73117J81059J81830J78079J72893
56064D104112J66451J59411J54591J52646J49980J42735J28893J05765P0962K7868
56054E363414j4721n0417p8607r9647j12761j20345j28389j39783j51814j61910
56044D305020j70530j76708j76678j69504j58975j47815j34981j20469j07204
56035B942156r6104q4745p2905o3872n8309n2582m5289l9560l6740l3712k8864
56024B329474k4717k2386j9357j5002j2371j2224j1317q590o731n771j946M878
$$ y = [1735939, 1746936, 1758888, 1772171, 1784770, 1796249, 1810122, 1829230, 1851529, 1873787, 1897018, 1924939, 1959269, 1999763, 2046546, 2099090, 2155167, 2214371, 2280694, 2358310, 2446899, 2544446, 2652291, 2773586, 2908796, 3056581, 3217134, 3390251, 3571310, 3753140, 3931219, 4104112, 4270563, 4429974, 4584565, 4737211, 4887191, 5029926, 5158819, 5264584, 5335546, 5363414, 5348693, 5298276, 5219669, 5120022, 5007261, 4886916, 4758527, 4618744, 4466930, 4305020, 4134490, 3957782, 3781104, 3611600, 3452625, 3304810, 3169829, 3049360, 2942156, 2846052, 2761307, 2688402, 2624530, 2566221, 2513639, 2468350, 2428790, 2392050, 2358338, 2329474, 2304757, 2282371, 2263014, 2248012, 2235641, 2223417, 2212100, 2203510, 2196779, 2191008, 2189062, 2193940]
56012B193940R665J0416J0935J3256J4678J4668J6892K1588K3863K2503K2513
56001B374917K5877K8162K7548K8516L2837L5637L4650L4683L8481M1767M1865
55990B744940M2622M6040M7840M6204M6121N0034N3044N2615N3929O0141O6281
55979C309811O8389O9868P3436P5964P6489P9816Q6819R1192R1200R4016J02765
55968D219765J10485J13073J16366J23625J28414J27554J28784J37135J46029
55959E351230J50533J56770J68918J79774J84230J89393K00880K12108K18111
55950G011947K26653K43870K62048K73987K86379L06177L27062L42966L61835
55941I642924L91811M26556M58367M92632N34759N76298O09208O40472O77529
$$ y = [2193940, 2203605, 2214021, 2224956, 2238212, 2252890, 2267558, 2284450, 2306038, 2329901, 2352404, 2374917, 2400794, 2428956, 2456504, 2485020, 2517857, 2553494, 2588144, 2622827, 2661308, 2703075, 2744940, 2787562, 2833602, 2881442, 2927646, 2973767, 3023801, 3076845, 3129460, 3183389, 3243530, 3309811, 3378200, 3448068, 3521504, 3597468, 3673957, 3753773, 3840592, 3931784, 4022984, 4117000, 4219765, 4330250, 4443323, 4559689, 4683314, 4811728, 4939282, 5068066, 5205201, 5351230, 5501763, 5658533, 5827451, 6007225, 6191455, 6380848, 6581728, 6793836, 7011947, 7238600, 7482470, 7744518, 8018505, 8304884, 8611061, 8938123, 9281089, 9642924, 10034735, 10461291, 10919658, 11412290, 11947049, 12523347, 13132555, 13773027, 14450556]
55932A4450556P13422P42060P73190Q15728Q61589R02955R49125J007921J067471
55923B2284017J116282J164419J224761J291293J357482J437047J543002J664658
55915C3082961J788900J924403K080696K246192K414163K606592K842456L106602
55907E2092965L381008L679999M021334M393553M791185N250585N807831O454385
55899H9872845P180811Q027193R039954J0224084J1599917J3258528J5290407
55892A64493739J7713898K0551040K3895820K7799858L2173202L6879481M1636306
55885C65143344M5357972M5664763L9814331K6873820R081759r215642k4138381
55878D98581966l3989412l9050791m0449825l9387878l6914892l3824258l0574174
$$ y = [14450556, 15163978, 15906038, 16679228, 17494956, 18356545, 19259500, 20208625, 21216546, 22284017, 23400299, 24564718, 25789479, 27080772, 28438254, 29875301, 31418303, 33082961, 34871861, 36796264, 38876960, 41123152, 43537315, 46143907, 48986363, 52092965, 55473973, 59153972, 63175306, 67568859, 72360044, 77610629, 83418460, 89872845, 97053656, 105080849, 114120803, 124344887, 135944804, 149203332, 164493739, 182207637, 202758677, 226654497, 254454355, 286627557, 323507038, 365143344, 410501316, 456166079, 495980410, 522854230, 531935989, 522720347, 498581966, 464592554, 425541763, 385091938, 345704060, 308789168, 274964910, 244390736]
55871B44390736k7377296k4358564k1587633j9048787j6700195j4556145j2657709
55864A08104407j0998990r542672q278095p207227o298275n505671m817515m239842
55856E1216120l753758l329280k963490k666444k424977k215271k035337j891861
55848B9935702j769741j646824j525705j421084j328192j232216j136894j055741
55840A8819305r85115r12145q39765p79346p27645o74574o24952n89913n65053
55831A2120797n38520n12471m95541m82266m60874m34239m12956l94677l69951
55822H019302l41949l20971l05222k85730k64964k52278k45717k35959k23970
55813E542542k17854k16152k10586k01623j95851j91556j82028j69582j61749
$$ y = [244390736, 217013440, 192654876, 171067243, 152018456, 135318261, 120762116, 108104407, 97105417, 87562745, 79284650, 72077423, 65779148, 60273477, 55455962, 51216120, 47462362, 44133082, 41169592, 38503148, 36078171, 33862900, 31827563, 29935702, 28165961, 26519137, 24993432, 23572348, 22244156, 21011940, 19875046, 18819305, 17834190, 16922045, 16082280, 15302934, 14575289, 13900715, 13275763, 12685850, 12120797, 11582277, 11069806, 10574265, 10091999, 9631125, 9196886, 8783930, 8389253, 8019302, 7677353, 7356382, 7051160, 6765430, 6500466, 6248188, 6002471, 5766512, 5542542, 5324688, 5108536, 4897950, 4696327, 4500476, 4308920, 4126892, 3957310, 3795561]
55804C795561j56971j48073j36229j27715j20645j08722r4527q5408p9611p0005
55794B667655n8149n1181m7955m1871l4737l4301m0184m5076m7923n3138n8714
55783B154426n7833n1195m5810m2765l7642l1510k9850l1607l0501k6494k5275
55772A743944k7418k8366k7975k9765l2138l0719k8086l0581l6604l8575l5557
55761A398160l3450l3427l0932k5964k3835k5226k5186k2567k1219k1530j9734
55750A115090j5924j4005j3588j0551n664l995n541m999j161J680J979K509L438
55737A049268J874j585l471m592q803j4822j7302j5966j5759j7895j8794j7898
55725I14255j8451k0080j8806j4962j3265j4258j3453r725o939o348m878k086
$$ y = [3795561, 3638590, 3490517, 3354288, 3226573, 3105928, 2997206, 2902679, 2817271, 2737660, 2667655, 2609506, 2558325, 2510370, 2468499, 2433762, 2399461, 2359277, 2314201, 2266278, 2213140, 2154426, 2096593, 2045398, 1999588, 1956823, 1919181, 1887671, 1857821, 1826214, 1795713, 1769219, 1743944, 1716526, 1688160, 1660185, 1630420, 1598282, 1567563, 1539477, 1508896, 1472292, 1433717, 1398160, 1364710, 1331283, 1300351, 1274387, 1250552, 1225326, 1200140, 1177573, 1156354, 1134824, 1115090, 1099166, 1085161, 1071573, 1061022, 1055358, 1051363, 1045822, 1040823, 1039662, 1041342, 1043321, 1045830, 1049268, 1051142, 1049557, 1046086, 1041494, 1032691, 1017869, 1000567, 984601, 968842, 950947, 932153, 914255, 895804, 875724, 856918, 841956, 828691, 814433, 800980, 791255, 784316, 777968, 773090, 771004]
55713G71004j684m982r342j3591j8422k1462j9198j3911j1421j1885j0363o361
55701F28382m579n806n739l837m683q857j1148r970j0124j3509j5238j2353q767
55688E13772p867p201m416k130k886m751n526o392q260r213q435q066q897q777
55674D20955p144o299o556n300k427j223k076j263J904K796r79n471o857o605
55660C73455p055p042n281l563l271k862j541j293k667k845n37J524J505J579
55646C40106L437N147N304N915Q092R057O785L837L187L634K760J295J226K203
55632D01985K880L514M562M828L422J643R87J212J783L069M760N360M342K766
55618D47113J242l18r20M82K121J189j419k071l37M45q53j346M48K071J685Q05
$$ y = [771004, 769320, 764338, 754996, 741405, 722983, 701521, 682323, 668412, 656991, 645106, 634743, 628382, 623803, 617997, 612258, 608421, 603738, 594881, 583733, 573763, 563639, 550130, 534892, 522539, 513772, 505905, 498704, 494288, 492158, 489272, 484521, 478995, 472603, 464343, 455130, 446695, 438629, 429732, 420955, 413811, 407512, 400956, 395656, 393229, 392006, 389930, 388667, 390571, 393367, 392388, 386917, 380060, 373455, 366400, 359358, 354077, 350514, 347243, 344381, 342840, 341547, 338880, 336035, 335498, 337022, 338527, 340106, 343543, 348690, 353994, 359909, 368001, 377058, 383843, 387680, 390867, 394501, 397261, 398556, 399782, 401985, 404865, 408379, 412941, 417769, 421191, 422834, 423821, 425033, 426816, 429885, 434645, 440005, 444347, 447113, 448355, 448037, 447117, 447599, 449720, 450909, 449490, 447419, 447082, 447527, 446674, 445328, 445776, 447847, 449532, 450337]
55602D50337P54M90k35L57K363L177J978J267K320L066K209J411J514Q04j112
55587D70700j910j061j535m750p954q977r592j1679j3978j5019j5670j6406j5697
55574C46472j3275j1270j0257q282n641n904r709j2397j0907q327q275r242q444
55561B24542o886o473n695k684N43J081k65j074j285j627j040Q13J415n77k183
55546A98605q35P98r24m299m870k311j11J21l57r25k018k670j301J530L948N549
55530A89930O813P066N617L745K961K661J865J622L055M717M713L949M460N979
55516B49153O893P345Q584J0433J1848J2987J4384J5438J5898J7322K0796K4724
55504D15805K7051K8104K8966K8868K6507K2133J6107P471l431j3107j8686k1746
$$ y = [450337, 451091, 451581, 451346, 451703, 454066, 457243, 459221, 460488, 462808, 465874, 468083, 469494, 471008, 471812, 470700, 468790, 467729, 466194, 461444, 453490, 444513, 434921, 423242, 409264, 394245, 378575, 362169, 346472, 333197, 321927, 311670, 303388, 297747, 291843, 282134, 269737, 258830, 250503, 242228, 232986, 224542, 217656, 211183, 205488, 202804, 203347, 204428, 204163, 203089, 201804, 200177, 199137, 199950, 201365, 200788, 198605, 197770, 198568, 197644, 193345, 188475, 186164, 186053, 186174, 185817, 184892, 182874, 180204, 178903, 180433, 184381, 189930, 196743, 203809, 209426, 213171, 216132, 218793, 220658, 222280, 225335, 230052, 234765, 238714, 243174, 249153, 256046, 263391, 271975, 282408, 294256, 307243, 321627, 337065, 352963, 370285, 391081, 415805, 442856, 470960, 499926, 528794, 555301, 577434, 593541, 601012, 597581, 584474, 565788, 544042]
55492E44042k5373k9194l0501k8870k6379k4285k2435k0994k0083j8643j6058
55481B81227j3601j2105r994o195k927k490l154j785R97K085J140O62J436J816
55467B37112J311J244J652R10j051k128j298q9k00j582l373m911n680n651n747
55452B10519o731q022q744r107r469r102p611o314o328o394m731k111q47j444
55438A23564k470l078l472l498k775k028k377l640m744n301n344m417k460o56
55424G7304o1l16r49k427m390m653k073J139K148J117q3j121k617l681k952j182
55408E5203j52K44J313K704K801J508K45k53j93N37J859K563J880J044J247J289
55392G3839l57k451k657j303n94r51j004n57o25q41J98K123K970K196J097L71
$$ y = [544042, 518669, 489475, 458974, 430104, 403725, 379440, 357005, 336011, 315928, 297285, 281227, 267626, 255521, 245527, 239332, 236405, 233915, 230761, 228976, 229973, 232058, 233198, 233860, 235296, 237112, 238423, 239667, 241319, 242229, 241178, 239050, 237752, 237663, 237463, 235881, 232508, 227597, 221917, 216266, 210519, 203788, 195766, 187022, 177915, 168446, 159344, 151733, 145419, 139091, 132697, 127966, 125855, 125008, 123564, 121094, 118016, 114544, 111046, 108271, 106243, 103866, 100226, 95482, 90181, 84837, 80420, 77960, 77304, 77243, 76927, 75978, 73551, 69161, 64508, 62435, 63574, 65722, 66839, 66756, 65635, 63018, 59337, 56385, 55203, 55051, 55295, 56608, 59312, 62113, 63621, 63866, 63613, 63420, 63957, 65816, 68379, 70259, 71303, 72550, 73839, 73482, 71031, 68374, 67071, 66477, 65526, 64522, 63965, 63340, 62499, 62697, 64820, 67790, 69986, 71083, 71454]
55376G1454l10n61M64J998K210Q86m75j105j413j274r8J499K184J919J590R55
55360G9923q50l044l680k289j55J822L454L867K087q93k632k005L7K046K916J905
55344H2509k30r93Q97L151K789M47q98n94o23j585j709k42J181J278P98O92P87
55327H7655Q42J115J416J277J140J699K251J621M95O22J879K405J639P71J66j087
55311A05906k700k932j534o79j878l939m914m477l412k192r81o2L87L01n50j975
55295G4369k895k499j499j033r12k96N12N78rn89j374k689l498k706j148l88k86
55278E3638J48L85o05j745j047J053K294K145J972J853L88k145l470k647j149
55263E1068j44P15J347P73p55j568j185q59j018n30R04K002K163K247K521K083
$$ y = [71454, 71144, 70583, 71047, 73045, 75255, 76141, 75666, 74561, 73148, 71874, 71776, 73275, 75459, 77378, 78968, 79923, 79073, 76029, 72349, 70060, 69905, 71727, 75181, 79048, 81135, 80242, 77610, 75605, 75642, 77688, 80604, 82509, 82279, 81286, 82183, 85334, 88123, 88570, 87672, 87078, 86455, 84870, 83161, 82919, 84100, 85378, 86176, 86868, 87655, 88497, 89612, 91028, 92305, 93445, 95144, 97395, 99016, 99511, 100133, 102012, 104417, 106056, 106827, 106993, 105906, 103206, 100274, 98740, 98061, 96183, 92244, 87330, 82853, 79441, 77249, 76268, 76206, 76593, 76894, 76344, 74369, 71474, 68975, 67476, 66443, 65531, 65235, 65747, 66325, 66316, 65727, 64353, 61664, 58166, 55460, 54312, 53924, 53638, 53786, 54171, 53566, 51821, 50774, 51827, 54121, 56266, 58238, 60091, 60479, 58334, 54864, 52217, 51068, 50924, 51639, 52986, 53759, 53004, 51436, 50251, 49392, 48374, 47844, 48748, 50750, 52913, 55160, 57681, 59764]
55247E9764R85N59R97Q35l86j253j010p20r66p62K68P88n1j143j301q31k40Q24
55229E6357K381L445L515L234K854J626n64k504l355l534l380k471q65M99J148
55214E8386J394J122p9j396j329q8N20o6m56J71R29J149J324J558J110J74L9P53
55196F5215P69l62j036k00J086J560J342P71l31j428j284j46N7j348k621k308
55180E9736j166l15M16J204J174l3j297j742j908k147j622J4J476J557P22J07
55164E6176J48P99J742K031J079J15P82K234K094M78L9J392J728n01k657j798
55148F5881J110L148L442K834J446q60k790k775j166L67R57P44p0j062j370o04
55132F9232P03K060L259L462J925k2m3J477J486q99k507r95J301J023j002j346
$$ y = [59764, 60749, 61308, 62305, 63140, 62754, 61501, 60491, 59771, 58805, 58043, 58311, 59099, 59048, 57905, 56604, 55773, 55533, 56357, 58738, 62183, 65698, 68932, 71786, 73412, 72848, 70344, 66989, 63455, 60075, 57604, 56739, 57238, 58386, 59780, 60902, 60823, 59427, 58098, 58010, 58530, 58464, 58008, 58179, 59108, 60257, 61581, 63139, 64249, 64423, 64462, 65215, 65984, 65622, 64586, 64386, 65472, 67032, 68374, 69145, 68814, 67386, 66102, 65956, 66013, 64665, 62044, 59736, 58570, 58255, 58671, 59875, 61049, 61016, 59719, 57977, 56069, 53922, 52300, 52314, 53790, 55347, 56069, 56176, 56324, 57123, 58865, 60896, 61975, 62090, 62872, 65106, 67200, 67678, 67717, 69109, 70837, 70336, 67679, 65881, 66991, 70139, 73581, 76415, 77861, 77001, 74211, 71436, 70270, 70637, 71594, 72338, 72268, 71206, 69836, 69232, 69935, 71995, 75254, 78716, 80641, 80619, 80576, 82053, 83539, 82640, 80133, 79138, 80439, 81462, 80460, 79114]
55116G9114P35K692K612J102m89j496j737j482j428j636j203P7Q02J11o09K26
55100G7391J772K014R03J75N05O45n50k580l979l833k595j618j607j585l45J366
55084F6079J648N01r1N47O38q34k178j705l49J72k1l6k18j024j267L56K883M086
55066F9187L254J477l2n91L6J025P79q66j794l06K364L683K958J531P20R62K078
55049H6465L184L068J712N29L45L18k83p88o16n67j290j915j483l84P04J866K862
55032I3727K705J487Q55J470J925J413J270K269K824J860J139K244L530K733P73
55017A22224M5M94M49kM20J202O99q04j495j047o35m76J83R04M55q49j411q14
54999A19542j34q3n90j659k862k667l37K268K763J365N6n16j038j359p82R1J18
$$ y = [79114, 79849, 82541, 85153, 86255, 85766, 84270, 82533, 81051, 79623, 77987, 76784, 76861, 77663, 77774, 77165, 77391, 79163, 81177, 82080, 82255, 82760, 83405, 82855, 80275, 76296, 72463, 69868, 68250, 66643, 65058, 64713, 66079, 67727, 68228, 68137, 68684, 69322, 68488, 66310, 64605, 64256, 64428, 64407, 64371, 64153, 63129, 61862, 62218, 65101, 69187, 72441, 73918, 73886, 73295, 73331, 74356, 75135, 74269, 72475, 72169, 74533, 78216, 81174, 82705, 83425, 84387, 86465, 89649, 92717, 94429, 94958, 95303, 95621, 95338, 94550, 93934, 93367, 92077, 90162, 88679, 88295, 88999, 90865, 93727, 96432, 97919, 98774, 100244, 102169, 103582, 104852, 107121, 109945, 111805, 112944, 115188, 118718, 121451, 122224, 122269, 122763, 123212, 123210, 123630, 124832, 125531, 124727, 123232, 122185, 121550, 121074, 121257, 122161, 122616, 121767, 120356, 119542, 119408, 119325, 118735, 117076, 114214, 111547, 111210, 113478, 116241, 117606, 117662, 117146, 116108, 114749, 113967, 114058, 114176]
54982A14176k71N3N85J04q09p01q4o38j962j972m55O22M78M89J360J863J106m3
54964A13901m79o7R86K332K915J890J99m36qPo89q48j4O56L58k55l15K72J133
54945A21538J607Q50r76k103j246L99P97k7o26p34j074j237k36J205J445P39Q05
54928A21126J699J662K51r27r00n61o91q22m91K02J446L336M719M287K753J957
54912A39046J997J470L02j09N08J068J574L108N159N701M545L922M989O149N814
54897A85243M557L664L610M697P164R861J0888J0290J0143J1349J2535J2846J3458
54884C00305J5275J7176J7795J7136J5448J2247P515K260l002q680j4302j8003
54872C61170j8702j7264j4885j2048r690r286j0818j2380j2639j2070j1211r736
$$ y = [114176, 113905, 113958, 114543, 114647, 113838, 113137, 113053, 112415, 110453, 108481, 108026, 108648, 109126, 109615, 110975, 112838, 113944, 113901, 113422, 113355, 114341, 116673, 119588, 121478, 121677, 121241, 121233, 121240, 120551, 119703, 119689, 120345, 120703, 120448, 120133, 120405, 121538, 123145, 123995, 123019, 120916, 119670, 120069, 120866, 120839, 120213, 119479, 118405, 117168, 116932, 118137, 119582, 120321, 121126, 122825, 124487, 124738, 123811, 122911, 122350, 121659, 120837, 120346, 120548, 121994, 125330, 130049, 134336, 137089, 139046, 141043, 142513, 142815, 142706, 143214, 144282, 145856, 148964, 154123, 159824, 164369, 168291, 173280, 179429, 185243, 189800, 193464, 197074, 201771, 208935, 218796, 229684, 239974, 250117, 261466, 274001, 286847, 300305, 315580, 332756, 350551, 367687, 383135, 395382, 402897, 405157, 402155, 393475, 379173, 361170, 342468, 325204, 310319, 298271, 288581, 279295, 268477, 256097, 243458, 231388, 220177, 210441]
54860B10441p923o881o378m598j148J793K498J958J885K402L172M825P637J0230
54846B19913J1320J1560J2370J4038J5989J7719J8555J7752J5659J3373J0685
54835C78933O173M5n209q140j0138j2577j4412j4381j3592j3787j4492j4060j2441
54822B51922j0980j0269r983j0053j0459j0458r434p876o532n337m072l039k243
54809A51187j063L45P14l83j749k628l682m772l899l42L117L471J618O86J413
54794A44033J815P76o44j374j488j135k89L39j35j140j288p82j421l660n315m203
54778A24089j061J178O83j472k820k297j026l56J6J099K384K129O8j759j617k31
54762A19007M91j16j154j477m85J602L589M194L528K946L120L443L638M374N616
$$ y = [210441, 202518, 195637, 189259, 184661, 183513, 185306, 187804, 189762, 191647, 194049, 197221, 202046, 209683, 219913, 231233, 242793, 255163, 269201, 285190, 302909, 321464, 339216, 354875, 368248, 378933, 385106, 385151, 379942, 371802, 361664, 349087, 334675, 320294, 306702, 292915, 278423, 264363, 251922, 240942, 230673, 220690, 210637, 200178, 189720, 180286, 172410, 165878, 160541, 156469, 153430, 151187, 150124, 150469, 151183, 150800, 149051, 146423, 142741, 137969, 134070, 133728, 136845, 140316, 141934, 142620, 144033, 145848, 146624, 145980, 144606, 143118, 141983, 141694, 142033, 141898, 140758, 139470, 138688, 137267, 133607, 128292, 124089, 123028, 124206, 124889, 123417, 120597, 118300, 117274, 116918, 116934, 118033, 120417, 122546, 122614, 120855, 119238, 119007, 119498, 119382, 118228, 116751, 116266, 117868, 121457, 125651, 129179, 132125, 135245, 138688, 142326, 146700, 152316]
54747A52316N998M968L949M255N206N701O221P650R229R476Q486P743Q162R612
54733B48972J1788J4263J6257J7448J8487J9747K0288J9134J6697J3774J0049
54722D26904M954p45n625r320j2268j4350j5101j4779j3984j2723j0924r292q373
54709C04374p415n524l372k288k072j225P57K686L450L283L123L552M540N714
54695C09583O832Q304J0938J4836J9004K2299K4176K4522K3832K3769K5971K9374
54683E43440L0312K6487J9665J3201Q062K837l365r781j5303j9513k2624k5393
54671E48025k8506l1228l1570k8756k4602k1367j9350j7733j6468j5722j4627
54660B98096j2441j0094q871q382p494o374n755n082l547k183k574l957m059k612
$$ y = [152316, 158314, 163282, 167231, 171486, 176692, 182393, 188614, 196264, 205493, 214969, 223455, 231198, 239360, 248972, 260760, 275023, 291280, 308728, 327215, 346962, 367250, 386384, 403081, 416855, 426904, 431858, 431113, 425488, 416168, 403900, 389550, 374449, 359670, 345686, 332963, 322039, 312747, 304374, 296959, 291435, 288063, 285775, 283703, 282478, 283235, 285921, 289371, 292654, 295777, 299329, 303869, 309583, 316415, 324719, 335657, 350493, 369497, 391796, 415972, 440494, 464326, 488095, 514066, 543440, 573752, 600239, 619904, 633105, 641167, 644004, 640639, 630858, 615555, 596042, 573418, 548025, 519519, 488291, 456721, 427965, 403363, 381996, 362646, 344913, 328445, 312723, 298096, 285655, 275561, 266690, 258308, 250814, 244440, 238685, 233603, 230056, 227873, 225299, 221342, 217283, 214671]
54646B14671j566j720j576j26J434J564K53j559k949k915r86J488K189O43j186
54631B07659j665j246r08m72L89R26M49k38J34J429K310K048J184O40R87K373
54615B15999M371N849N671L908K064J769L189M911N492M877M095L814L862M040
54601B73911M589N551O406O754O833P050P477Q121Q924R343Q735P508O936P449
54587C75587Q068Q121Q314R394J0909J2189J3567J5434J7240J8444J9636K1529
54575E38432K3721K5517K7003K8075K7459K4094J8686J2468N340l174j1969j9199
54563F96453k4496k8570l1048l0771k8136k5429k4397k4738k4980k3790k0609
54552D09489j6229j2611j1056j0733r954q407o955n872m737l701l369l635l899
$$ y = [214671, 213105, 211385, 209809, 209683, 211117, 212681, 212934, 211375, 208426, 205511, 204525, 206013, 208202, 208845, 207659, 205994, 204748, 203840, 203368, 203757, 204683, 205132, 204894, 205028, 206457, 208767, 210815, 211999, 212639, 213626, 215999, 220370, 226219, 231890, 235798, 237862, 239631, 242820, 247731, 253223, 258100, 262195, 266009, 269871, 273911, 278500, 284051, 290457, 297211, 304044, 311094, 318571, 326692, 335616, 344959, 353694, 361202, 368138, 375587, 383655, 391776, 400090, 409484, 420393, 432582, 446149, 461583, 478823, 497267, 516903, 538432, 562153, 587670, 614673, 642748, 670207, 694301, 712987, 725455, 730795, 727621, 715652, 696453, 671957, 643387, 612339, 581568, 553432, 528003, 503606, 478868, 453888, 430098, 409489, 393260, 380649, 369593, 358860, 348906, 340499, 333544, 327672, 322935, 319234, 315865, 312230, 308331]
54539C08331m183m820n426n460n290n392n169m011k766k575k941k826k922m585
54525B49965p033q047p321o701o926o601m791k488q99k73r11l181n910o753n141
54510A76989l125k472k581k042n75J387L396M432L303N90j398j577j372k001k330
54495A70624r55J091J667O88J7O93J832K248J827J165Q18J160K287L773M773M583
54479A98291L205J649J415L126N710P471P878P689P535P454P748R091J1278J2866
54465B92406J2803J1748J1104J1124J0656Q746N937L625K033n25n476j1257j4321
54452C38603j3428j1412j1468j3046j3216j1102q725p812p909p953p777p594p252
54439B09909o601n646m331k930k374l074l854l404k249j812k081j989j649k074
$$ y = [308331, 304148, 299328, 293902, 288442, 283152, 277760, 272591, 268580, 265814, 263239, 260298, 257472, 254550, 249965, 242932, 234885, 227564, 220863, 213937, 207336, 202545, 200057, 199158, 198885, 197974, 194793, 188883, 182130, 176989, 173864, 171392, 168811, 166769, 166194, 167581, 170977, 175409, 178712, 179302, 177904, 176327, 174955, 172954, 170624, 169669, 170760, 172427, 173115, 173132, 173825, 175657, 177905, 179732, 180897, 181715, 182875, 185162, 188935, 193708, 198291, 201496, 203145, 204560, 207686, 213396, 220867, 228745, 236434, 243969, 251423, 259171, 268262, 279540, 292406, 305209, 316957, 328061, 339185, 349841, 358587, 364524, 368149, 370182, 369657, 364181, 352924, 338603, 325175, 313763, 302295, 289249, 276033, 264931, 256206, 248394, 240485, 232532, 224755, 217161, 209909, 203308, 197662, 193331, 190401, 188027, 184953, 181099, 177695, 175446, 173634, 171553, 169564, 167915, 165841]
54425A65841k944k813j524k21J025L138N337N206K318n80j144p0Q33J201J451
54410A77054J444J214J620K864L656L010J702R42Q57J171K121L539M178L114R26
54395B09412j234k859l706l433k367j645j898k632l212l438l030j913j078j586
54381A75381k642k591j744j853k666j910N27J580l57k806l126k259k143k051m36
54366A50904J574J845J020J440L091L716K549J179O49K50n62j072o45M15J655
54351A68008K891L825M229M390M515M149L044J978J734K033K459L354M682N295
54337B16586M778M686O128P439O450M053K975L644L982L114K562L267L810K541
54323B76015j94k776m009l751k894k956m571o304o182m367k971l242m367n215
$$ y = [165841, 162897, 160084, 158560, 158339, 159364, 162502, 167839, 173045, 175363, 174783, 173639, 173569, 174402, 175603, 177054, 178498, 179712, 181332, 184196, 187852, 190862, 192564, 193506, 194363, 195534, 197655, 201194, 205372, 208486, 209412, 208178, 205319, 201613, 198180, 195813, 194168, 192270, 189638, 186426, 182988, 179958, 178045, 176967, 175381, 172739, 170148, 168404, 166551, 163885, 161975, 162502, 164082, 163725, 160919, 157793, 155534, 153391, 151340, 150904, 152478, 154323, 155343, 156783, 159874, 163590, 166139, 167318, 167967, 168217, 167655, 166583, 165938, 166353, 168008, 170899, 174724, 178953, 183343, 187858, 192007, 195051, 197029, 198763, 200796, 203255, 206609, 211291, 216586, 221364, 226050, 232178, 239617, 246067, 250120, 253095, 256739, 260721, 263835, 266397, 269664, 273474, 276015, 275821, 273045, 269036, 265285, 262391, 259435, 254864, 248560, 242378, 238011, 235040, 231798, 227431, 222216]
54309B22216n710o042n821m634k604k46J550J575m11k681l177k091j377j701j669
54294A87177m59O20K14r11r47N59K493L714L878L181K143J472J631K551L908N368
54278B16592O427O519N579M091K403M53j441k166q08J899L640K515j057m688o412
54263B33546o366n772m973l514j865j531k964m627m974m257l524k907k222k192
54249A81858l554n361n782m537l217l063l625l799l197k152j131n61o76j267j777
54234A38159j756j194o00p85j960l014k458m49J121J052K78J20K77k22j067j162
54218A26340m91pK4K16P52J171J346J637K080K336K288K005J416P48P24J481J893
54201A45959J022m55j282j344j126l81J069J986J130m69n84R70K173J894J064
$$ y = [222216, 216506, 210464, 204643, 200009, 197405, 197159, 198709, 200284, 199873, 197192, 194015, 191924, 190547, 188846, 187177, 186718, 187338, 187552, 186641, 185694, 186253, 188746, 192460, 196338, 199519, 201662, 203134, 204765, 207316, 211224, 216592, 223019, 229538, 235117, 239208, 241611, 242064, 240623, 238457, 237649, 239548, 243188, 245703, 244646, 239958, 233546, 227180, 221408, 216435, 212921, 211056, 209525, 206561, 201934, 196960, 192703, 189179, 186272, 184050, 181858, 178304, 172943, 167161, 162624, 159407, 156344, 152719, 148920, 145723, 143571, 142440, 141879, 141203, 139936, 138159, 136403, 135209, 134609, 133824, 131864, 128850, 126392, 125943, 127064, 128116, 128394, 128514, 128791, 128569, 127502, 126340, 125849, 125842, 125866, 126082, 126834, 128005, 129351, 130988, 133068, 135404, 137692, 139697, 141113, 141861, 142585, 144066, 145959, 146981, 146526, 145244, 143900, 142774, 142393, 143462, 145448, 146578, 146109, 145525, 146495, 148668, 150562, 151626]
54186A51626N18k27j279j452j15J379J270m58k387l336l060j953p10J39P11J286
54170A41952J437M88j121j891j072M06J144P59o9l88L17J642K431J959Q19J50
54154A48963L15J038K128L140K973J241n42p65k65j099k977l258j001J252Q41
54139A51984j598l353k968j039J226K789K798J138j096k341j808J38K307L282
54125A51459K434O03p74j320j779k504k902k551j784q98J02P30J52j449k693k642
54109A34184j739p27K44J054J258R49R13J387J675J416J223J507J798J788J875
54094A48805K046J548L13n64n82o82j321j244M29K170J886j38j821k174j867j419
54078A45385p29k05n80j422j464p17p39k164l363k578l94J029P12k70n51j34M8
$$ y = [151626, 152144, 151917, 150638, 149186, 149071, 150450, 151720, 151262, 148875, 145539, 142479, 140526, 139816, 139955, 140666, 141952, 143389, 143877, 142756, 140865, 139793, 140199, 141343, 142102, 142033, 141645, 141962, 143604, 146035, 147994, 148813, 148963, 149278, 150316, 152444, 155584, 158557, 159798, 159256, 158491, 158226, 157127, 154150, 150892, 149891, 151143, 151984, 150386, 147033, 144065, 143026, 144252, 147041, 149839, 150977, 149881, 147540, 145732, 145870, 148177, 151459, 153893, 154496, 153722, 152402, 150623, 148119, 145217, 142666, 140882, 139984, 140086, 140816, 140968, 139519, 136826, 134184, 132445, 131718, 131962, 133016, 134274, 135223, 136136, 137523, 139198, 140614, 141837, 143344, 145142, 146930, 148805, 150851, 152399, 152712, 152148, 151566, 150884, 149563, 148319, 148748, 150918, 152804, 152666, 150845, 148671, 146804, 145385, 144656, 144451, 143871, 142449, 140985, 140268, 139529, 137365, 134002, 131424, 131030, 132059, 132771, 132501, 131950, 131816, 131864]
54061A31864l54q06q48p79j138j939k738l082k515o72J960L718L234J189l46m11
54045A26337n6m99j450j777j043K49J302J431M62p62r50o4L50q21k608l214k336
54028A14551j156l67N37J858K724K078K09j371j492m02P97J508K028K575K601
54013A26678J657N09M28J430K194J904J221R54P49m8r27o35J006K554K469P96
53997A42939q44q64P32K452K960K444K040K267K575K346J697J106Q77J152J940
53982A65819K915L580L716L407K738J945J702K553M146N659O758P479P424O327
53968B26168N163N375O734P336O205M631M251N014N758N852N431M819M515N022
53954C02274O069O745O869P221P813P249M780J830J97l96j401k874l500k911k242
$$ y = [131864, 131510, 130704, 129856, 129077, 127939, 126000, 123262, 120180, 117665, 116993, 118953, 122671, 125905, 127094, 126748, 126337, 126281, 125782, 124332, 122555, 121512, 121761, 123063, 124494, 124956, 124194, 123244, 123180, 123530, 122709, 120101, 116887, 114551, 113395, 113028, 113565, 115423, 118147, 120225, 120434, 119063, 117571, 117169, 117966, 119474, 121502, 124077, 126678, 128335, 128844, 129272, 130702, 132896, 134800, 136021, 136975, 137724, 137676, 136749, 136114, 137120, 139674, 142143, 142939, 142095, 141231, 141963, 144415, 147375, 149819, 151859, 154126, 156701, 159047, 160744, 161850, 162727, 163879, 165819, 168734, 172314, 176030, 179437, 182175, 184120, 185822, 188375, 192521, 198180, 204938, 212417, 219841, 226168, 231331, 236706, 243440, 250776, 256981, 261612, 265863, 270877, 276635, 282487, 287918, 292737, 297252, 302274, 308343, 315088, 321957, 329178, 336991, 344240, 349020, 350850, 351047, 350651, 349250, 346376, 342876, 339965, 337723]
53939C37723k256k402k173k161k992m105m390l661k808k593k749k435j384l45
53925C01269k82j288k543l264l286k862k321j969j858j632j082p20j083j644j258
53910B74177J47J388J652J289P33p6p86n23N58R82K47Q0J960M483M966L096J132
53893B95505P01J203J547J771K208K405J860J097J151K209L399L822L442K954
53879C25274K990L447L646L246K830L330M770N920N426L465J880K205L611L618
53865C75658J230j513k095q27j75j121k042j391K62J505J921J832J519J639L116
53850C79518N582P083O549N475N854P543R066R993J0741J0687Q676N317K919K629
53836D77632L074K404N61j064j484j123j238k581m429n309m843m277m664n385
$$ y = [337723, 335467, 333065, 330892, 328731, 325739, 321634, 317244, 313583, 310775, 308182, 305433, 302998, 301614, 301269, 300987, 299699, 297156, 293892, 290606, 287744, 285423, 283454, 281596, 279964, 278882, 278162, 277079, 275435, 274177, 274324, 275712, 277364, 278653, 279386, 279310, 278524, 278001, 278559, 279541, 279788, 279868, 281828, 286311, 291277, 294373, 295505, 296206, 297409, 298956, 300727, 302935, 305340, 307200, 308297, 309448, 311657, 315056, 318878, 322320, 325274, 328264, 331711, 335357, 338603, 341433, 344763, 349533, 355453, 360879, 364344, 366224, 368429, 372040, 375658, 376888, 375375, 373280, 372453, 372278, 371157, 369115, 367724, 367986, 369491, 371412, 373244, 374763, 376402, 379518, 385100, 392183, 398732, 404207, 410061, 417604, 426670, 436663, 447404, 458091, 466767, 472084, 475003, 477632, 480706, 483110, 483671, 482607, 481123, 480000, 478762, 476181, 471752, 466443, 461600, 457323, 452659, 447274]
53822D47274n404n184o003p818r210r351q718p933p191o928p679q968r460q629
53808C38798p363o578o191n871n778n962n869n135m397m579n623o433o049m630
53794B58340l226k690k800k723k350k554l731m747m220k446j137j353k586l792
53780B17985m405m225l283k172j689j791j455j9J830K745K156P26l91n54o5L21
53764B05714K64K4k09o52j325j604r96K4N30K84k10m42j45Q44K338L612M063L749
53746B15863K911J584L40N62K779N259N711M190K935L282M296M725M867N642O932
53731B71878P830P931P532O922O124N217M429L921L706L649L484K961K089J120
53717C38793M01K91Q99J774K198K039J763J416L72j374k602k450j826k048k821
$$ y = [447274, 441870, 436686, 430683, 422865, 413655, 404304, 395586, 387653, 380462, 373534, 365855, 356887, 347427, 338798, 331435, 324857, 318666, 312795, 307017, 301055, 295186, 290051, 285654, 281075, 275452, 269019, 262970, 258340, 255114, 252424, 249624, 246901, 244551, 241997, 238266, 233519, 229299, 226853, 225716, 224363, 221777, 217985, 213580, 209355, 206072, 203900, 202211, 200420, 198965, 198946, 200776, 203521, 205677, 206403, 206012, 205458, 205393, 205714, 205978, 206002, 205793, 205141, 203816, 202212, 201216, 201240, 201770, 202054, 201844, 201402, 201257, 202101, 204439, 208051, 212114, 215863, 218774, 220358, 220698, 221260, 224039, 229298, 235009, 239199, 242134, 245416, 249712, 254437, 259304, 264946, 271878, 279708, 287639, 295171, 302093, 308217, 313434, 317863, 321784, 325490, 329139, 332623, 335584, 337673, 338793, 339194, 339485, 340384, 342158, 344356, 346395, 348158, 349574, 349946, 348572, 345970, 343520, 341694, 339646, 336825]
53702C36825k858k016j249p73m0N49k69k416m061m087l494l564l999l928l517
53687C01103l418l408k870k103j987k603l071k757j879r70l44q9j48l23m42n05
53671B74186n16l49Q7O46J059J154R09M01k86j134j975k255j484j70L87j88n65
53654B69907N47K439L274K503J238L67l09r12r20j67N91P77Q02J257J967K366
53638B85727K243J825J585K106L468M752M873M000L273L146L000K528K266K397
53624C27189K224J396O98R59K066L517M970N825N363M042L584M849O474O586M989
53609C84731K767O81q64j132J81J854K151R09m93j190j735k781l844l888k636
53594C74711q93K40L97J35M1j49j002k035j928n41K98r54l253m039k354K08J672
$$ y = [336825, 333967, 331951, 330702, 329929, 329889, 330438, 330169, 327753, 323692, 319605, 316111, 312547, 308548, 304620, 301103, 297685, 294277, 291407, 289304, 287317, 284714, 281643, 278886, 277007, 276037, 275693, 275604, 275456, 275133, 274691, 274186, 273670, 273321, 273408, 274054, 275113, 276267, 277176, 277577, 277291, 276157, 274182, 271927, 270443, 270273, 270660, 270472, 269907, 270454, 272893, 276167, 278670, 279908, 280275, 279966, 279054, 278134, 277967, 278558, 279335, 280137, 281394, 283361, 285727, 287970, 289795, 291380, 293486, 296954, 301706, 306579, 310579, 313852, 316998, 319998, 322526, 324792, 327189, 329413, 330809, 331507, 332466, 334532, 338049, 343019, 348844, 354207, 358249, 361833, 366682, 373156, 379742, 384731, 387498, 388179, 387315, 386183, 386364, 388218, 390369, 391278, 390785, 389595, 387860, 385079, 381235, 377347, 374711, 373818, 374058, 374455, 374590, 374631, 374482, 373480, 371445, 369517, 368976, 369274, 368320, 365067, 361028, 358674, 358882, 360554]
53577C60554J691J251J196J546J799J536Q30K49L47J185K421L523L896L161J716
53562C86901O40O66J537K604L529M032L629K439J682K408L935M630M174M009N238
53547D32053P044P807P034N595M471M081M540N778P243Q015P618O469N373M833
53533E17954N024O065P676Q752Q060N766L669L395M673N907O112N623N119M841
53519E98636M818N093N378N055L887K374J235Q04J014J513J749J414R70J269K487
53504F37696L821M388M047L254K564K251K051J368K69r6J074K717L000J995J665
53489F72064K908M166L918L001L150M352N291N691O390P421P750P082O357O087
53475G45628N587M480L775M527O261P637Q144Q223Q232Q233Q675J0154J2343J3955
$$ y = [360554, 362245, 363496, 364692, 366238, 368037, 369573, 370403, 370652, 370999, 372184, 374605, 378128, 382024, 385185, 386901, 387541, 388207, 389744, 392348, 395877, 399909, 403538, 405977, 407659, 410067, 414002, 418632, 422806, 426815, 432053, 439097, 446904, 453938, 459533, 464004, 468085, 472625, 478403, 485646, 493661, 501279, 507748, 513121, 517954, 522978, 529043, 536719, 545471, 553531, 559297, 562966, 566361, 571034, 576941, 583053, 588676, 593795, 598636, 603454, 608547, 613925, 618980, 622867, 625241, 626476, 627280, 628294, 629807, 631556, 632970, 633940, 635209, 637696, 641517, 645905, 649952, 653206, 655770, 658021, 660072, 661440, 661709, 661613, 662687, 665404, 668404, 670399, 672064, 674972, 679138, 683056, 686057, 689207, 693559, 698850, 704541, 710931, 718352, 726102, 733184, 739541, 745628, 751215, 755695, 759470, 763997, 770258, 777895, 786039, 794262, 802494, 810727, 819402, 829556, 841899, 855854]
53461H55854J4265J3967J4054J4453J4495J4251J4488J5531J7120J9191K1618
53450A029287K3228K2655K0771K0581K3514K7223K8645K8141K8595L1073L3700
53439A317413L4814L5063L5762L7134L8813M0560M1719M1477M0449M0435M1809
53428A745448M2701M1767M0159L9417L9041L7834L6354L5974L6410L6191L5186
53417B166482L4723L5302L5979L6044L5817L5551L4996L4201L3562L2838L1298
53406B546793K9130K7479K6775K6086K4528K2347K0189J8068J5548J2395Q786
53395B778124N353K927J474m91m447r684j3853j5866j7001j8641k0284k0821k0654
53382B646136k1174k2661k4001k4544k5119k6906k9901l2823l4292l3943l2515
$$ y = [855854, 870119, 884086, 898140, 912593, 927088, 941339, 955827, 971358, 988478, 1007669, 1029287, 1052515, 1075170, 1095941, 1116522, 1140036, 1167259, 1195904, 1224045, 1252640, 1283713, 1317413, 1352227, 1387290, 1423052, 1460186, 1498999, 1539559, 1581278, 1622755, 1663204, 1703639, 1745448, 1788149, 1829916, 1870075, 1909492, 1948533, 1986367, 2022721, 2058695, 2095105, 2131296, 2166482, 2201205, 2236507, 2272486, 2308530, 2344347, 2379898, 2414894, 2449095, 2482657, 2515495, 2546793, 2575923, 2603402, 2630177, 2656263, 2680791, 2703138, 2723327, 2741395, 2756943, 2769338, 2778124, 2783477, 2786404, 2787878, 2787387, 2782940, 2773256, 2759403, 2743537, 2726536, 2707895, 2687611, 2666790, 2646136, 2624962, 2602301, 2578300, 2553756, 2528637, 2501731, 2471830, 2439007, 2404715, 2370772, 2338257]
53371B338257l1049l0004k9220k8555k8104k7627k6281k3491j9846j6595j4316
53360B063169j2426j0130p455n148l707k724j245J199L970N838O298O255P258
53347B051152J0074J4039J7856K0748K2872K4850K7142K9642L1759L3021L3823
53336B316978L5364L8417M2273M5439M7364M8883N0797N2858N4548N6201N8605
53325B847727O1898O5557O9117P2172P4044P4481P4400P5010P6193P6769P6389
53314C643757P6002P6184P6159P5115P3437P1863P0128O7368O3459N9098N4793
53303D407363N0438M5793M0767L5248K9044K2111J4722P372M91n891j2096j8256
53291D617106k3984k8935l3318l7352m0667m3134m5876n0183n5497n9846o2456
$$ y = [2338257, 2307208, 2277204, 2247984, 2219429, 2191325, 2163698, 2137417, 2113926, 2094080, 2077485, 2063169, 2050743, 2040613, 2033158, 2028010, 2024303, 2021579, 2020334, 2021533, 2025503, 2031341, 2037639, 2043894, 2051152, 2061226, 2075265, 2093121, 2113869, 2136741, 2161591, 2188733, 2218375, 2250134, 2283155, 2316978, 2352342, 2390759, 2433032, 2478471, 2525835, 2574718, 2625515, 2678373, 2732921, 2789122, 2847727, 2909625, 2975182, 3044299, 3116471, 3190515, 3264996, 3339396, 3414406, 3490599, 3567368, 3643757, 3719759, 3795943, 3872102, 3947217, 4020654, 4092517, 4162645, 4230013, 4293472, 4352570, 4407363, 4457801, 4503594, 4544361, 4579609, 4608653, 4630764, 4645486, 4652858, 4653349, 4647458, 4635362, 4617106, 4593122, 4564187, 4530869, 4493517, 4452850, 4409716, 4363840, 4313657, 4258160, 4198314, 4135858]
53280D135858o4494o6770o8273o7851o5970o3735o1363n8970n7751n8657o0400
53269C441624o0543n8567n6445n5892n6181n5248n2194m8055m4422m1789l9413
53258B872875l6626l3874l1953l0644k8927k6612k4776k4262k4663k5170k5509
53247B559859k5513k4796k3509k2527k2141k1433j9728j7698j6112j4407j1679
53236B340316q343n704m319l865l925l898k701K02L843O946R583J2578J5753J8035
53222B374501J9104J9824K1122K3344K6402K9622L1747L2103L1471L1014L0818
53211B671072L0328K9590K8901K7824K5785K3216K0843J8288J4691J0378O638
53200B907554M003K032L83j209l620p456j1724j4824j6757j8900k1745k4416k6384
$$ y = [4135858, 4071364, 4004594, 3936321, 3868470, 3802500, 3738765, 3677402, 3618432, 3560681, 3502024, 3441624, 3381081, 3322514, 3266069, 3210177, 3153996, 3098748, 3046554, 2998499, 2954077, 2912288, 2872875, 2836249, 2802375, 2770422, 2739778, 2710851, 2684239, 2659463, 2635201, 2610538, 2585368, 2559859, 2534346, 2509550, 2486041, 2463514, 2441373, 2419940, 2400212, 2382514, 2366402, 2351995, 2340316, 2331973, 2326269, 2321950, 2318085, 2314160, 2310262, 2307561, 2307763, 2311606, 2318552, 2328135, 2340713, 2356466, 2374501, 2393605, 2413429, 2434551, 2457895, 2484297, 2513919, 2545666, 2577769, 2609240, 2640254, 2671072, 2701400, 2730990, 2759891, 2787715, 2813500, 2836716, 2857559, 2875847, 2890538, 2900916, 2907554, 2911557, 2913589, 2913972, 2912763, 2909143, 2901687, 2889963, 2875139, 2858382, 2839482, 2817737, 2793321, 2766937]
53187B766937k8093k9734l0848l1326l1613l1879l2196l3252l5438l7456l7571
53176B407531l6082l4876l4599l4196l3212l2414l1834l0456k8486k7698k8665
53165B055013k9626k9046k7432k5686k3663k1599k0837k1655k2101k0671j8601
53154A794096j7803j8035j8068j8109j8877j9443j8550j7411j8497k1600k3654
53143A584049k3004k1553k1786k3414k4391k4000k3394k3626k4376k4709k4215
53132A325581k3197k2170k1564k1624k2311k3229k3863k3962k3703k3497k3782
53121A072679k4919k6686k7798k6816k4003k1574k1200k1978k1885k0637j9642
53110H15541j9426j8874j7240j5347j4161j3511j2888j2433j2309j1997j0989
$$ y = [2766937, 2738844, 2709110, 2678262, 2646936, 2615323, 2583444, 2551248, 2517996, 2482558, 2445102, 2407531, 2371449, 2336573, 2301974, 2267778, 2234566, 2202152, 2170318, 2139862, 2111376, 2083678, 2055013, 2025387, 1996341, 1968909, 1943223, 1919560, 1897961, 1877124, 1855469, 1833368, 1812697, 1794096, 1776293, 1758258, 1740190, 1722081, 1703204, 1683761, 1665211, 1647800, 1629303, 1607703, 1584049, 1561045, 1539492, 1517706, 1494292, 1469901, 1445901, 1422507, 1398881, 1374505, 1349796, 1325581, 1302384, 1280214, 1258650, 1237026, 1214715, 1191486, 1167623, 1143661, 1119958, 1096461, 1072679, 1047760, 1021074, 993276, 966460, 942457, 920883, 899683, 877705, 855820, 835183, 815541, 796115, 777241, 760001, 744654, 730493, 716982, 704094, 691661, 679352, 667355, 656366]
53099F56366r569q439q130r002j0976j2930j3319j1881r850q269p098o214n982
53086E34707o258o102n299m952n719o607o442n525m789m284l636l144l315l820
53072D64815l982l743l364k735j841j222j151j111q71j198k485l574l143j542
53058D32853p0R16J776K144J318q8m74O16J934K359K202K324K802K916K085N16
53042D56129r33j643j956k757m178n455o167o748p257o853n380m422n507p883
53028C88990r376r021p640o302n518n658o674p377o331l790j662j254j927k300
53014C14160j972j587j775k475k974k504j111R5j44j914l978m947m470l360k675
52999B78369k616k386j422l92l04q99r71k82J44o0J50J354K520K635K127J532
$$ y = [656366, 646797, 638358, 630228, 621226, 610250, 597320, 584001, 572120, 562270, 554001, 546903, 540689, 534707, 528449, 522347, 517048, 512096, 506377, 499770, 493328, 487803, 483014, 478730, 475094, 471950, 468635, 464815, 460833, 457090, 453726, 450991, 449150, 447928, 446777, 445666, 444795, 443597, 441112, 437538, 434395, 432853, 432783, 433699, 435475, 437619, 438937, 438849, 438375, 438991, 440925, 443284, 445486, 447810, 450612, 453528, 455613, 456129, 455196, 453553, 451597, 448840, 444662, 439207, 433040, 426292, 419035, 412182, 406802, 402380, 396873, 388990, 379614, 370593, 362953, 356651, 351133, 345475, 338801, 331424, 325093, 321303, 319641, 318387, 316460, 314160, 312188, 310601, 308826, 306351, 303377, 300873, 299762, 299857, 299713, 297799, 293821, 288874, 284404, 281044, 278369, 275753, 273367, 271945, 271553, 271249, 270350, 269379, 269097, 269241, 269181, 269331, 270685, 273205, 275840, 277967, 279499]
52983B79499J46k509m970n350l787j817j82J050J020j029l693m453k914j108m19
52968B49484j46M72P71R0r09j330j366j638k126k432k434k160j708j585k221k939
52952B27823k453p29O88P91M48R77K247L082K882K035J189Q05J090J737J949J183
52936B45744l62k010k990k491j62K970M793M066J785K8k35L35Q31J205J776K285
52920B57568K077J245R18J957L585M163L404K787L301L792K733Q98P59L265O602
52905B99054Q520Q644P885O702N040L382K693L152L769L554K671K009J862J610
52891C60547Q00q7m81p74j584k309j707o0O48o00k334k710j970j540j660j489
52875C42690r60q92j494k139k554k855k602j349K4L2j079j323L20K588L816L766
$$ y = [279499, 279645, 277136, 272166, 266816, 263029, 261212, 261030, 262080, 263100, 262071, 258378, 253925, 251011, 249903, 249484, 249338, 249810, 250581, 250671, 249762, 248432, 247066, 245428, 243302, 240870, 238436, 236276, 234568, 232983, 230762, 227823, 225370, 224641, 225329, 226120, 226568, 227545, 229792, 232874, 235756, 237791, 238980, 239785, 240875, 242612, 244561, 245744, 245382, 243372, 240382, 237891, 237729, 240699, 245492, 249558, 251343, 251371, 251136, 251471, 252302, 253507, 255283, 257568, 259645, 260890, 261808, 263765, 267350, 271513, 274917, 277704, 281005, 284797, 287530, 288428, 289187, 292452, 299054, 307574, 316218, 324103, 330805, 335845, 339227, 341920, 345072, 348841, 352395, 355066, 357075, 358937, 360547, 361347, 361260, 360779, 360005, 358421, 356112, 354405, 354345, 354993, 354393, 352059, 349349, 347379, 345839, 344179, 342690, 341730, 340838, 339344, 337205, 334651, 331796, 329194, 327845, 327869, 327901, 326822, 325499, 325819, 328407, 332223, 335989]
52859C35989K927J394o13k056k127j385j001j204j159k10J335K496K502J496M43
52844C38827J28M52R95J831K920L279J990J7n31P32J818J269L27J009L095M478
52828C62636M082L009K695L097L208K641K019J963K289K371J943J190L22m13l91
52813C92661Q64K582L090J842K89M6R58J871K430K863K749J565J53N1J343K579
52797D17936K841K420J554J30j073o69J191K490K067J151J344K307K764K792L633
52782D42878N511P051P033N976N492O267P072O220L910K211K195K224K69l020
52768E01289n294n842n843n663m430k579k220l920n475n155m158m319n264n743
52754D35384o089p223q291p612n412l595l123l338l691m369n186n285m276k707
$$ y = [335989, 338916, 340310, 339697, 337641, 335514, 334129, 333128, 331924, 330765, 330555, 331890, 334386, 336888, 338384, 338827, 338955, 339407, 340402, 342233, 345153, 348432, 350422, 350439, 349908, 350640, 352458, 353727, 354054, 355063, 358158, 362636, 366718, 369727, 372422, 375519, 378727, 381368, 383387, 385350, 387639, 390010, 391953, 393143, 393465, 393052, 392661, 393525, 396107, 399197, 401039, 401328, 401374, 402332, 404203, 406633, 409496, 412245, 413810, 413963, 414014, 415357, 417936, 420777, 423197, 424751, 424881, 423808, 423139, 424330, 426820, 428887, 430038, 431382, 433689, 436453, 439245, 442878, 448389, 455440, 462473, 468449, 473941, 480208, 487280, 493500, 497410, 499621, 501816, 504040, 504309, 501289, 495995, 490153, 484310, 478647, 474217, 471638, 469418, 465498, 460023, 454868, 450710, 446391, 441127, 435384, 429295, 422072, 413781, 406169, 400757, 397162, 394039, 390701, 387010, 382641, 377455, 372170, 367894, 365187]
52740C65187j328p30j384l075m513m505l411k532k328k275k198k514l131l203
52726C28060k288r89k48m78j411k338k615k427k627l385l572k414j120j536l381
52711B97231m232k579K44J709P81j538l714m946n279n090m681m133l412k542j720
52696B56099j316j663k579l245k951j902r02l54k28p65k230l863m280l308k318
52681B24195k147j897o87N55L08j293k723l175l161l262l418l486l544l526l112
52666A89627k078m78J227K106J469N6m58K94O42p53k850l799l449k813j894l7
52650A76812J922K067J54j812k201j444n31O15K374M088M649L894K705K045K317
52635A97654L330M407M785M248L235K317J761J493J239P77L81N11R05N65o72j408
$$ y = [365187, 363859, 363129, 361745, 358670, 354157, 349652, 346241, 343709, 341381, 339106, 336908, 334394, 331263, 328060, 325772, 324783, 324535, 324057, 322646, 320308, 317693, 315266, 312639, 309254, 305682, 303268, 302148, 300612, 297231, 292999, 290420, 290664, 292373, 293154, 291616, 287902, 282956, 277677, 272587, 267906, 263773, 260361, 257819, 256099, 254783, 253120, 250541, 247296, 244345, 242443, 241541, 241187, 240959, 240194, 237964, 234101, 229821, 226513, 224195, 222048, 220151, 219464, 220019, 220327, 219034, 216311, 213136, 209975, 206713, 203295, 199809, 196265, 192739, 189627, 187549, 187071, 188298, 190404, 191873, 191929, 191471, 191765, 192407, 191654, 188804, 185005, 181556, 178743, 176849, 176812, 178734, 180801, 180955, 179143, 176942, 175498, 174967, 175582, 177956, 182044, 186693, 190587, 193292, 195337, 197654, 200984, 205391, 210176, 214424, 217659, 219976, 221737, 223230, 224469, 225246, 225627, 226138, 227043, 227608, 226936, 225528]
52619B25528m74J088J174n60k449l204l130k838k361k048k847m802o438o480n383
52604A84776m298l359k006m53L39K1p17j158j316j483j537j111l26J3p62k139
52588A64484k695j719k69Rj061j995j614m24K28j71r34j130m22Q08J785J925J375
52571A58180J058J814L379M337L440J044r90j202j7R65R51N10K49k8n10o91j93
52554A72296K89l32k110l870m257k824m66J011M43j295k080j012P36J768J903
52539A60200J353O3j128l07K840N512M991K384R70J521J776M94o64k5J539J999
52523A83518O59j639l508l623j573J127K196J286M32J157K458K555J432N03O74
52508A87654J751L143M194M351L685K878K303J770J437J987L346M224L782K812
$$ y = [225528, 225054, 226142, 227316, 226756, 224307, 221103, 217973, 215135, 212774, 210726, 207879, 203077, 196639, 190159, 184776, 180478, 177119, 175113, 174660, 174999, 175020, 174303, 173145, 171829, 170346, 168809, 167698, 167372, 167385, 166623, 164484, 161789, 160070, 159801, 159810, 158749, 156754, 155140, 154716, 154944, 154773, 153839, 152709, 152287, 153095, 154880, 156805, 158180, 159238, 161052, 164431, 168768, 172208, 173252, 172262, 171060, 171043, 172008, 172959, 173469, 173718, 173690, 173180, 172489, 172296, 172585, 172253, 170143, 166273, 162016, 159192, 158726, 159737, 160180, 158885, 156805, 155793, 156529, 158297, 160200, 161553, 161616, 160488, 160181, 163021, 168533, 173524, 175908, 176878, 178399, 180175, 180669, 180005, 179980, 181519, 183518, 184177, 182538, 179030, 175407, 173834, 174961, 177157, 178443, 178875, 180032, 182490, 185045, 186477, 186980, 187654, 189405, 192548, 196742, 201093, 204778, 207656, 209959, 211729, 213166, 215153, 218499, 222723, 226505, 229317]
52494B29317K374K102R53q41j786r10J191L058L498K323N36k57Q17L118N091N477
52478B56061L956J309r16j415k24J409K303K043P66q28j329K68K844L798K081
52463B72126l88j061L90K336L440L589L162K401J475N64n4R3J142K107J488q17
52447B91993l013l424k243p84J15K64m29j664k522k415j808j320q01q1J39p13
52431B71294j807j777o24M06O02M22M88R21J692K761L713L854K924J465M02L92
52415B87128J226J823J318K96J88J251K157K058J795K291K940K793K300K410K739
52400C14713K190Q74j07m36n23j56J199K798L079J861N66K5m02j171j667j409
52384C21434q21q1J375L471M864M664L727L240K944J918L90n12n09m38q55j306
$$ y = [229317, 231691, 233793, 234746, 233905, 232119, 231209, 232400, 235458, 238956, 241279, 241815, 241558, 242375, 245493, 250584, 256061, 260017, 261326, 260410, 258995, 258771, 260180, 262483, 264526, 265292, 264464, 263135, 263403, 266247, 270045, 272126, 271738, 270677, 271067, 273403, 276843, 280432, 283594, 285995, 287470, 288034, 287980, 288073, 289215, 291322, 292810, 291993, 288980, 285556, 283313, 282529, 282644, 282908, 282479, 280815, 278293, 275878, 274070, 272750, 271949, 271868, 272007, 271294, 269487, 267710, 267086, 267492, 268094, 268516, 269004, 269925, 271617, 274378, 278091, 281945, 284869, 286334, 286736, 287128, 288354, 290177, 291495, 291791, 291979, 293230, 295387, 297445, 299240, 301531, 304471, 307264, 309564, 311974, 314713, 316903, 317777, 317670, 317234, 316711, 316555, 317754, 320552, 323631, 325492, 326058, 326083, 325681, 324510, 322843, 321434, 320613, 320532, 321907, 325378, 330242, 334906, 338633, 341873, 344817, 346735, 347125, 346613, 346104, 345666, 344811, 343505]
52368C43505j195n70K09R53J488J482R17O36J718M038N805N178K269r46k745l053
52352C59689k627j934j394j775l110l907k698k04J357J011k06j254k358l789m701
52337C32100m123k289k93J133J837J925J713J612J625J367Q13M39L51N8n07n90
52321C37171J90R93R28M78Q05K069L293L691L359K784K345K343K872L570L862
52306C70753L555K936K469K526L160L776L450K021O52O63K041L555M235M155L879
52291D13826L782M015M561N122N384N479N899O786P669Q076Q022P655O807N363
52277D98446M016L987N633P657Q306P324O176O045O361N904M768M167M522M921
52263E78233M792M871N879P254Q080Q574R493J0586J0831J0201R902J0669J1794
$$ y = [343505, 342310, 341740, 341949, 342902, 344390, 345872, 346789, 347425, 349143, 353181, 358986, 364164, 366433, 365487, 362742, 359689, 357062, 355128, 353734, 351959, 348849, 344942, 342244, 342040, 343397, 344408, 344202, 342948, 340590, 336801, 332100, 327977, 325688, 325395, 326528, 328365, 330290, 332003, 333615, 335240, 336607, 337420, 337859, 338210, 338268, 337761, 337171, 337361, 338354, 339282, 339760, 340565, 342634, 345927, 349618, 352977, 355761, 358106, 360449, 363321, 366891, 370753, 374308, 377244, 379713, 382239, 385399, 389175, 392625, 394646, 395298, 395961, 398002, 401557, 405792, 409947, 413826, 417608, 421623, 426184, 431306, 436690, 442169, 448068, 454854, 462523, 470599, 478621, 486276, 493083, 498446, 502462, 506449, 512082, 519739, 528045, 535369, 541545, 547590, 553951, 559855, 564623, 568790, 573312, 578233, 583025, 587896, 593775, 601029, 609109, 617683, 627176, 637762, 648593, 658794, 668696, 679365, 691159]
52250F91159J2279J2254J2676J3960J5502J6385J6401J6287J6958J8407J9717
52239H61985K0388K1214K3015K5032K5614K4605K3858K4928K7323K9719L1861
52228A139542L4190L6270L7077L6703L6487L7090L7585L6985L5789L5259L5659
52217A538636L6178L6299L6279L6105L4894L2054K8564K6190K5356K4606K2508
52206A877669J9459J6859J5029J2895R856O829M928L879K524N08j363k292k305
52193A964475j975j979k864m555n981n821l972j769n13j62L51J907M506P398R581
52178A958627J0570J0922J1734J3539J5942J8331K0383K1819K2364K2246K2067
52167B148544K1885K1112J9708J8544J7973J6911J4334J0896P993N825L703J686
$$ y = [691159, 703438, 715692, 728368, 742328, 757830, 774215, 790616, 806903, 823861, 842268, 861985, 882373, 903587, 926602, 951634, 977248, 1001853, 1025711, 1050639, 1077962, 1107681, 1139542, 1173732, 1210002, 1247079, 1283782, 1320269, 1357359, 1394944, 1431929, 1467718, 1502977, 1538636, 1574814, 1611113, 1647392, 1683497, 1718391, 1750445, 1779009, 1805199, 1830555, 1855161, 1877669, 1897128, 1913987, 1929016, 1941911, 1951767, 1958596, 1963524, 1967403, 1969927, 1970435, 1969072, 1966780, 1964475, 1962500, 1960521, 1957657, 1953102, 1947121, 1941300, 1937328, 1935559, 1935046, 1934884, 1935235, 1937142, 1941648, 1949046, 1958627, 1969197, 1980119, 1991853, 2005392, 2021334, 2039665, 2060048, 2081867, 2104231, 2126477, 2148544, 2170429, 2191541, 2211249, 2229793, 2247766, 2264677, 2279011, 2289907, 2297900, 2303725, 2307428, 2309114]
52155B309114L26j090m193r037j3543j6065j7291j8837k1115k3502k5576k7212
52143B131979k8216k8815k9792l1215l1790l0501k8245k6760k6449k6489k6518
52132A817189k6752k6705k5400k2970k0634j8897j7113j5046j3468j2590j1345
52121A606269r136p142o784p848r099r960j0468j0301r227q042p781q181q139
52108A494161p425o631n582l505r52J70q53k457l181l731n330p213p566o405n624
52093A427876o194o882o252m558l072k463k585l096l681m104m515n343o452o939
52079A361740o127m268k051j9J107L56k366n460o861o042m295l148l068l558l892
52064A312048l681l021k251j532q54n32j040k086k393j051J334L435M733N640
$$ y = [2309114, 2309440, 2308350, 2304157, 2295120, 2281577, 2265512, 2248221, 2229384, 2208269, 2184767, 2159191, 2131979, 2103763, 2074948, 2045156, 2013941, 1982151, 1951650, 1923405, 1896645, 1870196, 1843707, 1817189, 1790437, 1763732, 1738332, 1715362, 1694728, 1675831, 1658718, 1643672, 1630204, 1617614, 1606269, 1597133, 1589991, 1583207, 1575359, 1566260, 1556300, 1545832, 1535531, 1526304, 1518262, 1510481, 1502300, 1494161, 1486736, 1480105, 1474523, 1471018, 1470066, 1470236, 1469383, 1466926, 1463745, 1460014, 1454684, 1447471, 1439905, 1433500, 1427876, 1421682, 1414800, 1408548, 1403990, 1400918, 1398455, 1395870, 1392774, 1389093, 1384989, 1380474, 1375131, 1368679, 1361740, 1355613, 1351345, 1349294, 1349275, 1350382, 1350738, 1348372, 1342912, 1336051, 1330009, 1325714, 1322566, 1319498, 1315940, 1312048, 1308367, 1305346, 1303095, 1301563, 1300709, 1300177, 1299137, 1297051, 1294658, 1293607, 1294941, 1298376, 1303109, 1308749]
52050A308749O605P815R440J1337J2750J3134J3079J3644J5012J6662J8676K1729
52038A468632K5802K9839L2893L4815L5828L6346L7209L9075M1406M2987M3607
52027A868439M4136M4799M4666M3374M2091M1987M2577M2458M1094L9038L6874
52016B331533L4605L1822K8111K3548J8971J5299J2484R713O549L113p12m983
52004B510053q659j0452j1155j3317j7667k1543k2286k0773j9853k0462k1197
51993B322689k1029k0355j9457j7906j5762j3867j2535j1055q890o308l614p55
51981B171156J950L642L963L706M035N437P591R758J1275J2080J2920J4552J6734
51968B278799J8273J8150J6289J3497J0910R205P986O251L732J270n55k386m981
$$ y = [1308749, 1315354, 1323169, 1332609, 1343946, 1356696, 1369830, 1382909, 1396553, 1411565, 1428227, 1446903, 1468632, 1494434, 1524273, 1557166, 1591981, 1627809, 1664155, 1701364, 1740439, 1781845, 1824832, 1868439, 1912575, 1957374, 2002040, 2045414, 2087505, 2129492, 2172069, 2214527, 2255621, 2294659, 2331533, 2366138, 2397960, 2426071, 2449619, 2468590, 2483889, 2496373, 2506086, 2512635, 2515748, 2515036, 2510053, 2501394, 2490942, 2479787, 2466470, 2448803, 2427260, 2404974, 2384201, 2364348, 2343886, 2322689, 2301660, 2281305, 2261848, 2243942, 2228180, 2214313, 2201778, 2190723, 2181833, 2175525, 2171911, 2171156, 2173106, 2176748, 2180711, 2184417, 2188452, 2193889, 2201480, 2211238, 2222513, 2234593, 2247513, 2262065, 2278799, 2297072, 2315222, 2331511, 2345008, 2355918, 2365123, 2373109, 2379360, 2383092, 2384362, 2383807, 2381421, 2376440]
51955B376440p832r908j1281j3025j5689j8772k1610k3896k5599k7109k9227l2297
51943B140195l5582l8170m0052m1599m2600m2716m2332m2035m1879m2154m3888
51932A687188m7137m9672m9254m6628m4421m3462m2412m0718l9465l8908l7706
51921A207405l5379l3460l3173l3746l4017l3945l3495l1864k9127k7044k6786
51910H55369k7135k6330k4410k2356k0223j7844j6234j6394j7332j7058j5076
51899F34977j2509j0212q349p424q009r399j0039r456q598q169p752o795n525
51886E22741m576m395n131o444p395p207o139n146m671m406m050l735l701l950
51872D51795m170l865k827j705j513k224k632k074j420j692k623l524m611o137
$$ y = [2376440, 2368608, 2358700, 2347419, 2334394, 2318705, 2299933, 2278323, 2254427, 2228828, 2201719, 2172492, 2140195, 2104613, 2066443, 2026391, 1984792, 1942192, 1899476, 1857144, 1815109, 1773230, 1731076, 1687188, 1640051, 1590379, 1541125, 1494497, 1450076, 1406614, 1364202, 1323484, 1284019, 1245111, 1207405, 1172026, 1138566, 1105393, 1071647, 1037630, 1003685, 970190, 938326, 909199, 882155, 855369, 828234, 801904, 777494, 755138, 734915, 717071, 700837, 684443, 667111, 650053, 634977, 622468, 612256, 603907, 596483, 588474, 579075, 569036, 559580, 550982, 542813, 535061, 528266, 522741, 518165, 513770, 508639, 502195, 494800, 487593, 481454, 476308, 471637, 467231, 463181, 459446, 455745, 451795, 447625, 443760, 440933, 439228, 437715, 435491, 432859, 430785, 429365, 427673, 425050, 421526, 416915, 410778]
51858D10778o965n618k466M66J678J026j163m143o233n981m153l029l431l905
51844C66861l172j772o80J30P79N34j061k963l751l360k764k510k405k269k186
51829C39411k272k719l591m099k925m8K515K809J259j80o83j033j700j864q53
51814C24027P23J808K128J973J424M74n07r91q73l91K83J018J460J294O71P2k52
51797C34341l92l99j27M21Q61Q00L35N6N58J922L611M844N185M839M398M261M375
51780C69889M366L885K808J373J48l95l92n20j235k095k094p95R05J325m11l193
51764C73569m701l654j161O55J063J040J287J112j28j533j726q74l81p45r95l68
51748C62460O08J150J341J567J573Q76l06j198j366r31j37Q76J920K710K834J779
$$ y = [410778, 403813, 398195, 395729, 396195, 397873, 398899, 397736, 393593, 387360, 381379, 377226, 374197, 370766, 366861, 363689, 361917, 361237, 361367, 362146, 362680, 361619, 358656, 354905, 351545, 348781, 346271, 343866, 341597, 339411, 337139, 334420, 330829, 326730, 323805, 323757, 326272, 329081, 330340, 330160, 329477, 328444, 326744, 324880, 324027, 324750, 326558, 328686, 330659, 332083, 332557, 332050, 331059, 330186, 329795, 330078, 331096, 332556, 333850, 334521, 334593, 334341, 333949, 333550, 333423, 333844, 334705, 335505, 335840, 335896, 336454, 338376, 341987, 346831, 352016, 356855, 361253, 365514, 369889, 374255, 378140, 380948, 382321, 382469, 382074, 381682, 381162, 379927, 377832, 375738, 374943, 375848, 377173, 376762, 373569, 368868, 365214, 364053, 364708, 365771, 366811, 368098, 369210, 369082, 367549, 365823, 364949, 364568, 363823, 362828, 362460, 363068, 364218, 365559, 367126, 368699, 369575, 369269, 368071, 366705, 365774, 365637, 366513, 368433, 371143, 373977, 375756]
51732C75756o05l340m568l223l23J935K329J561J043J351J971K186J814J109L39
51717C79335k84m45Q8J017J688J924K260K947L281K573J398R86J503J907J528
51702D01706P99K59j50l24M60K483M666N467M442K566J308J620L261M810M965
51687D38338M152M242O239Q917J0343J0070R284R279J0372J1988J3237J3755J4194
51674E64410J5477J7412J8686J8434J6887J4375J0831O841L733J800k69l006m642
51661F80969l480p71O39j73j804l126m349n593o288o231n733m679k974j885l081
51646F31441n915p555o506m405l345l134k540j884k464l987m499l146j614k050
51632E78397m295o055n594l552j746q72k02Q16J867K891M447O196O449M573K666
$$ y = [375756, 375151, 371811, 367243, 364020, 363697, 365632, 367961, 369522, 370565, 371916, 373887, 376073, 377887, 378996, 379335, 379051, 378606, 378694, 379711, 381399, 383323, 385583, 388530, 391811, 394384, 395782, 396768, 398271, 400178, 401706, 402505, 402764, 402614, 402290, 402750, 405233, 409899, 415366, 419808, 422374, 423682, 425302, 428563, 433373, 438338, 442490, 446732, 452971, 461888, 472231, 482301, 491585, 500864, 511236, 523224, 536461, 550216, 564410, 579887, 597299, 615985, 634419, 651306, 665681, 676512, 683353, 687086, 688886, 688617, 685611, 680969, 677489, 676718, 677357, 677184, 675380, 672254, 667905, 662312, 656024, 649793, 644060, 639381, 636407, 634522, 631441, 625526, 617971, 611465, 607060, 603715, 600581, 598041, 596157, 593693, 589706, 585207, 582061, 580447, 578397, 574102, 568047, 562453, 558901, 557155, 556283, 556081, 556897, 558764, 561655, 566102, 572298, 578747, 583320, 585986]
51617E85986L000M627M653K537O39L59K97q93k106j729k00J037J811K786L625
51602F06429L380K262J576J957K852L526L683L148J835J9j875l599m765m790l867
51587F11771l548n429r199j2618j3509j1479q095n673n555p043q266q280p789
51574E05288p517o828m840k187o60j163k930m644n740o470p143p459o615m351
51560D36741j778m08l76m67j29k13j181k051k151k490l880m854l461n02J230Q08
51544D14838J17O05J172L26j302j939j204k75j8p4K73J211K405L336L556K928
51528D25955J790Q46Q72K195M242N722N802N033M691N293O160O433O015N541N775
51513D92365P008Q616R343Q469O496M287K015l66k169k635k163j734j383p19o62
$$ y = [585986, 588986, 593613, 598266, 600803, 601442, 601801, 602098, 601205, 599099, 597370, 597170, 598207, 600018, 602804, 606429, 609809, 612071, 613647, 615604, 618456, 621982, 625665, 628813, 630648, 630667, 628792, 625193, 620428, 615638, 611771, 608223, 602794, 593595, 580977, 567468, 555989, 547894, 542221, 536666, 529623, 521357, 513077, 505288, 497771, 490943, 486103, 483916, 483256, 482093, 479163, 474519, 468779, 462309, 455166, 447707, 441092, 436741, 434963, 434555, 434179, 433712, 433583, 433370, 432189, 430138, 427987, 425497, 421617, 416763, 413302, 412800, 414030, 414838, 414955, 415560, 416732, 417058, 415756, 413817, 412613, 412338, 412320, 412246, 412519, 413730, 416135, 419471, 423027, 425955, 427745, 428591, 429463, 431658, 435900, 441622, 447424, 452457, 457148, 462441, 468601, 475034, 481049, 486590, 492365, 499373, 507989, 517332, 525801, 532297, 536584, 538599, 538233, 536064, 533429, 531266, 529532, 528149, 527430, 526768]
51498E26768k649n786o981m992k296j532j924j274J15J72j053j163P91K931L679
51483E04806L893M797N915O538P433R151J0007Q088M576K667L189L664K189J38
51469E77051k20R30J628J175O89J027J722K117K201J950J032l17q53L61K627M139
51453E97259L654J396j382l342l764k866j486l71J15k45j546l284m394m327l775
51438E71642l801m435m726m286m002m865o480p303o448m751l646l268k429o18
51424E10584Q24M89p92q36O84J597M56j079n07J998M039M428M247M523M865M873
51408E40393N241O348P167O785O104O586Q041R006R022R116R917J0676J0530R722
51394F54654R011Q630Q432Q484Q757Q607P256M903K795J985K185K100Q62j006
$$ y = [526768, 524119, 518333, 511352, 506360, 504064, 502532, 500608, 499334, 499449, 499621, 498568, 497405, 498196, 501127, 504806, 508699, 513496, 519411, 525949, 533382, 542533, 552540, 560628, 565204, 567871, 571060, 574724, 576913, 577051, 576831, 577761, 579389, 580564, 581253, 582280, 584002, 586119, 588320, 590270, 591302, 590985, 590132, 590493, 593120, 597259, 600913, 602309, 600927, 597585, 593821, 590955, 589469, 589098, 589213, 588968, 587422, 584138, 579744, 575417, 571642, 567841, 563406, 558680, 554394, 550392, 545527, 539047, 531744, 525296, 520545, 516899, 513631, 511202, 510584, 511408, 511897, 511105, 510269, 510953, 512550, 513006, 511927, 511420, 513418, 517457, 521885, 526132, 530655, 535520, 540393, 545634, 551982, 559149, 565934, 572038, 578624, 586665, 595671, 604693, 613809, 623726, 634402, 644932, 654654, 663665, 672295, 680727, 689211, 697968, 706575, 713831, 718734, 721529, 723514, 725699, 727799, 728661, 727655]
51380G27655k214k246j914k210k894k825j551k0O12L72K08O58J237J248P03K34
51364G17053K44M23R5j063k712m255n388o266p174q185r127r819j0237j0450j0339
51349F32800r544p886n871m569m698n867o872o713n255l185j514r21j196j391
51335E67318q29J44O96N96K59j24p33j340j183j01R06P56n11k038l187l800l934
51318E52895m055n009o907q466q419p486p758r863j1891j1713r601p759p732q957
51304D37279r714q971p287o104o259p177p705p519p170o894o206m847l427k688
51290C45311k801l677n176o479o179l876j122J15m49j665k646l104k517n19J799
51275C07015K425Q50j129j704j236j240j969k090p15J315K507K530K390K955L773
$$ y = [727655, 725441, 723195, 721281, 719071, 716177, 713352, 711801, 711781, 712393, 712765, 712973, 713631, 714868, 716116, 716819, 717053, 717297, 717720, 717815, 716752, 714040, 709785, 704397, 698131, 690957, 682772, 673645, 663826, 653589, 643139, 632800, 623256, 615370, 609499, 604930, 600232, 594365, 587493, 580780, 575525, 572340, 570826, 569905, 568709, 567318, 566489, 566633, 567329, 567925, 568184, 568060, 567327, 565987, 564804, 564703, 565609, 566365, 565854, 563816, 560629, 556829, 552895, 548840, 543831, 536924, 528458, 520039, 512553, 504795, 494932, 483041, 471328, 461727, 453968, 446236, 437279, 427565, 418594, 411307, 405203, 398944, 391767, 384062, 376543, 369373, 362479, 356273, 351426, 347999, 345311, 342510, 338833, 333657, 327178, 320999, 317123, 316001, 316116, 315667, 314002, 311356, 308252, 305735, 305216, 307015, 309440, 310290, 309161, 307457, 306221, 304981, 303012, 300922, 300207, 301522, 304029, 306559, 308949, 311904, 315677]
51260C15677L687K492J423J745L232M545M855M503M223M443N319O761Q082Q317
51246C79304P284N877M871L984K627J161N92J088J522Q06q14k184k681k787l285
51231C97365m303n430o412p296p918p789o683n064l639k693k147k094k894m651
51217C28352o689p706o745m323k328k217l416m032l198j811r52o79q69j863l341
51202B78183l772k352o40o50k011k627j857j079j193j436j090n35p5O69J509J401
51186B62445K30n21J18J242J778K206L244M081L562K239J591J726J458L96n62
51171B85233p66m79m8M72P16K42n39o04K91J304J667J339N34n16j138n81Q19J686
51153B89632J331O87R29J758J804N31r56j162J80K001L201L588L515L081K251
$$ y = [315677, 319364, 321856, 323279, 325024, 328256, 332801, 337656, 342159, 346382, 350825, 356144, 362905, 370987, 379304, 386588, 392465, 397336, 401320, 403947, 405108, 405700, 406788, 408310, 409116, 408302, 406118, 403437, 400650, 397365, 393062, 387632, 381220, 373924, 366006, 358217, 351534, 346470, 342831, 340138, 337991, 335897, 333003, 328352, 321663, 313957, 307212, 302889, 300561, 298344, 294928, 290896, 287698, 285887, 284935, 284256, 283387, 281524, 278183, 274411, 272059, 271419, 270769, 268758, 266131, 264274, 263195, 262002, 260566, 259476, 258941, 258866, 259535, 261044, 262445, 262675, 262154, 262272, 263514, 265292, 267498, 270742, 274823, 278385, 280624, 282215, 283941, 285399, 285795, 285233, 284467, 283988, 283940, 284412, 285128, 285370, 284831, 284227, 284518, 285822, 287489, 288828, 289362, 288846, 287708, 287127, 287946, 289632, 290963, 291650, 292579, 294337, 296141, 296672, 295716, 294554, 294734, 296735, 299936, 303524, 307039, 310120, 312371]
51138C12371J449J255J455J198K98l99k94L5k00q98j484j802j870j425n45p2m98
51121C08574j026p55k32n89j566j857j336j328k314k813j422R67K074Q95j236
51106B96036k279j671o68o64j475j748r80k93p66j763j773m92R09J334P63j43
51090B84327o73m87q4n30k083l518l693l109k769k235n23J421J308j132l307l078
51074B59835j232K48P97R77Q53K85N4J130L034M205L954L238L310M229M820L915
51058B93652J645m14q11M9L88o42j953k126j123J80J328K286K719K231J068r4
51042B98383q63j182j069q09j004j760k243j637j79J344K652L852M555M064K474
51027C06578Q91L66R25J697J798J134M30K25Q6n92j101L8K524L643J433k346l988
$$ y = [312371, 313820, 315075, 316530, 317728, 318026, 317627, 317333, 317368, 317168, 316270, 314786, 312984, 311114, 309689, 309144, 309072, 308574, 307548, 306793, 306561, 305972, 304406, 302549, 301213, 299885, 297571, 294758, 293336, 294303, 296377, 297272, 296036, 293757, 292086, 291418, 290754, 289279, 287531, 286551, 286258, 285492, 283729, 281956, 281464, 282373, 283707, 284470, 284327, 283654, 283167, 283083, 282553, 280470, 276952, 273259, 270150, 267381, 265146, 264623, 266044, 267352, 266220, 262913, 259835, 258603, 258851, 259648, 260625, 261478, 261763, 261817, 262947, 265981, 270186, 274140, 277378, 280688, 284917, 289737, 293652, 295297, 294883, 294072, 294121, 294509, 293867, 291914, 289788, 288665, 288845, 290173, 292459, 295178, 297409, 298477, 298383, 297520, 296338, 295269, 294460, 293456, 291696, 289453, 287816, 287637, 288981, 291633, 295485, 300040, 304104, 306578, 307469, 307835, 308760, 310457, 312255, 313389, 313819, 314044, 314130, 313538, 312437, 312475, 314999, 318642, 320075, 317729, 313741]
51010C13741k301L38J430J327J991L899N325M431J398j677k652j171J170K427
50996C29676J938N08o42p53J97J504K194J914J338J291J669J776J448J191J269
50981C46518J487J947L113M786N825N516M714M805N750O067M775K696J453J676
50967D01128K704L643M057L779K879K037K200L202L443J756p67j847p67R89J887
50952D30323K031K286K919L758M754N570N401M226L621N089P943R945R997R149
50938E07012Q869R466J0518J1811J3266J4511J5322J6117J7471J9229K0525K0807
50926F84924K0590K1080K2958K5632K7902K9415L1024L3524L6405L8520L9760
50915A011734M1323M4343M8764N3773N8734O3445O7881P2235P7018Q2713Q9211
$$ y = [313741, 311440, 311778, 313208, 314535, 316526, 320425, 325750, 330181, 331579, 329902, 327250, 326079, 327249, 329676, 331614, 332122, 331480, 330727, 330924, 332428, 334622, 336536, 337874, 339165, 340834, 342610, 344058, 345249, 346518, 348005, 349952, 353065, 357851, 363676, 369192, 373906, 378711, 384461, 390528, 395303, 397999, 399452, 401128, 403832, 407475, 411532, 415311, 418190, 420227, 422427, 425629, 429072, 430828, 430061, 428214, 427447, 428436, 430323, 432354, 434640, 437559, 441317, 446071, 451641, 457042, 461268, 464889, 469978, 477921, 487866, 497863, 507012, 515881, 525347, 535865, 547676, 560942, 575453, 590775, 606892, 624363, 643592, 664117, 684924, 705514, 726594, 749552, 775184, 803086, 832501, 863525, 897049, 933454, 971974, 1011734, 1053057, 1097400, 1146164, 1199937, 1258671, 1322116, 1389997, 1462232, 1539250, 1621963, 1711174]
50904A711174R5873J02232J08545J15249J21896J26961J29192J28993J27917J26794
50894B894826J24941J21284J15494J07581R7141Q3794O8124N1569L5465K0473
50884C720692O547o956k0577l3630m4309n1592n6455o0255o2562o2067n9342n7037
50872C212457n6791n7496n7382n6677n6992n8808o0915o2306o3567o5999o9895
50861B545629p4043p6856p7764p7533p7263p7179p6558p4692p1767o8629o5806
50850A727539o2747n8210n1733m4712l9336l6117l3215k8859k3621j9271j6061
50839A313657j2661q611n128l086j703J08K284M297O098P621Q478R096J0885J4014
50825A345349J6165J5271J2710J1798J3474J5607J6582J7302J8796K0130K0187
$$ y = [1711174, 1807047, 1909279, 2017824, 2133073, 2254969, 2381930, 2511122, 2640115, 2768032, 2894826, 3019767, 3141051, 3256545, 3364126, 3461267, 3545061, 3613185, 3664754, 3700219, 3720692, 3727239, 3720283, 3699706, 3666076, 3621767, 3570175, 3513720, 3453465, 3390903, 3328836, 3269494, 3212457, 3155666, 3098170, 3040788, 2984111, 2927119, 2868311, 2807396, 2745090, 2681523, 2615524, 2545629, 2471586, 2394730, 2316966, 2239433, 2162170, 2084991, 2008433, 1933741, 1861974, 1793345, 1727539, 1664792, 1606582, 1554849, 1510137, 1470801, 1434684, 1401469, 1372610, 1348989, 1329718, 1313657, 1300996, 1292385, 1287257, 1284171, 1282468, 1282576, 1284860, 1289157, 1295255, 1302876, 1311354, 1320450, 1331335, 1345349, 1361514, 1376785, 1389495, 1401293, 1414767, 1430374, 1446956, 1464258, 1483054, 1503184, 1523371]
50814A523371K0017K1398K3968K5685K6058K7030L0241L4810L8631M0976M2951
50803A855136M5973N0489N6010O1684O7047P2582P9420Q8119R7905J07657J17409
50792B699431J28224J40656J54146J68127J82750J98042K13108K27066K40219
50783D351769K53259K65553K75317K81594K85004K86132K84088K77138K63943
50774F823797K43733K16135J81938J43480J03317O2680K2027j7404n3649q5451
50764G640603j12460j33929j48536j56022j57925j56086j51182j43370j33623
50755F347470j23639j15099j09599j08506j11802j17597j23948j30854j39396
50746E267030j49310j58785j66606j73065j78328j81444j81655j79610j76228
$$ y = [1523371, 1543388, 1564786, 1588754, 1614439, 1640497, 1667527, 1697768, 1732578, 1771209, 1812185, 1855136, 1901109, 1951598, 2007608, 2069292, 2136339, 2208921, 2288341, 2376460, 2474365, 2582022, 2699431, 2827655, 2968311, 3122457, 3290584, 3473334, 3671376, 3884484, 4111550, 4351769, 4605028, 4870581, 5145898, 5427492, 5712496, 5998628, 6282716, 6559854, 6823797, 7067530, 7283665, 7465603, 7609083, 7712400, 7775080, 7797107, 7779703, 7726054, 7640603, 7528143, 7394214, 7245678, 7089656, 6931731, 6775645, 6624463, 6481093, 6347470, 6223831, 6108732, 5999133, 5890627, 5778825, 5661228, 5537280, 5406426, 5267030, 5117720, 4958935, 4792329, 4619264, 4440936, 4259492, 4077837, 3898227, 3721999]
50737C721999j71303j64220j55256j45124j33873j21495j09142r8317q8843p8986
50727B455440o7829n6492m6639l8826l2624k7398k2394j6941j1266o453k922K64
50715B125920L831O776P559O459N434N612O040N287L304R97j197l496n835p602
50701B159089q383q371p969p488p327p961r286j0365j0207q653o113k645J977
50688B066298P451J2888J7905K2978K8333L3298L7644M2787N0359N9714O8336
50677B447991P5018Q1266Q8892R7429J05229J12210J19947J29139J38467J46404
50667C541992J53000J59128J64710J68571J69741J68025J63346J55301J43707
50658D987521J29059J11986R2391O9639M3554J5014j4415m2987o8934r0705j07543
$$ y = [3721999, 3550696, 3386476, 3231220, 3086096, 2952223, 2830728, 2721586, 2623269, 2534426, 2455440, 2387611, 2331119, 2284480, 2245654, 2213030, 2185632, 2163238, 2146297, 2135031, 2128578, 2125656, 2125920, 2129751, 2136527, 2144086, 2150545, 2155979, 2161591, 2167631, 2172918, 2176222, 2177219, 2176022, 2172526, 2166691, 2159089, 2150706, 2142335, 2134366, 2126878, 2119551, 2111590, 2102304, 2091939, 2081732, 2073079, 2066966, 2064321, 2066298, 2073749, 2086637, 2104542, 2127520, 2155853, 2189151, 2226795, 2269582, 2319941, 2379655, 2447991, 2523009, 2604275, 2693167, 2790596, 2895825, 3008035, 3127982, 3257121, 3395588, 3541992, 3694992, 3854120, 4018830, 4187401, 4357142, 4525167, 4688513, 4843814, 4987521, 5116580, 5228566, 5320957, 5390596, 5434150, 5449164, 5434749, 5391762, 5322828, 5232123, 5124580]
50647E124580j19589j27172j30288j29127j24613j17844j09272r9228q9040q0605
50637C997802p4711p0735o8317o8349p1682p7666q4735r1886r8700j04560j08686
50626C077775j10878j11230j09448j05343r9948r4893r0324q4505p6282o7161
50616B127763n9830n4848m9936m2897l4225k6150j9717j4036q254k845J766O660
50604A823451J3051J9946K4662K6021K5794K6472K8532L0647L1835L2512L3692
50593B116615L5751L7987L9190L8926L8120L7834L7559L5830L2789L0973L2707
50582B514281L7625M3462M8411N1940N4424N7113O1521O7494P2681P5229P6278
50571C160459P8063Q0334Q0685P8239P4596P0911O6196N9356N1016M2308L3375
$$ y = [5124580, 5004991, 4877819, 4747531, 4618404, 4493791, 4375947, 4266675, 4167447, 4078407, 3997802, 3923091, 3852356, 3784039, 3715690, 3644008, 3566342, 3481607, 3389721, 3291021, 3186461, 3077775, 2966897, 2855667, 2746219, 2640876, 2540928, 2446035, 2355711, 2271206, 2194924, 2127763, 2067933, 2013085, 1963149, 1920252, 1886027, 1859877, 1840160, 1826124, 1817870, 1815025, 1816791, 1823451, 1836502, 1856448, 1881110, 1907131, 1932925, 1959397, 1987929, 2018576, 2050411, 2082923, 2116615, 2152366, 2190353, 2229543, 2268469, 2306589, 2344423, 2381982, 2417812, 2450601, 2481574, 2514281, 2551906, 2595368, 2643779, 2695719, 2750143, 2807256, 2868777, 2936271, 3008952, 3084181, 3160459, 3238522, 3318856, 3399541, 3477780, 3552376, 3623287, 3689483, 3748839, 3799855, 3842163, 3875538]
50560C875538K4281J5980R184L361j886n391n851l880j298J119L861P104J0230
50547C932352J2650J3885J3031R594M829Q02k342o876j4619k4562l4168m2361
50535C862215n0310n9626p0630q2170r2404r9728j03676j05276j06090j06644
50525B985661j06058j03428r9192r4722r0768q6770q1801p5780o9612o4329o0216
50514B052985n6512n1918m5733l8592l1801k5758j9641j3028p200l880k839j626
50502A754457J907P455J2892J6638J8923K0990K3696K7112L1044L5289L9247M1992
50490B031642M3428M4988M8169N2408N5492N6398N6503N7312N8266N7981N6723
50479B619310N6036N6402N6941N7255N8026N9569O1339O3263O6249P0684P5568
$$ y = [3875538, 3899819, 3915799, 3924983, 3928344, 3926458, 3921067, 3915216, 3911336, 3910038, 3911157, 3915018, 3922122, 3932352, 3945002, 3958887, 3971918, 3981512, 3986341, 3987143, 3984801, 3977925, 3963306, 3938744, 3904576, 3862215, 3811905, 3752279, 3681649, 3599479, 3507075, 3407347, 3303671, 3198395, 3092305, 2985661, 2879603, 2776175, 2676983, 2582261, 2491493, 2404723, 2322922, 2247142, 2177530, 2113201, 2052985, 1996473, 1944555, 1898822, 1860230, 1828429, 1802671, 1783030, 1770002, 1762802, 1758922, 1756083, 1754457, 1756364, 1763819, 1776711, 1793349, 1812272, 1833262, 1856958, 1884070, 1915114, 1950403, 1989650, 2031642, 2075070, 2120058, 2168227, 2220635, 2276127, 2332525, 2389028, 2446340, 2504606, 2562587, 2619310, 2675346, 2731748, 2788689, 2845944, 2903970, 2963539, 3024878, 3088141, 3154390, 3225074, 3300642]
50468C300642P9808Q3595Q7918R3464J00419J08592J17221J25338J32662J39391
50458D369050J44971J48013J47808J44969J40085J32839J23036J11343R8210Q2985
50448E643309O5089M5214K4484L259j8204l8714n6958p2893q7210r9791j09621
50437E297964j15881j18136j15907j09195r9245q7677p4917o0307m3757k6489
50427D446453j0257L442J3559J9682K2019K0671J5200N409p952k4028m2734o3766
50415D397698q5222j04514j20392j32963j42080j47170j48611j47720j45132j40544
50405C083350j34272j27548j20726j12778j03411r4242q6616p9413p0633o0465
50395B093246n1244m4463l9278l4101k8376k2241j5536q126q72M770Q345J1033
$$ y = [3300642, 3380450, 3464045, 3551963, 3645427, 3745846, 3854438, 3971659, 4096997, 4229659, 4369050, 4514021, 4662034, 4809842, 4954811, 5094896, 5227735, 5350771, 5462114, 5560324, 5643309, 5708398, 5753612, 5778096, 5781355, 5763151, 5724437, 5667479, 5594586, 5507376, 5407585, 5297964, 5182083, 5063947, 4948040, 4838845, 4739600, 4651923, 4577006, 4516699, 4472942, 4446453, 4436196, 4439638, 4453197, 4472879, 4494898, 4515569, 4530769, 4536178, 4528226, 4504198, 4461464, 4397698, 4312476, 4207962, 4087570, 3954607, 3812527, 3665357, 3516746, 3369026, 3223894, 3083350, 2949078, 2821530, 2700804, 2588026, 2484615, 2390373, 2303757, 2224344, 2153711, 2093246, 2042002, 1997539, 1958261, 1924160, 1895784, 1873543, 1858007, 1849881, 1849009, 1853779, 1862124, 1873157]
50383A873157J4340J8449K2382K5637K8889L2771L6532L8722L9051L8985M0369
50372B209284M3797M8219N1808N3136N2086M9821M7707M6319M5461M4762M3818
50361B736218M2158L9739L7275L5367L3548L1061K8264K6181K4785K3144K1595
50350C079335K2080K5451K9810L2801L4619L7097M0546M3337M4533M5004M5333
50339C479946M4233M0245L4020K7742K2677J8381J3815Q087J25j0983k4751l9169
50327C614368n2435o4291p5098q4283r0690r4152r5666r5821r4093r0021q4177
50316B693641p7274o9049n9086m8247l8178k9313k0475j0752r18P471J3583J7125
50304B378528J7429J3795O791j742j0204j8279k6207l3767m0348m5583m9327n1401
$$ y = [1873157, 1887497, 1905946, 1928328, 1953965, 1982854, 2015625, 2052157, 2090879, 2129930, 2168915, 2209284, 2253081, 2301300, 2353108, 2406244, 2458330, 2508151, 2555858, 2602177, 2647638, 2692400, 2736218, 2778376, 2818115, 2855390, 2890757, 2924305, 2955366, 2983630, 3009811, 3034596, 3057740, 3079335, 3101415, 3126866, 3156676, 3189477, 3224096, 3261193, 3301739, 3345076, 3389609, 3434613, 3479946, 3524179, 3564424, 3598444, 3626186, 3648863, 3667244, 3681059, 3689146, 3689271, 3678288, 3653537, 3614368, 3561933, 3497642, 3422544, 3338261, 3247571, 3153419, 3057753, 2961932, 2867839, 2777818, 2693641, 2616367, 2547318, 2488232, 2439985, 2401807, 2372494, 2352019, 2341267, 2340349, 2347820, 2361403, 2378528, 2395957, 2409752, 2416543, 2414801, 2404597, 2386318, 2360111, 2326344, 2285996, 2240413, 2191086, 2139685]
50292B139685n1946n1915n2335n3006n2537n0088m6493m3289m0922l8535l5285
50281A623334l1279k7219k3643k0610j7893j5243j2624j0224q183o412m726k948
50269A442330p31K214N484Q109R835J1710J4580J7606J9332J9940K0959K2825
50257A594193K4296K4693K5163K6739K8525K9072K8624K8544K9191K9835L0276
50246A899151L0963L1436L0221K6831K2829K0101J8698J7034J3841R395M857R93
50234B126350k348n615q723j1061j2278j2840j3701j5622j8700k2143k4677k5698
50222A952944k6230k7967l1255l4655l6706l7248l6710l5225l3169l1545l0860
50211A591374l0336k9181k7829k6975k6197k4799k3234k2288k1456j9754j7592
$$ y = [2139685, 2087739, 2035824, 1983489, 1930483, 1877946, 1827858, 1781365, 1738076, 1697154, 1658619, 1623334, 1592055, 1564836, 1541193, 1520583, 1502690, 1487447, 1474823, 1464599, 1456416, 1450004, 1445278, 1442330, 1441599, 1443813, 1449297, 1457406, 1467241, 1478951, 1493531, 1511137, 1530469, 1550409, 1571368, 1594193, 1618489, 1643182, 1668345, 1695084, 1723609, 1752681, 1781305, 1809849, 1839040, 1868875, 1899151, 1930114, 1961550, 1991771, 2018602, 2041431, 2061532, 2080230, 2097264, 2111105, 2120500, 2125357, 2126350, 2124002, 2118387, 2109664, 2098603, 2086325, 2073485, 2059784, 2044162, 2025462, 2003319, 1978642, 1952944, 1926714, 1898747, 1867492, 1832837, 1796131, 1758883, 1722173, 1686948, 1653779, 1622234, 1591374, 1561038, 1531857, 1504028, 1477053, 1450856, 1426057, 1402823, 1380535, 1359079, 1339325, 1321733]
50200A321733j6236j5641j4598j2808j1010r135o385l407k192l057l693k220M85
50187A221836K591L756M410M199K773J127M07J23r40k583l487l201k450j856j672
50172A225033k470m618p091q163p443o155n403n260n543o244o883o631n467m250
50158A143412l351k280j036o05j259j515QK483L974M159M369M959M426J956n63
50143A159137n21K044M506M946L942K790J548k05j785k126j658k026l826n796
50129A160970o590o284n780n521n488n771o436p153p507p462p158o701o382o656
50115A070081p431p876p560p301q169r778j0368q702n465k598j542k125k949k742
50101I85475j476j98P9q31k477m278n771o771p512q365r279r788r663r112q273
$$ y = [1321733, 1305497, 1289856, 1275258, 1262450, 1251440, 1242305, 1235920, 1232513, 1230321, 1227264, 1223571, 1221351, 1221836, 1224427, 1228183, 1232593, 1236792, 1239565, 1240692, 1241099, 1241222, 1240282, 1237699, 1234212, 1231011, 1228561, 1226705, 1225033, 1222563, 1217945, 1210854, 1202691, 1195248, 1189093, 1183690, 1178430, 1172887, 1166643, 1159760, 1153129, 1147662, 1143412, 1140061, 1137781, 1136745, 1136140, 1134881, 1133366, 1133374, 1135857, 1139831, 1143990, 1148359, 1153318, 1157744, 1159700, 1159137, 1158616, 1160660, 1165166, 1170112, 1174054, 1176844, 1178392, 1178187, 1176402, 1174276, 1172618, 1170592, 1166766, 1160970, 1154380, 1148096, 1142316, 1136795, 1131307, 1125536, 1119100, 1111947, 1104440, 1096978, 1089820, 1083119, 1076737, 1070081, 1062650, 1054774, 1047214, 1039913, 1031744, 1021966, 1011598, 1002896, 997431, 994833, 993291, 991166, 988217, 985475, 983999, 983801, 983880, 983049, 980572, 976294, 970523, 963752, 956240, 947875, 938596, 928808, 919145, 910033, 901760]
50086I01760p151o195o245p369q347p914o128m076k619j845j376o69N41J687J735
50071H45789O19k84K42J796L270M553O117P418P174N442M117M812P137R451J0665
50056I18318J0901J1067J2203J4529J6747J6936J4653J1579R593Q725P734O199
50044A059184N119N379O518P337P288O825O535O282N326L243O22j211j215M94
50030A117726K690M051M290M430N731Q194J0354J0873J0071R507J0072J1118J1614
50017A220721J1565J1799J2745J4054J5356J6782J8376J9541J9680J9252J9562
50006A399433K1143K2923K3532K3003K2383K1818K0236J7392J5181J5712J8464
49995A621220K0591K0055J7518J4821J2745J0951R327Q291P799O993N140K511
$$ y = [901760, 894609, 888414, 882169, 874800, 866453, 858539, 852411, 848335, 845716, 843871, 842495, 841826, 842367, 844054, 845789, 846408, 846124, 846366, 848162, 851432, 855985, 862102, 869520, 876694, 882136, 886253, 891065, 898202, 907653, 918318, 929219, 940286, 952489, 967018, 983765, 1000701, 1015354, 1026933, 1036526, 1045251, 1052985, 1059184, 1064303, 1069682, 1076200, 1083537, 1090825, 1097650, 1104185, 1110467, 1115793, 1119036, 1119658, 1118447, 1117232, 1117726, 1120416, 1124467, 1128757, 1133187, 1138918, 1147112, 1157466, 1168339, 1178410, 1187917, 1197989, 1209107, 1220721, 1232286, 1244085, 1256830, 1270884, 1286240, 1303022, 1321398, 1340939, 1360619, 1379871, 1399433, 1420576, 1443499, 1467031, 1490034, 1512417, 1534235, 1554471, 1571863, 1587044, 1602756, 1621220, 1641811, 1661866, 1679384, 1694205, 1706950, 1717901, 1727228, 1735519, 1743318, 1750311, 1755451, 1757962]
49983A757962O7j527k454l512n419q186j0947j2582j2558j1341j0081r937j1358
49970A658127j3705j5648j6346j6232j6202j6181j5104j2598r873q337p771o714
49958A503416m468k011q01j310k701l479k400N20L774N841O905Q352J0531J2187
49944A534356J2585J2970J4881J8023K0968K3253K5432K7402K8276K7898K7199
49933A773243K6694K5683K3352J9811J5635J1105O413K099j108k799l258l510
49921A893360m557o007o160m507l498o244j2617j9457k4782k9829l6152m2615
49909A696935m6826m8200m8107m7689m7019m5952m4435m2187l9096l5785l2915
49898A218724l0313k7564k5000k3192k1858k0362j8909j8189j7958j7215j5801
$$ y = [1757962, 1758029, 1756502, 1754048, 1750536, 1745117, 1736931, 1725984, 1713402, 1700844, 1689503, 1679422, 1669485, 1658127, 1644422, 1628774, 1612428, 1596196, 1579994, 1563813, 1548709, 1536111, 1526238, 1517901, 1510130, 1503416, 1498948, 1496937, 1496136, 1494826, 1492125, 1488646, 1486246, 1486766, 1490540, 1496381, 1503286, 1511638, 1522169, 1534356, 1546941, 1559911, 1574792, 1592815, 1613783, 1637036, 1662468, 1689870, 1718146, 1746044, 1773243, 1799937, 1825620, 1848972, 1868783, 1884418, 1895523, 1901936, 1904035, 1902927, 1900128, 1896870, 1893360, 1888803, 1882796, 1876636, 1872129, 1868631, 1862387, 1849770, 1830313, 1805531, 1775702, 1739550, 1696935, 1650109, 1601909, 1553802, 1506113, 1459094, 1413142, 1368707, 1326520, 1287424, 1251639, 1218724, 1188411, 1160847, 1135847, 1112655, 1090797, 1070435, 1051526, 1033337, 1015379, 998164, 982363]
$$ [...]
##END NTUPLES=NMR SPECTRUM
##END=
