
##TITLE=AC1173_Tolima-ibage-TDOAH12007_7165805_ORvyc2jwbm
##JCAMPDX= 6.0         $$ Bruker NMR JCAMP-DX V2.0
##DATA TYPE= NMR SPECTRUM
##DATA CLASS= NTUPLES
##ORIGIN= BRUKER
##OWNER= Administrator
$$ 1.72 TOPSPIN		Version 2.1
$$ 2012-12-01 23:40:05.218 -0500  Administrator@X
$$ Compression mode = diff/dup
##.OBSERVE FREQUENCY= 400.02188249412
##.OBSERVE NUCLEUS= ^1H
##.ACQUISITION MODE= SIMULTANEOUS (DQD)
##.ACQUISITION SCHEME= undefined
##.AVERAGES= 8
##.DIGITISER RES= 22
##SPECTROMETER/DATA SYSTEM= spect
##.PULSE SEQUENCE= zg30
##.SOLVENT NAME= COFFEE_meoh
##.SHIFT REFERENCE= INTERNAL, COFFEE_meoh, 1, 14.98509
##AUDIT TRAIL= $$ (NUMBER, WHEN, WHO, WHERE, PROCESS, VERSION, WHAT)
$$ ##TITLE= Audit trail, TOPSPIN		Version 2.1
$$ ##JCAMPDX= 5.01
$$ ##ORIGIN= Bruker BioSpin GmbH
$$ ##OWNER= Administrator
$$ $$ E:\/data/COFFEE/nmr/AC1173_Tolima-ibage-TDOAH12007_7165805_ORvyc2jwbm/10/pdata/1/auditp.txt
$$ ##AUDIT TRAIL=  $$ (NUMBER, WHEN, WHO, WHERE, PROCESS, VERSION, WHAT)
(   1,<2012-12-01 23:39:56.874 -0500>,<Administrator>,<X>,<go>,<TOPSPIN 2.1>,
      <created by zg
	started at 2012-12-01 23:38:50.312 -0500,
	POWCHK enabled, PULCHK disabled,
       configuration hash MD5:
       86 BA 57 50 F2 9D 5C 9B 26 00 A9 28 5F 66 2E 89
       data hash MD5: 64K
       38 D2 CB 50 1F 5D 18 3E 59 D2 91 AA 54 EE F8 85>)
(   2,<2012-12-01 23:39:59.999 -0500>,<Administrator>,<X>,<proc1d>,<TOPSPIN 2.1>,
      <Start of raw data processing
       efp LB = 0 FT_mod = 6 PKNL = 1 PHC0 = 0 PHC1 = 0 SI = 32K 
       data hash MD5: 32K
       3A 11 B2 41 26 D9 B3 5C ED 3B 82 02 65 47 39 78>)
(   3,<2012-12-01 23:40:00.453 -0500>,<Administrator>,<X>,<proc1d>,<TOPSPIN 2.1>,
      <pk PHC0 = 97.69043 PHC1 = 0 
       data hash MD5: 32K
       9F 8E CE E7 24 87 70 CD 28 B2 00 3F A1 BB 61 39>)
(   4,<2012-12-01 23:40:00.687 -0500>,<Administrator>,<X>,<proc1d>,<TOPSPIN 2.1>,
      <abs ABSG = 1 
       data hash MD5: 32K
       E3 76 BD 3C 32 0C 20 CB A5 0C 1C 3A D6 80 FC 00>)
(   5,<2012-12-01 23:40:00.874 -0500>,<Administrator>,<X>,<proc1d>,<TOPSPIN 2.1>,
      <abs ABSG = 2 
       data hash MD5: 32K
       3C 0F E0 E1 73 06 9B 2B 89 EC 57 3C 35 0E 81 A3>)
(   6,<2012-12-01 23:40:01.031 -0500>,<Administrator>,<X>,<proc1d>,<TOPSPIN 2.1>,
      <abs ABSG = 3 
       data hash MD5: 32K
       21 5E 8F 55 21 E5 EF FD 7A 7B 6D 19 EF 8E 26 1B>)
(   7,<2012-12-01 23:40:01.171 -0500>,<Administrator>,<X>,<proc1d>,<TOPSPIN 2.1>,
      <abs ABSG = 4 
       data hash MD5: 32K
       2A 85 25 13 EC 16 23 64 E0 4B 6E 2D 42 D9 78 CC>)
(   8,<2012-12-01 23:40:01.343 -0500>,<Administrator>,<X>,<proc1d>,<TOPSPIN 2.1>,
      <abs ABSG = 5 
       data hash MD5: 32K
       06 D1 10 6B 15 D1 C3 12 DB 77 ED 3D 0C 2D DD 36>)
$$ ##END=
$$ 
$$ $$ hash MD5
$$ $$ 05 A3 98 3D 04 14 49 D5 3C DB 8D 7C 7B EC 06 8D
##$RELAX= 
##$RELAX= 
##$RELAX= 
##$RELAX= 
##$RELAX= 
##$RELAX= 
##$RELAX= 
$$ Bruker specific parameters
$$ --------------------------
##$DU= <E:\>
##$EXPNO= 10
$$ [...]
150 150 150 150 150 150 150 150
##$TP07= 0
##$TPNAME0= <>
##$TPNAME1= <>
##$TPNAME2= <>
##$TPNAME3= <>
##$TPNAME4= <>
##$TPNAME5= <>
##$TPNAME6= <>
##$TPNAME7= <>
##$TPOAL= (0..7)
0.5 0.5 0.5 0.5 0.5 0.5 0.5 0.5
##$TPOFFS= (0..7)
0 0 0 0 0 0 0 0
##$TUNHIN= 0
##$TUNHOUT= 0
##$TUNXOUT= 0
##$USERA1= <user>
##$USERA2= <user>
##$USERA3= <user>
##$USERA4= <user>
##$USERA5= <user>
##$V9= 5
##$VALIST= <valist>
##$VCLIST= <CCCCCCCCCCCCCCC>
##$VD= 0
##$VDLIST= <DDDDDDDDDDDDDDD>
##$VPLIST= <PPPPPPPPPPPPPPP>
##$VTLIST= <TTTTTTTTTTTTTTT>
##$WBST= 1024
##$WBSW= 4
##$XGAIN= (0..3)
0 0 0 0
##$XL= 0
##$YL= 0
##$YMAX_a= 679895
##$YMIN_a= -578620
##$ZGOPTNS= <>
##$ZL1= 120
##$ZL2= 120
##$ZL3= 120
##$ZL4= 120
##$ABSF1= 14.98509
##$ABSF2= -5.573092
##$ABSG= 5
##$ABSL= 3
##$ALPHA= 0
##$AQORDER= 0
##$ASSFAC= 0
##$ASSFACI= 0
##$ASSFACX= 0
##$ASSWID= 0
##$AUNMP= <proc_prof1d_extract_pilot.lims>
##$AXLEFT= 0
##$AXNAME= <>
##$AXNUC= <1H>
##$AXRIGHT= 0
##$AXTYPE= 0
##$AXUNIT= <>
##$AZFE= 0.1
##$AZFW= 0.1
##$BCFW= 0
##$BC_mod= 0
##$BYTORDP= 0
##$COROFFS= 0
##$CY= 15
##$DATMOD= 1
##$DC= 0
##$DFILT= <>
##$DTYPP= 0
##$F1P= 0
##$F2P= 0
##$FCOR= 0.5
##$FTSIZE= 32768
##$FT_mod= 6
##$GAMMA= 0
##$GB= 0
##$INTBC= 1
##$INTSCL= 1
##$ISEN= 128
##$LB= 0
##$LEV0= 0
##$LPBIN= 0
##$MAXI= 10000
##$MC2= 0
##$MEAN= 0
##$ME_mod= 0
##$MI= 0
##$NCOEF= 0
##$NC_proc= -8
##$NLEV= 6
##$NOISF1= 0
##$NOISF2= 0
##$NSP= 0
##$NTH_PI= 0
##$NZP= 0
##$OFFSET= 14.98509
##$PC= 1
##$PHC0= 97.69043
##$PHC1= 0
##$PH_mod= 1
##$PKNL= yes
##$PPARMOD= 0
##$PPDIAG= 0
##$PPIPTYP= 0
##$PPMPNUM= 2147483647
##$PPRESOL= 1
##$PSCAL= 4
##$PSIGN= 0
##$PYNMP= <proc.py>
##$REVERSE= no
##$SF= 400.02
##$SI= 32768
##$SIGF1= 0
##$SIGF2= 0
##$SINO= 400
##$SIOLD= 32768
##$SPECTYP= <>
##$SREGLST= <1H.CDCl3>
##$SSB= 0
##$STSI= 32768
##$STSR= 0
##$SW_p= 8223.68421052631
##$SYMM= 0
##$S_DEV= 0
##$TDeff= 65536
##$TDoff= 0
##$TI= <>
##$TILT= no
##$TM1= 0
##$TM2= 0
##$TOPLEV= 0
##$USERP1= <user>
##$USERP2= <user>
##$USERP3= <user>
##$USERP4= <user>
##$USERP5= <user>
##$WDW= 1
##$XDIM= 32768
##$YMAX_p= 470911881
##$YMIN_p= -722844
##$CURPLOT= <Network HP LaserJet P1505>
##$CURPRIN= <$Network HP LaserJet P1505>
##$DFORMAT= <normdp>
##$LAYOUT= <+/1D_H.xwp>
##$LFORMAT= <normlp>
##$PFORMAT= <normpl>
##$SURQMSG= 1
$$ End of Bruker specific parameters
$$ ---------------------------------
##NTUPLES= NMR SPECTRUM
##VAR_NAME=  FREQUENCY,     SPECTRUM/REAL,   SPECTRUM/IMAG
##SYMBOL=    X,             R,               I
##VAR_TYPE=  INDEPENDENT,   DEPENDENT,       DEPENDENT
##VAR_FORM=  AFFN,          ASDF,            ASDF
##VAR_DIM=   32768,         32768,           32768
##UNITS=     HZ,            ARBITRARY UNITS, ARBITRARY UNITS
##FACTOR=    0.250966925370066, 1,           1
##FIRST=     8223.43324360094, -16496,       -105837
##LAST=      0,             45008,           -60908
##MIN=       0,             -722844,         0
##MAX=       8223.43324360094, 470911881,    0
$$ Real data points
##PAGE= N=1
##DATA TABLE= (X++(R..R)), XYDATA
$$ [...]
23809 230866 -116316 94481 -100013 210213 -155215 -25016 -76946 87773 -129353 -150614
23799 -150614 235837 -344392 -183588 -80706 407963 155852 125605 -423707 -174816 181556
23788 32431 -146911 -85664 -256594 -77610 86283 -431757 36941 -209882 -95574 -34095 27719
23776 181171 -91032 -357593 -205726 -115368 -133247 31397 -13324 -97312 215855 150193 -5592
23764 -176989 -30055 -90802 -17129 -272853 -75846 -469510 425005 163223 -36717 161963
23753 24220 53126 98207 -116334 -63827 -125853 -13081 -224454 416448 136921 142953 -209864
23741 54420 -333812 -240205 222410 -114912 69854 -202343 -52930 99344 -196408 -249931 -99777
23729 114420 -40011 -273679 -99477 124860 -228836 -98601 196620 188931 179403 -40951 -125942
23718 -125942 96005 -18859 127464 -23132 35483 116340 -148278 -213738 207241 -137057 126923
23706 123441 -20664 -183986 1480 193043 -104062 -143850 120955 -138379 -25458 136611
23695 129687 37672 -47225 -79716 276292 12407 -15294 -22714 -202262 -154697 -512047 -241370
23683 -64580 119873 318610 308067 129217 290385 -352237 -281491 -16032 95494 215076
23673 215076 -119653 245242 21065 22439 51630 -96876 -149502 -320065 -137837 100520 259149
23662 259149 353274 122149 198875 87157 29639 -219800 106713 17083 -110636 102228
23651 -110845 -135360 -7119 -160651 -136225 -122673 202076 -152639 -47438 -283981 104871 43372
23639 -172880 -260324 389880 37930 127460 88225 335967 -112029 482244 -85776 240536
23628 -196116 122165 -118277 796971 -89427 -16099 347475 -110769 54805 -66642 12638
23617 -77327 146028 -138386 -18399 138191 -101846 -271910 55057 106064 5411 -181141 -187892
23606 -187892 159648 267119 69231 -122967 -105666 -427106 165360 -93624 16589 127463
23596 127463 -160689 -318304 -48500 306193 -15962 -37031 2795 30396 94356 192975 122877
23585 122877 -6029 -59019 -282161 -16477 68009 81524 579303 -198273 109450 51332 -12061
23573 -169766 27766 -12637 -35541 -155875 79894 -193790 58384 365997 -79108 -163826 -133456
23562 -133456 197980 150223 298396 -11734 74756 -359584 -30965 -97651 91907 323135 -284987
23550 -444157 41524 -74681 95167 34013 -236346 -133433 -213202 218005 -223747 -87481 258870
23538 -46126 -92439 -224099 43123 -295451 14585 -151366 29501 62761 -299341 -283333 -93469
23526 -45670 -72747 -83189 -103969 -34051 213403 207905 126189 34996 -286591 20482 -98720
23514 306532 114825 378287 -54935 101562 -184734 -138773 -227007 224225 89581 -247550
23503 -75955 1170 -113984 58645 -253434 -445981 -10142 -204389 -323161 183155 178304 43242
23491 -255261 53602 -234219 -330640 -70767 359964 116620 -160983 -322790 130052 -49406
23480 41273 -65507 -179684 42862 15171 39070 10190 163034 260772 68584 -36734 46984
23468 -270598 -21899 -96953 136597 65091 114173 170166 178169 -44937 -26376 -39712 -131848
23457 -131848 -176258 -68294 -427747 37962 46863 -73583 -95006 -34968 -12418 211557 20146
23445 -17063 -202325 -143279 -106734 -211174 -233184 67565 148220 -191535 2579 23225 160292
23434 160292 -34001 -261370 -65838 -79155 200385 -221191 101370 -81147 67038 230542
23424 230542 -168814 -298443 27804 -50658 -310078 194942 65340 214769 -104074 223107
23413 248519 -316917 -306629 -110721 -161841 71747 34778 -18068 20845 52872 -126651 -764
23401 94002 -11771 47325 161778 -10073 -34727 130495 61289 208430 -214963 48016 117893
23390 117893 -201319 329145 205779 68740 230530 -31151 -151279 216262 -382576 71410
23379 40945 -45957 -114988 194101 92372 250568 -75201 -61786 -113344 -26105 167396 71092
23367 122325 209059 -64079 37531 195269 87924 -149203 309152 16865 75959 -17036 54100
23355 -284974 29573 370553 273500 -458318 172043 -309257 107389 -16570 108944 297245
23345 297245 -276126 33516 -76770 -84034 -264642 105835 -183184 21686 -151729 -308203
23335 -308203 -39286 294323 203002 100528 -245391 -353088 -172075 62463 -216652 55943
23324 -69008 -67710 76241 81802 -275707 -157780 -142397 -157388 -95907 -82425 18395 -86419 254377
23311 202358 -63838 -128580 -122659 -283652 -220972 -228563 285597 31949 -231138 -38419 224602
23299 34139 -74197 -272935 -213880 -321245 80757 44810 182548 20663 51561 83955 220194
23288 220194 -41148 -18898 -309020 16504 -178085 236661 3711 155316 -328256 18486 106511
23277 106511 24694 349755 -100716 113719 -15200 -280296 -146094 257923 233055 53794
23266 -165441 76684 51603 -105375 43458 349151 149118 -387090 -206916 -127124 -21149
23255 8967 -70223 48513 -38704 14071 -162075 -28871 237723 26945 146334 -136738 191997
23243 320816 25508 -26611 2497 116183 2853 89353 -94075 209827 160777 76786 -71754
23231 -190547 175896 61485 9313 130130 -169597 -39417 -47961 -191338 -188719 88568 99845
23220 99845 -91755 -67785 -280993 286066 157918 153878 75231 185895 -41838 -64613 402824
23208 -501192 -39684 -117253 -232870 -291292 45881 126374 84605 -236840 -161507 -53885 -101513
23197 -101513 148775 -111824 270817 200348 -269347 -91631 -77261 -101567 83645 17026 -245307
23185 -47553 85955 -365278 -156990 149962 81494 20032 -19372 68998 179212 -2628 104461
23173 -278214 -113502 112001 -210087 -262071 -256158 -48153 147252 -198011 -69665 -99915 -242061
23162 -242061 -266467 8157 -55133 -237160 -5313 -242164 48839 -102062 21547 291340 -172272
23150 51082 -127692 -202741 -88402 64817 66681 -63782 -22992 472949 -287957 -319740 -71220
23138 283706 -184623 -207024 -106730 122322 282462 25884 50091 -70422 -189744 -396527
23128 -396527 59453 229035 123592 -37907 -198494 -189184 384732 168695 104637 180718 197563
23117 197563 14214 -30848 -35315 263970 122379 -225271 -50269 24175 58806 119952 27969
23105 93314 -64274 -266309 94355 -182595 -419439 32547 -48228 109508 11125 -102304 151533
23093 -124088 -195081 173111 -75573 -14374 91490 14881 104958 -116140 278751 247095 155696
23082 155696 -131135 -213908 -266064 44378 -11036 -173210 -174662 -167334 -353812 -278155 44253
23070 77392 -161526 -28608 176734 -132204 -45731 57421 246449 150994 153891 205226 -34897
23058 -169815 208484 -188373 -168645 -100860 225057 9791 -125500 2486 230570 -173597 195632
23046 -62460 1016 151754 329838 -147705 -109740 -99405 18446 -145842 -4084 64873 1803
23034 -359703 -9754 104873 -53009 -65266 37398 -145829 92409 -46973 -159136 158280 -104564
23022 140158 62609 -253086 135597 -101722 -31204 123956 -327675 -61804 -24335 41114
23011 -161545 133921 90365 69214 -261962 -458772 84516 -182414 85335 -77574 35230 229319
23000 229319 118146 -80321 -334901 -139973 -411009 165830 -132045 53474 -56023 48239
22989 37789 -292510 275507 -160832 95525 115596 82649 -421572 -129288 -96803 88487 258954
22978 258954 -9151 57286 18442 -163699 -180635 181953 -92104 -20707 -227829 -131892 -13496
22966 -299376 -180638 -161508 51615 21991 121938 -338237 155968 -95791 -131452 -190759 -115796
22955 -115796 -12281 126464 -124748 -205611 -81062 21263 -244690 88799 -165404 40398 -32322
22943 210323 42057 141800 -16632 155386 46918 -92329 -22928 -93153 205114 71001 -168142
22931 170984 131906 -23028 -33762 -33415 247212 228000 -84796 -163649 -55855 158120 -166694
22919 197626 -193644 57130 -53164 -246422 -110532 -338655 -291057 222090 -126318 41570
22908 290685 8280 95599 -195876 9995 -242518 -103739 73989 -121005 10946 142702 -86966
22896 4458 -38805 29424 -16930 -287491 18220 -27756 -76564 -17496 25699 -82165 236148
22884 -95188 61856 43302 -165866 -274980 96710 408280 140621 -280610 46758 -116874
22873 -120165 -158847 141878 197186 -6581 -326946 -52375 -8020 -58814 -230919 176576 -252418
22861 -13057 121441 -21207 103829 -94081 -62140 -140808 65004 96559 225393 117738 235344
22850 235344 176147 157536 -84624 10036 -263923 85792 -128196 -102856 185052 -23077 -103816
22839 -103816 -19231 48482 137999 -162893 -39114 -155851 279578 8515 -214480 -263298 -178164
22828 -178164 52169 -200634 146882 97240 20553 -66586 -417982 -352133 -5215 -119487 -181586
22817 -181586 259730 -236303 50066 -204408 80478 -60991 22239 -205977 33867 -822 98690
22805 -244664 241312 -60687 105077 233228 -217272 -59496 151957 20089 -270022 -140891
22795 -140891 9352 -385078 -140202 -17966 -394176 -45639 97705 -300195 -169002 -145113 86297
22783 23195 -172948 230912 90434 -87669 -88899 199080 -94000 -132508 -210526 30005 -124146
22771 76633 69025 21263 -26067 -20684 114097 -318184 -144810 27371 -269578 -449259 150668
22759 40255 108166 -155913 -184428 -17389 -19800 33091 -73135 -172328 371115 639862 -3409
22747 -316001 51011 58334 -175842 259342 -146963 -82121 -163840 95334 -19609 -51398 74988
22735 43299 28555 -182884 32463 -476075 -70899 -11482 -408298 -180976 -188345 -112519 -180248
22724 -180248 -253868 -24265 -191520 136383 188676 248401 -75340 -4821 -117353 115092 237823
22713 237823 -91948 -70322 -137318 -114955 195051 -315102 -37731 280200 49721 -395208 -6670
22701 217421 16825 -194093 -96657 98959 -94798 211069 220257 51257 -129989 209086 163694
22690 163694 16838 174774 -244215 -64144 -182211 -70505 -103164 28260 -66674 93168 286828
22679 286828 -149466 -80790 -32039 235016 -62051 127482 -14056 -196171 6778 -72073 -13740
22667 47139 -214607 -241993 -59270 -58055 180 -117642 -100399 -197661 16482 157921 -199097
22655 -488677 248574 -113777 -166497 -147918 310648 -69024 -114068 -141096 -231114 172516 -186962
22643 -271668 -43116 -327610 40104 117412 -72817 34507 -76374 50507 364386 -78947 23682
22631 -203093 110855 -77315 113262 -161510 -460578 -222102 -162201 -163862 70603 -54024 27399
22619 -304885 -401605 -317446 208262 -149963 -104877 -89462 -95826 -38978 -136227 -142014 -376135
22608 -376135 -62768 333445 141411 63341 5775 -99402 -201922 75195 15908 -258797 -148389
22597 -148389 172159 -223978 351892 -139253 -169243 100591 60048 23983 84600 70202
22587 70202 56843 -81902 153633 62476 -102574 319332 80978 236228 326582 -118416 -47584
22575 -277708 -140279 173040 94585 172555 -148203 114637 -36985 59747 183808 -200201
22564 59207 93155 -62913 81117 168488 274436 19686 -42977 348216 511629 1192 -128942
22552 -53707 17389 54509 -59806 -6894 110280 54291 -9060 101096 188202 -215603 107615
22540 64391 13250 -12054 120793 27940 -424111 26628 159606 235252 -340955 -186818 7877
22528 -69465 276669 28970 -198118 -159262 88857 118670 -2719 -251930 27668 113047 107104
22517 107104 -144140 163143 133934 90468 -259172 -77485 209706 138013 200938 22658 -189133
22505 73824 -106347 -24950 -285428 184044 -326570 -137826 -395906 -94589 112699 -248168
22494 399384 235616 142353 -261762 -363549 262770 -175898 -253018 108171 93344 -351382
22483 -50676 125937 -257886 65460 -187584 100005 -166732 -417190 -39583 -43659 -253053
22473 -253053 155464 238340 28433 -245703 -3570 -154961 294240 -67740 -65096 18136 -64677
22461 125346 -134706 38501 -6090 -117979 9032 -95811 -18351 78668 208913 -195823 -42526
22449 162611 -142573 -138344 -350683 32362 -144029 -200344 244922 -261743 171483 162004 148397
22438 148397 -251031 80730 57236 31820 -184055 -13344 -139283 -118746 -99568 -244421 -107811
22426 52635 -135224 -305576 259766 51680 -84945 -46336 213512 -18174 11723 -22053 -189982
22415 -189982 -259313 -338045 -326883 178622 -280666 126367 -169604 -175776 -43745 -163173 -357882
22404 -357882 150309 -163649 -251764 -128618 -385368 188882 -19040 -281172 -78445 -84890
22394 -84890 152273 -67471 29777 250068 9566 154002 -21162 325433 25461 -77157 -90268
22383 -90268 -344269 292616 -192274 105442 173808 179174 -186827 -133003 -314207 -116301
22372 -87078 -88738 -72342 -297913 3645 102816 -265005 -14457 3828 -374190 115086 389037
22361 389037 180672 -224430 -209019 29870 -86943 -259208 -124540 -116702 249656 39547 92493
22350 92493 -229054 -145146 -76009 -187681 -125274 -156920 165519 174684 19880 -246518 -280240
22339 -280240 160677 -36461 98390 -360665 41568 212067 -142953 -141321 33952 -48444 -163665
22328 -163665 130879 220522 55203 229338 205178 109769 -276866 -61510 -30439 -10331 237871
22316 -108243 -209907 245440 -260716 2505 23248 -215604 -138574 -116730 -7889 -313597 -292165
22305 -292165 -193983 90535 -35120 -34944 122960 -216266 243285 203339 -215848 127452 -103677
22293 -140108 -107452 165438 13062 300980 31837 246223 -200061 118837 -428067 172558
22282 -170418 177332 75157 256630 -244507 -27526 -228263 123386 119739 -215150 92958
22271 -277434 -229350 -143561 -53657 -81355 -26521 110578 -52608 -117386 -34805 -61427 56653
22259 184699 65680 -477858 104055 -42521 156652 144241 -38855 -163963 112015 109832 110133
22248 110133 -77838 39774 -557874 -184218 124321 -39407 -353201 90475 54823 -139853
22237 -109364 -52870 -329856 -48473 29625 -121039 92041 -18128 6041 41960 -115434 -3497
22225 24219 -98028 74072 219308 -50889 -67644 25075 105410 -285572 104976 75553 -104769
22213 345658 151637 -313738 314939 45674 11514 -309761 -449716 22711 -5553 20623 -9255
22201 97990 39463 10118 7796 286186 1553 -64860 -296386 -37448 113488 -198925 -87490
22189 -53932 16391 71828 37094 167952 -359403 191933 246010 -56648 -111088 80262 -297285
22177 40046 -73594 -92006 -405433 -56733 165140 -215509 225174 -50647 121002 -193165
22166 -98782 -169701 -78393 -157112 -42800 -58147 118105 -21453 -155244 130086 -89930 9331
22154 -191732 8021 -233526 -8308 76272 67334 -13981 47488 196867 -30470 -503137 -33331
22142 79453 172583 -208974 -105260 138215 -26433 -34933 -205033 168552 -1972 -1732 5142 58013
22130 58013 -199799 31743 32396 -242989 120921 -225393 -12829 66198 -163321 -14917 -132955
22119 -132955 -179991 339570 111075 -88062 -169522 186907 -40108 16397 -111420 -80753 61566
22107 210785 -154515 -255606 -103030 -63297 -128396 176808 84978 -59432 7115 -65378 234248
22095 -409017 -96635 -21779 -101925 -91990 -128497 -295807 -74159 -148587 129945 -106826 50066
22083 226785 59789 80013 165369 -272188 -126862 -221103 187630 -148941 -104982 -84048 22813
22071 -52579 165601 -196351 140232 36527 -14620 -51411 -39915 -109208 -286329 -281580 -152674
22060 -152674 -210523 268482 322146 -13098 180457 -223558 163207 -167489 69282 92896
22050 92896 -119157 -290284 -120445 60324 240421 -190265 -164978 48736 -173773 44005
22039 69775 -49036 -269986 -200090 -231055 -81932 -187348 232813 -174069 53563 -89637 56679
22027 56047 389551 -79092 -54929 -217239 89322 -81858 -368259 54302 32817 310695 -29661
22015 -23703 202453 -148791 -88931 142643 -22362 -15362 -60571 -177193 115730 -72829 -385417
22004 -385417 108800 -176297 25414 143649 -20464 -5550 8746 52397 -307976 -285185 221661
21992 -239810 78058 -278043 45705 -86654 -286346 -154822 237976 32045 -38569 99853 -57659
21980 49584 -402037 -130017 -397679 153263 57008 -291271 444752 -182174 -214942 -97278
21969 146326 -99846 137642 -26329 52245 -61062 -240600 -84045 251048 237961 -163099 -99125
21958 -99125 -307612 -79181 -4207 170260 57382 -377912 -340044 111143 156577 210288 10674
21946 110251 -216956 -186015 -177775 95224 189987 169557 -299204 -178949 -66843 -63498 -161785
21935 -161785 -23848 -15825 -135749 -158651 -341473 -235885 118828 80400 124990 131500 -90550
21923 -32344 -429098 -70685 -98268 200293 42216 -348266 181536 131562 -48714 -311754 -46724
21911 -6165 75438 -430577 34146 -111664 -258194 110246 -97957 -91358 39138 -300767 300395
21899 223995 61178 63658 59202 -53125 278073 -209942 -44817 -53661 16773 -296348 122802
21887 -69155 22833 -2761 -232558 -180930 -315073 -241600 -85021 156820 -353513 -52152 -193884
21876 -193884 48008 -154099 142457 373451 -198049 -352932 48393 58367 -149472 -13988
21865 -124839 -360330 -322524 -198036 -321588 -1112 -45953 -58949 91459 -140040 182030 66366
21853 420393 -56087 9618 -111595 -94577 149923 -275190 -28044 71362 -466 -414877 262039
21841 18364 71948 -217585 87912 426782 -137503 -156172 -11270 -36511 -155823 74135 17989
21829 78616 -328255 5611 -15767 -165719 -254824 89410 -54761 99927 -135761 -313320 88481
21817 291199 -23770 13758 -440987 -13912 -41823 -243935 -21319 76712 -258786 73774 -384687
21805 7842 330415 87389 -146613 137487 -44208 -81610 123018 94658 125444 -346170 -122054
21793 45568 -61820 -162586 -4631 31589 139668 118508 -161457 -377333 20201 89437 213694
21782 213694 26177 85407 -33771 -156140 -8315 -119636 -60319 -90724 -89291 20746 -130709
21770 146500 28393 -143790 -235780 -87180 14426 -175884 28710 45068 -65587 3018 4092
21759 4092 206876 140116 -37486 8391 -129565 -177555 -247703 33032 57946 110155 50611 217747
21747 217747 -158043 193493 128964 -120168 -201907 86739 -164646 69098 -197156 -298897
21737 -298897 71970 86408 39419 -264332 -10471 105990 -355444 -134565 -499943 -251168
21727 -251168 -279138 24599 -397418 -291947 -21954 -341773 -503006 -167503 -226510 -196842
21717 -196842 -125854 8308 -166818 -198374 46962 -68727 -141090 -16274 -191975 78418 -85903
21705 -291751 58773 140781 -315191 -277088 -68302 -13030 -66588 71320 37841 -177044 -197325
21694 -197325 -137217 113819 -37300 194255 -44949 191118 -140367 -346615 36974 -26856
21683 127849 26354 -127138 -58134 -320606 -431026 26109 -33381 -100556 -25065 -140868 -130081
21672 -130081 -102318 -78494 -187184 -215628 97092 388691 -208826 -238922 -31443 196233 -237809
21660 17766 262190 -426024 -41112 164954 91371 227713 -236629 -55905 173784 -55162
21649 -32354 126996 3469 137406 -339720 177858 -323324 -271098 -52902 -109203 103403 -293357
21637 -312804 -175642 146566 -56785 -118391 48900 425666 50691 195636 -32119 -81405 -386868
21626 -386868 -401663 -103769 -277076 99100 -203086 105628 -11884 -79683 355617 -20005
21615 -101098 23981 19640 -77582 32771 -156121 144962 -304721 241744 -41208 -134637 20860
21603 -96977 -184621 -196944 -140298 -213639 184208 245929 -9760 -84157 244885 358024 13595
21591 -177528 -391972 -119787 -86131 -35050 -229017 -190254 -11292 -225764 82145 -3928 -144990
21580 -144990 185851 279932 157931 -158826 -52141 -6557 -153342 -334169 -204111 73530
21569 -163381 187304 211812 26600 -217338 79459 338359 -147687 236926 87424 -121628
21558 -245143 243045 -239193 -234847 -103041 -163473 -72199 -123400 222616 -225472 71591 -10124
21546 -146542 -177191 192873 -39316 41406 -16163 -64205 -78719 74288 -77809 -164042 -98457
21535 -98457 -3134 67504 243899 44814 -140411 -312029 -223557 -236761 3124 158182 -53585
21523 24252 20534 -65671 51723 -240202 84866 -37433 -57608 -225036 -87867 98446 105150 48885
21510 86532 17443 293670 -232810 11909 184235 -33518 -148746 -180620 -253462 -69192 186805
21498 163950 -340233 -188729 -21783 -139531 -200376 -116269 -79746 109585 394748 34483
21487 -36026 37637 61531 78038 20165 -122110 -34059 181167 -167338 -32711 -19087 -189663
21476 -189663 -463806 -20430 108588 -246855 -183401 9299 -281365 -263142 -5002 -297756 34274
21464 -182436 -180832 3018 -95351 67010 -205154 -53566 -123628 -102200 -146087 -217096 -117125 139659
21451 -27938 -197587 -161749 -202454 -25960 165272 -52743 -55774 21413 -79460 -26661 -145565
21440 -145565 195545 267459 206929 531465 176347 331992 -201573 -86091 95764 126129
21430 126129 183613 -24734 98014 120943 85625 97138 -70785 -62130 127498 -34290 -18788
21419 -18788 -217029 -483739 -153173 130680 195320 -271694 -436538 -207407 42231 -121765
21408 116170 -193494 97572 -63437 99095 -173290 -164846 -304759 -378059 -120791 -202340 -75894
21396 56402 -179462 -225887 483 -252360 44893 36937 -100107 -123868 -44212 211473 178709
21385 178709 -240006 -146981 -507220 182360 155983 -401426 200049 -109239 -87668 -293080
21375 -293080 -449632 -138130 -188651 207154 -187434 3682 34888 22788 -117932 -107773 -256361
21364 -256361 -365165 41152 175232 202876 134440 -286698 -45730 -221490 -155956 -3988 -157307
21353 -157307 41364 -134822 -39649 -181940 77472 -118952 56027 28065 -89772 93949 -124713
21341 4146 99257 -102476 -140227 90898 164641 -23971 -167369 -207317 162878 162912 -270105 232980
21328 -194162 -205314 59756 -37843 13357 175914 -111492 -168206 -370556 -179811 13362 -28501
21316 75457 59863 -246462 239452 -367446 -229513 -244054 -21556 245033 -151100 -27343
21305 -147097 -168098 87344 92652 -43796 72259 131145 -446251 -93162 -151725 -183397 -190036 -135339
21293 -135339 -270113 -169333 -228985 -323422 -114336 -54749 334865 22180 92919 63107 -103804
21281 -382763 -129136 321805 -129401 3960 -209581 -38458 -571344 36094 -43080 -63885 128273
21269 178822 -60520 11259 -158916 -22500 -74900 -85721 -52024 75347 453476 -186277 -62171
21257 -20387 -834 120682 -155152 -63392 -165784 155840 20452 285999 2198 150297 201953
21246 201953 -175388 -33758 -133464 -216753 -144183 -170423 -180653 162664 -9917 -236605 -690
21234 -296325 224310 -221800 -195469 -128496 26293 56974 -170491 -54354 -155654 -177035 37799
21222 -357058 -89952 -381401 -283111 -427669 -14440 -244407 -1630 -19136 -6993 -184575 -385749
21211 -385749 163618 -61806 -138971 -232742 453437 -107589 -180541 -40698 -270673 132576
21200 59381 -110863 -386715 -199934 -175476 -89207 -26856 -143926 116293 53528 -101741
21189 7116 -199568 125133 163833 -66236 -176708 52693 249375 -140029 225745 -127806
21178 -381314 -169002 -82414 33782 37389 -16312 20507 -84434 336158 161641 -257819 -52759
21166 -47278 -275512 156747 -110628 -40526 -27820 6519 -114763 214756 -250345 -157871 -154588
21155 -154588 142901 -101482 396748 -72832 -83083 63169 -72878 -43893 -49237 -309946 -169458
21144 -169458 -101919 49267 102067 -77289 212444 -72930 -185707 -134773 343267 63324 189509
21133 189509 75650 1474 -93092 46734 12866 180942 -84774 -409536 -232044 -41142 318949
21121 -191805 -109415 242099 -162348 -248 -146712 121672 35297 -46737 -23401 -43027 46008
21109 -451765 -50140 37572 -140789 8548 -38645 -285146 -302796 57952 -180766 -35439 143578
21097 17822 -150718 50100 262173 30409 -67132 -50994 502662 118066 83855 -91533 -97728
21086 -97728 -672953 16309 -152431 181640 -79066 -180496 -6714 52198 25365 -62201 -275918
21075 -275918 93345 -161137 -65452 -86730 77850 213645 -167672 182507 60350 -22947 -186492
21064 -186492 -56022 -282084 -92916 78436 -212649 -324273 -332471 48253 -127882 -151764 -49181
21052 361702 -74947 -67640 -87846 -187466 -142912 212671 -40171 28659 -277448 -264451 63426
21040 66128 -175960 81054 92028 66560 -63816 -26145 -84212 127490 -162407 -207217 -247133
21029 -247133 -152059 202806 -166401 241576 -101972 -30942 -117991 -68152 -249978 -33322
21018 -226759 47524 -137913 134540 -88428 214644 -97148 -123064 148097 109398 57252 -127451
21006 25852 -113808 -6295 354136 -378044 -182549 -141584 -190154 75111 -153982 -206444 -335859
20995 -335859 -358406 -116022 158918 106678 181063 102617 -268166 -87069 104551 -112007
20984 -13671 -115558 339927 173513 9852 157769 473296 -434798 -156060 -45552 -221669
20974 -221669 85160 -111785 -95372 -203828 -162988 -377456 136170 -41671 -268091 -1836 76405
20962 115748 132065 -443826 -16182 -230524 -144229 -210419 -32330 -85809 -99044 213568 -41528
20950 -320238 29107 2595 -107874 -177217 -134003 -134022 -547109 -152003 4745 20344 40522 -36914
20937 -110801 -123513 -10975 35727 49321 -124095 186061 -3349 345483 -122443 -417825 352317
20925 -302164 27262 -155971 -286931 -37625 -244859 24120 -251708 -106562 -202094 95518
20914 147708 342610 208819 -155772 -91195 379014 -348061 121200 -87772 134402 -171367
20903 -65487 -177202 -397836 105710 -248195 -495043 111036 -219628 -213207 31751 155275
20893 155275 -73551 247733 -193020 72829 64626 -13841 -26044 50819 -174367 134545 37626
20881 -131779 -26907 -66070 -249404 114540 -187683 -267976 -4692 153525 -181759 14019 134933
20870 134933 -28311 -198754 255920 -269994 -102543 -275208 -174199 -127004 165570 -83493
20859 61553 -55071 -181626 -37539 -305499 -5387 -24497 29320 107979 89743 -489941 -68611
20847 -31358 236106 -51774 24631 99158 -99163 -196633 6986 -145489 103287 -11304 -132109
20836 -132109 -306632 -47179 72234 -407122 9273 88473 41601 -177502 -63183 -216718 -10123
20824 -139137 -53499 -275013 -295205 -390302 207589 19719 199521 -279081 -60488 -54372 -269317
20813 -269317 169023 -225878 -239937 -302878 217701 101492 -176978 31408 -175537 273732
20802 -93266 -78557 -423059 -189893 -153224 62428 93245 -70639 -132768 -7802 -267609 317036
20790 -49106 -55348 -26701 108820 -244716 -122171 165021 95766 -261499 57562 49773 -12635
20778 -162432 -244123 83067 66599 -154437 127211 -266394 -236580 307582 35257 168496
20768 168496 125110 -185838 -3450 33104 -241564 -107432 -106275 -259671 124406 -4834 350168
20756 -45209 -266286 264890 -132722 20805 -104422 -257957 219085 -139907 -184936 -46180
20745 -129971 -305226 -148416 -151391 -271604 4637 -107671 183109 -16925 -120299 -14707 130737
20733 -24507 118442 227396 -232288 118214 -239909 99978 17207 79004 -134218 -166938
20723 -166938 94812 -52983 -97904 -192608 -275133 -15119 -54770 45730 120970 -64555 -26469
20711 -108077 -134988 207131 97601 -197567 -8285 34566 -10874 -120419 -202015 146570 -42102
20699 -94213 -438697 -54622 45591 -67955 158554 -89833 108314 -205781 110427 301156
20689 301156 108456 6573 305052 -6470 112741 -261815 -60645 -187989 -118696 -368641 51026
20677 -54182 -498307 -10437 -28086 17756 152394 -115695 -154201 71129 -156016 -56560 -344965
20666 -344965 -18065 -65706 -170055 234287 -315125 -82084 90416 39758 -38392 25563 -213847
20654 -370044 -102657 -144337 -54715 -5204 -130942 -146970 166467 -293739 205064 299807 -268270
20642 -83705 -232492 254303 278651 -43787 13778 -57141 -374086 154962 17450 47628 177471
20631 177471 41387 -110970 200295 -182433 -16138 -290990 -6055 -263590 -43350 -146587
20621 -146587 1003 52698 73849 -60876 -186077 -289412 -141990 -392817 24007 -8968 34451
20609 25978 197819 120242 -373006 58973 -5548 -69474 -30571 -271954 92587 -126362 28404
20597 -400395 100756 -156121 -77364 -217299 98405 -65940 248463 -290881 109761 -86380
20586 -5026 271311 236935 277130 -129950 -114092 -272650 74392 138980 270941 57171 -25162
20574 105552 128126 -19972 532 -255734 33539 -3273 249176 -106504 388261 509793 -299647
20562 -341093 -86033 -52396 10670 -11877 -190184 -9827 -94788 -303276 -17157 -88113 -58347
20551 -58347 -366891 -160196 -77635 10086 38792 -35438 136733 83547 -108849 -316373 -81729
20539 135807 214587 -570043 -36800 -109470 157274 130232 403342 -172417 -134247 85433 -162645
20527 -66883 -152892 -57152 130476 -74435 -392759 -173369 -51844 -166902 85368 -72720 188268
20515 -213257 72676 -68907 128955 127732 -78055 -223812 112089 27976 -253641 -14719 94145
20503 56367 -314094 -282398 -46378 89693 26912 -81845 174819 -182761 -185265 -12878 -143828
20492 -143828 -11199 -102645 -291860 -67613 246316 -273820 -107068 -56347 -131221 -152765 -265372
20481 -265372 105039 80908 -170502 -266977 146430 -193348 -228447 125264 -300357 35689
20470 238406 13325 222363 -28936 305935 3555 49438 309309 75535 50808 97497 -85553
20458 199712 -264279 -197113 -21813 72465 462014 -25910 40739 25779 -41508 -64270 -115354
20447 -115354 138872 364395 -255262 -211985 14421 -283030 83160 26072 37689 -193112
20436 46928 -324441 -101133 85930 44464 314532 201695 -194577 14574 49870 148315 -359283
20424 11487 -189641 64392 264751 -116212 -360084 -190803 72319 -20175 -213661 29110
20413 -212874 -84536 -227504 -502158 -105877 -235812 -66712 -127600 -99235 -87372 219153
20402 214080 -182114 -188946 -142690 72229 -116882 -171565 -71631 285599 -136304 36833 -367014
20390 191761 313135 201055 -274198 -34895 -403313 -249594 186266 25524 -116851 -43489
20379 -228985 -284029 -19014 -158402 -337494 105367 -82943 -182842 41648 -90324 289966 246680
20368 246680 -61792 395807 -123535 -71059 -166549 -52366 -306623 -146749 -293636 -305456
20358 -305456 109837 121153 146755 -104816 -154717 -113954 -291840 -17593 141563 158791 -212115
20346 -103311 -102785 -226351 -94729 -198205 145305 -133417 83138 41381 -148808 -49162 64405
20334 29208 77836 -46675 -296398 -87338 -383653 137620 -134982 -247161 -250262 1206 67495
20323 67495 68495 -369702 -43566 118548 -176546 -248607 19382 151088 -592 65751 -214496
20311 -33943 75386 -99585 -330626 -231142 84125 201066 -108539 -245520 -112385 -147955 24193
20299 6109 208838 -235407 -85758 -58209 42798 -218006 6656 -202858 157314 -1516 -78113
20288 -78113 264777 115342 -79414 4032 -47006 -66829 -21956 39922 -461194 -64517 -169792
20277 -169792 88731 -59024 193998 180044 -33004 -209694 131163 241044 -112591 343115
20266 120177 92297 -43609 49955 -387819 170874 197393 -246896 -109079 229546 -50997
20255 -105368 -408597 -54353 -77650 -216287 -68535 -174246 124504 -33949 -93578 -173205 104020
20243 -688153 -187958 -351626 12505 200521 -107645 -142565 -169410 -118730 14987 -149205
20232 -265308 -62409 171996 -126674 -97204 -192087 -68129 -96051 -61209 131127 -188081 -163366
20221 -163366 -86498 -25045 18012 -239196 -127330 -28377 -145758 -195798 -77727 -199474 -315323
20210 -315323 -93111 -10717 -171258 123837 -155129 -156254 -83825 -211877 155776 -352771
20199 40692 71300 12189 -210954 20565 140908 -9264 -273025 -196166 16782 -108805 -340409
20188 -340409 -152902 -312901 2760 -214556 -414452 38997 38887 -73399 158902 -135804 241578
20176 -110366 309588 -34170 159150 -98049 28323 -24703 -1990 -295040 -69208 101146 -235622
20164 -60981 -455124 273461 -311726 68124 185846 113718 49125 -49599 -111831 -41634 59384
20152 240663 149326 -238248 235518 87625 -261673 147788 35083 -66381 -37934 -34136 146431
20140 105966 75705 253479 -109029 -271074 67298 -128155 -143135 -312415 12513 37124
20130 37124 -226693 -241786 -276306 -208285 -141711 -246256 -204855 -63753 -175049 -251459 -261211
20119 -261211 -639501 -188364 -178680 -172871 -256842 36145 -139301 45969 42459 -64697 -21943
20107 380154 82891 19748 63486 85854 -265734 12429 13786 -10697 -42227 -235972 -81767
20095 -109356 -131369 87881 147128 85709 -6935 28283 -293457 -124680 -68412 103757 -202584
20083 -320586 -235977 -99254 101501 134475 60267 -52510 107919 53265 8463 49058 -25276
20071 192112 -102340 195738 -142594 -18364 -111820 318086 -312806 -282877 -323062 -491730
20061 -491730 274363 161787 -133853 137063 131716 136975 8627 69299 -163012 -15153 55283
20049 -60248 -38858 230277 53432 -58868 205036 -190726 -53674 -186297 -46600 -180655 282579
20037 61559 147578 28141 -42273 -344307 11341 -24118 -233044 -115226 -197380 76957 -20945
20025 -183671 -126925 42675 86313 -169973 -398042 -196831 113779 -93805 -131678 -212601 -203285
20014 -203285 -253248 34682 -349914 -69449 248279 32195 -104975 -81650 -64759 142314 -54365
20002 -53268 -220135 -89065 182734 -158238 -356248 -84431 347054 -8319 -186319 -163084 -353964
19991 -353964 132664 -153226 -252299 -181078 -74960 6465 -272923 -201985 -94734 -178463 -311456
19980 -311456 61958 -45977 -117476 -105236 -29447 -278314 13964 42118 -178226 -112364 62784
19968 39075 -58664 -121884 -106807 41435 130755 -157949 278912 -42891 -515927 -140405 -69980
19956 189782 -21913 12295 334651 226817 280273 -134024 217609 -191373 -58959 131713
19945 -2737 -159750 34202 -195019 -178483 -94081 -82860 -505825 163124 -146391 83450 1213
19933 -273096 -137513 -26306 -360190 -67563 -46768 24342 103387 -33576 -69054 -101045 121235
19921 -60044 -116369 87444 106403 -159220 20638 231155 -138493 191953 -136489 -318106
19911 -318106 -264548 21119 3900 -78150 31470 -185744 114942 112903 322903 -120940 -10218
19899 154894 -82471 -73694 -200797 80794 -392923 -90015 -185094 -307660 343775 -269420 241066
19887 -75216 -85409 -56091 330550 -181077 -211632 -42724 8743 -116095 160171 -125294 22123
19875 -464704 -125755 249462 -324494 354828 -107445 -115476 -318162 48474 -264366 -9438
19864 -140832 -192832 146259 -38077 31313 155582 -43406 -81871 -100994 99581 -169184 142415
19852 48975 -144541 77007 -309842 -353097 44982 -228323 96069 261102 -5638 -174016 -95716
19841 -95716 15780 62641 -240100 -197051 -349450 -241886 -452405 -194094 -174121 22890 -56247
19829 -274734 -77622 -110365 698 244427 122680 -310309 -27247 45352 90963 -376659 106208
19817 65681 -144571 45346 -232927 -105680 -335133 18421 -160959 -95398 -64937 -64257 -176096
19806 -176096 -106408 -175061 -96112 -26318 193605 27844 137144 -349232 13589 -93813 135052
19794 -209511 139879 37175 72072 -197094 -205984 -23681 -100400 124011 260041 -119370 -44131
19782 38078 -125383 -76649 35290 111718 -166565 53763 -235765 137237 88079 -335636 108987
19770 -559527 -22137 -331853 -65307 118207 270870 62130 -182047 -13688 236825 92793
19759 -87909 70471 -264419 130357 152751 -188943 93503 -281217 113281 81116 265438
19749 265438 -24385 -32402 157966 -122888 -134527 -40076 1252 -100701 -306556 86938 -176047
19737 -122381 79248 -86486 -72484 -121465 -191284 -21101 -62422 30581 -116004 -389296 -33662
19725 -175370 -143726 50714 127645 -26897 -180945 -226565 -246351 -134090 38442 -195663 -492240
19714 -492240 -165136 -136566 241698 48689 -42619 -53770 -190539 12401 89114 -291875 231348
19702 -151270 192880 388468 64654 66891 -185132 -31413 114474 -41780 375580 -276008
19691 -82976 80538 -76052 -31132 -409734 -40904 203723 -244474 -451562 -141363 -195280 -223834
19680 -223834 38276 -223812 -258758 -377340 448415 8379 -358181 -246963 394616 -18599
19669 149687 -215902 -147206 263106 240451 264460 -69432 -480762 -353235 77931 -134504
19658 -50392 -114393 152043 132417 -105181 72052 -33376 -66913 -293985 -224285 -106429 -430476
19647 -430476 -69273 -253168 58410 -469590 -54925 -50130 65366 214863 -120000 -174547 160576
19635 98575 -116223 32492 -126573 21484 -14381 110952 -238852 -33390 -155370 -126982 -82275
19624 -82275 -92766 -109598 -288670 -80359 86201 21875 126241 127593 -76307 60124 -95582
19612 -153341 -195868 -12986 -10731 -289501 66684 -119764 -306437 -77675 -44591 -352166 89575
19600 -415129 109696 129934 181139 -50624 -308005 212961 -363678 65927 -268037 -83678
19589 234795 -293548 86902 -374504 -211590 -155252 -260442 163170 -121507 68659 54479
19579 54479 -81727 -452415 -284565 -161161 -6025 373771 -16758 257565 -9383 -118085 228066
19567 80161 -249104 -75778 20669 116795 -467122 -72042 -23298 -53924 16081 -204203 -43031
19555 354891 108806 -74672 -49737 -370686 311039 -65209 -19850 194406 -104878 72851
19544 -383002 -222684 -116547 53617 -251551 -211780 -219479 -488334 147367 -110791 -122971
19534 -122971 -422142 111181 117927 258088 82932 -30958 -134362 -49154 -58903 118409 -78480
19522 -173090 12376 -98909 -123348 104983 206057 -258496 -15296 123208 88643 -137902
19511 53701 85305 -41954 -163119 232825 -116902 -25640 -84350 204538 46261 -84071 155842
19499 -210166 -81571 -57329 -153588 -330242 -274289 -212956 74180 -248692 -116779 14387 -221110
19487 118700 -37059 165642 77377 62387 -6523 80459 -142825 -44625 -135834 -84598 -106801
19476 -106801 -83994 31172 -40398 -108777 34086 229234 -348451 -133842 -168878 -38727 -35074
19465 -35074 23628 186081 -17499 13052 260222 -273130 -234019 -69963 83278 -112853 -30561
19453 -112379 -350525 -364425 -142161 -219832 216208 -355336 -181871 -98316 -161991 -286719
19443 -286719 -41318 -221280 112563 54938 143481 -127026 272767 272839 136778 61272 -65991
19431 -428177 -108980 -17263 75116 37777 -66306 -100053 -91645 -347846 -206007 62749 -97844
19419 -88420 84552 -23664 -33737 -149269 117710 25740 -183393 148431 -50141 83019 -130783
19407 115731 16457 -14722 -202835 121303 97745 47944 -269298 -4822 -183741 -323235 198335
19395 100057 117056 -480340 -129695 252996 -13569 -175649 -12591 -117687 -358510 -16775
19384 128789 46711 14103 -455636 -258109 -8006 119406 -196426 -4464 447420 93863 -402857
19372 390585 -194419 180591 -256566 -93149 -40652 -74061 -58183 160574 -293876 -282876
19362 -282876 -35753 -446689 145918 -223594 -439963 -228690 -95524 -110168 -141798 133089
19351 8975 -93600 -18448 -348655 22086 -126470 17137 73097 -303819 27290 -83451 -151535
19340 -151535 -118584 -251009 -326284 113809 -232672 146063 -48603 -302679 -131212 -86909
19330 -86909 43953 9861 -34214 61449 81224 38628 181281 249309 -28441 116204 -215927
19318 26169 -138941 -393852 -323280 104914 -235049 -293035 -323597 -254139 -49676 151348 94038
19307 94038 94207 86840 -215568 6996 -183570 248057 -186569 207800 95263 -206846 -179216
19296 -179216 -15342 231798 191043 -156493 -86779 83709 -81935 223882 -390705 -303280 -60658
19284 -323075 -54120 108233 130278 -35371 -153694 277756 148613 115101 -64608 -281439
19274 -281439 117087 -229184 -218267 -309969 -164506 219768 -35269 243133 261691 -28738
19263 51082 -89130 23813 -159359 -83071 -162999 -233176 481154 -40300 -57061 -243331 -212559
19252 -212559 65329 35643 -438158 174925 -26247 7810 -326035 308887 -217112 -222710 -166167
19241 -166167 -85751 -4652 -97916 -163357 -8870 64699 195499 -184132 -121956 -364287 -252084
19230 -252084 -436 101609 38523 102784 107339 30814 -182667 64920 79220 41334 -43958 -72317
19218 -72317 -202295 139243 164689 -189483 368784 -79058 59320 -136966 134737 -234447
19207 -61427 -183151 -80741 -47207 -74274 -60019 88200 -146658 -203196 -288706 -113703 -95981
19196 -95981 135266 -78385 -279255 -56048 -88934 -127580 -247660 -324008 -21976 135186 133532
19185 133532 -32585 -213665 -234159 -149245 -41403 153652 -4251 -135715 26371 -110828 27972
19173 282729 20399 -105577 -73706 -242393 343347 -119300 -15802 -77368 18699 -16904 -380088
19162 -380088 -19960 42012 71226 -270543 184158 -82001 -68303 186420 -63276 22311 -94844
19150 -304647 -31817 201155 -355740 59223 -36007 -51478 31365 -116415 -133564 -304003 -61272
19138 -35379 -173236 -179095 -77716 20728 -312271 85988 -259263 216913 25380 -55671 -85806
19127 -85806 -206778 138354 -177188 -60803 339095 232556 -64132 102083 -228306 -260710
19117 -260710 87535 17733 -184657 -74292 30911 -232917 -114398 7538 -150744 29660 -364955
19105 -2981 -123966 -180992 -210653 266814 -326074 -188346 -296676 -103276 53957 66424 -117595
19093 -14589 -83566 55718 47398 18293 -250398 -141789 34598 340991 208803 88500 -131344
19081 -145646 57888 -278704 -94499 -81154 40240 -417867 -152759 -44095 220545 -7244 -110729
19070 -110729 -160826 -114713 -53791 -96316 57960 -113581 41002 -128531 -92000 -148629 4005
19058 -100756 -135484 188378 150155 -35370 70990 7178 -37520 -181653 -118755 -40997 217417
19046 59339 -412512 294934 140593 -323119 -26474 -42775 -202011 41489 40907 199193 -202867
19034 -273409 100375 148794 -111272 57419 173732 -214432 198207 -292881 288560 316231
19024 316231 137533 -138164 -15106 -96967 -52197 -286870 -108206 -112080 -459695 117375
19013 -238392 -271896 -169070 59842 -79291 50003 -134528 -202581 15379 51570 22307 -133189
19001 -50156 -53206 -249406 830 -97876 82174 -164787 -315056 236192 -90479 11720 17240 -46602
18988 -185291 131320 170556 112622 -165956 -39908 31367 -80433 40837 41989 86801 -76895
18976 -19166 -401281 64298 82622 317781 -197344 -237953 93939 -449344 298712 -332810
18965 -116246 -109191 -20839 -329774 -135959 -226350 -53711 50334 148719 -204116 212248 -66343
18953 -49051 -201167 253303 -59952 -125809 -44784 -137358 -227392 -40762 232729 -183073 76814
18941 108503 97671 -96083 -198516 117808 128934 123803 -110342 190354 36048 -410169 -226224
18930 -226224 23821 -157501 17440 45525 -27287 -35519 -153229 -116570 -99011 -293703 -335506
18919 -335506 -58704 -186564 -203473 -270578 -7716 -407586 2813 -5577 -203829 -13675 -118826
18908 -118826 -70123 -317023 164987 -169062 233941 57622 -93447 -53462 -305468 -75619
18897 345964 -19317 289681 -52671 -95243 -251936 -42754 157301 -189216 198141 -371359
18886 -252592 48872 -263140 -311919 -213241 -211830 168994 206535 -142744 493042 -103066 168827
18874 -157548 68079 -140728 -123178 154308 -387219 -257200 -14475 -448731 -277377 56306
18863 -342393 -75039 -50595 -249539 -43622 -80382 240365 -61008 296497 -157735 68144 67647
18852 67647 -11 59508 138458 -57563 492814 138817 -11011 -86882 238023 -150565 -111290
18841 -111290 -17173 313441 -162078 -243281 -113825 124312 -77613 -321604 -143599 -44323
18830 -256100 -177059 158971 -224062 106083 -32137 302658 -81903 301180 55032 72045
18820 72045 154655 -27623 67514 214915 -96902 -203122 -275247 123896 73682 469675 -128198
18808 81008 -163775 30796 -313353 -195859 -105092 70225 -139044 107899 -259190 74538
18797 -16978 -7815 -382080 -267086 -271908 123938 -109778 -330394 -240731 58757 206097 97128
18785 -403715 66134 -322171 -191209 -428403 -258368 -422198 -330800 -244332 -11688 -172234
18775 -172234 -139370 44884 253093 97622 -137260 -305437 -112370 142424 -61856 306094
18764 -300760 -136922 -137720 -200724 -143291 145338 95212 35840 205320 157945 -267572 -220257
18753 -220257 -53779 325579 247841 -26793 168638 -203823 -69541 -21243 -105704 -415822 546
18741 39279 -133204 -265215 208032 -240745 -100851 571734 -32382 -98422 -217462 -127607
18731 -127607 22549 213938 180875 177318 -91255 25729 -126351 3239 130661 30974 251911
18720 251911 -115354 178500 10522 -17495 178877 -35534 58432 -101098 -137974 175382
18709 100680 -133344 1816 55726 143959 -38930 -32454 -11501 -45684 26312 -87762 132068
18697 -58063 143258 -226794 110297 -376310 385922 80593 -227639 -265057 -162319 148110
18686 -141838 65866 -146635 84948 133840 -517257 -29914 122507 -154335 282015 -185838
18675 206339 -283227 -210458 -153803 -216866 -240997 -125405 -101046 -286532 -44345 10075 308163
18664 308163 -137525 854 279158 -79035 337710 247006 314669 24868 108532 21451 95593
18653 95593 147120 -323658 -111878 216441 75163 -203242 -285771 140439 -306288 60314
18642 -393396 -52322 -50471 111780 -283226 108199 2582 -189848 31105 -136993 -77984 86218
18630 -15458 -290089 102812 10978 -171223 -216338 -125800 -294311 24004 -51334 203854 -383969
18618 2261 -192584 -50627 241865 169089 157695 -29380 -245563 -80713 58186 -304857 -141461
18606 -362130 -179266 95915 -95646 38336 -44011 -214265 -103155 -164432 -27030 138375 275899
18595 275899 -92936 283030 79728 102411 -19284 -119175 52949 -31282 2936 -20901 -112345
18584 -112345 -72321 91627 267900 -346358 102913 429 -261247 -205217 -205259 -205078 42594 -227023
18571 83339 86752 -37336 252743 -62420 -240844 56059 54811 -353690 -140727 -462631 3153
18559 80413 -84786 -69840 -65100 -434162 -220582 -138920 -54409 11615 140943 -172567 -354794
18548 -354794 -96494 102407 -244394 42698 -127810 231282 73668 -44478 -409 -266633 -56805
18536 -196932 147652 -212101 481106 -54855 -78263 -240736 24655 80351 -43304 160132
18525 -128071 -9580 57620 139723 -150389 -94071 44259 -142113 150711 -152587 257657 -99909
18513 -151303 -31232 -129645 -127263 -68600 115111 249699 -55932 47792 -144987 -324477 166465
18501 -87694 174536 124311 -66736 -167889 -275139 -167039 159114 -214023 -279880 -126231
18490 -64965 100265 -159601 92672 221587 -86896 -152510 -102315 57740 -146920 -169017 -118075
18479 -118075 -85928 -144353 -224006 -33494 -149188 -276274 -118957 -223989 -13570 -322474
18469 -322474 -337352 44129 -178128 -150574 171143 -132062 -33101 -227682 256426 10717
18458 102434 -293190 -271671 -103981 -418948 117099 -135289 263274 65845 -162787 -161958
18448 -161958 -31292 74861 -128659 -486204 213657 -19586 -46821 56977 48483 -198323 -128459
18437 -128459 -49167 232038 -211171 53751 157653 -12861 14486 -197921 63420 47883 -35816
18425 91416 8069 -47670 102535 -147436 33365 55415 -64380 -9508 -23210 -28462 -106938 117540
18412 8175 339701 -213511 -157966 166932 -323651 261097 51573 -122455 26410 268670
18402 268670 171667 -134071 -6139 -97086 82481 -135160 -68981 76257 52223 36759 -121152
18390 85468 -224842 121385 -112544 211907 -190926 -116643 -309892 329403 -291605 66735
18379 145284 -135932 -328221 161860 128749 57419 -205049 -145017 -43836 -64821 -68365 90571
18367 340775 -34398 297711 29296 -270076 50746 -63547 375076 -57808 143742 -452557
18356 -30406 -241605 12064 38462 35270 -338937 44533 -116319 -258006 91595 187333 310767
18345 310767 -183459 -86463 -343617 -172586 -138530 -28366 -254682 -246158 415120 -299078
18334 55201 -110447 367785 114762 110201 57090 161042 -91386 170134 174868 -15795 66370
18322 -177851 52439 -78633 -206848 254464 7129 91302 -8076 13993 51107 117016 268398
18311 268398 -349258 -190965 -140028 159016 95430 -137042 36623 -203393 -201236 -12419 107383
18299 84682 -33861 -228309 32106 -428513 -169750 -117345 73367 -33743 -52043 187957 -189102
18287 -59118 220005 -254023 107737 -273218 -15644 146344 223946 -301837 -134607 13167
18276 12992 93958 -72457 -86607 117187 85455 -299310 -68235 -229427 -214671 -320312 -167321
18265 -167321 57930 -293294 -228398 -226543 -147434 14267 -159240 -159630 308340 133130 -149272
18253 81584 -326610 126503 119278 -72362 -172631 -34540 -177931 -157354 -6234 168822 185439
18242 185439 268758 228635 206084 226885 -139527 117378 88954 -260211 243816 36417 238150
18231 238150 -81074 -257520 57354 58914 -259381 24825 -144408 167818 -272430 -51561 333560
18219 -163678 -124946 -58503 -209654 -126048 442161 73792 -66870 138927 -119595 202395
18208 -247136 173362 79232 404843 116375 -14070 -152030 -156114 -426443 61044 47065 -23613
18196 -193549 -66657 -89323 -106929 -78993 7582 -118789 -194236 -9475 214238 -172975 77796
18184 -235115 78464 -12170 -8047 -64514 -207937 -163733 252461 62421 -173115 164061 -231292
18172 74272 41272 228057 124910 -268108 -196572 45660 96142 112381 -212545 -193598 -230977
18161 -230977 92473 1820 -289498 169891 -64401 -170759 122541 -92296 -100913 -197805 172182
18149 -224640 7855 -133493 155221 -202203 109158 130838 -174296 161368 263923 46490
18138 -84340 36438 -125567 -23318 -34625 -229450 -292496 -264858 -70480 -229217 -89178 242811
18126 153342 39753 25235 -59327 -160651 -123350 209410 58830 -244964 14844 -359972 -236019
18115 -236019 42786 80107 -353065 -289592 107732 -37877 -269857 -50497 -58352 397224 52323
18103 31877 -18893 103896 121640 55451 91998 -229999 253241 -137071 -49566 -116583 -47264
18091 65395 -74453 147637 -118668 17186 -26172 343806 -283396 -384820 -86743 198497
18080 -71231 -25699 172706 133867 -213960 -68313 -35275 -15109 77231 -139894 58506 -292218
18068 159536 -205300 -6939 23021 29126 -10198 -346454 118958 -119359 -117028 -21276 -38165
18057 -38165 -99794 254629 -87062 -56530 -41531 -76469 146867 -10412 87471 -280943 -110041
18045 48739 150430 16147 102623 -183661 157551 88340 -157736 -54284 78745 -120598 126210
18033 28534 334067 56306 -245402 172204 -269622 106063 171878 -136153 30533 179939
18023 179939 109921 -5984 74439 42975 212330 -101901 198300 -147579 -305150 97590 -273170
18011 -164829 -156477 -42426 -25339 257456 -92928 13048 158487 27590 107894 -123013 -258731
18000 -258731 170108 235975 -31644 -62058 -11370 -54030 -131145 167492 -321892 -67598 -128470
17989 -128470 -77364 -65088 36044 -42285 214659 -110562 83699 170311 -204760 -228672 76488
17977 -32401 78280 -159466 8152 -74221 330396 -154907 -116453 -140033 59378 62723 127844
17966 127844 -4791 -183035 -113517 21540 -133154 -28449 -64793 -257881 55818 301698 -60173
17954 -183106 40502 17396 192469 -57341 -193636 175535 147848 -82555 -252469 374022
17943 16266 -149700 -99862 102913 318185 -121620 136588 -81402 -28366 170847 2200 23451
17932 23451 -514 284273 143544 -188408 183074 89611 -99448 -38500 -167324 -20269 -131903
17921 -131903 17803 -527380 26696 87722 -32247 65112 9676 -16678 -244001 -40592 -59863
17910 -59863 -65190 -166811 -54253 -42415 -207672 114669 225977 34604 -125509 -39079 88146
17898 175131 35138 291700 -382868 120941 318856 -158261 101366 284580 -53473 131091
17887 244788 35923 -437534 88153 119654 -187234 -276429 15393 110391 117590 -41350 301445
17875 -101593 -95188 -175555 36053 -153425 -71606 -383877 31606 254867 239957 206218 178231
17864 178231 194767 100166 -222718 -143600 160972 -79693 175529 179731 174488 182888 332941
17853 332941 258390 -120844 -14580 73993 47352 -135573 126901 28474 267989 79570 -66681
17841 -233417 -173580 33664 -32950 205067 165276 156767 -178253 103914 -135421 -99829 -373485
17830 -373485 102899 -72697 -265203 -254865 154940 207828 266161 -151233 -12377 11028 12721
17819 12721 46387 -297939 154012 -73245 159987 267647 168872 197324 -101172 -100863 45609
17807 -226531 -64302 -387395 -105044 142510 -6814 16213 -176633 -74366 -526876 -116409
17796 130326 -47609 -175836 37096 4327 4875 -139829 303311 -38367 -143061 75259 -178237
17784 79603 -79722 272981 94858 -179296 -197662 -217515 220717 466890 -184573 -44907 256833
17772 -205580 -249611 -117149 -2032 68653 237935 38744 -82091 -119662 183996 192536 -2579
17760 131762 -43504 -221042 -269687 82807 -150969 169592 -203847 143480 -246932 217212
17749 135254 -299313 -242058 -26458 -17606 212662 53510 -28072 -37241 -247283 4806 -175869
17737 -100719 -4845 -218478 -36635 35982 -25342 -26412 7817 160959 -102717 36237 -83336
17725 559770 326899 247127 -108197 -92401 149283 129392 107522 198341 223836 258670 -34869
17713 -105168 -5709 -61664 22161 55992 -75006 145850 289809 88529 328559 63501 243744
17702 243744 23680 125842 30479 406948 -237576 179267 -312102 -185938 -48200 32714
17691 276230 61094 -101651 -28011 143566 53999 38912 -131148 154914 229047 -245571
17680 213287 279407 -84254 220209 -103092 168039 -215571 342169 217023 -33610 268539
17669 608 175160 135475 48524 -352999 154348 -7538 69807 54024 160201 133400 373264
17658 373264 392951 220430 5294 -1882 -86170 151521 294138 307329 -23931 124452 33161
17646 113054 -163409 89753 -112710 174760 126185 -325571 -16962 -3034 110631 -88393 -172225
17635 -172225 -192260 16279 -171705 8205 -109579 102020 18091 -134033 175288 12703 -116483
17623 2650 37307 -196173 -14350 26530 53380 -165963 -170577 187306 -17220 111684 106050
17612 106050 87125 89229 -150285 97228 135270 280790 174118 51906 84432 224829 -128428
17600 50856 34017 198339 10094 346523 -54858 -169230 199683 -88970 -828 34150 146914
17589 146914 151104 440928 35104 119700 -154456 219782 59197 -99162 -60659 141593 152712
17578 152712 201166 -250197 311245 -114580 -135991 -35358 -75918 -7084 -46870 14821 110721
17567 110721 212252 -18920 -102039 -89369 60459 224320 680 -172119 142549 -124765 37964
17555 -48796 56277 235753 261899 18056 -6177 -20765 -24332 382302 39224 -28106 44046 -114023
17542 176163 153848 298133 -65508 -169906 156310 -178898 -45741 24964 -72666 -338475
17532 -338475 -113017 -105140 382267 -137681 25218 -414672 289173 -44533 -26091 168652
17521 139757 17839 -123762 175561 94903 228082 -77479 -241870 8074 -328239 -7096 -16289
17510 -16289 262400 123865 -70354 -173220 382295 -5774 114522 69020 196011 253066 -52449
17498 26486 254232 -121209 369414 -165986 162051 401616 -118475 361902 -51423 23605
17487 345540 33299 -125580 90831 152547 237142 613175 51269 -8467 197430 89046 -221080
17475 511587 252280 242193 436132 -91835 88722 179623 -17136 102601 239036 281378 85722
17463 124012 249781 124448 58931 -139363 146522 205259 364165 256648 64063 -156686
17452 191592 60523 -16681 -125685 484306 -48999 429701 439766 629872 381524 402110
17442 402110 290385 214113 332535 528401 295864 249458 33320 474698 363421 185481
17432 185481 -10535 547623 143886 303880 269228 298879 221820 196127 270497 466145 119089
17420 413648 127690 81190 -184524 314990 377071 267887 -66281 304012 240589 111707
17409 238953 335848 368242 125069 -205527 231339 394442 359692 365260 210245 25107 -222433
17397 127330 224429 198966 490330 28229 320280 239020 -112452 -76597 291952 147484
17387 147484 193184 239370 -226475 210257 36286 209014 -10511 115286 173076 348178
17377 348178 479421 238914 377853 74253 283154 158350 92163 -64941 5035 84503 -10002
17365 112573 103224 9977 149391 231878 131965 -316062 437256 173543 10546 249623 461738
17354 461738 400511 172533 123377 326046 98061 483374 131190 -18732 342757 102700
17343 321408 13953 164170 136636 103007 223832 285065 119272 -163660 10145 -119063
17332 88242 61521 341778 414999 107592 387519 -83475 496095 -242833 309171 -8181 350143
17320 83799 56929 379714 199453 245417 203681 32475 308190 359123 -95482 117083 178423
17309 178423 169778 67329 128541 -188735 197370 148334 188186 322021 137078 -143954 240592
17297 323334 9787 82086 -191476 76787 -204847 110224 155088 169106 -8990 412472 463353
17286 463353 206169 405456 222896 260278 -154293 301464 81083 41581 119337 206569
17276 206569 120392 271292 78692 55900 -78938 -41142 307082 342456 122910 169983 -227859
17264 170307 -174084 52567 288754 159680 143734 99981 240232 414714 214035 217957
17254 217957 344588 242881 185821 332161 154687 458592 170932 68193 62559 472821
17244 472821 485643 210686 185379 -17464 -140887 255116 144767 116715 67798 360317
17234 360317 -65471 273107 490793 544200 258171 61007 65563 239288 165098 -82626 107282
17222 410215 148345 224323 597088 291848 95237 240784 178671 -18741 -136580 41366
17211 130432 134114 305645 163018 361181 460936 246837 44445 -59648 1193 120376 379371
17200 379371 504895 142400 294738 283296 295692 356517 309810 443149 231063 245196
17190 245196 231788 400552 255821 -86674 338058 259659 62348 253727 181557 278460 482567
17179 482567 136492 533737 426037 600529 443148 153163 773310 361641 -77850 509201
17168 255083 331285 202355 191231 -1822 -8223 265421 761773 254404 116423 -12289 174061
17156 102423 448006 466547 484261 312904 190147 186695 480201 388596 215333 708877
17146 708877 128175 437630 173467 339577 138235 76677 250622 330202 158072 471097
17136 471097 341315 349604 94480 553260 358472 406460 416007 353648 346875 429580 265982
17125 265982 291706 308039 566505 598294 202908 174201 323951 240200 354101 434086 313143
17114 313143 429377 585137 313770 169676 45443 555430 629083 640405 319808 116584
17103 228849 535549 263016 510803 747705 346461 124980 247102 262084 279570 576857
17093 576857 347706 362505 614076 582926 684280 484228 561868 497622 494910 322675 971291
17082 971291 680632 737707 338238 242298 666823 496963 883150 108817 603873 630776
17072 630776 684586 430701 441417 515127 556779 628068 537982 324751 319339 727184 512764
17061 512764 339376 235569 670417 596240 577071 798578 407735 704724 764188 704147
17051 704147 574078 618155 426552 643401 163896 609841 511163 420249 550534 19900
17040 711632 622183 541265 565978 867632 628339 469108 816392 607549 656149 492399
17030 492399 355794 398521 836677 733229 531600 526854 976971 879185 387336 756316
17020 756316 822942 873749 686480 641915 894904 1040084 795691 717166 1160523 878111
17010 878111 652521 549342 552883 957253 846652 791178 1006052 509618 896091 877669
17000 877669 708493 1012916 668440 855111 948212 956465 1001979 1051611 832314 772013 864905
16989 864905 1122562 978690 1250502 1197638 1276437 938918 745732 1116897 863568 897083
16979 897083 992160 1068791 995776 953726 1083285 1120692 982477 908555 867546 852261 1263393
16968 1263393 1377817 1287238 1007235 1230184 924798 1264794 855016 692866 1412409 1170267
16958 1170267 1002772 1276556 1120241 1159306 1135097 1007898 1243423 1156214 1358874 1091452
16948 1091452 1266214 1516420 1386885 1229942 1112319 1364443 1130212 1456422 1527147 1402913
16938 1402913 1314880 1299293 1636228 1154412 1396406 1147363 1579993 1357465 1346185 1285437
16928 1285437 1346316 1444796 1600135 1262513 1556220 1293239 1681732 1685027 1561744 1421983
16918 1421983 1887537 1637453 1781610 1678420 1785155 1539838 1892487 1703651 1598576
16909 1598576 1743900 1792399 1696494 1765376 1529968 1810813 2053987 1703933 2079781 1783057
16899 1783057 1648989 1946868 1884308 1780275 2153054 2018952 2125770 2208277 2205280 1933313
16889 1933313 2370230 2229874 2112429 2230228 2478009 2479365 2399367 1992192 2705612 2270835
16879 2270835 2269670 2852471 2508931 2727053 2493392 2890516 2550706 2782161 2544042 2869697
16869 2869697 2620776 2906439 2951068 2955717 2680176 3257700 2801791 3192434 3270573 3177285
16859 3177285 2898784 3196971 3399818 3423977 3402824 3682811 3301403 3453351 3767866 3777883
16849 3777883 4152204 3765221 3780938 4029199 4089526 4234997 3863648 4216622 4370314 4095221
16839 4095221 4416015 4578034 4782527 4492355 4878561 4448195 4825486 5086949 4919672
16830 4919672 5111301 5484644 5126899 5493030 5620187 5821194 5640844 5517423 5836892
16821 5836892 6135685 5986827 6444519 6430857 6745249 6503667 7227499 7168387 7519166 7143614
16811 7143614 7438221 7772207 7935804 7983609 8077008 8125500 8473293 8560570 8904888 9081026
16801 9081026 9465887 9336252 9549406 10031953 10163039 10568191 10792165 11092096 11218535
16792 11218535 11732433 11666551 12310728 12615568 13036933 13555303 13474712 14208840 14500128 15005452
16782 15005452 15468059 15526590 16304270 16885793 16977295 17562762 18398180 18743448 19310564 20206681
16772 20206681 21118641 21864167 22276882 23394157 24177867 24739448 26011006 26816916 27921911
16763 27921911 29035743 30019370 31049757 32498627 33744465 35145806 36418114 38329125
16755 38329125 40171691 41997726 43974519 45703055 48026037 50462999 52923501 55652159
16747 55652159 58617659 61579400 64720179 68040340 71637519 75469852 79398532 83844918
16739 83844918 88522166 93266246 98702448 103814765 109753841 115743356 121514881 128326739
16731 128326739 134717243 141106084 147670916 153759432 159988864 165696423 170847608 175912552
16723 175912552 179480635 182948400 185029516 186374751 186513827 185699185 183702413 181080395
16715 181080395 177313031 172484859 167446289 161970263 155696969 149740120 142929280 136712597
16707 136712597 129621769 123602629 117415542 111280432 105430886 99666524 94804628 89484385
16699 89484385 84432287 80544378 75778222 72153558 67990911 64614508 61475622 57973688
16691 57973688 55573987 52679128 50258441 47906195 45670561 43735046 41510852 39718065
16683 39718065 38075980 36379796 34687365 33401284 31671285 30514809 28938931 28030376
16675 28030376 27173272 25983308 24967349 24006280 22887198 22334836 21723588 20592253 20147497
16666 20147497 19400825 18882808 18044682 17698209 17034839 16279057 15880358 15306439 15248950
16657 15248950 14413536 13834631 13598828 13448285 13082540 12247544 12255890 11929479 11272713 11127549
16647 11127549 11074106 10591613 10264912 9592466 9708963 9748012 9026037 8906031 8943756 8509304
16637 8509304 8455646 8151853 8313507 7968879 7594224 7583467 7121602 7362460 7174002 6597251
16627 6597251 6584689 6508550 6347821 6354874 6401555 6052916 5786333 5958041 5506310 5544179
16617 5544179 5506987 5546977 5644733 5476351 4987605 4896860 4890621 4771926 4699216 4704484 4773379
16606 4773379 4400648 4386827 4008759 4455887 4108177 4400305 4054992 3840466 3683054 3925884
16596 3925884 4046490 3387066 3757826 3449138 3577030 3552405 3549149 3249980 3259808 3354730
16586 3354730 3273629 3020459 3079697 3475662 2773477 2689236 3032168 3066014 3259822 2939750
16576 2939750 2531042 2794430 2711254 2582010 2674989 2660947 2696613 2697701 2488352 2349498
16566 2349498 2527655 2184959 1899090 2282151 2045092 2324715 2224829 2624873 2172017 2297873
16556 2297873 2173056 2251204 2197241 2383018 1793938 1864407 1957888 1827696 2249306 1919481
16546 1919481 2105948 1650252 2034278 1734427 1812348 1669661 1682244 1990536 1672555 1829759
16536 1829759 1711292 1658259 1483103 1728172 1511113 1540689 1416608 1272317 1761934 1289388
16526 1289388 1376059 1341721 1268317 1431436 1413717 1342263 1401682 1363105 1486977 1273394 976422
16515 976422 1355830 1421877 1130143 1316454 1312146 1391685 1359273 1265413 1356065 1259535 927514
16504 927514 1524425 1354786 803373 1068168 1439392 1257534 1221962 854611 994405 754273
16494 754273 806026 462241 991112 1160254 1131917 1163919 661751 957589 998736 1100441
16484 1100441 872700 995202 834936 720387 759765 987232 960807 765501 644931 963062
16474 963062 1028889 981418 886582 725252 783036 799511 859862 678092 884136 962277 613040
16463 613040 916344 917466 859797 454119 912834 853896 1051949 506111 728956 693449
16453 693449 662130 696494 957883 818772 846016 737675 500423 477356 716978 528129
16443 528129 798879 687842 626307 519808 997603 472025 469795 524027 378924 597522
16433 597522 756926 800931 567845 489863 390622 794347 308011 788597 496906 516608
16423 516608 371177 551980 707021 339224 277803 813643 573978 463729 668618 757442
16413 757442 606299 747183 531823 621184 830461 340087 340358 397742 189239 207875 411827
16402 411827 321696 620930 193109 123704 451535 389074 180008 530106 400259 390700
16392 390700 434552 225594 674693 461659 406095 542934 361306 341246 608855 311474
16382 311474 217258 721580 189064 656481 264877 266486 317838 522757 447779 568988
16372 568988 239090 304865 283506 165902 459743 446136 362163 127342 627671 206183
16361 385402 416542 372874 211737 446621 541049 144268 159407 386640 577563 -110378
16350 194713 502311 496811 486604 645151 369180 357963 385246 494091 335486 506081
16340 506081 387782 328659 156330 418149 468273 606994 226047 430636 486283 206831
16329 556262 303001 346520 270462 61417 450848 215581 439472 181607 647214 276943
16318 243541 357781 447510 489412 344826 662731 151225 241020 329287 503308 149973
16307 363260 137125 154635 489992 -102923 109260 187606 215703 96155 170968 366425
16297 366425 283332 334465 20711 261946 171959 3854 239849 429397 -17267 609929 247793
16285 101817 17575 323443 157209 277376 -253981 388219 94245 294550 -171040 361341
16274 323577 -193188 -96881 58081 348258 259162 -14940 147915 335888 338235 121809 238122
16263 238122 247265 -93910 70625 152253 530157 182911 97253 72279 340507 33144 -59354
16251 -16735 125919 30257 -325112 66474 18215 -142456 70720 -123996 -85841 242129 -40862
16239 251581 216312 117041 133563 81029 18393 129209 175243 77096 25716 405185 166115
16227 38239 235430 -117636 -7161 -144490 -184710 32397 350519 356414 160547 -124194 59677
16215 336414 -12413 54964 316138 198570 -70920 -13244 88428 80928 131659 277334 -50523
16203 -187268 101300 264887 -301111 80666 472837 -73274 -33921 99643 -283657 -134742
16192 340999 289233 231639 -276094 -115565 -63618 303422 199951 -69246 79914 -88420 42265
16180 59341 4590 69117 152271 -235871 -51561 -93587 -142353 -100742 4621 159141 295654
16169 295654 22821 391192 152219 123725 173130 306128 -35870 124423 7651 90472 -31273
16157 50224 91013 111978 363599 36160 6154 157502 81475 -49225 -157018 202935 -455106
16145 -41846 236013 159689 -88614 409661 -38730 183496 200258 -177251 -99268 12847 288985
16134 288985 -194030 149351 62314 235260 93047 23688 138334 -90760 139991 100188
16124 100188 -128202 314610 189700 -137436 248890 254866 279461 -29049 232064 243950
16114 243950 -16928 150600 -143222 -238219 88919 157447 56796 -15732 54953 -175127 138848
16102 56260 1892 -58241 769006 223896 79021 280185 -220869 75566 4663 138391 -158126
16090 126350 75213 9220 283292 -29904 -548 -126315 87566 145279 51383 -210687 -386598
16079 -386598 -41448 101472 -146586 38250 -153723 69209 11500 -133571 153609 144226 9541
16067 -104673 196292 238275 -186347 147413 90670 -92834 -160718 322395 -3686 -152935 -231296
16056 -231296 -200209 22309 248168 -183513 -61108 -28322 -162424 -80460 241642 67040 -39111
16044 -14697 69568 18968 147180 128820 196211 45130 219473 -109626 -36333 -134635 183344
16032 40333 -458055 -129606 -10789 -209997 20767 30880 66140 -79542 -130580 -191238 -252704
16021 -252704 -27169 -174255 -104765 65757 -194553 52830 -304085 120628 65494 -408206
16010 25516 -120468 92498 -264629 295262 -68398 213187 -106964 282952 -117204 193339
15999 -173323 -143928 113524 266902 204109 -412588 488174 -331186 -271533 -234952 122979
15988 185356 185910 -273782 228579 271058 -138755 131738 263655 250683 38160 184229 -132466
15976 226188 59211 -37829 -136033 -288141 -101033 24254 102719 -97801 -70291 135668 123581
15965 123581 44878 -160989 -233610 -45593 -108528 161613 261267 112437 -200310 74391 -7136
15953 -121228 462937 -430951 237054 200852 -99359 265682 -25791 87277 -65322 -87449 339223
15941 122243 -193248 236969 30275 -150637 34314 -73570 265443 -187147 201412 -144715
15930 178930 -6423 -58572 231704 -142818 113809 -472318 -93685 -109674 -327385 184023
15919 133156 -152819 -50234 65554 -311422 -25385 -457991 -235193 293931 236938 -184769
15908 272272 -118924 -53312 -259971 -118751 -29126 69901 -94891 -13770 -110619 118483 -218961
15896 38983 -75440 -18589 -196502 346180 -73981 -300473 -138597 -126706 299074 -145212
15885 -79995 68673 141475 220505 -69333 -7980 204685 251528 -108157 -26448 -136604 -31289
15873 106809 49080 -112861 -181723 107204 -250426 -22035 -145315 -212693 -75864 -232092
15863 -232092 2901 -186809 11345 -43686 199135 -142462 74287 127322 140827 175943 -5784
15851 43933 -122593 -107061 -293795 94674 109121 -322039 -53450 282180 161439 -79754 91549
15839 -417010 -95042 141871 45759 -194976 10717 -92136 -205665 -211947 -13645 -59362 -223118
15828 -223118 -201261 -166167 -112912 -317727 -2264 -81822 -79145 36172 189525 -83958 -261167
15817 -261167 -40960 -102211 -124400 26804 -17651 -225549 -57403 60875 110955 270642 223283
15806 223283 260425 -462755 -357501 -51021 284881 82466 408666 58843 -300615 -275214
15796 -275214 43199 162918 262496 -111176 140918 -30448 -51760 -121690 8045 47884 84483
15785 84483 143715 -36257 -303576 -49811 84422 -7969 -161648 -301941 -130355 -141302 111765
15773 -202167 -61342 159736 -110835 60047 248349 103015 -186744 -191318 231614 -78266
15762 -75923 -84747 216470 118396 -526742 60656 449884 -53037 -305053 302717 -36163 -81657
15751 -81657 107393 -61480 -250258 -82606 238168 -168101 -170094 157940 192843 102427 307052
15740 307052 45817 87800 -142589 -202063 17223 201200 484904 120421 -232872 49993
15729 -122776 -55307 2484 -196873 -412332 37334 196178 -415086 -78480 -160707 215851 95738
15717 -221355 -184104 -26832 190208 -98575 -231983 -261229 152599 60817 -331595 -76855 -40970
15706 -40970 115353 38736 191928 221019 82926 69870 -75146 -110042 -81918 36708 21729
15695 21729 171476 55926 128862 -95911 222184 187788 18653 474415 109814 40037 59985
15684 59985 170394 87812 -122430 -59040 39000 -329960 -101577 -151729 376454 -75070 -294813
15673 -294813 44770 61198 46496 230621 210551 220707 -17568 -196836 -147034 5943 146683
15662 146683 -42370 -38442 7572 -25354 -48470 -89798 -190657 236142 164242 172505 -335866
15650 198253 -68969 -265210 -232283 9084 -33752 -266374 214477 -132393 15166 313867 -3549
15638 -470692 -59743 -61630 -157009 164178 38653 76318 -8934 127607 185182 -86589 -33774
15626 -172 -145671 -154607 -62370 -49936 -24255 361778 208226 -46200 156400 -100571 -94667
15615 -94667 167600 -58045 110409 88854 -82439 -101935 -101576 162539 -389968 -203399 -242877
15604 -242877 38321 -41240 31055 -137384 -244113 -307211 120839 -419548 47969 13137 -165006
15592 -192758 149970 76432 28314 50205 -338802 -254964 -295331 101969 52338 -224143 -217784
15581 -217784 -246608 -235161 -59569 -237876 110412 159640 -213219 38366 108202 51178 -168335
15569 6902 103428 -35792 -189286 129587 411562 152481 -66356 35501 -48249 164972 -101969
15557 163181 -27524 -56157 -314772 31 41160 148749 84457 -275708 90051 21502 21730 148400
15545 148400 498600 -80557 -104101 -305482 -49429 122840 92489 -194339 12869 185505
15535 185505 91284 -99147 98208 -196317 -383892 -46506 224908 -104136 -9823 -66380 34408
15523 84751 66015 -129549 -142851 64693 128432 -131695 -25620 -132915 53931 163978 -43560
15511 -48230 -265688 -77701 55432 5331 -108846 162272 168339 -59212 -76281 -169603 164021
15499 325713 -144940 246298 -35928 -233760 -52324 -386421 226232 -71491 -186676 -190314
15489 -190314 -39894 -16783 -18280 16601 347392 -336915 1556 -30080 29056 -76562 -245254
15478 -245254 -84122 83765 5688 208751 -112629 -43801 -153000 -164947 282208 -78555 -163102
15467 -163102 166846 74895 -35515 -102489 27424 349758 -98982 -15431 -49456 153689 -92533
15455 -327442 -235686 -96409 -29810 -41442 -147247 88933 -55517 -248730 -79326 304606 120141
15443 182601 -418577 166512 -15740 -71202 15751 -126874 -112376 208914 -133483 -79290
15433 -79290 -151496 53792 -203876 -12503 -198795 -88066 -217965 -24184 -86064 -211628 -31693
15421 170232 -73398 -97583 340054 37765 -8439 -412136 6164 47178 85470 -147529 106483
15409 -245195 -16650 6599 12944 39136 -79464 229759 -265973 250440 -119187 79283 28791
15397 -85693 10926 547071 215893 68521 -46660 -107669 271587 163882 76673 43066 206389
15386 206389 140682 -183703 127944 -30203 51307 20313 -234013 91353 95410 238320 243986
15375 243986 39580 83137 25719 -227505 131377 13040 -92819 10374 143335 10300 33087
15364 33087 193206 268505 -11546 -38593 -109125 -259487 -323296 120713 188605 -58191 4762
15352 31785 -126111 -104948 237333 49449 132280 -90248 -564949 269877 137283 -62436 126086
15340 -85333 -190225 61100 108173 79558 151436 190467 34491 243783 2094 -36598 117360
15328 19592 -71609 -214512 -118821 -87096 41385 -203264 -46181 272468 -41162 -52608 143698
15316 26832 -229987 325435 18075 29963 81674 83577 122315 -335813 -76843 179226 51313
15304 -77648 -48310 88682 18919 113688 -23383 120522 5539 -43366 -74327 -24458 -141470
15293 -141470 -91982 -199926 340094 47647 11743 -124226 -154509 282329 152122 132683
15283 132683 -93275 -40391 -73409 -155404 -80436 385521 107593 228212 -160454 115478
15272 130118 -61135 120458 -126311 161822 146584 31810 178701 -113287 -129817 301647
15261 126547 148559 327789 186249 166901 -107461 118377 -44693 18508 132766 186354
15251 186354 365865 770467 1290921 1234630 1251917 1403045 675301 180480 34210 318423
15241 318423 285568 -117480 -112296 150661 119586 271387 -354199 254148 515577 7962 -5602
15229 86468 59430 -1362 281687 -161608 86145 245124 -378196 181025 -86507 -46435 22719
15217 50945 274073 -174547 161443 -290175 45377 355825 -46222 89777 289183 -88041
15206 -70566 52583 -275156 83809 333690 295908 -21342 -71607 194350 35025 -271248 -202834
15195 -202834 368596 88617 65160 186977 -103896 -16368 104531 213657 -5598 196722
15184 -859 533585 -147401 -262476 -272225 178851 -169580 -336272 318812 -52697 -78857 -51806
15173 -51806 135305 37876 -97404 280492 48252 196344 365065 75789 -66046 222461 111002
15161 215722 -124041 -39267 154911 77992 9982 -102113 -8433 248976 157918 116808 142775
15150 142775 -87919 -183017 103155 552 -91670 670882 -1918 53706 1492 305279 69279 204481
15138 204481 -148282 -59199 118347 358555 173921 130226 94917 243688 98033 156518
15128 156518 342633 327363 95252 131584 -20032 55189 263713 183867 -205911 245657 -103545
15116 149031 366444 2641 63611 -105592 119520 336261 -152549 -25387 -17232 109920 198730
15105 198730 209809 -116270 111298 327390 33222 47769 -20654 113700 -94568 -151286 57669
15093 4196 255965 526300 499444 103738 294169 417752 25530 265451 -235174 222531
15082 371850 37582 32658 249334 58623 -33098 -50026 228659 183186 -173192 106103 537832
15071 537832 172134 75663 270357 245426 -104809 24637 279631 114424 118913 5916 109654
15060 109654 160167 111008 95248 165432 177193 437493 338582 -80633 92408 172785 -25299
15048 -79853 43240 122686 177324 343057 341645 383922 -176473 -69515 514537 -126586 354266
15036 387196 191973 -6721 255683 245613 364673 220110 279370 38610 46625 -193874 344229
15024 272741 74808 15757 27781 188161 97382 463180 -9467 440540 48273 133148 13640
15012 -108949 -38894 96635 112873 292093 432283 97049 103529 -6159 497359 230026 215918
15001 215918 234241 101356 -207374 455159 -152031 690693 -21724 324306 216821 417363
14991 417363 424383 287153 334007 370950 237785 53481 252842 326617 -154107 170457 383714
14980 383714 336051 317819 427219 274017 265751 140574 318793 234568 -99754 343324 206972
14969 206972 141688 524538 112491 285646 337176 -88188 47610 114735 66897 307675 153663
14957 421134 48108 462601 277651 225217 338625 143147 420628 349071 336102 75037
14946 146730 220620 771000 -83483 442991 -19802 124394 206166 361866 364797 595492 114344
14934 229426 125361 112009 255601 47681 697226 363614 168436 475845 296222 409339
14924 409339 664919 592367 422556 310423 495239 349965 193041 107957 228651 253115
14914 253115 25676 263543 321743 280247 66327 432912 281168 197500 240449 451347 654110
14903 654110 335289 324321 429606 321752 237531 615671 -27186 527040 182173 562565
14893 562565 330411 863721 330756 492317 360457 33399 320182 521570 405233 475396
14883 475396 133196 551538 210185 448359 780208 320333 623803 323765 315495 600112
14873 600112 430970 339096 396073 283253 511131 148823 450951 618503 204104 204089 272744
14862 272744 307928 517458 575698 523538 318116 315426 371164 496603 585216 552163 671468
14851 671468 453195 127342 509068 225722 263604 580067 580527 -10278 451314 783340
14841 783340 359172 276913 513490 557638 309002 653953 892195 337527 409374 722485
14831 722485 538037 414841 479301 217093 447834 186926 421789 384941 649462 510329
14821 510329 434903 561654 306273 396608 424528 452829 533837 592925 672852 500354 495276
14810 495276 544321 372914 435058 593690 792127 462118 583684 678737 611427 464255
14800 464255 418040 536805 467609 455395 414225 538214 248013 616714 591876 497141 507682
14789 507682 823780 349109 439531 504713 462394 958845 655002 571376 181474 467028
14779 467028 378151 292679 735177 700516 807077 670545 508193 585160 621071 520780
14769 520780 565564 540466 738780 726309 548456 471288 588559 686990 677194 824933 490667
14758 490667 411958 541128 636043 248729 974876 597637 568200 431404 505439 502784 732998
14747 732998 975009 905172 803332 706418 951401 739058 622101 1055303 722504 1118614
14737 1118614 764184 1114785 548674 800234 948551 846781 691796 915625 970174 640859
14727 640859 1048613 703522 791092 1042796 693857 1209442 1095840 532620 795470 924707
14717 924707 926754 819752 1125628 789919 786120 846068 1071268 936493 934431 836837 1117988
14706 1117988 683628 980513 863269 1068342 833848 1003529 822845 934067 1142615
14697 1142615 965994 905090 1055042 660166 916355 815522 1083317 1038991 1042738 904538
14687 904538 878350 1070003 745705 847216 1162904 949360 751511 819426 809319 1041030
14677 1041030 1108424 1189416 1180977 1067869 976856 973609 1359283 1235559 929504 970201 1159920
14666 1159920 1236638 1098605 1326379 1059498 1150656 1048142 1184293 1299678 1116870 1143898
14656 1143898 1063301 1078281 1040122 1041945 1147143 1496151 864194 1000243 1291790 1579344
14646 1579344 1292423 1403917 1242074 1170774 1480451 1131880 1239610 1396482 1077951 1390640
14636 1390640 1428276 1404597 1439056 1487651 1188694 1564069 1424686 1772917 1079804 1318517
14626 1318517 1572498 1315918 1486039 1294294 1595941 1120860 1546219 1490039 1661787 1364454
14616 1364454 1560749 1630757 1337356 1607822 1933306 1920748 1487220 1605479 1586771 1825473
14606 1825473 1736775 1502998 1536863 1776678 1944635 1725255 1860686 1669950 1700921 2039032
14596 2039032 1711852 1908774 1826401 1837790 1826468 1778163 1873817 1947134 2110741 1808443
14586 1808443 1962671 1906257 1761230 2020296 1900692 2324182 1804268 2032863 2368348 2430579
14576 2430579 2270866 2017388 1932735 2215202 2264421 2212846 2156275 2273165 2349192 2453884
14566 2453884 2671093 2520284 2884587 2615602 2857683 2813057 2745196 2786953 2904716 2914908
14556 2914908 3159787 3407012 3647084 3955206 4401558 4959843 5914328 8037352 11851900
14547 11851900 20440083 35833132 46103382 29543134 12136911 5750384 3602703
14540 3602703 2526567 2792794 2200074 2141801 2379044 2142980 2222074 2472097 2490264 2252572
14530 2252572 2352095 2521866 2378337 2080085 2542863 2769883 2246474 2620651 2706693 2568449
14520 2568449 2431269 2845483 2832781 3022885 2876420 3110318 3073473 2954309 3461931 3108260
14510 3108260 3098344 2942818 2703396 3189140 2948246 2909740 3383875 3158600 3072138 2832767
14500 2832767 3637932 3515537 3273715 3483361 3458434 3625396 3572214 3882140 3632298 3630388
14490 3630388 3377588 3822504 3610412 3919357 4028242 3810288 3889840 4097316 4010035 4099104
14480 4099104 3860444 3978883 4136701 4137336 4460495 4707785 4526931 4297378 4445773 4552497
14470 4552497 4963556 4619050 4837290 4423652 5129634 4901514 4841481 4602437 5055160 5038869
14460 5038869 5382195 5340105 5196333 5356237 5379319 5403187 5176457 5374346 5602928 5811853
14450 5811853 5731769 5452532 5977449 5935296 6162738 6024990 6250773 6134189 6210171 6505838
14440 6505838 6513154 6522070 6765616 6450513 6540693 6858736 7052399 7119544 7243858 7124855
14430 7124855 7163302 7514291 7532062 7730901 7563238 7786821 8013109 8040354 8165361 8139865
14420 8139865 8375481 8542286 8621569 8585543 9090253 8781388 9176033 9228972 9396918 9792940
14410 9792940 9628508 9489642 10013705 9943440 10296580 10398147 10540056 10651628 10751792 10777201
14400 10777201 11624197 11137778 11603586 11989861 12102066 12180054 12375433 12597120 12602636 13071251
14390 13071251 13502934 13665333 13454128 13889062 14069261 14562569 14537119 14761032 15055877
14381 15055877 15519367 15924497 16361727 16410712 16713639 16891216 17116031 17680048 17925367
14372 17925367 18443665 18756061 19199044 19744825 19979128 20079367 20655771 21038769 21523577
14363 21523577 22224772 22414449 22763610 23207224 23884113 24179015 24856873 25565129 26423059
14354 26423059 26966453 27514216 28119846 28806389 29580143 30073787 30552834 31839279 32354207
14345 32354207 33439751 34390851 35157347 35761450 37080971 37601035 38980669 39969423 41292626
14336 41292626 42171004 43519378 44748008 45979713 47502841 48929869 50438650 51927251
14328 51927251 53386232 55109102 57120900 59015046 60829088 63287078 64876765 67100241
14320 67100241 69417573 72184961 74648177 77446880 80173864 83253182 86422675 89979656
14312 89979656 93301128 96854465 100946264 105115742 109542060 114176211 118824095 124238533
14304 124238533 129708709 135172856 141504766 147979533 155180648 162124994 170152378 178491971
14296 178491971 187111083 196479633 206079493 216361727 227223231 238692801 250473012
14289 250473012 263095253 275925648 289891938 303686306 318410171 333138727 348212490
14282 348212490 363625827 378682357 393636797 408411847 422355879 435379555 446923423
14275 446923423 456966069 464492465 469402646 470911881 470062325 467789036 467401400 464082323
14267 464082323 462539212 457212568 448949553 438565995 426972419 413970277 400085388
14260 400085388 385648974 370661747 355118775 339463237 324347685 309963020 295452404
14253 295452404 281138837 267712232 255083779 242427911 230553625 219492028 209152543
14246 209152543 199131425 189434020 180952651 172442099 164524844 156892578 149517702 143100004
14238 143100004 136639844 131204607 125750201 120202688 115155459 110475912 106170378 102191770
14230 102191770 97932939 94613159 90227165 86994936 83712944 80582243 77835985 74875638
14222 74875638 72215140 69457345 67162661 65388886 62902673 60969908 59084107 56866466
14214 56866466 55392954 54151865 52116867 50522775 48951518 47341540 46569977 45264826
14206 45264826 44506211 42710123 41259425 40310072 39217509 38154738 37512386 36709075 35177114
14197 35177114 34425144 33586778 32766138 31710251 31220393 30403324 29886603 29033285 28482645
14188 28482645 27481655 27024562 25958270 25790974 25001389 24275229 24117235 23841475 23041762
14179 23041762 22128521 22307382 21506445 20877962 20627758 20350857 20306584 19499366 19284985
14170 19284985 18763598 18478915 18184936 17834300 17396231 17525704 17060364 16606545 16169962
14161 16169962 15705054 15687788 15315659 15263894 14772262 14561086 14462124 14032093 13959389 13765164
14151 13765164 13575545 13172638 13231036 12776487 12739929 12465261 12363118 12054620 11930228 11473502
14141 11473502 11511153 11292058 11100373 10819187 10698545 10876109 10566508 10476667 10121661 10064560
14131 10064560 9871687 9692751 9645463 9655010 9381966 9469753 9082859 9325192 8880678 8898409
14121 8898409 8409089 8642857 8359646 8198810 8401896 8252113 7970433 7767568 7803124 7503742
14111 7503742 7665992 7209255 7486497 7233377 7390134 7114777 7278012 6865233 6725894
14102 6725894 6748651 6685408 6268101 6321384 6789891 6618463 6591396 6138816 6403801 5922189
14092 5922189 6045078 5977839 5868343 5769357 5735624 5574259 5817438 5546315 5634575 5292758
14082 5292758 5500550 5367793 4868867 5247045 5068989 5305087 5240054 5087388 4954083 4820648
14072 4820648 4926658 5008572 4748873 4471552 4735652 4664927 4748061 4538281 4513446 4373665
14062 4373665 4274885 4694418 4311859 4683023 4386664 4190945 4028708 4259137 4196849 3967134
14052 3967134 4329721 3487785 3823927 4047457 3630617 3890076 3696085 3451107 3838782
14043 3838782 3720146 3387502 3263598 3426833 3440470 3327721 3172707 3403560 3235543 3525085
14033 3525085 3490120 3543033 3119623 3136516 3125869 3049604 2927162 2984175 3119419 3040823 3216336
14022 3216336 2947438 3043806 2978800 2682754 2855364 2826146 2638690 2588502 2872549 3001106
14012 3001106 2279254 2626010 2683337 2830050 2506411 2392311 2438865 2766325 2545521 2455280
14002 2455280 2376194 2229492 2118838 2196766 2235443 2240416 2124578 2295612 2206524 2207257 2293763
13991 2293763 2117482 2803284 3968994 6270319 12992595 27671354 43585479 34116686
13983 34116686 18503913 10190300 6729782 5375956 4700879 4007168 3879608 3538075
13975 3538075 3337469 3464591 2746357 2978252 2715603 2630235 2550113 2262841 2591863 2454538
13965 2454538 2552805 2519639 2798768 2339444 2368497 2616109 2133802 2183879 2277566 2228852
13955 2228852 1889857 1982415 2280438 2189754 1991896 2212731 2082612 1904903 2226901 2249727
13945 2249727 1844776 2099697 1845834 1977647 1747838 1928696 2092850 1895340 2047573
13936 2047573 1843448 2012899 1764656 1924196 1871852 2175441 2235519 2075072 2059121 1511161
13926 1511161 1650868 1805295 1504664 1702381 1861326 1545111 1570123 1501956 1861724 1744742
13916 1744742 1712334 1537361 1834764 1728380 1301325 1472783 1532470 1468835 1246770 1484767
13906 1484767 1590369 1093769 1344620 1697767 1377293 1329250 1903684 1514928 1317093 1640950
13896 1640950 1519989 1505718 1505984 1424997 1268200 1238639 1392171 1617820 1187252 1259884 1137107
13885 1137107 1162686 1424860 1449218 1387782 1011394 1174753 1188200 1392254 1407829 1242087
13875 1242087 1346492 984906 1439091 986657 1594037 1408963 1394740 1227701 1533957 1103205
13865 1103205 1019148 1377357 1277804 1083632 1195670 1224214 753370 935270 1224161 1012150
13855 1012150 924147 1314100 1179898 1366734 1110309 1116971 1240255 1007626 910899 1235235
13845 1235235 1224417 1118560 834178 458817 1017434 907107 793095 1211033 1105576 976084
13835 976084 1292049 1251729 1300753 790899 785651 732643 743866 852129 785589 1160891 838765
13824 838765 964768 829694 924639 1184286 961165 1148679 813346 616748 850285 1038470
13814 1038470 923542 1061522 775421 651610 1123246 452117 968424 856704 737198
13805 737198 942021 860355 827686 747866 1069643 730532 619937 629467 605564 1047591 822329
13794 822329 707961 542697 1130885 819511 709622 758831 900101 724012 1024593 601384
13784 601384 605429 588958 842955 607549 1162553 626743 686962 992715 697610 907380
13774 907380 905215 906968 871153 897996 788051 777850 591322 935513 903197 1034734 678701
13763 678701 695607 655542 1020544 507845 1115341 312459 838537 836392 568973 634990
13753 634990 912323 731526 484318 666165 568294 584500 639522 980742 572900 578964
13743 578964 446753 590348 738543 650375 441751 348930 711932 537473 757904 520178
13733 520178 408960 565480 864587 331545 852279 726035 711625 723005 466798 777523
13723 777523 748108 605644 574018 648230 534037 480672 454803 621221 574414 717145 540025
13712 540025 751123 798990 641761 448656 381259 518282 878652 595350 517724 769598
13702 769598 348645 504078 467083 528805 388663 627782 520806 583650 499927 196981
13691 931031 549883 475809 824959 470600 319251 923322 414885 907946 536032 452386
13681 452386 317891 485472 405648 528130 403940 839666 600826 795178 540389 458101
13671 458101 444811 526788 637749 350752 218071 358263 814597 236344 393345 546757
13661 546757 452286 255537 823553 606971 187967 761580 253154 450677 610117 604781
13651 604781 407258 468292 642343 498308 568664 751495 333790 386573 440581 594638
13641 594638 568425 302146 617227 486675 536155 347562 216115 310227 349070 456588
13631 456588 43363 659137 244134 347739 330358 792669 524061 286471 734406 311297
13620 433088 554480 500574 477449 597606 266429 542482 309042 255133 474271 512204
13610 512204 218777 388025 157655 225081 593254 360497 302470 473400 70039 237227
13600 237227 331317 443169 451149 299520 155118 102300 318303 531744 495463 394456
13590 394456 526857 394373 346178 620752 373489 449131 200818 362393 359236 303305
13580 303305 339087 250608 505818 245943 274624 293631 252952 470917 334831 111143
13569 524910 531103 565626 489134 306990 332721 401537 408487 364038 475206 659977 198838
13557 10731 241812 467788 180144 416654 270753 109688 144822 358824 310220 -7613
13546 344729 217289 598693 153347 529176 289980 577777 519080 442916 295477 138895
13535 94239 119579 417782 242793 728382 496468 274213 441050 259193 4824 85197
13525 85197 179021 198514 268482 413068 281586 389606 295508 -48455 424388 348888 347067
13514 347067 456313 224126 78125 253814 137464 356984 435319 329682 277683 169717
13504 169717 265321 406419 308469 195716 228729 335349 125845 71852 36327 -2701 278118
13492 237020 593404 132722 -13818 468892 -24759 273724 186334 477207 110466 394841
13482 394841 222600 499404 382068 135499 64331 239700 316108 125422 346957 170145
13471 146904 252117 16787 314839 435573 246745 374603 -156525 411953 178641 188580
13461 188580 277555 382759 214958 384571 -56476 502093 323551 282058 164917 184925
13451 184925 436202 119786 284696 157974 449587 117244 -17742 109882 -175482 124773
13440 468376 589050 47258 355179 387206 517913 261936 120512 188871 277741 -17201
13429 374683 362948 -65368 26918 252993 -32646 421355 198040 218467 136541 141166 49445
13417 250670 183815 260430 -1571 249300 -12776 391132 150681 69929 -6194 -49622 678730
13405 344903 157208 -23175 124867 329729 190267 -11622 263787 147402 442440 332994
13395 332994 -223290 352442 -33981 151475 348471 83235 265218 210692 213358 -49523 309369
13383 -69081 103613 247650 143848 64216 495714 203392 61230 308481 391188 145117
13372 -113072 244682 313777 171361 192641 679541 165352 223321 191677 271727 369038 82366
13360 289296 313764 43741 334199 247951 348920 247678 263081 224329 148105 347714 589865
13349 589865 292225 96753 541529 241588 275926 310007 297710 268681 195128 251897 -40688
13337 80654 -45696 529391 116991 253272 306834 -26568 320303 127133 221310 119220
13327 119220 141102 103844 -44389 464511 40805 82738 455699 285403 260302 227660 249847
13316 249847 343346 38305 393459 155184 218713 536636 -136943 403792 -23595 26678
13305 28789 124017 224418 -25944 125349 563674 112532 156925 13241 -122602 310657
13294 210120 74827 131582 297780 287110 6855 1203 -25868 332348 86272 263131 57509
13282 490154 213343 66244 99963 209658 89253 185166 73159 -122425 191142 256080 472085
13271 472085 65240 542701 50895 24263 -44227 14728 185674 103672 -64582 151522 -94186
13259 148630 326760 -76247 165452 338946 198136 24560 26272 7267 106295 453985 284308
13248 284308 236307 234368 198596 117404 66209 370443 289820 64083 155633 144351 -140066
13236 -62369 296274 91125 293278 -34231 203801 276559 6818 -124699 151621 288635 282297
13225 282297 -87029 137261 -34921 330493 89722 165080 55999 -86686 195839 -87894 190757
13213 245201 87880 223327 304652 139293 63234 201621 -171057 -41398 -53138 206349
13202 167752 -131447 -18981 357835 156027 -9927 72063 -32953 75263 240835 285774 -91662
13190 144901 88257 230242 -139046 183674 88502 209398 253482 19241 -70745 58075 308655
13179 308655 233903 201164 5381 183567 16396 74128 -165917 -48955 15691 125618 289186
13168 289186 93920 16340 -55569 129925 344249 149480 -11132 142193 452131 368177
13158 368177 239106 173387 -45386 80773 -39274 -254910 -8447 305686 6149 345228 37450
13146 321040 -156608 -163534 152649 153714 -56372 303680 182541 -60433 289922 -110648 -223141
13135 -223141 246098 328202 197694 -66564 -23762 134889 270398 157321 -227245 -64171
13124 -103758 137660 78046 128820 -292746 -387794 184536 28636 -98218 32464 288375 -1329
13112 -39283 -60112 -203418 50811 25552 144041 78971 284402 199641 -57494 129615 323204
13101 323204 253626 93288 -30235 297837 -151596 95875 88812 6192 -249748 10777 189935
13090 189935 6399 206955 91896 119182 166912 234052 6425 20400 25820 195340 211025 -58842
13077 -150030 35427 -27937 -77755 327946 329977 -291799 -23862 293685 -55123 230030 -96015
13065 -62357 53661 301561 115538 111981 -12607 237358 -52487 232843 66468 -83153 98170
13053 326674 -46439 -42746 94206 -74864 215836 60144 262717 137232 71177 279815 192456
13042 192456 91750 143028 232513 179326 31473 -54112 -24344 -150714 282080 52059 90101
13031 90101 71478 131375 -31701 157486 162765 212898 28158 532751 436331 264122 25307
13019 -131608 85746 -293837 304378 23850 181024 10663 99492 322808 162627 -129846
13008 298861 -1976 6949 -72932 48127 231767 -138146 13620 221280 356445 32639 58076
12997 58076 134665 291164 283717 145762 218606 145056 -10940 -60786 -205446 -92366 -153803
12986 -153803 215109 100334 295735 264768 266117 164402 51984 204910 -215521 37243
12975 -128605 88771 -17151 192318 29475 -145596 -191357 308200 -93254 83346 131550 -91375
12963 131125 -22630 148728 128508 335654 -124926 291456 -179953 128125 -88616 -267 -26509
12952 -26509 -179694 -93498 179547 -85096 -224164 -189410 291866 -95328 -99345 98617 41445
12940 -167785 -171116 301084 -237044 -208145 -185856 -13562 137146 -106102 -119912 -113126 -42697
12928 -24413 7831 74652 179516 -126148 179130 -138893 -98296 159987 104562 173 86628
12917 86628 -181493 -286466 200353 -3086 -149405 -109747 116657 -52002 276849 272789 -39721
12905 229395 -310117 233323 -147599 80626 -316548 -152586 93382 126618 -205352 226519
12894 -146445 25217 -196576 167310 83717 95830 148781 -111578 138732 94833 -215147
12883 -169807 -14515 109686 130683 1965 333028 325686 120796 -141222 -200745 -137401 109252
12871 -404054 96868 -37172 57247 89173 -119540 -56930 -115426 13926 -114250 12357 73694
12860 73694 177910 -65176 -53479 43043 182420 -22759 -198952 -126579 39489 41316 -83685
12848 133833 -186290 -19181 226375 -70059 -122091 148499 135921 118610 -93651 -101596 -143512
12837 -143512 -110370 142444 -318338 65679 178217 -27726 192881 -38011 43535 -24634 -123092
12826 -123092 227918 -176388 134576 -120481 -139691 -43695 -150495 37758 6764 96724 7956
12814 -373569 -43597 -61738 -14069 140913 12824 69680 -2272 -112127 130097 66955 -75766
12802 -78632 121098 124400 -152154 -146723 259339 -164617 307541 -174558 89042 -201658 -256036
12791 -256036 61929 258023 -169718 21913 -4162 80336 48104 -30222 48448 -279280 -5848
12779 -100461 62650 410002 197199 76006 216432 -103744 197301 227662 150236 38096
12768 -83782 -150620 108404 202968 41938 205701 143316 268620 -137800 58687 274131 295783
12757 295783 73087 -236443 -88147 -314619 -209437 -127047 373384 13019 201144 497117
12747 497117 3666 73328 366678 -25336 24016 271572 63644 321919 -114193 177845 219713
12736 219713 367981 186517 190910 162287 -281015 52186 -106628 -246423 -87982 133621
12725 19748 77735 -166967 241689 321123 126275 19154 29424 -140725 -194820 -13553 150126
12713 -106620 263544 53309 11470 172768 317403 50230 -127637 -21224 2542 192039 357545
12702 357545 129500 416914 -185892 -148808 128031 -259672 201451 207475 125806 -87649
12691 -285649 484438 -65623 221788 -282826 54728 51335 -96646 -297916 233602 389533
12681 389533 10988 323546 138694 638918 110819 123893 402 -43983 401151 336447 54598
12669 -17394 -68219 -44189 264682 24052 88662 -19604 -228405 8752 131758 -62672 -206467
12658 -206467 208724 -132393 283572 275807 48877 58449 -179562 125295 334090 175071
12648 175071 166809 98694 930 -177844 -3768 -22762 73170 170896 -193594 54258 -53572 7066
12635 241305 409454 -254969 -63155 13403 163146 28 53343 91183 26319 3195 -106691
12623 198232 281678 56877 144978 48352 -187659 312538 -278055 108280 -227884 39630
12612 61018 -108025 -53345 -202194 -45125 -71120 -287911 267398 36801 -78641 98733 -97758
12600 -15878 58618 -47190 67495 -166634 250799 60162 75400 4858 186767 -233015 -110766
12588 461419 46680 -84932 45592 329633 332212 93421 -116762 30624 -94407 146335 97889
12577 97889 107611 -44327 -37911 -5846 291994 -143453 223376 315917 -41945 -145704 104584
12565 -24581 -96363 -25662 -156193 115125 235073 268649 162079 -77214 123457 -85510 -252697
12554 -252697 -315372 -298102 -297953 -108095 34385 107609 -172920 62672 -37855 -34645 -57206 158422
12541 319024 265404 49303 -57258 -171505 -109524 -99273 -60028 -263986 364427 293769 31511
12529 168143 63503 327959 -35067 -125385 -100454 -69315 206239 -43521 -126526 -140126 159502
12517 -348267 184550 -118275 -215128 -97060 6809 -19693 -242287 -161693 107830 -32069 97212
12505 73217 172663 10630 -129334 88472 -329089 -38244 270077 187930 7234 71261 470561
12494 470561 140750 -275035 -72045 -61625 -199013 198589 -211909 183691 -83093 36814
12483 -228651 333993 -70452 226424 170663 145320 263825 -12981 17716 39937 26324 90110
12472 90110 -35551 43861 65173 96049 7444 -143802 -120880 323305 -70287 -126319 89874
12460 -57907 -127693 272898 175855 -278636 298211 215112 -98774 33481 11115 298450 89523
12448 68174 -41782 -188755 71828 -130963 12141 -163750 -71748 101406 107806 -78256 -25250
12436 165465 111197 66446 10237 96080 -89550 36100 69877 -119036 209655 -71123 -69648
12425 -69648 275459 -66547 -505192 209614 -207421 235219 -57515 -124834 57294 -40602 -23357
12414 -23357 153915 251040 -71451 106491 -22755 -134979 -291157 30681 65804 101587 256554
12403 256554 -122429 -257161 199957 -133594 53627 -316352 110949 -122810 -216005 65629
12392 -256415 -224902 132296 -300856 187541 -145116 119101 111475 73484 124959 -278158
12381 140079 -421078 11108 24972 21521 26213 127927 -210028 23979 -118006 48350 -249653
12369 -268684 90983 371577 -320237 36401 53837 -86023 225864 -28702 -56958 337736 37202
12357 101423 -97750 40135 -106528 -128006 -21967 -134236 -127740 -15419 352315 -112596 100287
12345 21091 8267 18940 -349686 -167209 -150692 -72847 114058 47891 164606 -41602 -208222
12334 -208222 -55459 -241616 150882 13753 17563 214949 -176733 23490 -31530 -38590 243551
12322 -254246 -96882 301725 -13608 -158876 -86217 43335 -26262 -51512 -88541 -322714 -36788
12310 108586 -78555 76743 376651 -388034 182794 -14764 126100 328330 309355 -153949
12299 82681 677356 -235318 -238004 -14764 162422 58487 -158113 154681 -10712 112865 419312
12288 419312 209242 -292427 -166660 -21645 26562 -72685 170905 74679 302210 392284
12278 392284 217627 286159 46892 451031 361708 358922 322464 -1301 149169 341772 228149
12267 228149 354519 89729 -65149 184801 -308434 -257785 405008 244186 -371577 -84687
12256 338317 11559 23654 -97474 14279 136321 177048 58133 -218439 -44816 -97973 227079
12244 153613 166731 72283 244358 -143585 420861 281884 248313 -93762 -261797 115754
12233 81978 84466 -666052 314427 -78253 157417 -216048 441855 115466 447453 191778
12222 368096 -124996 98505 140808 52584 -163032 151925 266542 27842 138775 -273002
12211 476728 28915 15434 -344860 65185 -43419 37078 144838 -63360 -57265 178430 167233
12200 167233 117567 34243 106525 246978 557186 208375 43811 -6245 274436 307573 56379
12188 -99950 52904 204737 155351 209282 28549 291439 153757 98089 238637 -240947 295594
12176 183671 149975 -135059 101755 59769 -58608 141301 314701 125835 295365 243263
12166 243263 72974 221488 388192 182701 116786 -8490 199889 245641 231930 -9454 422424
12154 -243831 12917 -21747 100686 152021 -97140 551680 108552 -239915 -109710 33585
12143 7111 223800 93771 237884 207649 99049 -220068 48502 -42281 -37705 -461541 81883
12131 241386 -29231 -45194 400184 332049 -19652 92620 378529 117382 -101324 -29282 -169259
12120 -169259 -144688 251656 -294415 51063 150493 54942 132521 202435 -154153 175479 -18973
12108 -108186 105038 -146208 96788 -45541 399 -388364 -131540 353656 -7320 9010 177078
12097 177078 102015 -69504 -331294 29309 -66459 -333 269081 -15096 111648 500640 349981
12086 349981 23784 293142 498 -124921 -162219 -14134 -80774 50369 391042 495936 1394022
12075 1394022 1601017 893589 82850 142660 -330873 333125 274765 29190 -211245 -122801
12065 -122801 192258 -18582 -43872 32980 132509 -81888 116980 -98529 9369 136743 -198400
12053 318718 -193857 -40172 303436 -102684 26 129351 -102818 3656 -49250 -70728 100696
12041 -111158 -307818 -264997 -32922 -156193 321037 132742 125862 280116 22891 30223 280429
12030 280429 30579 -169005 122098 148602 85552 6932 86138 -436809 56823 -80789 -184921
12019 -184921 -307688 -214852 220107 -460482 60096 -49732 -43903 195231 -213190 -110215
12009 -110215 -126803 165375 -24749 -197822 -160534 69945 63138 -140502 -11473 -112321 180761
11997 -107141 -171485 103361 -51929 -26285 62462 98539 18810 -175908 160223 125207 -19169
11985 -84545 -172096 -138921 69969 -450999 305188 3868 88824 42034 48242 165092 -36292
11973 63078 -268491 -112821 224941 -6499 59468 187446 33493 -142253 -56118 -183100 -47338
11961 63121 253817 -11466 -202388 13877 110459 75801 159742 -97999 140923 -72309 84704
11949 -68173 -153524 1470 54550 -109291 -164522 -232385 -93907 215403 -35048 241130 167770
11938 167770 -185181 38444 -357176 -145689 100996 -85215 93123 -124025 -30616 -276905
11928 -276905 -4815 324273 155232 -234524 -188289 -93786 -186037 -97434 83200 67293 40697
11917 40697 31837 -6676 91360 65135 -16001 25183 51932 -121962 -204545 -123698 397940 -394361
11904 -158591 -50099 -71265 70897 77932 -89041 127569 252314 288102 -167037 -119009 -25608
11892 88594 -132189 324963 -3656 151598 -240810 -239573 5442 -148206 93682 -124412 163833
11880 -67857 -278646 -108653 -283910 -167526 -10402 36135 -107547 85437 -189162 -171996
11870 -171996 -490 -71675 -132248 39336 -25049 -156376 17946 -172149 80900 -228483 -118028
11859 -118028 82755 443652 -173751 -491335 -359258 88184 -249259 30957 -92369 -434803
11849 -434803 -590378 -77709 -92381 24543 -327339 -109317 197577 -290501 -204423 -40389
11838 -35082 292608 -61022 43202 8649 -95033 -109285 46799 -93522 59305 -211863 -330152
11827 -330152 -200568 342103 -517477 -229920 55408 -3716 -162195 46173 -96341 -84269 -16134
11815 -145381 64325 87651 155117 -298777 -16373 -109680 105203 35053 211730 167292 -201006
11803 245083 258940 3969 20642 -134725 485904 -327948 -180514 -196305 90815 274495 -270918
11791 -257785 -85580 256372 -67378 260144 -116277 173635 178805 -58181 -172556 -53433 -19049
11779 242781 101643 16901 88014 -237658 164607 -171045 -118491 -70004 -172207 -78616
11768 2072 -97755 162723 -97265 82827 -81406 223229 51374 -208253 284784 119229 391582
11757 391582 -7357 -284573 -213550 127967 156995 -247056 -402284 -133298 -198383 218750
11746 113377 85994 138482 138085 -12869 40000 19912 -42761 147838 -259300 -11848 -3327 -177742
11734 -177742 -297136 151167 -131375 103612 -39155 196348 -129682 8979 138318 -157982
11723 -10369 82782 -201295 98033 42435 181644 -10116 13681 283667 -56532 79302 -346382
11711 384440 18658 244514 -46482 -69631 -107173 130368 110485 -191343 117835 -105441
11700 172659 4208 99837 95451 86848 -12449 245075 -17485 -145764 164041 87612 -94016
11688 17593 142043 -153143 -14830 -75247 86471 280168 -149480 132252 119422 235128
11678 235128 -24825 70634 33585 -142929 125508 -4282 161509 -70563 -205232 -93439 149162
11666 163257 -132308 226001 -37080 -83899 216633 227772 4632 275271 87415 -64218 336910
11654 -219264 -190395 65243 32917 126992 220398 -7863 -288947 50223 80146 161969 115680
11643 115680 108373 76406 66556 4679 152308 -37024 -29751 -81814 -188774 168941 98711 -173043
11630 -37967 140318 292178 192715 -157086 -106083 367288 -356118 77690 378779 -82184
11619 177809 -21221 80545 -350645 -45623 115171 147711 -175585 239235 -142172 -161547
11609 -161547 24174 21111 34649 144008 145203 -370965 -48958 7583 114282 -154174 276533
11597 61054 457973 128367 28728 -57013 24175 -5199 218931 242250 227691 455589 224069
11585 -79042 72187 136522 104988 308908 197288 -159357 -254146 -157891 121656 86438 -20820
11573 500647 208703 -11644 -62192 420327 -98966 -103215 20590 -235318 381837 76823 -85857
11561 -76348 -34009 -12717 146127 274981 102327 290179 -175637 -208669 214570 23758
11550 314005 316916 -15607 -122892 -164335 6064 119654 -28368 -159945 216558 -95749 210004
11538 43718 -73136 -8661 91776 270811 4549 456778 374200 205549 -17628 203141 -38453
11526 59123 -8423 -59349 117595 240978 96498 112247 188942 -198470 277424 122803 80640
11515 80640 -380719 -18076 -98438 -62920 334862 81523 178680 -42137 -177520 38302 232560
11504 232560 -59354 -82824 -154555 109068 -140675 54794 176612 160638 -40004 194469 36652
11492 166277 79804 133575 415385 74399 184942 -80315 317431 2413 -48981 -188131 274338
11480 -105007 271344 282063 351892 355936 -56087 221194 186609 -119890 443027 378119 38352
11468 268187 290781 439167 253742 -69439 24369 -34296 250552 -2888 101466 -46462 129684
11456 -7076 162398 170907 218771 -100199 -331660 13105 304002 -48079 -76412 150132 239802
11445 239802 88387 -18888 297881 30717 -165105 291797 -17419 -142495 -89506 161084
11434 -20105 300323 238252 55900 135651 233005 97138 21823 -189816 73354 116689 -129510
11422 102486 -114815 -100898 -7558 -138659 228852 -104904 -168027 213493 -248384 -105960
11411 163162 -75243 -36241 -105649 -359233 -107385 84684 -107927 9336 339576 -130163 -52537
11399 -155192 225444 229455 -164177 106559 -234852 190484 25405 -374022 -77429 155689
11388 -130670 -353579 -58587 221212 108200 61827 -438540 172727 216111 -67831 -142414
11378 -142414 173533 -145305 -187832 -109812 12522 223732 40123 127883 107468 338323 -198359
11366 -28130 -111529 78935 251381 -218940 51748 -320966 -92721 58930 -30402 -175221 15984
11354 50983 194214 -320986 -81252 122904 104055 -476120 -300551 259458 91209 -31831
11343 395370 -11419 130132 -13583 89482 -153855 -210331 -130184 -172877 146043 -236116 -146804
11332 -146804 203284 202928 -30310 -41181 -119440 -138838 -93222 -45974 92154 67673 -120630
11320 30424 208819 -88655 -50594 85538 7726 -61875 -128185 -380741 123895 304671 -209223
11308 -4628 -78462 74756 -299995 -132569 141699 51200 -273974 386201 9864 277034 -183228
11296 -170613 -243997 -324386 54143 -26112 105562 126259 8539 -183215 -132531 -46162 -46188 -54540
11284 -54540 202223 -22849 124682 -291604 80029 -160719 -160710 -63583 104820 101917 -9041 200505
11271 171435 93126 -287610 -104249 60299 71835 -80888 63645 -295255 391084 -171766
11260 -47865 -297677 238029 11653 -121058 73641 -355167 213683 258076 82254 -478830
11249 -56460 -229780 -380574 228283 65329 -142760 -242928 -75547 -177423 -426236 -127091
11238 176216 -99904 -290929 276859 17145 -223814 -108223 -27969 -14846 -20435 -47887 -18523
11226 -357916 -35850 -123078 60175 27862 -358242 -41670 -101886 234862 245068 -84449 -37554
11214 -430019 -144580 -69406 -278771 -388926 51974 -385897 100503 27680 -140128 -283160
11204 -283160 -127321 139283 -96802 17709 -176072 -185362 -111376 319233 14986 217730 -4276
11192 -93704 144810 -83570 -47993 -322375 -157958 -106480 54573 -78361 -102453 -519987 119988
11180 -216463 -148973 4266 -283149 -25841 39468 -192027 259628 -5607 154887 -46301 11267
11168 -377885 -205620 101425 -202864 30098 55923 -115144 -176149 138134 132187 -360737
11157 113885 -153056 -34392 10402 -270046 9634 365091 -12490 122612 -218366 185787
11146 54514 218731 -87826 188905 -360217 -89192 496094 204208 157112 259239 -83847
11135 -111069 99194 -249033 172202 -32098 317080 148649 165278 125103 -59584 -38353 102864
11123 2194 -66075 -41456 -6241 -13263 252986 -80561 159140 -139898 38390 89264 -99043 277597
11110 20343 -37943 123972 83903 -25219 345133 48839 -157093 -235763 130080 123795 347724
11099 347724 184666 16818 105920 334785 208364 187126 311423 103323 418207 164305
11088 231514 6923 197187 279407 95273 271541 15322 244657 223347 79303 241720 623739
11077 623739 144607 338719 519479 335476 286561 571599 334075 273846 255223 306183
11067 306183 474124 232119 496670 209036 345183 663495 586185 376075 405552 453131
11057 453131 561058 866900 427853 664431 632449 911523 368189 678682 273383 722333
11047 722333 863857 875401 773386 670890 536880 489002 900367 1001939 607826 849171
11037 849171 811206 376065 845819 508708 585359 660631 454658 575938 541218 559447
11027 559447 342987 587744 608978 548321 685363 850055 707573 716403 623918 529624 625076
11016 625076 339977 398594 447444 565348 822104 184787 394154 658165 433871 535522
11006 535522 458387 723835 548738 509646 602148 649576 683740 575423 603042 762443 206277
10994 1074612 607284 728265 563407 790615 1155002 879439 680182 707029 889773 1133614
10984 1133614 1073602 912628 926850 1213210 1223223 960444 1666059 1467031 2047594 1963866
10974 1963866 2156212 2376877 2810108 2811094 2633512 2975905 2708014 2404325 2083478 2124446
10964 2124446 1824435 1848885 1876210 1729034 1670087 1857212 1521889 1936632 1853655 1717887
10954 1717887 1759742 1562030 1227523 1110127 1067735 934890 923168 563698 649875 649946 322134
10942 251190 167988 418436 494735 29417 282013 98674 540084 -64472 78083 392705 -37218
10930 -36306 148004 54573 -77512 -15031 127867 -144629 250390 21618 122861 1214 -43683
10918 43305 216015 -47872 -8132 15567 -110245 -1373 -268019 -90726 -229354 -89811 -12043
10906 36556 142642 107546 -183326 251286 120669 -198277 280082 -302473 68225 256104
10896 256104 159394 78328 -138281 377348 99843 6360 -94452 203247 110571 103838 -320286
10884 -67408 -19841 169528 -143981 188316 76082 -285976 -42185 -71688 95464 -237597 -283023
10873 -283023 128798 -75112 -56315 201595 162945 187662 -382578 -72349 212652 -71250 28138
10861 -210719 101794 -214727 -263014 -234547 223476 68251 -51579 -18418 212147 32727 -256098
10849 261712 -125762 -360967 161447 -198877 231741 262829 36948 8866 -313191 93702
10838 33428 337482 78785 -18331 -303062 191888 -96696 315819 70677 94000 -248564 -84642
10826 -44014 231129 -226684 165640 -103492 -29561 249594 -219119 -204872 13406 191629
10816 191629 17873 -158517 180196 -82189 83084 73716 -100024 -57692 230501 128860 -38111
10804 -31825 173089 -41992 -107163 -168194 -281713 -222507 -222734 -230141 -122447 -188870 -46419 -241025
10792 -241025 -191107 -119628 239749 -209097 -19356 -331564 14057 -23998 -39713 -127804 23060
10780 -123711 165021 -23091 -31124 -138679 -70706 -17247 -254925 196581 -85273 114520 168568
10769 168568 -134374 45677 -107821 152210 -17979 -218 -70362 -135332 -114023 13885 -147533
10757 -53813 30158 232650 -233941 -111180 28980 -175551 -25070 118332 -265336 7063 -113363
10745 166135 114742 -24615 -328535 243587 -44152 67761 -11446 -297932 132633 -191838
10734 -352267 -90886 -45055 13888 99279 -66687 -151409 33556 149156 -313355 47886 -90260
10722 235112 50058 -80579 -8468 69852 -276685 -664558 -351892 2099 -97129 -73311 -244429
10711 -244429 -171648 165066 -311229 468071 112734 -197039 -41798 -212476 -198851 224335
10700 54798 28721 59099 -126685 -108984 -8776 -139726 -113501 887 82175 -346220 66439 -78894
10687 -256389 -66561 414858 -140662 -56847 -88485 40286 -234990 -261998 -11980 -181338 173237
10675 -160576 99031 -165782 -208756 -106834 -76478 173771 89626 93337 -306769 169706 -182629
10663 -309531 -217536 16941 -32505 -211083 -104385 -202291 -402797 -54262 -88599 -46771 -607581
10652 -607581 -95817 -13822 -153863 -66925 168547 165377 -441918 -142760 151297 -214007
10641 38095 146205 -49599 101770 -131343 236552 84493 251928 -274358 -180960 -146093
10631 -146093 9940 -326173 104893 18967 -4947 -111071 159270 -86970 25422 348417 104452
10619 227039 -79934 98382 24209 -213076 4892 -131191 -109096 -282663 -59655 -179458 -290474
10608 -290474 -249291 269887 180357 18807 3983 74984 -79737 -31799 -268919 82217 24538
10596 -188355 -302525 10360 -33468 36126 227063 -91971 -108521 -180263 212482 332123 -71254
10584 166072 57290 -312909 -113712 273745 240697 -10430 -10700 -220610 -186725 -49750 -165526
10573 -165526 -142504 -140147 -118252 76057 -198621 -495123 -3906 -197269 188556 91586 26086
10561 3995 -156100 -14275 -470881 40014 -166627 -188127 -225578 26489 163041 7058 -185402
10549 -129973 67668 172046 -194466 -1151 -38269 -126932 37571 89486 -150062 3444 -87170
10537 -262588 204262 -312859 -66437 24572 -18478 -166169 -103222 7486 -153310 -199758 -90279
10525 -256216 -53669 -204289 -44810 -153317 27457 23064 108147 -192009 256474 13965 156558
10514 156558 -126201 -254242 -44903 223000 631 83541 -71264 -85343 78726 210141 159934
10503 159934 89721 24369 169552 27389 72517 70654 -158573 97248 -293239 356027 -125333
10491 207464 -135915 -293953 -24671 -84040 200077 246780 -133606 130212 181542 736645
10481 736645 721291 674132 638477 410768 458756 -43996 27791 167025 -59042 -103924 228968
10469 172881 -88649 185197 -188003 68953 10734 82425 -181222 -62611 102516 -389555
10458 -180182 205095 -113917 -7993 -207203 115596 -363962 -117922 131224 -249714 -334672
10448 -334672 52774 119622 227653 -157856 -5030 8225 -114959 64204 -180762 3680 33936
10437 33936 -95408 -140600 174128 106848 55794 53896 253435 -103031 30818 -48817 -30144
10426 -30144 85874 -92805 224232 -21813 -475181 -587623 -19984 210946 -214899 -15785 188050
10414 -59395 1072 64313 41623 -117294 -48551 29829 -186985 204778 -218084 -42760 124131
10402 210962 113203 79368 -43410 52022 -255674 -12550 150947 200888 -61398 35017 -35521
10390 247437 239520 271088 434053 167156 254097 161079 142485 153443 -362136 78887 73818
10379 73818 2909 271359 93522 522241 160613 139836 190084 244622 271821 317552 549874
10368 549874 265211 496974 261084 115625 530469 309638 -75173 110151 436251 345772
10358 345772 371130 713051 332418 45529 156109 178973 746940 276537 321251 610692
10348 610692 536339 214551 397509 271185 436620 246860 486587 -110114 327540 380905
10338 380905 104630 377367 -22522 197922 146536 254112 166488 142186 -6287 -31292 87425
10326 110959 79152 242584 118869 338557 192517 113418 178046 5481 -223890 -19289 -14691
10315 -14691 87506 225212 148154 344044 196667 101479 32341 -268203 -72469 -97035 -14679
10303 -51871 -199521 188931 126555 -184457 -30975 261431 -296858 59475 -152108 -1243 -14800
10292 -14800 -78035 145382 -110394 -32452 143595 -161210 -135515 -529799 -139510 -82657
10282 -82657 -80042 -344425 -125142 -67894 -108954 -230052 -11335 225766 -23644 236752 -196731
10270 228987 -109123 72630 162236 -111600 -147510 363842 124378 -28370 241399 75464
10259 533006 187273 302718 318412 112350 -42392 58126 -61708 -90823 320445 -103751
10248 148856 -97063 79711 -82908 -128975 -132401 115476 200419 273227 -46543 -63675 -165317
10237 -165317 129975 -232801 -155005 -428561 174483 -489269 156664 24637 151730 -208551
10226 168079 -85589 -49361 -280912 -50804 14938 -447301 204356 -37149 -163448 -180269 -290244
10215 -290244 242933 358401 213893 -29544 302828 195894 -212655 59544 -245411 -284612
10205 -284612 -296205 -232989 -246743 -102814 -16469 50888 53592 142233 -99504 -683889 218584
10193 -153638 -138386 -117833 47263 158525 -220702 -104726 -217267 -198115 81375 -86131 39204
10181 195740 -209099 122130 178565 364783 -202314 46256 107719 59087 -217951 -14913
10170 -82967 123213 20051 253867 -330389 -94688 151954 -157324 -130219 87099 194988
10160 194988 -53315 95163 -257187 -349383 67860 -152281 178148 -179285 -21907 -311253
10150 -311253 -192282 159335 -100505 -303013 -48495 174977 200025 -39578 -81475 -124541
10140 -124541 58592 -217075 36019 -162905 -35470 -79790 46227 -62048 -49106 -737 28022
10128 -209906 -294915 -430270 -374839 -166497 -124052 -83585 -137943 -69570 -134435 81129 -224250
10116 774 103392 -134960 -372003 258539 -81284 72784 165871 49989 -57064 9859 -522678
10104 -26900 89080 -236924 141611 -198412 -118414 43166 -28359 -58379 198228 -23043 106261
10092 -316831 -61958 89636 -151982 -85235 29859 -113407 -279239 -68082 95830 -472757 -65574
10080 -27967 2351 -163822 -30372 -420657 -172473 -100743 -157185 125837 -233612 -199023 16088
10068 -115745 -146175 228104 24313 -184438 -202104 -36407 117482 -352706 219473 -232663
10057 -321606 17678 -147022 -137624 175829 201769 -273102 -353856 -128160 -139554 -125524 133074
10045 285625 253584 350297 -55731 -217528 -115164 -62091 -506579 -236463 -302529 86340 17809
10033 -71387 -84617 204435 -294122 -148550 22907 45654 -157386 -161427 198892 -427606 -224134
10022 -224134 -110958 37554 97045 140048 -28012 -118318 -350523 13935 60155 -190438 65760
10010 -130930 -12952 21185 115424 -319334 -28830 37137 373489 48048 -221292 -323493 -139323
9998 -20290 -175034 -27447 -61525 -43317 6555 349252 -144747 -431351 -59309 292104 275200
9987 275200 -135142 -23707 -121461 -286315 22537 -44752 -24304 243629 -59869 -279544 -33260
9975 -90882 47671 -72003 205578 -318974 -165739 -15952 186553 -44848 -24302 -89252 -52393
9964 -52393 136306 119561 -240834 65708 -41608 -21699 169590 116757 291645 74687 -95491
9952 -115602 -227817 -202075 40406 32132 -340568 -61904 -200007 300784 238885 -4452 -155255
9941 -155255 -24278 -416227 65341 -159558 -370005 39380 -108411 -194147 -5841 189147 -106011
9929 -175104 91162 118209 -73933 -452018 -137906 -68990 107109 -256907 79141 -144965 -113557
9918 -113557 -197236 -205416 -154550 -95644 -49396 -129716 -67406 -219004 -58408 -321770 -295071
9907 -295071 -165770 -53893 -231925 -196368 -65271 -127473 -459690 -272463 -315648 140541 -379304
9895 -146954 -38925 -396125 -303505 4451 -77037 -160557 -245660 -14287 -158493 93542 -106091
9883 159674 -202363 56891 185719 -91198 -44970 -164126 -111296 -235546 41955 -256433 -246445
9872 -246445 -190165 28683 -421861 22883 -20810 234239 89113 -156237 -198172 -129887 -105203
9861 -105203 153739 61253 357938 -157806 -45438 143980 -28222 -94378 -8990 -200589 -60078
9849 -105358 -102163 -170399 12961 115049 -79626 -176494 -388375 -23565 25757 -132548 -103631
9838 -103631 -486164 -6568 -343823 139906 124480 -136256 126674 -94140 42183 154428 -272230
9826 -116726 -216242 220584 -202649 169029 -160368 -170463 -565470 55559 -57244 398036
9815 14832 27805 14471 -155372 -9155 177251 -138847 -74433 -238434 -169414 95095 -154650
9803 -333042 17681 -148948 39693 -371341 -56881 -282934 -139553 -365475 -156955 34864
9792 -83549 -199729 305253 126566 122094 133030 85742 351649 80935 215131 -169514 -92984
9781 -92984 -240045 -35980 -140916 298029 387963 50969 -88632 109842 -216484 -148080 -292819
9770 -292819 -287864 -166800 -163386 -386766 41925 45487 -182506 142447 -13532 54459 107108
9759 107108 9362 -148871 -283276 -194415 -34323 -202051 196113 -124318 -72207 590 -487314
9747 72818 -376747 21761 170184 90891 -337924 138079 170954 -184118 177863 45973 -56594
9735 73821 -145807 -77987 -91077 -80843 11797 -162965 -47249 -321460 -98695 91633 269258
9724 269258 144471 -39570 -220197 87180 -181175 -14678 62764 -64549 -45812 -254729 193783
9712 51555 61713 -8323 -204285 -375825 -84947 7230 -30442 -350191 -71685 -325631 -86512
9700 184596 -93770 -165785 200816 -90756 -316927 -256505 14050 -51042 192737 380575 -67284
9688 89750 197897 -178677 -81653 -41282 18779 -290013 -74533 216325 -81672 -33837 -280729
9677 -280729 -361811 108576 -71122 51273 -425974 -80469 -107706 237552 -335097 -306921 -450428
9666 -450428 -8357 368588 -141624 -81885 27298 256544 -193845 127720 287496 -14713 -245463
9655 -245463 -119178 -359075 40974 -171225 244550 -289893 -160356 -419311 -10259 134442
9644 -216864 137041 82132 -69696 -433055 -323080 -157458 -182470 329103 -268522 -335847
9634 -335847 -198841 -258188 -69420 -131450 -199022 19607 254972 -182987 -162104 -87525 145248
9622 5130 -132659 -156467 244604 -197210 100750 -340358 -126587 279290 -102575 317865
9611 162906 24490 -367839 61346 -246225 -81004 -89926 -269813 177114 30699 -188224 10193
9599 -135749 -197428 75109 -131050 -583254 -365720 -119742 277024 -343909 339206 -113872
9588 297334 38247 208378 6128 -228746 -341589 204001 253457 80856 -95298 161237 288970
9577 288970 -93916 -174233 102998 -208539 -414923 -5719 -180638 122566 -42822 -161769 -38854
9565 -155772 160349 -46194 -104342 -68881 -332444 154618 -63466 -72836 -89815 55585 -1113
9553 -80063 340984 -161140 -160596 -309998 -189817 -30126 -340385 -240813 238215 106812 6509
9541 15743 63382 -224912 -215070 -52489 -213696 56586 -152323 -367743 28605 -246733 -133800
9530 -133800 87488 -127215 -156510 145395 42764 239694 -332266 220494 -155621 -251510
9520 -251510 -21941 78774 -34423 -250716 90421 -218258 -72075 73858 -79184 89451 222898
9509 222898 -381334 -151182 -99098 -173741 -199195 -47296 107084 25304 -185330 -28946 129384
9497 -75649 59684 -21520 27030 134794 -140361 23046 158758 -157738 381696 41554 -150277
9485 -155545 31271 -62252 -327947 -170469 -140733 -424981 -35997 -119245 75069 51057 -121611
9473 120243 157788 -186199 287256 78058 249494 -33841 284379 185689 150389 -191632 -138675
9462 -138675 23422 -95421 -249113 -154480 -50692 -151982 -357390 204856 58752 -43438 -173791
9451 -173791 -159670 208912 -146817 4739 -80389 -138227 194803 -243913 -178442 -162810 -59354
9439 -191429 55676 -219609 -74182 -235348 -591601 -75973 -40747 -180440 -43772 -75757 -129753
9428 -129753 -346223 -38836 147027 -196789 6880 -311776 -72868 311948 208230 -299167
9417 -55369 -228033 92192 158965 14601 -48725 -449441 322284 -118271 -154760 338753 -56847
9405 -12472 -367355 64547 81676 -33995 -30864 -12477 192797 -142248 -138273 -48411 -85940 -233370
9393 -233370 -272619 226814 -65599 -62810 -173733 -175360 -46929 254820 76469 157719 -161951
9381 16016 -91161 303186 -88073 -18515 75597 -455791 252701 336824 -123808 -20649 254585
9369 -85038 76582 -32141 -17313 17973 232081 171162 66008 -107387 -246599 -456462 21977
9357 -133799 -96603 -335850 -38091 -306040 78790 -396767 204892 -400140 -330793 90933 80797
9346 80797 56367 205178 288694 311040 -80790 133458 -289576 -349786 135820 -194691 39364
9334 13895 299781 -136369 -19808 41889 -6318 -101578 -39359 4142 -191781 -19009 -155592
9323 -155592 41872 -32255 -141128 23471 67577 -230667 -421267 79172 -138738 -215986 224875
9311 255117 -17189 -37562 -132987 -32316 -293214 -36230 36776 -226644 374912 15062 -200989
9299 -125156 -116618 18364 -90001 22878 16452 -312124 -156647 75781 -107255 -1380 -401819
9288 -401819 108151 -10802 348770 -102731 -57693 -26944 -305422 -221295 -149202 -68207 -204025
9277 -204025 -139671 -90354 5632 141343 -352978 -69795 -277457 -262982 28573 -157 -106967
9266 -106967 -138412 -115083 -102650 33542 -249076 -327440 85859 65553 -93175 -8751 -159801
9255 -159801 -122219 17843 100970 207171 169825 291625 -72642 -232159 236414 140309 -123808
9243 125293 -229982 258759 89533 115748 -196882 -249662 -105011 32709 -218344 -164707 189959
9231 189373 -34793 298377 -43024 -98929 1874 143805 -25114 -55996 -248309 -141385 16263
9219 -175026 -38985 148829 -47651 -85888 105276 -110935 -122661 -142726 -74070 -230765 124864
9207 -140830 -191761 193777 -6756 -148821 -353168 -212929 13722 -196515 45679 27705 -291967
9195 33826 -81478 -273694 -26744 -42704 76989 -146826 -236966 -237608 323317 -180214 112955
9183 -130276 53504 311843 -13772 -153895 -174855 -40608 -353841 493 -246840 185256 -34197
9171 396348 90425 37454 -414245 -267758 -367245 46535 161266 256150 -336262 353654 64403
9159 -284888 121226 179138 -35381 -36657 -129158 180668 -165428 152659 142285 38996 124270
9148 124270 -252247 165506 64495 -210833 27105 -245836 -185094 -179001 -345620 -42879 -75535
9137 -75535 -194354 -304463 -264817 62453 -105468 -134155 -76815 154617 34893 268681 -217823
9125 -92821 -200572 -23087 -57523 -119233 -114832 25442 -43551 -353583 -248393 -93181 -141456
9114 -141456 5854 15764 -149380 -243991 82538 43535 172843 51061 -200790 -22153 -40742
9103 -40742 138159 -147641 -17513 -257563 -41015 -254392 -26747 193794 -400078 -91913 23345
9091 115244 75961 -283006 -107212 -246380 -148913 -358996 218914 22274 -102825 -111624 -132318
9080 -132318 -178640 -87459 -234025 -120345 -120037 2231 32998 -320639 -14170 -67598 -185915
9069 -185915 70431 66403 35358 -252437 -240538 -186119 88910 5629 15945 -122915 -7082 -143365
9057 -143365 -236735 -210744 37626 -64170 -376573 111744 -98894 -26032 277939 -236199 -175781
9046 -175781 -93006 164709 161399 189820 215487 6868 250251 -442328 -384288 -283291 -104148
9034 86449 152609 160740 -8428 58156 -47464 -321151 199339 -218735 -160854 -95747 -15508 -367813
9022 -367813 -88947 42961 -113350 139079 -24581 142993 -26459 1092 -216304 -112089 287546
9010 -5651 -132282 -18760 -162653 -28602 97525 27966 -11806 -100853 -125147 37107 -27864 45003
8997 -9191 -205587 -106765 158878 -168021 -224500 -114425 -4001 158663 44036 -42872 145863
8985 28668 -47928 -122508 -150584 212974 422598 130815 -230074 -104560 -131004 -138266 -8464
8973 -94033 -257192 -203433 -129699 182678 79943 -307324 -80351 -109134 -284445 -363243 13127
8961 -220782 -439942 161160 222704 -45741 -156746 -126587 106414 -61601 -58425 -436581 -202183
8949 73433 -223924 135481 86666 -236467 -363835 -115275 -181851 93632 -139688 -14052 100742
8937 -24621 -305689 -419741 -26064 297503 301673 44780 -110690 276372 -275561 -33417 19715
8925 22925 413754 510684 2266404 6090129 10729344 4752024 1388187 495045 203138
8915 83608 150454 199055 130451 -436013 89395 336120 139466 -181174 138538 81591 -22037
8903 177500 -129852 193068 -325554 -787 -190670 377322 19838 -273812 -81275 -93077 274936
8891 -88300 -354725 -80528 -88208 -291836 129532 170285 -225511 -299399 -159895 -57932 -37040
8880 -37040 -348638 11767 -79756 99029 -33625 -42171 93613 -43172 -77869 -150056 153809 142413
8868 142413 -205890 -481114 -37865 -103549 -94482 -167736 -15817 70892 -54838 172772 -300238
8856 -233126 127389 155216 -40838 -167085 -94416 -112858 -132264 -199685 31168 -228969 298058
8844 258131 11144 326011 -194493 -140825 -99299 -96467 -123929 18487 356582 -40557 -321608
8833 -321608 -166418 -24236 -14852 -28241 171628 -170672 198787 -76376 -167150 -234594 -2668
8821 44107 -139564 -323246 -105341 -134277 -122375 -55692 -67390 -137724 -171526 30816 257297
8810 257297 263889 -74427 -112934 -225234 -154593 172188 263198 -72721 -238198 125767 29287
8798 -65402 202076 125334 -135145 20930 -93676 -442897 183015 133916 153011 -121992 -107880
8787 -107880 -195366 94519 454759 27754 -28359 -53902 354306 447357 930 486199 -33773
8775 -3033 77766 85720 -70402 37353 -158238 -60402 177050 -193274 -164043 -140664 -222989 -81128
8762 -68275 219806 -160544 -167216 584 48301 -102202 270509 -57682 69084 -369129 149688
8750 9384 -55105 -76295 -29970 -233006 35352 36439 82967 3822 -42751 -153839 19079 -36661
8737 -114974 -100025 -133727 -133866 -49374 -293588 -29896 -243263 -163871 -77531 -128786 10860 -148809
8724 203191 -68525 159890 -503679 331969 13519 34397 205417 -233441 70424 -115109
8713 -218546 159664 -132103 -162551 86340 937 -90733 -111482 138111 -69152 55363 90201
8702 90201 -41492 -302848 -274929 -430184 -722844 99339 260629 158746 -95682 -127725 -402715
8691 -402715 14380 78560 -35434 -130894 -229335 -270539 -315887 -142422 174338 62232 -69150
8679 -64760 -193951 -80180 357019 -182414 -92129 -233966 170564 -437032 263121 -134548
8668 36599 20148 -108935 -126897 80748 -191781 140469 -111511 98741 -3975 -150492 -978
8656 -235437 -98629 -3193 47902 98990 -294418 -261370 -26485 -186144 625329 -246504 -232484
8645 -232484 -196157 -46787 -261456 -227553 -162129 -169376 1031 -135787 -161247 148385 36960
8633 32552 -211095 3935 60156 219923 -405634 2999 -75310 -66194 272409 418156 -482349
8621 -40815 -113356 214834 -52604 -37504 -126401 -1344 -86759 -231801 -66271 264331 39123
8609 51144 13699 -312493 -94476 -167603 -264132 -123758 -78808 132390 -101520 -71616 236430
8597 171024 -210930 145512 -257323 15833 -288565 143901 29783 -89336 -357208 -235797
8587 -235797 -86706 -65789 78833 -80680 37415 116218 -149352 156028 165357 237910 -258386
8575 -91719 -299766 -252133 333765 -182712 -97886 -215769 -28243 -88095 441956 173847 164068
8564 164068 -94115 109474 -32310 -77536 -121094 261288 101575 -32107 -61908 -587331 9259
8552 222366 212319 291111 -84817 -144878 -147688 232499 -308203 -142751 249276 -139527 59189
8540 -261867 163703 -184384 -250959 -157621 -240556 72622 99329 -281836 -84156 -304886 -110263
8528 174628 -4842 73159 -304893 -137912 -86252 -57997 49537 311991 -30089 -11361 -180283
8517 -180283 -34458 -101903 124194 -91609 -23160 -225151 -195696 109906 -33034 -35654 -65628
8506 -65628 -31987 158927 270490 -26793 -124970 -153584 -43105 -131031 -217678 93800 46782
8494 -54408 32699 236600 -3030 -103167 549 -119848 41422 -194250 29385 -33585 -40930 -68792
8482 -68792 69537 -99231 -201828 -228174 79053 160858 133479 30711 -246894 -142191 33835
8470 -50918 202471 39580 -36724 -260354 -309833 -13262 -264404 -58367 88009 -34892 -207919
8459 -207919 -238983 -84297 293335 25608 -16126 191083 -89272 -273441 98880 -101951 -112855
8448 -112855 -23207 -243718 -193248 36589 -462795 113285 -76959 -61681 -338830 48115 18912
8436 47746 195984 -94861 142839 74812 -76020 -145231 212895 -106280 -149271 -11817 -202993
8425 -202993 -172382 274435 -1087 234081 279911 -96007 -12565 -224978 18722 32454 362701
8414 362701 -120678 31144 -38207 206414 -164596 150201 -59469 51632 -263826 -44627 -153610
8403 -153610 -272790 301709 -209763 -210403 21995 -177159 46031 -378618 -57478 147656 -514202
8391 262189 -18886 -230445 -136470 107803 -175332 -87269 -79696 -30723 -88441 -218404 -237319
8380 -237319 4145 170594 -258900 -61267 -82294 182697 -89705 -149790 -200202 237726 -87114
8368 -139189 -41158 -68794 -132052 -103219 123193 -45532 -168931 20312 -84825 34512 -124746
8356 -235119 -7611 -108665 209262 13188 -21219 -142401 40534 -271958 16078 -260367 172434
8344 56324 -139238 -120023 -43731 -191610 281516 -1383 -31308 295502 -9638 232952 -75113
8332 240331 -82607 -18691 -6385 39380 -68905 94164 -74012 -332786 85463 253194 -113010
8320 -121713 26911 439427 -112215 10503 -157379 -307465 -275936 -59718 117255 -50921 -143386
8309 -143386 267948 -190171 -88540 -259078 253938 -102356 117933 -79806 -35002 -136167
8299 -136167 -327288 3835 -209620 -370050 -155057 219755 -220657 -20231 -178705 -50995
8288 -52109 -292044 -359593 80758 25934 -124956 62823 22998 -13737 66848 -203606 206294
8276 273450 57740 147860 -57744 -219427 -127328 -40602 148628 199434 158734 -319917 49453
8264 -264185 -140707 32929 -168215 134412 81882 -20035 -14178 -498463 -412366 -277983 43363
8252 -204096 -40546 147817 -213726 143436 -122849 -88836 5734 160532 -341769 -337326 -26836
8240 -221328 73133 40055 -55146 -215516 -151524 114640 96168 -179897 -248332 61567 276578
8229 276578 -33156 40714 42864 195817 -45903 -104494 -63740 -30413 -175108 121352 134002
8218 134002 -27084 85020 35097 50076 -145899 -470268 340462 -376625 190152 -243303
8207 -76317 -76607 -166011 200214 -163574 -541743 -465489 -100504 78520 293766 145329 35436
8195 -12145 -176739 -155172 -131294 -85795 325753 94895 -368029 355863 106838 136718 -66735
8183 65354 27000 30528 -81790 -76542 -49195 -77550 121734 -119776 -30175 99405 296881 108661
8170 42919 -143672 335605 -157191 130068 -34857 -235083 132203 -82762 -309274 -101025
8159 -155074 72390 180768 -133491 -74589 -32117 -114502 227411 -163432 -197967 -311019 116931
8147 37297 -225137 -135044 -156914 -41111 -49051 -190566 -244175 169014 -89327 -100615 -89636
8136 -89636 -73603 -129592 -222982 -153416 -84125 -309261 -23307 -239962 140843 116575 19493
8124 -243378 33517 -11789 118344 58966 -119344 193248 -280767 -99161 10561 123827 103045
8113 103045 51019 -356965 -6454 100810 -23472 -11376 -170944 252124 -253647 -38354 102411
8101 -56604 10360 -116799 62073 63042 -319713 44190 -227331 -233337 -92188 -8463 117608 -78404
8088 77105 58090 -317170 -13038 -151180 -44472 -32215 101039 -11099 183544 -221301 -193137
8077 -193137 -262281 -188709 367363 28292 224234 -138427 182659 14996 -221631 -107572
8066 -2875 182534 187651 -23992 -189786 16629 117896 -425138 -191886 -300903 -84192 -225320
8055 -225320 12937 -36736 -31720 -222417 135820 45571 -476563 86568 -125739 152406 20070
8043 -199596 -210346 71565 -130952 328490 -65427 -54783 94177 -125985 -463587 1548 -185504
8031 -461376 -110865 -85893 -45532 65497 -48107 -15651 102852 -33405 34741 -157282 93740
8019 -159492 -139714 -4711 -133175 20232 10554 -81834 -137063 -152665 -405460 105065 273913
8008 273913 -146833 -30826 -112236 87748 268449 133232 -122806 -28091 -166792 210677
7997 -289514 -113310 11410 107228 -254851 -219483 147192 163072 97214 34022 -398676 18274
7985 84609 -190258 -76924 206986 20756 -173022 -41947 61749 -307559 -157591 -38331 -111954
7974 -111954 -194606 73351 -163903 65507 95810 -118016 13500 76494 31065 -81796 265089
7962 4742 -137712 -168505 -4779 164104 -120263 -105276 -727 -280406 93068 -8632 -320448 83753
7949 20171 -12214 -137940 334116 -80789 -58335 145414 -29650 -35176 -48940 -116532 -77503
7938 -77503 8058 80591 87816 -191644 197603 -29960 -101020 82157 123085 86253 226028 78178
7925 69963 -58372 177843 86097 36263 -146309 -137042 -39087 242643 132794 132178 -177589
7913 -12156 -109387 -222593 -2995 51449 -106104 -297552 -298 24606 52503 -258160 -139823
7902 -139823 -55384 128887 -63963 437964 182570 177536 345947 -51165 1600 -211789 175322
7890 28846 132935 -55047 -53008 157819 -146185 41591 -137054 220538 -250024 -285888 -168030
7879 -168030 -77938 329316 44938 -366077 -181743 -236197 20309 270475 341552 -267166 -162940
7868 -162940 23408 -147772 239724 -25216 -276780 125568 278915 -379282 66934 -6108 -215605
7857 -215605 185271 111666 7243 -97553 38318 -282829 -21612 -301667 -15627 -103961 40252
7845 -311756 148863 98653 81017 238285 22290 -125365 -247783 -2218 148112 -22538 -289451
7834 -289451 -133112 -268794 -199602 -43869 66993 -115893 -79783 -19195 185026 33088 -196367
7822 -532520 -70524 -197832 -65647 59144 -72217 127276 -18127 -160194 150118 7510 169170
7811 169170 191664 -168010 -22557 148824 40126 -83235 -113704 -138031 89240 186789 269405
7800 269405 14773 -66713 103712 -92169 -48956 -400844 -176470 -36880 226734 102578 68795
7789 68795 -229946 172256 -107547 9084 -448480 137771 -60395 47602 -54262 74214 -134128
7777 -165271 53053 -330764 104344 -133977 162921 -415041 92730 -424921 142357 -47941
7766 -29452 71602 76652 -117816 -160863 -131265 236147 -282598 80033 -120825 -371412 173003
7754 93557 -299698 -74542 152546 -186348 139299 -36953 -190067 -140503 44205 -470 200253
7742 -294062 432758 -93403 -210888 -57879 -60533 -223075 -326582 -90129 -187176 249982 -103906
7730 -2473 43891 -327551 16258 -56741 -143882 174862 -37174 321837 -233202 -8052 -135397
7719 -135397 45775 -354048 105464 -254324 -313649 -358347 307473 -48307 -167159 151695
7708 111570 -80270 -10393 181447 59417 -115682 -265866 -55234 -2512 -278896 200584 -96640
7696 149690 -64305 84359 -179097 15936 63676 174172 137814 -181508 98437 -68185 -126629
7685 -126629 -140666 48487 -104068 80242 229493 -114885 63880 1784 -281722 88438 -94959
7673 -228899 -105979 36775 -195148 22981 -205238 166861 458587 -373530 424913 48471
7662 22924 11900 -265698 40298 -289598 108335 -45070 101683 45696 89220 194172 51353
7650 18490 -53562 -25956 -428114 -118841 -117680 -192482 3302 -122149 145788 -14098 -382530
7639 -382530 57768 133589 -33293 117124 36494 222184 97029 -78030 76474 243029 -27232
7627 -468584 50691 -149185 -48737 94529 -195885 -192239 -147223 -184013 -228137 67441 360995
7616 360995 87017 90867 -72277 -4208 -3125 -194832 -305262 372817 24355 -9955 -8137 14206
7603 374302 -83691 -283070 -244946 -12097 -202383 190630 92585 -50880 -133422 -66555 32258
7591 50069 42594 -128372 -146752 -166811 -174540 -50787 107809 112557 -329502 -47717 331502 -31693
7578 -135665 -4161 90317 -72021 182101 -40715 -381433 -205301 -142044 -65086 -291120 -85703
7566 2558 -248961 -17279 -10904 492840 -120805 -112067 -89763 -92668 -60674 -39243 -295913 7352
7553 126944 -40305 -77894 97390 208280 72762 175398 193311 -48315 -61780 -199375 -101042
7542 -101042 -74959 -68974 110826 -359120 -49272 -499 185868 -99385 -302699 -12800 -50501
7531 -50501 -92594 -77516 -112744 -152910 12630 -276939 -245860 -140781 121697 -297831 160483
7519 -87704 2447 -447735 -139653 -35610 89866 181401 246222 10374 223200 129594 -96221
7507 56221 -83992 -162040 290793 158078 -258500 -121958 -34571 -153855 15729 105206 -386407
7495 26098 186895 -236244 -152597 -178330 -384837 -266465 223299 83108 102495 45100 -33258
7483 -187066 -431006 55691 -19101 61138 -266168 126258 215711 -27402 70526 287104 -61792
7471 -121887 229794 -80451 -363417 -77987 -232621 122408 -252224 73757 246366 -304185
7460 -200941 75648 -109012 53738 -128109 54838 -13354 -411668 77386 -137054 15044 3239
7448 -208583 121510 -274537 -145852 -293789 -138209 364907 50062 39863 20000 85461
7438 85461 -29172 110345 174324 -330566 35759 285251 -65641 134555 4658 170152 49767
7426 -50038 -308537 157620 -58621 46659 89473 -135197 192266 -176605 382497 -368969
7415 6567 -41790 -205530 -296403 -71720 -50204 -75967 238030 -44677 32758 -76475 -307698
7404 -307698 45210 -54716 9533 -135427 -113414 -167022 -73900 220049 -227798 -38574 44411
7392 -79327 105942 409258 10063 187103 -302241 -97765 -189676 278570 -276609 -155238
7382 -155238 115141 -75593 -158249 -173784 116031 -164676 191662 -103271 44713 -313957
7371 -68251 3524 -94870 34450 207286 -420387 -105359 -77756 153957 -220047 253352 196819
7360 196819 -41656 -74525 -122860 -54894 458431 -297484 -95588 211475 216043 -143347 -4829
7348 -205902 -275047 127729 -199018 -116588 -165967 -73351 59711 -79794 -63197 76681 299774
7337 299774 215833 -309406 -63684 -2594 -7853 -346397 117352 -149038 38253 -42510 -38393
7326 -38393 -330293 138192 -96565 9798 6592 -105454 -89160 74885 -134178 111194 -105033
7314 -245073 188148 106878 -217785 -92671 75956 202274 -17936 -184520 225089 22976 259601
7303 259601 -13979 -204098 -218980 -88740 -38095 190205 36289 -98706 188777 91472 202368
7292 202368 -125017 -227619 66155 -54106 492701 174639 -130431 -143623 -21311 -54577 93613
7280 32504 69187 297969 178159 -34542 -370078 -40011 237200 -120248 -54699 -375167 -128165
7268 -274421 189717 6500 200771 109006 -150102 161262 50749 315161 116136 -20177 -13868
7257 -13868 -314148 54756 -110265 -82135 -223215 102550 1402 -145959 504 -102385 -58977
7246 -58977 118493 -113433 -205641 151154 -263489 -54478 -33687 141151 173453 -173347 85234
7234 -71652 23264 15900 -291667 66158 -144230 -26414 80459 -41059 -55214 -250999 -57269
7222 168151 -250136 -22490 -126560 164438 -272657 -144811 -101158 -157559 102725 -361566
7211 35585 90400 -85582 78810 -20718 -157052 -289408 283614 -221867 169743 77805 164093
7200 164093 53364 -39315 306173 -204306 -590401 -102609 123246 218926 -10398 19934 -60094
7188 73802 -257480 38666 191754 24319 -141577 49019 -185691 35579 -208051 -98424 -264381
7177 -264381 150461 235909 6291 207753 -267944 -43242 98938 -43162 -374172 -104888 -304650
7166 -304650 97393 22875 -71769 -147463 -115017 6173 -87235 -34371 82605 127914 159768 -81255
7153 -73106 -132549 31525 -91823 6206 130229 -214289 307547 81859 148381 40701 -75701
7141 -89566 -352769 277350 -189215 -157743 272511 50293 -229880 -269340 172673 153699 -5504
7129 -114196 -213785 -145363 -24392 -121326 75067 -240474 51130 170446 68880 -343217 -262861
7118 -262861 -179690 442907 -65175 2670 -134739 34113 -299147 -288619 28358 -5173 -64808
7107 -64808 -161267 260398 -117801 -170946 -190819 -125596 169536 164292 -343864 211876 41164
7095 -149267 74139 164132 137630 27914 53985 -230008 97044 115869 -130709 -180018 275126
7083 235765 -253835 22216 -100832 -115813 124125 -211408 312164 1236 -166081 39250 -101536
7071 -105504 394294 -154916 -261410 -87809 -173473 121061 335111 -198047 104684 276181
7061 276181 24658 149846 -134005 86625 -280133 61437 -117824 102540 102312 146795 82161
7050 82161 -7548 -171440 -62019 26678 122546 147480 269888 163242 -148598 -131052 366946
7038 -187870 -63987 71208 -98367 215791 -172679 -122103 305071 -353593 31812 -70251 215346
7026 -205979 -129693 -67602 -8208 -306913 -15446 265626 -141534 172360 -253933 58194 -179428
7014 -28508 152624 8680 102985 -81128 114673 244266 -317397 70749 15819 -276566 -96967
7002 -194354 -200055 265780 63633 315244 -29713 -14054 25479 -302434 309022 -145964 112988
6990 -240083 20352 124350 -315365 -252025 98830 -124907 -233099 31131 23763 -256881 10847
6978 113588 152144 -7861 -62541 -328980 258150 -225573 132266 53401 280761 -1458 -36614
6967 -36614 -70000 103802 -246847 18789 143716 -100145 119213 -274335 -7824 186984 -231981
6955 557909 156524 -199235 -69514 -199543 177263 129457 -36670 -594637 295642 -72580
6944 -181475 -39120 -67044 -231865 37468 -127500 -151066 224263 -67864 108665 -50804 406287
6932 -167395 170743 -181850 400178 -190510 35601 163854 -97416 188114 -195714 -60024
6921 -61392 -565356 155889 291595 -112947 90922 58856 -62952 -141296 -129946 46243 -75351
6909 -1236 396952 -3863 -45160 -230643 -96160 75195 126944 79996 121834 -87423 185725 101570
6897 101570 40281 -108887 33998 -171060 -277205 -377278 -39135 55350 -187023 88717 -279821
6885 473979 133335 -120022 152243 48970 -49430 75199 62887 -553306 -55800 27193 243952
6874 243952 248200 172468 -348298 153123 61495 251984 280564 45938 196041 -157 -216182
6863 -216182 -99292 -99465 -39360 -367436 -21641 34548 3570 -119402 -178558 -205190 136377 -282185
6850 -16861 -183664 385349 279600 -171268 -200808 131632 -116628 76819 -305497 -247273
6840 -247273 -94757 280067 -156361 106765 -248700 180117 286551 58876 1181 35298 397359
6829 397359 -396763 118962 -144251 -121927 -230308 -240674 -139672 -156014 -48482 -146725 -125893
6818 -125893 -100764 -133743 -46561 -84526 -116133 -30508 -142554 -46410 154551 -224389 201424
6806 83369 -277544 -72766 -21079 197330 257021 30694 -49305 8683 -190334 134982 -156808
6794 -68196 -13112 46389 -97361 -447289 139155 18538 -276652 22787 -87558 -122868 -101273
6783 -101273 35053 40383 -213290 253450 198531 -165268 -349869 -51328 256878 -305065 188320
6771 253643 -51492 231424 51298 -175566 -47304 185512 -126549 374885 -47861 -21484 368815
6759 -179259 123708 -17760 -144089 185381 156732 100949 -137241 209363 214065 -25930 -129190
6748 -129190 223813 -279573 180351 -53786 81770 -147195 -258415 151669 -65691 236204
6737 88912 -191043 -12874 -138195 -370884 73880 92206 303107 -91529 148520 -54611 -246719
6726 -246719 -351025 -125616 -137916 -261394 -249438 -11227 129587 -135988 163036 -56205
6715 154222 -14778 -252558 301981 -338 -230808 -103752 157249 -18298 -105997 45369 -590041
6703 146567 79628 -68529 146213 156298 79874 200819 117376 126620 -42665 214558 -241142
6691 220122 135686 -180439 490413 -76062 -239863 -1200 583 -161866 36169 44921 -3943 340210
6678 80019 -88487 149575 90859 -151343 -202546 -70245 -53469 133882 -68389 -454779 156953
6666 -178620 123203 -102934 104933 -184516 121593 113879 -111553 -24421 135928 172988
6656 172988 -47546 -109354 -467025 -36981 110050 -180254 -126858 18446 -95402 -247342 284303
6644 37721 83284 -639938 -133208 -107889 -249981 -142427 39960 95922 -167546 -66666 -152536
6633 -152536 -100852 173408 -1996 -153134 -128952 -169923 20916 117778 -141753 -35399 -22164
6622 -22164 250029 137115 -169767 38685 -51188 52034 124273 -39101 -191460 -224461 -28740
6610 -210255 161985 -207642 166052 -22595 -238501 -146095 -30471 209061 274240 348165 22153
6598 54210 230362 -314433 -191650 65408 -232726 -61225 156874 448293 -285782 -84253
6587 88627 35670 86877 -69212 -162811 117923 215588 121992 -202488 -25298 -103147 190077
6575 248011 -277282 -166408 -110643 -167767 87895 44686 -153274 -103483 28388 -83772 88630
6563 117109 10425 173587 -50531 36764 170104 -82446 -68887 -331341 121768 -145560 141139
6551 150900 -120653 -242214 13051 58041 -90759 -105596 596613 115033 12647 -152521 290499
6539 -204026 41437 -125004 90438 -269139 -16321 113213 -61661 88501 -138634 -147846 54919
6527 23455 74058 -118943 -50116 90313 -185773 -136556 -57737 -50485 126607 281053 -169610
6515 212472 471550 464170 184129 151932 -118876 -112428 270644 158210 -39503 -190844 -47003
6503 225024 3561 -138190 -125571 232065 -76450 243996 -34557 -28728 -182070 254574 -52119
6491 -530358 -16545 -17577 102987 196307 -75393 -120395 100084 -12398 -39277 -72186 -465739
6480 -465739 -10243 -236614 -168061 -163955 -438021 164351 -199758 -54138 144122 -57570 -35242
6469 -35242 185688 -13416 -123141 21398 -45856 89069 48215 79301 -36719 11155 -154829
6457 -109125 172599 -110870 -143002 95659 -89954 256657 -116915 -257320 151677 -125036
6446 -171480 113314 124068 29924 86342 72817 -72798 -175383 159821 -240222 51299 91643
6435 91643 -141238 -169507 -592593 119995 -261895 -48920 -16615 -72290 -230 14051 -144182
6423 -109504 -128003 -32697 -203958 119636 188685 -266545 101897 53755 -25416 8326 105137
6412 105137 29019 -296876 70559 -112047 -51798 -80699 213048 216270 43267 91286 -95088
6400 384585 347560 121137 98007 -31545 -3903 -113085 5731 -2858 143307 -73070 -260680
6389 -260680 130477 206193 -127791 -67030 192177 -78368 -320995 133486 -101178 -246318
6379 -246318 260114 -99662 -242509 67420 -140411 -67529 -40652 -98385 -13882 -156734 158622
6367 64409 -184134 -145480 -17342 -148601 25144 220130 -206846 -223607 -152296 -78543 -327616
6356 -327616 35523 -46932 113004 68846 -93109 108277 17111 188324 242596 -31746 90915
6344 -386483 -170208 106672 116985 -240505 -295455 134101 -246685 45587 -60752 -366865
6334 -366865 152160 51113 -78257 137821 131394 -104142 -268879 -45534 -335201 216043 140245
6323 140245 -135221 -198259 -28052 75063 61297 93268 -131985 -226568 62753 137926 -200304
6311 216030 74803 94914 -441758 -1549 -129460 157067 222148 52321 -113901 -65052 -134356
6300 -134356 -35515 -60413 227750 7782 -334077 -104356 -99267 -168979 -214092 -280104 -120461
6288 177621 51345 69290 106497 86411 41555 -21162 214562 129023 327706 -350827 60079
6276 -140724 -223478 -129637 23029 41669 -510523 64776 -297955 157524 -66984 -207622 14490
6264 45025 -6337 -239848 -129463 208338 160493 -199524 -5548 -53912 18472 63015 89062
6253 89062 -24186 -78233 -86692 114158 -160119 14910 -141276 58796 32457 -161893 3850
6241 87695 -196392 171698 -352213 -135475 -131273 -133221 -72857 108445 -77980 -48566 150005
6229 170143 135273 -39763 111457 39782 -142262 -71193 46978 -118984 -284586 -14320 -102523
6218 -102523 132915 -142365 192176 611183 -167679 198103 -58740 311 57997 -88742 143469
6206 -202745 -3289 -82726 -69740 231384 -61387 -16040 421264 -200907 252534 -97820 -7448
6194 205184 276950 -21282 -160234 -195701 -455504 -51354 -108781 -312365 185555 110153 -273004
6182 -8022 -154403 -266536 43110 -79001 109156 -79452 -119159 171901 -94744 286787 191615
6171 191615 -134810 301521 -57921 -162232 -41011 22939 104442 -19406 21758 125079 -6509
6159 -43364 54049 287903 70389 129161 255885 -211531 -252700 148831 128779 126644 -4482
6147 -79813 -845 50527 135044 84919 -76992 -299808 -31707 232108 272322 -258788 -211217 241266
6134 -77340 238840 -32315 -103502 254452 127773 220370 -120300 -45960 367385 77934 78274
6123 78274 -111237 34115 225696 15814 322047 153132 -310224 -150958 113948 -35203
6112 -7679 49215 -225641 -91697 232662 19324 272982 141971 291313 143349 -106283 107022
6100 -420765 -123653 248905 -67726 277744 -72098 -203320 50752 -176065 -30985 -10311 -134449
6089 -134449 60286 -6874 -143070 -197691 -22809 -181158 -44655 133113 -240528 -21496 168715
6077 -223526 -76428 -17918 -70317 -112757 -112890 -160747 -86470 -116915 -121847 13145 1527 11345 34496
6064 34496 152669 -72041 -181545 -55616 -76629 159131 236907 229135 -30510 143563 53903
6052 145246 162632 -79335 -101982 -225678 -211014 261887 21074 84478 223449 -240153 -277523
6041 -277523 -260103 -8364 30478 29256 -105684 -224873 172231 100485 81431 141702 42470
6029 119952 -116056 -28352 -176172 -265111 366702 181730 27771 77834 -284387 144692
6018 -121676 178833 -128227 -220589 87330 -291614 -331964 194915 -150332 -377180 -64113
6007 78575 -76054 -99030 -124169 -250180 59176 -118879 -112012 145327 -219647 -188847 -168861
5996 -168861 -137336 -121913 -138730 202930 135151 243624 -166593 88046 -84427 -9324 125406
5984 -235855 -281026 150451 -185526 -80482 33326 120420 -3923 44682 98992 -200288 95705
5972 -152090 -27517 -188686 -432762 582 -235251 152936 -63657 202848 267221 93271 135972
5961 135972 151637 154277 -163496 23711 -576310 -172742 -34846 -156771 23066 45275 260318
5950 260318 9551 2395 -57681 57279 -241012 -96536 -2470 -291715 143546 168088 145745 202961
5938 202961 -57786 -24389 163577 29421 -147227 250329 -85952 154073 155750 -141715 -115454
5927 -115454 -16259 101958 -48550 -21407 -28571 192335 39414 132868 -295125 157207 -360632
5915 -149262 -251672 -18400 80142 -266724 48410 146199 15207 -188756 -125902 3570 218136
5904 218136 128228 184293 -13768 165193 244144 1132 20005 -4115 71574 -54694 264051 57730
5891 -469966 208274 208070 296610 34611 -35253 105121 -102535 -136362 -88832 25314 -21513
5879 24233 96863 -195731 135805 377731 -241280 185083 -57347 -3486 -139182 -20958 -30004
5868 -30004 -2527 233646 192450 -70364 -38601 22685 -194991 80664 160309 152159 -212003 -76856
5855 238873 -308778 -147976 -62021 5047 52334 -35596 -38012 438681 -73948 -286241 10327
5843 45815 17509 1249 -89282 174036 100296 59057 75035 -12107 -195647 135515 210487
5832 210487 -83774 98307 45507 -259520 -125069 -94105 -91690 -16300 -8067 78559 -189413
5820 99736 12864 48887 109029 45136 49194 -172082 -22005 -202746 44840 236963 -63403
5808 367596 196806 13882 140016 -210379 -303037 2395 5150 38191 -254397 -37925 -345068
5797 -345068 248346 -43877 198878 -56126 12541 35983 -136480 65638 101732 295373 74997
5785 -272228 -13388 198413 82299 103703 142042 -175382 324757 25859 -228059 -53222 -152289
5774 -152289 10207 -249845 -81443 -66275 -194439 -190734 48088 117964 93424 -184825 -109182
5763 -109182 -122821 22309 -287291 -151109 -399648 123324 -300340 -50543 -27836 -283679
5753 -283679 147259 -175245 -98606 197629 310216 122884 22292 -202684 80542 214137
5743 214137 -116929 16852 130233 292693 63373 166778 -347216 -171203 -130767 108488
5732 -100837 200193 -10078 -136815 -77095 -81288 -2479 14997 -279069 5822 -350508 -375411
5721 -375411 -27392 324340 224742 262391 152709 83359 31362 -106163 74154 -33787 106363
5709 272121 116843 -219101 -256593 131862 -161975 234862 -310520 -62616 -271038 -33910
5698 -192900 38971 -175415 97578 49238 -246100 251452 -363346 343177 -42150 15072 107306
5687 107306 102606 35429 315230 -244245 -241870 70528 -363307 -42809 -166035 165857 149763
5676 149763 -66994 -99018 -124484 -191684 20438 -366135 148491 20167 -50837 -24255 -113141
5665 -113141 -168237 494744 462985 201053 23200 235971 -238302 214047 7331 173709 129707
5654 129707 -78761 -102519 4857 101700 -330912 -103598 -128467 -72696 -337555 140815 -62238
5642 105816 -255364 161112 -224445 76126 -269021 170317 -51376 -30539 51925 -131549
5631 197632 -94092 -164569 -451321 -229096 303309 -128960 59902 15973 -185222 -101604 114785
5619 13573 221093 -84396 -207812 51892 -21304 12200 100610 291337 -635502 -347085 -256919
5608 -256919 -274729 -62814 58762 -62258 -122068 -6834 -92582 -75341 67476 -182901 -2934 3775
5595 88961 -184230 -277085 -69628 -74588 -74784 256088 339018 -69663 -149498 -60219 -251338 246593
5582 231801 -16724 105995 59155 9500 77734 180446 -194373 9651 -148590 74656 455853
5571 455853 11971 -155492 944 -287501 161735 -180236 164808 125329 110962 -11589 72483
5559 67879 17470 21343 282557 -93902 121296 -73695 -203334 -216445 -129008 281498 -72135
5547 -141302 155328 -65302 -33061 284751 165522 -123064 -235959 152161 25584 9363 224467
5536 224467 175032 -60796 80224 -238222 136300 16250 -41397 48649 -55948 -11609 -102043
5525 -102043 -229181 -108820 -209010 -61647 17521 -166370 -356712 -86951 -49120 -111783 -142492
5514 -142492 35102 -351299 -262248 -307277 144635 -42123 231881 117295 15575 25651 13982
5503 13982 -97602 -90061 205667 134062 -241300 215251 -135660 58668 -60981 22978 -358911
5491 439224 -108220 844 -293012 137453 137374 37122 17137 141798 -144173 -79357 133417
5479 -15880 126633 39681 166196 -8243 -289191 -114972 -386477 22567 -56499 15672 -144609
5467 107961 35506 -173197 18248 10720 -100859 -40634 -302633 -276949 -311451 133043 -141232
5455 -175334 295142 -197676 -174044 214369 -230092 164003 41608 -31964 -199915 143280
5444 -126577 -17976 73730 -8364 -56125 -190135 68666 -50620 28028 -110352 10539 72298
5433 72298 -139463 -132457 102246 -12119 -206466 -136828 261072 -212828 -134 78062 239779
5422 239779 355810 27984 -219128 -103451 46862 184391 36018 -120786 135950 -186963
5411 169627 -42026 118471 219513 -58268 54321 172883 339031 256913 433970 -69953 -286712
5400 -286712 -80666 -15122 620795 -113596 -306299 42512 -2777 204024 -46822 -21904 -56806
5389 -56806 343352 -129514 -123764 237930 -237533 161933 -77683 169271 -29915 159677 -57775
5377 -49179 -26878 -92200 8462 -56668 226069 -197590 5397 -246366 -186337 -68520 -244597
5366 -244597 221006 -132852 112251 -178729 69475 -176911 -315739 -137369 -150272 113472
5355 -191439 -50004 -253463 110697 134418 -64987 120369 -241541 80484 62499 -71981 184753
5343 143813 -24071 -77803 471449 -259295 145079 209512 -195376 -149017 -86679 -330414 -182639
5332 -182639 173258 -472972 -117581 -2694 -101321 58493 185479 151512 -77134 -276896 157413
5320 328530 -161806 196855 154430 -112080 -194782 13448 72244 14572 205241 -73767 -23260
5308 643545 -407877 -157839 -37393 19832 235470 147172 -48275 -232842 10481 -218938 306166
5296 123570 60095 -350215 -149007 -178879 -378251 -70179 39560 4759 314122 56695 348158
5285 348158 80362 -177450 -299622 -293148 -91497 -163875 246084 -210539 -88195 212541 173365
5274 173365 40932 155666 141547 -8782 274642 -15868 -13349 -82913 91378 -91271 -8215 -127943
5262 -127943 -189580 -29847 -39819 -304379 -355258 186676 -189542 -33149 83777 -224775 -16532
5250 34647 66798 -55008 195356 118458 57739 149154 327450 -293795 247189 358842 -183051
5238 59405 117090 -38403 -30015 -85981 -225612 61922 60639 2189 144484 86018 115494 -14973
5225 -100612 167372 -356595 164471 57527 211967 -94930 -292592 -155693 -194801 -171240
5215 -171240 -94071 44571 -216272 35391 -174694 44925 5945 354845 57325 42648 -136737
5203 -202176 -161877 24953 -157594 231085 415973 44919 -155197 -112974 39309 -89795 -54500
5192 -54500 296544 -54027 -101757 -227380 47381 31098 -112741 311802 -146009 24743 78098
5181 78098 176861 -9806 191998 -233316 -30569 -81248 -259678 -116876 -29664 -135284 -92955
5170 -92955 -318064 -277215 -128393 90949 -30839 -71580 22616 174962 -13517 -125682 138930
5158 237535 -66367 -167799 -70860 355560 282939 -122076 -219806 49672 -47716 15753 18527
5147 18527 100900 -44932 -87226 8185 -177135 42987 -91820 -156395 -116697 236360 -90592 63235
5134 12710 240590 186349 114903 245042 62557 146915 -64307 316817 -74826 -73253 129376
5122 97610 -233976 -217767 -1661 -360860 35126 -78416 -100304 -14025 -168352 -233041 142976
5110 -55391 -137004 382925 882 -73412 86285 -155478 -136538 -124707 -59602 175196 -57712 -303371
5098 -303371 -4600 156574 100346 172113 -90676 433858 -71951 749 110219 -182158 119240
5086 -30416 -21035 -217290 -109214 -88802 -52902 129228 242978 272136 446818 -123737 -162508
5075 -162508 -240677 -113160 127049 162089 -51235 292642 250649 41201 -48056 372569 -16271
5063 -131155 112379 -23263 -160455 -60923 -286740 25920 -133181 -13571 -179377 -9044 -19772
5052 -19772 -148155 -184690 -428374 435947 29564 -65918 106661 105753 -130113 -43207 47323
5040 -105152 67146 -108528 -237920 -6778 -15600 -297994 2177 -571134 98435 -47179 -1039 169162
5027 -7748 15395 -372782 117254 -39810 234195 146131 31080 448627 271378 184155 -9723
5015 166744 54659 30727 -49865 -175859 74637 68116 13092 207732 117900 -196895 -13943
5003 -214357 142868 -35319 459262 -47412 107732 -73761 126658 102360 139080 210379 -64660
4991 181686 -19459 22752 -97986 -176751 305325 -167615 290553 136196 145061 -132578 -128641
4980 -128641 -14196 -311711 263069 8362 -29152 -22260 115278 -31502 -97882 160284 -241340
4968 74318 -25051 -354248 -142900 -107561 -258194 37209 -84622 44164 -209689 82094 -263610
4956 -277724 -613838 -23358 -23930 264738 -11470 204631 -23835 -76257 92119 26206 81240
4945 81240 51750 14149 33742 -101527 -67786 -255354 -68005 -105368 -145384 156305 -45337
4933 115911 -28599 33615 34879 191378 265342 -398271 -70530 23434 145662 14842 -368407
4921 -9709 116749 41172 -130798 13667 45823 -27964 122720 -558913 137301 42025 220648
4910 220648 106204 291357 -153776 252209 -112328 -132472 -132488 85194 33858 174615 360142
4899 360142 -21380 9459 115555 -169012 164159 12735 -93802 65512 -307069 218821 16591
4887 388038 47883 -346488 -128838 -107678 173706 118621 -347086 -186587 294155 62662
4876 -86110 211778 167888 -30248 29680 -78181 -148359 -79717 -143801 -82677 -140022 149798
4864 105898 167771 366152 130799 -117788 -246747 -222439 35941 178809 -250606 -81851
4853 -73601 -80088 156290 -99592 180771 103585 -258829 218822 258716 -133387 269835 15968
4841 152236 -12715 -166577 206219 358339 -193054 -129728 -54797 -113785 141720 -161026
4830 129176 -122824 108962 -46518 -98224 -93192 -185767 332960 72368 -15637 143938 141170
4819 141170 265221 -30180 54092 -84914 186169 269880 -230436 210912 -80492 -101189 111073
4807 201917 169498 -385666 60692 -26820 72176 -83636 117617 144951 -270433 -183102 36152
4795 -88995 -187153 201718 93371 206457 90462 -174514 -133727 7630 -382247 113027 -1758
4783 -44169 183313 106647 -226068 -379210 11160 -83911 -164034 -164920 130945 -99512 -81300
4772 -81300 270354 -11302 144261 -147040 -200983 89110 -313157 -146595 -129363 -49383 -17809
4760 -33569 -165474 237918 -131102 -481347 -43160 38084 -111724 43314 58641 -322500 -3899
4748 -101489 -6151 32186 -32306 60935 251921 -5939 55033 -172146 571547 -26470 -243627
4737 -243627 102407 -40158 -119690 -194539 60477 -8249 38888 205843 -5468 -144751 -222183
4726 -222183 151989 135571 -29612 -127242 291060 -106043 58676 -297121 -51675 91417 137346
4715 137346 139617 190382 -70223 111900 75651 437016 -137173 -140299 -240190 -127884 -313120
4704 -313120 -118893 54377 78889 -180706 12887 194210 180634 208883 2326 186831 73207
4692 -264044 243938 -169349 -97091 5102 482031 -316051 119892 25107 -199223 149847
4681 -60143 96406 -113619 39183 -95147 356801 -240784 199171 -102117 -51386 150513 -46047
4669 21646 -7099 18251 161718 -118312 152551 -256193 82875 107790 -261687 -114532 -272198
4658 -272198 70463 -55208 92167 223014 -105684 -111568 -171966 354799 194509 -118849 -188936
4647 -188936 -53318 -150924 64250 43076 -56827 -214800 -222439 -43072 490336 60024 -109295
4635 -127366 159210 -154881 -187168 -79439 20069 -136489 513917 80755 95050 -38761 -55401
4624 -55401 -266483 85013 -210351 -205057 -107116 -243552 231226 -27284 -13788 155719 -111607
4612 12836 48082 54049 -60740 -132742 151964 -276756 -135765 -438706 69670 90127 -269697
4600 -17090 17829 -231868 70325 -232289 191316 -63333 -200497 -147438 -1449 118732 91885
4589 91885 201956 329280 146664 192033 319436 -324988 253104 56738 78924 236055
4579 236055 170296 14615 -247885 43840 -211342 147690 137727 -34730 157779 43256 -2215
4567 -23820 10827 44847 -149040 95114 -96569 109842 37610 359548 275049 -90811 22525
4555 -75054 -40385 267161 -256040 14569 -41532 171234 7960 -66551 -53564 -275868 144935
4543 40995 268763 78620 -13485 142284 -152176 -134910 341444 70575 -73471 227027 -240609
4531 -64535 334765 149648 104636 -120240 281379 -110748 122753 -260595 22627 34678
$$ [...]
##END NTUPLES=NMR SPECTRUM
##END=
