
##TITLE=AC1174_Popayan-cajibio-cauca-CCAAH12001_5898680_RbtZyoOoqB
##JCAMPDX= 6.0         $$ Bruker NMR JCAMP-DX V2.0
##DATA TYPE= NMR SPECTRUM
##DATA CLASS= NTUPLES
##ORIGIN= BRUKER
##OWNER= Administrator
$$ 1.72 TOPSPIN		Version 2.1
$$ 2012-04-03 18:01:24.281 -0500  Administrator@TOPSPIN
$$ Compression mode = diff/dup
##.OBSERVE FREQUENCY= 400.13188235
##.OBSERVE NUCLEUS= ^1H
##.ACQUISITION MODE= SIMULTANEOUS (DQD)
##.ACQUISITION SCHEME= undefined
##.AVERAGES= 8
##.DIGITISER RES= 22
##SPECTROMETER/DATA SYSTEM= spect
##.PULSE SEQUENCE= zg30
##.SOLVENT NAME= COFFEE_meoh
##.SHIFT REFERENCE= INTERNAL, COFFEE_meoh, 1, 14.98061
##AUDIT TRAIL= $$ (NUMBER, WHEN, WHO, WHERE, PROCESS, VERSION, WHAT)
$$ ##TITLE= Audit trail, TOPSPIN		Version 2.1
$$ ##JCAMPDX= 5.01
$$ ##ORIGIN= Bruker BioSpin GmbH
$$ ##OWNER= Administrator
$$ $$ C:\Bruker\TOPSPIN/data/COFFEE/nmr/AC1174_Popayan-cajibio-cauca-CCAAH12001_5898680_RbtZyoOoqB/10/pdata/1/auditp.txt
$$ ##AUDIT TRAIL=  $$ (NUMBER, WHEN, WHO, WHERE, PROCESS, VERSION, WHAT)
(   1,<2012-04-03 18:01:17.125 -0500>,<Administrator>,<TOPSPIN>,<go>,<TOPSPIN 2.1>,
      <created by zg
	started at 2012-04-03 18:00:10.187 -0500,
	POWCHK enabled, PULCHK disabled,
       configuration hash MD5:
       1A 1E CE 29 27 FD 77 03 67 4E F0 E3 C4 B2 CB 90
       data hash MD5: 64K
       D6 EF 40 C1 5B A0 E9 25 37 2A 90 55 5C FE FB 79>)
(   2,<2012-04-03 18:01:19.781 -0500>,<Administrator>,<TOPSPIN>,<proc1d>,<TOPSPIN 2.1>,
      <Start of raw data processing
       efp LB = 0 FT_mod = 6 PKNL = 1 PHC0 = 0 PHC1 = 0 SI = 32K 
       data hash MD5: 32K
       91 4E 81 CB 94 81 22 DF 0A F3 AE 3F 9D A5 65 D5>)
(   3,<2012-04-03 18:01:20.187 -0500>,<Administrator>,<TOPSPIN>,<proc1d>,<TOPSPIN 2.1>,
      <pk PHC0 = 212.6733 PHC1 = 0 
       data hash MD5: 32K
       9C 33 18 8B A5 E7 12 C6 15 AB E4 F4 AB D4 7E DC>)
(   4,<2012-04-03 18:01:20.281 -0500>,<Administrator>,<TOPSPIN>,<proc1d>,<TOPSPIN 2.1>,
      <abs ABSG = 1 
       data hash MD5: 32K
       3B A1 B5 11 8E 95 9C 63 D1 62 C7 51 73 ED DB 46>)
(   5,<2012-04-03 18:01:20.375 -0500>,<Administrator>,<TOPSPIN>,<proc1d>,<TOPSPIN 2.1>,
      <abs ABSG = 2 
       data hash MD5: 32K
       7F E1 A3 BD 6E 03 E0 99 D7 13 F7 CA 18 58 B2 EE>)
(   6,<2012-04-03 18:01:20.406 -0500>,<Administrator>,<TOPSPIN>,<proc1d>,<TOPSPIN 2.1>,
      <abs ABSG = 3 
       data hash MD5: 32K
       A8 D0 6D 14 6C E7 E8 5C 41 FC 5A DD C9 7A 15 B1>)
(   7,<2012-04-03 18:01:20.437 -0500>,<Administrator>,<TOPSPIN>,<proc1d>,<TOPSPIN 2.1>,
      <abs ABSG = 4 
       data hash MD5: 32K
       D7 E8 F9 0A 10 21 6E C5 4A F0 63 80 AD 78 CD 72>)
(   8,<2012-04-03 18:01:20.468 -0500>,<Administrator>,<TOPSPIN>,<proc1d>,<TOPSPIN 2.1>,
      <abs ABSG = 5 
       data hash MD5: 32K
       7F B5 AC F5 2D 2D C4 65 9C 96 2A 2D 1D 00 4E 53>)
$$ ##END=
$$ 
$$ $$ hash MD5
$$ $$ 27 B6 B6 17 6D E3 81 ED 78 3C B5 51 91 43 C9 B8
##$RELAX= 
##$RELAX= 
##$RELAX= 
##$RELAX= 
##$RELAX= 
##$RELAX= 
##$RELAX= 
$$ [...]
150 150 150 150 150 150 150 150
##$TP07= 0
##$TPNAME0= <>
##$TPNAME1= <>
##$TPNAME2= <>
##$TPNAME3= <>
##$TPNAME4= <>
##$TPNAME5= <>
##$TPNAME6= <>
##$TPNAME7= <>
##$TPOAL= (0..7)
0.5 0.5 0.5 0.5 0.5 0.5 0.5 0.5
##$TPOFFS= (0..7)
0 0 0 0 0 0 0 0
##$TUNHIN= 0
##$TUNHOUT= 0
##$TUNXOUT= 0
##$USERA1= <user>
##$USERA2= <user>
##$USERA3= <user>
##$USERA4= <user>
##$USERA5= <user>
##$V9= 5
##$VALIST= <valist>
##$VCLIST= <CCCCCCCCCCCCCCC>
##$VD= 0
##$VDLIST= <DDDDDDDDDDDDDDD>
##$VPLIST= <PPPPPPPPPPPPPPP>
##$VTLIST= <TTTTTTTTTTTTTTT>
##$WBST= 2048
##$WBSW= 25
##$XGAIN= (0..3)
0 0 0 0
##$XL= 0
##$YL= 0
##$YMAX_a= 513636
##$YMIN_a= -624780
##$ZGOPTNS= <>
##$ZL1= 120
##$ZL2= 120
##$ZL3= 120
##$ZL4= 120
##$ABSF1= 14.98061
##$ABSF2= -5.57192
##$ABSG= 5
##$ABSL= 3
##$ALPHA= 0
##$AQORDER= 0
##$ASSFAC= 0
##$ASSFACI= 0
##$ASSFACX= 0
##$ASSWID= 0
##$AUNMP= <proc_prof1d_extract_pilot.lims>
##$AXLEFT= 0
##$AXNAME= <>
##$AXNUC= <1H>
##$AXRIGHT= 0
##$AXTYPE= 0
##$AXUNIT= <>
##$AZFE= 0.1
##$AZFW= 0.1
##$BCFW= 0
##$BC_mod= 0
##$BYTORDP= 0
##$COROFFS= 0
##$CY= 15
##$DATMOD= 1
##$DC= 0
##$DFILT= <>
##$DTYPP= 0
##$F1P= 0
##$F2P= 0
##$FCOR= 0.5
##$FTSIZE= 32768
##$FT_mod= 6
##$GAMMA= 0
##$GB= 0
##$INTBC= 1
##$INTSCL= 1
##$ISEN= 128
##$LB= 0
##$LEV0= 0
##$LPBIN= 0
##$MAXI= 10000
##$MC2= 0
##$MEAN= 0
##$ME_mod= 0
##$MI= 0
##$NCOEF= 0
##$NC_proc= -8
##$NLEV= 6
##$NOISF1= 0
##$NOISF2= 0
##$NSP= 0
##$NTH_PI= 0
##$NZP= 0
##$OFFSET= 14.98061
##$PC= 1
##$PHC0= 212.6733
##$PHC1= 0
##$PH_mod= 1
##$PKNL= yes
##$PPARMOD= 0
##$PPDIAG= 0
##$PPIPTYP= 0
##$PPMPNUM= 2147483647
##$PPRESOL= 1
##$PSCAL= 4
##$PSIGN= 0
##$PYNMP= <proc.py>
##$REVERSE= no
##$SF= 400.13
##$SI= 32768
##$SIGF1= 0
##$SIGF2= 0
##$SINO= 400
##$SIOLD= 32768
##$SPECTYP= <>
##$SREGLST= <1H.CDCl3>
##$SSB= 0
##$STSI= 32768
##$STSR= 0
##$SW_p= 8223.68421052632
##$SYMM= 0
##$S_DEV= 0
##$TDeff= 65536
##$TDoff= 0
##$TI= <>
##$TILT= no
##$TM1= 0
##$TM2= 0
##$TOPLEV= 0
##$USERP1= <user>
##$USERP2= <user>
##$USERP3= <user>
##$USERP4= <user>
##$USERP5= <user>
##$WDW= 1
##$XDIM= 32768
##$YMAX_p= 466622758
##$YMIN_p= -696923
##$CURPLOT= <Network HP LaserJet P1505>
##$CURPRIN= <$Network HP LaserJet P1505>
##$DFORMAT= <normdp>
##$LAYOUT= <+/1D_H.xwp>
##$LFORMAT= <normlp>
##$PFORMAT= <normpl>
##$SURQMSG= 1
$$ End of Bruker specific parameters
$$ ---------------------------------
##NTUPLES= NMR SPECTRUM
##VAR_NAME=  FREQUENCY,     SPECTRUM/REAL,   SPECTRUM/IMAG
##SYMBOL=    X,             R,               I
##VAR_TYPE=  INDEPENDENT,   DEPENDENT,       DEPENDENT
##VAR_FORM=  AFFN,          ASDF,            ASDF
##VAR_DIM=   32768,         32768,           32768
##UNITS=     HZ,            ARBITRARY UNITS, ARBITRARY UNITS
##FACTOR=    0.250966925370066, 1,           1
##FIRST=     8223.43324360095, -97550,       -43069
##LAST=      0,             -174457,         -215491
##MIN=       0,             -696923,         0
##MAX=       8223.43324360095, 466622758,    0
$$ Real data points
##PAGE= N=1
##DATA TABLE= (X++(R..R)), XYDATA
$$ [...]
$$ plain form
19460 -212608 -11564 27133 -290690 -149532 -280766 102392 -40997 -138746 -325906 -215362
19450 -215362 124398 20204 -196506 -48084 72691 -202277 57653 -299638 81545 -52325 -232254
19439 -232254 -81343 -246686 -209964 58930 -2312 -198655 -56402 -170844 -73031 -99736 -57540
19428 -57540 -310271 -246472 -32708 -40975 -111494 -120099 -127378 3918 -300930 366139 -53936 17925
19415 -264521 -367024 -210982 -57397 -38885 138828 -198994 90955 24272 186393 304929
19405 304929 419667 100569 -116442 31503 96698 32175 -80773 -152781 151501 76475 -135013
19393 -176761 -191364 -180646 -213382 -41431 2033 -158383 -172628 -52040 -131126 184623 -179800
19381 59639 87283 -159383 -170862 172082 -67154 -324475 -89681 -318315 -16723 -350298 295644
$$ packed form
19460b12608a1564B7133b90690J41158j31234A02392d0997r7749j87160J10544
19450b15362A24398B0204a96506d8084G2691b02277E7653b99638H1545e2325j79929
19439b32254h1343j65343L6722E8930b312j96343e6402j14442g3031k6705M2196
19428e7540k52731O3799c2708q267p0519q605p279C918c00930C66139e3936A7925
19415b64521j02503J56042e7397J8512A38828a98994I0955B4272J62121J18536
19405C04929J14738A00569a16442C1503O5195C2175h0773p2008A51501p5026a35013
19393a76761j4603J0718l2736d1431B033a58383j4245e2040p9086A84623a79800
19381E9639K7644a59383j1479A72082f7154k57321h9681k28634a6723l33575B95644
$$ plain form
19369 8967 -11237 75304 -111753 89858 -144640 46902 234839 2446 25859 13591 -105014
19357 -4384 -171624 -174451 -68496 79495 -183902 -29317 -210739 -334447 -203067 -200037 182560
19345 12455 76281 -152317 214158 -13140 -192176 52373 102299 -134563 11198 -61480 -88847
19334 -88847 -345098 -62511 -357134 -161151 -4732 -32179 -96483 -141185 -76247 95221 -404600
19322 -442796 52122 96124 124337 99893 -15647 -85969 72438 -289109 -141988 165847 -100351
19310 246088 -26580 -21814 -189279 -199699 13769 -215041 86268 28655 -203341 194402 161092
19299 161092 -22491 -107932 105974 -347120 -269631 -15445 -25996 -95532 101938 45916 304052
19288 304052 -32781 87543 -13289 -304496 -109335 -128475 278657 -234845 -322647 -245988 150406
$$ packed form
19369H967a1237G5304a11753H9858a44640D6902J87937B446K3413j2268a05014
19357d384j67240k827f8496G9495a83902b9317j81422j23708J31380L030A82560
19345A2455O3826a52317B14158a3140j79036E2373M9926a34563A1198f1480k7367
19334h8847k56251f2511k94623a61151d732k7447o4304m4702O4938I5221d04600
19322d42796E2122M4002K8213k4444a5647p0322G2438b89109a41988A65847a00351
19310B46088b6580M766j67465j0420A3769b15041H6268B8655b03341A94402l3310
19299A61092b2491q5441A05974c47120P7489a5445j0551o9536A01938D5916K58136
19288C04052c2781H7543a3289k91207a09335j9140B78657b34845q7802P6659A50406
$$ plain form
19276 -199138 -63081 -273678 63798 -492304 32568 -111708 -43501 16465 -225880 -69665 61003
19264 -73237 -176938 -310319 -194219 -402736 33242 -223103 -210330 -387116 -163619 -254610
19254 -254610 -84183 149438 109246 -127133 204099 -137158 -77293 109174 95354 -264919
19243 -32229 48412 -430204 -92644 -305813 -199943 31615 -158303 33238 97730 276461 267856
19232 267856 -208907 6200 -113333 302065 -186558 -230418 70048 -5702 -236148 -151510 -359427
19221 -359427 78481 -474698 -108857 33406 100818 -406725 -13260 -323970 -83555 -141655 -124966
19210 -124966 -79994 -143920 -371444 -298723 285677 -51287 -208814 -208301 -365681 -72331 218925
19198 -234223 36737 156057 279710 -62710 -98723 -209567 -149756 -268598 51480 -140950
$$ packed form
19276a99138f3081k10597F3798d92304C2568a11708d3501A6465b25880f9665F1003
19264g3237j03701j33381J16100k08517C3242b23103J2773j76786a63619r0991
19254b54610h4183A49438m0192a27133B04099a37158N9865A09174j3820b64919
19243c2229D8412d30204i2644k13169J05870C1615a58303C3238O4492J78731q605
19232B67856b08907F200a13333C02065a86558m3860G0048e702k30446Q4638k07917
19221c59427G8481d74698a08857C3406O7412d06725a3260l10710h3555n8100J6689
19210a24966M4972o3926k27524P2721B85677e1287j57527N13j57380g2331B18925
19198b34223C6737J19320J23653f2710l6013j10844N9811j18842E1480a40950
$$ plain form
19187 -234808 -70836 -68482 -236795 3830 -32659 -13408 53528 -321973 -119122 -185636 -216092
19176 -216092 -229928 -312806 44168 61713 -23354 136156 -125595 -122712 124385 67491 88026
19165 88026 -41421 -37903 29055 105266 138937 -47017 -133032 -50984 -35222 102592 126162 181777
19153 181777 -317041 108451 -181280 730 -101654 -123754 -272372 -277224 13073 -91177 -183410
19142 -183410 -303991 -204050 -479968 -11352 -311200 -307908 112712 -291785 -104296 -70090
19132 -70090 162783 -105336 131979 -351459 -98404 -172693 -292565 196069 136119 29068
19121 -194231 -110184 -146495 -105656 -138085 -37419 -306193 74678 34347 -9578 -225279 -49350
19109 249029 -126234 174265 18080 29841 -65670 93811 -14247 -52364 -98057 5830 241898
$$ packed form
19187b34808g0836K354j68313C830c2659a3408E3528c21973a19122o6514l0456
19176b16092j3836q2878D4168J7545b3354A36156a25595K883A24385n6894K0535
19165H8026d1421L518B9055P6211L3671d7017q6015e0984J5762A02592K3570N5615
19153A81777c17041A08451a81280G30a01654k2100j48618m852A3073i1177r2233
19142a83410j20581R9941k75918a1352k99848L292A12712b91785a04296L4206
19132g0090A62783a05336A31979c51459i8404p4289j19872A96069n9950B9068
19121a94231Q4047l6311M0839l2429c7419k68774G4678C4347i578k15701d9350
19109B49029a26234A74265A8080J1761f5670I3811a4247l8117m5693E830K36068
$$ plain form
19098 241898 175078 -290631 -184292 -49421 31979 -129013 -226926 77779 -167436 186493
19087 -8339 -45162 -101835 193294 -199033 -110996 138379 44305 152951 74232 -101608 137186
19075 133020 -75621 324861 9624 -172992 137158 -288702 -210037 -314094 -372274 -142162
19064 41958 -80548 150701 -144685 -235328 102082 -62206 -132040 266298 126934 329497
19054 329497 -21443 141559 106523 -163977 159894 -389699 -173922 -267353 -118244 -3327
19043 17489 57548 -105851 -46931 -107910 -124057 -296783 11537 -144464 -304141 -258374 262864
19031 -23259 -329688 -120586 120242 -246541 -59105 -203812 -88552 73276 23664 229013
19021 229013 -25248 -246859 -194462 103359 -346369 121650 1488 43904 125717 322764 -95069
$$ packed form
19098B41898o6820b90631J06339d9421C1979a29013r7913G7779a67436A86493
19087h339l6823n6673A93294a99033Q8037A38379D4305J08646G4232a01608A37186
19075A33020g5621C24861I624a72992A37158b88702P8665j04057n8180a42162
19064D1958h0548A50701a44685r0643A02082f2206o9834B66298A26934K02563
19054C29497b1443A41559l5036a63977A59894c89699a73922r3431a18244c327
19043A7489M0059a05851d6931o0979j6147j72726A1537a44464j59677M5767B62864
19031b3259l06429a20586A20242b46541e9105j44707h8552G3276B3664K05349
19021B29013b5248k21611N2397A03359c46369A21650A488M2416Q1813J97047i5069
$$ plain form
19009 -31503 144390 104577 154586 28425 -88203 -97425 332429 -70569 -3062 -197943 -76452
18997 -25185 -2623 -170677 -133742 -270613 229402 -59703 -247488 -89890 126424 38869 -145394
18985 -208811 262265 -142946 106398 150978 237943 236370 -69099 -267401 -157506 -286856
18975 -286856 -219327 -83373 -92914 -33984 129505 182322 -130670 -88562 -151949 -92284 -87531
18964 -87531 -30182 -104039 -239522 -159419 186445 -141137 323874 192780 152213 692974
18954 692974 54545 -69031 347418 -24071 -112884 -180402 166965 100714 -230646 -139638 48110
18942 22880 -68795 -13364 -107324 -5077 -21397 142192 -61934 -209741 164137 68360 -106942
18930 -129290 -125930 -113340 208464 197697 -214821 -79703 102391 79117 361946 -12618 -29329
$$ packed form
19009c1503A44390l9813N0009B8425h8203r222C32429g0569c062j94881g6452
18997b5185b623j68054L6935j36871B29402e9703j87785h9890A26424C8869a45394
18985b08811B62265a42946A06398M4580Q6965j573f9099j98302J09895j29350
18975b86856O7529h3373r541c3984A29505N2817a30670M2108o3387N9665M753
18964h7531c0182p3857j35483Q0103A86445a41137C23874j31094m0567N40761
18954F92974E4545f9031C47418b4071q8813o7518A66965o6251b30646R1008D8110
18942B2880f8795a3364r3960e077j6320A42192f1934j47807A64137F8360a06942
18930a29290L360J2590B08464j0767b14821g9703A02391k3274K82829a2618j6711
$$ plain form
18919 -29329 156140 -31388 -73487 -22442 -359482 -179316 132239 -198283 64891 118892 -258226
18907 -90630 -157286 -295882 26890 -230758 -7452 -163342 -133980 31013 -33104 22784 -7501
18895 -47661 -18584 -102 278883 360863 338096 209983 291893 -34114 -146731 31693 -56839
18883 -397898 -189312 -193904 -16981 72696 107275 -69524 72492 68229 -104693 -11716 -28277
18872 -28277 -167117 -199159 -254917 -38079 74340 146121 44981 -133997 -11970 153316 11468
18860 -70453 50693 -161665 -14549 16727 -39480 22927 -317755 -198576 35841 -480224 80345
18848 206964 -168526 -174080 -53399 -129881 -152027 -102210 -61500 -111787 4161 -358321 98237
18836 -58194 103501 503565 -63474 20673 -121387 -42171 -268676 -313166 -12828 47078 140479
$$ packed form
18919b9329A56140c1388m2099b2442l37040a79316A32239a98283F4891N4001b58226
18907i0630o6656j38596B6890b30758g452j55890K9362C1013c3104B2784g501
18895d7661a8584a02B78883Q1980k2767j28113Q1910c4114j12617C1693e6839
18883c97898a89312m592a6981G2696L4579f9524G2492m263a04693a1716j6561
18872b8277j38840l2042n5758c8079G4340P1781D4981a33997a1970A53316A1468
18860g0453E0693a61665a4549A6727c9480B2927c17755J19179C5841d80224H0345
18848B06964a68526n554e3399p6482k2146M9817M0710n0287D161c58321I8237
18836e8194A03501M00064f3474B0673a21387d2171k26505m4490a2828D7078R3401
$$ plain form
18825 140479 77402 -226311 -147206 214401 938 -341181 -6291 -366498 105470 -127150 -59874
18813 -34891 108000 60004 -115570 195879 102904 -261486 -142335 -93786 -129709 108148
18802 -177973 -69337 313087 11046 -132835 97713 -207197 177406 -98721 323428 1854 -156398
18790 -378457 108315 -60624 239231 -102397 377693 157211 40891 47366 -123946 12889
18779 402867 -62770 108060 -44807 94282 -9605 -3494 -128355 -301104 10493 -317889 -48775
18767 104923 161327 101195 4705 -254334 66719 -8466 72261 -218383 165843 -4632 -172413
18756 -172413 -12854 -117112 -263041 95319 -75674 18703 -37855 -90807 105210 -93388 -406180
18745 -406180 -22272 -347231 30540 -109402 -64741 -85159 170610 -71237 -155889 27183 175543
$$ packed form
18825A40479o3077b26311P9105B14401I38c41181f291l60207A05470a27150e9874
18813c4891A08000m7996a15570A95879r2975b61486J19151M8549l5923A08148
18802a77973f9337C13087A1046a32835I7713b07197A77406i8721C23428A854a56398
18790c78457A08315f0624B39231a02397C77693A57211D0891O475a23946A2889
18779D02867f2770A08060d4807I4282i605c494j24861j72749A0493c17889d8775
18767A04923N6404o0132D705b54334F6719h466G2261b18383A65843d632j67781
18756a72413a2854j04258j45929I5319g5674A8703c7855n2952A05210i3388l12792
18745d06180b2272l24959C0540a09402M4661k0418A70610g1237q4652B7183J48360
$$ plain form
18734 175543 -211046 -228482 -42309 -43392 194278 -223675 -255198 30079 82548 -53286 -122372
18723 -122372 -20568 -189103 162363 -327419 -148760 60037 -144444 -29616 -155796 -31126
18712 -28671 -2837 -32712 -228999 132347 -102748 -316256 -149509 120994 432723 121586
18701 -181404 291848 -60460 -233573 180585 -161847 -113704 142884 170581 98003 194995
18691 194995 -161148 -201304 139460 -1396 177185 -210447 242467 -412203 65872 -196998
18680 89275 -156506 330247 -332455 164853 198262 -188791 102250 373083 53555 163434
18670 163434 223112 112579 -106119 184893 -297036 339291 -142431 -163356 -233748 109367
18659 -144916 47742 -144733 -20764 -136970 80870 -249058 -87168 -60479 -157653 -115672 -328952
$$ packed form
18734A75543b11046j7436d2309j083A94278b23675l1523C0079N2469e3286o9086
18723a22372b0568j68535A62363c27419a48760F0037a44444b9616j26180c1126
18712b8671b837k9875j96287A32347a02748k13508a49509A20994L11729A21586
18701a81404B91848f0460j73113A80585a61847M8143A42884K7697p2578R6992
18691A94995a61148m0156A39460a396A77185b10447B42467d12203F5872a96998
18680H9275a56506C30247c32455A64853L3409a88791A02250K70833E3555J09879
18670A63434N9678j10533a06119A84893b97036C39291a42431k0925p0392A09367
18659a44916D7742a44733b0764j16206H0870b49058h7168K6689r7174M1981k13280
$$ plain form
18648 -328952 321846 -217269 108822 -5786 181542 -353231 -236818 -237829 63881 -129361
18637 -102200 -82523 -109193 -49955 23042 300162 -333279 -18277 -91072 -179896 -212622 10847
18625 -316465 8289 -170654 -18485 -41180 -424287 -2819 130793 -329753 -65446 -456329 -180960
18613 -67737 -111460 -242217 75839 -85151 -70802 -231156 129924 -140456 -315275 -442740
18603 -442740 82810 -193557 314878 -263195 119747 -12292 -207522 -137386 -106590 48874
18592 82772 -11701 187086 -464751 243309 122111 -304061 -3724 270656 -13362 13629 -2431
18580 107773 41831 -67532 16069 -83389 -58527 -190104 -239574 47661 -339341 -272674 -68405
18568 142785 6303 -23892 208491 -114442 -126001 -233424 -274721 76847 -176346 4242 103268
$$ packed form
18648c28952C21846b17269A08822e786A81542c53231J16413j011F3881a29361
18637a02200J9677k6670d9955B3042K77120c33279a8277p2795q8824l2726A0847
18625c16465H289a70654a8485k2695l83107b819A30793c29753f5446l90883a80960
18613f7737m3723j30757G5839h5151J4349j60354A29924a40456j74819j27465
18603d42740H2810a93557C14878b63195A19747a2292j95230P0136L0796D8874
18592H2772a1701A87086d64751B43309j21198c04061c724B70656a3362A3629b431
18580A07773D1831f7532A6069h3389K4862j31577m9470D7661c39341O6667f8405
18568A42785F303b3892B08491a14442j1559j07423m1297G6847a76346D242R9026
$$ plain form
18557 103268 -63753 -176938 -298542 93973 -111864 -89569 -75954 -216825 -247246 -63387 -285828
18546 -285828 16662 -98428 -144502 -2729 121844 -291263 -173918 -85278 319133 -189039 297176
18534 13656 -25533 -196551 132457 9325 -64991 95931 161803 -13740 116478 -64302 -287343
18523 -287343 167932 163208 111139 -51782 82832 84233 31965 -357355 -233964 -145953 352805
18511 213654 -223761 -45967 7300 -65063 83212 -50554 -142067 -33077 -113311 175910 33773
18499 -63005 47948 -273573 -48694 -71743 130 -103189 -103707 -131543 166396 209188 -204665 -267192
18487 -267192 -113855 -63119 -86563 -146742 -291858 55716 55607 -179541 -83149 -114868 -1003
18475 -113659 -2753 -172820 184655 191684 440698 121475 261589 -65741 -214811 -337057
$$ packed form
18557A03268f3753j13185j21604I3973a11864K2295J3615j40871l0421f3387k22441
18546b85828A6662i8428m6074b729A21844b91263J17345h5278C19133a89039B97176
18534A3656b5533j71018A32457I325f4991I5931O5872a3740A16478f4302k23041
18523b87343A67932m724n2069e1782H2832J401C1965c57355J23391Q8011C52805
18511B13654b23761d5967G300f5063H3212e0554r1513c3077q0234A75910C3773
18499f3005D7948b73573d8694k3049A30a03189n18k7836A66396M2792b04665o2527
18487b67192a13855N0736k3444o0179j45116E5716j09a79541h3149l1719a003
18475a13659b753j70067A84655P029K49014A21475J40114f5741j49070j22246
$$ plain form
18465 -337057 -214476 255074 70231 -7333 28372 -95666 -305000 54983 -77544 -57637 -150311
18454 -150311 -190764 180546 16850 338718 126197 -136434 -184516 483825 5773 105052 -121661
18442 -84785 8902 -343785 -66850 9939 -245245 272909 -156879 73615 -36023 132102 77372
18431 77372 -16322 106592 -104203 -38142 -175317 -167728 -34075 -76469 -123603 121298 -184882
18419 218585 -69017 252171 19846 13716 -217376 89872 -152692 -33781 -28683 162930 -76105
18407 86291 1611 -106372 -131861 -322456 -84597 -89654 -75249 -389851 -104968 277363 311239
18396 311239 -345708 258244 -88961 -63549 -284207 -75756 231869 146483 -191389 191165
18385 56615 -317693 -95070 40078 83663 178292 -68617 124243 186071 -215509 82958 217434
$$ packed form
18465c37057J22581B55074G0231g333B8372i5666k09334E4983g7544J9907r2674
18454a50311m0453A80546A6850L21868A26197a36434m8082D83825E773R9279a21661
18442h4785H902c43785f6850I939b45245B72909a56879G3615c6023A32102n4730
18431G7372a6322A06592a04203c8142j37175P589c4075m2394m7134A21298a84882
18419B18585f9017B52171A9846o130b17376H9872a52692c3781N098A62930g6105
18407H6291A611a06372k5489j90595h4597n057J4405l14602a04968B77363L3876
18396C11239c45708B58244h8961K5412k20658g5756B31869q5386a91389A91165
18385E6615c17693i5070D0078M3585R4629f8617A24243O1828b15509H2958J34476
$$ plain form
18374 217434 135805 -79171 -112097 -68931 -113874 8092 -123611 -76774 119534 145929 -154580
18362 -372816 214558 -206739 -388716 77910 -11313 -96289 70919 -9762 33704 -66865 -140468
18351 -140468 160352 189938 74066 65228 148087 -190907 157149 111658 31847 -38323 -493767
18340 -493767 -188535 -165376 41893 -141535 50955 -8503 -98128 32729 -146385 36979 368556
18329 368556 36606 -31826 -147067 13598 -120780 -129075 -75166 -98918 -173129 -215493 4371
18317 -38477 117572 -387664 -203487 -83157 77791 201998 -320621 47934 -315955 122986
18306 104262 -167067 82358 -34346 329593 -28444 2810 -32540 -324040 -49088 -122619 44644
18294 59046 217264 205472 146617 -94837 -43269 -161037 279854 220069 -302282 -116808 -54774
$$ packed form
18374B17434q1629g9171l2926M3166m4943H092a23611M6837A19534K6395a54580
18362c72816B14558b06739j81977G7910a1313q4976G0919i762C3704f6865p3603
18351a40468A60352K9586G4066q838Q2859a90907A57149m5491C1847c8323m55444
18340d93767a88535K3159D1893a41535E0955h503q9625C2729a46385C6979L31577
18329C68556C6606c1826j15241A3598a20780q295N3909k3752p4211m2364D371
18317c8477A17572c87664J84177h3157G7791J24207c20621D7934c15955A22986
18306A04262a67067H2358c4346C29593b8444B810c2540k91500d9088p3531D4644
18294E9046J58218j1792n8855i4837d3269j17768B79854n9785c02282a16808e4774
$$ plain form
18282 -173339 78497 -16377 271526 -119138 -129764 -167465 -86148 -345575 159952 -69764 -63506
18271 -63506 -45799 -140921 164559 -54106 -187944 783 124194 -81030 -138658 -9155 -55652 -129446
18259 -129446 167829 -64339 -143225 24523 147092 -127348 -208699 -105918 73686 -317770
18248 94991 17216 -336230 -363112 -31725 -66071 -14569 -125830 -50824 71228 -132389 102630
18236 250120 -101895 -65982 -83460 -102000 -123766 -199490 -4737 167220 -45427 58386 303484
18225 303484 -40835 40305 36492 -56506 325193 -159465 -159034 131791 84884 35644 96343
18214 96343 -289819 -326869 -445880 37008 178268 158425 12016 202106 -122290 240540
18203 -6188 53309 272899 -152492 16349 -117471 -321886 -75878 22803 -22918 -46590 -32632
$$ packed form
18282a73339G8497a6377B71526a19138j0626l7701Q1317k59427A59952f9764O258
18271f3506J7707r5122A64559e4106j33838G83J23411h1030n7628i155m6497p3794
18259a29446A67829f4339p8886B4523J22569a27348q1351J02781G3686c17770
18248I4991A7216c36230k6882c1725l4346a4569j11261e0824G1228a32389A02630
18236B50120a01895L5913j7478j8540k1766p5724d737A67220d5427E8386K45098
18225C03484d0835D0305l813e6506C25193a59465M31A31791m6907C5644O0699
18214I6343b89819l7050j19011C7008J41260j9843A2016J90090a22290B40540
18203f188E3309K19590a52492A6349a17471k04415g5878B2803b2918k3672J3958
$$ plain form
18192 -32632 298568 307783 102877 -135053 -340928 -172645 306697 -9829 -59425 497247 46069
18180 -104072 56721 -195202 226529 29812 -79607 33783 97648 403953 -122012 225296
18169 95320 294999 148743 75627 6866 -204413 165528 -22347 120255 -103111 -145861 58928
18157 11190 321015 61712 -82701 -300256 -123506 -196483 61652 -50854 -3147 24877 -127143
18145 254795 262682 -88701 211380 -3085 96065 48126 9550 -23895 130658 -164346 -176302
18134 -176302 260379 220527 182075 -95848 -234974 121696 -279496 249106 -59532 -152895
18124 -152895 187207 -337327 -116295 282310 -161257 83232 66514 115967 -278370 188932
18113 -305246 -111136 141967 44867 -113484 -60171 -262241 -177374 -131421 305199 358674
$$ packed form
18192c2632B98568R215A02877a35053k05875J68283C06697i829m9596D97247D6069
18180a04072E6721a95202B26529B9812g9607C3783O3865L06305a22012B25296
18169I5320J99679j46256p3116F866b04413A65528b2347A20255a03111m2750E8928
18157A1190L09825F1712h2701k17555a23506p2977F1652e0854c147B4877a27143
18145B54795P887h8701B11380c085I6065m7939I550b3895A30658a64346j1956
18134a76302B60379l9852l8452i5848j39126A21696b79496B49106e9532r3363
18124a52895A87207c37327a16295B82310a61257H3232j6718M9453b78370A88932
18113c05246a11136A41967D4867a13484N3313k02070Q4867M5953C05199N3475
$$ plain form
18103 358674 -29536 -23808 -156523 -296934 50723 15944 -170037 182220 257406 373332 69946
18091 -220454 41458 283045 -180500 -53618 -36286 -42758 251517 89326 368482 199080 -283278
18079 -78737 373046 174925 315100 27358 -1499 -181056 -235316 -257419 -513708 335416 -146159
18067 -249147 -25850 21440 242512 81739 -106515 -77688 -214416 27545 81747 370112 103803
18055 -2780 100433 -187515 279745 -180889 354178 16460 161330 35372 -43993 92741 50224
18044 50224 -69115 56737 95424 230082 239303 162347 -220936 -17966 6978 48910 -99504 -138630
18032 -138630 -123643 -170466 57357 -236258 2101 139579 -143132 -29073 36933 154043 -13180
18020 239832 -57120 -196285 19217 1014 -371662 -280738 -22337 91276 -122345 207767 112781
$$ packed form
18103C58674b9536N728j32715j40411E0723A5944a70037A82220P5186J15926F9946
18091b20454D1458K41587a80500e3618J7332o472B51517H9326K79156j69402b83278
18079g8737C73046A74925J40175B7358a499j79557n4260k2103k56289C35416a46159
18067b49147b5850B1440K21072H1739a06515K8827j36728B7545N4202K88365A03803
18055b780A00433a87515B79745a80889C54178A6460J44870C5372d3993I2741m2517
18044E0224f9115E6737L8687J34658R221p6956b20936a7966F978M1932i9504l9126
18032a38630J4987m6823E7357b36258B101J37478a43132b9073C6933J17110a3180
18020B39832e7120j39165A9217A014c71662R0924b2337I1276a22345B07767r4986
$$ plain form
18009 112781 99796 88473 90637 67241 31452 313004 -181864 118776 166904 184545 -92547
17997 -149150 -149356 202304 -63412 53732 219947 -99531 174884 -86677 -82591 42726 -294385
17985 261940 206600 137444 -21412 -64190 -31729 118200 52569 -216657 -284002 111648 -46694
17973 7253 -22682 -64280 18276 -5397 83121 256631 30972 -86946 -244372 -66443 -98019 -236999
17961 -236999 103763 -272620 -114718 171654 68594 -117556 -1929 -274913 -258369 68377
17950 -172549 90144 -139753 137920 83157 -318755 108485 -200304 63035 102604 305398
17940 305398 -128168 -196769 -126912 -144667 61061 221092 -150476 -89121 280824 123653
17929 -173540 -9782 146854 113597 13905 199016 -126850 263061 19127 -48434 1234 -77651
$$ packed form
18009A12781j2985j1323K164k3396C1452K81552a81864A18776M8128J7641i2547
17997a49150k06B02304f3412E3732J66215i9531A74884h6677M086D2726b94385
17985B61940n5340o9156b1412m2778c1729A18200E2569b16657o7345A11648d6694
17973G253b2682m1598A8276e397H3121J73510C0972h6946j57426f6443l1576j38980
17961b36999A03763b72620a14718A71654F8594a17556a929k72984J6544F8377
17950a72549I0144a39753A37920n4763c18755A08485b00304F3035L9569K02794
17940C05398a28168o8601O9857j7755F1061J60031a50476O1355B80824A23653
17929a73540i782A46854l3257A3905J85111a26850B63061A9127d8434A234g7651
$$ plain form
17917 -228919 -15332 -51748 219980 -143700 -333680 120876 117251 -36075 -255931 -200159 -96423
17905 115581 80274 -188352 -4683 -196155 255990 101672 345136 144298 -407625 38175
17894 -350045 25271 -13617 -16161 -445247 184460 87703 -133374 -145731 -108501 -114193 324812
17882 -34480 -218034 -36250 393647 128949 154093 -176839 -118778 -280585 397270 140770
17871 -22245 65358 23989 -105877 -33932 -284486 258365 -59672 -233407 31847 -215550 19461
17859 -40951 119232 -51415 -305529 37503 290898 308491 -105698 319073 -82237 241848
17848 233716 119688 144004 166201 14011 217438 -6256 -82831 43941 -25413 -15801 120644
17836 399665 -168969 248200 343861 94723 -18212 75576 131414 -183599 -70992 -497305 41977
$$ packed form
17917b28919a5332l6416B19980a43700j89980A20876l625c6075k19856N5772i6423
17905A15581l5307a88352d683j91472B55990A01672K43464A44298d07625C8175
17894c50045B5271a3617k544m29086A84460H7703a33374j2357L7230n692C24812
17882c4480j83554c6250C93647A28949K5144a76839N8061j61807C97270A40770
17871b2245F5358B3989a05877c3932k50554B58365e9672j73735C1847b15550A9461
17859d0951A19232e1415k54114C7503K53395J7593a05698C19073h2237B41848
17848B33716j14028K4316K2197A4011K03427f256p6575D3941b5413R612A20644
17836C99665a68969B48200R5661I4723a8212G5576N5838a83599g0992m26313D1977
$$ plain form
17824 -154257 113478 14131 11407 97201 175903 -62304 -112435 -44042 278779 45666 66781
17813 66781 102540 -148601 -173313 1054 -4962 164258 -87574 -83783 16101 -155040 223102
17801 30438 159577 -176538 213108 -7216 56858 218145 -229425 186399 -57556 485028
17790 70674 -290256 101259 183847 -239173 316143 109242 -51095 187239 46379 -66736
17779 -109390 67548 -88207 213101 236942 261234 72493 135933 119302 17144 -126278 18874
17767 80048 -180473 25760 87615 -36707 -149842 300588 279026 95404 406018 -273820 8851
17755 257131 -56841 182664 -68332 154070 -84450 82511 101831 -223778 14986 189561 228882
17744 228882 15902 196532 152697 -129094 86125 16825 -184011 59002 167708 178731 153318
$$ packed form
17824a54257A13478A4131k724Q5794P8702f2304n0131d4042B78779D5666K1115
17813F6781L5759a48601k4712A054d962A64258h7574L791A6101a55040B23102
17801C0438J29139a76538B13108g216E6858J61287b29425A86399e7556D85028
17790G0674b90256A01259Q2588b39173C16143A09242e1095A87239D6379f6736
17779a09390F7548h8207B13101K3841K4292G2493O3440j6631A7144a26278A8874
17767H0048a80473B5760O1855c6707j13135C00588k1562I5404L10614b73820H851
17755B57131e6841A82664f8332A54070h4450H2511J9320b23778A4986J74575L9321
17744B28882A5902J80630m3835a29094H6125A6825a84011E9002J08706J1023k5413
$$ plain form
17733 153318 -166841 -92653 -109858 -261810 -420222 104665 14472 191846 179935 206726
17723 206726 -78752 366259 40461 119045 209690 19967 -2946 -133254 313404 31644 134085
17712 134085 86410 240940 376127 -23307 145050 -77860 170663 158132 56638 334 40025
17701 40025 26213 102920 -49467 1275 178143 59208 78723 22732 -434270 232216 -160596
17689 -300931 43147 87345 317149 260824 189401 203662 -87494 -308267 277746 98574 224637
17678 224637 97895 10732 148658 -71384 55004 -123569 -2366 50141 -148952 422981 4252
17666 -224490 132888 294565 203124 35919 -110729 -49008 -106144 47503 31216 95005 56074
17655 56074 124185 61593 -21961 298912 344804 199490 28570 -149005 148482 -34735 434425
$$ packed form
17733A53318a66841P4188j7205j51952j58412A04665A4472J77374j1911K6791
17723B06726g8752C66259D0461P8584R0645A9967b946j30308C13404C1644J02441
17712A34085m7675J54530J35187b3307A45050g7860A70663j2531E6638C34L9691
17701D0025j3812P6707d9467A275J76868E9208J9515B2732d34270B32216a60596
17689c00931D3147M4198K29804n6325p1423J4261h7494k20773B77746I8574J26063
17678B24637I7895A0732J37926g1384E5004a23569b366E0141a48952D22981D252
17666b24490A32888J61677r1441C5919a10729d9008n7136D7503j6287O3789l8931
17655E6074O8111F1593b1961B98912M5892j45314B8570a49005A48482c4735D34425
$$ plain form
17643 88942 384816 11367 56793 595709 -125892 -67386 70716 167023 108115 135436 158691
17632 158691 179350 222610 217103 -69746 165019 -4649 113135 347352 78477 -70346 113468
17620 26146 89905 231716 157206 188681 28941 199529 215676 166560 261625 -266206 -8826
17608 -271424 -64646 145757 365914 -21445 82546 155112 89537 238111 70571 301967 -190478
17596 169622 449173 171030 33526 -51554 173904 -42504 -92312 -12800 -50938 279183 62716
17584 236755 35847 -239460 143079 66202 260011 190836 103962 -51514 85793 197877 86556
17572 339045 286862 -207798 227363 417490 213 15818 -25307 178138 43413 119788 9882
17560 -32435 77130 66109 364566 287915 169165 -7837 49495 146276 3479 172498 172983 34917
$$ packed form
17643H8942K95874A1367M5426N38916a25892N8506G0716R6307n8908K7321K3255
17632A58691K0659M3260n507f9746A65019d649A13135K34217G8477g0346A13468
17620B6146O3759J41811p4510L1475B8941J70588J6147m9116R5065b66206h826
17608b71424f4646A45757K20157b1445H2546P2566o5575J48574G0571K31396a90478
17596A69622K79551A71030C3526e1554A73904d2504m9808a2800l8138B79183F2716
17584B36755C5847b39460A43079F6202J93809o9175q6874e1514H5793J12084H6556
17572C39045n2183b07798B27363J90127B13J5605b5307A78138D3413P6375I882
17560c2435G7130j1021K98457p6651j18750g837D9495R6781C479J69019M85C4917
$$ plain form
17547 208973 323836 10896 60926 284079 -115422 41233 -48192 -303558 294788 61613
17536 334141 368266 -121839 306005 190671 308186 -114084 184740 196660 138479 424322
17526 424322 51522 -15870 358856 200755 270431 -29534 196771 253247 -44326 138323 366392
17515 366392 554865 297052 308523 377003 646117 686039 405069 1157015 914957 881616
17505 881616 853301 788896 471662 350813 265385 479181 417185 230754 561381 626431
17495 626431 835502 760551 1019415 689190 722835 884740 575965 591719 901945 577801
17485 577801 380918 346588 222449 110674 360673 246878 310827 417799 198640 549322
17475 549322 90920 69606 298606 348066 269334 333240 -96559 285464 12837 312650 62094
$$ packed form
17547B08973J14863A0896N0030K23153a15422D1233d8192k55366B94788F1613
17536C34141L4125a21839C06005j15334J17515a14084A84740J1920n8181K85843
17526D24322E1522a5870C58856j58101O9676b9534A96771N6476d4326A38323K28069
17515C66392J88473k57813J1471O8480K69114L9922k80970P51946k42058l3341
17505H81616k8315o4405l17234j20849q5428K13796o1996j86431L30627O5050
17495F26431K09071p4951K58864l30225L3645J61905l08775J5754L10226l24144
17485E77801j96883l4330j24139A10674K49999j13795O3949J06972A98640L50682
17475E49322I0920k1314K29000M9460p8732O3906i6559B85464A2837K99813F2094
$$ plain form
17463 332126 -113662 301119 96974 418076 233478 -46976 -16670 569962 44087 -2892 5610
17451 402273 364662 30774 369945 64146 173731 207612 255598 265414 440410 330234 217888
17440 217888 448723 436444 228101 210776 272518 305875 285342 387105 270183 389078
17430 389078 331310 324970 571545 333051 328686 271674 257499 329912 618687 241484 283138
17419 283138 520103 271624 277695 373098 152382 259998 310713 83523 11018 223493 124859
17408 124859 351299 461292 560267 369770 201088 282327 -92067 302671 250845 228060
17398 228060 124796 273161 -4312 149706 165307 20268 378554 307754 305868 471639 718639
17387 718639 235903 -139717 -59783 230036 473927 258654 310454 16792 418547 386364
$$ packed form
17463C32126a13662C01119I6974L21102j84598d6976a6670E69962D4087b892E610
17451D02273l7611C0774L39171F4146J09585L3881M7986R816J74996j10176j12346
17440B17888K30835j2279k08343j7325O1742L3357k0533J01763j16922J18895
17430C89078n7768o340K46575k38494m365n7012j4175P2413K88775B41484M1654
17419B83138K36965k48479O071R5403A52382J07616N0715H3523A1018K12475r8634
17408A24859K26440J09993R8975j90497j68682Q1239i2067C02671n1826k2785
17398B28060j03264J48365d312A49706J5601B0268L58286p0800j886J65771K47000
17387G18639B35903a39717e9783B30036K43891k15273N1800A6792M01755l2183
$$ plain form
17377 386364 250775 268901 158536 473112 232817 147012 81611 111957 333208 303322
17367 303322 142386 112435 -123110 -4644 305899 369395 285403 -117551 405024 480133 158642
17355 339264 224612 171902 409403 358788 105960 -21923 436959 269541 495072 434095
17345 434095 161422 -39550 150363 151157 20258 439597 36620 291998 327980 98057 -7178
17333 443437 196899 214782 145247 207959 216660 233699 161460 386739 568223 541712 190810
17321 117558 263665 350988 365879 121243 179335 -81236 299980 289877 65542 197319 383559
17310 383559 127011 344202 28180 -40663 382420 403529 -66200 648465 159981 569006
17300 569006 230269 366574 350691 428488 376596 194763 349215 253301 143114 122703
$$ packed form
17377C86364j35589J8126j10365L14576B32817q5805o5401L0346K21251k9886
17367C03322A42386k9951a23110d644C05899O3496q3992a17551D05024P5109A58642
17355C39264j14652n2710K37501n0615A05960b1923D36959j67418K25531o0977
17345D34095A61422c9550A50363P94B0258M19339C6620K55378L5982I8057g178
17333D43437A96899J7883o9535O2712Q701J7039p2239K25279J81484k6511A90810
17321A17558J46107Q7323J4891A21243N8092h1236B99980j0103F5542J31777J86240
17310C83559A27011K17191B8180d0663C82420K1109f6200F48465A59981M09025
17300E69006B30269J36305j5883P7797n1892j81833J54452r5914j10187k0411
$$ plain form
17290 122703 576312 284952 -45877 389197 50869 275554 201302 359738 143260 471106
17280 471106 130890 262218 58238 391415 300717 162785 584362 236873 166696 165487
17270 165487 599781 730300 242728 12172 120943 384310 195657 435758 291802 220478
17260 220478 125462 310506 171993 491228 109630 84145 232648 290650 -195840 166229
17249 178932 283673 482392 326780 170520 533197 135822 341786 187984 193788 323363
17239 323363 504312 216314 278450 170210 251931 206117 97529 143211 172086 455781 540012
17228 540012 454086 254608 265533 260262 308615 639908 383506 220563 329633 135034
17217 159402 141397 275651 433749 280691 395649 70355 425578 227637 652416 219609
$$ packed form
17290A22703M53609B84952d5877C89197E0869K24685p4252J58436A43260L27846
17280D71106A30890J31328E8238L33177r0698j37932M21577B36873p0177j209
17270A65487M34294J30519B42728A2172J08771K63367j88653K40101j43956p1324
17260B20478r5016J85044j38513L19235A09630k5485J48503N8002a95840A66229
17249A78932J04741J98719j55612j56260L62677A35822K05964j53802N804J29575
17239C23363J80949B16314O2136j08240Q1721m5814I7529M5682K8875K83695Q4231
17228E40012q5926j99478J0925n271M8353L31293k56402j62943J09070A35034
17217A59402j8005J34254J58098j53058J14958G0355L55223j97941M24779B19609
$$ plain form
17206 71156 214676 303758 484241 554024 462425 644523 80203 306546 529128 526520 219406
17194 633410 311089 298300 389128 363144 35706 199193 570808 480024 708626 495475
17184 495475 220763 104462 441508 281657 601494 557626 513506 277879 253394 382960
17174 382960 557567 626236 150305 402455 180029 370374 590170 414587 350650 581951
17164 581951 55836 578584 227124 658352 749073 579411 672441 582211 793103 217396
17153 583340 594420 620969 814883 143086 113280 463770 566412 248147 532078 405083
17143 405083 279870 507635 579057 519871 194649 188287 252233 252880 478439 261854 586933
17132 586933 504012 584430 489740 146704 470912 490421 388985 383208 241901 651531 614060
$$ packed form
17206G1156J43520Q9082J80483O9783r1599J82098H0203K26343K22582k608B19406
17194F33410C11089j2789R0828k5984C5706J63487L71615r0784K28602k13151
17184D95475B20763A04462L37046j59851L19837m3868m4120k35627k4485J29566
17174C82960J74607O8669A50305K52150A80029J90345K19796j75583o3937K31301
17164E81951E5836N22748B27124M31228R0721j69662R3030r0230K10892B17396
17153E83340J1080K6549J93914A43086k9806L50490J02642B48147K83931j26995
17143D05083j25213K27765P1422n9186A94649o362O3946O47K25559k16585L25079
17132E86933q2921Q0418r4690A46704L24208J9509j01436n777j41307M09630l7471
$$ plain form
17121 614060 504627 501692 889652 486381 461965 598444 519816 360110 441878 753047
17111 753047 662539 479545 379634 495378 939056 357978 736292 398790 703942 558074
17101 558074 973081 536299 568356 610752 386230 778674 746353 653082 546381 425975
17091 425975 354814 574196 387237 525193 491368 386642 400178 876712 685793 374457
17081 374457 752382 494705 400343 699406 629526 636464 556644 967628 726156 404515
17071 404515 859522 526138 623524 1021249 668072 771445 740674 752238 818044 1006211
17061 1006211 886861 673993 450413 597092 703972 442672 618980 529650 674460 675774
17051 675774 556865 299144 730286 812728 860642 1048672 619205 656064 763367 513909
$$ packed form
17121F14060j09433k935L87960m03271k4416J36479p8628j59706Q1768L11169
17111G53047r0508j82994r9911J15744M43678C57978L78314l37502L05152j45868
17101E58074M15007m36782L2057M2396k24522L92444l2321r3271j06701j20406
17091D25975p1161K19382j86959J37956l3825j04726J3536M76534j90919l11336
17081C74457L77925k57677r4362K99063o9880O938p9820M10984k41472l21641
17071D04515M55007l33384R7386L97725l53177J03373l0771J1564O5806J88167
17061A006211j19350k12868k23580J46679J06880k61300J76308q9330J44810J314
17051F75774j18909k57721M31142Q2442M7914J88030m29467L6859J07303k49458
$$ plain form
17041 513909 904453 519520 597569 1043089 737093 850506 456886 583950 678746 1020898
17031 1020898 657329 947999 620694 609941 854271 629087 945323 832221 959654 1037024
17021 1037024 1048240 766253 924751 1215457 976798 1141875 888216 798504 1105592 902053
17011 902053 1012447 1092131 918946 956276 764052 576841 1100485 848177 961304 1009703
17001 1009703 856459 849357 1087898 1403296 717632 778458 999449 910922 1235577 912348
16991 912348 699868 823706 918651 1345916 1040799 1018291 986911 1158040 1057488 1218941
16981 1218941 1169416 1216702 1320757 1311098 1241581 1348651 1341529 1303682 988966 1149879 1006232
16970 1006232 1117847 1226262 1205693 1402011 1173374 1259381 1389755 1321623 1177527 1160231
$$ packed form
17041E13909L90544l84933P8049M45520l05996J13413l93620J27064R4796L42152
17031A020898l63569K90670l27305j0753K44330k25184L16236j13102J27433P7370
17021A037024J1216k81987J58498K90706k38659J65077k53659q9712L07088k03539
17011I02053J10394P9684j73185L7330j92224j87211N23644k52308J13127M8399
17001A009703j53244p102K38541L15398o85664O0826K20991q8527L24655l23229
16991I12348k12480J23838R4945M27265l05117k2508l1380J71129j00552J61453
16981A218941m9525M7286J04055r659o9517J07070p122l7847l14716J60913j43647
16970A006232J11615J08415k0569J96318k28637Q6007J30374o8132j44096j7296
$$ plain form
16960 1160231 978860 1169341 1010889 1098120 1370973 1459372 1233568 1459076 1116170 1209754
16950 1209754 1515087 1290622 1308080 1297492 1498112 1367169 1415307 1375877 1403462 1646524
16940 1646524 1540574 1529124 1269926 1589794 1508071 1617294 1444388 1787809 1606024 1410977
16930 1410977 1654738 1532241 1694271 1559423 1785988 1606271 1569368 1888251 1586203 1687618
16920 1687618 1824380 1790573 1578708 1608216 1700445 1727221 2204059 1923399 1920349 1893890 1614007
16909 1614007 2112473 2191618 1802743 2073419 2033485 1644577 1794846 2366316 2135003 2410559
16899 2410559 2112469 2184825 2160693 2302141 2496494 2159523 2542285 2576313 2649859 2702501
16889 2702501 2667766 2830137 2799793 2520195 2674511 2606814 2807019 2761381 2870463 2621635
$$ packed form
16960A160231j81371J90481j58452Q7231K72853Q8399k25804K25508l42906R3584
16950A209754L05333k24465J7458j0588K00620j30943M8138l9430K7585K43062
16940A646524j05950j1450k59198L19868q1723J09223j72906L43421j81785j95047
16930A410977K43761j22497J62030j34848K26565j79717l6903L18883l02048J01415
16920A687618J36762l3807k11865K9508R2229K6776M76838k80660l050k6459k79883
16909A614007M98466P9145l88875K70676l9934l88908J50269N71470k31313K75556
16899B410559k98090P2356k4132J41448J94353l36971L82762L4028P3546N2642
16889B702501l4735J62371l0344k79598J54316o7697K00205m5638J09082k48828
$$ plain form
16879 2621635 2478720 2906295 2920118 2662597 2679001 2870612 2998135 2824209 3235264 2924164
16869 2924164 3117454 3104384 3507001 3584308 3179034 3204891 3428693 3594047 3545151 3488633
16859 3488633 3758193 3565959 3690158 3407354 3840093 3522588 3790057 3949077 3658272
16850 3658272 3943019 4065308 4174000 4156301 3837533 4188064 4471265 4159142 4380351 4616604
16840 4616604 4677048 4391681 4463970 4698465 4909652 4896180 5040521 4809096 5290362 5049815
16830 5049815 5388222 5371018 5392528 5590501 5755829 5701701 5821715 5847610 6056442 6203804
16820 6203804 5987081 6251602 6487960 6589031 6595594 6531010 7018579 6821460 7189668 7253452
16810 7253452 7158460 7689492 7422834 7772657 7936086 7920104 8479810 8608786 8656230 8835008
$$ packed form
16879B621635j42915M27575J3823k57521J6404J91611J27523j73926M11055l11100
16869B924164J93290j3070M02617P7307m05274K5857K23802J65354m8896n6518
16859C488633K69560j92234J24199k82804M32739l17505K67469J59020k90805
16850C658272K84747J22289J08692j7699l18768L50531K83201l12123K21209K36253
16840D616604O0444k85367P2289K34495K11187j3472J44341k31425M81266k40547
16830E049815L38407j7204K1510J97973J65328n4128J20014K5895K08832J47362
16820F203804k16723K64521K36358J01071O563o4584M87569j97119L68208O3784
16810G253452r4992N31032k66658L49823J63429j5982N59706J28976M7444J78778
$$ plain form
16800 8835008 8826467 9338977 9207140 9667271 9695279 10061332 10040519 10470193 10769801 10925413
16790 10925413 11008154 11517328 11750486 11641472 12294908 12787343 12765389 12930436 13782643 13661657
16780 13661657 13816412 14478525 14977931 15165845 15571698 16012631 16252099 16783139 17176911
16771 17176911 17531244 18368072 19057435 19079529 19813499 20760148 21565004 21847237 22387118
16762 22387118 23144609 23876184 24486633 25386543 26308066 27044336 28175748 28856814 29744030
16753 29744030 30886445 32240528 33308835 34384026 35917640 37095433 38516838 39907148
16745 39907148 41472623 43027988 45107888 46750406 48412692 50061624 52360486 54122630
16737 54122630 56581846 59026891 61289825 63708962 66606032 69249983 72254114 74735112
$$ packed form
16800H835008q541N12510j31837M60131K8008L66053k0813M29674K99608J55612
16790A0925413Q2741N09174K33158j09014O53436M92435k1954J65047Q52207j20986
16780A3661657J54755O62113M99406J87914M05853M40933K39468N31040L93772
16771A7176911L54333Q36828O89363K2094P33970R46649Q04856K82233N39881
16762B2387118P57491P31575O10449Q99910R21523P36270J131412O81066Q87216
16753B9744030J142415J354083J068307J075191J533614J177793J421405J390310
16745C9907148J565475J555365K079900J642518J662286J648932K298862J762144
16737E4122630K459216K445045K262934K419137K897070K643951L004131K480998
$$ plain form
16729 74735112 78074026 81090885 84347383 87854741 90920526 94556771 98123512 101470335
16721 101470335 104736130 108034315 111376800 114478289 117687952 120402381 122918401 125625318
16713 125625318 127484663 129165359 130648699 131558896 132435668 132658343 132278839 131578764 130848494
16704 130848494 129186225 127563436 125666880 123243525 120374883 117369147 114217052 111242896
16696 111242896 108077133 104538582 100862332 97612166 94522089 90786099 87631785 84518584
16688 84518584 81016273 77777716 75080290 71947972 69081847 66187610 63561394 61076179
16680 61076179 58479568 56576152 53776849 51639048 49542758 47660832 45728449 44194332
16672 44194332 42710764 40974007 39254258 38046293 36396776 35137544 33863497 32672052
$$ packed form
16729G4735112L338914L016859L256498L507358L065785L636245L566741L346823
16721A01470335L265795L298185L342485L101489L209663K714429K516020K706917
16713A25625318J859345J680696J483340R10197Q76772K22675l79504p00075p30270
16704A30848494j662269j622789j896556k423355k868642l005736l152095k974156
16696A11242896l165763l538551l676250l250166l090077l735990l154314l113201
16688H4518584l502311l238557k697426l132318k866125k894237k626216k485215
16680F1076179k596611j903416k799303k137801k096290j881926j932383j534117
16672D4194332j483568j736757j719749j207965j649517j259232j274047j191445
$$ plain form
16664 32672052 31268345 30532623 29055148 28217129 27519959 26525376 25651835 25059551 23946689
16655 23946689 23332740 22621814 22012105 21380030 20515394 20138529 19453853 18880301 18290111
16646 18290111 17700794 17498677 16960212 16303114 16078237 15538264 15154293 14585830 14093316
16637 14093316 14158651 13545064 13510904 13000377 12687169 12254550 11916356 11835585 11558177 11352298
16627 11352298 11139017 10804335 10593079 10118231 9945773 9939210 9639875 9207548 9260362 8826551
16617 8826551 8576409 8408111 8552097 8406025 8045691 7573808 7854827 7356212 7542245
16608 7542245 7194323 7094661 6921336 6952010 7020081 6670361 6490154 6595708 6280993 6340629
16598 6340629 6101771 5920691 6166437 5976764 5946914 5793218 5321483 5418962 5349732 5465565
$$ packed form
16664C2672052j403707p35722j477475q38019o97170r94583q73541n92284j112862
16655B3946689o13949p10926o09709o32075q64636l76865o84676n73552n90190
16646A8290111n89317k02117n38465o57098k24877n39973l83971n68463m92514
16637A4093316O5335o13587l4160n10527l13208m32619l38194q0771k77408k05879
16627A1352298k13281l34682k11256m74848j72458o563k99335m32327N2814m33811
16617H826551k50142j68298J43986j46072l60334m71883K81019m98615J86033
16608G542245l47922r9662j73325L0674O8071l49720j80207J05554l14715N9636
16598F340629k38858j81080K45746j89673k9850j53696m71735R7479o9230J15833
$$ plain form
16588 5465565 5070333 5304897 4986116 5135807 4525380 4831782 4632745 4638755 4494586 4501971
16578 4501971 4428158 4331425 4275846 4349791 4204574 4252215 3954280 3925189 3770655 3834737 4041029
16567 4041029 3703923 3728908 3731911 3580695 3615900 3733630 3382055 3488810 3460374 3340924
16557 3340924 3428044 3237089 3663696 3289501 3307220 2995955 3254348 3085429 2888878 3258144
16547 3258144 2653934 2787408 2796371 3001399 2606121 2783848 2601458 2656986 3079535 2570681
16537 2570681 2603412 2588580 2494820 2654328 2350067 2145345 2813723 2462671 2208828 2262268
16527 2262268 1928005 2116042 2228715 2502036 2041961 2200928 2320116 2094104 1941185
16518 1941185 1865260 1593479 1901128 2325701 1603765 2088192 1499068 2462722 1946902 1888711
$$ packed form
16588E465565l95232K34564l18781J49691o10427L06402j99037O010j44169P385
16578D501971p3813r6733n5579P3945j45217M7641k97935k9091j54534O4082K06292
16567D041029l37106K4985L003j51216L5205J17730l51575J06755k8436j19450
16557C340924Q7120j90955M26607l74195J7719l11265K58393j68919j96551L69266
16547C258144o04210J33474Q963K05028l95278J77727j82390N5528M22549n08854
16537B570681L2731j4832r3760J59508l04261k04722O68378l51052k53843N3440
16527B262268l34263J88037J12673K73321m60075J58967J19188k26012j52919
16518A941185p5925k71781L07649M24573p21936M84427n89124R63654n15820n8191
$$ plain form
16508 1888711 1650150 1875713 2310247 1903552 1986152 1723911 1675596 2263660 1510120 2021891
16498 2021891 1801188 1457960 1505136 1747477 1846679 1600011 2044171 1328177 1629537 1669208
16488 1669208 1771484 1444987 1467267 1387478 1602701 1802487 1738558 1599076 1451063 1537827
16478 1537827 1153656 1397601 1102570 1613447 905022 1589036 1569018 1434208 1499431 1594265
16468 1594265 1352397 1260228 1450127 1274087 1413129 1301966 1165310 1359220 1038749 896155
16458 896155 1457495 1321025 1323931 1212225 1368964 983719 1541909 1190704 1122813 1056884
16448 1056884 1171120 1104918 1252884 1140333 1035740 920317 1024719 1060991 1171713 1236433
16438 1236433 1335175 1004015 809108 817069 989267 1012932 868735 1067041 1162603 1118202
$$ packed form
16508A888711k38561K25563M34534m06695Q2600k62241m8315N88064p53540N11771
16498B021891k20703l43228M7176K42341R9202k46668M44160p15994L01360L9671
16488A669208J02276l26497K2280p9789K15223J99786o3929j39482j48013Q6764
16478A537827l84171K43945k95031N10877p08425O84014k0018j34810O5223R4834
16468A594265k41868r2169J89899j76040J39042j11163j36656J93910l20471j42594
16458H96155N61340j36470K906j11706J56739l85245N58190l51205o7891o5929
16448A056884J14236o6202J47966j12551j04593j15423J04402L6272J10722O4720
16438A236433R8742l31160j94907P961J72198K3665j44197J98306R5562m4401
$$ plain form
16428 1118202 558971 892243 659798 1163096 1130365 839945 794600 1014090 890644 1079989
16418 1079989 1261216 878171 1074510 925539 834087 667384 1164867 784601 962842 840419
16408 840419 879035 842980 526107 980845 703106 862751 525211 998401 760251 676678
16398 676678 788764 417490 584265 709047 832002 972514 914572 1115957 584653 828465
16388 828465 681571 597001 1021711 829932 894154 669735 849587 608137 676615 444980
16378 444980 864829 882748 850903 652800 1057837 770289 497710 816015 702162 696881
16368 696881 775283 578539 657531 336857 386587 686570 906867 474171 728289 721046
16358 721046 617076 755424 448411 488322 401507 897476 555056 599615 566325 640184
$$ packed form
16428A118202E58971L33272k32445N03298l2731k90420m5345K19490j23446J89345
16418A079989J81227l83045J96339j48971r1452j66703M97483l80266J78241j22423
16408H40419L8616l6055l16873M54738k77739J59645l37540M73190k38150q3573
16398F76678J12086l71274J66775J24782J22955J40512n7942K01385n31304K43812
16388H28465j46894q4570M24710j91779O4222k24419J79852k41450O8478k31635
16378D44980M19849J7919l1845j98103M05037k87548k72579L18305j13853n281
16368F96881P8402j96744P8992l20674M9730K99983K20297m32696K54118p243
16358G21046j03970J38348l07013L9911q6815M95969l42420M4559l3290P3859
$$ plain form
16348 640184 815895 618452 624613 698155 636662 678247 728287 841232 576022 288063 596265
16337 596265 599218 513313 449285 554934 664780 841111 566816 670939 408445 565457
16327 565457 746528 508012 598515 165415 284139 498868 495441 492443 881412 310666
16316 554840 415497 376869 525460 510168 439576 495035 635650 407450 628016 383425
16306 383425 519187 570655 115821 689972 544877 320902 399131 444821 612795 590229
16296 590229 374202 514575 587890 532996 612834 447305 186309 463257 750639 644611
16286 644611 368824 445085 304933 551824 397290 512294 479659 512210 425620 865509
16276 865509 465507 301765 316502 542604 507059 332466 674476 661056 479069 319827
$$ packed form
16348F40184J75711j97443O161P3542o1493M1585N0040J12945k65210k87959L08202
16337E96265K953q5905o4028J05649J09846J76331k74295J04123k62494J57012
16327E65457J81071k38516R0503A65415J18724K14729l427k998L88969C10666
16316E54840j39343l8628J48591j5292p0592N5459J40615k28200K20566k44591
16306C83425J35762N1468A15821N74151j45095k23975P8229M5690J67974k2566
16296E90229k16027J40373P3315n4894P9838j65529A86309K76948K87382j06028
16286F44611k75787P6261j40152K46891j54534J15004l2635L2551q6590M39889
16276H65509m00002j63742J4737K26102l5545j74593L42010j3420j81987j59242
$$ plain form
16266 319827 255006 459299 273861 297898 470810 507089 38239 550871 810337 385655
16255 674796 458769 515849 374500 290018 188553 277784 566636 451649 626652 725275
16245 725275 463616 454550 468729 337688 353855 570650 343444 303401 243422 560654 689847
16234 689847 183836 115971 407370 282580 168229 70639 164184 331654 572745 687615
16224 687615 144506 558329 361693 230870 403544 257385 226960 278236 347195 338300
16214 338300 271831 293394 260091 295892 47689 90172 408194 475493 450034 22162 265570
16203 265570 279632 468499 214096 559556 241095 261333 -21916 174388 216455 133444
16193 133444 51967 423579 46820 327525 583829 217658 -83794 85706 81628 137563 547146
$$ packed form
16266C19827o4821K04293j85438K4037J72912L6279C8239N12632K59466C85655
16255F74796k16027N7080j41349q4482j01465Q9231K88852j14987J75003R8623
16245G25275k61659r066J4179j31041J6167K16795k27206m0043n9979L17232J29193
16234F89847A83836o7865K91399j24790j14351G0639R3545J67470K41091J14870
16224F87615A44506M13823j96636j30823J72674j46159l0425N1276O8959q895
16214C38300o6469K1563l3303L5801D7689M2483L18022O7299k5459B2162K43408
16203B65570J4062J88867B14096L45460B41095K0238b1916A74388M2067q3011
16193A33444E1967L71612D6820K80705K56304B17658h3794H5706m078N5935M09583
$$ plain form
16182 547146 174126 512319 516130 53983 560218 39339 327295 17330 187334 78819 404440
16171 404440 132362 454554 294965 162437 67010 150248 236289 -75081 295537 -1627 22531
16159 165011 257533 302825 151573 57759 214151 50679 440548 -112958 312336 215632
16149 215632 67449 -92042 420471 358055 -74661 168140 35821 83287 151516 308616 -25569
16137 375799 344186 230250 165967 241620 159498 72061 339066 421807 171843 -36690 151751
16125 -101059 184397 192150 217554 317852 -80220 -122114 307723 -5360 -149816 204111 561192
16114 561192 -106791 -172107 -399761 94955 -218921 127351 205002 4479 -72934 110065 113939
16103 113939 330039 320787 -118220 194713 119115 -29942 10205 179629 64888 158600 260158
$$ packed form
16182E47146A74126L38193L811E3983N06235C9339K87956A7330J70004G8819L25621
16171D04440A32362L22192j59589j32528F7010Q3238Q6041g5081B95537a627B2531
16159A65011R2522M5292j51252E7759J56392E0679L89869a12958C12336r6704
16149B15632F7449i2042D20471o2416g4661A68140C5821M7466O8229J57100b5569
16137C75799l1613j13936o4283P5653q2122G2061K67005Q2741A71843c6690A51751
16125a01059A84397P753K5404J00298h0220m1894C07723e360j44456B04111L57081
16114E61192a06791o5316k27654I4955b18921A27351P7651D479g2934A10065L874
16103A13939K16100r252a18220A94713p5598b9942A0205J69424F4888R3712J01558
$$ plain form
16092 260158 350895 81160 470463 -79160 214431 184135 148920 299089 -165439 62176 338212
16081 338212 107102 259155 101059 66551 36320 108930 279870 -9164 257403 88794 301984
16070 301984 -7802 -22606 -151867 -85981 91595 79624 -55413 33322 185506 -85821 268521
16058 211542 -48360 -141871 -184801 -177528 55396 292313 -48509 -61391 -16010 391074 52476
16046 236780 -71036 -11729 305719 530456 207779 420050 226011 32200 -182907 -21578
16035 -219903 78004 189620 63426 -114686 -135506 266168 3946 34597 361203 197088 -26277
16023 -129944 48154 261762 74108 8125 34104 -74973 117244 163019 -44414 -36294 31070
16011 2521 58085 -39548 -136371 -181312 3069 380361 174282 96688 297722 73271 437086
$$ packed form
16092B60158R0737H1160L89303g9160B14431l0296l5215J50169a65439F2176K76036
16081C38212A07102J52053A01059l4508l0231P2610J70940i164B57403H8794K13190
16070C01984g802j4804j29261O5886I1595j1971e5413C3322J52184h5821B68521
16058B11542d8360r3511m2930P273E5396K36917d8509j2882a6010C91074E2476
16046B36780g1036a1729C05719K24737B07779K12271j94039C2200a82907b1578
16035b19903G8004J11616F3426a14686k0820B66168C946L0651L26606j64115b6277
16023a29944D8154K13608G4108H125K5979g4973A17244M5775d4414Q120C1070
16011B521N5564c9548r6823m4941C069L77292A74282p7594K01034G3271L63815
$$ plain form
16000 437086 -97522 336887 170106 179963 -103159 507224 26 100460 74695 37805 -37953
15988 203006 -168017 -310375 294401 39473 150751 -22851 167394 105237 -168573 52583
15977 254504 133575 124951 225690 234817 402867 644295 782297 931802 937652 1038529 783675
15966 783675 587872 802378 305090 236874 -12620 195046 186913 39972 135590 83949 -11178
15954 104764 -171156 57620 -245620 121076 118366 -372826 90728 47604 144375 294916 -167769
15942 -377899 -120071 82831 -197439 14803 -25735 -117612 -343228 -241118 -143552 238128
15931 32518 -100300 2593 -112528 -35836 204398 -62826 -137316 -104095 -384492 72836 65122
15920 65122 72627 83969 17944 179914 -22751 -55413 140790 -196006 -88524 -58010 250718
$$ packed form
16000D37086i7522C36887j66781R857a03159E07224B6J00434k5765l6890c7953
15988B03006a68017j42358B94401C9473J11278b2851A67394o2157a68573E2583
15977B54504j20929q624J00739R127J68050K41428J38002J49505N850J00877k54854
15966G83675j95803K14506C05090o8216a2620A95046q133C9972R5618n1641a1178
15954A04764a71156E7620b45620A21076k710c72826I0728m3124R6771J50541a67769
15942c77899a20071H2831a97439A4803b5735r1877k25616J02110R7566B38128
15931C2518a00300B593a12528c5836B04398f2826p4490L3221k80397G2836p714
15920F5122P505J1342A7944J61970b2751l2662A40790a96006h8524L0514B50718
$$ plain form
15908 -220967 128559 236707 -77626 -210602 115562 301596 -111761 16838 279047 6233
15897 -44841 -129359 -50844 -93279 -109836 115052 -143834 -66983 50405 73898 -278152 -43287
15885 -231848 -124648 130845 85592 237947 44701 -130531 14683 -47592 -253011 90172
15874 202273 -31333 -38501 124318 1621 -85091 65835 75249 6847 -59029 136580 -98750 47664
15861 -29240 122049 4345 -179456 8189 1613 -406665 -473022 39433 -85964 364024 -183804
15849 -74060 382588 -243930 129162 72967 -91324 -7775 -33395 -116768 -13208 -7203 -4682 -285938
15837 -285938 7159 -116881 266950 126708 -41473 -139119 117725 148559 54540 218022 -89036
15825 65548 380886 -297542 -133118 -105621 -202974 -12894 76299 -81253 -282725 -197326 5005
$$ packed form
15908b20967A28559J08148g7626j32976A15562J86034a11761A6838K62209F233
15897d4841q4518e0844m2435j6557A15052a43834f6983E0405K3493b78152d3287
15885b31848J07200A30845m5253J52355D4701a30531A4683d7592k05419I0172
15874B02273c1333p168A24318A621h5091F5835R414F847e9029A36580i8750D7664
15861b9240A22049D345a79456H189A613d06665o6357C9433h5964C64024a83804
15849g4060C82588b43930A29162n6195i1324g775k5620q3373a3208O005K521k81256
15837b85938G159a16881B66950A26708d1473r7646A17725L0834E4540J63482h9036
15825F5548L15338b97542a33118K7497r7353a2894G6299h1253k01472Q5399E005
$$ plain form
15813 -140585 175997 207542 -77685 -246339 -297299 -174797 -294824 -34425 112432 -138588
15802 -178477 131628 -189520 -116789 96357 -162776 -228075 148920 -368731 -468610 20149
15791 -8681 153826 114248 -65434 21879 7715 206967 -388804 319844 -330530 -87479 204088
15779 -147207 757 -105443 -268493 -499439 -333423 -294084 -330292 -86544 295413 -36972 -24510
15768 -24510 -55371 -233169 78003 -101372 45045 -154267 -135091 -328791 82111 36591 264348
15757 264348 44904 -257781 -99229 76403 236537 -56644 176164 83177 387398 11355 -66941
15745 118455 85678 278356 29679 -170881 54502 -140320 219992 243581 145556 327589
15735 327589 181664 -93874 30743 -148667 -1340 -85207 101186 256259 156065 -273044
$$ packed form
15813a40585A75997L1545g7685j68654n0960J22502j20027c4425A12432a38588
15802a78477A31628a89520P2731I6357a62776o5299A48920c68731r9879B0149
15791h681A53826l9578f5434B1879G715J99252c88804C19844c30530h7479B04088
15779a47207G57a05443j63050k30946J66016L9339l6208h6544B95413c6972J2462
15768b4510l0861j77798G8003a01372D5045a54267J9176j93700H2111C6591K27757
15757B64348D4904b57781i9229G6403J60134e6644A76164H3177L04221A1355f6941
15745A18455l2777J92678B9679a70881E4502a40320B19992K3589r8025J82033
15735C27589j45925i3874C0743a48667a340q3867A01186J55073j00194b73044
$$ plain form
15724 45311 -2497 -8119 -150495 -228364 113335 51020 -337571 61798 -13402 -255255 83462
15712 127038 -60807 -112420 88482 89704 172330 -312301 6230 -15569 -100465 90596 -13229 -18667
15700 -18667 81803 58656 158503 -19992 -114014 190631 -72400 80982 -247326 -118457 -28264
15688 -457634 -65815 -132342 268046 -239015 -253809 -150231 72589 -2743 -46726 -181767 9370
15676 65111 130733 286051 -86004 229743 -28873 -278963 256167 -48150 98423 -95583 228951
15664 -63722 233680 -335532 54258 172690 9474 -323004 141317 10030 -144375 105744
15653 77884 284139 205792 197717 19134 -446794 -266709 -175653 8328 143592 -192973 -164751
15642 -164751 -367098 -167405 53423 -141184 -76533 411463 -163846 -63938 -47811 -24125
$$ packed form
15724D5311b497n622j42376p7869A13335E1020c37571F1798a3402k41853H3462
15712A27038f0807n1613H8482J222Q2626c12301F230a5569q4896I0596a3229n438
15700a8667H1803k3147R9847a9992r4022A90631g2400H0982b47326a18457b8264
15688d57634f5815o6527B68046b39015j4794J03578G2589b743m3983j35041I370
15676F5111O5622J55318h6004B29743b8873k50090B56167d8150I8423i5583B28951
15664f3722B33680c35532E4258J18432I474c23004A41317A0030a44375A05744
15653G7884K06255p8347q075A9134d46794J80085R1056H328J35264a92973K8222
15642a64751k02347a67405E3423a41184O4651D11463a63846f3938J6127K3686
$$ plain form
15632 -24125 -89272 1570 -154264 200818 -419552 -262692 -153009 -65310 -55144 8546 -39296
15620 3257 -37530 223670 63004 -354234 134568 6528 -303673 -142463 59355 451779 134882
15608 -56505 -82862 51278 28348 -156965 -266777 -201059 -197868 69039 -58315 -332072 78822
15596 -145832 -11694 -110798 -46847 -4967 -60238 -46718 110728 -44133 134179 164454 38308
15584 19769 -220211 -136326 -76198 161957 125460 -127567 -62302 68362 135175 87839 -12419
15572 113108 -383276 77231 -93430 102930 -80323 165088 -386390 -159238 22495 -187228
15561 71847 -199150 -178638 -117627 -240202 201098 -5291 48590 -108279 -215496 213142 36126
15549 -62578 -101410 -6075 238062 184152 82805 -125495 -32545 47668 -24069 18528 205261
$$ packed form
15632b4125o5147A570a54264B00818d19552J56860J09683f5310J0166H546c9296
15620C257c7530B23670F3004c54234A34568F528c03673a42463E9355L92424A34882
15608e6505k6357E1278k2930a56965j09812O5718L191F9039e8315k73757G8822
15596a45832a1694r9104d6847d967n5271J3520A10728d4133A34179L0275C8308
15584A9769b20211Q3885O0128A61957l6497a27567f2302F8362O6813m7336a2419
15572A13108c83276G7231i3430A02930h0323A65088c86390a59238B2495a87228
15561G1847a99150K0512O1011j22575B01098e291D8590a08279j07217B13142C6126
15549f2578l8832f075B38062n3910H2805a25495c2545D7668b4069A8528J86733
$$ plain form
15538 205261 168145 -151400 -253119 99805 -112950 -190568 -139822 4368 -335523 -252238 -380901
15527 -380901 299 -9396 -12404 88317 215980 -84393 335793 159979 23545 -240818 34279
15515 -87357 -167651 -175848 368547 223396 -47751 144058 303397 -82121 107826 -59727 43566
15503 -262522 -33949 -97941 -151420 205465 150980 48882 6086 -67570 -145101 241540 49943
15491 199501 135377 -35382 -141987 46061 -297875 -45031 -241367 -134686 105833 277643
15481 277643 291099 -19993 116455 370378 -155080 114247 174181 169834 317037 267348 196262
15470 196262 172117 17102 -86522 87897 -103061 421759 408463 114035 109117 300081 239677
15459 239677 374201 613904 303144 456141 365718 80532 51074 161129 -14099 123525
$$ packed form
15538B05261l7116a51400j01719I9805a12950p7618N0746D368c35523Q3285j28663
15527c80901B99i396l008H8317J27663h4393C35793A59979B3545b40818C4279
15515h7357q0294q197C68547j45151d7751A44058J59339h2121A07826e9727D3566
15503b62522c3949o3992n3479B05465n4485D8882F086f7570p7531B41540D9943
15491A99501o4124c5382j06605D6061b97875d5031j96336J06681A05833J71810
15481B77643J3456a9993A16455K53923a55080A14247N9934m347J47203m9689p1086
15470A96262k4145A7102h6522H7897a03061D21759j3296A14035m918J90964o0404
15459B39677J34524K39703C03144J52997r0423H0532k9458J10055a4099A23525
$$ plain form
15448 301024 662 239195 34852 31992 168898 -123754 408512 80072 -189515 -78270 -58091
15437 -58091 -118876 -157013 -255359 111212 111561 219854 51469 183729 459807 225214 626795
15426 626795 820459 609050 1074429 968767 629493 459831 66844 -195999 -81763 430854
15415 -18207 107913 406062 10478 252651 24968 141918 305925 -244380 -190332 616426
15404 56842 180705 2543 -124447 -418130 -206156 205470 392597 -14381 314442 -155501
15393 61146 -51636 -92479 -123958 49318 -192354 18953 301755 -17423 72944 -321554 -396362
15382 -396362 -83128 82798 43363 442261 138031 -124756 -140423 -248106 128415 -110003
15371 78329 -110218 -17893 97249 -306947 -240605 158953 298229 -142127 167301 -128407
$$ packed form
15448C01024F62K38533C4852k860J36906a23754D08512H0072a89515g8270K0179
15437e8091o0785l8137r8346A11212L49J08293E1469J32260K76078B25214M01581
15426F26795J93664k11409M65379j05662l39274j69662F6844a95999h1763D30854
15415a8207A07913K98149A0478K42173B4968J16950J64007b44380N4048F16426
15404E6842J23863B543a24447k93683b06156B05470J87127a4381C14442a55501
15393F1146e1636m0843l1479D9318a92354A8953K82802a7423G2944c21554p4808
15382c96362h3128H2798l9435L98898A38031a24756j5667j07683A28415a10003
15371G8329a10218a7893I7249c06947O6342A58953J39276a42127A67301a28407
$$ plain form
15360 -125377 179481 -74879 216652 233773 208379 264937 346570 177915 -293269 1218 -65782
15348 -51101 357956 -17635 110618 67225 301297 -58697 356435 221856 317480 -194830
15337 48921 140869 177505 132368 191654 227757 -79432 -51444 223993 326801 397432 313478
15326 313478 305418 267583 232562 15896 442414 316409 195688 67094 90648 -21430 247194
15314 333021 299702 88721 135095 81385 200154 130245 10751 80472 214333 19356 138958
15303 138958 72996 93851 -10449 -130824 -219102 362542 -228083 399430 -94546 220940
15292 74257 388662 41033 31966 340 -370317 -39050 -196111 77206 -130190 77701 -82635
15280 76930 272512 130833 15777 167826 203043 155613 -210858 78107 -79878 163408 74338
$$ packed form
15360a25377A79481g4879B16652J7121k5394N6558Q1633j68655b93269A218f5782
15348e1101C57956a7635A10618m3393K34072e8697C56435j34579R5624a94830
15337D8921R1948L6636m5137N9286L6103g9432K7988B23993J02808P0631q3954
15326C13478q060l7835l5021A5896M26518j26005j20721F7094K3554b1430B47194
15314C33021l3319H8721M6374n3710J18769o9909A0751O9721J33861A9356J19602
15303A38958o5962K0855a0449j20375q8278C62542b28083C99430i4546B20940
15292G4257L14405D1033r067C40c70317c9050j57061G7206a30190G7701h2635
15280G6930J95582A30833A5777J52049L5217m7430b10858G8107g9878A63408G4338
$$ plain form
15268 253 79701 139464 -107705 40096 241829 70556 14819 -34269 -272841 -67844 139264
15256 -152071 -42424 -77037 -16317 -267977 5128 34851 74837 -342135 -279349 -31599 -178496
15245 -178496 6426 -198572 -235245 88365 -125713 -3565 179475 -158600 -23443 307236 -17385
15233 303221 103550 -188168 337741 78090 1053762 975468 1505377 1195689 1279471 1125179
15223 1125179 928703 762747 72520 49639 226911 -80233 -18704 180181 168027 -119267
15212 80612 225422 -185550 398765 -64497 146225 -52091 -107593 74547 7784 59748 161003
15201 161003 146859 20047 82530 80155 165235 177930 255618 91060 -198444 -25484 -105555
15190 -105555 -232088 -192652 95165 -240686 251761 174955 159533 94293 39895 -1871 136369
$$ packed form
15268B53P9448N9763a07705D0096K01733G0556A4819c4269k38572f7844A39264
15256a52071d2424l4613a6317k51660E128K9723L9986c42135O2786c1599j46897
15245a78496F426a98572l6673H8365a25713c565A79475a58600b3443C07236a7385
15233C03221A03550a88168C37741G8090R75672p8294N29909l09688Q3782j54292
15223A125179j96476j65956G2520k2881J77272h0233a8704A80181j2154a19267
15212H0612J44810a85550C98765f4497A46225e2091n5502G4547G784N1964J01255
15201A61003j4144B0047O2483k375Q5080J2695P7688I1060a98444b5484q0071
15190a05555j26533L9436I5165b40686B51761p6806j5422o5240C9895a871A36369
$$ plain form
15178 303935 216456 -17183 219526 301898 -215844 302148 352172 89102 115366 -54566 297631
15166 -66230 -102934 148783 150453 -930 -726 242532 208954 29606 116009 16659 154909 105971
15154 105971 -32216 86062 49371 323157 18461 193964 -277104 43906 74410 134645 141337
15143 141337 187467 29552 -164419 30264 297097 103264 -84594 129430 44006 180001
15133 180001 67089 -40333 -58310 102054 407910 110174 136851 409909 227256 183655
15123 183655 -112772 36920 223225 -165785 -104523 215102 132801 261500 84198 316647
15113 316647 -74413 39433 88188 303244 -94165 -58661 -93915 187383 267276 -94509 221629
15101 372390 255238 185839 168412 39515 376821 184125 -83365 253297 -24543 -174867
$$ packed form
15178C03935q7479a7183B19526Q2372b15844C02148N0024H9102K6264e4566B97631
15166f6230l6704A48783J670i30K04B42532l3578B9606Q6403A6659J38250m8938
15154A05971c2216H6062l6691K73786A8461J75503b77104D3906L0504O0235O692
15143A41337M6130B9552a64419C0264K66833A03264h4594A29430D4006J35995
15133A80001F7089d0333j7977A02054L05856A10174K6677K73058j82653m3601
15123A83655a12772C6920J86305a65785O1262B15102q2301J28699H4198K32449
15113C16647g4413C9433M8755K15056i4165L5504l5254A87383P9893i4509B21629
15101C72390j17152o9399j7427C9515L37306A84125h3365B53297b4543j50324
$$ plain form
15091 -174867 -28585 -141558 74382 354688 27971 24168 187366 185190 385415 487926 320956
15080 320956 130525 460495 254048 -25922 -316100 124775 275260 -58890 -104722 143754
15069 -230879 146891 89934 -7755 -87934 351797 352694 73627 241298 73253 285607 253002
15058 253002 205748 -25373 156407 -200504 200485 -124627 112012 457928 450423 291418
15048 291418 198255 259466 343538 -28873 415463 115913 245802 198125 526371 93995 472830
15037 472830 289287 417754 70156 99471 451032 215602 477243 -14475 399974 236209
15027 236209 289260 250148 237311 560504 504814 263622 90484 297235 447435 222653
15016 538672 532292 459767 487867 840716 747847 564046 681018 465758 525984 416331 314482
$$ packed form
15091a74867b8585j12973G4382K80306B7971l803J63198k176K00225J02511j66970
15080C20956A30525L29970k06447b5922k90178A24775J50485e8890m5832A43754
15069b30879A46891n6957g755q0179C51797Q97G3627J67671G3253K12354l2605
15058B53002m7254b5373A56407b00504B00485a24627A12012L45916p505j59005
15048B91418r3163O1211Q4072b8873D15463A15913J29889m7677L28246I3995L78835
15037D72830j83543J28467G0156K9315L51561B15602K61641a4475C99974j63765
15027B36209N3051l9112j2837L23193n5690k41192I0484K06751J50200B22653
15016E38672o380p2525K8100L52849r2869j83801J16972k15260O0226j09653j01849
$$ plain form
15005 314482 666226 389547 612392 516365 445946 360172 212775 476984 231529 219137
14995 219137 459780 629293 128031 504061 314179 394073 624170 201195 125173 395797
14985 395797 194635 379444 303143 552167 283521 885082 509401 338836 343688 280281
14975 280281 92895 540055 159871 220444 167960 467522 338139 906666 386105 521157
14965 521157 1097522 749837 735527 594903 638162 689042 320327 610455 432485 594188
14955 594188 656366 703706 604217 388457 389499 350840 509006 388396 509707 231034 242662
14944 242662 209347 65656 167303 418448 84067 452122 505234 402133 52544 744068
14934 744068 -128689 508301 357967 166233 292491 719382 349030 819687 578084 376735
$$ packed form
15005C14482L51744k76679K22845r6027p0419q5774j47397K64209B31529j2392
14995B19137K40643J69513A28031L76030j89882P9894K30097B01195p6022K70624
14985C95797A94635J84809p6301K49024k68646O01561l75681j70565M852o3407
14975B80281I2895M47160A59871O0573n2484K99562j29383N68527C86105J35052
14965E21157N76365l47685j4310j40624M3259N0880C20327K90128j77970J61703
14955E94188O2178M7340r9489k15760J042l8659J58166j20610J21311B31034J1628
14944B42662l3315F5656J01647K51145H4067L68055N3112j03101E2544O91524
14934G44068a28689E08301j50334A66233J26258M26891C49030M70657k41603k01349
$$ plain form
14924 376735 427789 629484 856788 601477 588890 597636 521471 484176 666302 843411 934363
14913 934363 1070718 1229576 1113229 1471028 1541092 1913736 1768800 1622612 1239630 1338033
14903 1338033 799587 1425106 1875874 2220917 1996935 1775146 1326935 1053766 1176862
14894 1176862 796865 719208 623844 608216 646718 349644 277081 485057 460333 383775 648167
14883 648167 345838 222549 122168 294874 515971 434227 226215 337268 469036 595521
14873 595521 463439 706577 480440 637732 822479 491648 847653 571457 889846 749211
14863 749211 515164 571647 539000 264808 476687 444343 582564 524191 194843 575628
14853 575628 620014 602683 428330 252138 691689 538583 565785 479407 554350 297431
$$ packed form
14924C76735N1054K01695K27304k55311j2587Q746p6165l7295J82126J77109R0952
14913I34363J36355J58858j16347L57799P0064L72644j44936j46188l82982R8403
14903A338033n38446O25519M50768L45043k23982k21789m48211k73169J23096
14894A176862l79997p7657r5364j5628L8502k97074p2563K07976k4724p6558K64392
14883F48167l02329j23289j00381J72706K21097q1744k08012J11053J31768J26485
14873E95521j32082K43138k26137J57292J84747l30831L56005k76196L18389j40635
14863G49211k34047N6483l2647B64808K11879l2344J38221n8373A94843L80785
14853E75628M4386j7331j74353j76192M39551j53106K7202q6378P4943k56919
$$ plain form
14843 297431 373455 346496 346223 553985 160772 192174 508929 470306 453518 562184 519473
14832 519473 596390 530810 759532 826559 815803 1026433 903666 1185502 973349 838758
14822 838758 1089130 928157 814830 646625 941258 972844 701173 534224 557011 540604
14812 540604 491826 762155 526612 732111 791028 700207 646539 476622 841816 554508
14802 554508 900428 860198 809232 502151 803493 639270 1036766 965809 405675 655013
14792 655013 653701 606279 726099 797321 823876 1053523 1173690 518509 767909 495463
14782 495463 411632 458099 541630 615028 673979 567768 547454 456979 289728 888285 679407
14771 679407 505381 753089 599241 262308 580101 534308 306719 905470 445721 573572
$$ packed form
14843B97431P6024k6959k73K07762A60772L1402L16755l8623j6788J08666m2711
14832E19473P6917o5580K28722O7027j0756K10630j22767K81836k12153j34591
14822H38758K50372j60973j13327j68205K94633L1586k71671j66949K2787j6407
14812E40604m8778K70329k35543K05499N8917r0821n3668j69917L65194k87308
14802E54508L45920m0230n0966l07081L01342j64223L97496p0957D05675K49338
14792F55013j312m7422J19820P1222K6555K29647J20167E18509K49400k72446
14782D95463q3831M6467Q3531P3398N8951j06211k0314r0475j67251N98557k08878
14771F79407j74026K47708j53848B62308L17793m5793k27589N98751D45721J27851
$$ plain form
14761 573572 734123 886586 744911 787023 511447 838774 714728 562240 399148 471730
14751 471730 849328 392670 493495 444917 266711 452256 580731 516572 184115 765539
14741 765539 441279 755853 857293 713822 598885 611633 762010 703490 771119 455780
14731 455780 432211 348070 803575 756762 861990 608611 591748 1105990 783960 596565
14721 596565 975629 1148983 1023862 859284 804931 1004897 771552 1239208 866575 1301274
14711 1301274 1222813 1672638 2040634 1252745 1325265 1156564 1223209 1083944 939782 1019476
14701 1019476 834477 537074 862908 736047 759816 559786 857299 794321 1038282 1042888
14691 1042888 1063477 1085464 898445 906422 1491787 1571135 1675078 1446483 1721592 1430884
$$ packed form
14761E73572J60551J52463j41675M2112k75576L27327j24046j52488j63092P2582
14751D71730L77598C92670J00825m8578j78206J85545J28475o4159A84115N81424
14741G65539l24260L14574J01440j43471j14937J2748J50377n8520O7629l15339
14731D55780k3569q4141M55505m6813J05228k53379j6863N14242l22030j87395
14721E96565L79064J73354j25121j64578n4353J99966k33345M67656l72633M34699
14711A301274p8461M49825L67996p87889P2520j68701O6645j39265j44162P9694
14701A019476j84999k97403L25834j26861K3769k00030K97513o2978K43961M606
14691A042888K0589K1987j87019P977N85365P9348J03943k28595K75109k90708
$$ plain form
14681 1430884 1342668 1242945 834405 1371123 1044294 981851 989959 984437 656065 727284 850283
14670 850283 1268634 1069355 644532 946291 836331 1013960 697013 991684 1117110 851651
14660 851651 1043301 742387 821585 698520 943873 845930 1043834 1048007 1260834 1008832
14650 1008832 1159195 1309651 905188 953763 1048466 834823 1059365 676256 863552 1045166
14640 1045166 1088507 845989 1346636 1137885 1371266 972839 1593421 1309739 1455916 1517516
14630 1517516 1271575 1092108 1029476 1330499 1205926 1064680 1167051 1152348 1420110 1065115
14620 1065115 1176434 1289003 1261513 1028766 1138701 1292739 1103356 1231626 1368481 1213178
14610 1213178 916346 1201524 1336547 1147519 1190923 1200539 1304174 1153173 1387873 1385874
$$ packed form
14681A430884q8216r9723m08540N36718l26829o2443Q108n522l28372P1219J22999
14670H50283M18351j99279m24823L01759j09960J77629l16947K94671J25426k65459
14660H51651J91650l00914P9198j23065K45353r7943J97904M173K12827k52002
14650A008832J50363J50456m04463M8575R4703k13643K24542l83109J87296J81614
14640A045166M3341k42518N00647k08751K33381l98427O20582k83682J46177O1600
14630A517516k45941j79467o2632L01023j24573j41246J02371j4703K67762l54995
14620A065115J11319J12569k7490k32747J09935J54038j89383J28270J36855j55303
14610A213178k96832K85178J35023j89028M3404R616J03635j51001K34700j999
$$ plain form
14600 1385874 1542444 1117617 1264326 1487227 1178303 1663577 1545069 1383729 1523561
14591 1523561 1301163 1074615 1234349 1618522 1402068 1546298 1481198 1656456 1390752 1406140
14581 1406140 1731822 1364237 1784784 1487920 1687348 1498665 1641801 1756497 1336061
14572 1336061 1685978 1824598 1751384 1284935 1679902 1579777 1869016 2239431 1779125 2063543
14562 2063543 1742670 2032037 1816504 2142909 1528941 2145875 1983499 1762005 1883980
14553 1883980 2255329 2179009 2086438 1984789 2390483 2361937 2281700 2600125 2351278 2334943
14543 2334943 2954678 3401488 3360058 3438793 3530477 4168428 4814149 5550960 6533929 8574570
14533 8574570 12622613 18651010 29015629 31939683 19933870 11792651 7244852 5282442
$$ packed form
14600A385874J56570m24827J46709K22901l08924M85274j18508j61340J39832
14591A523561k22398k26548J59734L84173k16454J44230o5100J75258k65704J5388
14581A406140L25682l67585M20547k96864J99428j88683J43136J14696m20436
14572A336061L49917J38620p3214m66449L94967j00125K89239L70415m60306K84418
14562B063543l20873K89367k15533L26405o13968O16934j62376k21494J21975
14553A883980L71349p6320r2571j01649M05694k8546q0237L18425k48847j6335
14543B334943O19735M46810m1430P8735R1684O37951O45721P36811R82969K040641
14533H574570M048043O028397J0364619K924054j2005813q141219m547799j962410
$$ plain form
14525 5282442 4432772 4475824 4621305 4850910 3424021 2840715 2461966 2627250 2389466
14516 2389466 2028557 2210125 2233155 2436057 2350646 2412039 2230601 2478826 2513655 2600609
14506 2600609 2359653 2362579 2547778 2318539 2337336 2449983 2654720 2594881 2378370 2561384
14496 2561384 2430222 2415991 2729671 2597800 2945982 2886721 2703638 2770401 2776600 2432865
14486 2432865 2794546 2856345 2791596 3131553 2794273 3005082 3237875 3104227 2971847 3069511
14476 3069511 3171373 3125930 3350227 3540918 3654726 3599301 3165574 3592356 3841390 3463273
14466 3463273 3736133 3667812 3366351 3490817 3590713 3686713 3861301 3649374 3749360 3862960
14456 3862960 3867000 4131474 3933960 4062896 4212579 4448728 4322264 4175981 4553176 4381886
$$ packed form
14525E282442q49670M3052J45481K29605j426889n83306l78749J65284k37784
14516B389466l60909J81568K3030K02902q5411O1393j81438K48225L4829Q6954
14506B600609k40956K926J85199k29239J8797J12647K04737n9839k16511J83014
14496B561384j31162j4231L13680j31871L48182n9261j83083O6763O199l43735
14486B432865L61681O1799o4749L39957l37280K10809K32793j33648j32380R7664
14476C069511J01862m5443K24297J90691J13808n5425m33727M26782K49034l78117
14466C463273K72860o8321l01461J24466R9896R6000J74588k11927R9986J13600
14456C862960M040K64474j97514J28936J49683K36149j26464j46283L77195j71290
$$ plain form
14446 4381886 4608053 4970908 4556082 4549863 4647829 4616879 4577521 5038152 4926654 4989345
14436 4989345 4992842 5121726 5119775 5038413 5100322 5450666 5293494 5434030 5728240 5732583 5392834
14425 5392834 5573865 5913271 5503030 5977507 5874216 6210114 6218826 6187055 6459330 6434257
14415 6434257 6901537 6543401 6650038 6443720 6585001 7018416 7139540 7109745 7655370 7497001
14405 7497001 7911368 7997455 7911083 8173123 8305289 8111143 8624569 8476479 8623870 8803357
14395 8803357 8707199 8790358 8866349 8976773 9594963 9112506 9718872 9790078 9958538 10398721
14385 10398721 9919636 10132984 10350832 10561607 10605685 10833518 10973028 11166208 11416259
14376 11416259 11622627 12056743 11998306 12309077 12316656 12326628 13007096 13007998 13326436 13282932 13866698
$$ packed form
14446D381886K26167L62855m14826o219R7966l0950l9358M60631j11498O2691
14436D989345L497J28884j951q1362O1909L50344j57172J40536K94210M343l39749
14425E392834J81031L39406m10241M74477j03291L35898Q712l1771K72275k5073
14415F434257M67280l58136J06637k06318J41281M33415J21124k9795N45625j58369
14405G497001M14367Q6087q6372K62040J32166j94146N13426j48090J47391J79487
14395H803357r6158Q3159P5991J10424O18190m82457O06366P1206J68460M40183
14385A0398721m79085K13348K17848K10775M4078K27833J39510J93180K50051
14376A1416259K06368M34116n8437L10771P579R972O80468R02L18438m3504N83766
$$ plain form
14365 13866698 14561082 14208981 14397784 15334297 14964498 15533268 15802178 16470987 16298406
14356 16298406 16552407 17055698 17494063 18019226 18309132 18882001 18991945 19582407 19924082
14347 19924082 20594667 20420889 21137556 21376048 21856503 22357774 22680082 23606963 23883332
14338 23883332 24597505 25290191 25876660 26404142 26884770 27617469 28631831 29071149 30069452
14329 30069452 30881439 31664593 32138320 33544356 34413080 35128654 36404905 37241492 38352005
14320 38352005 39351308 40670287 41603912 43256827 44621605 46063167 47644205 49264262
14312 49264262 50471550 51976648 54210290 56002007 57986773 59987078 62288278 64404184
14304 64404184 67246935 69698168 72378981 74708526 77911830 80842950 83800374 87497993
$$ packed form
14365A3866698O94384l52101J88803R36513l69799N68770K68910O68809j72581
14356A6298406K54001N03291M38365N25163K89906N72869J09944N90462L41675
14347A9924082O70585j73778P16667K38492M80455N01271L22308R26881K76369
14338B3883332P14173O92686N86469N27482M80628P32699J014362M39318R98303
14329C0069452Q11987P83154M73727J406036Q68724P15574J276251Q36587J110513
14320C8352005R99303J318979R33625J652915J364778J441562J581038J620057
14312D9264262J207288J505098K233642J791717J984766K000305K301200K115906
14304F4404184K842751K451233K680813K329545L203304K931120K957424L697619
$$ plain form
14296 87497993 91270641 94814578 99544800 103658424 108489607 113347185 118526935 124150426
14288 124150426 130064827 136867658 143512718 150689155 158499383 166745155 175547873 184360696
14280 184360696 194321751 204685538 215787633 227223501 239349942 252201027 265674767
14273 265674767 279810227 294453567 309422897 324583845 339209361 354255082 368947894
14266 368947894 383254272 396592178 409173566 420625599 430980213 440874188 449193562
14259 449193562 457723999 463120041 464868005 465708516 466622758 464613953 456918544 451822164
14251 451822164 443867898 432433309 421023166 407969369 393755158 378765110 365735237
14244 365735237 351512294 336593765 321696920 307232341 292838571 279633888 266473491
$$ packed form
14296H7497993L772648L543937M730222M113624M831183M857578N179750N623491
14288A24150426N914401O802831O645060P176437P810228Q245772Q802718Q812823
14280A84360696R961055J0363787J1102095J1435868J2126441J2851085J3473740
14273B65674767J4135460J4643340J4969330J5160948J4625516J5045721J4692812
14266C68947894J4306378J3337906J2581388J1452033J0354614R893975Q319374
14259D49193562Q530437N396042J747964Q40511R14242k008805p695409n096380
14251D51822164p954266j1434589j1410143j3053797j4214211j4990048j3029873
14244C65735237j4222943j4918529j4896845j4464579j4393770j3204683j3160397
$$ plain form
14237 266473491 253930621 242009339 230150331 218405156 207633181 196853187 186833607
14230 186833607 177145593 167820893 159684163 151784071 144409263 137454232 131114138 125232149
14222 125232149 119832187 113973337 109057559 104194110 99683286 95806115 91939728 88545105
14214 88545105 84584842 81450675 78196183 74908804 72204391 69273110 66771594 64634131
14206 64634131 62375226 60130208 58047301 56076446 54190852 52536914 50784789 49412358
14198 49412358 47784778 46581109 45017248 43591747 42542794 41241399 40259590 38930349
14190 38930349 37724777 36567669 35610296 34798469 33698550 33336747 32308779 31243579
14182 31243579 30208483 29259147 29111060 28490055 27774508 26908107 26532457 25874724 25285530
$$ packed form
14237B66473491j2542870j1921282j1859008j1745175j0771975j0779994j0019580
14230A86833607r688014r324700q136730p900092p374808o955031o340094n881989
14222A25232149n399962n858850m915778m863449m510824l877171l866387l394623
14214H8545105l960263l134167l254492l287379k704413k931281k501516k137463
14206F4634131k258905k245018k082907j970855j885594j653938j752125j372431
14198D9412358j627580j203669j563861j425501j048953j301395r81809j329241
14190C8930349j205572j157108r57373q11827j099919l61803j027968j065200
14182C1243579j035096r49336j48087o21005p15547q66401l75650o57733n89194
$$ plain form
14173 25285530 24473089 23985840 23231938 22664574 22112903 21887808 21229687 20671732 20145198
14164 20145198 20082554 19432936 18875845 18685059 18290888 18193587 17843537 17461975 16976228 16703565
14154 16703565 16268932 16302395 15997383 14995652 15272847 15148682 14610283 14121426 14190746
14145 14190746 13664690 13509644 13543488 13370978 13047193 12932327 12270195 12421818 12435749 12043098
14135 12043098 11845560 11584413 11507249 11142596 11075679 10868270 10629195 11002781 10286907 10431012
14125 10431012 10104028 9679624 9843223 9300394 9612130 8921837 9424558 9049589 9070394
14116 9070394 8647506 8883267 8454203 8556988 8095393 7871822 8031735 7818728 7791142 7601016
14106 7601016 7669097 7612191 7297523 7453049 7432025 7270844 7139536 6838396 7132670 6916834
$$ packed form
14173B5285530q12441m87249p53902n67364n51671k25095o58121n57955n26534
14164B0145198o2644o49618n57091j90786l94171r7301l50050l81562m85747k72663
14154A6703565m34633L3463l05012j001731K77195j24165n38399m88857O9320
14145A4190746n26056j55046L3844j72510l23785j14866o62132J51623J3931l92651
14135A2043098j97538k61147p7164l64653o6917k07409k39075L73586p15874J44105
14125A0431012l26984m24404J63599n42829L11736o90293N02721l74969K0805
14116I070394m22888K35761m29064J02785m61595k23571J59913k13007k7586j90126
14106G601016O8081n6906l14668J55526k1024j61181j31308l01140K94274k15836
$$ plain form
14096 6916834 6521597 6658605 6465952 6565768 6513930 6281035 6052378 6146531 6035489 6323740
14086 6323740 6242772 5846441 5718766 5884483 5716540 5639767 5357810 5151479 5146090 5477105
14076 5477105 5469094 5100712 5056341 5359254 5113771 4941131 4920426 5140995 4890410 4927465
14066 4927465 4881310 4747584 4631311 4853862 4332181 4490338 4217583 4371037 4405645 4154141
14056 4154141 4009013 4547477 4278398 4230948 4194868 4220611 3999011 4000560 4059190 3979667 4177317
14045 4177317 4473022 4033399 3639069 3978072 3919704 3896454 4046966 3690419 3687175 3631345
14035 3631345 3650764 3319342 3445659 3416524 3365733 3484113 3270053 3203629 3466865 3235152
14025 3235152 3006073 3264068 3080855 3332182 3049278 2759695 2914217 2998217 3022033 2898581
$$ packed form
14096F916834l95237J37008j92653R9816n1838k32895k28657R4153j11042K88251
14086F323740q0968l96331j27675J65717j67943p6773k81957k06331n389L31015
14076E477105q011l68382m4371L02913k45483j72640k0705K20569k50585L7055
14066D927465m6155j33726j16273K22551n21681J58157k72755J53454L4608k51504
14056D154141j45128N38464k69079m7450l6080K5743k21600J549N8630p9523J97650
14045D177317K95705m39623l94330L39003n8368k3250J50512l56547l244n5830
14035C631345J9419l31422J26317k9135n0791J18380k14060o6424K63236k31713
14025C235152k29079K57995j83213K51327k82904k89583J54522Q4000K3816j23452
$$ plain form
14015 2898581 2784437 2813493 3232724 3053758 2913228 2858978 2942540 3073043 2935406 2524499
14005 2524499 2353066 2223539 2558162 2496038 2587736 2618618 2294126 2513620 2514429 2552867 2335807
13994 2335807 2426803 2371073 1776438 2175194 2013550 2285470 2222026 2216150 2352215 2512324
13984 2512324 2256865 2353086 2385428 1914267 2187024 2507145 2783588 3262436 3290117 3969597
13974 3969597 5672862 8320144 13816790 23968649 33122351 23790037 15332724 10428843
13966 10428843 7528840 6115861 4880739 4530368 3918937 3541223 3427345 3128364 3081224
13957 3081224 2705142 2761519 2673874 2286995 2490792 2523484 2344117 1925857 2249065 2175000
13947 2175000 1930731 2082135 1997048 2158549 1963136 2172139 1981945 1894614 1867509 2120654
$$ packed form
14015B898581j14144K9056M19231j78966j40530n4250Q3562J30503j37637m10907
14005B524499j71433j29527L34623o2124R1698L0882l24492K19494Q09L8438k17060
13994B335807R0996n5730n94635L98756j61644K71920o3444n876J36065J60109
13984B512324k55459R6221L2342m71161K72757L20121K76443M78848K7681O79480
13974C969597J703265K647282N496646J0151859R153702r332314q457313m903881
13966A0428843k900003j412979j235122l50371o11431l77714j13878k98981m7140
13957C081224l76082N6377q7645l86879K03797L2692j79367m18260L23208p4065
13947B175000k44269J51404q5087J61501j95413K09003j90194q7331k7105K53145
$$ plain form
13937 2120654 2121249 2016496 1744156 1642906 1654740 1956758 1598031 1714189 1684614 1504996
13927 1504996 1887792 1743624 1757981 1650598 1355172 1625396 1845809 1704352 1694843 2041545
13917 2041545 1873523 1713593 1691946 1622947 1549098 1510254 1850396 1526229 1584589 1471056
13907 1471056 1426815 1401616 1631884 1318405 1673390 1381737 1397064 1403405 1492603 1370979
13897 1370979 1264932 955880 1187355 1264568 1610197 1674865 1304990 1349138 1502257 1196496
13887 1196496 1372340 1533138 1354335 1572332 1487746 1228586 1272913 1685432 1133990 1321399
13877 1321399 939202 1211189 1242537 1099632 1259550 1174290 990482 854798 1402086 1113486
13867 1113486 1302380 1173260 1131495 1419045 1165156 1357327 1104848 1165184 1220298 977767
$$ packed form
13937B120654N95j04753k72340j01250J1834L02018l58727J16158k9575j79618
13927A504996L82796j44168J4357j07383k95426K70224K20413j41457r509L46702
13917B041545j68022j59930k1647o8999p3849l8844L40142l24167N8360j13533
13907A471056m4241k5199K30268l13479L54985k91653J5327O341Q9198j21624
13897A370979j06047l09052K31475P7213L45629O4668l69875M4148J53119l05761
13887A196496J75844J60798j78803K17997q4586k59160M4327M12519n51442J87409
13877A321399l82197K71987L1348j42905J59918q5260j83808j35684N47288k88600
13867A113486J88894j29120m1765K87550k53889J92171k52479O0336N5114k42531
$$ plain form
13857 977767 1311287 995222 985100 1179781 1286554 1149289 1011577 1191742 1319958 942624
13847 942624 1059076 1079478 998929 1015977 847081 1036372 1150964 1104699 1120852 852391
13837 852391 932000 1328598 1119488 1054661 600795 787899 1022536 1026506 1302734 861177
13827 861177 607711 851200 1008850 1025460 1140147 741110 1165134 1151026 882898 786268
13817 786268 1007131 860024 920355 821053 1107973 858911 649327 912247 856280 936229
13807 936229 756976 966032 912966 1166516 1189215 862202 999280 872712 960849 836933
13797 836933 743689 1089001 685339 1001636 606262 745083 880536 745381 729783 704250
13787 704250 693321 791096 577444 621719 846714 677094 618758 792870 867234 602197
$$ packed form
13857I77767L33520l16065j0122J94681J06773j37265j37712J80165J28216l77334
13847I42624J16452K0402q0549J7048j68896J89291J14592m6265J6153k68461
13837H52391P9609L96598k09110o4827m53866J87104K34637L970K76228m41557
13827H61177k53466K43489J57650J6610J14687l99037M24024j4108k68128r6630
13817G86268K20863j47107O0331r9302K86920k49062k09584K62920n5967P9949
13807I36229j79253K09056n3066K53550K2699l27013J37078j26568Q8137j23916
13797H36933r3244L45312m03662L16297l95374J38821J35453j35155j5598k5533
13787G04250j0929R7775k13652M4275K24995j69620n8336J74112P4364k65037
$$ plain form
13777 602197 725770 918472 1046040 761857 576170 782898 695518 672851 1002792 967987
13767 967987 908610 609016 740667 703636 610708 510869 930945 597954 1028846 651588
13757 651588 595449 329031 482876 746605 443759 802218 613320 700985 636111 278454
13746 646463 711608 704890 778852 349010 1139566 734774 643539 639409 1097395 581177 588737
13735 588737 717966 992715 542078 687972 973277 670420 447368 752688 420150 657109
13725 657109 530677 655170 386563 788185 394501 635347 733582 716995 262715 436887
13715 436887 900978 831383 541896 474711 759387 339827 448688 589692 646194 559714
13705 559714 685299 701610 429947 852982 303587 409251 700016 731472 451119 610000
$$ packed form
13777F02197J23573J92702J27568k84183j85687K06728q7380k2667L29941l4805
13767I67987n9377k99594J31651l7031r2928r9839M20076l32991M30892l77258
13757F51588n6139k66418J53845K63729l02846L58459j88898Q7665o4874B78454
13746F46463O5145o718P3962C49010P90556m04792r1235m130M57986n16218P560
13735E88737J29229K74749m50637J45894K85305l02857k23052L05320l32538K36959
13725F57109j26432J24493k68607M01622l93684K40846R8235j6587B62715J74172
13715D36887M64091o9595k89487o7185K84676C39827J08861J41004N6502q6480
13705E59714J25585J6311k71663M23035C03587J05664K90765L1456k80353J58881
$$ plain form
13695 610000 590480 722769 751900 323086 400268 455902 654400 540871 233253 324059
13685 324059 236842 492443 518706 516497 220717 542848 506186 642678 503016 143149
13674 643287 350269 540329 574013 329954 505284 648536 752167 359702 577291 398617
13664 398617 598845 505333 229560 461598 685691 343595 475886 297167 503543 686202
13654 686202 478190 458143 400816 676392 650845 329199 656481 261849 427612 436571
13644 436571 430482 419418 385627 297715 509183 508877 666397 267767 567934 584749 426577
13633 426577 418839 545907 521981 114077 285943 138232 484146 71635 571685 506973
13623 506973 278925 581773 325799 429620 375685 377720 541341 350524 241088 233598
$$ packed form
13695F10000j9520J32289K9131C23086P7182N5634J98498j13529B33253R0806
13685C24059q7217K55601K6263k209B20717L22131l6662J36492j39662A43149
13674F43287k93018J90060L3684k44059J75330J43252J03631C59702K17589j78674
13664C98617K00228r3512B29560K32038K24093l42096J32291j78719K06376J82659
13654F86202k08012k0047n7327K75576k5547l21646L27282B61849J65763Q959
13644D36571o089j1064l3791q7912K11468l06J57520B67767L00167J6815j58172
13633D26577p738J27068k3926A14077J71866A38232L45914G1635N00050o4712
13623E06973k28048L02848k55974J03821n3935K035J63621j90817j09436p490
$$ plain form
13613 233598 625772 379763 502734 106048 320927 349496 98405 186508 168359 408203
13603 408203 485487 419317 383706 232498 383505 135487 274596 505244 353034 577007
13593 577007 90423 344851 201735 460722 602575 251561 99393 -75088 378580 252716
13583 252716 396280 429688 194722 530706 387140 374401 461427 414111 624519 527834
13573 527834 680013 373711 455070 258442 604366 624865 547140 494313 190717 551231
13563 551231 271321 420821 22788 399990 241666 -17149 209007 265286 245513 83688
13552 268771 207300 562309 174995 -13045 460525 206395 282970 622238 193770 303319
13542 303319 371062 102128 149492 335426 -14964 432102 -43226 406340 251500 54345
$$ packed form
13613B33598L92174k46009J22971A06048K14879K8569I8405Q8103j8149K39844
13603D08203P7284o6170l5611j51208J51007A35487J39109K30648j52210K23973
13593E77007I0423K54428j43116K58987J41853B51561I9393g5088C78580j25864
13583B52716J43564L3408A94722L35984j43566j2739Q7026m7316K10408r6685
13573E27834J52179l06302Q1359j96628L45924K0499p7725n2827A90717L60514
13563E51231B71321J49500B2788L77202j58324a7149B09007N6279j9773H3688
13552B68771o1471L55009A74995a3045D60525B06395P6575L39268A93770J09549
13542C03319O7743A02128M7364J85934a4964D32102d3226D06340j54840E4345
$$ plain form
13531 98006 359191 402550 327114 433171 195148 465264 322479 152946 525578 181547
13520 104635 459939 113598 134252 160155 169363 181840 299883 518747 156995 354856
13510 354856 308778 172094 270297 579129 517070 400559 278818 149533 365486 413704
13500 413704 31698 504414 330886 443088 175000 93299 -39509 186474 345477 249717
13490 249717 302815 -58605 742725 487115 -12701 53889 484879 261026 160767 646 352862
13479 352862 573580 152520 169333 284485 183805 387375 451257 450428 241594 154813 270984
13468 270984 135850 413972 439027 234950 297622 281703 391263 228373 141870 283827
13458 283827 444321 377703 259518 228953 -223040 203708 546830 395023 110591 179235
$$ packed form
13531I8006K61185M3359p5436J06057A95148K70116j42785A52946L72632A81547
13520A04635L55304A13598K0654K5903R208J2477J18043K18864A56995J97861
13510C54856m6078j36684R8203L08832o2059j16511j21741j29285K15953M8218
13500D13704C1698M72716j73528J12202A75000q1701c9509A86474J59003r5760
13490B49717N3098e8605G42725k55610a2701E3889M30990k23853j00259F46L52216
13479C52862K20718A52520J6813J15152j00680K03570O3882q29k08834q6781J16171
13468B70984j35134K78122K5055k04077O2672j5919J09560j62890q6503J41957
13458B83827J60494o6618j18185l0565b23040B03708L43122j51807A10591O8644
$$ plain form
13448 179235 215289 248731 136273 131059 118520 -2782 340153 307048 432272 388370 258278
13437 258278 176837 89692 186264 141760 150294 179305 414654 96120 95854 -133797 104039
13425 195280 434867 46956 416532 156493 100324 446735 -208878 -12630 172393 234714
13415 234714 362502 -37508 -9205 264059 371154 212068 263872 32103 -14367 244645 233050
13404 233050 236112 291152 257702 333322 234201 399641 411797 59466 31172 130639 140563 108637
13392 108637 118001 529835 132716 360250 364930 377540 411119 -160079 46166 -25672 27488
13380 180171 140359 202600 13008 39772 361945 -12751 277471 371684 379898 277022 101479
13368 -140665 181038 -108545 235663 131632 376758 -164126 24079 -108478 573013 556091
$$ packed form
13448A79235L6054L3442j12458n214j2539b782C40153l3105J25224m3902j30092
13437B58278q1441q7145R6572m4504Q534K9011K35349I6120k66a33797A04039
13425A95280K39587D6956L69576A56493n6169L46411b08878a2630A72393O2321
13415B34714J27788c7508i205B64059J07095j59086N1804C2103a4367B44645j1595
13404B33050L062N5040l3450P5620r9121J65440J2156E9466k8294R9467R924l1926
13392A08637R364M11834A32716K27534M680J2610L3579a60079D6166b5672B7488
13380A80171l9812O2241A3008K6764L22173a2751B77471R4213Q214j02876A01479
13368a40665A81038a08545B35663j04031K45126a64126B4079a08478E73013j6922
$$ plain form
13358 556091 575627 236516 357391 -175453 82237 140515 424630 249277 52149 345091
13348 345091 241908 267633 168276 -141022 359394 48680 121328 247279 103793 -83330
13337 166234 -79978 395403 1773 217336 196631 469707 383636 383909 522430 297235 -142885
13325 435329 -43454 322926 358443 240989 545465 138288 98132 232187 67072 -101617
13314 354793 297189 160299 -88485 463869 -12750 253978 83511 229098 396642 544956
13304 544956 642648 18215 21184 532346 350368 447855 403360 164572 -187852 207802 112394
13293 112394 16183 193278 190590 200470 268962 99064 68406 594148 -28605 283452 58193
13281 20085 153235 217370 287467 190548 15754 232124 89528 -159662 104149 313130 164663
$$ packed form
13358E56091J9536B36516J20875a75453H2237N8278K84115j75353E2149K92942
13348C45091j03183K5725r9357a41022C59394D8680P2648J25951A03793h3330
13337A66234g9978C95403A773K15563k0705K73076q6071K73J38521k25195a42885
13325D35329d3454C22926L5517j17454L04476A38288m0156J34055F7072a01617
13314C54793n7604j36890h8485D63869a2750B53978H3511J45587J67544J48314
13304E44956R7692A8215K969N11162j81978R7487m4495A64572a87852B07802r5408
13293A12394A6183J77095k688R880O8492I9064l0658N25742b8605B83452E8193
13281B0085J33150O4135P0097r6919A5754K16370H9528a59662A04149K08981j48467
$$ plain form
13270 164663 480694 62571 148233 -222070 -105068 213785 71876 -117198 106016 106380 105129
13259 105129 354275 -42243 77565 6988 40151 526616 117070 -433 102780 -52945 143156
13247 122179 122635 41896 256973 219215 236245 -22441 188722 -87341 67634 221307 -126101
13235 115925 559356 322881 353779 299555 179657 -49600 94588 23132 78291 473757 45725
13223 311873 93931 408465 331611 125041 243926 -35467 -92578 169187 12006 -68358 156597
13211 -4842 347326 25455 181377 173959 330762 -40839 -126659 424851 203851 160836 67921
13199 116743 -5836 -17325 -63696 209568 -76434 233212 38448 20618 420173 107261 -62074
13187 -123461 202706 66773 -265264 102126 -330978 -259624 -301294 143159 -19838 134530
$$ packed form
13270A64663L16031F2571Q5662b22070a05068B13785G1876a17198A06016L64j251
13259A05129K49146d2243G7565F988L3163M86465A17070d33A02780e2945A43156
13247A22179M56D1896K15077l7758J7030b2441A88722h7341F7634J53673a26101
13235A15925M43431k36475L0898n4224j19898d9600I4588B3132N5159L95466D5725
13223C11873I3931L14534p6854A25041J18885c5467n7111A69187A2006f8358A56597
13211d842C47326B5455J55922p418J56803d0839q5820D24851B03851m3015F7921
13199A16743e836j1489m6371B09568g6434B33212C8448j7830L99555A07261f2074
13187a23461B02706F6773b65264A02126c30978P1354m1670A43159a9838A34530
$$ plain form
13176 23674 106595 267130 -99591 -14271 153351 92741 47967 -131536 114150 7119 366942
13165 366942 320998 309435 -154616 -5556 33117 -79883 5276 -45030 -5270 15460 37636 550696
13153 550696 -231484 -59559 -417326 -80600 -104669 -43227 -115013 54324 67903 247464 -107174
13141 -23102 -88688 141757 371844 204565 -224712 210011 -59938 -90528 420373 332016
13131 332016 -47440 -138821 28604 87092 -201491 -396732 442957 -126132 148012 -152316
13120 108023 41871 321336 180877 127966 -67126 106978 -6419 356492 54940 -65082 209723
13108 32607 147775 70222 23681 132360 333603 182161 238127 -55224 -20564 299001 -179955
13096 -61527 164905 156267 430185 -34082 107450 -73724 229321 206974 -115049 276200 224267
$$ packed form
13176B3674Q2921J60535i9591a4271A53351o0610m4774a31536A14150G119L59823
13165C66942m5944j1563a54616e556C3117g9883E276d5030e270A5460K2176N13060
13153E50696b31484e9559l57767h0600k4069d3227p1786E4324J3579J79561a07174
13141b3102o5586A41757K30087j67279b24712B10011e9938l0590D20373q8357
13131C32016d7440r1381B8604N8488b01491j95241D42957a26132A48012a52316
13120A08023D1871K79465j40459n2911f7126A06978f419C56492E4940f5082B09723
13108C2607J15168G0222B3681J08679K01243j51442N5966e5224b0564B99001a79955
13096f1527A64905q638K73918c4082A07450g3724B29321k2347a15049B76200n1933
$$ plain form
13085 224267 39738 123434 102704 53817 209457 401642 35933 -151651 -75050 -55714 -131364
13074 -131364 108426 -77353 296397 321911 97798 45494 189366 -101621 221321 -94158
13063 156640 -166284 199877 -96998 -192780 215357 -184488 213791 67621 -247416 153258
13052 -140556 196778 205977 200092 -189442 175684 255774 123058 163212 -76015 115821 29172
13040 36023 395989 189324 81061 -150721 87737 364526 142437 471091 30243 193962
13030 193962 211197 113383 -24479 -65017 66913 -45060 241048 -227955 -54940 185579 318666
13019 318666 372633 -56021 -329096 -59789 301635 187125 135407 182208 -58760 -201920 541354
13007 7965 -44950 -79530 69932 62656 191398 113585 286589 294855 -110215 206825 -152342
$$ packed form
13085B24267C9738Q3696k0730m8887J55640J92185C5933a51651g5050J9336p5650
13074a31364A08426g7353B96397K5514I7798D5494J43872a01621B21321i4158
13063A56640a66284A99877i6998r5782B15357a84488B13791F7621b47416A53258
13052a40556A96778R199n885a89442A75684Q0090A23058M0154g6015A15821B9172
13040C6023L59966A89324H1061a50721H7737K76789A42437L28654C0243J63719
13030A93962J7235r7814b4479m0538F6913d5060B41048b27955e4940A85579J33087
13019C18666N3967e6021k73075e9789C01635j14510n1718M6801e8760j43160E41354
13007G965d4950l4580F9932p276J28742p7813J73004Q266a10215B06825a52342
$$ plain form
12995 63998 -222543 129148 283858 295566 -160683 103451 -63257 153891 -30387 -111559
12985 -111559 -139783 141008 -40917 33780 1622 -163511 446 306989 269314 -79624 -291072
12974 -291072 -238771 362765 64687 128707 -179884 -21069 26565 141020 -114491 200368
12963 71835 42084 173741 -285048 296142 159527 68397 104505 169243 -3269 -32159 -13948
12951 -18199 -288098 20215 12016 165668 275336 -321320 -4309 122298 198606 320411 159980
12939 -71291 161087 25452 381899 278149 13306 -49692 6551 167352 -260740 -65126 320834
12927 215517 -275306 11723 31720 373751 181040 -137294 314465 -153197 186862 138016
12917 138016 -10200 9753 109358 86552 -232772 -55234 -19472 87663 101268 309140 260336
$$ packed form
12995F3998b22543A29148J54710J1708a60683A03451f3257A53891c0387q1172
12985a11559k8224A41008d0917C3780A622a63511D46L06543l7675g9624k11448
12974b91072N2301C62765F4687O4020a79884b1069B6565J14455a14491B00368
12963G1835k9751J31657b85048B96142j36615F8397L6108O4738c269k8890a3948
12951a8199k69899B0215q199J53652J09668c21320d309A22298P6308J21805A59980
12939g1291A61087B5452L56447j03750A3306d9692F551J60801b60740f5126C20834
12927B15517b75306A1723J9997L42031A81040a37294C14465a53197A86862m8846
12917A38016a0200I753R9605k2806b32772e5234a9472H7663J3605K07872m8804
$$ plain form
12906 260336 114246 201684 -348109 61750 -201218 -361594 308922 240323 -97151 633 185022
12895 185022 291495 -2724 -189634 260619 -351801 -122392 17201 140855 65017 -411254
12884 78807 -9324 -78577 107290 45771 -164154 175694 82067 86044 184047 -140970 20498
12872 231012 -658 -166749 -183743 205900 88595 118241 204286 228871 -176264 206412 -89950
12860 286016 -252868 3139 223461 -326357 91950 -291517 -224961 50149 -116614 -227428
12850 -227428 -212498 -172399 182845 -47174 18276 163591 207866 -6294 44937 -19200 22462
12838 257623 276430 261008 -113661 -232770 99689 66595 -66510 226043 48422 92694 17453
12826 34449 -218241 -26811 165335 18842 -150842 -159302 187260 -57357 291002 -44471 131644
$$ packed form
12906B60336A14246Q7438c48109F1750b01218j60376C08922o8599i7151F33J84389
12895A85022J06473b724j86910B60619c51801a22392A7201J23654F5017d11254
12884G8807i324o9253A07290D5771a64154A75694H2067L977R8003a40970B0498
12872B31012f58j66091j6994B05900H8595K9646Q6045K4585a76264B06412h9950
12860B86016b52868C139K20322c26357I1950b91517O6556E0149a16614j10814
12850b27428J4930M0099A82845d7174A8276J45315M4275f294D4937a9200B2462
12838B57623J8807j5422a13661j19109I9689l3094f6510B26043D8422M4272A7453
12826C4449b18241b6811A65335A8842a50842q460A87260e7357B91002d4471A31644
$$ plain form
12814 -120046 -22455 -212941 61180 39693 -51932 54236 -67921 -267884 -103266 130060 -51702
12802 -56512 -68575 29605 -80013 507 -85124 -45784 -81341 26594 46201 -216893 298987 -75485
12789 -334426 -173223 62634 182906 -22498 -218789 -47608 50388 51323 -75683 -289653 -42598
12777 78150 -43295 62745 -106691 17169 275182 -49091 209797 4488 -83388 -41284 -262896
12766 -262896 -417651 174441 208794 106306 14415 108012 -199482 -61385 59036 -49874 -132816
12755 -132816 -97149 227423 -203232 4151 524320 151966 -165393 -72570 -229515 -123256
12745 -123256 80062 18693 -289525 -272457 -85120 -148241 33128 -165346 -250664 -147092 -302356
12734 -302356 114913 153256 -36716 -58250 43855 101532 110073 21604 -147884 351177 115162
$$ packed form
12814a20046b2455j90486F1180k1487e1932E4236f7921j99963a03266A30060e1702
12802e6512j2063B9605h0013E07h5124L9340l5557B6594J9607b16893B98987g5485
12789c34426J61203F2634J20272b2498j96291d7608E0388R35g5683k13970d2598
12777G8150d3295F2745a06691A7169K58013d9091B09797D488h3388d1284k21612
12766b62896j54755A74441L4353j02488A4415R3597a99482f1385E9036d9874q2942
12755a32816L5667B27423b03232D151N20169A51966a65393g2570j56945J06259
12745a23256H0062A8693b89525J7068h5120o3121C3128a65346q5318J03572j55264
12734c02356A14913L8343c6716k1534D3855N7677Q541B1604a47884C51177A15162
$$ plain form
12722 148055 251027 -127774 -90764 -17127 134855 151409 218075 176883 105220 5331 -178919
12710 156513 -200120 180627 -68479 -318997 86041 -17630 -251612 -72386 236465 12861
12699 -268812 235397 -73004 347800 -68180 27177 10807 -29907 182639 131118 39447 353402
12688 353402 393944 186378 224692 15174 71085 225617 116135 -12696 28283 -167403 -12163
12676 -362369 -172697 119203 -93032 -200900 -154763 -9436 107050 -100284 -227623 -251298
12666 -251298 297961 -78431 77395 133948 365594 77736 101781 180631 -147552 249335 458017
12655 458017 -108695 40507 33917 18050 -69892 -376102 116835 58185 108079 73927 212565
12644 212565 165984 200086 -214779 -200005 62336 81805 -10123 255535 -9577 21494 -123940
$$ packed form
12722A48055J02972a27774L7010a7127A34855J6554O6666m1192p1663E331a78919
12710A56513b00120A80627f8479k50518H6041a7630k33982g2386B36465A2861
12699b68812B35397g3004C47800f8180B7177A0807b9907A82639n1521C9447L13955
12688C53402M0542A86378L8314A5174N5911J54532j09482a2696B8283a67403a2163
12676c62369a72697A19203i3032j07868M6137i436A07050a00284j27339k3675
12666b51298B97961g8431G7395N6553K31646G7736K4045P8850a47552B49335K08682
12655D58017a08695D0507o590j5867f9892l06210A16835E8185M9894l4152J38638
12644B12565m6581L4102b14779J4774F2336J9469a0123B55535i577B1494a23940
$$ plain form
12632 148087 141078 244151 310504 -229979 108111 -328158 408682 326133 -225165 289867
12621 248851 11526 20348 304270 201339 150015 495663 130435 175020 79821 325823 82138
12609 5653 296420 -232406 -124729 -30463 108222 417676 -96507 -6944 -14880 258584 -244727
12597 -93761 -176430 225103 261219 -181750 159841 -59891 59856 83958 -15772 217198 26668
12585 -103075 -231657 341716 204462 -1750 426599 -167279 26790 -167994 128096 98603
12575 98603 466464 168831 58880 75773 -330867 -27489 87686 144436 -284215 -420474 -78948
12563 -108767 32027 85586 163729 101984 169819 103096 -287142 34644 -120832 -164296 -43583
12551 201485 77733 -278371 -249919 -9852 -344784 -330033 121286 292052 125159 3681 3160
$$ packed form
12632A48087p009J03073O6353b29979A08111c28158D08682q2549b25165B89867
12621B48851A1526Q822K83922j02931n1324L45648A30435M4585G9821K46002H2138
12609E653K90767b32406J07677c0463A08222L09454i6507f944p936B58584b44727
12597i3761q2669B25103L6116a81750A59841e9891E9856K4102a5772B17198B6668
12585a03075j28582C41716j37254a750D26599a67279B6790a67994A28096k9493
12575I8603L67861A68831E8880J6893c30867b7489H7686N6750b84215j36259g8948
12563a08767C2027N3559P8143o1745O7835o6723b87142C4644a20832m3464d3583
12551B01485G7733b78371K8452i852l34932J4751A21286J70766A25159C681n21
$$ plain form
12540 3160 219766 15072 146643 -151816 -17190 -8552 -69484 49624 72021 -52060 267676
12528 90302 -178968 -86196 -203957 43101 51101 -161793 -290636 120488 -241846 -258906 -202944
12517 -202944 426579 -30996 33231 11245 210629 79395 -186271 -138956 -113765 332176 336536
12506 336536 -27737 100594 -322962 369565 -176286 -14566 171106 56243 -132455 168095
12495 173570 235411 -146211 -27858 -149415 -95678 282515 -227943 114495 -65990 -58252 -22536
12483 132211 -56193 -128727 25980 -11674 35094 -73650 -65086 -46851 -214608 -251256 -43388
12471 -151971 -43393 -257179 -59895 -51356 -49309 88836 -1983 -32179 202026 50979 12868 74901
12459 74901 157867 27217 -257266 -433401 8829 446169 -74466 -80571 -241528 -34001 -43130
$$ packed form
12540C160K16606A5072J31571a51816a7190h552o0932D9624K2397e2060B67676
12528I0302a78968h6196j17761D3101Q000a61793j28843A20488b41846j7060N5962
12517b02944D26579c0996C3231A1245J99384G9395a86271M7315K5191C32176M360
12506C36536b7737A00594c22962C69565a76286a4566A71106E6243a32455A68095
12495A73570O1841a46211b7858j21557N3737B82515b27943A14495f5990P738b2536
12483A32211e6193p2534B5980a1674C5094g3650Q564J8235j67757l6648d3388
12471a51971d3393k13786e9895Q539K047H8836a983l0196B02026E0979A2868O2033
12459G4901Q2966B7217b57266j76135H829M37340g4466o105j60957c4001r129
$$ plain form
12448 -43130 -256057 -15317 -114108 -153026 -133499 15436 121890 -40894 157863 -28915 -125146
12437 -125146 81292 310983 -110779 -114942 -96825 -4947 -59271 -123221 -262720 -251247 -239164
12426 -239164 -306347 26320 138771 122338 -138289 -67184 384971 -13564 -58799 196794 -264114
12414 -194399 116267 -25435 -244673 85015 -120037 122113 -88121 186317 -483552 6035
12403 -108638 -78196 -168236 -51688 -112874 -88944 -98166 -41021 151137 -185027 -218972 -124025
12392 -124025 112731 -309856 -14775 37151 -47960 5510 -98131 -239196 -50916 -2187 54289
12380 -142960 42144 52764 69001 -149420 -32311 11660 59427 137603 -165574 171877 -97090
12368 359555 -48131 41698 29563 119203 -88310 233925 -145557 100856 213150 -195039
$$ packed form
12448d3130k12927a5317r8791l8918J9527A5436J06454d0894A57863b8915r6231
12437a25146H1292K29691a10779m163J8117d947n4324o3950j39499J1473J2083
12426b39164o7183B6320J12451j6433a38289f7184C84971a3564m5235A96794b64114
12414a94399A16267b5435k19238H5015a20037A22113h8121A86317d83552F035
12403a08638L0442r0040e1688o1186K3930r222d1021A51137a85027l3945R4947
12392a24025A12731c09856a4775C7151d7960E510i8131j41065e0916b187E4289
12380a42960D2144J0620J6237a49420c2311A1660M7767P8176a65574A71877i7090
12368C59555d8131D1698j2135Q9640h8310B33925a45557A00856J12294a95039
$$ plain form
12357 -69557 51328 276819 418126 142121 -150575 -84862 -109392 50200 -75334 -2083 248596
12345 358446 53808 -869 263515 -15097 107022 203090 -195862 220111 -18640 -1156 113215
12333 -65442 -24302 225336 100449 80199 -93245 -177910 132544 -8229 16951 47886 198697
12322 198697 151445 -161953 64288 19537 276186 21591 148619 72439 394794 184074
12311 97810 303096 8155 414690 124358 123976 488887 79554 5486 179830 254754 -213800
12299 107807 215621 26690 87097 17996 40597 167799 287542 268058 -255144 2920 8539
12288 8539 161580 215520 -6564 -151376 -334450 207518 112779 184750 289642 -174973 250711
12276 -99209 48619 1998 27318 -112919 237832 -34147 -186841 516358 276129 -20202 191762
$$ packed form
12357f9557E1328K25491J41307A42121a50575O5713k4530E0200g5334b083B48596
12345C58446E3808h69B63515a5097A07022R6068a95862B20111a8640a156A13215
12333f5442b4302B25336A00449k0250i3245q4665A32544h229A6951L0935J50811
12322A98697m7252a61953F4288A9537K56649B1591J27028G2439L22355A84074
12311I7810K05286H155M06535A24358l82L64911G9554E486J74344P4924b13800
12299A07807J07814B6690O0407A7996K2601J27202J19743j9484b55144B920N619
12288H539J53041N3940f564j44812j83074B07518r4739P1971J04892a74973B50711
12276i9209D8619A998K5320a12919B37832c4147j52694E16358k40229b0202A91762
$$ plain form
12264 66670 275442 75711 73482 15866 -204727 65553 -85297 418640 112933 432321 174876
12252 383489 126385 219185 159475 -130957 214252 195779 -6954 256777 27112 91913 284397
12241 284397 -27530 -368322 -86628 -326693 314340 -7102 290251 210707 393767 433034 217184
12230 217184 -24227 -158332 120182 62491 -153924 -78120 202240 166595 133370 34732 1665
12218 337824 295863 28816 116907 309792 41582 134578 -149621 347666 -82137 -22540 16366
12206 187915 -122764 28205 101380 299252 -262608 275539 162520 89854 123787 93579
12196 93579 282054 206206 -32003 240960 -307573 156162 -19723 -8905 78300 -55872 -20956
12184 181843 -3332 -197919 212455 216175 4531 279712 48327 147812 216259 -105481 505359
$$ packed form
12264F6670K08772G5711k229A5866b04727F5553h5297D18640A12933L19388A74876
12252C83489A26385R2800n9710a30957B14252j8473f954B56777B7112O4801J92484
12241B84397b7530l40792h6628k40065C14340g102B90251p9544J83060L9267k15850
12230B17184b4227j34105A20182n7691a53924P5804B02240l5645l3225C4732A665
12218C37824m1961B8816Q8091J92885D1582R2996a49621C47666h2137b2540A6366
12206A87915a22764B8205P3175J97872b62608B75539j13019p2666L3933l0208
12196I3579J88475p5848c2003B40960c07573A56162a9723h905G8300e5872b0956
12184A81843c332j94587B12455L720D531K75181D8327R9485O8447a05481E05359
$$ plain form
12172 151486 174762 -131889 164273 204333 357749 97096 -131708 357714 308126 -45739
12161 318691 119500 -8126 195065 125791 21922 156034 232989 92139 77761 224164 -124738
12149 68757 272484 190339 360343 69333 22079 69 -451032 12207 -51941 69066 52425 73080
12137 73080 -70530 -46100 -6969 70292 23032 -72690 230286 88932 21164 101451 40043 70482
12125 70482 7637 35697 40502 78917 -46779 327856 507466 -132299 -148619 -65249 264047
12113 21050 54001 567 -23749 203124 -98233 138247 337946 312829 30378 266294 183508
12102 183508 -15673 173370 226920 500312 76033 -270181 223777 103253 159470 256578
12092 256578 135631 321389 25404 135293 -189165 145348 -96037 108468 321612 -97713
$$ packed form
12172A51486K3276a31889A64273M0060J53416I7096a31708C57714m9588d5739
12161C18691A19500h126A95065o9274B1922J34112P6955I2139j4378J46403a24738
12149F8757K03727q2145J70004F9333B2079F9d51032A2207e1941F9066j6641K0655
12137G3080g0530K4430f969G0292B3032g2690B30286H8932B1164Q0287D0043L0439
12125G0482G637K8060M805L8415d6779C27856J79610a32299j6320f5249B64047
12113B1050L2951E67b3749B03124i8233A38247J99699k5117C0378K35916q2786
12102A83508a5673A73370N3550K73392G6033b70181B23777A03253N6217R7108
12092B56578j20947J85758B5404J09889a89165A45348i6037A08468K13144i7713
$$ plain form
12081 291741 339068 -60239 291483 34641 -329116 -227311 -89762 342093 102246 1361 232433
12070 232433 90835 95741 90538 121373 189166 178852 459840 114562 -7639 144427 -130731
12058 132654 30993 33630 9216 -115784 62463 36248 -5240 -260786 -109654 275814 -51102
12046 -12290 173525 -128331 141575 -320111 -285079 123878 186210 31486 -85542 -151859 291194
12034 77023 157808 -45627 -78435 252210 236918 229225 113682 -37151 -214215 80040 243848
12023 243848 75056 200264 -4700 -2528 228008 28656 103391 -83732 365372 114765 219654
12012 219654 -39564 -101399 113936 -422486 49287 -239167 -306901 60231 -71259 262216 -209146
12000 -61535 87629 283031 171412 -260574 302239 -23437 219281 59875 -40752 169831
$$ packed form
12081B91741M7327f0239B91483C4641c29116J01805h9762C42093A02246A361K31072
12070B32433I0835M906n203L0835O7793j0314K80988A14562g639A44427a30731
12058A32654C0993K637I216a15784F2463k6215e240k55546a09654B75814e1102
12046a2290A73525a28331A41575c20111L5032A23878O2332C1486h5542o6317B91194
12034G7023Q0785d5627l2808B52210j5292p693A13682c7151j77064H0040J63808
12023B43848G5056J25208d700K172B28008B8656P4735h3732C65372A14765J04889
12012B19654c9564o1835A13936d22486D9287b39167o7734F0231g1259B62216b09146
12000f1535H7629J95402j11619b60574C02239b3437B19281E9875d0752A69831
$$ plain form
11989 -31667 473963 300288 -80340 244166 -271956 -415724 -89441 -16887 154416 220121
11979 220121 29816 -72534 41723 -16379 -82740 8727 142487 268321 111243 -20281 193334
11967 119067 -254004 -120310 -12173 76917 139782 139158 171060 101430 -70221 -148332 -37337
11955 -4617 -74587 -147128 172707 127579 1194 32340 -15728 -472917 257362 -70582 -182560
11944 -182560 378133 185246 12052 335254 -80622 -51602 -318753 90916 1623 78399 -336677
11932 -185420 -176155 -217810 -25380 -93435 -172224 -129089 -50808 53887 127951 40372 66678 234932
11920 234932 -157252 -190875 57623 -119456 -234348 517057 -138426 -504391 341030 68719
11909 -106795 135879 -136481 53708 64301 42594 -108813 -224834 8193 -146790 141571
$$ packed form
11989c1667D73963j73675h0340B44166b71956j43768h9441a6887A54416O5705
11979B20121B9816g2534D1723a6379o6361H727J33760J25834A11243b0281A93334
11967A19067b54004a20310a2173G6917O2865o24L1902o9630g0221p8111c7337
11955d617o9970p2541A72707m5128A194L1146a5728m57189B57362g0582j11978
11944a82560C78133A85246A2052L23202h0622K9020k67151I0916A623P6776c36677
11932a85420R265m1655b5380o8055p8789M3135e0808E3887P4064D0372K6306J68254
11920B34932a57252l3623E7623a19456j14892E17057a38426l65965C41030F8719
11909a06795A35879a36481E3708J0593k1707a08813j16021H193a46790A41571
$$ plain form
11898 -47115 242863 -286378 -93415 90166 -100589 192808 29975 61889 -149745 -204809 -445275
11887 -445275 231498 -45576 -70380 -105411 -237774 -297010 -220389 124696 51313 121014 -109102
11875 -169486 77145 52650 -24513 9826 -278157 -110622 -200336 -178010 -183901 -325050 -124767
11863 -337473 81527 173493 78608 -240442 218199 -135893 414831 -220048 120070 164091
11853 164091 -309639 -315890 91920 92172 -315251 6689 64545 -37188 8558 -116169 51661 -229657
11840 125165 51116 97431 157149 193905 -66062 102551 3076 157366 -152080 171891 25437
11828 59179 29380 20467 -41795 -39184 63456 192933 51175 -21666 -223236 -116868 724 -74691
11815 121863 -112953 239075 -13623 63131 -188475 42787 -267555 -192305 78828 2133 -181065
$$ packed form
11898d7115B42863b86378i3415I0166a00589A92808B9975L1914a49745n5064k40466
11887d45275B31498d5576k4804l5031j32363n9236P6621A24696E1313O9701a09102
11875a69486G7145k4495b4513I826b78157a10622q9714K2326n891j41149a24767
11863c37473H1527R1966G8608b40442B18199a35893D14831b20048A20070M4021
11853A64091c09639o251I1920K52c15251F689N7856c7188H558a16169E1661b29657
11840A25165E1116M6315N9718L6756f6062A02551C076J54290a52080A71891B5437
11828E9179B9380q913d1795K611F3456J29477E1175b1666k01570J06368G24g4691
11815A21863a12953B39075a3623F3131a88475D2787b67555P5250G8828B133a81065
$$ plain form
11803 -165226 53791 -222942 -163193 109034 -199329 -29373 -61953 -129577 -16000 85854 -19227
11791 -181032 135143 -13303 -174859 -221657 -252913 200908 87110 116210 -130056 171545
11780 -38846 -215947 -26627 -26172 -162723 -177289 309898 108842 63843 212232 12609 224183
11769 224183 -85056 -147337 42554 -42073 153085 17013 15162 15483 -57440 47146 -218765 -9004
11756 187028 -196262 -233970 245770 41693 -110787 172252 -211435 106961 -231967 -24670
11745 253733 111917 -391702 -203743 -6954 -322736 -172890 843 -16689 -4812 173165 86852
11734 86852 -295191 -146 -249809 48957 -158503 105386 33945 -16370 272680 103820 145886
11723 145886 -75677 -121200 31193 187348 -291567 -21183 149004 36998 -147088 51792 222401
$$ packed form
11803a65226E3791b22942N9749A09034a99329b9373l2580o7624a6000H5854a9227
11791a81032A35143a3303j61556m6798l1256B00908H7110K9100a30056A71545
11780c8846j77101b6627M55j36551j4566C09898A08842m4999J48389A2609K11574
11769B24183h5056o2281D2554d2073A53085A7013j851L21e7440D7146b18765i004
11756A87028a96262l7708B45770D1693a10787A72252b11435A06961b31967b4670
11745B53733A11917c91702J87959f954l15782J49846H43a6689d812A73165q6313
11734H6852b95191a46k49663D8957a58503A05386C3945a6370B72680A03820M2066
11723A45886g5677m5523C1193J56155b91567b1183A49004C6998a47088E1792J70609
$$ plain form
11712 222401 -86784 56333 79975 -43675 94560 84720 146561 324997 115613 163064 226879
11701 226879 205731 19453 9499 77665 4338 -197479 -61951 190107 -47697 176313 -96811
11689 -96529 51932 -110926 1163 76313 -118952 -64522 21976 -176596 -39525 390083 -196017
11677 173349 72665 30842 235600 -253582 240187 65492 -281500 56495 -77319 45685 230540
11666 230540 -44625 34048 10116 -143851 23568 49191 40167 -153963 121377 231188 966
11654 262244 -1666 225043 24315 -256268 141167 -298757 288209 84510 -151376 -107104
11644 -107104 112938 38152 -238586 553859 183966 -133480 97934 73155 216784 -215344
11633 -80822 195053 -79727 462957 478181 -82931 145933 -11000 66634 -113084 167740 -126230
$$ packed form
11712B22401h6784E6333K3642d3675I4560r840O1841J78436A15613M7451O3815
11701B26879k1148A9453I499O8166D338a97479f1951A90107d7697A76313i6811
11689i6529E1932a10926A163P5150a18952N4430B1976a76596c9525C90083a96017
11677A73349G2665C0842K04758b53582B40187F5492b81500E6495g7319D5685J84855
11666B30540d4625C4048A0116a43851B3568K5623r024a53963A21377J09811I66
11654B62244a666B25043B4315b56268A41167b98757B88209H4510a51376M4272
11644a07104A12938C8152b38586E53859A83966a33480I7934k4779J43629b15344
11633h0822A95053g9727D62957J5224h2931A45933a1000F6634a13084A67740a26230
$$ plain form
11621 119505 -144972 122206 -120445 -129636 464107 136882 -209377 102770 39728 -14105
11610 -177953 160931 148137 -20984 10248 129605 235363 216011 -205360 130470 -110731
11599 252456 -241833 158249 -67732 144256 142113 -123982 -48932 -98626 212035 93504 18685
11587 -2878 237399 96355 197945 122915 -90538 -13552 319096 158987 -173561 282944 -217271
11575 -208738 237962 255059 186248 314987 -82891 204788 -56258 -150115 319121 365309 70910
11563 -191948 154047 -54327 204265 -18130 226827 31972 134565 212923 -258309 -219279
11553 -219279 297610 -229771 5440 249993 -8664 -3941 163083 119623 69875 187267 -292123
11541 82220 55248 222541 -25356 171422 -18259 -29063 80982 11310 76566 -172514 -112357
$$ packed form
11621A19505a44972A22206a20445r191D64107A36882b09377A02770C9728a4105
11610a77953A60931j2794b0984A0248J19357J05758j9352b05360A30470a10731
11599B52456b41833A58249f7732A44256k143a23982d8932m9694B12035I3504A8685
11587b878B37399I6355J01590p5030i0538a3552C19096A58987a73561B82944b17271
11575b08738B37962J7097o8811J28739h2891B04788e6258r3857C19121M6188G0910
11563a91948A54047e4327B04265a8130B26827C1972J02593P8358b58309L9030
11553b19279B97610b29771E440K44553h664c941A63083m3460m9748J17392b92123
11541H2220k6972J67293b5356A71422a8259j0804H0982A1310O5256a72514O0157
$$ plain form
11530 -112357 71608 280210 -121060 18995 -87034 98261 274759 -21983 -65013 132821 144937
11519 144937 -127484 125240 192693 239460 -3751 135922 -238548 -115152 -10470 -252207
11509 -252207 119783 -92289 167731 -255314 -253531 -56346 193266 79105 -279504 194187
11498 23057 14940 -41774 157908 -18753 -6907 38812 117475 134669 62069 36198 -19088 -25416
11486 -25416 255034 -146339 347468 -262346 138195 113675 -182098 -284857 -54335 93909
11475 -226832 24215 -121023 90979 -320318 -239342 25561 301215 -98381 -57817 353469 -20503
11463 205314 -105705 30870 140391 291979 60224 -140484 52448 102580 529353 265345
11453 265345 200049 -100474 369629 -66040 102868 181188 -144727 198877 10285 202616
$$ packed form
11530a12357G1608K08602a21060A8995h7034I8261J76498b1983m3030A32821J2116
11519A44937a27484A25240O7453M6767c751A35922b38548a15152a0470k41737
11509b52207A19783i2289A67731b55314J783e6346A93266G9105b79504A94187
11498B3057q117d1774A57908a8753f907C8812P8663J7194F2069k5871a9088o328
11486b5416B55034a46339C47468b62346A38195k4520a82098j02759e4335I3909
11475b26832B4215a21023I0979c20318Q0976B5561K75654i8381M0564C53469b0503
11463B05314a05705C0870J09521J51588F0224a40484E2448N0132M26773k64008
11453B65345o5296a00474C69629f6040A02868P8320a44727A98877A0285J92331
$$ plain form
11443 202616 252901 -191075 292792 50430 51832 -68415 334481 38614 21343 157355 16767
11431 175604 21763 -245143 95492 -315346 23515 319893 305377 127199 92824 111689 -181357
11419 98099 -31892 109971 -231693 -1072 19101 -69631 -18811 -201157 -142634 -249500 158066
11407 -54147 -99915 21376 224486 117751 -360774 -79797 -33318 -204898 -21133 38367 -202375
11395 232300 -62146 -144212 -34764 -234312 8346 -26620 125732 346236 -221852 267572 224961
11384 224961 -45716 157590 -115292 292159 9843 203745 299763 144684 -68990 24643 -324470
11372 -70996 139098 141987 62286 286777 291941 92047 398165 -107310 -169936 -112157 75375
11360 -174963 140144 33339 89922 -298156 12427 19832 -47129 177720 -210213 -162609 -48085
$$ packed form
11443B02616N0285a91075B92792E0430J402f8415C34481C8614j7271J36012A6767
11431A75604B1763b45143I5492c15346B3515K96378j4516A27199l4375J8865a81357
11419I8099c1892A09971b31693a072A9101f9631a8811j82346N8523j06866A58066
11407e4147m5768B1376K03110j06735c60774g9797c3318j71580b1133C8367b02375
11395B32300f2146q2066c4764j99548H346b6620A25732K20504b21852B67572m2611
11384B24961d5716A57590a15292B92159I843J93902R6018A44684f8990B4643c24470
11372g0996A39098K889F2286K24491N164I2047L06118a07310o2626N7779G5375
11360a74963A40144C3339N6583b98156A2427P405d7129A77720b10213M7604d8085
$$ plain form
11348 116072 -118391 -52418 47471 309826 275594 -141967 84564 147808 -377531 -185597
11337 -171703 -124918 -328264 193856 -259280 151450 117380 -210524 105294 -246408 -337023
11327 -337023 77393 260948 154361 51708 30631 82606 44643 -80584 9402 -147398 55763
11315 102668 122119 111312 145413 -174636 66208 216886 50658 121617 47137 -223812 -342000
11304 -342000 185480 -239157 97463 41516 -131827 -183241 -173377 -74730 -93752 157457 -28906
11292 -146875 -71169 164065 246510 -74332 2307 180328 -40885 -162609 -111079 -120850 -111278
11281 -111278 -33888 138827 16478 176662 -175193 -7077 146405 -213136 140582 147457 -300876
11269 42438 -272616 215042 67206 -375063 65926 -474900 165305 55890 224693 8772 -40144
$$ packed form
11348A16072a18391e2418D7471K62355l4232a41967H4564O3244c77531a85597
11337a71703M6785k03346A93856b59280A51450l4070b10524A05294b46408r0615
11327c37023G7393J83555j06587E1708k1077N1975l7963h0584I402a47398E5763
11315A02668J9451j0807L4101a74636F6208J50678E0658P0959D7137b23812j18188
11304c42000A85480b39157I7463D1516a31827n1414R864g4730j9022A57457b8906
11292a46875g1169A64065Q2445g4332B307J78021d0885j21724N1530r771R572
11281a11278c3888A38827A6478J60184a75193g077A46405b13136A40582O875c00876
11269D2438b72616B15042F7206c75063F5926d74900A65305E5890J68803H772d0144
$$ plain form
11257 -257388 58332 -444903 -55436 -310034 -7182 24757 -111917 -15055 -46738 -185228 -421586
11246 -421586 135727 -190197 -254826 112529 -114349 112223 1365 -196410 382924 -148733
11235 -57468 142430 -47585 190552 -166257 -78242 309741 -369053 169327 107692 -132068
11224 -237569 -434341 30857 69848 71487 103872 -106571 71654 -269254 28955 285939 -242796
11212 112117 -365617 17970 -183108 128993 77673 9448 442074 -68674 -179747 199810
11201 -93582 -441046 5984 75056 -166023 247407 -20059 49961 66746 -89178 -237266 -119739
11190 -119739 20960 -6054 168295 134974 221202 159602 16688 177315 -115219 -382186 -134546
11178 -24131 -254352 75526 -306086 -360593 1532 53318 -202153 -195286 -107224 -226241 -325452
$$ packed form
11257b57388E8332d44903e5436k54598g182B4757a11917a5055l1683j38490k36358
11246d21586A35727a90197o4629A12529a14349A12223A365a96410C82924a48733
11235e7468A42430d7585A90552a66257g8242C09741c69053A69327o1635a32068
11224b37569j96772C0857L8991J639L2385a06571G1654b69254B8955K56984b42796
11212A12117c65617A7970a83108A28993n1320I448M32626f8674j11073A99810
11201i3582l47464E984O9072a66023B47407b0059D9961J6785h9178j48088J17527
11190a19739B0960f054A68295l3321Q6228o1600A6688J60627a15219k66967a34546
11178b4131k30221G5526c06086n4507A532N1786b02153O867Q8062j19017r9211
$$ plain form
11167 -325452 -240826 -384596 121123 -202764 44130 -271494 21966 -190725 -109827 44352
11156 -283825 -3928 -48864 -11800 -211223 -131139 11189 -189369 25274 -207728 249202 -115788
11144 115043 110030 -18143 164388 -85229 2348 -4002 -175736 -305973 -27843 -182060 -89064
11132 -112251 -37045 -445470 86485 67820 103945 -26236 -183045 -221512 -83378 -111039 -157966
11121 -157966 75708 -57921 34749 -325168 -192930 222586 173582 16340 -234238 -24329 156016
11109 -28173 246115 86623 28722 142567 260996 -122565 -183158 193898 219939 85830 -64761
11097 83536 130792 235197 -164303 -105767 -221558 217234 -203823 200590 234095 205264
11087 205264 46823 -78159 -91136 140531 850 134928 97651 244890 382308 -11800 -26444
$$ packed form
11167c25452Q4626j43770A21123b02764D4130b71494B1966a90725Q0898D4352
11156b83825c928m4936a1800j99423Q0084A1189a89369B5274b07728B49202a15788
11144A15043n013a8143A64388h5229B348d002j71734j30237b7843j54217h9064
11132a12251c7045m08425H6485j8665L6125b6236j56809l8467h3378k7661m6927
11121a57966G5708e7921C4749c25168J32238B22586m9004A6340b34238b4329A56016
11109b8173B46115H6623B8722J13845J18429a22565o0593A93898K6041H5830f4761
11097H3536M7256J04405a64303N8536j15791B17234b03823B00590L3505k8831
11087B05264D6823g8159j2977A40531H50J34078l7277J47239J37418a1800j4644
$$ plain form
11076 -26444 154180 96169 -275533 251151 -158648 -20806 -40194 -5484 -39234 365057 245195
11065 245195 180146 -237919 -60116 458770 429405 95845 132318 248188 -95400 325538 214773
11054 214773 93137 -27086 325140 82928 254737 145321 200255 253416 345441 145995 604274
11043 604274 306880 720805 414984 259873 518369 622554 516723 665253 365152 566137
11033 566137 489155 391460 578097 351647 494812 267007 391789 927984 589687 815466
11023 815466 793729 563643 590413 633630 378463 302703 472776 455747 694782 702431 442712
11012 442712 455995 500194 532394 445189 636001 437350 471548 675067 665791 410995 375407
11001 375407 588700 590391 679626 489866 377934 450477 393934 451614 271736 563485 476384
$$ packed form
11076b6444A54180n8011b75533B51151a58648b0806j9388e484l3750C65057j19862
11065B45195o5049b37919f0116D58770k9365I5845L6473J15870i5400C25538j10765
11054B14773I3137b7086C25140H2928J71809j09416N4934N3161R2025A45995M58279
11043F04274k97394M13925l05821j55111K58496J04185j05831J48530l00101K00985
11033E66137p6982r7695J86637k26450J43165k27805J24782N36195l38297K25779
11023H15466k1737k30086K6770M3217k55167p5760J70073j7029K39035P649k59719
11012D42712J3283M4199L2200q7205J90812j98651L4198K03519r276k54796l5588
11001C75407K13293J691Q9235j89760j11932P2543n6543N7680j79878K91749q7101
$$ plain form
10990 476384 519065 415095 950659 589102 616210 768464 552175 717125 605919 790620
10980 790620 418267 305816 210599 463936 362667 282719 482556 460712 529882 837679
10970 837679 727185 781610 522965 612740 744703 538092 417678 736990 1158701 655270
10960 655270 1242039 1137285 1419385 1335416 1911730 1620414 1665093 1954302 1978165 2305095
10950 2305095 2197905 2090716 1876383 1667254 1514474 1348350 1690709 1485729 1347945
10941 1347945 1204049 1406744 1429182 1259431 1824488 1424921 1553036 1081384 1026326 973556
10931 973556 902196 886001 521612 547872 641535 427375 438406 332388 318060 -9292 153702
10919 69604 73149 162111 133249 468263 250092 331166 -30159 -78763 120481 -57567 -72030
$$ packed form
10990D76384M2681j03970N35564l61557K7108J52254k16289J64950j11206J84701
10980G90620l72353j12451r5217K53337j01269p9948J99837k1844O9170L07797
10970H37679j10494N4425k58645Q9775J31963k06611j20414L19312M21711n03431
10960F55270N86769j04754K82100q3969N76314k91316M4679K89209K3863L26930
10950B305095j07190j07189k14333k09129j52780j66124L42359k04980j37784
10941A347945j43896K02695K2438j69751N65057l99567J28115m71652n5058n2770
10931I73556p1360j6195l64389K6260R3663k14160J1031j06018j4328i292A53702
10919F9604L545Q8962k8862L35014k18171Q1074c0159m8604A20481e7567j4463
$$ plain form
10908 -72030 -3570 -68258 4929 -137004 128704 -72057 10939 147514 105228 487 132850 125965
10896 125965 -109818 -231539 -205249 13629 27102 -105725 -161188 143135 -32348 74747 -96523
10884 31790 -292048 -231059 -70657 -87543 -90919 -292420 822 14799 119539 119822 116980 109191
10872 109191 -177667 -86270 -48855 -198563 -66526 -48722 -256671 74869 125540 363148 22483
10860 -178203 -19100 -221706 69642 -241893 -290718 54274 -116454 -2014 188499 -86946 79665
10848 -389685 -94739 -120464 -111985 303932 -155642 -70532 232438 204923 -40629 279609 -261196
10836 51353 -99553 -118930 106338 20813 -205278 144932 245030 56082 66673 77748 331908
10825 331908 -31313 -153790 -461815 -26859 158844 43264 180049 -297953 -15077 251522
$$ packed form
10908g2030c570o4688D929a37004A28704g2057A0939J36575m2286D87J32363o885
10896A25965a09818j21721K6290A3629J3473a05725n5463A43135c2348G4747i6523
10884C1790b92048O0989g0657j6886l376k01501H22J3977J04740K83k842p789
10872A09191a77667h6270L7415j49708f6526J7804k07949G4869N0671K37608B2483
10860a78203a9100k02606F9642b41893m8825E4274a16454b014A88499h6946G9665
10848c89685i4739k5725Q479C03932a55642g0532B32438k7515d0629B79609b61196
10836E1353i9553j9377A06338B0813b05278A44932J00098E6082J0591J1075K54160
10825C31908c1313j22477l08025b6859A58844D3264J36785b97953a5077B51522
$$ plain form
10814 67898 -219181 -5129 -225947 82890 254393 326888 351356 34823 -22649 -73747 -14587
10802 -235455 -61276 -271986 -32712 30695 -341000 69465 103736 -130862 299844 -234487
10791 -283712 -24031 27484 212152 87457 -376876 36660 -96072 43307 -144124 127575 38807
10779 -109726 172963 -194678 -399286 302875 -138846 -99246 280363 -47902 87377 65872
10769 65872 -48501 200429 45609 287805 -273980 -281754 -224520 302748 45717 280226 -243930
10757 108641 -34647 -296443 -135860 -162247 -239244 254222 10267 -247311 -21050 -64341 -125205
10746 -125205 -300537 140826 -126451 -167119 -111093 -14956 -374617 -148155 138146 -35366
10735 79923 31854 47056 -330035 69746 39112 185395 -136536 -80602 -74260 -108534 152954
$$ packed form
10814F7898b19181e129k20818H2890J71503P2495K4468C4823b2649n1098a4587
10802b35455f1276k10710c2712C0695c41000F9465L4271a30862B99844b34487
10791b83712b4031B7484J84668H7457c76876C6660i6072D3307a44124A27575C8807
10779a09726A72963a94678k04608C02875a38846L9600B80363d7902H7377k1505
10769F5872d8501B00429D5609K42196b73980p774N7234C02748D5717K34509b43930
10757A08641c4647k61796a35860k6387p6997B54222A0267b47311b1050m3291o0864
10746a25205j75332A40826a26451m0668N6026a4956l59661a48155A38146c5366
10735G9923C1854J5202c30035F9746l0634J46283a36536N5934O342l4274A52954
$$ plain form
10723 -157339 -573437 117920 4474 -16160 -226859 333 -156475 -433605 -175309 -21 25802
10711 -302322 -119328 199366 -350865 -66996 -203419 98997 -191361 -331916 1566 -247548
10700 -255264 231724 -482053 -132072 -34526 -181090 -99637 -179179 86241 -265808 97226
10689 26542 -221079 -224557 -179636 -15890 70221 -2404 91529 18196 300616 189574 -92354
10677 -63811 251262 -121314 -76050 -117351 -72182 -230544 137244 259786 -40245 -209024
10667 -209024 -90570 -57628 -303092 -246353 276047 -190926 93015 -16613 -157671 -55889 -304520
10656 -304520 103316 72433 -228126 92903 174643 81291 -101370 -84540 -110193 -95419 -284205
10645 -284205 -209776 -162865 -396055 19408 -295051 122990 117662 -180795 305787 37663 386949
$$ packed form
10723a57339m16098A17920D474a6160k10699C33a56475k77130a75309b1B5802
10711c02322a19328A99366c50865f6996j36423I8997a91361j40555A566b47548
10700b55264B31724d82053a32072c4526j46564Q1453p9542H6241b65808I7226
10689B6542b21079l478M4921a5890G0221b404I1529A8196K82420j11042i2354
10677f3811B51262a21314M5264m1301M5169j58362A37244J22542d0245j68779
10667b09024i0570L2942k45464N6739B76047a90926I3015a6613j41058e5889k48631
10656c04520A03316l0883b28126I2903Q1740H1291a01370J6830k5653J4774j88786
10645b84205P4429M6911k33190A9408b95051A22990n328a80795C05787C7663L49286
$$ plain form
10634 386949 -155770 -34362 -199182 -105744 -163588 -453438 -129311 130114 -183987 -17811
10623 -17420 -30281 -19632 49529 25477 -68294 122398 164357 -233711 -374967 -515553 -52483
10611 -79941 -215046 -37950 151682 -41516 -156908 134364 98915 -23839 -282903 -82612 -311424
10600 -311424 385683 161082 -270066 -194717 17531 -35011 -102031 -145095 -59164 -427590 -175687
10588 -161056 -180775 -9667 168157 68704 -296979 -309845 -43128 359439 -1502 -190587 -6088
10576 -94122 -169259 -116489 -111582 -106616 26938 157778 -123038 164852 -45229 235133 63186
10564 -83570 -155573 -130531 -235248 117785 106824 -145154 -16171 81880 -33003 5226 187317
10553 187317 5858 -36345 44470 16893 149025 -35282 155572 330 -39009 -19447 -101439 -285158
$$ packed form
10634C86949a55770c4362j64820R3438n7844k89850a29311A30114a83987a7811
10623a7420j2861J0649D9529k4052f8294A22398M1959b33711j41256j40586e2483
10611g9941j35105c7950A51682d1516j15392A34364l5449b3839k59064h2612k28812
10600c11424C85683A61082b70066P5349A7531c5011o7020m3064e9164l68426a75687
10588a61056j9719i667A68157F8704b96979j2866d3128C59439a502j89085f088
10576i4122p5137N2770M907M966B6938J30840a23038A64852d5229B35133F3186
10564h3570p2003K5042j04717A17785j0961a45154a6171H1880c3003E226J82091
10553A87317E858c6345D4470A6893J32132c5282A55572C30c9009a9447q1992j83719
$$ plain form
10541 -285158 185232 -65297 -146649 -358360 59400 -185970 54504 -316788 189754 -321161
10530 -52908 25830 -241369 292960 6621 -108762 262161 -55851 120191 -134081 -186584 5612
10518 179061 -9784 -76122 -11385 -207171 58735 -138605 -53558 -166304 264660 183082 -36093
10506 -38385 -45989 404622 -184063 198372 8102 269681 -200448 198882 188096 19885 -201239
10494 80893 -94140 91817 -357768 143992 -397 32468 41167 264656 -193428 -241244 -62479
10482 -166924 -132321 71088 -193429 -121325 -261333 126976 8343 73204 245802 87260 -26046
10470 -51891 -64392 -109726 -148918 -66410 -187910 82021 -73106 152504 134697 315745 70764
10458 227095 379308 272979 69440 -42228 158672 265217 164845 42880 -179536 74 47557
$$ packed form
10541b85158A85232f5297q1352k11711E9400a85970E4504c16788A89754c21161
10530e2908B5830b41369B92960F621a08762B62161e5851A20191a34081n2503E612
10518A79061i784o6338a1385j95786E8735a38605e3558j12746B64660q1578c6093
10506c8385p604D04622a84063A98372H102K61579b00448A98882j0786A9885b01239
10494H0893i4140I1817c57768A43992c97C2468Q699K23489a93428m7816f2479
10482a66924L4603G1088a93429P2104j40008A26976H343O4861J72598H7260b6046
10470e1891j2501m5334l9192f6410j21500H2021g3106A52504j7807J81048G0764
10458B27095J52213j06329F9440d2228A58672J06545j00372D2880a79536G4M7483
$$ plain form
10447 47557 38150 161491 -319482 70319 -77354 -181899 209472 -106634 306189 133856
10436 -55857 44797 255691 -245139 -79771 -82552 -635602 -78900 -107055 -97705 82569 -147685
10424 -149434 -189142 92974 -242652 -10949 -329015 -97501 -180320 -152970 -33947 111098 57543
10413 57543 -111881 -22069 277533 -152050 -92241 -108360 -253694 335062 -125490 -171600
10403 -171600 171085 53951 82296 -98114 -219065 -303509 -17002 -289970 116196 -189460
10392 27431 -191342 -217729 50073 -291372 -152515 -185022 187747 43833 -98025 -51385 88262
10380 -20000 -236487 154326 -83093 278950 17916 49867 127106 -87024 76275 -69266 -127049
10369 -127049 394840 58100 15902 -120695 67310 25165 126694 -172030 -123589 243352
$$ packed form
10447D7557r407J23341c19482G0319g7354j04545B09472a06634C06189A33856
10436e5857D4797K10894b45139g9771k781n53050g8900k8155R350H2569a47685
10424a49434l9708I2974b42652a0949l18066i7501q2819K7350c3947A11098n3555
10413E7543a11881b2069B77533a52050N9809j6119j45334C35062a25490m6110
10403a71600A71085E3951K8345i8114j20951q4444a7002k72968A16196a89460
10392B7431a91342k6387E0073b91372J38857l2507A87747D3833i8025M6640H8262
10380b0000k16487A54326h3093B78950A7916L1951P7239h7024G6275f9266n7783
10369a27049C94840E8100A5902a20695F7310B5165J01529a72030M8441B43352
$$ plain form
10358 287988 54369 93451 179763 172711 64093 -61190 479307 247114 473017 52044 255004
10347 255004 553973 357394 320887 119418 203475 157922 184657 273557 92968 46663 -43842
10335 443343 172662 190924 370257 373351 145367 303816 327343 81930 369965 -36774 78469
10323 345568 187852 497745 157743 322020 29707 22024 -30414 48991 27233 199571 151130
10312 151130 324243 66350 57410 203243 19963 36623 -8025 -129588 152034 110441 115501
10301 115501 223690 -20432 145595 -468932 123902 357631 46261 160248 -110884 228281
10290 -324456 -230028 47228 138427 78350 127355 102695 13193 -54932 365163 47988 -21903
10278 -100733 -142557 473880 -42065 -161183 -167936 4589 -216181 -26007 -266110 8155 -76990
$$ packed form
10358B87988E4369L9082Q6312p052F4093f1190D79307k32193K25903E2044K02960
10347B55004K98969j96579l6507A19418Q4057m5553K6735Q8900I2968m6305d3842
10335D43343A72662J8262J79333L094A45367J58449K3527H1930K88035c6774G8469
10323C45568j57716L09893A57743J64277B9707p683c0414D8991k1758J72338m8441
10312A51130J73113F6350q940J45833A9963J6660h025j21563A52034m1593N060
10301A15501J08189b0432A45595d68932A23902K33729D6261J13987a10884B28281
10290c24456R4428D7228R1199o0077M9005k4660A3193e4932C65163D7988b1903
10278a00733m1824D73880d2065j19118o753D589b16181b6007k40103H155g6990
$$ plain form
10266 -232029 173232 -215339 -184177 -452709 24772 -8471 -19028 -349165 -169692 -50346 -121405
10255 -121405 32025 762 -98838 -260954 -71987 169781 43823 107109 221572 132211 35740
10243 367347 130891 28384 -107061 -317709 313108 214004 3674 206544 243724 102096
10232 132861 -21476 125466 156158 136409 -46265 -77152 136523 -95967 -237174 170921 -96503
10220 -193676 -99546 -230017 -260781 -98389 106800 105707 23052 522992 -291984 152803 224891
10209 224891 -195679 -35509 52125 139944 -35663 44498 -304384 51421 -292496 20558 -44054
10197 -4803 -274268 -327493 -109009 54375 168183 -137229 29068 260099 -124955 -147285 -30420
10185 51507 -101513 198179 210091 186273 -41178 -639879 212318 23373 -15654 -58620 -66907
$$ packed form
10266b32029A73232b15339L1162k68532B4772h471j0557l30137a69692e0346p1059
10255a21405C2025G62i8838j62116g1987A69781D3823O3286J14463q9361C5740
10243C67347A30891B8384a07061k10648C13108r9104C674K02870L7180A02096
10232A32861b1476A25466L0692j9749d6265l0887A36523i5967j41207A70921i6503
10220a93676R4130j30471l0764i8389A06800j093B3052M99940b91984A52803P2088
10209B24891a95679c5509E2125Q7819c5663D4498c04384E1421b92496B0558d4054
10197d803k69465n3225a09009E4375J13808a37229B9068K31031a24955k2330c0420
10185E1507a01513A98179J1912k3818d1178n98701B12318B3373a5654m2966q287
$$ plain form
10174 -66907 145676 -149874 -262828 -108778 37225 -283913 27277 21156 -240895 111644
10163 -125195 -36762 -110229 -93294 -107458 -314139 -214039 21686 -40011 -271016 -171756 103695
10151 -61522 50632 -276193 -52871 -238965 -75463 149314 42568 -72769 149432 15056 93848
10140 93848 -69713 129303 -94210 -239192 5148 -151333 -227377 -390859 -92937 -439830 -100938
10128 -10726 -103393 48398 -112314 64796 14978 -203334 -244554 75128 -6744 79439 70011 -71983
10115 -191870 -131403 -327395 -324823 -519219 -312034 12943 -96724 40149 38655 -17076 -228008
10104 -228008 -27047 126487 130685 -229350 -121968 132174 65573 97918 -182602 15892 -335439
10092 362927 74304 35359 152618 140032 114615 -306251 -148472 -102108 12980 219576 -229276
$$ packed form
10174f6907A45676a49874j12954a08778C7225b83913B7277o121b40895A11644
10163a25195c6762p3467J6935j4164k06681J00100B1686d0011k31005R9260A03695
10151f1522E0632b76193e2871j86094g5463A49314D2568g2769A49432A5056P8792
10140I3848f9713A29303i4210j44982E148a51333p6044j63482i2937l46893a00938
10128a0726r2667D8398a12314F4796A4978b03334m1220G5128f744G9439r428g1983
10115a91870O0467j95992K572j94396K07185A2943i6724D0149j494a7076k10932
10104b28008b7047A26487M198b29350J07382A32174F5573L2345a82602A5892c35439
10092C62927G4304C5359J17259j2586k5417c06251a48472M6364A2980K06596b29276
$$ plain form
10080 89292 -23284 -166751 -208595 -95122 -49290 -145609 -481830 57037 236730 -300621 -62926
10068 248320 91455 -193045 16569 21406 282826 -234969 1852 -166824 -196807 -180191 -123113
10057 -123113 -17055 -278623 -324258 -109228 -236915 -251199 193274 185265 164018 15660 90344
10046 90344 149693 58214 -136280 9849 32491 -55459 -94430 -336098 -96390 60456 138485
10035 138485 200106 96960 78450 -11681 -118119 -49144 -216312 -337637 -112122 22384 -40552
10023 -297056 -365066 -310383 -351555 101855 -92203 24009 -193355 -25438 274744 33088 39777
10012 39777 -42413 -250784 -272124 -48173 17057 77087 -228679 -496333 43964 -308636 -3395
10000 -62744 27374 -31539 -39845 -146696 23161 -194032 42388 -232862 32830 101012 -206450
$$ packed form
10080H9292b3284j43467m1844i5122M5832r6319l36221E7037J79693c00621f2926
10068B48320I1455a93045A6569M837K61420b34969A852a66824k9983J6616N7078
10057a23113a7055k61568m5635a09228j27687j4284A93274q009k1247A5660P4684
10046I0344N9349E8214a36280I849K2642e5459l8971k41668i6390F0456P8029
10035A38485O1621I6960j8510a1681j06438d9144j67168j21325a12122B2384d0552
10023b97056o8010N4683m1172A01855i2203B4009a93355b5438B74744C3088O689
10012C9777d2413k08371k1340d8173A7057O0030b28679k67654D3964c08636c395
10000f2744B7374c1539q306j06851B3161a94032D2388b32862C2830O8182b06450
$$ plain form
9988 -56686 -151354 -387176 -64638 100696 -54410 55386 -269574 183870 -74640 13539 -156373
9976 25908 -96321 -27866 -12767 363895 -7979 51780 -165808 143829 -73940 -98136 91785
9964 -34345 -244198 -337432 118332 -5779 72149 -103452 163342 -73720 57650 -243717 241292
9952 112946 -316255 -233772 100134 -176690 338584 244026 298239 92802 -354275 -154773
9941 -77501 -171940 -257906 -317268 125744 -153291 -334584 256943 -220373 -174931 52152 -410023
9929 -88854 65960 1669 -125000 -155806 -196493 -206549 -129767 -61512 -35220 -247817 247198
9917 -129362 9013 39569 190994 203318 -249292 46720 13568 46497 -199263 349438 161703
9905 -55974 -245819 231901 -9812 197170 -281926 12225 63500 -100972 69150 4241 -241799
$$ packed form
9988e6686r4668k35822f4638A00696e4410E5386b69574A83870g4640A3539a56373
9976B5908i6321b7866a2767C63895g979E1780a65808A43829g3940k4196I1785
9964c4345k09853r3234A18332e779G2149a03452A63342g3720E7650b43717B41292
9952A12946c16255Q2483A00134a76690C38584r4558N4213I2802c54275a54773
9941g7501r4439q5966n9362A25744a53291j81293B56943b20373M5442E2152d10023
9929h8854F5960A669a25000l0806m0687j0056P6782f1512K6292k12597B47198
9917a29362I013L0556J51425J2324b49292D6720A3568L2929a99263C49438A61703
9905e5974j89845B31901i812A97170b81926A2225N1275a00972F9150D241b41799
$$ plain form
9893 20674 -78337 123222 327001 -102742 -316339 -368464 -266244 159426 -387625 14845
9882 -70466 -318681 287890 86552 -134893 -257358 20907 -69571 -419357 -24795 104235 -2402
9870 -136014 163373 18901 92815 17809 -15283 -179884 -190673 -299737 -245101 95864 140461
9859 140461 57671 -355496 -190407 -147237 -342571 142665 -52181 302181 -80530 9190 -117646
9847 -11677 307414 32448 -90169 190866 -262021 279078 -113622 -147264 -80917 -85630 -342334
9836 -342334 205117 -62226 210493 322423 5355 124903 -188611 165879 -236687 130667
9825 -30447 -43891 -113958 -119692 -95909 -181868 5379 -42433 -199036 -145419 -23169 -208130 -519996
9813 -519996 152082 140612 2368 -226666 3043 -153267 127081 -118464 225332 -25244 272154
$$ packed form
9893B0674g8337A23222K03779a02742k13597n2125J02220A59426c87625A4845
9882g0466k48215B87890H6552a34893j22465B0907f9571l49786b4795A04235b402
9870a36014A63373A8901P3914A7809a5283j64601j0789j09064N4636I5864M4597
9859A40461E7671c55496J65089M3170j95334A42665e2181C02181h0530I190a17646
9847a1677C07414C2448i0169A90866b62021B79078a13622l3642O6347m713k56704
9836c42334B05117f2226B10493J11930E355J19548a88611A65879b36687A30667
9825c0447j3444p0067n734K3783q5959E379d2433j56603N3617b3169j84961l11866
9813e19996A52082j1470B368b26666C043a53267A27081a18464B25332b5244B72154
$$ plain form
9801 -53343 -101004 270326 -338868 -63126 8162 -343827 123638 123219 16212 -352992 -216699
9790 -216699 -194411 -53843 -105805 112138 -333045 -69017 89302 50754 -57062 -268367 -204658
9779 -204658 134504 136045 -130219 172765 51222 -47327 141557 195076 -73676 -265337 3400
9767 -213426 -79640 17753 -91655 -127689 -113488 -228272 49365 -262630 194898 376640 -201210
9755 156438 -122905 -69378 2189 -32135 5955 -347807 89868 72368 57474 -35363 -76830 -294785
9743 -294785 -226647 18557 -261791 -216253 133551 39338 -23495 -399033 -378680 -202176 55122
9731 -297719 -156734 -73938 -111973 106007 -17047 -195201 -175335 -222449 56532 82580 -167817
9719 -268780 -253599 -343269 -74959 -171740 -274280 -194795 -99115 -202815 -522084 -4676 -34233
$$ packed form
9801e3343m7661B70326c38868f3126H162c43827A23638m19A6212c52992J36293
9790b16699K2288e3843n1962A12138c33045f9017H9302l8548e7062k11305O3709
9779b04658A34504J541a30219A72765E1222d7327A41557N3519g3676j91661C400
9767b13426g9640A7753i1655l6034J4201j14784D9365b62630A94898J81742b01210
9755A56438a22905N3527B189c2135E955c47807H9868j7500j4894c5363m1467k17955
9743b94785O8138A8557b61791M5538A33551C9338b3495l75538K0353J76504E5122
9731b97719J40985g3938l8035A06007a7047j78154J9866m7114E6532K6048a67817
9719b68780J5181q9670g4959r6781j02540P9485R5680j03700l19269d676k9557
$$ plain form
9708 -34233 -171648 95871 305236 76572 -40500 269830 -96169 -41048 -71164 -192070 -195005
9697 -195005 -223075 -15647 -107589 14240 100537 -219598 58514 -28371 359491 -52056 -68360
9686 -68360 155258 234557 32816 -42003 71508 109378 -286293 101985 -182497 -114494 -134204
9675 -134204 -128410 -277090 -224085 -62773 297830 190172 -86381 -262757 -204032 -119323 -124551
9664 -124551 -12199 -30495 157108 207470 -310864 150959 97397 -78575 -165827 -114331 -408438
9653 -408438 -95382 -297721 45225 -259379 52613 -150961 50665 -231249 3455 -230646 188221
9641 -321076 -91069 140305 -53423 -161867 -315623 -291160 41317 -259933 147155 177123 -82486
9629 -252647 -162971 -214245 110228 75703 -28118 -143154 94195 -215972 -38763 -104117 104336
$$ packed form
9708c4233j37415I5871K09365G6572d0500B69830i6169d1048l0116j20906k935
9697a95005k8070a5647r1942A4240Q6297b19598E8514b8371C59491e2056j6304
9686f8360A55258P9299C2816d2003G1508L7870b86293A01985a82497O8003j9710
9675a34204N794j48680N3005f2773B97830j07658h6381j76376N8725Q4709n228
9664a24551a2199j8296A57108N0362c10864A50959n3562g8575q7252N1496k94107
9653d08438i5382k02339D5225b59379E2613a50961E0665b31249C455b30646A88221
9641c21076i1069A40305e3423j08444j53756K4463D1317b59933A47155K9968h2486
9629b52647Q9676n1274A10228l4525b8118j15036I4195b15972c8763o5354A04336
$$ plain form
9617 -97600 -37851 -25400 122286 252852 -143936 -209686 -96627 -113645 155815 -15719 -286652
9606 -286652 -77782 111037 -142751 -199653 42383 -155875 -277563 52934 -386 -95462 -163170
9595 -163170 -235533 114455 -231203 -13075 -130646 -51167 165696 -37756 443858 -105227
9584 -85125 254221 -106856 -286018 186056 42533 262068 -103403 18694 162331 -412509
9573 265111 128894 -257822 63221 -51138 66771 160709 24674 -180059 -61325 -37022 -195527
9562 -195527 19870 -196850 53539 188780 -22749 109235 -167416 -147027 -223013 -418186 445432
9550 -59563 267677 -349508 -168303 -121448 -72279 -28253 -164585 -171295 -30962 -113412 67833
9538 91007 -182630 82644 -96315 -217175 -67347 -59103 -24535 -16001 -15193 185405 -46153 -104964
$$ packed form
9617i7600c7851J2451A22286J30566a43936o5750i6627j7018A55815a5719k70933
9606b86652g7782A11037a42751n6902D2383a55875j21688E2934c86r5076o7708
9595a63170p2363A14455b31203a3075j17571e1167A65696c7756D43858a05227
9584h5125B54221a06856j79162A86056D2533K19535a03403A8694J43637d12509
9573B65111A28894b57822F3221e1138F6771R3938B4674a80059f1325K4303j58505
9562a95527A9870a96850E3539J35241b2749A09235a67416K0389p5986j95173D45432
9550e9563B67677c49508a68303M6855M9169b8253j36332o710c0962q2450F7833
9538I1007a82630H2644i6315j20860f7347Q244b4535Q534Q08A85405d6153n8811
$$ plain form
9526 -104964 -64202 -202329 -5010 -225065 -93208 -239250 143185 91777 -80337 -21746 42800
9514 -11913 -114321 -96655 -216952 -201611 230899 -194461 -104785 -388470 -260669 102637
9503 19198 22592 -44609 230045 -130163 241351 7569 -20624 87682 -274938 -77818 -189167
9492 -189167 -69153 -63253 -160627 222857 35863 -137040 -135564 -28493 31739 -469900 -48322
9480 99014 82063 -68125 -50467 -86434 -219696 -190511 181839 69651 16330 -237631 -125513
9469 -125513 -304266 48324 -43489 -128499 173521 -374759 -139222 -292946 -77315 -341803
9459 -341803 108716 114833 79478 151646 197488 -11926 -190244 -376264 79599 -287996 157346
9447 84472 -85348 31912 -118541 -51907 -130900 -73965 -71305 -117427 -148118 -118851 -173279 -109606
$$ packed form
9526a04964M0762j38127e010k20055i3208j46042A43185n1408h0337b1746D2800
9514a1913j02408J7666j20297J5341B30899a94461Q9676k83685J27801A02637
9503A9198L394d4609B30045a30163B41351G569b0624H7682b74938g7818j11349
9492a89167f9153N900r7374B22857C5863a37040J476b8493C1739d69900d8322
9480I9014j6951f8125J7658l5967j33262K9185A81839F9651A6330b37631J12118
9469a25513j78753D8324d3489q5010A73521c74759a39222j53724g7315k64488
9459c41803A08716O117l5355P2168M5842a1926j78318j86020G9599b87996A57346
9447H4472h5348C1912a18541e1907p8993N6935K660m6122l0691K9267n4428O3673
$$ plain form
9435 -109606 -223988 -196046 -129548 -40164 -219280 -97749 -316340 -234591 -47516 262702 168945
9424 168945 153805 -200374 149299 -290378 -380092 -53560 20348 92553 -31919 -242502 -100594
9412 -195545 -204696 -22669 -161470 -40625 -102861 38499 38789 -375189 -3386 36990 100396 -53676
9399 -131082 158497 -4213 -81852 -31663 -141488 -201934 -81436 -108326 23521 54173 -75982
9387 -183524 109403 -42439 -103055 -191766 -190800 34783 -280556 -192961 -184092 -111810 269581 200490
9375 200490 53536 -255776 119812 -83443 190320 -574949 -32590 -152495 -138841 -100624 312598
9363 26846 117384 3879 -85404 131903 -218542 408074 93973 -123514 -158977 -199247 -174697
9352 -174697 -85022 -170431 6534 -162520 -6178 -164820 -152797 93162 -187961 -282266 -54537
$$ packed form
9435a09606j14382K7942O6498d0164j79116i7749k18591Q1749d7516B62702r3757
9424A68945j5140b00374A49299b90378q9714e3560B0348P2205c1919k10583a00594
9412a95545r151b2669j38801d0625o2236C8499K90c75189c386C6990O3406e3676
9399a31082A58497d213p7639c1663j09825o0446h1436k6890B3521L0652g5982
9387a83524A09403d2439o0616q8711R66C4783b80556Q7595Q869P2282B69581o9091
9375B00490E3536b55776A19812h3443A90320e74949c2590j19905J3654L8217C12598
9363B6846R0538C879h5404A31903b18542D08074I3973a23514l5463m0270K4550
9352a74697h5022q5409F534a62520f178j58642J2023I3162a87961r4305e4537
$$ plain form
9340 104574 -42727 -123067 183982 -8810 -167677 9513 -205734 136903 -137312 -176740 -151565
9329 -151565 35425 -35466 -4477 -119118 -154893 168925 -227094 -47632 -124819 -255503 -194786
9318 -194786 -188930 65057 -175332 146065 16433 -153194 242960 -8826 -409932 118847 29144
9306 155720 104489 -512767 -265583 -216832 173602 105084 165150 -81354 89245 -105349 -205720
9295 -205720 -203307 -451042 -98595 -110204 -274080 258691 -294059 -63924 -69156 -120436 -114104
9284 -114104 -472060 -242704 -91580 463611 25128 127971 -200923 -229952 -229520 -62356 -82034
9273 -82034 -14152 -192778 156398 -39813 -126575 82751 -159808 -8102 258299 -371365 -140703
9261 209034 -21946 -464891 238818 -267241 126539 -215183 -82160 -292555 -223106 -45086
$$ packed form
9340A04574d2727q0340A83982h810j58867I513b05734A36903a37312l9428K5175
9329a51565C5425c5466d477j14641l5775A68925b27094d7632p7187j30684O0717
9318a94786N856F5057a75332A46065A6433a53194B42960h826m01106A18847B9144
9306A55720n1231e12767K47184M8751A73602o8518O0066h1354H9245a05349j00371
9295b05720K413k47735i8595j1609j63876B58691b94059f3924n232n1280O332
9284a14104l57956K29356i1580D63611B5128J02843b00923k9029M32f2356j9678
9273h2034a4152j78626A56398c9813q6762H2751a59808h102B58299c71365a40703
9261B09034b1946m42945B38818b67241A26539b15183h2160k10395O9449d5086
$$ plain form
9250 232871 10320 539 -71279 58450 266240 -152297 56310 1593 -42732 -227869 214113
9238 17700 -2023 60226 34502 33306 -247827 32123 -42283 125623 -102255 293687 -84928
9226 -314345 242971 -163107 -195435 -197203 -425827 85761 -96267 -179957 -80710 -339631 250666
9214 83042 -267965 48099 -327250 351660 -81776 79853 -87388 -166450 18332 180638 -66601
9202 264308 86294 -300661 111653 57480 85781 -412541 178994 -155102 222094 -324128
9191 -128940 48028 144620 -9307 -93116 -671046 -28590 -7053 -62615 -20663 116678 140364 -74913
9178 34256 -119343 -192268 7829 -145774 -6192 111035 -267204 -176568 -237574 -201388 -321961
9167 -321961 -223536 -29423 -151594 -1992 -253999 -94371 291153 -45815 -98386 143756 -52072
$$ packed form
9250B32871A0320E39g1279E8450K07790a52297E6310A593d2732j85137B14113
9238A7700b023F0226k5724j196b47827C2123d2283A25623a02255B93687h4928
9226c14345B42971a63107l2328j768k28624H5761i6267q3690h0710k58921B50666
9214H3042b67965D8099c27250C51660h1776G9853h7388p9062A8332J62306f6601
9202B64308H6294c00661A11653n4173K8301d12541A78994a55102B22094c24128
9191a28940D8028R6592i307q3809n77930b8590g053n5562b0663A16678K3686g4913
9178C4256a19343p2925G829a45774f192A11035b67204R0636o1006L6186j20573
9167c21961R8425b9423j22171a992k52007i4371B91153d5815n2571A43756e2072
$$ plain form
9155 99495 -224759 49111 -101294 -289351 -237962 285504 81165 -97550 -156154 -169860 -417736
9144 -417736 -153220 -97575 430955 -141000 -63511 -396289 53898 -1079 -168809 -40643 217552
9132 241498 317244 -193771 -141431 36808 -226110 32779 -65366 134177 -182183 -143352 -287757
9121 -287757 -68138 -104941 62299 443311 51375 -203516 -477061 112656 12552 -100242 285663
9109 -257356 -165355 243801 -261999 -141558 75619 -199628 -161173 130778 -108770 207775
9098 -7388 -4080 -206626 -274320 -32880 251515 134711 -310145 101597 -179970 -78129 -288461
9087 -288461 14178 8831 154387 -314683 -25047 56897 292921 14120 124457 115445 49317
9075 230360 189705 -46237 -121551 78604 -215002 -10410 -252859 -50792 -256722 -55873 -401365
$$ packed form
9155I9495b24759D9111a01294j88057N1389B85504H1165i7550n8604j3706k47876
9144d17736a53220N5645D30955a41000f3511l32778E3898a079j67730d0643B17552
9132B41498P5746a93771N2340C6808b26110C2779f5366A34177a82183L8831j44405
9121b87757f8138l6803F2299L81012E1375b03516k73545A12656A2552a00242B85663
9109b57356R2001B43801b61999J20441G5619a99628L8455A30778a08770B07775
9098g388L308k02546o7694c2880B51515j16804c10145A01597a79970g8129k10332
9087b88461A4178n347J45556c14683b5047E6897K36024A4120J10337r012D9317
9075B30360m0655d6237p5314G8604b15002a0410k42449e0792k05930e5873l45492
$$ plain form
9064 -401365 -350676 284242 103589 268211 -284985 -176552 202235 -192223 -89534 -147483
9054 -147483 -328896 246213 106762 -96175 92426 297497 -196716 -88035 -15724 48068 -204008
9042 -58669 -121584 11012 -737 -198302 -251554 -119734 -335761 -301650 -79657 -164267 -221000 -118285
9030 -118285 91066 -196691 250208 14970 174523 -14922 -126453 -143356 -97170 -227429 -227661
9019 -227661 -52973 -71735 -361609 -47423 26817 -123024 100550 -138119 -153678 137522 -67715
9007 -631841 -53499 -631217 -37417 -242971 -237257 -137504 -37833 -36069 50775 12581 -173232
8995 241503 150887 -83387 -232224 -12617 -324360 147003 -13132 220051 -70474 -120587 235963
8983 -165062 151744 -66801 -73865 36026 -403045 73737 -70085 -376383 -98131 -67840 -136379
$$ packed form
9064d01365N0689B84242A03589J64622b84985J08433B02235a92223h9534n7949
9054a47483j81413B46213A06762i6175I2426K05071a96716h8035a5724D8068b04008
9042e8669o2915A1012g37j97565n3252a19734k16027L4111g9657q4610n6733J02715
9030a18285I1066a96691B50208A4970J59553a4922j11531j6903M6186j30259k32
9019b27661e2973j8762k89874d7423B6817a23024A00550a38119j5559A37522f7715
9007f31841e3499n77718c7417k05554N714R9753c7833J764E0775A2581a73232
8995B41503r0616h3387j48837a2617l11743A47003a3132B20051g0474n0113B35963
8983a65062A51744f6801p064C6026d03045G3737g0085l06298i8131L0291o8539
$$ plain form
8972 -136379 -17959 -205798 -6190 -5972 47776 -268013 -264962 40819 -157683 -179431 -58868 4361
8959 -41246 16761 28345 -166051 -338543 -276791 30494 13456 57833 138701 211180 -253679
8947 -127807 -218399 -195972 200849 -183892 131826 -138660 -17292 -169687 -144379 -26450 180800
8935 177868 -273139 49348 -127674 131289 65056 -38279 -210657 -216955 -36785 160551 -235547
8923 239368 -158946 -77998 -131713 38264 -209859 -94827 91130 194294 208134 -8629 -30534
8912 -30534 -165076 81930 202026 432077 93817 254263 621772 1257428 2310598 4769028
8902 4769028 5015725 2285990 1407844 584242 483897 550421 180484 -30281 129100 187550
8892 187550 338947 417645 14912 20368 -173683 278353 49532 41384 97546 -179883 -1334
$$ packed form
8972a36379a7959j87839f190K18D7776b68013L051D0819a57683k1748e8868D361
8959d1246A6761J1584a66051j72492O1752C0494A3456M4377Q0868P2479b53679
8947a27807r0592K2427B00849a83892A31826a38660a7292j52395K5308b6450A80800
8935A77868b73139D9348a27674A31289F5056c8279j72378o298c6785A60551b35547
8923B39368a58946g7998n3715C8264b09859i4827I1130J03164J3840h629k1905
8912c0534j34542H1930J20096K30051I3817J60446L67509O35656J053170K458430
8902D769028K46697B285990q78146E84242j00345O6524A80484c0281A29100N8450
8892A87550J51397P8698A4912N456a73683B78353D9532q148N6162a79883a334
$$ plain form
8880 88277 291226 -224795 180757 -233450 40405 -313447 -217859 -39470 -235158 -180499 -141687
8869 -141687 -317570 -100336 -219570 33834 -58926 -287440 -39989 -411894 139977 -77565
8858 1053 114652 80503 295051 -523025 8352 5970 402305 -43818 -346685 -198547 256573
8846 -75466 -175294 -11879 55196 2617 240986 86382 -200850 123251 -69813 -426551 -334740
8835 -334740 -220741 -159200 -253668 -134063 -189574 86219 -319264 -330724 -82510 -168394 -11976
$$ packed form
8880H8277K02949b24795A80757b33450D0405c13447R5588c9470j95688N4659L8812
8869a41687j75883a00336j19234C3834e8926k28514c9989l71905A39977g7565
8858A053J13599l4149K14548e23025H352k382L96335d3818l02867J48138B56573
8846g5466r9828a1879E5196B617K38369H6382b00850A23251f9813l56738R1811
8835c34740J13999O1541r4468J19605n5511H6219c19264j1460h2510q5884a1976
$$ [...]
##END NTUPLES=NMR SPECTRUM
##END=
