
##TITLE=AC1174_Popayan-cajibio-cauca-CCAAH12001_5898680_RbtZyoOoqB
##JCAMPDX= 6.0         $$ Bruker NMR JCAMP-DX V2.0
##DATA TYPE= NMR SPECTRUM
##DATA CLASS= NTUPLES
##ORIGIN= BRUKER
##OWNER= Administrator
$$ 1.72 TOPSPIN		Version 2.1
$$ 2012-04-03 18:15:00.015 -0500  Administrator@TOPSPIN
$$ Compression mode = diff/dup
##.OBSERVE FREQUENCY= 400.13188235
##.OBSERVE NUCLEUS= ^1H
##.ACQUISITION MODE= SIMULTANEOUS (DQD)
##.ACQUISITION SCHEME= undefined
##.AVERAGES= 64
##.DIGITISER RES= 22
##SPECTROMETER/DATA SYSTEM= spect
##.PULSE SEQUENCE= noesygpps1d.comp
##.SOLVENT NAME= COFFEE_meoh
##.SHIFT REFERENCE= INTERNAL, COFFEE_meoh, 1, 14.96867
##AUDIT TRAIL= $$ (NUMBER, WHEN, WHO, WHERE, PROCESS, VERSION, WHAT)
$$ ##TITLE= Audit trail, TOPSPIN		Version 2.1
$$ ##JCAMPDX= 5.01
$$ ##ORIGIN= Bruker BioSpin GmbH
$$ ##OWNER= Administrator
$$ $$ C:\Bruker\TOPSPIN/data/COFFEE/nmr/AC1174_Popayan-cajibio-cauca-CCAAH12001_5898680_RbtZyoOoqB/12/pdata/1/auditp.txt
$$ ##AUDIT TRAIL=  $$ (NUMBER, WHEN, WHO, WHERE, PROCESS, VERSION, WHAT)
(   1,<2012-04-03 18:14:55.171 -0500>,<Administrator>,<TOPSPIN>,<go>,<TOPSPIN 2.1>,
      <created by zg
	started at 2012-04-03 18:03:23.546 -0500,
	POWCHK enabled, PULCHK disabled,
       configuration hash MD5:
       1A 1E CE 29 27 FD 77 03 67 4E F0 E3 C4 B2 CB 90
       data hash MD5: 64K
       58 D3 F8 DD 75 91 7B 3A CE B8 10 65 44 6B 1E F1>)
(   2,<2012-04-03 18:14:58.078 -0500>,<Administrator>,<TOPSPIN>,<proc1d>,<TOPSPIN 2.1>,
      <Start of raw data processing
       efp LB = 0.3 FT_mod = 6 PKNL = 1 PHC0 = 0 PHC1 = 0 SI = 128K 
       data hash MD5: 128K
       EB 24 A9 37 6F BC E7 51 20 48 CB 70 C5 63 65 78>)
(   3,<2012-04-03 18:14:59.296 -0500>,<Administrator>,<TOPSPIN>,<proc1d>,<TOPSPIN 2.1>,
      <pk PHC0 = 34.49707 PHC1 = 0 
       data hash MD5: 128K
       87 C7 BA E6 32 4E D8 71 F6 38 89 5F 1E 67 18 5E>)
(   4,<2012-04-03 18:14:59.515 -0500>,<Administrator>,<TOPSPIN>,<proc1d>,<TOPSPIN 2.1>,
      <abs ABSG = 1 
       data hash MD5: 128K
       2C 39 34 D3 64 15 72 9D B0 14 4B FD 39 43 DE D5>)
(   5,<2012-04-03 18:14:59.593 -0500>,<Administrator>,<TOPSPIN>,<proc1d>,<TOPSPIN 2.1>,
      <abs ABSG = 2 
       data hash MD5: 128K
       EE 70 D1 8E 1B 2B 62 7B FE 22 8F 0C 05 0A 58 05>)
(   6,<2012-04-03 18:14:59.640 -0500>,<Administrator>,<TOPSPIN>,<proc1d>,<TOPSPIN 2.1>,
      <abs ABSG = 3 
       data hash MD5: 128K
       87 4C 7E C9 74 D3 D1 C3 09 31 C3 41 FC 65 CB 8F>)
(   7,<2012-04-03 18:14:59.875 -0500>,<Administrator>,<TOPSPIN>,<proc1d>,<TOPSPIN 2.1>,
      <abs ABSG = 4 
       data hash MD5: 128K
       68 8C 96 32 AC ED D6 12 92 F0 31 F3 55 4C DA AB>)
(   8,<2012-04-03 18:14:59.921 -0500>,<Administrator>,<TOPSPIN>,<proc1d>,<TOPSPIN 2.1>,
      <abs ABSG = 5 
       data hash MD5: 128K
       EB D6 A7 E8 E3 FC 87 07 5C 1E 0E 7E C8 8D C7 63>)
$$ ##END=
$$ 
$$ $$ hash MD5
$$ $$ 17 08 75 67 27 0F 88 EA E2 D8 44 CA 0B CE 13 70
##$RELAX= 
##$RELAX= 
##$RELAX= 
##$RELAX= 
##$RELAX= 
##$RELAX= 
##$RELAX= 
$$ [...]
##$TP07= 0
##$TPNAME0= <>
##$TPNAME1= <>
##$TPNAME2= <>
##$TPNAME3= <>
##$TPNAME4= <>
##$TPNAME5= <>
##$TPNAME6= <>
##$TPNAME7= <>
##$TPOAL= (0..7)
0.5 0.5 0.5 0.5 0.5 0.5 0.5 0.5
##$TPOFFS= (0..7)
0 0 0 0 0 0 0 0
##$TUNHIN= 0
##$TUNHOUT= 0
##$TUNXOUT= 0
##$USERA1= <user>
##$USERA2= <user>
##$USERA3= <user>
##$USERA4= <user>
##$USERA5= <user>
##$V9= 5
##$VALIST= <valist>
##$VCLIST= <CCCCCCCCCCCCCCC>
##$VD= 0
##$VDLIST= <DDDDDDDDDDDDDDD>
##$VPLIST= <PPPPPPPPPPPPPPP>
##$VTLIST= <TTTTTTTTTTTTTTT>
##$WBST= 2048
##$WBSW= 25
##$XGAIN= (0..3)
0 0 0 0
##$XL= 0
##$YL= 0
##$YMAX_a= 13155756
##$YMIN_a= -5790665
##$ZGOPTNS= <>
##$ZL1= 120
##$ZL2= 120
##$ZL3= 120
##$ZL4= 120
##$ABSF1= 14.96867
##$ABSF2= -5.58386
##$ABSG= 5
##$ABSL= 3
##$ALPHA= 0
##$AQORDER= 0
##$ASSFAC= 0
##$ASSFACI= 0
##$ASSFACX= 0
##$ASSWID= 0
##$AUNMP= <proc_prof1d_extract.lims>
##$AXLEFT= 0
##$AXNAME= <>
##$AXNUC= <1H>
##$AXRIGHT= 0
##$AXTYPE= 0
##$AXUNIT= <>
##$AZFE= 0.1
##$AZFW= 0.1
##$BCFW= 0
##$BC_mod= 0
##$BYTORDP= 0
##$COROFFS= 0
##$CY= 15
##$DATMOD= 1
##$DC= 0
##$DFILT= <>
##$DTYPP= 0
##$F1P= 0
##$F2P= 0
##$FCOR= 0.5
##$FTSIZE= 131072
##$FT_mod= 6
##$GAMMA= 0
##$GB= 0
##$INTBC= 1
##$INTSCL= 1
##$ISEN= 128
##$LB= 0.3
##$LEV0= 0
##$LPBIN= 0
##$MAXI= 10000
##$MC2= 0
##$MEAN= 0
##$ME_mod= 0
##$MI= 0
##$NCOEF= 0
##$NC_proc= -3
##$NLEV= 6
##$NOISF1= 0
##$NOISF2= 0
##$NSP= 0
##$NTH_PI= 0
##$NZP= 0
##$OFFSET= 14.96867
##$PC= 1
##$PHC0= 34.49707
##$PHC1= 0
##$PH_mod= 1
##$PKNL= yes
##$PPARMOD= 0
##$PPDIAG= 0
##$PPIPTYP= 0
##$PPMPNUM= 2147483647
##$PPRESOL= 1
##$PSCAL= 4
##$PSIGN= 0
##$PYNMP= <proc.py>
##$REVERSE= no
##$SF= 400.130004780256
##$SI= 131072
##$SIGF1= 0
##$SIGF2= 0
##$SINO= 400
##$SIOLD= 131072
##$SPECTYP= <>
##$SREGLST= <1H.CDCl3>
##$SSB= 0
##$STSI= 131072
##$STSR= 0
##$SW_p= 8223.68421052632
##$SYMM= 0
##$S_DEV= 0
##$TDeff= 65536
##$TDoff= 0
##$TI= <>
##$TILT= no
##$TM1= 0
##$TM2= 0
##$TOPLEV= 0
##$USERP1= <user>
##$USERP2= <user>
##$USERP3= <user>
##$USERP4= <user>
##$USERP5= <user>
##$WDW= 1
##$XDIM= 131072
##$YMAX_p= 484601982
##$YMIN_p= -298508983
##$CURPLOT= <Network HP LaserJet P1505>
##$CURPRIN= <$Network HP LaserJet P1505>
##$DFORMAT= <normdp>
##$LAYOUT= <+/1D_H.xwp>
##$LFORMAT= <normlp>
##$PFORMAT= <normpl>
##$SURQMSG= 1
$$ End of Bruker specific parameters
$$ ---------------------------------
##NTUPLES= NMR SPECTRUM
##VAR_NAME=  FREQUENCY,     SPECTRUM/REAL,   SPECTRUM/IMAG
##SYMBOL=    X,             R,               I
##VAR_TYPE=  INDEPENDENT,   DEPENDENT,       DEPENDENT
##VAR_FORM=  AFFN,          ASDF,            ASDF
##VAR_DIM=   131072,        131072,          131072
##UNITS=     HZ,            ARBITRARY UNITS, ARBITRARY UNITS
##FACTOR=    0.0627417313425165, 1,          1
##FIRST=     8223.62146879498, 752,          -104967
##LAST=      0,             4677,            -103740
##MIN=       0,             -298508983,      0
##MAX=       8223.62146879498, 484601982,    0
$$ Real data points
##PAGE= N=1
##DATA TABLE= (X++(R..R)), XYDATA
$$ [...]
63944 1257774 1268558 1280880 1294799 1310622 1329028 1350670 1375730 1403959 1435135 1469287 1506307
63933 1506307 1545584 1586579 1629950 1677656 1731423 1791188 1855406 1922817 1993651 2069426 2152161
63922 2152161 2243535 2343846 2451584 2564862 2683763 2810685 2947972 3095889 3253429 3420361
63912 3420361 3597720 3786978 3989795 4208269 4444337 4699072 4973670 5271230 5596618
63903 5596618 5954418 6348046 6781306 7259991 7791393 8382766 9040648 9771005 10579311
63894 10579311 11470428 12448248 13514538 14667386 15900826 17206053 18572434 19987172
63886 19987172 21434616 22896234 24350390 25771391 27129419 28392823 29531417 30518573
63878 30518573 31332054 31954731 32374809 32584587 32578802 32354775 31914440 31266061 30424424 29410271
63868 29410271 28249538 26971685 25606895 24183417 22726393 21258170 19799256 18369082
63860 18369082 16985856 15665376 14419730 13256932 12181322 11193820 10292239 9472468
63852 9472468 8730099 8060831 7459483 6919480 6434010 5997343 5604706 5251368 4932629
63843 4932629 4644494 4383516 4145858 3927298 3724615 3536442 3362296 3201088 3051085
63834 3051085 2910976 2780223 2658227 2543669 2434846 2330330 2229225 2131310 2037209 1947928
63824 1947928 1863675 1783293 1705318 1629607 1557522 1490418 1428190 1369407 1312722 1258042 1206349
63813 1206349 1158501 1114391 1073417 1035449 1000719 968738 938084 907736 878166 850639 825866
63802 825866 803908 784826 768444 753612 738775 723504 708735 695395 683578 673250 664772 658145
63790 658145 652478 646963 641970 638515 636907 636473 636346 635944 634838 632773 629865 626364 622191 616976 610394
63775 610394 602121 591688 578945 564730 550448 536747 523041 508700 494274 480872 468392 455261
63763 455261 440496 425504 412878 403351 394824 384778 372904 360772 349688 339938 331687 325313
63751 325313 320585 316483 312229 307829 303414 298832 294201 290082 286633 283228 279437 275815 273189 271623
63737 271623 270482 269077 266843 263472 259387 255704 253311 252368 252788 254308 255649 254761 250964 246073 242295
63722 242295 239651 236758 233601 231832 232217 233297 233080 231006 227825 224605 222416 222034 223073 223861 222858
63707 222858 219993 216326 212940 210594 209839 210647 212032 212674 212017 210519 208940 207746 207093 206963 207141 207270
63691 207270 207158 207050 207491 208807 210636 212080 212456 211842 210848 210012 209620 209857 210744 211951 213089 214306 216300
63674 216300 219642 224262 229636 235153 240238 244553 248435 252993 259262 267069 274911 281243 286020 290756
63660 290756 296849 303921 310109 313986 315807 316773 317537 317842 317342 316212 314952 313902 313054 312154 310986 309621
63644 309621 308291 306955 305174 302585 299293 295602 291596 287218 282609 278107 273961 270140 266321 262130
63630 262130 257736 254197 252626 252792 253050 251997 249745 247421 246086 246453 248777 252314 255633 258293 261588
63615 261588 266713 272900 278547 283665 289808 297779 306864 316326 326076 335427 342595 346231 346667 345104
63601 345104 342399 339039 335349 331051 325435 318677 312294 307523 303830 299771 294908 290106 286270 283521
63587 283521 281518 280011 279016 278736 279283 280438 281923 283868 286585 289940 293680 298464 305580 315138 325416
63572 325416 334744 343369 352665 363114 374045 384986 396245 408225 421098 435278 451409 469632
63560 469632 489328 509837 531111 553585 577627 603245 630216 658553 688750 721223 755358
63549 755358 789469 821835 851358 877143 898281 914588 926879 935840 941151 942445 940494 936476
63537 936476 930551 922323 912585 903313 895641 888669 880474 869580 855403 838226 819166 799499 779649
63524 779649 759275 738370 717569 697296 677625 659278 643688 631383 621081 611202 601646 593286
63512 593286 586243 579646 572904 566450 561299 558513 558835 562069 566975 572590 579601 589556 602644 617206
63498 617206 631857 647235 664986 685647 708422 732846 759740 790144 823750 858831 893603
63487 893603 927262 959515 989418 1015247 1035734 1050976 1061759 1068479 1071505 1072291 1072948 1074269 1075079
63474 1075079 1074119 1071705 1068712 1064629 1057908 1047873 1034874 1018362 996229 966864 931162 891848
63462 891848 851497 811829 774098 738933 705878 674150 644147 617554 595525 577057 559502
63451 559502 540698 520685 501486 485219 472268 461295 450955 441220 432865 426210 420897 416601
63439 416601 413324 410945 409004 407001 404644 401929 399345 397858 398223 400389 403906 408570 414091 419542
63425 419542 424237 429043 435659 444318 453375 461654 469893 478887 487387 493404 497010 500108 503359 504998
63411 504998 503307 498948 493869 488918 483732 478440 473993 470666 467488 463791 460531 459216 459941 461420
63397 461420 462953 465433 469902 475613 480278 482227 481936 481279 481626 482902 484354 485902 488547 493501 501068
63382 501068 510477 520629 530894 541406 552987 566752 583235 601751 621094 641200 663619 689810
63370 689810 719292 750169 781387 813829 849019 887230 927077 966746 1005583 1044644 1085627
63359 1085627 1129006 1173313 1216407 1256963 1294123 1326164 1350739 1366762 1375245 1377937 1375792 1369218
63347 1369218 1359137 1347069 1334330 1321449 1308062 1293041 1275147 1253866 1229335 1201303 1168993
63336 1168993 1132571 1094148 1056413 1020498 985896 952148 919691 889162 860834 835005 812083
63325 812083 791968 774009 758027 744814 735177 728926 725285 723801 724233 726039 728932 733917 742751
63312 742751 755955 772017 789087 806988 826949 849718 874824 901649 930411 961669 995375
63301 995375 1030895 1067741 1105840 1145107 1184965 1224201 1261104 1293761 1320458 1340004 1352088
63290 1352088 1357645 1358567 1356338 1350945 1341832 1329943 1317647 1306138 1294018 1279443 1262669 1245057
63278 1245057 1226185 1203841 1177067 1147557 1117422 1086894 1055095 1022008 988655 955969 924482
63267 924482 894694 866747 839893 813183 786844 762358 741011 722775 706746 692288 679395
63256 679395 668062 657745 647763 638197 629954 623790 619706 617493 617163 618100 618503 616872 613820 611083
63242 611083 608776 605228 599972 595128 592629 591421 588943 584587 580052 576619 573707 570231 566007 561438
63228 561438 556956 553249 551200 550991 551773 552562 553007 553022 552384 551202 550231 550106 550572 551061 551744 553299 555701
63211 555701 558023 559641 561028 563012 565833 569457 574187 579938 585120 587528 586791 585136 585212 587958 593009
63196 593009 599986 608181 615925 622017 627695 635738 647384 661300 675688 690048 704506 718743 732430
63183 732430 745949 760102 775757 793970 815442 839383 863907 888085 912797 939239 967770
63172 967770 998651 1032427 1068604 1105287 1141309 1177671 1215658 1254628 1293068 1330826 1368588
63161 1368588 1405852 1441252 1474660 1507274 1539663 1571226 1601612 1631229 1660185 1687840 1713495
63150 1713495 1736463 1755546 1769673 1778975 1783971 1783752 1776429 1761521 1740355 1713838 1681444 1643150
63138 1643150 1601009 1557864 1515489 1474740 1436434 1400997 1368046 1337444 1310406 1288650 1272731
63127 1272731 1261943 1255575 1253543 1255802 1261734 1270285 1280547 1292316 1306185 1322912 1342620 1364780
63115 1364780 1388857 1414467 1440788 1466528 1490883 1514262 1537621 1561177 1584022 1604960 1623535
63104 1623535 1640068 1654601 1666015 1672585 1673345 1668341 1657505 1640345 1617236 1590017 1560410 1528699
63092 1528699 1494977 1460710 1427512 1395003 1361683 1327671 1294747 1263818 1234371 1206700 1182420
63081 1182420 1161892 1143115 1124418 1106710 1091728 1079504 1069066 1060399 1053842 1048395 1042510 1036280
63069 1036280 1031251 1028236 1026760 1026493 1027555 1029227 1029994 1029473 1029079 1030011 1031549 1032187 1031784 1031679 1033031 1035823
63053 1035823 1039366 1043056 1046538 1049679 1052619 1055535 1058227 1060258 1061776 1063790 1067200 1071725 1076397 1081055
63039 1081055 1086552 1093177 1099682 1104611 1108172 1111973 1117159 1123568 1130592 1137978 1145647 1153396 1160985 1168054
63025 1168054 1174022 1178692 1182959 1188226 1195131 1203556 1213803 1226647 1241952 1258275 1274514 1291210
63013 1291210 1309568 1329725 1350690 1371702 1393105 1415974 1441098 1468243 1496461 1525381 1555938
63002 1555938 1589179 1624630 1660823 1697487 1736127 1778206 1823820 1872539 1924352 1979047 2035748
62991 2035748 2094063 2154939 2219391 2286865 2355805 2425494 2496540 2569806 2645555 2723324 2801979
62980 2801979 2880084 2956780 3032193 3106645 3179942 3251846 3322803 3393600 3464575 3535434 3605353
62969 3605353 3672772 3735612 3792168 3841320 3881513 3910386 3926152 3928785 3919018 3896539 3859876 3807911
62957 3807911 3741266 3662827 3577241 3488936 3399831 3309606 3218749 3130315 3047824 2972661 2904843
62946 2904843 2845323 2795532 2755032 2721596 2693867 2672554 2658786 2652637 2653585 2661139 2674508 2692597
62934 2692597 2714794 2740916 2769978 2799837 2828525 2855520 2881646 2908369 2937028 2967609 2997893
62923 2997893 3024649 3046102 3062640 3074874 3081825 3081346 3071585 3051708 3021953 2983428 2937130 2882721
62911 2882721 2818938 2745714 2665303 2580801 2494126 2406004 2317258 2229263 2143447 2061098 1983456
62900 1983456 1911205 1843870 1780419 1720620 1665257 1614788 1568295 1524317 1482516 1443865 1409009
62889 1409009 1377038 1346580 1317874 1292727 1271978 1253785 1235289 1215672 1196691 1180222 1166036
62878 1166036 1152167 1136876 1120024 1102993 1087499 1074139 1061790 1048599 1033607 1017366 1001248
62867 1001248 986568 974149 963974 955093 946425 937841 930075 923586 918151 913732 910841 909496 908373
62854 908373 905831 901635 897130 893769 891964 891281 891108 890873 890076 888599 886931 885749 885282 885315 885744 886728
62838 886728 888123 889236 889578 889633 890328 891848 893523 894760 895337 894714 892079 887665 883188 880057 877595 874028
62822 874028 869103 864737 862875 863473 864958 866111 866929 867857 868775 868987 868018 866133 864019 862223 861085 860804
62806 860804 861108 861082 860049 858490 857264 855849 852398 845996 837964 830394 824302 819880 817485 817169 817832
62791 817832 818180 818281 819047 820335 820753 819574 817945 817828 820235 824495 828752 831203 831447 830711 830500 831229
62775 831229 832425 833629 834468 834460 833700 833399 834781 837628 840753 843635 846757 850683 855722 862022 868939 874747
62759 874747 878240 880358 882972 886535 890405 894934 901049 907710 912154 913471 914008 916286 920323 925111
62745 925111 930864 938136 946071 953441 960748 969676 980880 993616 1007177 1021451 1036446 1052532 1070937
62732 1070937 1092945 1118650 1147302 1178518 1212337 1248566 1287192 1329076 1375047 1424482 1476038
62721 1476038 1529814 1587623 1651006 1720174 1795207 1877004 1966267 2062363 2164063 2271067 2384073
62710 2384073 2503386 2627810 2754759 2881156 3004262 3121786 3231269 3329575 3413363 3480151
62700 3480151 3528701 3558417 3568783 3559514 3530899 3483752 3419325 3339504 3246875 3144242 3033978
62689 3033978 2917905 2797560 2674385 2549785 2425518 2304044 2187930 2078407 1974768
62680 1974768 1875842 1782023 1695193 1616472 1544785 1478143 1415701 1357939 1305361 1257986 1215918
62669 1215918 1179326 1147623 1119406 1093513 1069689 1048122 1028896 1012070 997722 985658 975506
62658 975506 967194 960895 956443 953406 951844 952410 955570 961299 969649 980836 994600 1010284 1027916
62645 1027916 1048421 1072352 1099191 1128486 1160953 1197705 1238853 1283571 1331245 1382007 1436460
62634 1436460 1495336 1559112 1627554 1699977 1776266 1857124 1942675 2031096 2119060 2203364 2282042
62623 2282042 2354463 2420632 2479766 2529170 2565186 2585761 2591476 2583656 2562472 2527684 2480266 2422068
62611 2422068 2354511 2278960 2197959 2114625 2030695 1946294 1861706 1778250 1697190 1618880 1543445
62600 1543445 1471534 1403920 1340979 1282911 1229910 1181696 1137331 1095879 1057054 1021052 988061
62589 988061 958017 930553 905145 881585 860183 840946 822727 804003 784768 766906 752171
62578 752171 740264 729390 718374 707608 698118 690313 683795 677922 672155 666036 659263 652101 645577
62565 645577 640933 638774 638745 639871 640984 641120 640217 639585 641079 645392 651546 658264 665219 672602 680344
62550 680344 688568 698192 709967 723195 736570 750266 765977 784602 805018 825726 846816 869578
62538 869578 894802 922379 952206 984544 1019426 1056522 1095912 1138607 1185923 1238396 1295409
62527 1295409 1355731 1418225 1482042 1546381 1610313 1672876 1733022 1789237 1839367 1881185 1913208
62516 1913208 1934902 1946206 1947208 1938246 1919910 1892775 1857427 1814895 1766729 1714394 1658875 1601282
62504 1601282 1543477 1487421 1433756 1381619 1330143 1279617 1230863 1184144 1139581 1098289 1061913
62493 1061913 1030670 1002833 976660 952052 929579 908689 888054 867330 847339 828491 810194
62482 810194 792214 775587 761544 750132 740441 731734 723863 716928 711031 706183 702225 699065 697117
62469 697117 697059 698940 701936 705271 708951 713349 718471 724102 730440 738313 748760 762260 778089 794748
62455 794748 811756 830821 854266 882258 912747 944424 978380 1016077 1056989 1099518 1143272
62444 1143272 1188944 1236290 1283691 1329630 1373297 1413618 1448945 1478280 1501922 1520277 1532440
62433 1532440 1536500 1531163 1516808 1495030 1467342 1434479 1396995 1356250 1314306 1272871 1232806 1194658
62421 1194658 1158902 1125494 1093979 1064388 1037207 1012192 988339 965702 946063 930635 918052
62410 918052 906008 894206 884078 876006 868531 860485 852435 845652 840846 838332 838368 840669 844244 848205
62396 848205 852323 856693 861492 867175 874273 882714 891792 900876 909712 918227 926577 935217 944133 952256
62382 952256 958582 963710 969097 974580 977845 976790 971522 963560 953997 943137 931184 918429 905040
62369 905040 891177 877125 863051 848922 834843 821143 808026 795605 784347 775026 768094 763533
62357 763533 761168 760515 760487 760254 760587 763326 769166 776824 784867 793300 802708 812720 822402 831662 841319
62342 841319 852020 863940 877300 892143 907358 920751 930830 938488 946503 956997 969205 979900
62330 979900 986189 987777 986366 983367 978996 973387 967472 962288 958051 954395 951012 947700 944459 942206
62316 942206 942924 948230 957818 969891 983155 997900 1015196 1035827 1060387 1089788 1124660 1164210
62304 1164210 1206626 1251378 1300526 1356736 1420052 1487786 1557747 1630280 1706394 1785101 1863844
62293 1863844 1940654 2014397 2083376 2145271 2198446 2241960 2274312 2293698 2299841 2294340 2278860 2254094
62281 2254094 2220721 2179897 2132253 2077825 2017872 1955518 1893471 1831988 1770190 1708625 1649333
62270 1649333 1593862 1542356 1494343 1449374 1406922 1366595 1328657 1293838 1262503 1234279 1208435
62259 1208435 1184457 1162433 1142981 1126466 1112263 1099412 1088155 1079972 1075586 1073623 1071898 1069457
62247 1069457 1066658 1063836 1060815 1057533 1054238 1050942 1047168 1042332 1036214 1029210 1022322 1016445 1011278 1005197
62233 1005197 996683 985818 974344 964561 958107 955062 953799 952248 949805 947729 947623 950188 955563 963792
62219 963792 974216 985251 995668 1005648 1015972 1026924 1038747 1052429 1068846 1087569 1107656 1129446
62207 1129446 1154475 1183564 1215869 1249951 1285169 1322105 1362157 1406599 1455456 1507572 1562345
62196 1562345 1620968 1684996 1753772 1824111 1892508 1956939 2016598 2070788 2118284 2157250 2185810
62185 2185810 2203250 2210539 2209042 2198931 2179643 2151608 2116377 2074959 2027262 1973668 1916239 1857762
62173 1857762 1800191 1744555 1691783 1642856 1598334 1558202 1522160 1489913 1461326 1436406 1414957
62162 1414957 1396355 1379999 1365915 1354397 1345065 1336897 1329461 1323676 1321019 1322067 1325760 1329795 1332064
62149 1332064 1332357 1332619 1334797 1338455 1341368 1342532 1343450 1346001 1350228 1355143 1360756 1367929 1376690 1386095 1395814
62134 1395814 1406671 1419371 1433660 1449159 1466126 1484970 1505745 1528690 1554467 1583056 1612978
62123 1612978 1642517 1671376 1700189 1728700 1755620 1780472 1804469 1829168 1855155 1882585 1912035
62112 1912035 1943918 1977668 2012519 2048803 2087664 2129784 2175274 2224516 2277850 2334247 2391323
62101 2391323 2447097 2500993 2552716 2600910 2643555 2679266 2707730 2729358 2745008 2755761 2762334
62090 2762334 2764727 2762630 2756191 2746210 2733888 2720532 2707349 2695245 2684805 2676337 2669861 2665320 2663183
62077 2663183 2664517 2669829 2677979 2686959 2695800 2705001 2715110 2725872 2737127 2749656 2764452 2781709
62065 2781709 2801046 2822277 2845419 2870210 2896083 2922461 2949009 2975961 3004260 3034842 3067660
62054 3067660 3101984 3137689 3175446 3215394 3256512 3297776 3339239 3381402 3424149 3466900 3509435
62043 3509435 3552249 3596489 3643610 3694327 3747737 3802393 3858491 3917977 3982106 4049899 4119382
62032 4119382 4188958 4256949 4321443 4382067 4440944 4500547 4561270 4622169 4683110 4744763 4807105
62021 4807105 4869244 4930207 4988815 5043627 5094532 5143793 5193945 5245088 5295647 5345190 5394756
62010 5394756 5444817 5494972 5545738 5598775 5654799 5712718 5771191 5829771 5888233 5946027 6002583
61999 6002583 6056887 6106588 6148970 6183230 6210544 6231631 6245698 6252247 6252306 6246954 6235805 6217901
61987 6217901 6193242 6162721 6127411 6088723 6048465 6007933 5967413 5927054 5887548 5849483 5812709
61976 5812709 5776997 5742836 5711126 5682410 5656681 5633406 5611652 5590721 5570669 5551530 5532298
61965 5532298 5511824 5490679 5470765 5452787 5435498 5417762 5399801 5381784 5362833 5342522 5321919
61954 5321919 5301791 5281019 5258334 5234675 5211978 5190115 5166751 5140170 5110782 5079800 5047913
61943 5047913 5015653 4983892 4953150 4922981 4892606 4861905 4831406 4801397 4771238 4739732 4706302
61932 4706302 4671610 4636525 4600521 4561899 4519821 4475323 4429750 4383067 4334566 4284707 4235272
61921 4235272 4187800 4142587 4098971 4055961 4012893 3970275 3929861 3893091 3859364 3826549 3793171
61910 3793171 3759499 3726524 3694693 3663997 3634614 3606835 3580443 3554630 3528759 3503250 3479606
61899 3479606 3459185 3441703 3425128 3407422 3388489 3370190 3354466 3341581 3330317 3319700 3310210
61888 3310210 3303026 3298260 3294658 3291380 3289429 3290596 3295365 3302835 3312559 3325363 3342177 3363066 3387835
61875 3387835 3416727 3450031 3487757 3530146 3577855 3631192 3689953 3754436 3825785 3904694 3990680
61864 3990680 4083373 4183677 4292809 4411061 4538745 4677699 4830508 4998478 5181555 5380082
61854 5380082 5595593 5830213 6086619 6368595 6680344 7025094 7405542 7825741 8291037
61845 8291037 8805477 9370403 9986184 10654082 11375254 12148539 12969856 13832423 14725279
61836 14725279 15630666 16523012 17370182 18135464 18780176 19268097 19571123 19673161 19570990
61827 19570990 19273715 18802024 18185812 17459132 16654831 15801991 14925990 14048551 13186901
61818 13186901 12353747 11558632 10808886 10109012 9459991 8860161 8306950 7797825 7330338
61809 7330338 6902122 6510883 6154107 5828986 5532895 5263559 5018480 4794702 4589739
61800 4589739 4402282 4231431 4075732 3933654 3804376 3687072 3579856 3480777 3389728 3308037
61790 3308037 3235921 3171436 3112277 3057624 3007897 2963704 2925417 2892830 2864723 2839498 2816607
61779 2816607 2796550 2779293 2763867 2750038 2739190 2732704 2730330 2730970 2734161 2739820 2747282 2755586 2764382
61766 2764382 2773849 2784365 2796940 2813140 2833509 2856586 2880526 2905282 2932293 2962599 2996467
61755 2996467 3034484 3077523 3125428 3176871 3230982 3288495 3351055 3419884 3495269 3576972 3665134
61744 3665134 3760992 3866414 3982270 4107581 4240688 4380926 4528834 4685492 4852491 5032004
61734 5032004 5225749 5434041 5656705 5894715 6150062 6424284 6718271 7033589 7373014
61725 7373014 7739636 8136307 8566127 9032717 9539871 10091720 10693539 11351839 12073543
61716 12073543 12865432 13734059 14685148 15722784 16849738 18068450 19380436 20783829
61708 20783829 22271081 23827846 25431645 27049658 28637186 30138255 31488380 32619474
61700 32619474 33467404 33981192 34130901 33911891 33344758 32470760 31343451 30019930 28555850
61691 28555850 27004207 25413905 23826253 22272387 20774404 19348225 18004740 16749556
61683 16749556 15583915 14506815 13516013 12607477 11775433 11013946 10318130 9683444 9104423
61674 9104423 8575049 8090481 7647741 7244304 6876345 6538871 6227545 5939899 5674671
61665 5674671 5430414 5205045 4996402 4802743 4622751 4455346 4299574 4154457 4018995
61656 4018995 3892355 3773893 3662813 3558057 3458854 3365300 3278142 3197950 3124544 3056977
61646 3056977 2993901 2934161 2877337 2823693 2773588 2727079 2683926 2643367 2603754 2563232 2521376
61635 2521376 2479700 2439921 2402025 2364608 2326774 2288922 2251881 2215974 2181076 2147132 2114524
61624 2114524 2084076 2056347 2030645 2005141 1978555 1951385 1924991 1900005 1876423 1854765 1835808
61613 1835808 1819064 1802611 1785017 1766785 1749532 1734266 1720921 1709157 1698918 1690056 1681688 1672482
61601 1672482 1661935 1651147 1641673 1633571 1625386 1616312 1607417 1600127 1594431 1589400 1584622 1580072 1575311
61588 1575311 1570154 1565605 1562768 1561059 1558764 1555140 1550763 1546185 1541705 1538180 1536285 1534930 1532134 1527669
61574 1527669 1523045 1518660 1513091 1505982 1499466 1495352 1492614 1489277 1485408 1482450 1480636 1478931 1476887 1474750
61560 1474750 1472080 1468044 1462993 1458207 1454038 1449648 1444703 1439833 1435128 1429508 1422255 1414145 1406462 1399769
61546 1399769 1394272 1390476 1388469 1387028 1384485 1380480 1376166 1372618 1369787 1367248 1365373 1365087 1366565 1368732
61532 1368732 1370258 1370810 1371126 1372152 1374461 1378453 1384748 1394001 1406219 1420290 1434526 1448117 1461988
61519 1461988 1477754 1495864 1515502 1536452 1559975 1587076 1616890 1647996 1680671 1716370 1755233
61508 1755233 1795763 1837156 1880374 1926408 1974884 2025034 2076735 2129602 2182154 2233012 2282069
61497 2282069 2329456 2374187 2415156 2452927 2489193 2524599 2558282 2589468 2618325 2645012 2668835
61486 2668835 2688744 2704092 2714734 2720912 2723272 2722542 2719100 2713139 2705134 2695649 2684777 2672466 2659516
61473 2659516 2647620 2638158 2631351 2626954 2625394 2627830 2635229 2647709 2664798 2686163 2712034 2743131
61461 2743131 2780407 2824816 2876982 2936823 3003798 3078031 3161201 3255806 3363435 3484027 3616863
61450 3616863 3761791 3919485 4091223 4278852 4484448 4709453 4954145 5218046 5500483
61441 5500483 5800590 6117079 6447931 6789559 7135835 7478394 7808000 8115016 8388632
61432 8388632 8617302 8791587 8906757 8962443 8960629 8904810 8800253 8653622 8472204 8264143
61422 8264143 8038792 7805347 7570602 7338616 7112489 6895635 6691336 6502049 6329544
61413 6329544 6175037 6038865 5920622 5819988 5737101 5672063 5624595 5594301 5580641 5582387 5597743
61402 5597743 5625428 5665253 5717106 5779563 5849918 5925662 6005726 6090151 6178499 6268763 6358238
61391 6358238 6445517 6531145 6616054 6699967 6781867 6861445 6939117 7014879 7088196 7159040 7227996
61380 7227996 7295103 7359452 7420233 7477248 7530011 7577231 7617880 7652164 7680752 7703552 7719864
61369 7719864 7729299 7731890 7727701 7717037 7700775 7679904 7654943 7626355 7595056 7561646 7525506 7485873
61357 7485873 7443992 7403240 7366694 7335284 7308503 7285839 7266795 7250351 7235562 7222347 7210727
61346 7210727 7199442 7186314 7170026 7150739 7128904 7104516 7077966 7050735 7024608 7000867 6980940
61335 6980940 6967139 6961896 6966716 6982902 7013013 7060426 7127367 7214389 7322008 7451875 7605884
61324 7605884 7784910 7988957 8217925 8471717 8750068 9052577 9378116 9723533 10083355
61315 10083355 10451041 10819666 11180645 11522703 11833501 12102296 12320618 12481481 12579883
61306 12579883 12614421 12587288 12502364 12364129 12178176 11951011 11688320 11394313 11073459 10731925
61296 10731925 10376427 10012492 9644918 9279266 8921372 8575297 8242786 7924942 7623459
61287 7623459 7340019 7075391 6829772 6603523 6397104 6210740 6044560 5898669 5772513
61278 5772513 5664498 5572993 5497744 5439672 5398938 5373656 5360968 5359298 5369157 5391641 5426485
61267 5426485 5471831 5525606 5586515 5653521 5724867 5798204 5871575 5943742 6013546 6079538 6140575
61256 6140575 6196409 6247325 6293425 6334563 6370699 6401982 6428620 6450911 6469015 6482242 6488943
61245 6488943 6487643 6478072 6460490 6434474 6399519 6356772 6308821 6257175 6200925 6138560 6070302 5997852
61233 5997852 5922637 5845437 5767347 5689880 5613927 5539336 5465796 5393774 5324671 5260344 5202199
61222 5202199 5150245 5103189 5059807 5019829 4983104 4948682 4915604 4884008 4854242 4825237 4795131
61211 4795131 4763543 4731891 4701265 4671308 4641768 4614002 4590229 4572051 4560158 4554614 4554847 4560212
61199 4560212 4571205 4589459 4616121 4651230 4695410 4751098 4820858 4905041 5002197 5111349 5232724
61188 5232724 5366417 5511315 5665088 5824119 5983354 6137166 6280613 6409090 6516570
61179 6516570 6595034 6636422 6635522 6591435 6506935 6386573 6235133 6057695 5860812 5652504 5440012
61168 5440012 5227624 5017311 4811233 4612759 4425070 4249684 4086689 3935759 3796602
61159 3796602 3668921 3552413 3446673 3351036 3264773 3187415 3118449 3056759 3001001 2950796 2906998
61148 2906998 2870473 2841004 2817683 2799927 2787649 2780773 2779148 2782843 2791878 2805469 2821898 2839460
61136 2839460 2857503 2876292 2895741 2914371 2929745 2939993 2944765 2944583 2939561 2929272 2913868 2894646
61124 2894646 2873073 2849526 2823460 2794569 2763135 2729342 2692994 2654291 2614226 2573705 2532676
61113 2532676 2490732 2448193 2405845 2363853 2321789 2279618 2237673 2195656 2152859 2109736 2067985
61102 2067985 2028421 1989915 1951334 1913367 1877186 1842390 1808000 1774807 1744721 1717915 1692510
61091 1692510 1667245 1642488 1618058 1592096 1563341 1533111 1503663 1475552 1447921 1420636 1394726
61080 1394726 1371012 1349436 1329605 1311127 1293582 1276891 1261616 1248314 1236862 1227027 1219355 1214753
61068 1214753 1213361 1214611 1218324 1225000 1234772 1246541 1258424 1268958 1277875 1285906 1293997 1302764 1312628
61055 1312628 1323993 1336790 1350179 1363397 1376760 1391056 1406093 1420754 1434453 1447323 1458751
61044 1458751 1467081 1471446 1472829 1472493 1470269 1465229 1457280 1447281 1436232 1425115 1414782 1405191 1395385
61031 1395385 1385052 1375361 1367404 1360549 1353409 1345759 1338264 1330724 1321889 1311053 1298898 1286722 1275439
61018 1275439 1265279 1255949 1247167 1239221 1232556 1226705 1220577 1214274 1209479 1207248 1206456 1205503 1204508 1204539 1205536
61003 1205536 1206578 1207651 1209648 1212940 1217257 1222621 1229015 1235532 1241356 1247364 1255177 1264662 1273929 1281991
60989 1281991 1290088 1299977 1312031 1325243 1338129 1349491 1359316 1369161 1380791 1394421 1409070 1424430
60977 1424430 1441194 1459597 1478982 1499132 1520929 1545318 1572468 1602235 1634627 1669555 1706841
60966 1706841 1746603 1789012 1833637 1879786 1927484 1977400 2029959 2085296 2143967 2206632 2272965
60955 2272965 2341796 2412631 2486457 2564964 2649490 2740763 2839233 2945687 3061633 3188570 3326659
60944 3326659 3474876 3632768 3801025 3980055 4169605 4370596 4585585 4816356 5063240
60935 5063240 5328631 5618937 5940304 6293950 6678430 7095196 7549560 8048847 8604195
60926 8604195 9232870 9953746 10780400 11722612 12793754 14011773 15394991 16965579 18758014
60917 18758014 20814580 23169972 25849904 28880361 32257385 35857113 39368938 42369719
60909 42369719 44532463 45802654 46386119 46582551 46641837 46743749 47019396 47495249 47993096
60900 47993096 48140638 47554406 46058375 43751880 40897584 37764462 34552005 31396820
60892 31396820 28393806 25600249 23039662 20716480 18628692 16769764 15127773 13687864
60884 13687864 12433513 11344520 10397156 9568458 8839421 8194387 7620142 7106608 6646542
60875 6646542 6233513 5860916 5522772 5214201 4931243 4671433 4433960 4217594 4018620
60866 4018620 3832112 3654821 3485546 3323569 3168644 3021911 2884654 2756204 2634905
60857 2634905 2520942 2416179 2321020 2233253 2150315 2071155 1995738 1924419 1858263 1798517 1745173
60846 1745173 1696963 1652807 1612148 1573966 1537003 1501295 1468158 1438269 1410852 1385070 1361104
60835 1361104 1339489 1320447 1304269 1291389 1281499 1273218 1265167 1257106 1249888 1244496 1241023 1238335 1235039
60822 1235039 1230952 1226983 1223258 1218432 1211620 1203925 1196844 1190088 1182392 1173778 1165496 1158113 1151208 1144621
60808 1144621 1138542 1132502 1125590 1117704 1109573 1101912 1095527 1091542 1090094 1089483 1088262 1087657 1090041 1095451
60794 1095451 1101714 1107961 1115729 1126235 1138701 1152070 1166544 1182468 1199212 1216284 1234457 1254863
60782 1254863 1277666 1302095 1326943 1350618 1371594 1389401 1404659 1418075 1430114 1441515 1453014
60771 1453014 1464359 1474397 1482139 1486995 1488424 1486597 1483126 1479722 1476249 1471519 1465790 1460674 1456567
60758 1456567 1452091 1446486 1440725 1435623 1430535 1424645 1418019 1410672 1402126 1392694 1383699 1375425 1366281 1355105
60744 1355105 1343054 1331992 1322099 1312410 1302929 1294841 1288939 1284844 1281655 1278719 1275928 1273623 1272103
60731 1272103 1271350 1271698 1274378 1280308 1288501 1297028 1305644 1316022 1329167 1344270 1360621 1378874 1399403
60718 1399403 1420942 1442152 1463390 1485724 1509125 1532845 1556748 1580950 1604672 1626593 1646220
60707 1646220 1664223 1681668 1699199 1716404 1731681 1743617 1752773 1761107 1769240 1775565 1778648 1779011 1777670
60694 1777670 1774386 1768715 1761575 1754212 1746526 1737989 1729427 1722227 1716158 1709607 1701813 1693451 1684982 1675812
60680 1675812 1665344 1653882 1642220 1630984 1620467 1610467 1600307 1589588 1578868 1569103 1560543 1552563
60668 1552563 1544382 1535658 1526849 1519444 1515182 1514336 1515237 1516222 1517644 1521148 1527452 1535747 1544945 1554445 1563644
60653 1563644 1571720 1578286 1583795 1588967 1593957 1598055 1600139 1599676 1597311 1594055 1589890 1583884 1575888 1567167
60639 1567167 1558801 1550355 1540934 1530729 1520525 1510186 1498685 1485344 1470206 1453574 1436083 1418812
60627 1418812 1402253 1385454 1367265 1348282 1330391 1314296 1298803 1282898 1267375 1253579 1241343
60616 1241343 1229259 1216748 1204988 1195587 1188882 1183797 1178977 1173759 1168474 1164419 1163280 1165588 1169438
60603 1169438 1171780 1171758 1172028 1175785 1183082 1191329 1198863 1206376 1214900 1224177 1233525 1242672 1250986 1257340 1261810
60588 1261810 1266444 1273310 1282509 1292849 1303405 1313542 1322474 1330056 1337268 1344768 1351695 1357087 1361832
60575 1361832 1367911 1376135 1385826 1396311 1407402 1418674 1429692 1441089 1454250 1469605 1485970 1501749
60563 1501749 1516241 1529832 1543615 1558844 1576104 1594846 1613983 1632794 1650941 1667949 1683155
60552 1683155 1695972 1705960 1713097 1718302 1723126 1728444 1733968 1739285 1744401 1748696 1750452 1748495 1743499 1736638
60538 1736638 1727677 1715526 1699943 1681446 1660285 1637052 1613840 1593088 1575251 1558940 1543262
60527 1543262 1528648 1515462 1503521 1493407 1486707 1484016 1483595 1482810 1480477 1477400 1475146 1474726 1476117 1478748
60513 1478748 1482341 1486971 1492135 1496505 1499339 1501614 1504840 1509158 1513677 1518331 1524155 1531646 1539954 1547939
60499 1547939 1555228 1562121 1569054 1576053 1582101 1585529 1585991 1585616 1587010 1590337 1593674 1595976 1598171 1601429
60485 1601429 1606165 1613058 1623316 1637135 1653314 1671196 1691874 1716695 1745775 1778842 1816423 1859181
60473 1859181 1906899 1959060 2015441 2074948 2134373 2189349 2236195 2272156 2294760 2302523 2296340 2279152
60461 2279152 2254177 2224177 2192219 2161753 2135214 2113092 2095044 2081771 2075270 2077140 2086833 2101782
60449 2101782 2119254 2137931 2157751 2178762 2200787 2224169 2250262 2280848 2317291 2360341 2410377
60438 2410377 2467605 2532132 2604064 2683626 2771383 2868571 2976993 3098243 3233018 3381408
60428 3381408 3543603 3720000 3910990 4117448 4341586 4586861 4856955 5155142 5484540
60419 5484540 5848247 6248584 6685737 7156039 7649961 8150607 8633967 9071333 9433121
60410 9433121 9693066 9831674 9838098 9710910 9458928 9101375 8664857 8177245 7662661 7140638
60400 7140638 6627066 6133479 5666156 5228184 4822736 4453008 4119447 3819299 3549574
60391 3549574 3308857 3095662 2906798 2738543 2588351 2454496 2335014 2227960 2131914 2045487
60381 2045487 1967168 1896356 1833563 1778678 1729733 1684243 1641110 1600464 1562473 1527252 1495167
60370 1495167 1466060 1438561 1411220 1384127 1358617 1335679 1315277 1296782 1279327 1262150 1245414
60359 1245414 1230263 1217387 1206078 1195503 1186167 1178991 1173498 1168405 1163709 1160621 1159281 1158022 1155441
60346 1155441 1152054 1149368 1148396 1149701 1153812 1160444 1167823 1173915 1178367 1182686 1188546 1196422 1205700 1215399
60332 1215399 1224563 1232494 1239128 1245135 1251387 1258276 1265572 1272774 1279255 1284044 1286008 1284810 1281580 1278151
60318 1278151 1275492 1273269 1270909 1268471 1266135 1263487 1260006 1256014 1252480 1249954 1248220 1247030 1246551 1246837
60304 1246837 1247343 1247541 1247923 1249908 1254366 1260316 1265514 1268702 1271099 1275274 1282553 1291956 1301603 1310482 1318631
60289 1318631 1326505 1334963 1345278 1358007 1371847 1384559 1395367 1405718 1417405 1430546 1443882 1456476
60277 1456476 1468476 1480453 1492645 1504845 1516623 1527542 1537439 1546550 1555360 1564544 1575176 1588546
60265 1588546 1605246 1624592 1645328 1666563 1687352 1705724 1719320 1727258 1730321 1728845 1721601 1707756
60253 1707756 1688972 1668068 1646091 1622320 1597092 1572785 1551378 1532521 1515031 1499117 1485854
60242 1485854 1475305 1466637 1459709 1455086 1452407 1450066 1447042 1444148 1442937 1443927 1446436 1449743 1453823 1458981
60228 1458981 1465098 1471340 1476543 1480005 1482014 1483781 1486916 1492786 1501858 1513351 1525763 1537997 1549840
60215 1549840 1561350 1572317 1582725 1593241 1604585 1616556 1628299 1639632 1651731 1666339 1684330
60204 1684330 1704919 1726342 1747677 1770038 1795395 1824150 1854811 1886590 1921314 1961703 2008312
60193 2008312 2059273 2112797 2168837 2228422 2292561 2362105 2437929 2520841 2611596 2710813 2818407
60182 2818407 2933538 3056000 3187414 3330039 3484312 3648416 3820262 3998858 4183526
60173 4183526 4372703 4563972 4754731 4942542 5125188 5300322 5464656 5613892 5744425
60164 5744425 5855068 5946375 6018519 6070914 6103662 6118051 6115631 6098164 6068678 6031004 5987773
60153 5987773 5940201 5890436 5842669 5801041 5767685 5743787 5731374 5732874 5749790 5783046 5833894
60142 5833894 5903265 5990746 6095305 6216597 6354453 6507383 6672455 6846207 7024736 7203415
60132 7203415 7377852 7545042 7702539 7846563 7972080 8074948 8153223 8206324 8233817 8235287
60122 8235287 8210715 8160715 8086992 7992873 7882953 7761973 7634263 7504186 7376523 7256098
60112 7256098 7147160 7053148 6976728 6919826 6883629 6868517 6874163 6900123 6946396 7012878 7097855
60101 7097855 7197517 7307457 7424310 7545382 7667074 7784480 7892631 7987727 8067467 8131049
60091 8131049 8179109 8213108 8234475 8244498 8245032 8238895 8229560 8220960 8217768 8225408 8249101 8292518 8357192
60078 8357192 8443196 8550546 8680336 8834850 9016973 9229635 9475498 9756489 10073402 10426295
60068 10426295 10815406 11241208 11703246 12199284 12725846 13278997 13853883 14443655 15039508
60059 15039508 15631877 16211342 16768575 17294150 17778711 18213079 18588089 18894868 19126068
60050 19126068 19277253 19346986 19335335 19242335 19068356 18816343 18493457 18110189 17678058 17208693
60040 17208693 16714763 16210309 15708906 15221444 14756016 14319661 13919427 13561524 13249963
60031 13249963 12986506 12771803 12606082 12488510 12416427 12385883 12392923 12433552 12502207 12591124
60021 12591124 12691936 12797366 12900720 12994534 13071243 13125290 13153551 13153775 13124048 13064266 12976713
60010 12976713 12863897 12726277 12563118 12375427 12167172 11943337 11707169 11459572 11201122
60001 11201122 10934516 10664909 10397971 10138054 9888370 9652156 9432902 9233763 9057379
59992 9057379 8905807 8779888 8679287 8604236 8556749 8538798 8549785 8587492 8651231 8741915 8858522
59981 8858522 8996597 9151143 9319020 9497124 9679707 9859220 10028924 10183437 10317777
59972 10317777 10427526 10509543 10561341 10580286 10564486 10513915 10429707 10313241 10167236 9996920
59962 9996920 9808494 9606777 9395745 9180754 8968295 8763452 8569210 8388500 8225291
59953 8225291 8083084 7963697 7868410 7799278 7758255 7745494 7759484 7799009 7864701 7958656 8082535
59942 8082535 8235887 8416116 8620012 8845058 9089180 9349474 9621141 9897144 10168715
59933 10168715 10427014 10665004 10877665 11060504 11208835 11319081 11389992 11421777 11414598 11368553
59923 11368553 11284566 11164600 11011789 10831367 10631011 10419363 10204451 9993743 9794216
59914 9794216 9610844 9445768 9300595 9178980 9085331 9021382 8985995 8978322 8999085 9048290 9123738
59903 9123738 9222851 9344457 9487423 9648540 9823046 10006667 10195952 10387054 10575425 10756928
59893 10756928 10928551 11087998 11233375 11363796 11480084 11584335 11678562 11763892 11841473 11914247
59883 11914247 11987488 12067321 12159013 12266963 12395868 12551195 12738505 12962641 13227445 13535719
59873 13535719 13889288 14289067 14734632 15223320 15749929 16307428 16887289 17478367 18065735
59864 18065735 18631345 19156036 19621019 20008441 20302047 20488326 20557898 20507165 20339747 20066012
59854 20066012 19700307 19258302 18756638 18213400 17646800 17072730 16504101 15952278 15427963
59845 15427963 14940028 14494033 14092442 13736473 13427917 13169440 12963242 12809571 12706844
59836 12706844 12652974 12645890 12682839 12760228 12874534 13022230 13198116 13394482 13602422 13812797
59826 13812797 14015134 14196991 14345961 14451747 14505451 14498417 14424134 14281173 14072770 13803882
59816 13803882 13480272 13110058 12703859 12272523 11825613 11371917 10919771 10476150 10046349
59807 10046349 9634828 9245530 8881334 8544133 8235382 7955487 7702744 7474331 7268795
59798 7268795 7086604 6928137 6792028 6675493 6574966 6486167 6404868 6328438 6256160 6187896
59788 6187896 6123159 6061488 6002792 5947107 5894676 5846196 5802120 5761730 5723581 5686452 5648850
59777 5648850 5608100 5561485 5508363 5449956 5387181 5320092 5249473 5177473 5106425 5038258 4975004
59766 4975004 4918312 4868349 4824695 4788434 4761477 4743411 4731031 4721959 4717227 4719471 4730101 4749238
59754 4749238 4776993 4813453 4858222 4910948 4971508 5038999 5111562 5188013 5268786 5354502 5444299
59743 5444299 5536039 5627194 5715090 5797448 5873458 5943538 6007639 6064840 6114962 6159213 6198811
59732 6198811 6234587 6268820 6305961 6350336 6404202 6468791 6545734 6636396 6741542 6863351 7006545
59721 7006545 7175771 7372719 7597348 7851048 8136828 8457132 8813458 9207845 9642593
59712 9642593 10117762 10629661 11171241 11731777 12294578 12835050 13321964 13722592 14009959
59703 14009959 14168795 14197062 14103601 13905421 13625961 13291862 12927714 12552815 12182423 11829802
59693 11829802 11505127 11213691 10957606 10739129 10560731 10422542 10322164 10257575 10228620 10235189
59683 10235189 10275612 10347921 10451868 10588723 10759373 10963209 11198793 11465518 11764768 12099467
59673 12099467 12472306 12884514 13336470 13829170 14364886 14946852 15578559 16262814 17001041
59664 17001041 17793895 18642746 19549746 20515822 21539002 22614685 23736112 24893666 26074819
59655 26074819 27266082 28454659 29627902 30773107 31880200 32944755 33967497 34951863
59647 34951863 35903638 36832052 37748328 38661757 39577315 40495851 41413966 42322913 43209147
59638 43209147 44056914 44849668 45569414 46197227 46716575 47116475 47392012 47543926 47579223
59629 47579223 47511308 47358035 47139457 46877518 46596242 46319883 46070008 45864807 45720948
59620 45720948 45654835 45681429 45812464 46056514 46420470 46910143 47529178 48277662 49151621 50142837
59610 50142837 51238074 52418199 53658170 54927209 56187695 57393376 58489847 59418924
59602 59418924 60125019 60560444 60688865 60488310 59954369 59102166 57965027 56589390 55027975
59593 55027975 53334321 51559909 49752398 47953332 46196096 44505541 42898447 41382977
59585 41382977 39957640 38611603 37326063 36075189 34828400 33557194 32244490 30889155
59577 30889155 29502345 28100781 26703199 25329468 23998451 22724740 21517598 20382631
59569 20382631 19323273 18340613 17433018 16596959 15828401 15123626 14479124 13890983 13354750
59560 13354750 12866292 12422558 12020808 11657209 11327207 11027385 10755866 10510476 10287698
59551 10287698 10084005 9896962 9724081 9561567 9405292 9252347 9100691 8948056 8792309
59542 8792309 8632489 8468700 8301546 8132481 7963940 7798018 7635441 7476619 7323091
59533 7323091 7176930 7039396 6911249 6793842 6688678 6596224 6516204 6448814 6394538 6352996
59523 6352996 6322942 6303291 6293391 6292616 6300506 6317033 6341970 6374388 6413399 6458777 6510051 6565765
59511 6565765 6624766 6687714 6756219 6831017 6912106 7000056 7095853 7199840 7312176 7434148 7567763
59500 7567763 7714241 7874131 8048726 8240101 8449777 8678461 8927016 9196645 9488179
59491 9488179 9802197 10139517 10500310 10882806 11284039 11701767 12134423 12579132 13030834
59482 13030834 13483431 13930918 14367672 14788933 15191145 15570972 15924224 16246760 16536023
59473 16536023 16790415 17007706 17185825 17325367 17429888 17503806 17551597 17579014 17593088 17600286
59463 17600286 17606172 17617389 17642214 17688016 17759122 17857599 17984533 18139011 18316223 18507068
59453 18507068 18699011 18877208 19026360 19132960 19185915 19175256 19091737 18928763 18684253 18360304
59443 18360304 17961987 17497252 16977111 16414729 15824070 15219119 14613008 14016649 13438277
59434 13438277 12884686 12362318 11876540 11430358 11024619 10659358 10334431 10049077 9801573
59425 9801573 9589689 9411607 9266600 9154949 9076949 9031733 9017116 9030707 9071323 9139557
59415 9139557 9236907 9363972 9519334 9700647 9906866 10138646 10396033 10676480 10975665 11289309
59405 11289309 11613020 11940752 12264518 12575397 12863876 13119625 13332313 13493085 13594960
59396 13594960 13632442 13602054 13503370 13338821 13112627 12830649 12500861 12132803 11736308 11320935
59386 11320935 10895691 10468027 10043403 9626660 9223097 8837002 8469929 8122099 7794925
59377 7794925 7490403 7208503 6947413 6706436 6486587 6288039 6109099 5948224 5805019
59368 5805019 5678383 5565585 5464364 5374658 5297312 5232450 5179984 5140252 5112897 5096126 5088156
59357 5088156 5088531 5097163 5113136 5135475 5164229 5199870 5242574 5292993 5352398 5420249 5491992 5560937
59345 5560937 5622888 5678719 5733002 5791093 5857176 5933670 6021697 6122253 6237135 6368578 6517600
59334 6517600 6682442 6858810 7042601 7233238 7434279 7650597 7885899 8143676 8429208
59325 8429208 8748465 9105036 9499877 9934166 10410695 10932050 11499312 12113392 12776062
59316 12776062 13488442 14249282 15055350 15902090 16782631 17686751 18601754 19513890 20408655
59307 20408655 21271256 22088641 22851425 23553697 24191788 24764023 25271074 25715441 26100161
59298 26100161 26427693 26699145 26913833 27069579 27163338 27191189 27148226 27029697 26832758 26556850
59288 26556850 26202993 25774107 25276031 24716833 24104716 23447388 22752980 22029672 21283994
59279 21283994 20521160 19747528 18971064 18198847 17436063 16688433 15963683 15269077 14608736
59270 14608736 13984613 13398618 12852115 12344451 11873947 11440040 11043238 10683513 10359881
59261 10359881 10070836 9813942 9585605 9382594 9203486 9047615 8913231 8797904 8700226
59252 8700226 8619715 8555202 8504501 8465565 8436831 8416424 8402041 8391753 8384163 8377759 8370844 8362272
59240 8362272 8351672 8338876 8323547 8305465 8284924 8262882 8240859 8220509 8203108 8189665 8181503
59229 8181503 8180392 8188202 8206982 8239290 8287510 8352514 8433648 8530349 8643161 8773104 8920795
59218 8920795 9086361 9269256 9467745 9679169 9900895 10130228 10363365 10595340 10821013
59209 10821013 11034766 11228988 11394490 11523639 11612688 11661114 11670133 11642474 11582138 11493102
59199 11493102 11378712 11242703 11089704 10924125 10749635 10570307 10390918 10214995 10043458
59190 10043458 9876080 9713420 9556530 9405782 9261230 9123652 8994474 8875130 8766928
59181 8766928 8670826 8586890 8514879 8455840 8412272 8386403 8379414 8392688 8428419 8488378 8573418
59170 8573418 8684915 8825405 8997172 9201612 9440732 9717598 10034214 10390279 10784868
59161 10784868 11217579 11686755 12187936 12715037 13260937 13814897 14360746 14879596 15353747
59152 15353747 15767080 16103769 16349368 16493037 16527594 16448791 16256816 15958138 15564418 15089955
59142 15089955 14550872 13964854 13349066 12718180 12085171 11462530 10860776 10286715 9744854
59133 9744854 9239475 8773373 8345548 7952562 7592012 7263208 6965347 6697037 6456879
59124 6456879 6242413 6049136 5872922 5713136 5571247 5446672 5336196 5237302 5149665 5073163
59114 5073163 5006647 4949310 4901440 4863105 4833374 4811207 4796043 4787458 4785398 4790530 4803057 4821453
59102 4821453 4843845 4870423 4902968 4942307 4987784 5038879 5095407 5156184 5219441 5284687 5352374
59091 5352374 5421636 5490151 5556342 5619812 5679372 5732747 5778867 5818590 5852370 5878965 5897405
59080 5897405 5908638 5914081 5913788 5907387 5895986 5881941 5867005 5851560 5835620 5820236 5807895 5801478
59068 5801478 5802646 5811550 5828372 5854520 5891757 5940948 6002455 6076875 6164183 6263020 6372430
59057 6372430 6493852 6629835 6781128 6946383 7124228 7313920 7514509 7725514 7948444
59048 7948444 8185615 8437112 8700661 8974693 9259504 9554728 9857330 10162666 10465758
59039 10465758 10760577 11039477 11294414 11517742 11701122 11835011 11910547 11921754 11865879 11742929
59029 11742929 11555977 11311248 11016793 10681005 10312447 9920317 9514183 9103011 8694244
59020 8694244 8293367 7904041 7528718 7169078 6826147 6500751 6194211 5907967 5642134
59011 5642134 5395232 5165799 4953314 4756914 4574565 4404639 4247254 4102807 3970109
59002 3970109 3847300 3733596 3628659 3531186 3439673 3353750 3273347 3197556 3125975 3059879 3000072
58991 3000072 2944765 2891931 2842585 2798880 2759707 2721302 2682003 2643325 2606253 2569481 2531845
58980 2531845 2493683 2455120 2415752 2376823 2341091 2309472 2280092 2251670 2225511 2203131 2184246
58969 2184246 2168439 2156544 2148697 2142919 2137467 2133241 2132277 2134942 2140022 2146486 2153729 2160842 2166937 2171874
58955 2171874 2176017 2179788 2183778 2188531 2193954 2199786 2206625 2215333 2225427 2235448 2245009 2254944 2265328
58942 2265328 2275254 2284920 2295969 2308921 2321978 2333300 2343052 2352334 2361522 2370562 2379728 2389245 2399102
58929 2399102 2409677 2421538 2434446 2447849 2462417 2479494 2498931 2519320 2540644 2564597 2591756
58918 2591756 2620469 2649305 2678534 2708377 2738061 2767932 2800487 2837659 2878516 2920995 2964582
58907 2964582 3010038 3057847 3108259 3161727 3218107 3276332 3335698 3396341 3457908 3519329 3580797
58896 3580797 3644365 3711459 3781296 3852823 3926689 4003985 4084488 4167638 4254165 4345466 4442381
58885 4442381 4545751 4657093 4777395 4906028 5041922 5185183 5336843 5497984 5669809
58876 5669809 5853576 6049793 6258543 6481047 6719606 6975534 7248666 7539568 7850470
58867 7850470 8183178 8537835 8914909 9316795 9746200 10204446 10692797 11214162 11772123
58858 11772123 12369246 13007446 13688855 14415246 15187531 16006695 16874013 17789316 18749939
58849 18749939 19751700 20789262 21854477 22935484 24017709 25083879 26112369 27077751
58841 27077751 27954568 28719531 29350133 29824408 30124593 30240275 30167828 29909866 29477275
58832 29477275 28889283 28168712 27337786 26419079 25437155 24415793 23374577 22330144 21298799
58823 21298799 20294825 19327199 18400579 17518859 16685501 15901349 15164975 14475238 13831596
58814 13831596 13232266 12673946 12153189 11666568 11210136 10780558 10376581 9998012 9643824
58805 9643824 9312625 9004144 8718409 8453899 8208151 7979854 7768946 7575063 7397252
58796 7397252 7234826 7087217 6953370 6832399 6724398 6629746 6548364 6480394 6426423 6385876
58786 6385876 6356463 6336647 6327548 6330948 6346603 6373260 6411304 6462458 6527515 6606085 6698000 6803302
58774 6803302 6921404 7051929 7196120 7355910 7531797 7722782 7928214 8148811 8386311
58765 8386311 8642931 8920630 9220222 9541779 9886223 10255523 10651285 11074930 11529800
58756 11529800 12021061 12552536 13125605 13742128 14405936 15119762 15883043 16694682 17555555
58747 17555555 18465635 19420258 20411478 21431099 22469308 23511459 24538828 25531435 26467586
58738 26467586 27321791 28066426 28675805 29127833 29404230 29493255 29392812 29109294 28654117
58729 28654117 28043078 27297319 26441320 25499256 24494187 23448909 22384507 21318183 20264259
58720 20264259 19235979 18243723 17292443 16383701 15519816 14703642 13935358 13212653 12533884
58711 12533884 11898329 11303647 10746032 10223024 9733751 9276518 8848637 8448578 8075722
58702 8075722 7727864 7401471 7094693 6807931 6541106 6292385 6059808 5842260 5638660
58693 5638660 5448036 5270552 5106876 4956466 4817797 4689822 4571631 4461276 4356778
58684 4356778 4257914 4165411 4078965 3997576 3920941 3848790 3779991 3714105 3652348 3594835 3538584
58673 3538584 3481116 3424457 3372233 3323959 3275848 3226441 3177552 3130080 3082881 3035897 2990435
58662 2990435 2945818 2899329 2850198 2800233 2749839 2696920 2640900 2584525 2530254 2477725 2426143
58651 2426143 2376464 2329503 2284154 2239094 2194555 2151258 2109294 2069021 2031456 1996895 1964474
58640 1964474 1933434 1903274 1872699 1840580 1808178 1778214 1751358 1725749 1700313 1676189 1654457
58629 1654457 1634855 1617461 1603275 1592181 1582291 1572169 1562038 1552334 1542981 1534571 1528303 1524131
58617 1524131 1520656 1517121 1513754 1510151 1505522 1500701 1497598 1496219 1494312 1490261 1484240 1476594 1467592 1459029
58603 1459029 1453342 1450487 1448052 1444888 1442162 1440524 1439075 1437865 1438630 1441992 1446377 1450705 1455837 1462449
58589 1462449 1469863 1477951 1487919 1500316 1514552 1531133 1551813 1576439 1602157 1627127 1652926 1682006
58577 1682006 1714815 1750670 1789494 1831392 1876208 1924639 1978286 2037723 2101912 2170055 2242497
58566 2242497 2319649 2402013 2491390 2589899 2697549 2813065 2937199 3072507 3219734 3377636
58556 3377636 3547059 3731737 3933749 4151316 4382749 4629644 4894096 5175079 5469458
58547 5469458 5774361 6086366 6399682 6706685 6999065 7267496 7501841 7692858 7832799
58538 7832799 7914703 7933784 7890481 7790103 7638990 7443288 7211620 6955324 6684197 6404100
58528 6404100 6119761 5837206 5561989 5297433 5046069 4810504 4591511 4387588 4197874
58519 4197874 4023337 3863894 3716975 3580651 3455972 3344372 3244654 3154148 3071104 2994504
58509 2994504 2923160 2856289 2793582 2733982 2676156 2620674 2569418 2522237 2476507 2430509 2384493
58498 2384493 2337758 2288024 2235152 2182513 2132951 2085964 2040394 1997130 1957205 1919569 1882748
58487 1882748 1846879 1812722 1780552 1751049 1725090 1701745 1678888 1656646 1637590 1622588 1609345
58476 1609345 1595857 1582108 1567404 1549858 1530174 1512312 1498282 1485573 1471744 1458177 1446909
58465 1446909 1436984 1426476 1415213 1402964 1387922 1369713 1351356 1335587 1321465 1306766 1291148
58454 1291148 1274802 1256932 1238120 1221574 1209349 1199653 1190143 1181248 1173865 1166651 1158373 1150496 1144664
58441 1144664 1139901 1134759 1129912 1126265 1122884 1119067 1115853 1113370 1109656 1104479 1101062 1101191 1101792 1099452
58427 1099452 1095270 1091985 1089330 1085853 1082583 1081034 1079910 1077447 1074867 1074017 1073825 1072684 1072186 1074688 1079030
58412 1079030 1082304 1084198 1086105 1087690 1087902 1087811 1088914 1090028 1089182 1087208 1086226 1085884 1084213 1080966 1077221
58397 1077221 1072999 1067976 1063145 1059207 1054919 1049410 1044180 1040246 1035554 1028013 1018983 1010865 1003421 995462
58383 995462 988009 982652 978771 975261 972831 971670 969297 963990 958067 954533 952806 951031 950020 951228
58369 951228 953105 953259 952387 952610 953945 955667 958850 964068 968866 971089 972418 975134 977992 979112 980390
58354 980390 984876 991972 999254 1006836 1015942 1025426 1033804 1042615 1053733 1065520 1075624 1085194 1096314
58341 1096314 1107786 1117658 1127238 1138030 1147362 1152006 1153774 1156521 1159760 1160354 1158572 1157268 1156676 1154954
58327 1154954 1152410 1150643 1149184 1147398 1147667 1152035 1157894 1161754 1164917 1170428 1176972 1181374 1184936 1191367
58313 1191367 1200162 1207752 1213710 1220314 1227489 1233694 1240294 1249594 1260021 1268534 1276123 1285590 1295910
58300 1295910 1304410 1312557 1323617 1336406 1347375 1356981 1367818 1378360 1385138 1389550 1395858 1403766 1409610
58287 1409610 1413593 1419120 1426168 1432174 1438413 1448433 1460787 1470293 1476160 1482316 1490198 1497760 1505099
58274 1505099 1514348 1524232 1531215 1535876 1542094 1550461 1558625 1567302 1579560 1594772 1609615 1624280 1641625
58261 1641625 1661326 1681123 1702243 1726833 1751675 1771676 1788193 1806655 1827555 1847431 1867085
58250 1867085 1890519 1916702 1940597 1961592 1983012 2004383 2022501 2039198 2059584 2083296 2105794
58239 2105794 2127272 2151715 2178358 2203267 2228387 2259494 2295710 2330531 2362783 2397192 2434808
58228 2434808 2472745 2512682 2559177 2609731 2657071 2701491 2750468 2805901 2862453 2918830 2979658
58217 2979658 3045250 3110431 3174845 3244136 3319786 3397654 3477007 3560844 3647408 3732063 3817235
58206 3817235 3909454 4007288 4104068 4201609 4308395 4424943 4544679 4669013 4806878 4958772
58196 4958772 5116019 5276875 5448537 5632259 5821981 6019071 6232281 6461150 6695859
58187 6695859 6935988 7192583 7468862 7756127 8052248 8366640 8702617 9052245 9413333
58178 9413333 9794500 10198962 10620584 11060322 11528971 12029588 12555611 13110371 13709286
58169 13709286 14358562 15051686 15790955 16590897 17455580 18374831 19348284 20390253 21505775
58160 21505775 22686711 23937789 25280553 26724436 28260631 29892135 31641847 33523104
58152 33523104 35532129 37678821 39994404 42499632 45198477 48113281 51291886 54771530
58144 54771530 58575778 62760202 67422723 72661423 78570146 85285848 92984805 101818507
58136 101818507 111916465 123470658 136747542 151993325 169392929 189115446 211291395
58129 211291395 235982618 263410967 294208168 328842258 366038954 401621173 429488596
58122 429488596 444483184 444830520 432284741 410423558 382898022 352668175 321926815
58115 321926815 292142565 264130003 238243044 214602262 193224421 174072715 157086799
58108 157086799 142181505 129216183 117993093 108303629 99971223 92859170 86863826
58101 86863826 81910524 77948392 74939283 72830195 71516620 70864669 70827253 71503147 72934051
58092 72934051 74753214 76122863 76164923 74496392 71337672 67184077 62481366 57564975
58084 57564975 52711622 48120574 43878755 40003559 36502550 33371375 30576494 28080453
58076 28080453 25865358 23910636 22173914 20616777 19226975 17995180 16891697 15885683
58068 15885683 14967664 14134647 13370760 12659526 11998802 11387997 10815643 10273277 9766399
58059 9766399 9298581 8859265 8439320 8044064 7679098 7337517 7012521 6708334 6426746
58050 6426746 6156414 5887382 5623972 5372564 5129140 4889774 4661082 4448837 4247345
58041 4247345 4050938 3865346 3697135 3542062 3394077 3256053 3131539 3015359 2902393
58032 2902393 2796889 2703528 2617605 2533159 2452710 2380163 2312080 2244557 2181006 2124722 2071169
58021 2071169 2015625 1961211 1911607 1863252 1812447 1762993 1719158 1678025 1636227 1597249 1564730
58010 1564730 1535225 1504716 1475543 1449890 1423480 1393164 1364154 1342212 1324808 1307119 1290526
57999 1290526 1277847 1266143 1251728 1237012 1225427 1214743 1201821 1188544 1176666 1162574 1143853
57988 1143853 1125472 1112655 1102926 1091909 1081487 1075044 1069684 1060615 1049047 1038982 1030315 1021553
57976 1021553 1015133 1013385 1013040 1009981 1005698 1003232 1000919 996177 991364 989617 988718 985253 981266 980722 982841
57961 982841 984652 986577 989708 991196 988279 983594 980893 978808 974283 968650 964609 960624 954084 946792
57947 946792 941631 936786 928835 918611 908807 898966 888125 879036 874210 870957 865770 860377 857958 856871
57933 856871 854015 850994 850672 850646 846637 839841 834522 830568 824730 817387 811846 808537 805675 803989 805035
57918 805035 806356 804098 799255 796015 795212 794531 793646 793894 794290 793063 791789 792985 795075 794709 792389 790626
57902 790626 788353 782896 776090 772494 772311 771585 768730 765420 761635 755374 747214 740078 734397 728172 721616
57887 721616 717117 714842 712897 711589 712942 716151 718092 718441 719981 723826 728354 732843 738149 743882
57873 743882 748694 753127 758202 761595 759367 751537 742051 733268 724250 714326 704287 693895 681947
57860 681947 669193 657913 648548 639881 632294 627549 625596 624796 624990 627126 630361 632829 634824 638083
57846 638083 642663 647753 654453 663996 674177 681646 687065 693856 702448 710074 715853 721479 726857 729616
57832 729616 729517 729102 729219 727796 723842 719043 714509 709277 702791 695777 688214 679518 671083 665352 661902
57817 661902 657519 650643 642882 635965 630204 626038 624023 623126 622001 621859 624989 630701 636111 640638 646043
57802 646043 652252 657245 661324 667199 675127 681985 686264 690166 695503 700946 704611 706200 705533 702145
57788 702145 697365 693586 690414 684721 675613 666058 658324 651000 642097 632091 622271 612793 604003 597251
57774 597251 592831 589161 585198 581560 578352 574135 568054 560897 553420 545767 538862 533639 528516 520606
57760 520606 510161 500652 493509 486041 475797 463833 452169 441128 431006 423457 419085 415918 412135
57747 412135 408179 404699 400886 396604 393807 393854 395496 397307 399993 404365 409201 413322 418043 425309 434709
57732 434709 444314 453161 461023 466983 470215 471462 472234 473354 475442 479607 486120 493319 499130 502916
57718 502916 504893 504885 502949 500208 497703 494946 490574 483849 474861 464238 453448 444509 438339 433813
57704 433813 429047 423223 416975 411601 407995 405779 403747 401904 402306 406480 412760 418155 422326 427293
57690 427293 433373 438286 441010 443871 449490 457715 466933 476584 486744 496444 504034 508934 512377 516697
57676 516697 523764 533310 543127 551863 560845 571613 582692 591339 597966 605984 617165 630037 643097
57663 643097 656632 670561 683562 695676 709227 725693 743874 762527 782713 806005 832098
57652 832098 859520 887241 914754 942295 971716 1005250 1042596 1081141 1119653 1159410 1201127
57641 1201127 1243640 1286922 1333634 1385864 1442693 1502796 1567232 1637638 1713565 1793535 1877131
57630 1877131 1964335 2054591 2148561 2249423 2360741 2484198 2620541 2770978 2936202 3115775
57620 3115775 3310032 3520915 3749479 3994276 4253452 4526135 4809737 5097834 5382716
57611 5382716 5658271 5918541 6155889 6363679 6539409 6682223 6787678 6846896 6850220 6790504
57601 6790504 6665003 6477554 6239185 5964837 5669067 5364628 5062464 4770478 4493008
57592 4493008 4232979 3993428 3775746 3578618 3400875 3243704 3107779 2990108 2886544
57583 2886544 2795977 2719081 2654268 2598460 2551385 2515655 2492306 2479117 2473738 2475901 2485989 2503628
57571 2503628 2528430 2560500 2599790 2646402 2701660 2767359 2843883 2930517 3027584 3136754 3259148
57560 3259148 3394495 3542141 3701544 3871757 4051420 4238827 4430745 4621702 4805750
57551 4805750 4978164 5133692 5264005 5359382 5413371 5424442 5393593 5322585 5214742 5075316
57541 5075316 4910078 4724465 4524143 4314941 4101873 3889200 3681269 3481756 3291974
57532 3291974 3111284 2939500 2777795 2627210 2487567 2358086 2238040 2126623 2023175
57523 2023175 1927700 1840448 1761096 1689043 1623995 1565354 1511515 1460986 1413777 1370626 1331409
57512 1331409 1295583 1263410 1235056 1209007 1183354 1158547 1137084 1120286 1106951 1095275 1084583
57501 1084583 1074986 1066778 1060445 1056120 1052975 1050314 1049009 1050417 1054206 1058935 1064593 1072604 1083243 1095213
57487 1095213 1108324 1124535 1145387 1170081 1197127 1226553 1259378 1296085 1336748 1381857 1431993
57476 1431993 1487070 1546446 1609389 1675307 1744347 1818047 1898623 1987312 2084055 2188780 2301929
57465 2301929 2423581 2553095 2689882 2833365 2981888 3132643 3282947 3430336 3571025
57456 3571025 3699549 3810584 3900119 3964345 3998894 4000532 3969218 3907825 3820548 3712253 3588448
57445 3588448 3454450 3314259 3170549 3025616 2882003 2742419 2609300 2484316 2368163
57436 2368163 2260981 2162783 2073284 1991896 1918578 1854294 1799586 1752983 1712069 1676215 1646992
57425 1646992 1625590 1610988 1601233 1595505 1594261 1598154 1607568 1622758 1643753 1670321 1702174 1738878
57413 1738878 1779580 1823512 1871113 1924183 1984687 2053664 2131084 2216113 2307563 2404754 2508012
57402 2508012 2617773 2733485 2854075 2978930 3106999 3234798 3356456 3465821 3557485 3626086
57392 3626086 3666634 3676384 3655133 3603227 3520968 3411068 3280129 3135844 2983116 2824002
57382 2824002 2660813 2497698 2339095 2187627 2043791 1907128 1777521 1655695 1542553
57373 1542553 1438103 1341296 1250992 1166643 1088062 1015199 948456 888465 835057 786735 741587
57362 741587 698491 657408 618926 583628 551367 521197 492500 465902 442135 420318 398831
57351 398831 377984 360019 345742 332918 319175 305040 292403 281110 269136 255697 242134
57340 242134 229528 217160 203971 190305 177420 166029 155971 146753 137868 128964 120249 112547
57328 112547 106504 101740 97113 92008 87316 84790 85075 86507 86437 83929 80608 78500 77608 76208 73141
57313 73141 69053 65515 63563 63134 63353 63106 61621 58726 54565 49256 43034 36534 30547 25502 21354
57298 21354 17869 14796 11893 9108 6648 4603 2568 -110 -3630 -7436 -10611 -12594 -13599 -14389 -15509
57283 -15509 -16779 -17798 -18958 -21483 -26188 -32494 -39012 -44955 -50623 -56463 -61882 -65276 -65647 -64342 -64549
57268 -64549 -68222 -73675 -77172 -77083 -75487 -75444 -77791 -81263 -84575 -87165 -88644 -88985 -89154 -90284 -92091 -93098
57252 -93098 -92498 -90910 -89133 -87128 -84493 -81108 -76932 -71915 -66554 -61793 -57832 -53554 -47597 -39495 -29295
57237 -29295 -16864 -2496 12182 25157 36215 47572 61963 80453 102353 126824 154004 184579
57225 184579 218632 255224 293060 331407 370296 410065 450956 493143 536810 581911 627856
57214 627856 673531 717665 759101 796697 828896 853623 869008 874615 871851 862823 848707 829316
57202 829316 804140 773538 738944 702254 665063 628291 592429 558028 525598 494927 465201
57191 465201 436401 410014 387342 367459 348187 329151 312411 299497 289224 279472 269935 261754
57179 261754 255157 249099 243077 237931 234696 233688 234852 238000 242474 247480 253074 260194 269524 281006
57165 281006 294574 310502 328608 347762 366742 385283 404017 423701 444659 466696 489288
57154 489288 511962 534577 557456 581613 608727 639885 673834 707518 739333 771078 805584
57143 805584 843338 882873 923573 965859 1008897 1050587 1090333 1129720 1169733 1209254 1247347
57132 1247347 1285213 1324436 1364673 1404499 1443546 1482447 1521352 1559699 1597068 1633488 1669316
57121 1669316 1705259 1741843 1778655 1815061 1851809 1890587 1931495 1972357 2011109 2047539 2082158
57110 2082158 2115085 2146856 2178662 2210809 2242462 2273769 2306486 2341472 2377284 2412336 2446546
57099 2446546 2479710 2510477 2538558 2565839 2593527 2620189 2644450 2667306 2689409 2708067 2719733
57088 2719733 2723900 2721954 2713565 2696899 2671136 2636215 2591113 2534730 2467258 2388402 2295490 2185533
57076 2185533 2057662 1911359 1744244 1554329 1342662 1110918 858116 582426 284083
57066 -36623 -382277 -755955 -1158278 -1590387 -2057887 -2568208 -3126344 -3736985 -4408364 -5149631
57056 -5149631 -5966720 -6865225 -7854966 -8947434 -10151716 -11477932 -12941606 -14559452 -16344211
57047 -16344211 -18309302 -20474616 -22861339 -25485418 -28363522 -31521384 -34989001 -38793007
57039 -38793007 -42962268 -47535098 -52552539 -58055165 -64103871 -70802123 -78287668 -86706733
57031 -86706733 -96194104 -106838977 -118627991 -131431846 -145074774 -159377223 -174058084
57024 -174058084 -188635191 -202599791 -215821935 -228721838 -241877379 -255377183 -268556050
57017 -268556050 -280320850 -289658726 -295870004 -298508983 -297297045 -292142607 -283196546 -270863686
57009 -270863686 -255766744 -238665203 -220329920 -201427824 -182486310 -163928147 -146104750
57002 -146104750 -129294224 -113691564 -99412523 -86501517 -74940642 -64670534 -55614765
56995 -55614765 -47686459 -40781777 -34784236 -29580945 -25069915 -21155539 -17749298 -14777827
56987 -14777827 -12183463 -9916406 -7932821 -6199473 -4691306 -3382424 -2244491 -1253352
56979 -1253352 -390771 360258 1015918 1587620 2083993 2516929 2900462 3244235 3553657
56970 3553657 3835836 4099337 4348298 4582553 4803533 5014548 5215366 5401980 5571874
56961 5571874 5724645 5858013 5968962 6059014 6133282 6194279 6241531 6276810 6304127 6324407 6335271
56950 6335271 6335994 6327527 6307987 6273675 6224441 6162783 6088613 6001498 5907534 5816556 5732429 5654324
56938 5654324 5587790 5542444 5511620 5462054 5353151 5165784 4909826 4609450 4287843 3962583
56928 3962583 3646289 3347375 3071255 2821252 2597960 2399465 2223686 2069261 1933458
56919 1933458 1811510 1699530 1596323 1501451 1413702 1332540 1258629 1191662 1129986 1073526 1024536
56908 1024536 984049 949983 920313 895799 878058 867064 862052 862864 868914 878650 891277 907228
56896 907228 925845 944395 960064 970863 974226 967614 951679 930131 905299 876392 843227 808652
56884 808652 775610 744528 715391 689752 668650 650975 635966 625248 620472 620935 625239 633265
56872 633265 644885 658963 675286 694861 716098 733044 739921 735733 722565 701770 674438 643433
56860 643433 611708 579709 546974 515213 487327 464271 444942 428244 413320 398946 384816
56849 384816 372423 362736 354054 344185 333655 324768 318492 314219 311593 310430 309659 308417 307581 308360
56835 308360 310094 311206 311579 312164 312843 312459 310451 307053 302535 297524 293077 289018 283307 274537 263795
56820 263795 252574 240591 227909 217590 213266 214739 218603 222703 227482 233521 240609 249375 261184
56807 261184 275979 292321 309983 330467 354562 381411 410664 443807 482230 524787 567514
56796 567514 604805 631167 643645 643476 634655 620639 603075 583267 563265 545051 529706 517907
56784 517907 510609 508814 512986 522716 536955 555145 578517 609444 648927 695721 748585 807757
56772 807757 872275 936598 991877 1030716 1049818 1049121 1030684 998596 958040 913469 868144 824975
56760 824975 786402 753303 725258 702109 684521 673154 668215 669721 677317 690053 707202 728971
56748 728971 755581 786097 819037 853101 885729 911690 925332 924639 911828 890174 861814 828537
56736 828537 792613 756065 720408 687569 659682 637350 619275 604252 592585 585038 581506 581465
56724 581465 584833 591505 600626 611183 622910 635751 648404 658080 662016 659169 650322 636710 618943
56711 618943 597526 573902 550108 527417 506184 486981 470652 456807 443620 430019 417098
56700 417098 406427 397997 390923 385128 380847 377154 372591 367146 362410 359860 359757 361277 362787 362588
56686 362588 360526 358363 357492 356871 354446 350003 345289 341795 339913 339777 341163 342603 342217 339724 336538
56671 336538 333958 332227 331119 330153 328498 325983 323910 323422 323349 321298 316874 312168 308987 307218 306111
56656 306111 305438 304820 303379 300734 297396 293898 290652 288712 289115 290993 291726 289677 285713 281531 277613
56641 277613 273423 268629 263448 258526 254878 253009 251755 249026 244222 238996 235135 232666 230708 229251
56627 229251 229164 230963 234346 238719 243597 248480 252636 255136 255485 254609 254840 258167 264538 272324 280096
56612 280096 287173 292906 296629 298555 299826 301457 303722 306398 309005 310995 312406 314030 316231 318014
56598 318014 318154 316927 315797 315749 316703 317961 318226 315902 310740 304559 299006 293342 286123 278327 272666
56583 272666 270087 269137 268686 269048 270117 270715 270443 270279 270664 270716 270002 269332 269181 269040 269016 270264 272897 275107
56565 275107 275427 274461 273445 272457 271072 269565 268475 268014 268618 270939 274575 278000 280399 282338 284161
56550 284161 285269 285777 287210 290432 294174 296725 298003 299078 300878 304168 309342 315119 318767 318851 316760
56535 316760 314638 313064 311763 311083 311324 311699 311414 310994 311452 312910 314872 316853 318029 317685 316848 317819
56519 317819 320873 323175 322570 320713 320513 322069 323429 324140 325363 327189 328539 329673 332347 337141 342624
56504 342624 347592 352513 358289 364989 372224 379677 386898 393574 400182 407447 415067 421833 427022 430839
56490 430839 433617 435571 437260 439325 441639 443520 444812 446042 447528 448943 449700 449321 447725 445613 444073
56475 444073 443146 441427 437823 433025 428322 423678 418237 412163 406596 402091 398460 395887 394724 394107 392338
56460 392338 389081 385981 384524 384261 383762 382469 380759 378635 375304 370324 364669 360177 357832 356906 355962
56445 355962 354296 351928 348730 344569 340233 336983 335022 333469 332132 331994 333412 335085 335630 335160 334521
56430 334521 333989 333596 333776 334672 335607 336080 336449 336898 336750 335838 335533 337273 340823 344992 349230 353524 357560
56413 357560 361035 364046 366341 367373 368025 370856 377117 384748 390883 395264 399394 403594 407141 410651
56399 410651 415875 423073 430485 436603 441456 445630 449328 452463 454669 455505 455558 456568 459177 461407 461062
56384 461062 458884 457457 457467 457202 455527 453204 450986 448351 444816 441077 438128 436108 434401 432335 429743
56369 429743 427247 425561 424203 421926 418972 417297 417395 416729 413228 408622 405883 404725 402656 399580 398060
56354 398060 399231 401577 403838 406149 407916 407681 405939 405335 406828 407986 406257 402005 397252 393274 390431
56339 390431 388715 387368 385352 382883 381129 380027 378161 375278 373061 372761 373914 376032 379556 384219
56325 384219 388484 391783 395655 401488 408507 414968 420032 423732 426566 429803 434498 439498 442232 442421
56311 442421 443102 446792 452383 457057 459600 460472 460321 460174 461818 466136 471803 476914 481082 484890 488311
56296 488311 491044 493539 496385 499267 501579 503488 505502 507662 510012 513186 517795 523738 530528 537467
56282 537467 543121 545856 545738 545040 546164 549688 554714 560110 564976 568953 572665 577049 582120 587351 593127
56267 593127 600326 608488 616161 623326 631613 641751 652763 664204 677049 691539 706256 720330
56255 720330 734620 749598 764145 777761 791931 807710 823637 837638 849524 860060 869145 876582
56243 876582 883339 890392 897289 903212 908376 913257 917670 921734 926393 931823 936762 940624 944803 950620
56229 950620 957605 965243 974873 988190 1005182 1024924 1047008 1070818 1095066 1119749 1147087 1178739
56217 1178739 1213461 1249234 1286324 1326493 1370532 1418462 1470832 1527818 1588230 1651434 1719274
56206 1719274 1794250 1876773 1966036 2062547 2167875 2282788 2407553 2543222 2690860 2850213
56196 2850213 3020657 3202613 3396512 3601407 3816067 4040211 4272950 4511046 4750281
56187 4750281 4987316 5218692 5439463 5644708 5831040 5994903 6131058 6235143 6306659 6347403
56177 6347403 6358367 6340448 6296876 6232275 6150015 6052524 5943066 5824772 5698748 5565395
56167 5565395 5426718 5285195 5141425 4995135 4847426 4699569 4550575 4398518 4243470
56158 4243470 4086806 3928744 3769247 3610510 3455766 3306119 3160882 3020224 2884934
56149 2884934 2754526 2628351 2507903 2395340 2290494 2192105 2101119 2019532 1946482 1878689
56139 1878689 1814566 1754914 1699840 1648264 1600541 1558363 1521594 1487988 1456404 1427795 1402630
56128 1402630 1379921 1359218 1341316 1326578 1314568 1305449 1299672 1296318 1293825 1292237 1292749 1295368 1299159
56115 1299159 1304393 1312035 1321480 1331214 1341470 1353970 1369331 1387010 1407181 1430310 1455378 1480972
56103 1480972 1507493 1535808 1564594 1591684 1617070 1641725 1664668 1684626 1703597 1724837 1747813
56092 1747813 1769054 1787765 1806747 1827814 1850317 1874485 1902424 1935234 1972667 2016055 2068065
56081 2068065 2129083 2197239 2272493 2357365 2453502 2561122 2682100 2819742 2974809 3145262
56071 3145262 3330162 3529607 3739771 3951952 4158048 4354127 4538274 4709012 4867361
56062 4867361 5017013 5160532 5297008 5423125 5533316 5619058 5672271 5690767 5678009 5638024
56052 5638024 5574107 5491430 5395279 5285596 5157742 5009779 4844922 4666564 4476129 4277336
56042 4277336 4077662 3883437 3697312 3521746 3360500 3214916 3082834 2962942 2856474
56033 2856474 2763544 2681984 2610838 2550546 2498615 2450096 2403684 2362385 2326680 2292444 2257517
56022 2257517 2224783 2196392 2170309 2145213 2123459 2106174 2090488 2074813 2062065 2054430 2049558 2045154
56010 2045154 2042807 2044055 2047173 2051184 2058662 2071115 2085622 2099257 2113011 2128525 2145044 2162258
55998 2162258 2181889 2204049 2226476 2249645 2277501 2310653 2344370 2376135 2409465 2447082 2486387
55987 2486387 2525350 2566845 2612951 2660670 2707574 2756188 2808668 2862873 2917934 2977584 3043304
55976 3043304 3110374 3175824 3244206 3320008 3400297 3480683 3562740 3649375 3738379 3827126 3918858
55965 3918858 4018053 4123905 4234008 4349952 4473876 4604261 4740368 4885886 5043190 5209306
55955 5209306 5382213 5565040 5759214 5960335 6166266 6382143 6611706 6851494 7099887
55946 7099887 7363464 7647000 7945343 8253105 8574346 8914426 9270590 9639571 10026398
55937 10026398 10436414 10866545 11314015 11785762 12289675 12824845 13390353 13994954 14647659
55928 14647659 15347676 16094169 16896204 17761635 18686312 19666500 20711593 21832006 23025975
55919 23025975 24292233 25643924 27094924 28644697 30292951 32056816 33956240 35995670
55911 35995670 38179055 40529583 43074901 45827616 48802637 52039583 55586212 59477896
55903 59477896 63761231 68523565 73875395 79925307 86800759 94666174 103682297 113974233
55895 113974233 125684116 139033668 154302120 171794712 191893782 215079062 241801722
55888 241801722 272373838 306991249 345497556 386466952 426194552 459007978 479408172
55881 479408172 484601982 475399683 455039511 427322641 395487903 361994406 328614727
55874 328614727 296511931 266368871 238575986 213345707 190735997 170679382 153030318
55867 153030318 137576465 124040270 112132716 101621176 92332584 84113820 76824760
55860 76824760 70357716 64626936 59539758 55001623 50942237 47312128 44058402 41125056
55852 41125056 38470288 36061534 33858338 31820258 29927369 28174624 26550287 25036648
55844 25036648 23626081 22317596 21100523 19958152 18884538 17882155 16945746 16063503
55836 16063503 15231855 14454655 13729399 13047453 12406289 11808997 11253131 10731390 10241439
55827 10241439 9784119 9354132 8943387 8551614 8183467 7837529 7508275 7196081 6904561
55818 6904561 6630204 6365251 6109022 5866255 5636049 5412701 5196018 4990637 4796077
55809 4796077 4607261 4424116 4251114 4087774 3928875 3773818 3626908 3488503 3354649
55800 3354649 3225688 3106780 2999436 2900443 2809631 2730887 2664331 2604374 2546505 2489848 2432831
55789 2432831 2372795 2310557 2249602 2190503 2131453 2073820 2021270 1973637 1927424 1882233 1841230
55778 1841230 1805570 1773646 1745214 1720891 1698314 1674340 1650331 1629889 1612368 1594136 1574910
55767 1574910 1556780 1538011 1514308 1485738 1456306 1427181 1396427 1364757 1335003 1306133 1274431
55756 1274431 1240819 1210575 1185329 1161540 1137359 1114764 1094229 1073583 1053290 1036906 1024980
55745 1024980 1014089 1003049 994466 988999 983790 978170 975389 976690 978697 978607 977293 975490 971556 965027
55731 965027 958127 951835 944260 934410 923761 912765 899836 885124 871371 859714 848511 837485
55719 837485 828883 823237 818130 812656 808842 806919 803217 794927 783389 770716 756560 740203 722668
55706 722668 704755 685803 666059 647624 631748 617839 606054 597651 591653 584514 574539 563597
55694 563597 553183 542110 529626 517609 507731 499069 490202 481184 472163 462618 453257 446005 440805
55681 440805 435013 427221 419043 411868 404553 395875 386797 378777 371890 365907 361372 358645 357725 359300
55667 359300 363604 368030 368766 365410 361097 357546 353173 346935 340612 335847 331919 327947 324579 322173
55653 322173 319833 317409 315801 314345 310856 305521 301759 301792 304142 306811 309897 313526 316296 317713 319422
55638 319422 322020 323315 321790 319325 318333 318492 318471 318780 320609 323551 326664 330391 335525 341533 347478
55623 347478 353439 359730 365964 371951 378158 384347 389218 392129 393655 393918 392228 388913 385441 382205
55609 382205 378435 374774 373267 373899 373771 370894 366452 362401 359425 358332 360559 365704 371038 375036 379117
55594 379117 384642 390761 396624 402981 409842 415103 417399 418029 418282 417200 413787 409116 404342 398792 391908
55579 391908 384881 378492 371495 362998 354257 346173 337242 326087 313936 302511 291524 280399 270393
55566 270393 262648 255857 248139 239711 231730 224164 216741 210338 205506 201237 196901 193517 191432 188904
55552 188904 184925 181199 179144 177246 173896 170682 170046 171449 172608 172964 173250 173129 171953 170606 170165
55537 170165 170075 169864 170852 173595 175562 174452 172264 172816 176320 179625 180845 180526 178997 175956 172497 170529
55521 170529 170205 170394 171373 174396 178743 181869 182783 183295 185901 192092 202139 214562 226392 236036 245440
55506 245440 257459 271939 286758 301790 318911 338236 357105 372948 384819 392021 393712 390422
55494 390422 383931 375128 363449 348593 331358 312884 294537 278111 264342 251573 237729 223406
55482 223406 211160 201988 194494 187401 180839 175079 169928 165644 162809 161144 159886 159275 160145 162214
55468 162214 164381 166542 169408 172674 175147 176701 178396 180466 181855 181946 181375 180976 181114 181971 183223 183628
55452 183628 182201 179562 176896 174091 170389 166217 162612 159244 154991 150276 146851 145225 144047 142099
55438 142099 139219 135360 130581 126113 123554 122595 121108 117776 113183 108147 102617 96700 91261 86931
55424 86931 83510 80671 78278 75867 72807 69114 65238 61194 56876 53019 50822 50688 52179 54796 57892
55409 57892 60439 62034 63555 65711 67646 68214 67703 66813 64920 61156 56376 52196 48833 45908 44503
55394 44503 45959 49106 51171 51275 50799 50572 50199 49993 50863 52066 51735 50085 49488 50740 51798 51203 50355
55377 50355 51121 53097 54588 54820 54136 53213 52887 53575 54347 53802 52137 50932 50810 51074 51710 53613 56335
55360 56335 57925 57791 57558 58094 57951 56055 53874 53220 53589 53502 53141 53761 55355 56672 57079 57000 56811 56398
55342 56398 55623 54567 53583 53410 54530 56149 56720 55882 54921 54930 55688 56797 58591 61057 63081 63815 63863 64113
55324 64113 64225 63282 61354 59491 58641 59257 61410 64541 67429 69028 69144 68050 65932 63045 59955 57332
55308 57332 55704 55276 55469 54921 52814 50038 48192 47715 47995 48895 50604 52101 51609 49030 46411 45439
55292 45439 45861 46828 48182 49616 50125 49454 48986 49951 51588 52134 51074 49499 48645 48846 49545 49792 49000
55275 49000 47510 46120 44947 43296 40670 37363 34147 32008 31873 33563 35211 34905 32961 31482 31741
55260 31741 33245 35228 37566 40003 41923 43216 44201 44588 43852 42545 41618 40478 37755 34214 32595
55245 32595 33861 35783 36337 36392 37598 39593 41062 41995 42901 42945 40979 37868 35967 36389 38165 39957
55229 39957 41432 42912 44638 46569 48421 49807 50439 50008 48167 45338 43369 44201 47633 51456 53988
55214 53988 55423 56466 57031 56826 56023 54706 52714 50513 49168 49014 49413 50076 51306 52661 52956 52079
55198 52079 51253 50981 50460 49664 49984 51744 52977 52073 50016 48591 47952 47471 47522 48615 49994 50758 51349
55181 51349 52241 52276 50204 47124 45532 46270 47873 48559 47628 45384 42955 41677 41555 40942 38911 37192
55165 37192 38378 42640 47462 50240 50191 48318 46525 46242 47037 47260 46706 47330 50171 53042 53140 50984 49787
55148 49787 51494 55293 59581 63386 65875 66388 65501 64948 66078 69000 72924 76543 78381 77820 75673
55133 75673 73120 70607 68375 67055 66744 66411 65427 64719 65110 65570 64745 63269 62691 62964 63127 63781 66279
55116 66279 69515 70186 66976 62499 60155 60626 62213 63137 62553 60442 57530 54873 53057 52229 52716 54581
55100 54581 56557 56732 54703 52101 50605 50390 50796 51368 51652 50936 49036 46926 46047 47242 50356 54206
55084 54206 56795 56517 53770 50951 50250 51644 53345 53915 53601 53722 55153 57535 59798 61153 61453 60906
55068 60906 59914 58983 58305 57552 56648 56411 57558 59401 60771 62071 64772 68749 72005 73672 75303 78122
55052 78122 80979 82552 83738 85963 88640 90502 92206 95160 98569 100237 99943 99546 99848 99757 98734 97756
55036 97756 97334 96631 95229 94035 93763 94124 95206 98005 102575 107009 109361 109671 109232 108666 107699 106261
55020 106261 104852 103882 103279 102886 103137 105017 108903 113439 116395 116996 116448 115665 113869 110609 107748 107585
55004 107585 109815 112223 113794 115096 116111 116010 115083 114663 114865 114435 113127 112149 111756 110546 107933 105386
54988 105386 104293 104318 104733 105534 106195 105123 101864 98441 97120 97985 99900 102540 105852 108638 109428 108320
54972 108320 106579 104939 103548 102965 103717 105150 106090 106553 107557 109114 109634 107728 103921 100264 98764
54957 98764 100251 104068 108414 111424 112573 113108 114748 117685 120172 120546 119411 118945 119859 120317 118695 116257
54941 116257 115557 116914 118364 118999 120233 123201 126734 128969 129686 129819 129704 129007 127724 126063 123768 120628
54925 120628 117428 115375 114582 113907 112451 110669 109815 110631 112792 115469 118155 120809 123298 125153 126131
54910 126131 126706 127694 129718 133258 138451 144228 148373 149584 149071 149089 150285 151798 153540 156685 161816
54895 161816 168263 175631 184366 194165 203425 211288 218987 228069 238324 248702 259536 272442 288306
54882 288306 306424 325578 345053 364481 383284 400521 415078 425915 432144 432897 427547 416562
54870 416562 401871 385684 368947 351479 333267 314754 296034 276980 258374 241976 229152
54859 229152 220166 214652 211668 209319 205854 201642 198824 198507 199497 200366 201382 203529 206784 210554 215011
54844 215011 220934 228687 238142 249132 261409 274761 289646 306898 326166 345412 362625 377246
54832 377246 389153 397077 399123 394540 384251 369988 353396 335472 316424 296562 277394 260866
54820 260866 247104 234201 220999 208825 199414 192323 185782 179121 172728 166245 158713 150455 143286
54807 143286 138578 136177 135317 135494 136193 136727 136771 136490 135972 135076 133984 133326 133539 134335 134847 134197 132237 130034
54789 130034 129151 129985 131201 131359 130611 130100 130056 129452 127375 123977 120111 116789 114945 114841 115557 115688 114795
54772 114795 113576 112509 111074 108735 106038 104051 103049 102472 102137 102653 104263 106025 107054 108260 111571
54757 111571 117099 122275 124635 124539 124018 123805 123149 122167 122433 124817 128447 132548 137834 145025 153130 160401
54741 160401 166265 171306 176010 180669 186101 193215 201898 211184 220528 230315 241197 253569 267732
54728 267732 283999 302367 322232 342473 361936 380083 397138 413211 427220 437144 441479 440121
54716 440121 434009 424634 413852 403188 392818 381820 369765 357587 346727 338010 331388 326006
54704 326006 320468 313960 307398 302669 300565 300397 301656 304800 310061 316830 324764 334179 344706 355053
54690 355053 365196 377584 394827 416826 441164 465579 489210 512265 535598 559954 584678
54679 584678 607568 626562 640708 648941 649362 641092 625862 606404 583994 558845 531955 504874
54667 504874 478045 451043 424270 399027 375879 354170 333291 313576 295928 281212 269709
54656 269709 260504 251848 242839 234250 227024 220730 214502 208703 204323 201211 198190 194644 190839 187059
54642 187059 183552 181085 180442 181538 183733 186450 188661 188760 186316 183206 181486 180846 179838 178816 179352
54627 179352 180957 180929 178102 174731 173708 175413 178218 180800 182927 184893 187093 189668 192065 193547 194498
54612 194498 196515 200674 206217 211392 215262 218525 222853 229391 237473 244921 250053 253292 256408 260593
54598 260593 265840 271699 277797 283959 290587 298500 307543 315950 322179 326929 332259 339207 347537 357207
54584 357207 368308 379869 390655 401510 415228 433486 455095 477727 500277 523239 547784
54573 547784 574775 603598 631715 656227 675878 690526 699065 699630 692119 678790 661770 641341
54561 641341 617262 590343 561927 533047 504864 478864 455817 435429 417503 402361 389562
54550 389562 377426 364696 351715 339319 327730 317311 309064 303190 298118 292267 286028 280731 276283
54537 276283 271290 265297 259492 254890 250930 246326 240723 234919 229683 224854 219864 214911 210990 208452
54523 208452 206088 202322 197044 191467 186353 181303 175826 170276 165517 162288 160867 160635 160121 158442 156509
54508 156509 155739 155632 154049 150166 145759 143035 142399 143001 144294 146190 148551 151383 154904 158809 162053
54493 162053 163783 163846 162235 159068 155558 153797 154786 157608 161220 165970 172437 179706 185984 190457 193625
54478 193625 196256 198890 202058 206280 211950 219418 228712 238996 249172 259399 271027 284419 297849
54465 297849 309386 318987 327836 336452 344530 351930 358541 363471 365480 364155 359888 352980 343550 332175
54451 332175 319882 307547 295630 284113 272324 259424 245779 233357 223952 217294 211539 205286
54439 205286 198539 192149 187043 183713 181694 179727 176884 173385 170018 167306 165589 165119 165301 164507 161624
54424 161624 157421 153621 151105 149790 149618 150479 151489 151620 151143 151353 152707 154100 154340 153610 153139 153917
54408 153917 156025 158845 161659 164165 166544 169059 171717 174318 176547 177919 178194 177999 178450 179743 180726
54393 180726 180371 179124 178133 177651 177008 175897 174795 174146 173694 172710 170549 167109 163042 159284 156109 153000
54377 153000 149687 146761 144869 143970 143971 145352 148214 151185 152422 151625 150123 149060 148387 147649 146758 145698
54361 145698 144296 142801 142173 143304 146147 149866 153558 156581 158510 159305 159599 160516 162807 166180 169698
54346 169698 172954 176492 180820 185481 189673 193425 197326 201216 204179 206058 208006 211008 214625 217775
54332 217775 220182 222449 225092 227912 230054 230483 228963 226727 225550 225909 226624 226427 224948 222041 217382
54317 217382 211387 205401 200184 195180 190016 185708 183282 182129 180835 178889 176494 173557 170228 167741
54303 167741 167193 167763 167529 165871 163893 162726 162654 163632 165216 166065 165003 162857 162001 163800 167509 171754
54287 171754 175825 179164 180980 181206 181002 181532 182778 184052 185155 186406 187894 189275 190273 191140 192587
54272 192587 195125 198218 200326 200178 197948 194772 191350 187510 182953 177857 172801 168579 165870 164493
54258 164493 163170 160655 157041 153413 150485 148256 146738 146018 145539 144167 141330 137611 134076 131444 129853
54243 129853 128875 127715 125846 123491 121233 119340 117841 116797 115907 114294 111596 108928 107855 108482 109454
54228 109454 109723 109482 109356 109671 110504 111586 112095 111486 110589 110955 112943 115307 116778 117152 116722 115753 114879
54211 114879 114984 116102 117199 117498 117286 117036 116624 116024 115993 117177 119027 120371 120943 121743 123933 127632 131680
54194 131680 134477 135269 134693 133858 133089 132042 130863 130371 130903 131768 132183 132071 131531 130120 127225 122908 118140
54177 118140 114410 113036 114171 116364 117791 118235 119120 121270 123530 124246 123393 122433 122533 123835 126109 129119
54161 129119 132200 134321 134979 134658 134216 134128 134482 135350 136718 138146 138933 138837 138397 138188 137916 136769 134758
54144 134758 133011 132381 132464 132681 133673 136411 140145 142558 142335 140520 138909 138057 137537 137232 137329 137470 136947
54127 136947 135579 133707 131537 129264 127626 127282 127597 127154 125845 125410 127070 129499 130320 129105 127587
54112 127587 126994 126656 125647 124309 123166 121523 118547 115007 112482 111205 110244 109612 110465 112930 115372
54097 115372 116466 116630 116738 116714 116263 115721 115252 114331 113035 112642 113756 114929 114571 113236 112502 112403 111732 110248
54079 110248 108722 107157 104904 102514 101598 102555 104022 104908 105415 105646 104826 102594 99799 97259 94888 92784
54063 92784 92067 93619 96592 99173 100512 101186 101864 102060 100489 96681 92010 88554 86928 86092 85642 86829
54047 86829 90300 94215 96347 97025 97817 98139 95937 91689 88792 89152 90871 91464 91106 91253 92095 93197
54031 93197 95063 98031 100620 100950 99366 98175 99112 102072 105781 108648 109578 109012 108632 109170 109302 107694
54015 107694 105231 103921 104355 105607 107043 108692 110249 111275 112270 114146 116591 118220 118417 117898 117387
54000 117387 116900 116576 117050 118556 120446 121973 123007 123761 124486 125610 127632 130594 134132 138044 142367
53985 142367 146838 150926 154575 158315 162377 166108 168629 169835 170492 171516 173356 176076 179848 185097
53971 185097 191950 199653 207031 213709 220537 228655 238458 249600 261413 272915 282906 290733 296952
53958 296952 302907 309701 317585 325908 333384 338827 342086 344085 345879 348029 350951 354939 359188 361504
53944 361504 360003 355106 349161 344146 340285 336762 333030 329069 324765 319614 313285 306393 300376 296236
53930 296236 293538 290987 287779 283871 279173 273531 267728 263412 261285 260023 257744 254140 250456 247784
53916 247784 246172 245328 245331 246281 247565 247891 246278 243083 239768 237451 236001 234976 234909 236629 239443 241222
53900 241222 240771 239200 238426 239007 240018 240524 240621 241303 243451 246596 248816 248646 247069 246597 248269 250702
53884 250702 252417 253743 255703 258186 260202 261304 262067 263824 268286 276424 287066 297484 305892 312521
53870 312521 318021 322285 325539 328960 332983 336294 337732 338008 338329 338603 338326 337961 337885 337312 336088 336348
53854 336348 340177 346474 352370 357141 362470 369353 377155 385705 395862 407672 420018 432438 445307
53841 445307 457846 468006 475026 480399 485565 490210 493514 495521 496501 496363 495489 494898 494792 494082 491938
53826 491938 488575 483929 476964 467203 455819 444380 433551 423685 415389 408481 401493 393258 384134
53813 384134 374898 365559 356300 348348 342320 336509 328506 318312 308361 300502 294193 287895 281106 274597
53799 274597 269292 265401 262237 258535 253176 245964 237900 230678 225617 222695 220613 218152 215337 212894
53785 212894 210896 208745 206361 204320 202565 200132 196723 193601 192124 192044 192066 191494 190490 189205 187655
53770 187655 186255 185513 185176 184448 183165 182139 182076 182652 182943 182402 181120 179396 177497 175945 175566 176710
53754 176710 178467 179366 179242 179821 182740 187425 191798 194901 197698 201123 204614 207279 209606 212942 217666
53739 217666 222809 227506 232092 237514 244124 251335 258228 264271 269486 274259 279231 285261 292904 301620
53725 301620 309783 315921 319828 322276 324041 325645 327627 330294 333222 335566 336875 337288 337118 336742 336553
53710 336553 336411 335422 332938 329533 326319 323745 321875 321231 321924 322322 320293 316014 311956 309571 307568
53695 307568 304243 300046 296566 294038 291335 287934 284593 282023 279827 276954 272856 268150 264147 261465
53681 261465 259161 255845 251621 248042 246006 244717 243166 241458 239916 237908 234613 230360 226249 222959
53667 222959 220724 219850 220282 221120 221602 222235 224016 226700 228819 229294 228248 226335 224174 222397 221466 221239
53651 221239 221262 221537 222496 224300 226682 229425 232495 235814 239327 243038 246498 248720 249443 250211 253066 258054
53635 258054 263044 266372 268796 272251 277396 283083 287802 290855 292300 292599 292651 293649 296292 300098 303795
53620 303795 306595 308911 311659 314945 317750 318961 318544 317661 317676 318966 320579 321218 320730 320336 321055 322343
53604 322343 322995 323041 323681 325233 326372 325953 324509 323101 321520 318852 315344 312441 310943 310146 309058 307575
53588 307575 306089 304699 303383 302501 302544 303477 304739 305863 306874 308098 309826 312156 314861 317285 318630
53573 318630 318708 318368 318711 319778 320475 320155 319798 321038 324281 328539 332974 337655 342532 346643 349082 350402
53557 350402 352360 356273 361977 368259 373983 378842 383314 388075 393456 399371 405454 410979 414953 416891
53543 416891 417547 418445 420638 424264 429170 435275 442225 449298 455997 462323 468380 474273 480505 487842 496287
53528 496287 504552 510961 514802 516760 518309 520584 523502 526022 527668 529496 532881 537552 541798 544666
53514 544666 546879 549347 551764 553285 553781 553785 553734 553721 553621 553206 552551 552294 552787 553172 552319 550766 550455 552232
53496 552232 554899 557119 558791 559994 560301 560185 561515 565087 568983 571065 572136 574718 579281 583633 585969
53481 585969 586907 588331 591496 596319 601505 605375 607481 609306 612601 617476 623014 629046 635865 642765
53467 642765 648674 654160 661084 670122 680208 690637 702018 714691 727842 741053 755383 772007
53455 772007 790828 811187 832780 854955 876267 896045 915714 937378 961532 987170 1013661
53444 1013661 1041150 1069199 1096445 1122197 1147620 1174751 1204658 1236902 1270424 1304429 1338524
53433 1338524 1372587 1406852 1441889 1478093 1515175 1552365 1589102 1625278 1660940 1696194 1731366
53422 1731366 1766617 1801264 1834139 1865054 1895337 1926511 1958919 1992019 2025295 2058269 2090247
53411 2090247 2120891 2150646 2179915 2208309 2235393 2261555 2287224 2311872 2334804 2356292 2376585
53400 2376585 2394343 2407707 2416847 2423785 2429612 2433431 2434364 2432856 2429248 2422646 2412312 2399045 2384073
53387 2384073 2367465 2348811 2328779 2308808 2289460 2269875 2248649 2224692 2197707 2168550 2138873
53376 2138873 2109814 2081272 2052805 2024552 1996631 1968370 1939325 1910782 1885013 1862912 1843316
53365 1843316 1824916 1807884 1793104 1780674 1770084 1761476 1755627 1752451 1750420 1748144 1746143 1746277 1749459
53352 1749459 1754700 1760537 1766670 1773754 1782385 1793109 1806981 1825014 1846985 1871490 1897298 1924124
53340 1924124 1952133 1981534 2012764 2046280 2081765 2118226 2155406 2194653 2237739 2285076 2335578
53329 2335578 2388209 2443088 2500893 2561560 2624069 2687693 2753040 2821276 2892398 2964959 3037718
53318 3037718 3110811 3184796 3259364 3333807 3408057 3482044 3554409 3623248 3688265 3751009 3812611
53307 3812611 3872254 3928219 3979558 4026306 4068820 4107357 4141628 4170363 4191964 4206025 4213625
53296 4213625 4215772 4212239 4202283 4185772 4162975 4133910 4098644 4057872 4012586 3963418 3910747 3855117
53284 3855117 3797023 3736618 3674161 3610592 3547108 3484215 3421518 3358520 3295436 3233249 3172949
53273 3172949 3114626 3057510 3001195 2946419 2893886 2842535 2790072 2735591 2680860 2628547 2579945
53262 2579945 2534860 2492811 2453397 2416042 2380396 2347019 2317010 2290813 2267621 2245822 2223830
53251 2223830 2200814 2176980 2153092 2129671 2107023 2085877 2067111 2050489 2034563 2018509 2003335
53240 2003335 1990392 1979221 1968085 1956580 1946661 1940715 1939310 1941175 1944826 1949616 1955516 1962557 1970889
53227 1970889 1981065 1993688 2008590 2024827 2041980 2061106 2083690 2109667 2137277 2165023 2193090
53216 2193090 2222568 2253897 2286412 2318784 2349549 2377839 2404139 2429801 2455223 2478862 2498589
53205 2498589 2513770 2525592 2535648 2544579 2551692 2555430 2554556 2549344 2541371 2531670 2519404 2502900 2481919
53192 2481919 2458480 2435394 2413989 2392953 2369396 2341582 2310777 2279828 2249797 2218896 2185122
53181 2185122 2148903 2112285 2076461 2041293 2006719 1973164 1940619 1908488 1876586 1845376 1815057
53170 1815057 1785135 1755179 1725395 1696269 1668147 1641192 1615193 1589448 1563405 1537566 1513184
53159 1513184 1490968 1470644 1451768 1434249 1417892 1402102 1386470 1371131 1356247 1341616 1327213
53148 1327213 1313555 1300877 1288218 1274036 1257813 1240462 1222923 1204781 1184829 1162990 1141141
53137 1141141 1121596 1104855 1089224 1072696 1054828 1036654 1019158 1002288 985355 967981 950534
53126 950534 933727 917873 902552 887106 871360 855602 839876 823705 806719 789205 771767
53115 771767 754754 738329 722849 708727 695938 683967 672311 660875 649925 639690 629933 619974
53103 619974 609421 598929 589837 582797 577016 571047 564170 556830 549955 544033 538654 532834 525935 518277
53089 518277 510660 503472 496689 490505 485115 479828 473358 465458 457561 451324 447117 444220 441764 438949
53075 438949 435175 430809 427262 425479 424761 423775 422313 421222 420913 420653 419222 415793 410532 404824 400373
53060 400373 397446 394544 390493 386167 383275 382136 381807 381752 381948 381745 380228 377662 375088 372501 369023
53045 369023 365144 362979 363519 365133 365852 365920 366838 368730 370089 369834 368499 367415 367476 368700 370366 371516
53029 371516 371691 371213 370637 370228 370072 370208 370245 369254 366524 362250 357265 352428 348521 346157 345141 344264 342312
53012 342312 339144 335381 331324 326735 321518 316015 310609 305470 300757 296624 292971 289417 285651 281608
52998 281608 277375 273162 269259 265777 262481 259198 256339 254590 253928 253176 250928 246982 242864 240781 241724
52983 241724 244354 245884 244431 240619 236692 234127 232422 230291 227479 224903 223199 221850 220033 217839
52969 217839 216105 215194 214483 213208 211351 209399 207444 204926 201377 197263 193936 192592 193141 194236 194673
52954 194673 194663 195316 196839 197801 196559 193073 188906 185723 184179 184065 184824 185798 186457 186779 187253 188328 189863
52937 189863 191245 192030 192415 192950 193682 193740 192139 189092 186164 184911 185645 187714 190490 193530 195969 196555
52921 196555 194670 191199 188157 187367 189280 192836 196381 198783 199838 200014 200143 201102 203170 205695 207922
52906 207922 210134 213237 217189 220828 223598 226277 229330 231769 232901 234190 237586 242343 245428 245489 244827
52891 244827 246741 252059 259058 265720 271074 275028 278106 281261 285188 289671 294000 297896 301643 305456
52877 305456 309181 312606 315729 318548 320729 321634 320831 318679 316281 314575 313521 312385 310639 308305 305619
52862 305619 302963 301021 300268 300183 299621 298323 297407 297864 299041 299257 297741 295406 293701 293059 292679 291657
52846 291657 290158 289296 289758 290822 291118 290210 288906 288004 287499 287253 287709 289312 291702 294257 297188 301243
52830 301243 306232 310571 312669 312414 311009 309694 309023 309186 310370 312518 315011 317014 318225 319082 320121
52815 320121 321278 321977 321916 321627 322123 323835 325854 326452 324703 321594 319293 319284 321399 324545 327774 330410
52799 330410 331734 331314 329651 328126 328165 330409 334318 338314 340726 341148 340832 341340 342880 344339 344778 344423
52783 344423 344130 344391 345168 346470 348734 352491 357622 363078 367524 370297 371693 372444 373155 374050 374835 375008
52767 375008 374848 375750 378632 382094 383496 382149 380040 378759 377354 374494 371340 370307 371620 373056 372871
52752 372871 371223 368728 365474 361846 358668 355789 351837 346176 340170 335773 333517 332281 330315 326309
52738 326309 320453 314795 311526 310462 309156 305928 301673 298132 295685 293752 292200 291055 289465 286330
52724 286330 281745 276917 272839 269751 267569 265986 264295 261842 258648 255191 251870 248982 246680 244373
52710 244373 240826 235819 231230 229396 230419 232067 232273 230707 227733 223199 217267 211792 209412 210792
52696 210792 213402 213740 210749 206538 203710 202582 201446 198943 195283 191247 187049 182698 178913 176944
52682 176944 177361 179190 180363 179331 176488 173657 171783 169676 165793 160775 156947 155352 154644 153239 151243
52667 151243 149610 148577 147853 147477 147462 147231 146392 145665 146115 147730 149480 150583 151062 151262 151353 151252 150675 149521
52649 149521 148293 147595 147016 145438 142885 141013 140929 141505 141032 139811 139657 141274 143536 145295 146487 147305
52633 147305 147684 148095 149732 153071 156915 159632 161039 162492 165207 168838 171812 173017 173150 174173 177211
52618 177211 181224 184108 184958 184812 185305 187121 189866 192939 196188 199742 203372 206152 206967 205435 202238
52603 202238 198669 196084 195442 196568 197769 196975 193608 188747 183387 177613 171879 167680 165767 164664 162349
52588 162349 158943 156328 155464 155506 155447 155186 154688 153456 151407 149405 148452 148937 150846 153939 157460 160472
52572 160472 162776 164871 166863 168350 169615 171855 175539 179392 181814 182663 182856 182730 181784 179783 177171
52557 177171 174321 171087 167218 162785 158178 154180 152012 152535 155086 157586 158333 157437 156179 155335 154754
52542 154754 154413 154946 156709 158866 160117 160198 160162 161191 163444 166061 167938 168536 168255 168044 168426 169036 169321
52525 169321 169411 169901 171168 173492 177404 182978 188957 193612 196491 198299 199083 197970 195137 192646 192397
52510 192397 194159 196414 198256 199582 200316 200662 201616 204153 208065 212276 215917 218552 219960 220446 220740
52495 220740 220925 220204 218518 217370 217972 219473 220451 221379 223895 227983 231752 234061 235787 238128 240966
52480 240966 243321 244453 244303 243685 244046 246157 249160 251847 254458 257960 261872 264579 265771 266772 268146
52465 268146 268868 268526 268531 270102 272538 274550 276014 277247 277802 277383 276978 277594 278574 278625 278018 278232 279607 280779
52447 280779 280651 279794 279507 280257 281399 282041 281976 281962 282900 284449 284847 282723 278934 275942 275369 276739 278583
52430 278583 280056 281188 282064 282395 282021 281498 281815 283365 285497 287419 289376 292288 296168 299609 301267
52415 301267 301371 301262 301759 302567 303087 303204 303221 303442 304010 304940 306112 307225 307832 307557 306480 305243 304520 304408
52397 304408 304672 305504 307489 310577 313594 315222 315180 314053 312254 309818 307209 305600 305836 307317 308436
52382 308436 308216 307234 306779 307484 309099 311200 313418 314952 314785 312834 310301 308273 306475 304144 301826
52367 301826 301324 303669 307825 311741 314274 315697 316601 316830 315763 313491 311245 310287 310631 311404 312368 314312
52351 314312 317726 321805 325110 326569 325640 322472 318453 315506 313998 312196 308778 304965 302925 302872 303238
52336 303238 303208 303392 304092 304573 304296 303511 302377 300656 298616 297117 296505 296362 296495 297162 298163 298791 298939
52319 298939 299201 299684 299795 299461 299401 299911 300513 301292 303370 307316 311931 315301 316510 315974 314747 313861 313756
52302 313756 314165 315021 317221 321584 327327 332758 337326 341713 346074 349934 353854 359237 365914 371769 375501
52287 375501 378052 380557 382804 384879 388380 394192 400457 404583 406427 407912 410337 413583 417253 421043
52273 421043 424471 427606 431723 437909 445308 451817 456247 458997 461131 463775 467844 473289 478946 483981
52259 483981 488974 494829 501376 507980 514753 522103 529829 537887 547290 558901 571876 584579 596631
52246 596631 608806 621439 634255 647425 661506 676555 692466 709807 729181 750149 771910
52235 771910 794556 818324 842130 864415 885226 906092 928084 951445 976771 1004766 1034713
52224 1034713 1064825 1094340 1123886 1153535 1182084 1208695 1233860 1258165 1281357 1303267 1324609
52213 1324609 1346078 1367332 1387447 1405844 1422374 1436985 1449495 1459386 1466009 1469682 1472308 1475923
52201 1475923 1480662 1484982 1487820 1489436 1490217 1489906 1488425 1486511 1485030 1484219 1483716 1482837 1480996 1478606 1477325
52186 1477325 1478460 1481376 1484641 1488494 1494721 1504004 1514949 1526223 1538309 1552428 1568833 1586915
52174 1586915 1606099 1625837 1645372 1664158 1682181 1699532 1716181 1732355 1748517 1764765 1780857
52163 1780857 1796830 1812698 1827358 1838764 1845659 1848562 1848857 1847610 1845358 1842068 1836963 1829228 1819267
52150 1819267 1808568 1797979 1786803 1773765 1758149 1739953 1719896 1699556 1680557 1663204 1646595
52139 1646595 1630146 1614066 1598275 1582044 1565038 1547686 1530286 1513042 1497204 1484560 1475029
52128 1475029 1466295 1456794 1447667 1440501 1434499 1427584 1419424 1411563 1405033 1399532 1394798 1391077 1387919 1383901
52114 1383901 1378240 1371829 1366139 1361728 1358188 1355004 1351885 1348641 1345259 1342068 1339399 1336942 1333633 1328498
52100 1328498 1321631 1314182 1307271 1301160 1295545 1290222 1285013 1279422 1273073 1266410 1260387 1255502 1251592 1248383
52086 1248383 1245535 1242240 1237639 1231815 1225768 1220234 1215095 1210047 1205225 1201024 1197773 1195624 1194229 1192634
52072 1192634 1190063 1186749 1183484 1180697 1178618 1177766 1178112 1178140 1176084 1171987 1167238 1162415 1157205 1152329 1149398
52057 1149398 1148393 1147365 1145441 1144223 1145163 1147355 1149369 1151630 1155388 1160622 1166772 1174497 1184842 1197308
52043 1197308 1210540 1224480 1240127 1257489 1275515 1294081 1314438 1337357 1362148 1388070 1415715
52032 1415715 1446336 1480213 1516168 1552579 1588668 1624742 1661061 1696890 1731298 1764640 1798032
52021 1798032 1831207 1862209 1889747 1914525 1937542 1958608 1977635 1995809 2013713 2029367 2040061
52010 2040061 2045547 2047691 2047582 2045007 2040489 2035559 2030532 2023741 2013770 2001279 1988017 1974938 1961784
51997 1961784 1947801 1932548 1916566 1901313 1887938 1876293 1865729 1856312 1848278 1840957 1833691 1827559
51985 1827559 1824550 1824919 1826859 1829046 1832010 1836554 1842336 1848794 1856164 1864667 1873627 1882300 1890885 1899845
51971 1899845 1908680 1916098 1921210 1924245 1926357 1928807 1931839 1934387 1935510 1935914 1937032 1938603 1938500 1935301
51957 1935301 1929745 1922998 1914757 1904060 1890968 1876236 1859941 1841642 1821558 1800543 1778887 1755885
51945 1755885 1730610 1702639 1672203 1640133 1607498 1574894 1542294 1509811 1478022 1446988 1415492
51934 1415492 1382105 1346777 1310592 1274118 1236876 1198506 1159624 1121170 1083500 1046551 1010569
51923 1010569 976199 943871 913353 883937 855037 826655 799288 773431 749207 726474 705090
51912 705090 684925 665695 646991 628558 610402 592598 575117 557999 541760 527404 515691
51901 515691 506231 497520 488110 477749 467373 458171 450668 444390 438080 430507 421517 412263 404143 397628
51887 397628 392290 387621 383337 379126 374793 370690 367420 364975 362689 360106 357356 354428 350750 345950
51873 345950 340683 336139 332837 330261 327571 324402 321004 317943 315647 314008 312316 309791 306347 302773
51859 302773 300011 298267 296962 295574 294211 293105 291901 290081 288011 286764 286551 286013 283715 279964 276483
51844 276483 274490 273703 273074 271867 269997 267888 266170 265124 264361 263295 261855 260378 258836 256597 253042
51829 253042 248188 242804 238092 235082 233887 233584 233043 231765 229868 227752 226142 225833 226694 227332 226599 225128
51813 225128 224572 225519 227048 228110 228311 227455 225553 223527 222755 223471 224605 225522 226834 228966 231161 232844
51797 232844 234971 238716 243362 246873 248543 249886 252619 256600 260279 262597 263895 265137 266738 268310
51783 268310 269209 269062 267905 266278 265287 265972 268157 270306 271098 270893 270923 271382 271318 270423 269828 270621 272426 273994
51765 273994 274657 274694 274799 275621 277314 279102 279772 279062 278142 278308 279673 281468 283069 284150 284374 283624 282312
51748 282312 280969 279903 279510 280261 281740 282403 281227 279247 278568 280023 282595 284929 286460 287130 286865 285580
51732 285580 283122 279254 274339 269922 267819 268442 270650 273204 275651 277795 279329 280237 280727 280530 279298
51717 279298 278071 279064 282964 287358 289164 288215 287184 288193 290781 293375 295476 297720 300534 303431 305323
51702 305323 305363 303966 303112 304790 308743 312650 315037 317060 320502 325038 328958 332053 335967 341654 348223
51687 348223 354751 361567 368845 375439 380510 385267 391646 399833 408492 416972 425748 434820 443302 450835
51673 450835 458016 464979 470705 474356 476295 477188 476965 475543 473898 473509 474931 477516 480332 482809 484578
51658 484578 485178 484150 481524 478355 476608 477861 481825 486502 489878 491252 491095 490364 490047 490571 491237 490848
51642 490848 489230 487575 486954 487178 487501 487635 487483 486567 484654 482613 481876 483258 486728 491824 497583 502531
51626 502531 505792 508252 511894 517824 525394 533246 540768 548489 557312 567201 576473 582840 585586 586285
51612 586285 586943 587984 588729 589168 590129 591928 593990 595871 597676 599301 600231 600471 600984 602720 605618 608732
51596 608732 610999 611893 611863 612038 612879 613136 610950 606007 599768 593416 586589 578478 569215 559573 550173 541656
51580 541656 534886 530103 526353 522490 518226 513545 507762 500327 492206 485319 480523 477026 473769 470510
51566 470510 467448 464660 462141 459699 456660 452534 448206 445523 445130 445455 444466 441804 438534 435520 432968
51551 432968 431180 430634 431119 431528 430725 428332 424829 421432 419667 420198 421975 423139 422950 422243 421987 422253
51535 422253 422836 423921 425425 426419 426119 425143 425047 426733 429906 433867 438126 442338 446308 450192 454203 458097
51519 458097 461333 463626 464854 464634 462828 460507 459426 460052 460794 459832 457276 454965 454384 455358 456589 456863
51503 456863 455777 453918 452539 452652 454119 455790 456676 456743 456485 456057 455311 454488 454251 454798 455449 455562 455512 456260
51485 456260 458141 460691 463577 466943 470677 474043 476342 477362 476980 475196 473005 472278 473762 475767 475961
51470 475961 474159 472354 472210 473694 476175 479464 483308 486841 489316 490882 492163 493410 494430 495002 495092
51455 495092 494899 494808 495013 495216 495008 494295 492841 489779 484574 478352 473155 469665 466687 463117 459280 455881
51439 455881 452851 450014 447860 446589 445122 442129 437666 432936 428849 425732 424033 424237 425998 428110
51425 428110 429546 430141 430348 430685 431380 432300 433359 434911 437171 439271 439870 439179 439458 442691 448566 455461
51409 455461 462470 469293 475003 478687 481189 484742 490566 497876 505354 512530 519440 525951 531904 537290
51395 537290 542054 546328 550849 556286 562042 566652 569680 572223 575128 577702 578895 578945 578887 578959 578599 577934
51379 577934 578294 580800 584938 588933 591372 592303 592950 594594 597682 601663 605429 608004 609087 609021 608142 606231
51363 606231 602836 598020 592396 586467 580500 575146 571414 569512 568279 566428 564056 562341 561983 562490 562815
51348 562815 562217 560695 559075 558477 559230 560509 561437 562235 563721 566050 568622 570999 573210 575193 576601
51333 576601 577212 577167 576912 577048 577749 578021 576346 572614 568506 564953 560291 552430 542015 531536 521778
51318 521778 511488 500641 491481 485364 480780 475915 471291 468085 465328 461004 455197 449891 445747 441095
51304 441095 434509 426760 419480 413073 406788 400128 393327 386835 381010 376198 372548 369599 366307 361748
51290 361748 355976 350178 345717 342794 340299 337261 334181 332419 332432 333280 334028 334905 336560 338643 339878
51275 339878 339558 338351 337378 337050 337114 337317 337377 336606 334457 331603 329766 330140 332461 335797 339453 342639 344083
51258 344083 343121 341009 340240 342366 346848 351939 356115 358763 360081 360565 360423 359587 358403 357774 358103 358490
51242 358490 357590 354988 351177 346717 342121 338059 334684 331186 327110 323627 322102 321626 319673 315391 310628
51227 310628 307199 304702 301701 297635 292677 287049 281598 277904 276471 275580 273291 269974 267608 266929 266557
51212 266557 264803 261267 256720 252414 249633 249026 250007 251221 251727 251429 250516 248953 246617 243717 241140
51197 241140 240259 241863 244987 247364 247547 246183 244876 244313 244064 243711 243376 243346 243718 244309 244671 244491 244116
51180 244116 244071 243839 241968 238050 233807 231396 231270 232421 234008 235699 237020 237626 237978 238728 239616 239908
51164 239908 239735 240013 241169 242802 244407 245528 245498 244043 241928 240063 238317 236446 235740 238024 242902
51149 242902 247686 250553 252240 253974 255272 254965 253343 251954 251761 252483 253483 254467 255395 256177 256428 255548
51133 255548 253501 251511 251130 252338 253461 253350 252610 252094 251371 249806 248254 248236 249714 251049 251135 250451 249768
51116 249768 248837 246906 244038 241545 241163 243697 248088 251998 253690 253312 252118 250940 249979 249534 249787 250003
51100 250003 249090 247188 245707 245311 244746 242240 237505 231729 226243 221805 218711 216699 214943 212886 211004
51085 211004 210153 210287 210455 210051 209403 209082 209319 210290 212287 215206 218311 220862 222621 223516 223288 221893 219883
51068 219883 217999 216694 216331 217351 219690 222500 225109 227852 231174 234290 235872 236017 236334 237662 238823
51053 238823 238301 236346 234518 233664 233311 232790 232002 230960 229354 227108 225102 224912 227445 231646 234765 234546
51037 234546 231489 228571 228390 230911 234138 236379 237342 237692 238522 240975 245298 250039 252952 253016 251128 248808
51021 248808 246975 246228 247310 250362 254152 257012 258611 260030 261949 263512 263553 262382 261514 261700 262153 261997
51005 261997 261671 262189 263573 264872 265509 265693 265638 265397 265619 267362 270653 274159 276879 279289 282083 284725
50989 284725 286394 287765 290469 294822 299145 301507 301322 299324 296930 295832 297206 300790 305082 308624
50975 308624 310754 311390 310993 310816 312113 314672 316880 317717 317879 318433 319205 319384 319092 319231 319954 320397 320167
50958 320167 320226 321699 324268 326370 326939 326601 326991 329101 332464 335857 338622 341185 344452 348832 353920
50943 353920 359030 363869 368538 372926 376561 379486 383008 388809 397158 406620 415788 424634 433843 443659
50929 443659 454182 466114 480193 496172 513269 531276 550225 569274 587333 604963 624338
50918 624338 646815 671592 697295 723960 752832 785103 821502 862337 907059 954470 1004261
50907 1004261 1057818 1116594 1180213 1247270 1317784 1393571 1475944 1563969 1655382 1748595 1843412
50896 1843412 1940164 2038584 2137336 2234401 2327964 2416993 2500901 2578690 2648682 2709057 2758650
50885 2758650 2797316 2825620 2843994 2852222 2850166 2839256 2822742 2803852 2783849 2762304 2738864 2714110
50873 2714110 2688910 2663844 2639285 2615090 2589857 2561343 2528279 2491256 2451167 2407306 2358002
50862 2358002 2303020 2244210 2183322 2119977 2052601 1980915 1906569 1831370 1755978 1680902 1607918
50851 1607918 1539305 1475727 1415946 1358981 1305690 1257489 1214150 1173947 1136047 1101775 1072990
50840 1072990 1049780 1030368 1013083 997749 985083 975314 967842 962098 958220 956659 957277 959109 961055
50827 961055 962661 964198 966175 969002 972974 978233 984657 992109 1000894 1011566 1023880 1036360 1047656
50814 1047656 1058363 1070709 1086237 1104536 1124603 1146510 1170769 1196825 1223557 1251094 1280733
50803 1280733 1312935 1346786 1381988 1420058 1462719 1510231 1562332 1619857 1684109 1755272 1832885
50792 1832885 1917517 2010688 2113362 2225903 2349359 2485181 2633443 2792808 2962703 3144011
50782 3144011 3336816 3538867 3747381 3961289 4180310 4402377 4623226 4838179 5043095
50773 5043095 5233757 5405817 5555895 5682122 5783241 5857809 5904706 5924240 5918587 5891468
50763 5891468 5847500 5791390 5727199 5658174 5587266 5517707 5452832 5394880 5343546 5295821 5247796
50752 5247796 5196894 5142110 5082072 5013675 4933264 4838915 4730940 4610321 4477391 4332300
50742 4332300 4176174 4011303 3840369 3665907 3490499 3316957 3147861 2985052 2829915
50733 2829915 2684024 2548861 2424724 2310600 2205601 2110056 2024588 1948673 1881031 1821128
50723 1821128 1769242 1725210 1688221 1657874 1634038 1615218 1598507 1582152 1567285 1556054 1548688
50712 1548688 1543371 1538417 1533447 1528754 1524653 1521391 1518735 1515581 1510745 1504285 1497536 1491795 1487449 1484225
50698 1484225 1481712 1479746 1478794 1479741 1482749 1486609 1490064 1493569 1498774 1506448 1516068 1527684 1542974 1563674
50684 1563674 1589653 1619264 1651225 1685691 1723932 1767545 1817625 1874031 1935516 2001020 2070811
50673 2070811 2146013 2227055 2312988 2402457 2495139 2592069 2694584 2803056 2916688 3034335
50663 3034335 3155102 3277877 3400586 3520412 3634787 3741927 3840374 3928382 4003824 4064392
50653 4064392 4107791 4132047 4136068 4120146 4086243 4037886 3979361 3914270 3844620 3771650 3697677
50642 3697677 3626735 3562940 3508120 3461121 3419313 3380683 3344386 3309456 3273509 3233313 3186693
50631 3186693 3133225 3072796 3004229 2926212 2839228 2745609 2647621 2546339 2442692 2338874 2238096
50620 2238096 2143157 2055503 1975280 1901911 1834801 1773742 1718598 1668622 1622568 1579883 1541626
50609 1541626 1509907 1486332 1470916 1462197 1458195 1457456 1459538 1464693 1473225 1485192 1500470 1518700 1539164
50596 1539164 1561070 1584103 1608593 1635093 1663986 1695406 1729281 1765489 1804214 1845955 1890787
50585 1890787 1937909 1986657 2037971 2094020 2156020 2223042 2293415 2366715 2443774 2525287 2610987
50574 2610987 2699914 2790671 2881473 2970589 3056939 3139979 3219042 3293155 3361381 3422872 3476525
50563 3476525 3521068 3555740 3580787 3597224 3606245 3608748 3605059 3595178 3579679 3560522 3540620 3522293
50551 3522293 3506296 3492426 3480831 3472411 3468078 3467933 3471162 3476474 3482536 3488230 3492758 3495439 3495156 3489887
50537 3489887 3477080 3454889 3423048 3382163 3332065 3271323 3198893 3116140 3026670 2934069 2840055
50526 2840055 2744847 2648703 2552588 2457710 2365094 2275733 2190641 2110502 2035492 1965584 1900743
50515 1900743 1840766 1785470 1735365 1691660 1654911 1623930 1596807 1573016 1553699 1539647 1529966
50504 1529966 1523403 1520305 1522101 1529035 1539452 1551667 1565661 1582444 1602365 1624859 1649633 1677254
50492 1677254 1708339 1742666 1779364 1817621 1856942 1897066 1938192 1981236 2027216 2076156 2126986
50481 2126986 2178746 2231519 2285826 2341561 2398146 2455525 2514268 2574815 2637522 2703668 2775434
50470 2775434 2854211 2939466 3029904 3125374 3226949 3335635 3451965 3576612 3710184 3851979
50460 3851979 3999761 4151340 4305863 4462893 4620538 4775179 4923153 5062335 5191998
50451 5191998 5311386 5418587 5510655 5584662 5638728 5672196 5684995 5676982 5647975 5598429 5530004
50440 5530004 5445325 5347235 5238412 5121643 5000063 4876894 4755378 4639392 4533771 4443031
50430 4443031 4369476 4313012 4272860 4248679 4239759 4243968 4258224 4279391 4303911 4326940 4342932 4347211
50418 4347211 4336594 4308710 4261581 4194112 4106604 4000767 3879530 3746641 3605803 3460059
50408 3460059 3312138 3164991 3021336 2882853 2750528 2625623 2509547 2402762 2304636 2214524
50398 2214524 2132394 2058338 1992275 1934307 1884472 1841817 1804522 1771497 1743267 1720876 1704499
50387 1704499 1693602 1687784 1686683 1689515 1695593 1705265 1719665 1739366 1763561 1790611 1819225 1849161
50375 1849161 1880950 1914935 1950653 1987412 2025338 2065202 2107024 2149513 2191355 2232594 2274126
50364 2274126 2316147 2357821 2398429 2438172 2477503 2516009 2552476 2586242 2618214 2650038 2682061
50353 2682061 2712775 2740949 2767908 2796752 2829367 2865428 2904530 2947946 2997249 3052018 3109999
50342 3109999 3169134 3228615 3288342 3348285 3408136 3466591 3521067 3568945 3609058 3641223 3664512
50331 3664512 3677043 3677595 3666268 3643042 3606614 3555529 3490101 3412568 3325682 3231793 3133273 3033100
50319 3033100 2934522 2840067 2750929 2667410 2590029 2520285 2460389 2412346 2377156 2354380 2342071
50308 2342071 2337472 2338419 2344122 2354103 2366444 2377751 2384994 2386727 2382163 2369782 2347700 2315249 2273516
50295 2273516 2224416 2169912 2112180 2053625 1995905 1939092 1882372 1825705 1770447 1718220 1669447
50284 1669447 1623245 1578754 1536337 1497343 1462706 1432001 1404154 1378996 1357554 1340496 1326814
50273 1326814 1314805 1304205 1296407 1292422 1291540 1292489 1295060 1299829 1306961 1316277 1328078 1342721 1359501
50260 1359501 1376968 1394475 1412540 1431677 1451818 1473037 1495733 1519679 1543924 1568193 1593616
50249 1593616 1621405 1651346 1682021 1711902 1739894 1765624 1789713 1812902 1834370 1851893 1864458
50238 1864458 1873707 1881675 1888044 1891002 1890163 1886948 1882322 1875807 1866882 1855872 1843009 1827904 1810537
50225 1810537 1791739 1772079 1751109 1728331 1704244 1679806 1655401 1630918 1606398 1582132 1558450
50214 1558450 1535812 1514649 1494627 1474427 1452789 1429702 1406345 1384035 1363406 1344251 1325873
50203 1325873 1307794 1290393 1274601 1260795 1248302 1236293 1224884 1214983 1207201 1201275 1196567 1192803
50191 1192803 1190109 1188408 1187072 1185438 1183545 1181961 1180857 1179772 1178506 1177585 1177310 1176859 1175085 1171801 1167617
50176 1167617 1162996 1158310 1154230 1150794 1146518 1139966 1132130 1125535 1120727 1115524 1108483 1101257 1096227 1093229
50162 1093229 1090168 1085776 1080211 1073930 1067787 1063602 1062589 1063417 1063694 1063475 1065471 1071375 1079640 1087508 1093688
50147 1093688 1098216 1101255 1103381 1106138 1110745 1116446 1121094 1123284 1123232 1121799 1119365 1115701 1110480 1103876
50133 1103876 1096691 1089588 1082172 1073485 1063640 1054126 1045985 1038547 1030833 1023413 1017615 1013257 1008470 1001800
50119 1001800 993402 984067 974273 964519 955539 947552 940093 933158 927762 924680 923216 921957 920219 918067
50105 918067 915479 912570 910313 909810 910661 911061 909888 907714 905164 901208 894274 884783 875346 868065 862421
50090 862421 856398 849113 841599 835239 830316 826233 822436 818650 814786 811216 808726 807482 806232 803392
50076 803392 798981 794768 792396 792096 793474 796466 800786 805231 808723 811896 816647 823963 832727 840760
50062 840760 846611 850519 854278 860168 869235 880297 890969 899804 907235 914712 923466 933918 945344
50049 945344 955939 964045 969785 974992 981302 988784 996537 1003818 1010231 1015560 1019966 1023914 1027524 1030548
50035 1030548 1033284 1036723 1041222 1045830 1049625 1053084 1057302 1062550 1068520 1075350 1083106 1090679 1096741 1101932
50021 1101932 1108705 1118493 1130055 1141215 1151331 1161363 1172140 1183438 1194530 1205113 1215737 1227616
50009 1227616 1241770 1258099 1275434 1292693 1309740 1326977 1344436 1361583 1377849 1393244 1408586
49998 1408586 1425037 1442924 1460901 1476808 1489760 1501051 1512642 1525097 1537433 1548595 1558358
49987 1558358 1566740 1573299 1577558 1579834 1581131 1582092 1582434 1581523 1579084 1574996 1568814 1560323 1550484 1540824 1531387
49972 1531387 1520223 1505758 1489156 1473246 1459421 1446732 1434007 1421535 1410203 1400086 1390746
49961 1390746 1382239 1375021 1369218 1364667 1361402 1359537 1359049 1360209 1363834 1370233 1378157 1385754 1392667 1400357
49947 1400357 1410136 1421785 1434589 1448798 1464894 1481758 1496889 1508884 1518843 1528609 1538115 1545197
49935 1545197 1547781 1545503 1539345 1530723 1521232 1512381 1504754 1497601 1489705 1480363 1469264 1455889 1439570
49922 1439570 1419900 1396646 1369629 1339281 1307049 1274595 1242685 1211284 1180391 1150194 1120781
49911 1120781 1092582 1066880 1044908 1026388 1009784 994086 979527 966516 954786 943856 933515
49900 933515 923582 913895 904687 896158 887588 877840 867048 856737 847878 839890 832044 824610 817771 810578
49886 810578 802124 792892 783846 774883 765421 755831 746972 738868 731320 725369 722391 721719 720817 718239 714949
49871 714949 712228 709762 706755 703748 702080 702210 703654 706220 710146 715037 719648 723097 725723 728494
49857 728494 731865 735592 739502 744016 749716 756506 763582 770303 776816 783495 790065 795828 800785 806031
49843 806031 812808 821430 831277 841631 852328 863785 876421 889965 903458 916345 929548 944961
49831 944961 963626 984805 1007153 1030405 1055324 1082110 1109576 1136229 1161804 1187180 1212889
49820 1212889 1238203 1261886 1283379 1302892 1320774 1337441 1353715 1370290 1386703 1401578 1414160
49809 1414160 1424696 1432797 1436458 1433860 1425602 1413889 1399674 1381941 1359951 1334855 1308447 1281353
49797 1281353 1253321 1224531 1195568 1166420 1136500 1105828 1075505 1046864 1020520 996357 974001
49786 974001 953064 933181 914204 896401 880243 865807 852452 839402 826781 815743 807147 800252
49774 800252 793153 784557 774738 764787 755485 747057 739411 732229 725210 718634 713344 709719 706890 703340
49760 703340 698144 691459 684230 677847 673650 672032 672209 673320 675470 678832 682116 683220 681841 680298
49746 680298 681023 683867 686683 687984 688121 688127 688395 688692 688871 689387 691330 695530 701135 705677 707597 708481 711401
49729 711401 716899 722037 723913 722761 720682 718763 716995 716068 717314 720983 726162 732333 739532 746894
49715 746894 752814 757213 762220 769741 779559 790701 803544 819212 837595 857310 877310 897425
49703 897425 917389 936448 954111 970651 986724 1002802 1018890 1034416 1048627 1061398 1073317
49692 1073317 1084698 1095130 1104491 1113660 1123312 1132542 1139595 1143509 1144043 1140522 1132094 1119060 1102751
49679 1102751 1084148 1063744 1042591 1022030 1002118 981730 960729 940716 923068 907430 892947
49668 892947 879934 869387 861657 856370 852881 850088 846719 842721 839498 837763 835991 832248 826830 821645
49654 821645 817478 813479 809215 805543 803004 800760 797791 794266 791134 789053 788158 788271 788915 789552 790053
49639 790053 790465 790358 789221 787605 786757 786883 786882 786349 786548 788371 790477 790920 789941 789608 791038 793502 796127
49622 796127 798704 800554 800473 798677 797295 797766 798897 798874 798197 798913 801506 804371 806398 808289 810911 813900
49606 813900 816685 819626 823141 826678 829606 832365 835724 839544 843390 847748 853174 858507 861640 862461
49592 862461 863649 867667 873806 879054 881413 881658 882168 884682 889019 893441 896358 897929 899885 903528 908237
49577 908237 912253 914553 915516 916076 916870 918088 919523 920620 920953 920875 921431 923468 927022 931580 936568 941470
49561 941470 945826 949535 953095 957252 962296 967852 973429 979087 985332 992387 999863 1007454 1015740 1025745
49547 1025745 1037576 1050128 1062556 1075528 1090299 1106820 1123620 1139568 1154737 1169319 1182881
49536 1182881 1195619 1209449 1226415 1246188 1266450 1285981 1306085 1328441 1352719 1377231 1401106
49525 1401106 1424782 1448930 1474060 1500756 1529053 1557727 1585545 1613353 1643597 1677403 1713403
49514 1713403 1749964 1787149 1825489 1864149 1901857 1939024 1977391 2017756 2059450 2101969 2145726
49503 2145726 2190914 2236876 2283089 2329699 2376396 2421689 2464266 2504769 2545402 2587763 2631435
49492 2631435 2674657 2716088 2755870 2795062 2834096 2872054 2907656 2940621 2971516 3000520 3027137
49481 3027137 3051202 3073248 3093485 3111154 3125467 3136734 3146037 3154146 3161257 3167533 3173313 3178858
49469 3178858 3184220 3189348 3194123 3198476 3202734 3207661 3213889 3221383 3229635 3238297 3247575 3258108 3270419
49456 3270419 3284247 3298508 3312361 3326257 3341373 3357930 3374795 3390990 3406847 3423128 3439570
49445 3439570 3454934 3467986 3477794 3483561 3485075 3483220 3479143 3472883 3463524 3450783 3435717 3419449 3401681
49432 3401681 3380864 3355626 3325832 3292521 3257093 3220397 3182361 3142491 3100851 3058393 3016205
49421 3016205 2974487 2932462 2889303 2844983 2800191 2755604 2711477 2667768 2624240 2580326 2535461
49410 2535461 2490025 2445691 2404260 2366131 2330233 2295253 2260527 2226085 2192713 2161975 2135174
49399 2135174 2111902 2090298 2069137 2048992 2030777 2013909 1996733 1978432 1959746 1942043 1926452
49388 1926452 1913882 1904983 1899578 1896355 1893487 1889723 1885045 1880376 1876597 1873905 1872122 1871395 1872100 1874110
49374 1874110 1876803 1879960 1884195 1890253 1898274 1907863 1918432 1929443 1940859 1953407 1967725 1983384
49362 1983384 1999834 2018354 2041549 2070349 2103087 2138557 2178076 2222380 2267426 2305787 2332527
49351 2332527 2348309 2356881 2361550 2364507 2367568 2372002 2378134 2385954 2395823 2408319 2423927 2442981 2465181
49338 2465181 2489023 2512682 2535768 2559425 2584318 2609425 2633375 2656196 2679062 2702782 2727063
49327 2727063 2750891 2773158 2793269 2811493 2828546 2844790 2860261 2875420 2891214 2908245 2926522
49316 2926522 2945976 2966336 2986404 3004612 3020891 3037018 3054581 3073553 3093458 3114774 3138026
49305 3138026 3162344 3186291 3209826 3234352 3261018 3289818 3320083 3350843 3380924 3409795 3438386
49294 3438386 3468289 3500257 3534301 3570979 3611227 3654588 3698810 3741950 3784215 3827209 3872050
49283 3872050 3918934 3967986 4019556 4073658 4129683 4186889 4244993 4304316 4365459 4428719 4493691
49272 4493691 4559702 4626707 4695319 4765474 4835529 4903522 4969387 5035116 5102260 5169915 5235813
49261 5235813 5298930 5360049 5419845 5477602 5532383 5584536 5635099 5684136 5730722 5774507 5816256
49250 5816256 5856522 5894439 5928324 5957124 5981070 6001380 6019499 6036010 6049792 6058773 6062107 6061443
49238 6061443 6059474 6057379 6054193 6048694 6041302 6033794 6027444 6021904 6016002 6009306 6002461 5996198 5990699 5986264
49224 5986264 5983798 5983797 5985194 5986290 5986773 5987808 5990088 5993045 5996515 6001910 6010638 6021973 6033498 6043225
49210 6043225 6050387 6054641 6055678 6053701 6049299 6042490 6032407 6018099 5999378 5976858 5951358 5922988
49198 5922988 5890564 5852460 5808710 5761764 5714297 5666505 5616629 5564022 5510533 5458531 5408524
49187 5408524 5359247 5309315 5258168 5205962 5153258 5100672 5048338 4995822 4942887 4890295 4839655
49176 4839655 4792415 4748875 4707964 4668062 4628345 4589267 4551492 4514712 4478038 4441358 4405566
49165 4405566 4371501 4339418 4309587 4282469 4257914 4235028 4213339 4193450 4176100 4161245 4148659
49154 4148659 4138718 4131676 4126637 4122143 4117635 4113607 4110599 4108870 4108951 4111505 4116397 4122527 4128922 4135528
49140 4135528 4142838 4151266 4161092 4172444 4185106 4198758 4213618 4230307 4248777 4267884 4286544 4305005
49128 4305005 4324448 4345541 4367884 4390777 4414007 4437833 4462661 4488924 4516904 4546345 4576295
49117 4576295 4605575 4633576 4660758 4688416 4717770 4749022 4781315 4813730 4846174 4879058 4912299
49106 4912299 4945212 4977498 5009908 5043582 5078936 5115320 5151431 5185944 5218291 5249267 5280565
49095 5280565 5313198 5346686 5380232 5414221 5449667 5486468 5523445 5560291 5598247 5638239 5679366
49084 5679366 5720193 5760766 5802221 5844732 5886992 5927567 5965680 6000581 6031324 6057774 6081230
49073 6081230 6103522 6125728 6147832 6169110 6188719 6206415 6223006 6239720 6257039 6274587 6292004
49062 6292004 6309088 6325121 6339201 6351766 6364623 6378677 6392634 6404910 6415779 6426195 6435335
49051 6435335 6441333 6444379 6447093 6451252 6455854 6459291 6461817 6464459 6466624 6466664 6464514 6462198 6461582 6462863 6465429
49036 6465429 6468970 6473181 6477365 6481158 6485110 6489859 6495092 6499889 6503745 6506640 6508426 6508985 6509053 6510130 6513190
49021 6513190 6517840 6523002 6528055 6532913 6537308 6540546 6542092 6542153 6541556 6541284 6542125 6544355 6547311 6549461 6549375 6546785
49005 6546785 6542339 6536156 6527204 6514684 6499640 6484258 6469369 6453410 6434298 6411653 6386575 6359946
48993 6359946 6332000 6303190 6274024 6243745 6210509 6173757 6135531 6098302 6062076 6024917 5986038
48982 5986038 5946814 5908539 5870825 5833113 5796464 5762251 5729709 5696515 5661931 5627870 5596353
48971 5596353 5567173 5538924 5511319 5485302 5461319 5438728 5416930 5396218 5377470 5361722 5349957
48960 5349957 5342342 5337364 5332571 5326717 5320813 5316800 5315669 5317060 5319888 5322859 5325036 5326678 5329285 5334264
48946 5334264 5341727 5350753 5360199 5368830 5375584 5380706 5386041 5392993 5400464 5405924 5408302 5408555 5407558 5405085
48932 5405085 5401247 5397131 5392914 5386600 5376022 5361475 5345117 5328189 5310020 5289591 5266868 5242361
48920 5242361 5216197 5188016 5157436 5124616 5090685 5057298 5025118 4992832 4958330 4920907 4881727
48909 4881727 4842284 4803180 4764561 4726846 4690558 4655939 4623247 4593143 4566252 4542370 4520440
48898 4520440 4499481 4479534 4461611 4446571 4434062 4422875 4412465 4403708 4397840 4395182 4395567 4399586
48886 4399586 4408350 4421746 4437749 4453958 4469434 4484838 4501304 4519608 4540129 4563091 4588692
48875 4588692 4617015 4647633 4679410 4711167 4742803 4775553 4810937 4849509 4890600 4933070 4976354
48864 4976354 5021064 5068499 5119120 5171509 5223320 5273406 5322666 5372758 5424586 5478256 5533916
48853 5533916 5592062 5653181 5717429 5784535 5853779 5924214 5995199 6066782 6139596 6214390 6291365
48842 6291365 6369708 6448098 6526216 6605449 6687324 6771402 6855609 6938650 7020935 7102842 7183428
48831 7183428 7261728 7338264 7414022 7488447 7559659 7626454 7689085 7748170 7803698 7855136 7901765
48820 7901765 7942829 7978024 8007879 8033059 8053231 8067256 8074499 8075366 8070415 8059507 8042068 8017886
48808 8017886 7987594 7952673 7914772 7874451 7830680 7782128 7728972 7672807 7614808 7554784 7492217
48797 7492217 7427383 7360822 7292347 7221362 7148071 7073793 6999978 6927289 6855831 6786038 6718804
48786 6718804 6654467 6592000 6529912 6468086 6408082 6351307 6297678 6246670 6198806 6154923 6114421
48775 6114421 6075659 6038145 6003121 5971773 5944092 5919892 5899686 5883764 5871279 5861108 5853035
48764 5853035 5847428 5844413 5844072 5846922 5853378 5863143 5875687 5890934 5908878 5929171 5951756 5977331 6006259
48751 6006259 6037539 6069866 6103347 6139148 6177762 6218676 6261501 6306051 6351266 6395476 6438278
48740 6438278 6481176 6525876 6572800 6621668 6672297 6724018 6775202 6824507 6872155 6919028 6964981
48729 6964981 7009155 7051782 7094386 7137882 7181435 7223719 7264481 7304062 7341925 7376820 7408596
48718 7408596 7438864 7469261 7499521 7528040 7554060 7578333 7601442 7622571 7640763 7656705 7672002
48707 7672002 7686736 7698843 7706285 7708846 7707238 7701261 7689822 7672437 7649780 7622797 7591988 7557653
48695 7557653 7520000 7478710 7432945 7382307 7327484 7269663 7209638 7147877 7084995 7021492 6957170
48684 6957170 6891591 6825323 6760033 6697005 6636151 6576950 6519768 6465443 6413981 6364837 6318600
48673 6318600 6277173 6241747 6211460 6184857 6161901 6143516 6129710 6119638 6113571 6113325 6119864 6131345
48661 6131345 6144643 6158536 6174542 6194630 6218901 6245809 6273970 6303158 6333795 6366250 6400800
48650 6400800 6437586 6475991 6514486 6551916 6588871 6626876 6666040 6704587 6741256 6777025 6813362
48639 6813362 6849669 6884160 6916954 6950429 6986156 7023234 7060446 7098507 7138760 7180677 7222338
48628 7222338 7263085 7304267 7347329 7392351 7438648 7485738 7533280 7580815 7628151 7675718 7724268
48617 7724268 7774325 7825825 7877767 7928275 7975657 8019674 8061392 8101681 8140236 8176045 8208139
48606 8208139 8235668 8257983 8275257 8288465 8298035 8302618 8299886 8288577 8269318 8243400 8211320 8172800
48594 8172800 8127730 8076536 8019700 7957406 7889790 7817280 7740477 7659921 7576130 7489644 7400910
48583 7400910 7310399 7219155 7128878 7040877 6955070 6870610 6787336 6705812 6625820 6545926 6465163
48572 6465163 6384394 6305245 6228242 6152925 6079315 6008060 5939111 5871412 5804251 5738099 5673638
48561 5673638 5610622 5548305 5486566 5425972 5366809 5308472 5250063 5191572 5134369 5080235 5029642
48550 5029642 4981251 4933547 4886773 4842657 4802369 4765460 4730850 4697914 4666272 4635437 4605436
48539 4605436 4577253 4551887 4529158 4508070 4488030 4469079 4451079 4433565 4416550 4400837 4387257
48528 4387257 4376064 4367281 4361112 4357460 4355368 4353569 4351731 4350744 4351607 4354355 4358317 4363092 4368793 4375393
48514 4375393 4382438 4389759 4398121 4408670 4421756 4436553 4451832 4466918 4481907 4497194 4512908 4528765
48502 4528765 4544507 4560411 4577059 4594440 4611503 4626792 4639373 4649072 4656254 4661718 4666475 4671096
48490 4671096 4675435 4679280 4682974 4687016 4691551 4696847 4703739 4712646 4722376 4730980 4737797 4743696 4749271 4754008
48476 4754008 4757649 4761381 4766948 4775103 4785250 4795926 4805436 4812962 4819617 4827694 4838390 4850955 4864464
48463 4864464 4879279 4896063 4914454 4933865 4954772 4977940 5002977 5029035 5056549 5086880 5120354
48452 5120354 5155957 5192950 5231312 5270422 5308850 5346235 5384200 5424439 5466693 5509518 5552317
48441 5552317 5595503 5639030 5682150 5724896 5768658 5814432 5860997 5905752 5947451 5987293 6026990
48430 6026990 6066370 6103598 6137307 6167512 6194438 6217673 6237061 6253517 6267970 6279927 6288055
48419 6288055 6292070 6293211 6292878 6291521 6288975 6285074 6279450 6271238 6259633 6244789 6227825 6209728 6190308
48406 6190308 6168580 6144252 6118326 6091667 6063386 6031727 5996597 5960052 5923889 5887870 5851028
48395 5851028 5813597 5776502 5739825 5703070 5666353 5630002 5593437 5555901 5518160 5482014 5448137
48384 5448137 5415814 5384953 5356844 5332315 5310356 5289263 5268303 5247820 5228604 5211697 5197983
48373 5197983 5187261 5178323 5170319 5163392 5157678 5152630 5147921 5144218 5142339 5142164 5142960 5144222 5145675 5147018
48359 5147018 5148345 5150407 5153939 5159046 5165559 5173368 5181905 5189818 5195805 5199579 5201864 5204010 5207738 5214288
48345 5214288 5223056 5231720 5238361 5242910 5246121 5248178 5249279 5250742 5254046 5258999 5264076 5268447 5272585 5276840
48331 5276840 5280581 5283123 5284631 5285659 5286442 5287079 5287922 5289210 5290471 5290758 5289508 5287008 5283861 5280036 5274749
48316 5274749 5267510 5259074 5250834 5243323 5235938 5228286 5221010 5214862 5209689 5204932 5200585 5196916 5193735 5190749
48302 5190749 5188422 5187569 5188113 5188878 5188760 5187584 5185855 5184153 5182972 5182778 5184020 5186981 5191310 5195544 5197680
48287 5197680 5196786 5193948 5191269 5190089 5190299 5190829 5190248 5187355 5181976 5175110 5167829 5160114 5151085 5140037 5126898
48272 5126898 5112175 5096990 5082583 5068948 5054351 5037134 5017819 4998571 4980763 4963964 4947256
48261 4947256 4930481 4913941 4897710 4881649 4865587 4849217 4832299 4815152 4798615 4783365 4769507
48250 4769507 4756696 4744407 4732256 4720408 4709446 4699513 4690129 4681288 4673931 4668424 4663337 4657077 4650236
48237 4650236 4644738 4640863 4636964 4632405 4628763 4627156 4625964 4622655 4616871 4610253 4603664 4596014 4585785 4572722
48223 4572722 4557819 4542267 4526647 4510737 4493851 4475350 4454843 4432135 4407399 4381264 4354177
48212 4354177 4325787 4295622 4264362 4233502 4203565 4173628 4142949 4112054 4081700 4051863 4022658
48201 4022658 3995241 3970485 3947181 3922829 3896220 3868461 3841495 3816361 3792822 3769941 3746898
48190 3746898 3723667 3700908 3679061 3657913 3637395 3618203 3600861 3584675 3568533 3552479 3537509
48179 3537509 3523858 3510481 3496381 3481733 3467483 3454448 3442876 3432232 3421428 3409990 3399086
48168 3399086 3390626 3385098 3381055 3376934 3372397 3367432 3361182 3352806 3343032 3333668 3325375 3316649 3305291 3290589
48154 3290589 3273955 3257706 3243256 3230188 3216971 3202725 3188149 3174403 3161221 3146788 3129761
48143 3129761 3110853 3091844 3073285 3053955 3032633 3009618 2986076 2962543 2938800 2914829 2890895
48132 2890895 2866736 2841742 2816355 2792392 2771241 2752320 2734112 2716244 2699604 2684663 2670844
48121 2670844 2657735 2645902 2635941 2627481 2619674 2612159 2604876 2597478 2589809 2582846 2578237 2576598 2576734 2576832
48107 2576832 2576094 2574986 2574256 2574079 2574102 2574070 2574395 2576102 2579985 2585644 2591556 2596276 2599519 2601927 2603995 2605556
48091 2605556 2606225 2605981 2605259 2604761 2605284 2607410 2611089 2615599 2620039 2623844 2626846 2629086 2630760 2632137 2633404
48076 2633404 2634611 2635839 2637241 2638794 2640136 2640810 2640581 2639522 2638023 2636834 2636752 2637957 2639819 2641503 2642627
48061 2642627 2643276 2643815 2644949 2647432 2651144 2654892 2657879 2661070 2666166 2673152 2679869 2684372 2686927 2689199
48047 2689199 2692142 2695405 2698341 2700755 2702772 2704680 2707034 2710394 2714704 2719154 2722827 2725425 2727472 2730047
48033 2730047 2734239 2740492 2748300 2756661 2765023 2773803 2784039 2796617 2811773 2829083 2847796 2867274
48021 2867274 2887391 2908621 2931624 2956588 2983026 3010263 3038023 3066355 3095117 3123868 3152303
48010 3152303 3180502 3208692 3237190 3266671 3298002 3331459 3366502 3402648 3440103 3479084 3518982
47999 3518982 3558992 3599362 3641271 3685507 3731944 3780457 3831655 3886258 3943579 4000076 4048934
47988 4048934 4081810 4092583 4080381 4049027 4004052 3950735 3893963 3837672 3783327 3730045 3677129
47977 3677129 3625833 3577989 3533692 3491402 3449978 3409691 3371401 3335419 3301214 3267785 3234314
47966 3234314 3200668 3167134 3133650 3099785 3065646 3032142 2999904 2968369 2936256 2902408 2865843
47955 2865843 2825817 2782586 2737800 2693526 2651067 2610773 2572099 2533394 2492718 2449905 2407218
47944 2407218 2367010 2329382 2293102 2257942 2224552 2192456 2160053 2126957 2094961 2066102 2040609
47933 2040609 2017018 1993563 1969308 1944827 1921920 1901829 1883666 1865520 1847133 1830306 1816478
47922 1816478 1805144 1795046 1785546 1776146 1765985 1755054 1745052 1737838 1733420 1730336 1727487 1724748 1722305
47909 1722305 1720421 1719517 1719431 1718855 1716533 1712864 1709356 1706518 1703358 1699062 1694096 1689207 1684239 1678435 1671290
47894 1671290 1662707 1652939 1642858 1633537 1624920 1615406 1603633 1590290 1577423 1566165 1556082 1546558
47882 1546558 1537743 1529861 1522700 1516331 1511381 1507735 1503698 1497615 1490044 1483235 1478559 1475490 1473172 1471731
47868 1471731 1471583 1472497 1474157 1476887 1480976 1485867 1490877 1496386 1503423 1512235 1522035 1532080 1542288 1552855
47854 1552855 1563871 1575307 1586766 1597311 1606212 1613892 1621450 1629101 1635674 1639854 1641479 1641555 1641358 1641449
47840 1641449 1641073 1638589 1633117 1625628 1617727 1609551 1599825 1588004 1575099 1562046 1548598 1534592 1521109
47827 1521109 1509112 1497700 1485146 1471414 1458324 1447211 1437628 1428652 1420358 1413362 1407776 1403466
47815 1403466 1400909 1400874 1403206 1406624 1410021 1413574 1418242 1424419 1431586 1439259 1447744 1457560 1468474 1479704
47801 1479704 1490994 1502887 1515769 1529146 1542237 1554920 1567688 1580957 1594740 1608724 1622149
47790 1622149 1633747 1642465 1648482 1653185 1657770 1662036 1664660 1664518 1661556 1656529 1650224 1643106 1635547 1628065
47776 1628065 1621043 1614220 1606681 1597593 1586994 1575742 1564633 1553679 1542333 1530341 1518189 1506676
47764 1506676 1496259 1486947 1478613 1471113 1464356 1458663 1454883 1453370 1452775 1450739 1446478 1442058 1440380 1442361
47750 1442361 1446891 1453098 1461315 1471671 1483022 1493943 1503972 1513225 1521454 1528328 1534257 1540100 1546201
47737 1546201 1552397 1558875 1566125 1573774 1580169 1583800 1585003 1585764 1587871 1591593 1596204 1601281 1607019 1613528
47723 1613528 1620410 1627240 1634056 1641254 1649276 1658450 1668638 1678850 1687782 1695151 1701971 1709082 1716083
47710 1716083 1722385 1728566 1735575 1743008 1749512 1754823 1760027 1765595 1770431 1773418 1774848 1775692 1776295 1776351 1775386
47695 1775386 1772693 1767647 1760741 1753509 1746713 1739467 1730947 1722062 1714260 1707398 1700155 1692138 1684143 1676341
47681 1676341 1667564 1656822 1644659 1632652 1622204 1613926 1607522 1601980 1596452 1591149 1587055 1584834 1584367
47668 1584367 1585103 1586180 1586517 1585776 1585266 1586970 1591509 1597856 1605223 1614254 1625990 1640583 1657583 1676701
47654 1676701 1697609 1719571 1742069 1765502 1790763 1818284 1847794 1878512 1909196 1938599 1966576
47643 1966576 1994418 2023449 2053429 2082774 2109884 2133626 2152953 2167174 2176707 2182854 2186535 2187731
47631 2187731 2186083 2181313 2172968 2160616 2144830 2127356 2109586 2091133 2070455 2046864 2021442 1996006
47619 1996006 1971630 1948408 1926440 1906625 1890115 1876955 1865811 1855696 1847725 1844256 1845975 1850687
47607 1850687 1855695 1860743 1867755 1878156 1891591 1907168 1924622 1943820 1964150 1985088 2006655 2028727
47595 2028727 2050545 2071631 2092558 2113966 2135282 2155389 2174239 2192754 2211130 2228269 2242975
47584 2242975 2254727 2263018 2267052 2266813 2263662 2258987 2252631 2243454 2231209 2216964 2201412 2183537 2161697
47571 2161697 2136004 2109032 2083629 2060177 2036523 2010736 1983206 1955675 1929041 1903053 1877699
47560 1877699 1853520 1830511 1808006 1786135 1766241 1749046 1733344 1717386 1700922 1684860 1669487
47549 1669487 1654246 1639065 1624578 1610755 1596403 1580809 1565300 1552364 1543217 1536652 1530321 1522777
47537 1522777 1514056 1504647 1494604 1484024 1473789 1465008 1457730 1450948 1444076 1437678 1432405 1427792 1422671
47524 1422671 1416251 1408302 1398857 1388478 1378456 1369749 1361608 1352014 1339731 1325566 1311433 1298545
47512 1298545 1286748 1275365 1264291 1254118 1245266 1237351 1229620 1221731 1213697 1205285 1196250 1187161 1179168
47499 1179168 1172675 1166968 1161447 1156388 1152026 1147800 1143184 1138512 1134086 1129098 1122396 1113877 1104304 1094243
47485 1094243 1084099 1074647 1066352 1058411 1049545 1039507 1028802 1017356 1004797 991942 980462 970735
47473 970735 961255 950590 938885 927095 915856 905648 897175 890745 885773 881220 876154 869879 862364
47460 862364 854804 848832 844763 841292 837216 832603 828050 823798 820170 817874 817088 816916 816519 816118 816283
47445 816283 816856 817402 818164 819704 821945 824225 826081 827518 829001 831700 837041 845121 853957 861223 866579
47430 866579 871523 877182 883133 888391 892813 897290 902987 910450 919118 927686 935197 941628 947294 952113
47416 952113 955855 958684 960832 961986 961623 959826 957261 954489 951694 948878 945840 942206 937972 933798
47402 933798 930323 927534 925331 924215 924579 925687 926441 927110 929171 933229 938077 942259 945709 949397 954102
47387 954102 960132 967570 975945 983918 990104 994300 997554 1001101 1005552 1010969 1017298 1024559 1032701 1041257
47373 1041257 1049207 1055592 1060591 1065669 1072183 1079908 1087467 1094217 1101093 1109317 1118779 1128281 1137100 1145643
47359 1145643 1154499 1163491 1171980 1179702 1186823 1193474 1199777 1206379 1214450 1224833 1237197 1250043 1261520
47346 1261520 1270502 1277180 1282666 1287898 1292983 1297576 1301509 1304801 1307506 1309999 1313025 1316717 1319791 1320492
47332 1320492 1318415 1314640 1310062 1304415 1297170 1288525 1278981 1268551 1256950 1244207 1230785 1217508 1205592
47319 1205592 1196167 1189348 1184188 1179806 1175990 1172496 1168552 1163740 1158800 1154970 1152841 1152244 1152738 1153797
47305 1153797 1155105 1157195 1161166 1167245 1174264 1181083 1187766 1194793 1202179 1210272 1220240 1232181 1243532
47292 1243532 1251228 1255318 1258775 1263605 1268742 1272091 1273074 1272405 1270479 1266895 1261018 1252481 1241564 1229261
47278 1229261 1216350 1202329 1186005 1167274 1147595 1128583 1110915 1094676 1079747 1065617 1051654
47267 1051654 1037788 1024203 1010518 996366 982673 970792 960143 948463 935068 922221 912347
47256 912347 905403 899994 895347 890645 884112 875054 865968 860371 858741 858521 857901 857595 858769 861270 864490
47241 864490 868285 872196 875052 876234 876440 876578 876767 876972 877604 878754 879634 879618 879238 879438 880312 881193 881589
47224 881589 881471 881095 881033 881867 883239 883635 881923 878997 877298 878707 883101 888780 893904 897724 900865 904494
47208 904494 909206 914863 921339 928751 936817 944762 952327 960315 969659 980495 992609 1006058 1020501
47195 1020501 1034518 1046708 1057384 1068265 1080591 1094269 1108685 1123237 1136879 1148174 1156414
47184 1156414 1162253 1166859 1170860 1174292 1177149 1179613 1181902 1183949 1185092 1184437 1182042 1179392 1177717 1176000
47170 1176000 1171804 1164409 1155970 1148981 1143692 1138857 1133953 1129269 1124319 1117807 1109423 1100589 1093017 1087248
47156 1087248 1082952 1079977 1078642 1079354 1082311 1087357 1093783 1100468 1106518 1111951 1117854 1125831 1136902 1150490
47142 1150490 1164547 1177158 1188106 1198706 1210204 1222659 1235290 1247383 1258771 1269734 1280598
47131 1280598 1291161 1300418 1307177 1311059 1312723 1313096 1312684 1311707 1310455 1309105 1307184 1303554 1297295 1288900
47117 1288900 1280465 1274151 1270176 1266740 1262286 1257401 1253969 1252989 1254100 1256924 1261692 1268383 1276270 1284820
47103 1284820 1294278 1304940 1316630 1329482 1344543 1362696 1383307 1404637 1425596 1446581 1468745
47092 1468745 1492911 1519036 1546165 1572839 1597962 1621399 1643525 1664329 1683342 1700510 1716638
47081 1716638 1732524 1747686 1760322 1768887 1773721 1776793 1779655 1781928 1781982 1778687 1772159 1763305 1753401 1743832
47067 1743832 1735350 1727575 1719873 1712509 1706004 1699659 1692204 1684157 1677882 1674525 1672333 1669206 1665675 1663787
47053 1663787 1663910 1664419 1664295 1664333 1665592 1668107 1671534 1675822 1680606 1684882 1688087 1691034 1695165 1701008 1707669
47038 1707669 1713706 1718415 1722275 1725901 1728389 1727200 1720426 1708949 1695648 1682576 1669610 1655658 1640142
47025 1640142 1622953 1603891 1582797 1560027 1536538 1513673 1492752 1474306 1457592 1441282 1424725
47014 1424725 1408213 1392154 1376586 1361458 1346794 1332600 1319241 1307862 1299665 1294694 1292071 1291416
47002 1291416 1293079 1296730 1300770 1303770 1305853 1308136 1311455 1316146 1322340 1329766 1337673 1345591 1353853 1362914
46988 1362914 1372550 1382324 1392430 1403387 1414994 1426195 1435985 1444140 1451104 1457483 1463539 1469008 1473577
46975 1473577 1477716 1482674 1489328 1497247 1505290 1512946 1520694 1529121 1538196 1547631 1557709 1569368 1583184
46962 1583184 1598361 1613112 1626289 1638368 1650589 1663500 1676807 1690222 1703677 1716833 1729273
46951 1729273 1741274 1753613 1766495 1779375 1792026 1804995 1818778 1833230 1848105 1863454 1879188
46940 1879188 1894908 1910407 1925701 1940398 1953892 1966372 1978578 1990254 1999974 2007032 2012269 2016322
46928 2016322 2018365 2017845 2016285 2015825 2016569 2016766 2015102 2011522 2006361 2000360 1995261 1992596 1991515 1989212 1984037
46913 1984037 1977230 1971418 1968440 1968893 1972557 1978573 1985849 1993828 2002470 2011532 2020641 2030170 2041099 2053762
46899 2053762 2067542 2081969 2097094 2112541 2127395 2141659 2156798 2173994 2192684 2211595 2230351
46888 2230351 2249041 2266977 2283238 2298168 2312953 2327587 2340411 2350080 2357102 2362914 2368101 2372216
46876 2372216 2374984 2376994 2379130 2381774 2384656 2387210 2388832 2388967 2387318 2384156 2380355 2376927 2374333 2372217
46862 2372217 2369852 2366999 2364497 2363906 2366349 2371566 2378276 2385421 2392863 2400848 2409301 2418005 2427115 2437020
46848 2437020 2447792 2459274 2471624 2485321 2500474 2516381 2531959 2546595 2560755 2575848 2593133
46837 2593133 2612248 2630807 2645859 2655862 2661148 2662869 2662087 2659737 2656566 2652567 2646828 2638503 2627974
46824 2627974 2616766 2606236 2596432 2586382 2575527 2564674 2555461 2549109 2546064 2546533 2550592 2557720 2567138
46811 2567138 2579060 2594724 2614484 2636568 2658606 2679826 2700805 2721663 2741836 2761368 2780937
46800 2780937 2800349 2818199 2833494 2846648 2858548 2869552 2879829 2889774 2899488 2908614 2917186 2926026
46788 2926026 2935874 2946765 2958724 2972252 2987524 3003744 3020032 3036446 3053490 3071066 3088599
46777 3088599 3105822 3122825 3139673 3156468 3173327 3189737 3204353 3216173 3225634 3233889 3241309 3247328
46765 3247328 3251503 3253969 3254941 3254524 3253041 3250924 3248139 3244112 3238391 3231240 3223720 3217289 3212910 3210209
46751 3210209 3207860 3205292 3203679 3204799 3209219 3216188 3224970 3235559 3248358 3263930 3282959 3305642 3330988
46738 3330988 3357403 3384135 3411554 3439883 3468289 3495589 3521370 3546069 3570089 3593137 3614270
46727 3614270 3632543 3647649 3659835 3669106 3674778 3676105 3673133 3666634 3657402 3645947 3632615 3617515
46715 3617515 3600528 3581824 3562154 3542118 3521394 3499456 3476856 3455012 3434695 3415497 3396937
46704 3396937 3379268 3362857 3347512 3332893 3319094 3306278 3294008 3281414 3267970 3254020 3240709
46693 3240709 3229426 3220882 3214520 3209062 3203764 3198918 3195136 3192523 3190744 3189655 3189771 3192140 3197590 3205795
46679 3205795 3215376 3225400 3236415 3249356 3263800 3278453 3293251 3309599 3328087 3347216 3365155
46668 3365155 3381759 3397873 3413547 3428140 3441781 3455491 3469883 3484614 3498983 3512241 3523368
46657 3523368 3531523 3536997 3541093 3544940 3548948 3553513 3559462 3567427 3577198 3588008 3599146 3610117 3620617
46644 3620617 3630737 3641021 3652083 3664149 3676932 3689742 3701790 3712647 3722365 3730917 3737623 3741599
46632 3741599 3742660 3741162 3736794 3728216 3714430 3696115 3674868 3651224 3624101 3592501 3557207 3520232
46620 3520232 3482786 3444465 3404538 3363158 3320698 3276583 3230081 3182351 3136466 3094781 3056978
46609 3056978 3021306 2986840 2953591 2921268 2889434 2858692 2830216 2803838 2777931 2751740 2726712
46598 2726712 2704705 2685706 2668126 2650764 2633565 2617016 2601803 2588998 2579667 2574017 2571366 2571042
46586 2571042 2573020 2577776 2585816 2597243 2611480 2627618 2645305 2664897 2686344 2708367 2729496 2749659
46574 2749659 2769953 2790890 2811737 2831571 2850046 2866718 2880548 2890669 2897188 2900676 2901363 2899430
46562 2899430 2895722 2891518 2887788 2885263 2884980 2888026 2894625 2904100 2915912 2930127 2946727 2965175 2985263
46549 2985263 3007964 3034580 3064949 3097107 3129048 3160405 3191882 3223198 3252222 3276489 3295239
46538 3295239 3309512 3320206 3326462 3326217 3318227 3303263 3283402 3260535 3235781 3209851 3183128 3155071
46526 3155071 3124219 3089731 3052894 3016350 2981547 2947666 2913472 2879307 2846268 2814090 2781544
46515 2781544 2749026 2719161 2693801 2671572 2649588 2626840 2604400 2582682 2560277 2535992 2510595
46504 2510595 2485713 2461924 2438857 2416383 2394640 2373354 2352296 2332231 2314278 2298308 2283134
46493 2283134 2268572 2256250 2247657 2242215 2238025 2233940 2230015 2226379 2222725 2218997 2215762 2213708 2213391 2215457
46479 2215457 2220315 2227276 2234723 2241729 2249061 2258066 2268849 2280104 2290625 2300516 2310982 2323360 2338311
46466 2338311 2355535 2374040 2392880 2411761 2430934 2450691 2471203 2492750 2515739 2540325 2566149
46455 2566149 2592558 2619144 2646199 2674699 2705574 2738743 2773021 2807235 2841343 2876196 2912417
46444 2912417 2949902 2988280 3027247 3066252 3104384 3140962 3176074 3210236 3243498 3275001 3303362
46433 3303362 3327540 3347518 3364263 3378937 3392050 3403283 3411937 3417444 3419668 3419165 3417070 3414380 3411329
46420 3411329 3407731 3403801 3399978 3395781 3389544 3379877 3367129 3352928 3338373 3323085 3306067 3287043
46408 3287043 3266710 3245801 3224127 3200647 3174309 3144575 3111120 3073648 3032533 2989407 2946214
$$ [...]
##END NTUPLES=NMR SPECTRUM
##END=
