
##TITLE=AC1175_Popayan-timbio-cauca-CTiAH12017_5898312_MqStoMD3g8
##JCAMPDX= 6.0         $$ Bruker NMR JCAMP-DX V2.0
##DATA TYPE= NMR SPECTRUM
##DATA CLASS= NTUPLES
##ORIGIN= BRUKER
##OWNER= Administrator
$$ 1.72 TOPSPIN		Version 2.1
$$ 2012-04-10 10:40:22.703 -0500  Administrator@TOPSPIN
$$ Compression mode = diff/dup
##.OBSERVE FREQUENCY= 400.13188235
##.OBSERVE NUCLEUS= ^1H
##.ACQUISITION MODE= SIMULTANEOUS (DQD)
##.ACQUISITION SCHEME= undefined
##.AVERAGES= 8
##.DIGITISER RES= 22
##SPECTROMETER/DATA SYSTEM= spect
##.PULSE SEQUENCE= zg30
##.SOLVENT NAME= COFFEE_meoh
##.SHIFT REFERENCE= INTERNAL, COFFEE_meoh, 1, 14.98061
##AUDIT TRAIL= $$ (NUMBER, WHEN, WHO, WHERE, PROCESS, VERSION, WHAT)
$$ ##TITLE= Audit trail, TOPSPIN		Version 2.1
$$ ##JCAMPDX= 5.01
$$ ##ORIGIN= Bruker BioSpin GmbH
$$ ##OWNER= Administrator
$$ $$ C:\Bruker\TOPSPIN/data/COFFEE/nmr/AC1175_Popayan-timbio-cauca-CTiAH12017_5898312_MqStoMD3g8/10/pdata/1/auditp.txt
$$ ##AUDIT TRAIL=  $$ (NUMBER, WHEN, WHO, WHERE, PROCESS, VERSION, WHAT)
(   1,<2012-04-03 16:04:14.187 -0500>,<Administrator>,<TOPSPIN>,<go>,<TOPSPIN 2.1>,
      <created by zg
	started at 2012-04-03 16:03:05.578 -0500,
	POWCHK enabled, PULCHK disabled,
       configuration hash MD5:
       1A 1E CE 29 27 FD 77 03 67 4E F0 E3 C4 B2 CB 90
       data hash MD5: 64K
       21 14 27 01 9C C8 F4 D6 07 7C 39 C2 A1 FA 42 F8>)
(   2,<2012-04-03 16:04:17.109 -0500>,<Administrator>,<TOPSPIN>,<proc1d>,<TOPSPIN 2.1>,
      <Start of raw data processing
       efp LB = 0 FT_mod = 6 PKNL = 1 PHC0 = 0 PHC1 = 0 SI = 32K 
       data hash MD5: 32K
       2B A4 35 1D F3 11 F1 6B 0C 99 00 0B 87 C5 94 D9>)
(   3,<2012-04-03 16:04:17.515 -0500>,<Administrator>,<TOPSPIN>,<proc1d>,<TOPSPIN 2.1>,
      <pk PHC0 = 211.7834 PHC1 = 0 
       data hash MD5: 32K
       DC AC 78 F2 9A A3 E5 93 98 8A C1 AE 20 4D 02 57>)
(   4,<2012-04-03 16:04:17.578 -0500>,<Administrator>,<TOPSPIN>,<proc1d>,<TOPSPIN 2.1>,
      <abs ABSG = 1 
       data hash MD5: 32K
       A0 65 4C DF DC CC 0C 5C 25 E6 7E 44 72 B6 DD 52>)
(   5,<2012-04-03 16:04:17.625 -0500>,<Administrator>,<TOPSPIN>,<proc1d>,<TOPSPIN 2.1>,
      <abs ABSG = 2 
       data hash MD5: 32K
       0E 6A 34 3A 74 E4 AD DD EA 39 DD 6E F9 A9 4A 2D>)
(   6,<2012-04-03 16:04:17.656 -0500>,<Administrator>,<TOPSPIN>,<proc1d>,<TOPSPIN 2.1>,
      <abs ABSG = 3 
       data hash MD5: 32K
       DB 31 D9 98 06 FF 00 00 C2 0A 93 46 61 E3 41 7D>)
(   7,<2012-04-03 16:04:17.703 -0500>,<Administrator>,<TOPSPIN>,<proc1d>,<TOPSPIN 2.1>,
      <abs ABSG = 4 
       data hash MD5: 32K
       28 09 3E 92 76 59 E2 EE 04 49 36 18 53 87 F2 0C>)
(   8,<2012-04-03 16:04:17.765 -0500>,<Administrator>,<TOPSPIN>,<proc1d>,<TOPSPIN 2.1>,
      <abs ABSG = 5 
       data hash MD5: 32K
       60 E6 9E B1 7F FA DD CC C0 5C F5 65 E3 17 A9 BA>)
(   9,<2012-04-03 16:04:22.031 -0500>,<Administrator>,<TOPSPIN>,<audit>,<TOPSPIN 2.1>,
      <user comment:
       ICON-NMR User ID: COFFEE
       data hash MD5: 32K
$$ [...]
##$TP= (0..7)
150 150 150 150 150 150 150 150
##$TP07= 0
##$TPNAME0= <>
##$TPNAME1= <>
##$TPNAME2= <>
##$TPNAME3= <>
##$TPNAME4= <>
##$TPNAME5= <>
##$TPNAME6= <>
##$TPNAME7= <>
##$TPOAL= (0..7)
0.5 0.5 0.5 0.5 0.5 0.5 0.5 0.5
##$TPOFFS= (0..7)
0 0 0 0 0 0 0 0
##$TUNHIN= 0
##$TUNHOUT= 0
##$TUNXOUT= 0
##$USERA1= <user>
##$USERA2= <user>
##$USERA3= <user>
##$USERA4= <user>
##$USERA5= <user>
##$V9= 5
##$VALIST= <valist>
##$VCLIST= <CCCCCCCCCCCCCCC>
##$VD= 0
##$VDLIST= <DDDDDDDDDDDDDDD>
##$VPLIST= <PPPPPPPPPPPPPPP>
##$VTLIST= <TTTTTTTTTTTTTTT>
##$WBST= 2048
##$WBSW= 25
##$XGAIN= (0..3)
0 0 0 0
##$XL= 0
##$YL= 0
##$YMAX_a= 528473
##$YMIN_a= -647073
##$ZGOPTNS= <>
##$ZL1= 120
##$ZL2= 120
##$ZL3= 120
##$ZL4= 120
##$ABSF1= 14.98061
##$ABSF2= -5.57192
##$ABSG= 5
##$ABSL= 3
##$ALPHA= 0
##$AQORDER= 0
##$ASSFAC= 0
##$ASSFACI= 0
##$ASSFACX= 0
##$ASSWID= 0
##$AUNMP= <proc_prof1d_extract_pilot.lims>
##$AXLEFT= 0
##$AXNAME= <>
##$AXNUC= <1H>
##$AXRIGHT= 0
##$AXTYPE= 0
##$AXUNIT= <>
##$AZFE= 0.1
##$AZFW= 0.1
##$BCFW= 0
##$BC_mod= 0
##$BYTORDP= 0
##$COROFFS= 0
##$CY= 15
##$DATMOD= 1
##$DC= 0
##$DFILT= <>
##$DTYPP= 0
##$F1P= 0
##$F2P= 0
##$FCOR= 0.5
##$FTSIZE= 32768
##$FT_mod= 6
##$GAMMA= 0
##$GB= 0
##$INTBC= 1
##$INTSCL= 1
##$ISEN= 128
##$LB= 0
##$LEV0= 0
##$LPBIN= 0
##$MAXI= 10000
##$MC2= 0
##$MEAN= 0
##$ME_mod= 0
##$MI= 0
##$NCOEF= 0
##$NC_proc= -8
##$NLEV= 6
##$NOISF1= 0
##$NOISF2= 0
##$NSP= 0
##$NTH_PI= 0
##$NZP= 0
##$OFFSET= 14.98061
##$PC= 1
##$PHC0= 211.7834
##$PHC1= 0
##$PH_mod= 1
##$PKNL= yes
##$PPARMOD= 0
##$PPDIAG= 0
##$PPIPTYP= 0
##$PPMPNUM= 2147483647
##$PPRESOL= 1
##$PSCAL= 4
##$PSIGN= 0
##$PYNMP= <proc.py>
##$REVERSE= no
##$SF= 400.13
##$SI= 32768
##$SIGF1= 0
##$SIGF2= 0
##$SINO= 400
##$SIOLD= 32768
##$SPECTYP= <>
##$SREGLST= <1H.CDCl3>
##$SSB= 0
##$STSI= 32768
##$STSR= 0
##$SW_p= 8223.68421052632
##$SYMM= 0
##$S_DEV= 0
##$TDeff= 65536
##$TDoff= 0
##$TI= <>
##$TILT= no
##$TM1= 0
##$TM2= 0
##$TOPLEV= 0
##$USERP1= <user>
##$USERP2= <user>
##$USERP3= <user>
##$USERP4= <user>
##$USERP5= <user>
##$WDW= 1
##$XDIM= 32768
##$YMAX_p= 462134873
##$YMIN_p= -717460
##$CURPLOT= <Network HP LaserJet P1505>
##$CURPRIN= <$Network HP LaserJet P1505>
##$DFORMAT= <normdp>
##$LAYOUT= <+/1D_H.xwp>
##$LFORMAT= <normlp>
##$PFORMAT= <normpl>
##$SURQMSG= 1
$$ End of Bruker specific parameters
$$ ---------------------------------
##NTUPLES= NMR SPECTRUM
##VAR_NAME=  FREQUENCY,     SPECTRUM/REAL,   SPECTRUM/IMAG
##SYMBOL=    X,             R,               I
##VAR_TYPE=  INDEPENDENT,   DEPENDENT,       DEPENDENT
##VAR_FORM=  AFFN,          ASDF,            ASDF
##VAR_DIM=   32768,         32768,           32768
##UNITS=     HZ,            ARBITRARY UNITS, ARBITRARY UNITS
##FACTOR=    0.250966925370066, 1,           1
##FIRST=     8223.43324360095, -120481,      -59667
##LAST=      0,             -114398,         -83660
##MIN=       0,             -717460,         0
##MAX=       8223.43324360095, 462134873,    0
$$ Real data points
##PAGE= N=1
##DATA TABLE= (X++(R..R)), XYDATA
$$ [...]
23774 -116720 74141 -64502 -391004 -226376 139296 -4912 -28307 -286196 116497 -113066
23763 165957 -73502 -115590 -53630 54653 241534 197273 -359891 -215027 -130131 6986 90382
23752 90382 152507 -344276 187912 86200 -174056 -148098 38587 -220659 132680 125458 192850
23741 192850 36309 -151180 16482 -273816 -141384 -368903 -160472 213854 -38015 -203890
23731 -203890 -130637 -165205 193196 -161402 -127277 2933 -8207 -145212 -94638 154486 23022
23719 441065 90987 -16635 -197031 237282 -117793 -157228 -292439 121416 21007 -48975
23708 -438760 266516 -266738 -114953 61156 214115 -163634 -489212 -202604 87898 -293064
23697 85930 -1608 190232 339855 -50230 -76807 -79232 -117234 -98137 138148 147119 -84198 -116889
23685 -116889 -2594 -73806 1957 -322996 251231 113612 49243 -229684 138927 18459 221915
23674 221915 -179617 -165258 -26120 -154778 210048 304139 14260 -24083 -42878 -32362 229025
23662 129068 280490 -124923 43304 262612 -359651 -17444 -114018 -295749 -203798 19097
23651 66554 60342 -150758 20057 337000 155887 -68509 -63926 122197 -148461 123648 -120664
23639 -58850 125837 26993 -123663 -39819 178578 -21690 -26147 -353108 -95222 -16630 233138
23627 -69765 15253 220839 -121791 175243 -86091 -67524 -42356 -11298 50774 118097 -81457
23615 -19917 187881 -33264 11328 -148014 -127602 81515 166118 -171474 19003 98509 -68446
23603 -34480 -66934 245006 71945 -124760 132017 -165955 1247 76531 16914 -220228 85469
23591 44513 -32975 -186827 295962 4888 -51889 113315 374036 78361 138319 380584 149811
23579 235193 203145 -223032 51217 58493 99838 86495 18555 326619 166919 42365 -220532
23567 159570 314338 18856 -198935 -104766 -121696 175837 11532 -136033 -110639 44623 -134628
23555 -62097 50082 -23643 -23548 -338697 86876 -118885 413 47936 -95336 -232641 -99049 -51138
23543 -51138 259526 -35003 -304415 281514 -127117 -64338 33045 -101630 -370153 22059
23532 -5798 214281 -117660 -205657 -61428 -49467 47031 126838 -33561 -338224 -144132 -94731
23521 -94731 225006 323612 401366 -20267 -87875 -157897 25663 122422 -356214 -53471 146294
23509 114593 146126 -388910 56726 95570 -288174 211708 132584 166052 181032 230695 16204
23497 -63300 -60542 -265185 29452 -2408 -11190 -212071 228713 222666 132369 -73132 33181 -20920
23484 -130443 -340035 37628 -274127 17751 -220943 -21475 108289 148786 124800 108150 -217546
23472 340839 -11744 270066 109036 21489 -269260 -74114 55449 35945 -108385 73620 -195033
23460 -139270 -10155 -62709 -129419 203665 64864 195378 -6926 101741 27122 -117937 157899
23448 69978 73098 -220461 70594 -69653 -91283 -5362 -242751 86446 -128288 -226534 -228901 46434
23435 205160 -377527 36832 -111819 59879 -50765 -71146 33469 -127185 56040 135917 -53602
23423 205008 78452 39291 49391 -12387 -115815 -268098 3865 -37742 -73160 -149861 106165
23411 -120660 131351 -107271 -71065 -139472 212265 279226 3795 -184074 85554 26529 -163026
23399 -93261 116345 -12363 245966 -114822 132094 -131607 -302685 -21851 -204320 30817
23388 125852 52850 -24489 21708 29060 6867 93772 45220 -131756 -50855 -150115 -96023 -24081
23375 39182 -47257 247050 -182045 42372 -8476 171793 80620 -86383 242640 -151321 -48270
23363 -10571 -174569 -212673 -408389 -62045 98823 -113026 -28881 79446 -50065 316453 -66562
23351 198169 -99252 28507 -145219 -62279 89427 236711 -155143 -139608 -127369 146694 75752
23340 75752 -133456 -255220 -81592 13841 -136016 -228191 -12680 23136 -127400 72844 -59147
23328 -53990 138143 -22290 -18386 109892 -398716 163493 74022 -86677 -12095 -56159 -244323
23317 -244323 81301 6189 -147908 62618 -71533 32690 -197035 118797 40105 37118 -137135
23305 88466 335773 -167612 74297 -347089 -64209 37618 -26490 136440 87352 -32902 30253
23293 174380 -186412 -173719 -178697 -309554 -38125 -200998 86947 43517 -214988 -281784 255497
23281 569000 18143 101013 1191 -78210 25935 -30370 28050 -53915 -340942 -224772 -324869
23270 -324869 393605 -42203 189222 -202586 -194034 79531 -160471 75766 4546 -364654 -9982
23258 -52256 150794 88310 193233 44883 -316582 -67010 -179454 84872 -49834 -116055 -193432
23247 -193432 -139521 -13177 398808 139311 192949 9843 27713 -68275 79595 -347587 -43770
23235 62844 21998 -117082 -145925 245236 122109 -125827 -105163 -157226 45246 -140720 -377408
23224 -377408 46043 -240638 198974 -18234 -168587 -160898 13698 96801 29242 -384030 -107046
23212 -34761 -39449 -35412 -181003 339918 -38151 106355 -130627 -282119 456009 4155 -43072
23200 -146274 -135779 -64612 92354 40610 -135761 98144 194100 -166075 88422 99853 -27606
23188 -201393 7702 -43111 -122102 101415 115092 -333863 -325376 227776 -156830 -179233 207257
23176 -36005 -236693 217394 64621 -215213 235787 -18880 93444 -34178 -141015 48708 -5091
23164 -231812 102277 -140710 -73025 -253349 -91890 -141707 -261297 48077 75893 21839 263533
23153 263533 111403 -103568 -114518 157593 36017 -351575 -29440 -107126 -14392 129466
23142 247127 129887 -529257 -117356 -50969 -263445 40752 325918 -82854 -130511 13629
23131 21806 -697330 42780 291297 59900 -144789 36581 25069 -77590 -83032 73619 -74591
23119 -18649 94160 137152 -166967 -9761 62618 -152955 -69737 -51563 -509806 -39750 -102678
23108 -102678 -10349 331074 -73219 -368109 114080 155899 -339930 -8655 -356262 -39459 -462038
23097 -462038 -9231 -118188 -18711 -473326 311503 208246 -90057 10628 28798 -5601 -175689
23086 -175689 -151425 -16347 328605 275083 -147879 -200096 -165228 -46804 139333 -486687 244717
23074 710 -159127 -29697 -168587 -14357 110673 -315188 102311 7788 90185 -214014 -145851
23063 -145851 -187718 33256 13339 -206266 54687 164107 -367793 -84592 330740 -95085 40098
23051 -109648 198309 148340 -84092 25836 -25194 -154003 67508 156238 121310 115546 235865
23040 235865 -3393 5157 -106803 217641 232151 61859 246104 -164742 -63119 -45454 -197185
23029 -197185 -155166 -402280 -76044 -110742 340567 104244 133269 -213109 -280031 -117354
23018 57588 -299855 -33736 171465 25101 310268 178306 37298 19276 -74914 -121229 144581
23006 -7758 -23983 -94041 93224 -103801 -82352 -115578 -114707 28301 -179756 -77109 -153010 129412
22993 261870 7159 -68903 130745 -122122 -211522 -71811 150203 -72342 242067 -111466 78421
22981 155895 217283 -160939 10412 -62087 -388511 -207738 -269162 -64075 90690 -23807 42025
22969 69778 62058 193160 31941 119552 -10527 64079 -51013 -30586 -26592 190138 -222680
22957 188756 86974 13592 225362 -91754 -193447 37365 152289 66243 234409 122468
22947 122468 23829 -136308 -188204 -149573 183104 183928 -151109 215395 -20810 -7256 22853
22935 65108 158198 324037 190204 -135114 -145841 -97404 -93344 14632 79764 17704 -116927
22923 59904 -415999 148515 -38013 166095 -298633 11482 20529 234077 -217090 -241900 21913
22911 -107951 36998 225901 156052 -137533 196791 146323 -95903 216902 -317985 -63909
22900 -409283 93248 206221 -102203 228329 168506 -63893 -30261 -66412 -65599 294650 -13275
22888 93273 -277187 -75187 -73721 -172420 40559 -148292 355358 -20540 -272745 170097 -131007
22876 -111577 54050 44489 -100209 -120010 125012 -377452 -153775 7842 22642 56671 -126310
22864 59583 -176310 -286446 28148 31536 -190444 -22813 304556 82201 279665 307381 -8187
22852 15077 -85329 -60897 33278 -40962 -382434 86841 -74928 -41029 83561 -90262 -119461
22841 -119461 421021 34923 172703 -191480 -309857 -175267 -80231 180911 -123056 -142060
22831 -142060 128746 125501 54085 -132609 -152423 -254881 -132824 -65536 192913 -307969
22820 -153344 68548 -491709 -198872 -175489 -254004 -196843 -123007 -6326 1503 61707 -356737
22808 -46591 -71371 -58259 -129761 -310876 155932 -66563 22629 147214 -217727 -265074 -72753
22796 -64216 141247 -76449 -323939 -14999 -390505 -109053 60647 51186 231291 -225126 -41673
22784 -111701 -95734 -99063 229779 -109627 -71917 66152 -65736 -93244 -147979 -182397 -45292
22772 -253285 -309170 155366 212085 60103 -36630 38670 -19381 -103215 191122 -200364 -44705
22760 248671 -205940 -297207 -364645 200882 -127331 -114321 9128 180112 -71004 117887 -168
22748 260348 -44838 -110701 154071 -118787 -144659 -134380 79695 -38171 375375 -241997 -56839
22736 -219492 -66953 -184415 -242818 -375419 -207041 261021 -93581 -316361 -171747 262152
22725 -160989 -256527 9444 21916 -250803 -122447 -118984 45647 -273196 -163575 -174240 38985
22713 -184338 18058 -45162 -105705 200738 -252663 138070 -160658 -28978 165577 44583
22702 103819 49204 390 41830 -120294 -197601 259904 -9598 -55582 -240535 145220 244649
22691 244649 -376817 -68613 167072 -32595 109205 -194997 -176351 -277477 -61755 279505
22680 -302057 -11671 -230329 64425 64802 262222 -31688 -59137 -219090 84747 -176411 -43811
22668 162389 -6744 -106688 -47973 -95980 7920 159521 70437 200196 -207025 72131 174239
22657 174239 -12362 -19531 -48818 10363 343798 -127413 -120659 73387 -139680 93203 52006
22646 52006 85188 246925 -263552 32385 88444 159186 93926 -127136 -31017 -50843 -190448
22635 -190448 27543 10324 61484 -253327 -383947 196133 -212635 -282090 115439 239796
22625 239796 -422173 -31546 -136545 -136387 15159 -121509 -191755 52081 -289829 -26304 220677
22613 32275 -9880 -21078 -50418 -19080 93204 -214465 -363393 -39919 136221 114985 -127877
22601 -191701 -124233 56531 -77986 29365 166619 58588 -76146 -153795 -69855 171531 67445
22589 -249528 -212249 74426 67536 160455 27183 -125748 27617 332957 -240027 2374 202124
22578 202124 -113686 198193 427165 -19967 -12349 -234328 111450 -18101 -93439 530 40771
22567 40771 42263 -238731 -113710 141865 -78180 -194062 -145014 319823 -226666 -274316 172837
22555 1206 -24885 173429 1279 122531 -97453 236520 -163021 -331106 -19992 119385 -154991
22543 10368 -142446 -81224 164731 335923 -20868 -183516 6168 46734 -343474 32389 28525
22532 28525 34860 -262879 -423733 -209218 111718 -74617 224381 -321101 68547 -42238 -110065
22521 -110065 242772 92664 -102540 -194348 -116592 -353196 -102585 -386777 186657 -20437
22510 -121366 -126472 -29318 -33189 -258548 -34161 175537 -140408 -189772 269122 189214 79056
22498 34717 -179358 -253900 -57793 -14435 204345 43805 -40285 -44697 46942 -248580 -168980
22487 -168980 160549 -6251 -80266 -114366 -245187 70050 -267758 -75498 51352 -148233 84597
22475 -112827 -228600 -362439 -317589 -47546 -369851 118964 -2158 -272707 342963 67941
22464 -28756 41842 -12386 -205158 -17901 -155288 -76321 24553 238687 -152221 -127295 -194423
22453 -194423 -345143 -64400 -206074 -157125 25497 -76029 132831 -60081 -128678 -145277 -153130
22442 -153130 118677 -39922 372336 109069 13893 -263829 38232 98110 -32793 -70250 -287365
22431 -287365 -40912 -153813 2946 -22985 144926 243075 -23014 132136 -263891 64000 -187044
22419 -124313 -86278 -131035 -427289 20530 -361377 -67754 -394717 -338295 -80299 -66993 -59967
22408 -59967 -15927 -243624 -343355 56865 -134321 26970 -88263 1050 283408 -264999 -14546
22396 88617 -55787 -268356 -155658 44124 -18108 34399 89031 32409 191388 87548 -48682
22384 72115 -264453 -82327 57661 183233 -142396 -153771 -211734 -165908 84695 -116301 21663
22372 -203634 31465 164846 -281986 -79043 30819 110877 -482175 -205232 -209983 58331 27753
22360 73712 -328300 107569 -3012 -147975 171142 -135985 180107 78712 388390 -383862
22349 49764 -92319 100710 5720 188201 47734 -157288 -134122 -147762 387918 150690 197424
22338 197424 -122039 -322254 -207145 -104132 -120419 -14761 -11640 -189902 -125619 -67678 -131795
22327 -131795 263123 -254764 -84116 -75846 -271176 134578 143210 -33674 106057 -116767 185074
22315 271527 80181 234296 -94086 -193750 -331087 -106438 -223111 -42480 74166 -41414 -147011
22304 -147011 -110927 -73120 215184 -247715 30974 -32738 58201 219693 -169220 -83497 -106930
22293 -106930 83084 -41549 -90393 -155136 -9978 -347557 320397 -233630 34428 -251794 -113625
22281 -232356 335126 -52741 -92603 308907 89902 -138811 27589 212197 -131322 -97472
22271 -97472 -260823 330603 -272409 -47537 -73561 315687 31519 169476 -327594 53381
22260 -70523 -45541 -81118 193615 -157588 75122 79314 -385345 -61848 100423 -305497 -253724
22249 -253724 194599 -273198 -374223 139058 -53235 -78446 -118394 115613 -203689 -42312
22238 93339 -19977 -152429 -172078 -60819 189152 -64156 24999 -264090 87062 5534 -88239
22226 -124360 -173313 119281 142932 -42854 -7965 -149179 193792 -56856 -95309 71462 239905
22215 239905 -140024 -21425 160754 115980 287679 -78598 57946 -244593 213733 -75781
22204 46729 67462 -233648 112243 147956 -375688 176410 121243 -261316 83280 90203 -44168
22192 -121066 -304261 -95989 44199 260739 32104 227883 -285806 -337703 -79636 -172427 95973
22180 -50602 -8126 149221 73671 27859 -173812 153291 -182389 -91698 7494 7753 -188614
22168 -57573 -200830 -108750 -343156 -303200 68605 -134460 -235959 218869 -383 47587 -110871
22156 -88067 -125719 -135803 76878 -164422 -131592 47077 -337754 -181845 -519 -221938 7968
22144 52413 134987 -255727 -267704 185760 379328 -121612 -46883 -172477 136778 -152611
22133 66364 249043 -115557 -228104 -65205 -39392 54192 -166823 -74177 -107610 -208010 -171754
22122 -171754 -127521 -551558 -138857 -152422 15163 116749 -39876 271436 -18561 1039 294277
22111 294277 56113 -297961 126383 -189104 113068 -173413 -84272 20044 -155332 -144560
22101 -144560 125685 -218165 94647 -172380 -253667 -344380 119715 69591 -166445 39716
22090 -81051 189849 102929 -84496 -71953 338719 346585 104384 98575 177347 -318191 -157763
22078 -98637 116509 -289192 149592 99137 -24029 -90316 -270266 39496 -122187 90462 96509
22067 96509 -277978 -213835 10561 -276542 -254984 -219015 -301897 -144981 -312635 -108929 41934
22055 -309035 -27172 13476 -100504 -255792 76344 230109 -75468 229839 -11806 -66742 126972
22043 146733 -61152 257900 -160440 -34357 -91722 -65493 -83731 82656 715 -114522 -56051
22031 -90458 -81942 -212383 -256924 -28659 80828 -147937 120818 37472 37741 44089 -108646 238926
22018 468 -110907 71347 84064 -79633 225094 -191521 -333178 -231247 -132482 -67128 379313
22006 92189 34282 41719 -191384 -149887 6763 143306 -121844 -237371 -62474 89729 192644
21995 192644 9533 -151054 -226892 36429 1567 86198 -154100 -207552 87268 179999 -157293
21983 -164660 -10188 -18355 -304176 46652 48377 -180322 -241497 89431 -189271 204746 -226183
21971 -68106 -139355 -183371 -333565 37183 -63033 -185119 -305435 11391 -377977 457603 -235892
21959 -158229 -257210 60133 -374066 220951 -24540 70503 101602 58839 -163828 -61735 38200
21947 -129154 -63706 -93486 53160 77432 -126423 -232709 65786 -188822 92887 -43656 180475
21935 -179165 90937 -104516 -94366 -228624 39916 414103 -130602 22312 -163189 38205
21924 142503 -96733 76509 207060 -6098 -105159 -14313 -76114 56157 214124 -211993 -86697
21912 82611 10128 210841 -45944 45321 -94236 -196250 -575 -96408 -59501 11367 86231 -269645
21899 204136 136750 -152053 -191733 284221 34854 296303 -66894 -70318 -191018 -260510 -181010
21888 -181010 -41525 -194647 -163477 98491 20051 38066 -221223 160473 -263 344226 35707
21876 51939 -71481 -110181 298967 92380 90970 -396868 -120465 -127183 -222240 -87499 193504
21864 -79513 -245419 -107162 -42021 -131607 -167652 53647 -183146 -207398 -169521 -149996 -97054
21853 -97054 -35655 177853 -310840 103744 206652 -153824 -132620 49534 109275 214911
21843 214911 62821 -15254 -307621 29286 -58931 59258 -194533 -107963 228701 -282954 -129509
21831 -516795 -1257 -178913 -9802 70305 343029 -368423 90833 -129768 -185216 199439 69544
21819 49470 169490 -5115 -18083 -243138 -271431 119288 -102184 150499 187423 -41163 -68856
21808 -68856 -129721 -28619 -130143 -445093 -329665 -202968 115204 5107 17675 -73646 165554
21796 43374 -149617 -124606 -337083 124951 -17109 -43190 -8139 -149845 -206744 -42370 15969
21784 -144577 20341 -88549 -475906 -40170 26459 -55601 76748 -177107 41027 124053 188023
21773 188023 79880 63791 137027 166397 53065 271018 -98951 21468 403412 -21733 -295092
21762 -295092 69338 -155690 128172 20269 34573 -100044 72071 -306979 199655 219593
21752 219593 -179612 -390264 -219344 -175905 57206 -255806 156416 -149811 306352 87035
21741 -61703 304367 -284795 159688 -113266 -6790 -7290 22639 -207018 63219 92398 -234703
21729 39210 -337573 -126634 -50927 19094 -62718 70000 -8463 -6821 -34516 -157512 72698
21717 -186379 -232893 69411 -267097 -63303 -101758 -160183 -195630 128203 -24979 -93496 340887
21705 123933 -294179 -315020 -175800 -212980 -39137 61148 -207065 -335846 -116174 298893
21694 -108277 98303 166848 204281 -219970 -43974 60883 19657 11865 47698 -41671 -137032
21683 -137032 197938 -88573 -59190 -210126 -353000 -127254 -18783 26301 -280477 281494
21672 -12815 34439 235890 128960 48937 -127224 13764 -270807 -165958 -180770 136126
21661 -71923 -714 -34849 -27449 -191031 302780 22702 6300 -123629 -260784 -332921 -329174 25951
21648 -373954 112460 -307870 -222050 206166 -21602 -3601 -291230 53817 -153055 -141502 16731
21636 -119648 -166104 -31348 63493 -47702 -43974 -169103 87652 -211541 120133 -90860 45887
21624 -5934 -133492 36832 -207475 -179683 58736 1198 174026 119854 -254384 -15180 -98639
21613 -98639 -137938 37320 -1055 -56904 -358695 -105276 -25471 -199921 246465 -110926 -260942
21602 -260942 -70720 295705 127293 -344798 92997 -31849 -126826 -25787 -162863 227241
21591 -263555 -23887 404131 -60140 -231133 182138 86041 -68763 195728 -58911 133269
21580 -229216 106328 38927 -183010 -91976 53420 -5243 91255 104008 31707 -437514 -170801
21568 -135584 190360 77607 -4331 -24876 51659 -162612 48811 -91635 339792 -189768 -126888
21557 -126888 330040 -150342 297983 -139505 -55296 -26362 -173134 -106080 153395 -139575
21546 73207 91556 261386 129066 -90727 37534 27413 -182339 -77160 97986 -9458 -287216
21535 -287216 103222 44790 106916 -15543 149740 -111159 22147 7042 46748 144384 84372
21524 84372 151817 60393 55028 181860 -39536 -48177 209825 163228 -255146 -109562 81168
21512 149577 -124683 76182 -67956 145528 -31183 13633 -309352 -39633 -37804 -174667 -334959
21501 -334959 35478 -93185 -163988 -362062 -152136 -156122 187208 89423 -150249 -14993 -232884
21490 -232884 -55251 -346386 40583 -176811 63261 -272922 -192122 -88150 -273027 42996 16191
21478 -158346 -161870 -32926 158924 -141404 -125435 -128708 -184538 225402 82069 -126070 -242375
21467 -242375 -9401 -185794 -31596 179430 -267542 -42887 -71361 6868 215340 -229559 -198773
21456 -198773 -74249 -142715 -114435 -209854 -141874 -445870 -102166 96584 -154044 -141076 -263343
21445 -263343 209927 96118 -71291 67511 270156 102467 -184052 -99265 -49723 12430 -11370
21433 -73368 -26528 71068 -104610 -274576 -343112 -361556 486277 290505 665195 339833
21423 339833 191865 181939 331323 101653 174382 50865 101121 -312008 -16485 -225119 40636
21411 -42871 132081 -38370 -73806 -104684 -187144 -89123 -356635 315916 -68381 140410 8316
21399 -257898 33110 -128163 291919 124501 -295024 -443434 -28516 102044 -174801 -76910
21388 495 11502 -124017 -94264 -126852 -20474 -12785 -309974 -126048 247164 -33854 -51140
21377 -51140 -27909 -144575 258123 -195649 -170802 -130429 128955 -133064 -155252 -299043
21367 -299043 -1479 414175 151651 -365692 -65731 -93016 -211441 -148342 -34988 -374490 40702
21355 -116683 37353 -127664 -386918 -46056 -53878 -108568 13373 -161902 -242540 -345269 148678
21343 -34028 61877 97641 -37053 283097 104556 -202955 283705 -400382 96332 66258 -226687
21331 218789 -15108 212025 -288213 -158642 -137878 -106149 -55175 -85416 -41782 -140572 -242876
21320 -242876 -257696 -162708 -133264 -190326 -76392 114488 -247160 -55773 -6429 -112925 -11143
21308 -357221 -96659 -19109 -126830 -34086 -16670 70404 21748 -123362 -134697 -298300 59954
21296 29114 -48099 -255931 49032 -67194 108359 -320136 74951 -57784 -60127 -10112 225624
21284 -22847 2774 -106367 -89042 -110664 -3557 -53639 76477 -60707 123069 -380808 -215226
21273 -215226 -123707 -66265 -79763 -106910 -17204 -194276 -115110 -134038 -6405 72669 -210705
21261 -85818 -24509 -99557 -189194 -85150 -177378 -24890 -1712 198796 -137227 37210 -236607
21249 -366610 -597420 -17864 47050 -123156 42454 275314 175115 -470987 18828 -231480
21238 81576 86473 -207605 231287 -404785 -51717 -185125 74078 -224283 -166047 5090 -181126
21226 -111648 -87568 138864 -21792 376558 112485 -246455 -83220 -127476 -267796 -174326
21216 -174326 -296859 -58501 130569 -355810 190790 -273418 55064 125819 -242401 385091
21205 -373686 102648 -263269 -162920 -246304 121638 -66259 254340 173431 -334180 122895
21194 -5169 -1818 -16965 -26789 -233382 42646 342914 178248 -127617 -149930 -331825 -241652
21183 -241652 192294 79665 154096 -88258 -15644 -380235 -141238 -8227 -67468 15545 -5549
21171 70464 -97290 234514 -294964 191084 338125 -29041 -520194 240872 -346755 -180024
21161 -180024 -401871 -21654 120418 -242931 9061 14185 155888 -139575 254163 59638 -71459
21149 -100143 46308 173972 67808 -144960 -20475 -284881 260915 -156578 -29855 16773
21138 -114766 507989 -141173 153923 16763 97366 107035 94399 164550 -27435 -332221 -350
21126 -210992 32384 -163907 -307939 45013 -449489 -16122 -97031 -102712 103030 -183384 62335
21114 -270349 -424086 -59448 11566 127540 -220123 284482 -4864 -150066 178293 -4763 -56815
21103 -56815 -3655 -107564 -160447 -105355 27654 -207182 -137458 -135144 -348718 -137036 -220648
21092 -220648 34356 -200182 118926 1878 -181931 -48569 -63232 96827 -52911 93916 -107522
21080 -381589 -418 -163676 -75059 167780 258953 -247681 -148616 170573 -64609 -204651 416778
21068 16488 -470128 -118761 -283401 -315621 -345942 -348235 -44640 54775 123597 -219137 113499
21056 -132398 -239490 -10991 63385 -24900 78939 -202161 14498 157512 -23760 -137693 -305324
21045 -305324 39558 -14796 -99555 -47958 -333445 -66922 129776 11710 -97403 -146827 13888
21033 27222 68968 -93078 52662 36634 -39262 -12874 60665 -334690 -206201 21994 -102815
21021 -273598 84704 67737 50507 19391 30609 -134984 -33827 262821 -11459 374295 -218888
21009 52653 -272194 -139713 60335 -184450 -72481 -182939 -42845 60890 309624 -165047
20998 -110937 148363 141889 -23249 -8265 -143108 -169924 323318 97647 -47616 408018 143996
20986 -311932 163921 181815 -186183 17059 -198657 -57954 351110 77596 451173 -135004
20975 -44537 -343256 -311472 116588 106126 -203701 103722 -201611 -96813 6887 -305764 87107
20963 -50418 -328147 241184 51827 68171 -78506 -1998 -66152 -181495 275400 -122996 -24921
20951 -12279 37857 78051 -101225 143130 -72412 33285 -405602 38508 -99302 22983 -106063
20939 -103211 -86422 -201239 77972 202033 129927 -102301 -36645 165573 -52051 357674
20928 109332 412691 340905 51395 -154545 430240 -206692 -116124 -97128 -59999 -54270 100443
20916 -504340 -2883 -21469 -129547 -206206 -229486 -3945 -154336 262364 -193526 -318809 -3321
20904 353742 -281848 -206931 -114009 -38212 30255 49891 -4128 9082 96991 109266 -83553 -431080
20892 -431080 -20793 -254875 346149 -59147 -35854 -227780 120215 -143285 -125528 -69569
20882 -69569 51043 -97967 -97121 -214983 15014 -258267 -66850 -56174 118573 -175064 -113042
20871 -113042 -345226 184070 -517406 -175206 -2255 -132173 69792 104645 -205141 -150314
20861 -150314 -119526 -12688 12533 99966 -83480 237842 -106552 -83601 13480 124024 231677
20850 231677 -131488 110061 136312 -154580 -180153 58679 -155801 -4993 -48851 -118203 -29461
20838 79574 -14244 -318499 -72795 -91371 102751 191607 85719 124294 -197928 -214927 -206963
20827 -206963 -109971 -98960 46109 108293 -164357 95954 -58876 -81438 -31597 47507 -133876
20815 -87300 -14855 -34934 -113371 -349594 4682 -5589 -230520 -168417 -348756 -83511 59320
20803 103792 -99609 138097 228376 -100405 18387 -198428 -75576 -148222 -46589 -240022 -164873
20792 -164873 42283 97335 198548 -197959 -176313 -211722 95290 -42123 307660 -195726 -108659
20781 -108659 -57456 -15105 -202687 52069 142416 -87261 67186 14684 -1170 -228409 67855
20769 -53676 158778 242438 392485 -90602 -39315 -49018 -147098 -68451 331429 -134504 6752
20757 -35502 50686 -82331 -155115 -421646 -74430 101188 84677 161728 -97145 13785 -201367
20745 -325958 -145102 -78487 -36183 -10025 -205991 -191830 139970 -306003 17156 -26942 -74251
20734 -74251 -151943 -261354 -245551 -88764 -181621 59695 -156054 46711 197686 -14985 -47268
20723 -47268 13347 -115066 -111799 27555 375525 219181 -229721 -157621 -86284 -267664 -81970
20711 -92331 -133511 -109622 -227376 -139112 -192049 30875 -53220 235819 -5773 90824 -72436
20699 36418 -154217 213236 19529 -307808 -96361 -48995 -41429 -277464 -267664 -170022 19503
20687 184571 -147389 75232 -40767 -70252 -149402 -249645 -250790 -234491 -8638 -89795 -117422
20676 -117422 -170221 -437097 -417022 -12387 -206771 -191516 -134313 -194289 -234737 -84736 190962
20664 142976 226213 -88286 -45143 -173149 -309711 47523 -283959 214 193586 -161397 -86209
20653 -86209 3485 57494 -218933 289419 97882 -490338 -265189 -44096 -90720 67690 -177484
20641 -425764 170352 -96959 31532 35316 -68712 21952 -27962 -342444 20357 -689 -320370
20630 -320370 -106458 97514 9484 4364 -383303 187275 -2228 -35564 381432 -61237 138232
20618 184566 10725 190923 -164523 97595 -59178 -36218 315073 -105917 249478 2450 -214118
20606 -191269 -95639 -5674 -209454 257747 174368 -383264 200349 -158302 -137663 50926 -75799
20594 50136 -284549 93576 76631 -113326 -133440 -296334 -227680 -24881 4368 122222 -5097
20582 -126077 -347940 111275 -127036 -172412 -109584 -51694 -91231 -335480 383407 -67931
20571 80915 112299 -180746 39510 -60985 -102643 -251911 478237 39222 -31329 -291816 180947
20559 -44459 173497 142603 -227453 -15654 71892 -298738 93481 -177784 -82640 -110978 -38417
20547 -253019 -158778 -21207 23624 97295 -164020 -98087 -221323 -53046 -12467 -43524 -181164
20536 -181164 314934 -297154 -41795 -88689 -131263 -214248 65661 -167801 -339140 -76512 41446
20524 183677 53354 -250449 -268311 131860 -56696 15476 -175487 97884 -341831 -39504 174006
20512 97381 151258 -76691 -94072 108814 -42669 -29976 -18899 37457 -27190 78937 -19419
20500 265115 -122108 -238169 -26756 -95711 -19487 -11037 -104892 55652 -137584 -104247 236442
20488 -93380 406594 -45751 -546949 215542 155949 -169600 67889 116454 -360467 -56847 135649
20476 -280353 -229130 195771 98207 -131151 57383 147857 -103760 49285 -195362 -54514 -364713
20465 -364713 27374 -71783 -87037 312402 -265292 -42400 149665 34576 -246837 -280375 -11156
20453 31935 -145577 -150989 21896 -96242 64405 -161469 -41142 -144541 -265127 241644 -117555
20441 261752 460153 -159080 -55318 127692 -228327 200231 -48193 -25035 -151468 -21066
20430 -166674 -188261 -96895 -52714 82353 -150887 52273 -84955 -286349 -144472 -16820 -441651
20419 -441651 1494 -266644 68136 -32443 -125965 -391565 -11924 -192195 -20888 -56851 98731
20407 204243 -128055 -78466 -385140 -176509 -483823 -134815 -163204 -306872 -210285 11441
20396 -297062 -239261 -112900 137624 117315 -197848 -229791 -77737 -195606 -256487 127157
20385 71351 -231942 -73783 -241329 21869 -58179 -75269 -81796 178920 -154347 11174 -9494
20373 16403 -23907 -157398 133549 -198268 155510 89036 91631 -71474 247295 37967 -328814
20361 -123486 -161437 218326 -279687 -175482 -77862 -232557 -188602 -7144 39257 64024 156710
20350 156710 82089 -75402 34941 -249339 128242 -323732 68093 3789 6131 103661 119205
20339 119205 -20616 -160172 -135095 68303 -25827 204334 -1016 -56972 -194356 -110184 -31092
20327 -89711 -191382 116783 141975 -110556 220575 -218643 120340 -8710 76986 133048 -317459
20315 -206002 20430 -304388 -105158 -116817 247160 -155746 27752 70822 15539 -108545
20304 -27561 90933 -95845 -270812 -3950 96174 36996 -256837 -25647 -306311 -19472 56438
20292 -87414 -216350 -67481 -129176 10355 -240638 80544 -51241 15268 144294 -219017 -40584
20280 98707 -271784 26219 -199476 -152248 71048 -241285 70452 9156 -343988 -198130 -354303
20269 -354303 -195217 81202 157433 -40874 -65943 -83374 -55320 220189 -275411 117591 30972
20257 -96867 -273418 -2954 -101487 -273209 153655 -7816 -166265 10293 79191 -145366 -219392
20246 -219392 -211840 180385 -344760 363010 -15160 145349 -49547 -97117 -252547 313033
20235 -192648 -122056 -225035 -33217 -46918 206343 -115336 -193082 -379288 141024 44347
20224 36830 -109031 211321 -93844 14753 13435 -147956 -241029 -101185 -104908 -243454 68568
20212 -294594 425491 -211743 -225763 -224809 -340854 -243477 -17964 108329 -3554 38066 -18042
20200 209601 -138365 -64674 -306764 200650 -116598 89559 -17492 -155088 -39322 -237504
20190 -237504 161589 -39379 29399 281745 -107013 -290859 -411196 -183333 -358783 158845
20179 -203670 -18259 79671 -272815 -31138 209598 79207 -245673 -187301 -138583 62836 105941
20168 105941 -96529 -43216 190636 -55946 -25376 328197 143491 -16193 129591 -97855 -35421
20156 -384216 -49351 -85073 -200510 -81668 417521 290712 -275867 -188296 -14643 -60561 117067
20144 -94648 -158069 -141623 -4932 16641 39459 223032 10371 145445 184780 -222532 -55570
20132 96333 88845 334216 414809 292218 -12416 -91463 533964 245388 77927 261518 134815
20121 134815 73516 88659 309124 147293 100718 -204729 528144 -327798 -127324 -58832
20110 82579 37220 141269 97274 34382 -297323 209515 -352019 47906 -234963 129704
20099 -105679 -55010 -57209 -238888 75386 173442 -267328 104218 -13191 -235121 315380 -85543
20087 -3452 -67812 -77920 -114984 -94854 242896 -44557 63945 82582 -143287 -25931 -220589
20076 -220589 -124816 -167038 240727 -200249 -295416 218375 -72887 125079 -26125 165434
20065 53218 30010 -244331 -37281 -179449 -120761 -174111 -185758 -44894 -187688 -90659 -219932
20054 -219932 -115163 34871 -142644 -270024 -124296 74964 -90006 377729 34920 -248770
20043 -202891 -157059 -64160 196879 -380040 -143947 -288853 81838 -394111 -167471 -281340
20033 -281340 61216 111759 89434 -220441 -209694 67142 -28156 256353 -86398 26596 -51272
20021 52314 -134262 -170713 -213452 24462 -69028 -76746 -2387 -136666 -50427 82189 213888
20010 213888 189124 -315295 -38179 -249862 163082 150106 -239550 -64231 110548 188453
20000 188453 -120771 -43586 -194517 -29244 24713 -231902 -312584 96208 -186045 -154341 -175635
19989 -175635 -153822 -174469 -55924 194376 -54109 101400 252155 50938 348525 102227
19978 109821 190870 -13470 438453 134031 -185521 607254 78717 66416 -65430 104103
19967 87355 9951 125543 -254567 -51587 -98532 185187 -61406 115984 137065 70727 38159
19956 38159 -92577 63287 -33211 -125730 146779 -33780 37624 -314924 56617 -312125 420174
19944 676997 -176960 329331 -183237 323442 -26709 25606 -59584 -100385 378683 82512
19933 -138546 -308586 -183566 -106049 127008 220309 -378742 -309501 17063 -38226 260659
19922 78101 -149926 -88075 -100148 140942 325174 88247 -152441 -152359 -234675 58533 -184880
19910 -112173 -51895 -19803 -22500 108729 -264014 136001 -54149 97356 14939 -204398 49221
19898 -212774 -135425 117786 21960 86852 -118243 293627 -220588 -228827 -183085 -60143 -202090
19887 -202090 -71184 157858 -73041 -267647 -19223 -52793 -63662 46744 -102711 -268775 -151540
19876 -151540 109742 99697 -77685 281391 -414289 204358 -83474 189732 75390 92426
19866 92426 -74180 -12688 48149 -162738 -143485 -75508 -79384 -36082 87333 -129069 77668
19854 -60521 111715 -109110 98294 -50570 -48865 -174937 -77922 -88719 -85116 197408 -420980
19842 -196622 92963 65486 -146017 -142354 -40670 -242808 -84272 205239 -79795 7886 67655
19831 67655 29932 -34156 -206898 -467893 -95300 149033 52323 -300225 60943 -56480 -74981
19820 -74981 167074 31633 -215722 54703 -66728 -100165 255446 -144474 58380 36101 220938
19809 220938 -160622 -397561 -464983 -36895 10228 -148838 182695 117710 -170281 27698
19798 -100228 -223766 -93421 53246 106778 53634 -10941 -254960 31721 -318184 -90915 -198722
19787 -198722 -142687 -320191 195889 -20643 -356409 -278320 -256210 -172394 -85548 34800 38502
19776 38502 81519 -199901 -98496 -384032 -109832 279888 36846 -31912 33231 123407 -52353
19764 -202509 -148780 80378 80807 -40042 -183874 -273820 213768 85540 41273 -25208 61258
19752 -306221 -245922 -139363 -58395 109298 222525 -321613 -134407 -30708 -324899 81415
19741 -104683 -302449 75362 145737 -164197 -194877 100404 -32778 163221 21449 -245657
19730 52667 199713 46713 12009 -84929 199294 6212 67427 124799 19679 -24296 186749
19718 244074 -32209 114476 317514 276743 366793 202788 601929 123234 151380 274012
19708 274012 -6564 66134 -35980 248254 -231253 -87800 -621936 -127144 -126032 -87413 -173156
19697 -173156 -146746 -211982 36454 50193 -9370 219561 127638 56436 240073 183203 -85128
19685 -88629 190601 62183 293435 247177 212209 462423 64567 136792 25012 132682 -179387
19673 32572 71816 -142390 -212385 337550 -231059 18690 18627 -219262 112858 -89050 -1901
19661 -156274 169025 -71557 131265 -8430 11843 183873 -223884 149139 -59759 -113837 -111527
19650 -111527 -51930 -170897 228474 -154166 -72454 351139 -70857 25034 117690 -145511
19639 -80687 225177 119453 70559 -152911 -255191 10059 -109960 -176518 -561544 17572
19628 292343 -120318 3010 -193179 43486 30973 122370 -69747 -153655 136647 -99404 -2788
19616 -229686 131913 -22559 36373 26085 175656 102980 105496 -139503 205446 -253426 -265530
19605 -265530 147079 -240305 -272391 -97262 -2018 96782 271601 128667 -160536 33578 -117743
19593 89227 262616 90886 -379642 -363518 -180401 -314929 -71437 -247776 308913 -327376
19582 -7703 -242638 165 -185328 -9061 399639 156338 -200681 2570 -2485 -223212 129885
19570 265375 218260 -193291 42051 -171874 -198730 -61774 -422423 145982 -363778 -45307
19559 -85979 -273454 -262947 67894 151378 316495 205424 292075 -128930 -10822 123308 -177520
19547 179625 -209496 -229885 -16599 67059 154299 -241537 -261571 -85251 -24034 116535 -173522
19535 8071 -146347 -161304 -149421 100314 -295890 -6612 -29649 -547885 -87734 82258 15604
19523 -203409 -293649 -34793 204502 66654 121017 -151658 -51792 -14293 -434110 -151026 -166955
19512 -166955 13060 -271535 -77796 -174244 -313038 -133596 -363115 28227 140107 -246131
19501 -172214 122071 -70152 -91830 -165809 132436 86526 122207 -82615 -119670 -140959 -213501
19490 -213501 214836 -81991 -353423 370441 -235497 -177305 140679 -168214 12237 -246605
19479 -339934 26004 -59281 -152300 -217484 146807 -18869 -88466 -147345 -120143 -98577 -303308
19468 -303308 295595 -292168 307970 53002 66286 26968 -321220 -233053 -4196 -116689 -138027
19457 -138027 -362984 -205262 -84113 -58009 -78664 165042 -106563 -107871 -108198 -31529 -96114
19446 -96114 -234405 79681 -346248 -221025 -36287 -9855 -174836 -79896 297 -219191 186605
19434 -358479 -152941 128279 -153228 225269 204521 294120 22311 -441847 48537 -89354
19423 86817 -28687 -266577 202341 -281260 134280 -248042 97323 -100532 -18482 -20004 36131
19411 119510 -163984 -62150 71285 -30452 107095 59776 -247098 -361644 110689 237968
19401 237968 -44642 10790 -91762 -119782 -119755 2592 -175794 -196710 -112896 -325211 -203403 -407259
19389 -407259 71707 115757 -56910 -434310 77935 -137167 371216 -124353 -31912 3411 -313252
19377 5778 20881 50814 -2929 -173761 -66436 331973 -313641 -71039 -308420 -285649 -102503
19365 25779 -64103 77308 -383482 39687 -92606 245876 -37876 -60287 -116674 -270413 -358372
19354 -358372 -309503 -159098 -322511 -204158 42447 -111831 -66277 360636 -195183 -24215
19343 -54684 -401206 -202763 -118205 -175352 82164 -235627 63635 -22656 334716 -157107 74237
19331 34540 163497 -206030 -382514 330710 -181 -263484 -373557 116723 -277826 51774
19320 89929 -159512 -31970 402970 118120 -226263 117632 -77930 -178683 -155485 -154478 92504
19308 162932 -161417 -312453 97855 87136 -48346 -169339 -87930 -138558 -41489 11316 -395797
19296 -134272 -63979 -156729 -107990 83815 -197133 -9500 -92947 -259184 -48264 59187 -246409
19284 63134 146318 -201733 -59707 -153519 -393059 62269 121517 -96281 93140 228248 -42425
19272 192754 216560 128595 -130712 -158678 34088 -196378 -50502 -17285 296876 59703 -11581
19260 6043 -43238 -105077 -201325 -144084 77840 92833 -209964 49862 -87928 31733 201387
19249 201387 56875 -246154 -165438 -207750 -21810 -14554 152659 -246655 62116 327504 19428
19237 -184135 150386 -129995 -143391 -440976 -91551 107825 394845 -47178 -87471 -247810
19227 -247810 213457 59373 31876 -41682 -107004 180592 -293636 37883 157570 -149573
19216 -123516 109665 -90748 -362595 -348024 -89429 -209045 -148669 353141 -201000 24695
19205 157075 -6094 48827 67209 -31303 -251848 -162758 275178 -111029 -417237 -35842 -54850
19194 -54850 304898 -5566 -356770 -86628 -257752 382991 -250614 -52460 -296052 -138101
19183 -251227 -150066 -124495 220252 216640 6530 422166 -23449 -169918 -191360 -478709 -342327
19172 -342327 -282131 -206427 -260554 2844 -27559 8853 -360529 -220023 -34436 216924 -142142
19160 -213529 208452 -66813 -109527 209527 -100759 157180 -92958 -20508 -286405 -338737
19150 -338737 -66331 -155669 24950 129683 46657 -191720 93211 241082 129172 -146409
19139 -27533 -206496 -10682 -25012 268293 -219027 -55939 -393191 -251581 -167878 -212254 -47778
19127 235190 -186146 -112019 7942 -409157 53718 26025 -238167 88390 -151167 99143 -89587
19115 -247152 39967 -78692 -30310 62641 -221075 185272 -355908 21502 -263231 -243470 68881
19103 64052 72188 -159920 -385702 -61998 -109368 340289 -48902 185997 24615 -34910 -136896
19092 -136896 16538 -272751 -137182 -12310 -8704 -322759 121582 -51445 -63031 143477 -536668
19080 -89073 44190 -187659 119500 -210123 25130 -67712 219156 -132013 31494 -96886 -64633
19069 -64633 128877 187626 127742 94511 -196364 181996 -14176 -155900 -49123 -17672 508387
19057 -69822 -185721 -101913 133849 12638 -334356 161155 -47210 -305772 83697 3230 384174
19046 384174 -89411 -182337 -92058 44636 216134 47970 -130450 -90149 -289715 -236091 -97109
19034 237548 -39500 34896 -59280 -33431 226047 -91728 -345427 112942 -147737 -195513 -140485
19023 -140485 -139791 -12472 452794 -342441 55734 45481 246281 73317 -78049 -82400 -81067 -31296
19010 168105 -71983 176388 -111209 99407 143719 -201539 399328 384785 -73362 -144862 -224682
18999 -224682 187598 -165959 -46792 54305 -164752 105126 -60243 -286166 -20694 196161
18988 2437 266649 175433 -31372 226 30371 -135878 12967 -94320 -80751 49410 -49349 -229750
18976 -229750 -469665 -272141 -232513 -286231 -175231 -432266 186376 -133548 -45199 32797
18965 141335 88108 -10191 264123 145831 162153 -276573 4983 196027 541051 388018
18955 388018 375659 163987 144706 312972 -114371 198148 -43879 -22696 -40153 -121675 94117
18943 -7748 -71245 -20877 -127288 362619 -13384 -235857 111386 126430 56445 -191506 -267030
18932 -267030 -13490 -137432 49894 -64777 26246 26901 -97118 105569 -128116 -42334 -120878
18921 -120878 -469912 -71991 -316590 -237216 105884 82912 239548 -13401 160541 -155708
18910 11532 383922 -437150 -3053 -135798 -169794 -43496 77297 -26100 35917 254755 27473
18898 -72006 -404182 83822 18832 44594 226815 230537 420182 193706 20412 -224203 57693
18886 92862 -34759 -358193 -82778 -68689 69993 -184681 104796 -211259 167469 -253602
18875 -43250 24980 -76759 4409 194781 50193 46094 325523 294946 -171208 150116 -106413
18863 -270736 -62537 -241820 190922 -273774 -94767 -217144 -32931 -504846 11180 -2948 -130424
18852 -130424 110875 -202343 -124290 -315453 -125309 -162285 196978 365996 -51502 238172
18841 -192303 -149917 178459 -118885 -80330 -6896 40908 28077 -47579 -34138 -157648 -203035
18830 -203035 113533 224072 -90931 -32841 -154050 69934 -165819 -97470 -1902 -11451 -72286
18819 -72286 -42074 49261 -179760 93677 181901 -243742 287007 -18694 17316 -123766 103643
18807 -198186 -205069 -130521 94644 -103807 -252552 -99239 100914 98774 117352 -62796 -67441
18796 -67441 75524 -69051 2196 14304 -33426 -141824 -24346 -200487 -81698 -146814 -49396
18784 100135 -62046 20669 92381 -236181 67102 -359684 300533 117097 -302574 200459
18773 -153283 167477 -237679 -65008 199148 -179201 79060 -118622 62077 270825 -287312
18762 26835 -212057 -259317 -136825 22644 -326635 -115593 -338413 190955 -162424 -53652
18751 -154509 -43695 -38062 -43204 -228507 -12065 -353343 151203 288226 -15583 -71617 -172443
18740 -172443 -66341 328896 24696 -481869 -66982 -168112 40347 -35032 41047 -329122 211266
18728 -50189 -301794 -108763 43885 -242921 -464649 -138494 114680 -192970 -229395 221410
18717 -84186 113749 -56802 100940 145539 249822 14776 110272 251902 -126570 -133100 235631
18705 2999 89038 233348 349721 -309575 -358326 85648 117120 -335120 -39484 -60358 -14845
18693 -20064 13093 32079 211151 -45585 -84878 159149 -265029 -149840 298346 338630 10174
18681 -42314 -138659 -66088 119198 -163977 -275211 50852 -45601 -74197 59139 196834 -92160
18669 -123686 76672 -3530 316853 -58546 -285416 -195911 -307816 -139946 89704 -219791 71857
18657 -130327 -58721 6744 -308365 -4956 -37311 204058 -173850 99159 -342663 72988 -16019
18645 63820 126765 50668 245972 -17946 55748 -296862 7011 232946 -117811 -231643 -266656
18634 -266656 -154813 -462107 -109038 69328 84655 -114518 18724 -166827 62880 -46988
18623 -126311 -222781 -137750 355689 -155183 -47643 -102323 48886 -29070 -85868 -15751 -47625
18612 -47625 -163415 100536 323862 -2855 -68365 224330 719 -86568 -68050 -202797 -4230
18600 -251863 246070 -246022 -300885 -177281 57067 -348960 92673 -178212 -176661 -163824 107106
18588 275339 -340755 216902 -131829 94538 -5278 30479 -10966 -14739 17082 -132851 -164496
18577 -164496 -188593 118146 43299 109528 -211039 146784 -322658 -28731 -114144 4720 73998
18566 73998 -275573 15648 53986 -237593 20188 -212057 30907 -165639 -35066 -128310 -150467
18555 -150467 -297702 -92991 -75096 -37227 -238810 70583 242861 -74432 55167 -95007 -361234
18544 -361234 124965 77199 -23220 154546 -391696 132075 -223660 -183792 155606 185277
18534 185277 2459 -56687 -86709 -352586 -27039 210619 65236 -260673 -96777 -275520 371864
18522 -493802 -72440 416290 -141125 165356 -21916 -149593 331256 -90943 -23272 -168452
18512 -168452 132670 -181706 -292577 -169957 -165346 -24546 -317002 -8428 53038 -1854 -141398
18501 -141398 184576 -13179 -28715 343259 -1019 -96025 38109 206042 139717 -3432 -96738
18490 -96738 114579 -128456 -155574 22976 -132512 -195731 166300 -548254 89626 -230752
18479 140707 118881 161605 -430370 198583 62987 -329060 -123278 16526 -384152 10892
18468 -176209 -206368 -32408 -68111 -367777 86913 174866 19778 -113941 -60929 -14157 182585
18456 -31080 -141188 50188 -68677 130441 -269635 19015 215227 -294478 -149368 122511
18445 -210431 119100 -133852 -43703 -13352 -69492 184783 77495 162137 -118779 -180988 -45083
18433 -168496 -107349 -45977 126693 -144533 -88505 -144726 -132225 -101310 317428 35207 292803
18422 292803 234869 58757 -182516 -207472 -13947 160991 -78436 -12298 -148218 9302 -112354
18410 242838 -148161 65334 198488 197143 -236581 -157005 -50130 -401231 94473 180105 -32098
18398 18416 61673 166695 -348202 19400 242548 -91985 35681 -61015 -157670 -66405 3012
18386 187028 42418 63215 74266 117690 270625 180333 4786 174842 -102727 -59205 89851
18374 21022 167558 -39748 181868 1434 -18240 -347361 -238299 292873 -421496 42959 -116629
18362 255781 90256 -309366 129559 -60697 -33783 -150985 -14477 -258063 92781 -6293 129730
18350 -57562 156535 -153592 31395 28525 -31651 -6855 69295 -92179 24910 -148329 -101242
18339 -101242 222978 -111177 17713 23713 160793 -234909 -72622 -117533 -49443 -142913 192253
18327 435874 40839 270395 309923 230514 -89639 -70684 -61003 -14536 84435 6693 -210095
18315 18395 -28378 -188143 -108651 187461 70490 59497 -255243 -132335 278222 -294678
18304 -104468 -87078 -111995 -51774 -553166 -191081 -73360 -233541 89374 303908 -124302
18293 162610 -178898 64113 133949 147046 115336 -158898 138691 76885 15794 -75228 -367178
18282 -367178 -106115 -327966 -46388 14429 -230397 84101 -143960 82776 -56808 -359944
18272 -359944 61985 -3693 -53281 3738 14410 -6671 25781 67080 -102022 -280911 143147
18260 -287835 -189551 -157329 119494 20441 -205203 -212723 -284950 -310495 -202949 -104323 157849
18248 -59670 -197199 -112440 170194 -33113 -21158 -233040 -26717 104958 177192 24805 137135
18237 137135 -226931 -243379 42890 -233158 333827 90957 24947 49448 188364 262320 -31493
18225 -188600 24434 333632 -136176 30467 343538 -46146 152338 -108180 -364023 -312398
18215 -312398 -234105 -158178 -55627 -113032 102712 217603 110184 198103 307430 113560
18204 -269430 -146902 20580 -149103 -7627 -82435 -132350 -110958 19977 -65025 12653 66091
18193 66091 134633 51522 130836 -259758 20307 15397 190794 44753 153650 -211714 -94828
18181 269592 -380805 89471 -156417 -52113 -66178 68896 -86433 -273857 42579 -366996 -142432
18169 -109804 -262947 121963 -302691 -3408 -63518 -127671 -108958 82889 -347685 -104252 -8836
18157 103848 -72430 -176336 31523 -143632 -88691 122930 173380 -287874 -181198 134399
18146 -19488 18587 119168 -213093 -253649 -172671 -129983 -28782 47607 -142142 140845 -190472
18134 55140 22719 82311 -105357 162548 -54555 -52374 4071 38925 -61083 56804 -118206
18122 -149141 270410 -25204 89887 127786 -109063 -90745 353945 84440 67766 -399348 204426
18110 175262 238652 143614 68310 11784 369823 383728 416922 -226613 -14407 277146 -50944
18098 103560 174247 -116085 -25835 314116 -115551 -254002 -217846 219859 -299553 -51532
18087 191920 -217779 -148979 -27960 -113699 19439 -195152 -37992 -14927 -202279 99466 137207
18076 137207 68275 127886 9877 -5635 159353 -46845 -171577 -182914 324220 122609 110360
18065 110360 -282847 -85078 -152611 -352613 13582 -193614 -161999 471801 -22274 267831
18054 110349 -19721 -154444 83237 240002 29964 115270 8167 -69043 -10449 115312 -26827
18042 524449 -68196 70874 -44538 394749 -86705 90692 185644 -256336 35471 -288263 134898
18030 -308615 49675 151175 7432 -261803 -27347 -141431 163480 -33351 -125759 71463 1689
18018 -91016 -296131 -94850 -88410 7014 -228134 -75124 464241 231317 -123408 -230662 -171376
18007 -171376 -266030 -37257 -81647 51359 318257 -50070 -118573 -117260 55076 119795 -136840
17995 -41161 99635 -116690 298883 106470 -111404 108630 -103172 -35677 -123250 113200
17984 -181452 7800 -55134 -75170 69024 141058 52323 164337 -315495 -216600 373656 -160562
17972 -28494 438639 -129342 -131446 127982 -111136 -150722 32404 -262146 15927 126778 -54414
17960 114565 -170219 139175 196858 64723 15102 142344 -66294 202325 -15052 76714 70702
17949 70702 9497 227181 58251 -93796 12405 -34445 162331 68051 -280915 -51798 105889
17937 106459 -18518 197355 248761 248938 23298 204090 -109800 52107 69605 -79056 82494
17925 125387 162800 19343 18238 359920 40631 -96972 142536 347374 322706 -134469 -24731
17913 233376 -57808 -75218 -73418 77181 -124941 -201285 124714 -16902 47791 69186 159208
17902 159208 28337 231707 -102448 21316 -218073 236355 -40635 -192269 -391046 165876
17891 83230 120301 80109 205155 -8757 -333683 138199 -115102 -22576 99326 -213638 300016
17879 131526 113106 -66009 212486 -339592 -94569 -238967 206044 -109734 -80637 286877
17868 -17870 352346 -182810 82848 -69980 112820 -391673 -163525 -100989 -43759 -144654
17858 -144654 -80439 -117229 190078 320437 -19150 -50220 -187755 216980 146314 197434 152763
17847 152763 200096 257912 147385 -123437 395374 191579 226877 194904 309016 -12010
17836 -216117 -108127 98530 344500 -77253 -172454 61850 -80506 23427 44987 -71528 -61735
17825 -61735 26274 160540 93576 -97524 280288 109839 -111858 -53540 -66902 -116369 361646
17813 -86505 111778 303656 -76400 4965 -118672 15515 302155 -83314 -10051 -55021 64219
17801 -30930 161615 -17568 214873 -39961 -227930 22594 189928 236149 33137 -49689 157478
17789 240656 119322 -248865 -55924 56087 -154509 -60404 211090 207015 317879 218561 396578
17778 396578 173052 321812 -142523 14071 370717 -261632 -3350 -216513 -16038 239597
17767 175675 138641 290451 -366072 180196 225892 73925 -59282 -133403 -20409 309567 149171
17755 256690 169627 75151 -225255 -224263 29856 -40431 166150 -161425 44508 129678 -70343
17743 128666 14995 -29817 -47899 137753 137707 41695 -342172 549385 -223890 -8277 28879
17731 149074 56278 46912 192415 444007 -53459 42994 -38544 35063 253132 288014 -53308
17719 101040 -143801 -351152 19534 94623 -98368 187802 289192 -111067 -108794 365584
17708 354026 -95255 -30197 -372755 -16202 348157 105617 -84579 236654 100413 255705
17698 255705 -40555 -80321 -87704 77113 341018 -390624 447682 381685 104574 -74102 -14396
17686 248236 202603 -54717 140035 295766 -100470 48189 24130 66845 282021 -128645
17675 328125 172268 -46744 -32507 145243 -28552 -199004 149263 161523 243493 -129495
17664 157430 81206 418539 114847 411291 41244 241697 -94197 -128816 -28285 150149
17653 69420 -30996 -63475 67711 367146 31613 252896 285504 160819 57388 117531 260231
17642 260231 56852 119382 7104 -38034 -85892 63312 292767 -240949 212346 66733 55179
17631 55179 28377 146536 208772 317761 87567 65960 186448 97985 -143484 -107140 172850
17619 14973 31104 -75508 147521 108840 218419 382409 70996 -112202 128823 270066
17609 270066 62649 59759 -241055 -267701 225679 110468 156386 68232 -63144 127165 -33199
17597 -19957 110835 104145 254708 98056 -292589 -83905 154586 71684 212506 -14860 117529
17585 508604 -489656 63813 86536 209046 10553 444233 277845 -93764 219113 122921
17575 122921 355004 126646 34033 395745 -26314 -298495 -103546 118571 385795 289272
17565 289272 326727 118986 181510 -120849 320019 15757 378485 146302 -55652 -127842
17555 -127842 -130884 121792 143390 304623 87425 337026 346512 39336 -87051 203564 -49532
17543 264099 -86731 319430 297222 -214066 220760 86213 32098 425178 -102963 409631
17532 146801 106923 156932 306977 503750 -25690 41659 443456 567158 49386 367695
17522 367695 366896 103490 384233 264547 237884 309952 592476 212436 532100 518260 458083
17511 458083 416004 511919 829376 924310 1138899 780906 482569 333465 276347 692231
17501 692231 472649 455200 662156 740298 546081 970933 491063 631969 641970 757862
17491 757862 426672 615472 812994 589497 289801 539 286778 234550 398641 109875
17480 638545 332532 260453 308614 534214 117912 218115 483410 264451 244260 376934
17470 376934 122429 254512 257673 231888 57198 -16379 290914 347332 505897 135779 147913
17459 147913 328977 64917 512459 288424 572178 320600 551939 336478 372077 62322
17448 260322 72773 389021 317033 68845 163757 34942 198116 387997 442404 251518 384328
17437 384328 -99261 463180 209183 432783 142469 394152 417657 368179 -15369 326052
17426 297274 340454 250363 397930 481754 265670 35604 454230 396194 229442 368424
17416 368424 302059 323781 327278 48927 714533 316314 294670 300798 308679 367706 495037
17405 495037 420873 401931 66199 156327 436176 370819 269388 648650 372377 14443 -92604
17393 411813 276184 189042 222958 177668 230784 11181 440053 229513 558943 185414
17382 16463 631656 208821 313593 285504 84087 197902 224950 562965 457185 361492
17372 361492 355415 258201 45610 247059 474584 151411 73648 472592 100116 202909
17362 202909 317436 180062 302880 -2237 221809 357183 -54097 353206 29712 -85615
17351 313745 75075 149379 233719 62931 280989 164811 226199 34150 90823 223622 560310
17340 560310 146809 248323 178591 75547 232894 135381 468333 198729 289914 -194745
17329 78214 237783 -112077 311680 85191 346629 208072 214032 318056 163669 441238
17319 441238 -96407 489723 213808 305874 117220 -97414 225926 174920 212806 289394 149242
17308 149242 218127 238050 286496 21836 458294 285433 384993 435538 464838 313006 127654
17296 222666 400791 152501 535490 188280 331133 173705 269451 366258 477352 418116
17286 418116 239429 295250 113995 248985 522442 48130 418830 86069 98833 -76236
17275 599687 396683 427327 436800 378341 346925 236028 131459 310026 330924 239033 494691
17264 494691 153509 409639 82182 262421 172342 357032 -25019 336195 123007 400331
17254 400331 347546 112984 658418 317226 161190 324263 196690 495319 399415 232991
17244 232991 191355 242234 559227 154927 107206 41521 429511 208095 -52864 256355
17233 323033 298900 223505 205170 345827 359050 14579 223118 271186 227979 341533 237476
17222 237476 543888 324350 256793 476215 417344 164733 524690 141276 331554 47423
17211 332112 394352 717725 266002 378817 407326 209490 305407 341532 382522 252926
17201 252926 167186 237376 159231 677715 364183 221616 596246 180932 280501 1020786
17191 1020786 305724 507299 352084 74012 279274 377963 287971 253494 234485 293961
17181 293961 286123 13729 731272 173717 340319 288046 292057 450518 283227 443440 384418
17170 384418 389482 409634 444492 389542 286875 597852 747330 323486 235118 458110 104368
17158 628008 470756 912457 357192 383330 407753 413677 405615 566964 163823 327852 389375
17147 389375 459336 616142 422427 767896 443485 424270 500399 478322 458809 422784 263604
17136 263604 454283 536113 491866 553703 107036 624863 587522 296901 735652 555279
17126 555279 415508 502094 152731 504292 618251 315699 688595 509622 475997 455566
17116 455566 545438 292123 474979 262650 612365 548742 165408 700688 466224 238467
17106 238467 762250 711968 540635 464729 712467 617909 553555 687814 410420 410337 747771
17095 747771 762813 202072 645837 613372 864286 779949 660890 725188 748823 565469
17085 565469 372740 207124 697132 757926 548595 84503 467116 631907 388755 694574
17075 694574 759729 824710 724699 764046 73720 456752 616196 657577 530354 740695
17065 740695 596943 635865 575630 727845 567440 479517 609670 723639 784452 969067
17055 969067 671924 477680 734443 767853 167490 851535 707841 904273 500791 861133
17045 861133 838499 979570 657545 885015 626580 1089805 284367 678290 825847 493121
17035 493121 917189 659297 965291 734551 1158576 891602 899237 951410 883653 1018179
17025 1018179 1103102 667055 819279 1123220 525207 1207397 997700 613401 572652 782057
17015 782057 771591 906088 658019 768449 953372 728833 1086817 922358 1079795 870819
17005 870819 1023433 1028058 981174 980416 974166 856213 1179299 1020004 986009 984468 675491
16994 675491 774718 1047830 1010606 889936 952090 1179495 940061 1146328 1110679 1187352
16984 1187352 863872 1030228 774934 936685 1310504 1288230 869600 984829 1271656 1427550
16974 1427550 1298843 1112776 1447240 1047850 1201690 1031904 1309242 1289632 1001493 1132360
16964 1132360 1070076 1367851 1053426 1414497 1284949 1283632 1616707 1264846 1611234 1354855
16954 1354855 1299993 1321073 1290812 1584939 1308703 1335049 1112964 1223377 1238746 1549148
16944 1549148 1703486 1626570 1336764 1536741 1094037 1042178 1561504 1755621 1285536 1745248
16934 1745248 1525331 1688899 1869062 1654250 1779950 1667098 1526318 1732146 1295207
16925 1295207 1639824 2117107 1781073 1931358 2099259 1542027 1470408 1581087 1816677 1672985
16915 1672985 1678365 1924083 1856982 1833483 2153686 2017190 1803397 2008613 1984404 2073557
16905 2073557 1913951 2030880 2016796 1816140 2331925 2047905 2416199 2214398 2165029 2029452
16895 2029452 1816379 2222746 2273381 2328287 2538630 2210414 2361635 2360709 2328084 2480321
16885 2480321 2578372 2303650 2693156 2606383 2640017 2770339 2363623 2634169 2705507 2799896
16875 2799896 2677671 2758387 2948456 2875288 2732492 3024985 3170650 2859412 2871882 3041945
16865 3041945 3128878 3163267 3199701 3129698 3436244 3162081 3599975 3308147 3179864 3481777
16855 3481777 3668146 3843003 3847682 3530506 3645304 3868983 3524278 3919509 4019670 3608546
16845 3608546 4070251 4123375 4110553 4163260 4413367 4494009 4549903 4504948 4574658 4822154 4602836
16834 4602836 4739010 4667388 4694253 4953568 5258927 5367233 5194412 5044987 5335022 5489839
16824 5489839 5822646 5800698 5751272 5819517 5897979 5943654 6056688 6534277 6505974 6435626 6932882
16813 6932882 6834770 6917576 6795176 7555015 7345012 6996968 7799499 7638216 7799436 7857247
16803 7857247 7934195 8228020 8223210 8696251 8691583 8745052 9193062 9151042 9803579 9792381 10006886
16792 10006886 9919042 10624636 10659684 10831411 11181333 11595797 11667035 11879663 12083472 12509405
16782 12509405 12835150 12977323 13094223 13371832 14144475 14032142 14831881 15335187 15463794
16773 15463794 15977421 16256770 16670447 17855929 17695964 18367577 18458447 19511391 19781091
16764 19781091 20291253 21285500 22002788 22589267 23448363 23884684 24580006 25222265 26685425
16755 26685425 27556200 28300341 29003564 30082220 31213955 32213397 33800494 34448076 35950251
16746 35950251 37209170 38653257 40226372 41673454 43210651 44942517 46962777 48818278
16738 48818278 50853999 52847910 54964353 57411539 59886883 62276232 64951267 67725492
16730 67725492 71064633 73342708 77162871 80262029 83636615 86893748 90508614 94235733
16722 94235733 98103405 102010844 105961175 109877139 113299318 117637338 121054627 124486058
16714 124486058 128179782 131151889 133977521 136490174 138858274 140630066 141624280 143048739
16706 143048739 143168286 143358135 142472294 141572954 140134286 138003921 135678582 133049408
16698 133049408 130124638 126588619 123361959 119885143 115847771 111876550 108026034 104106960
16690 104106960 100558366 96707311 92525723 89060476 84809715 81675726 78426454 74834393
16682 74834393 71718884 68719660 66077336 62890084 60239327 57802322 55298398 53154406
16674 53154406 50926323 48933715 46982167 45039554 43095054 41355684 39838084 38083900
16666 38083900 36856280 35340894 34026412 33187149 31724458 30340522 29527023 28303524
16658 28303524 27544553 26415345 25511639 24621067 24086730 23234025 22581319 21571142 21009660
16649 21009660 20376433 19857559 19053893 18760681 17854225 17928203 17180091 16487329 15932743
16640 15932743 15809477 15148629 15011269 14227822 13823453 13885039 13494279 12794481 12771639 12317499
16630 12317499 11783858 11647280 11493739 11119087 10965987 10732172 10435283 10009747 9801907
16621 9801907 9366234 9615555 9236682 9039277 9095716 8939757 8154782 8290103 8420608 7781640
16611 7781640 7803838 7892656 7674146 7620822 7282325 7287615 6841015 6530542 6575705 6410222
16601 6410222 6434618 6497931 5911515 6348213 5980098 5686266 5678100 5807149 5903475 5278444
16591 5278444 5171074 5269070 5057038 5010190 5038660 5000528 5015956 4725624 4644290 4649339 4270668
16580 4270668 4309981 4311217 4446019 4172308 4248525 4228902 4200748 3805328 3993273 4020970 3925349
16569 3925349 3681141 3734245 3683291 3647456 3287515 3642303 3557793 3383211 3523511 3079673
16559 3079673 3158198 3250408 3180945 3318229 2836164 3098851 3429352 2938118 3263935 3020419
16549 3020419 2915167 2997539 2701055 2936903 2907560 3022114 2744268 2877990 2612431 2686726
16539 2686726 2795584 2801894 2567694 2592915 2270922 2183937 2794278 2392352 2208755 2308783
16529 2308783 2407706 2379225 2415891 2216737 2232900 2194663 2533422 2124297 1676583 2191589
16519 2191589 2093953 1866434 2201424 1676143 2078561 2092326 2167126 1960187 1763156 2010561
16509 2010561 1738200 1684280 2002861 2000003 2088133 1821938 1497536 1945769 1672976 1868659
16499 1868659 1632210 1368446 1793153 1700630 1584286 1461139 1488357 1296076 1271224 1725592
16489 1725592 1481346 1520347 1443151 1444229 1310385 1410104 1513861 1552800 1533297 1371488 1398202
16478 1398202 1493188 1176919 1668894 1420296 1066197 1270564 1383317 1890881 1467162 1110830
16468 1110830 1175370 1364637 1176662 1266599 1156656 1253670 1178689 1341804 1362874 939282
16458 939282 1104646 1230553 979255 1059762 1158335 1443181 1014815 1070994 1289838 1176052
16448 1176052 1477637 1182753 1238601 1166480 1324849 990646 1133433 1177556 987941 969476
16438 969476 1138336 987129 1336305 1054183 1029441 1001442 861170 1119934 887416 620572
16428 620572 1277936 811849 988629 825454 1050996 1047385 893647 905414 877283 885693 932652
16417 932652 757613 909964 597584 1101236 769242 693248 900576 706224 784257 937238
16407 937238 802211 750938 990938 760828 879195 628154 1170877 971382 969297 791098
16397 791098 1140290 906152 852455 457525 1073212 669068 781950 742911 961870 900598
16387 900598 916819 925132 713760 559715 750257 706383 691828 998341 770740 736467 690962
16376 690962 659391 826378 737813 984854 1006614 512135 740006 938534 818558 715637
16366 715637 564533 726013 531324 955095 672136 832781 426061 627159 756770 394829
16356 394829 896060 618579 692571 454644 1020520 591748 802068 431784 560898 648414
16346 648414 511724 447746 553090 808679 735349 633899 568288 417266 358177 304338
16336 304338 805552 406259 556062 449308 522714 617306 667332 712614 287153 707323
16326 707323 619790 829026 625586 573445 778162 653088 427850 100588 389483 285708
16316 285708 528978 452085 361106 580287 441596 485235 849829 506705 340681 534819
16306 534819 385048 397410 812672 288933 782911 565226 198217 225773 165942 171012
16296 171012 454071 377503 588211 318914 502969 228989 346664 369329 431372 491259
16286 491259 195465 501223 675751 690245 440346 308886 173088 253231 472470 854465
16276 854465 803146 745429 634027 -21266 335068 645685 779741 529042 426296 626334
16266 626334 600320 686605 330288 434093 351293 386898 295014 544983 544775 151461 326725
16255 326725 286542 146639 412585 498151 -21467 206049 205717 -26751 176717 517925 309202
16244 309202 399495 198913 517210 471815 213457 226205 626892 419024 565024 288250
16234 288250 476012 412884 509778 -5112 768237 280950 339400 464328 533099 435820 57630
16222 311367 61383 256387 59207 82758 721342 415984 -39723 283644 198033 590796
16212 590796 199238 338759 189377 -22526 365834 173248 264672 267131 468630 509101
16202 509101 174220 102656 248967 626239 51245 490361 148714 77240 294168 -44850
16191 -50858 415272 263496 41760 338037 379721 427414 264539 102925 476459 151179
16180 277543 304953 245062 285513 231933 173785 -59002 230057 101361 139703 195198 406419
16169 406419 377168 252567 330582 508333 457934 431308 361720 31021 597666 89217 148410
16158 148410 102650 120246 -98199 538421 26150 -75094 247169 238834 306512 -165365 -126669
16147 -126669 -28402 203535 127100 94478 43633 62704 320223 173820 302231 409305
16137 409305 225055 -2138 187472 375515 167922 200198 408810 -215029 161613 297765
16127 297765 187634 326601 -84055 75580 244634 -5705 223105 19734 27598 299855 177318
16116 177318 475793 309808 67699 197033 86127 382126 244517 22938 340304 100214
16105 85601 98899 166050 -180248 197406 34347 197232 95576 125748 246769 -10069 239548
16093 140213 405422 250772 16259 -156247 34307 190934 142202 -26133 44870 54970 -100410
16081 47289 372396 286913 176366 97308 -45382 373591 -176889 -306984 -20832 -84889 144316
16069 317689 151213 207872 317443 -57272 -163994 217777 54278 125349 262412 -94447
16058 119683 15048 180776 -65770 344917 284624 240193 79322 -13356 189792 83452 232780
16047 232780 325437 156201 6742 13586 -44611 24716 226057 -148479 119561 244036 -44558
16035 2426 51262 387080 111776 -18054 -11644 67980 15658 229324 -91600 64534 -146932
16023 31105 -69715 204196 43753 -256786 -140712 138324 -40457 -282483 142665 108070
16013 108070 238303 -212618 95726 266660 -103342 -68814 -201922 378910 -20178 -61619
16003 -61619 50992 60221 111946 -68128 -43934 25420 -78558 85657 -32151 191494 59751 -81897
15990 -84076 55373 -142435 69456 239478 16100 51642 -10341 11100 -94651 189020 125111
15979 125111 -11892 115317 -235284 -120631 323551 246652 313342 249551 499127 470045
15969 470045 855586 782258 993208 690346 201748 -101561 130028 281149 66747 167864
15959 167864 -136075 9547 36186 273837 -72737 -204245 11025 136711 -60476 -1263 -331064
15948 -331064 142959 80261 -29533 35736 116892 -85555 310473 -123342 294890 23757 96682
15937 96682 150211 137927 -316035 -4804 -163774 8500 -90801 -108937 -314125 -170152 -145145
15926 -145145 120517 -5944 -355752 -145512 -358203 -25243 87556 -79142 7970 24404 -266904
15914 -149543 54250 316074 -74042 -59783 9684 42196 -153762 109080 61170 176963 -287435
15902 -63398 -173186 119648 -5023 119704 44726 142713 -78795 -92176 -125680 225196 120240
15891 120240 -98143 -8173 33668 -76195 -112385 38859 6511 -80656 -5517 -159367 38271 82963
15879 82963 -156705 -234767 -58488 -134962 -54725 -53970 879 30402 185116 69370 182059 91185
15867 91185 -73453 -402225 196766 13069 -78727 344 162582 13217 142278 113302 187275
15856 187275 -206820 -30677 -256682 -28742 -23344 -27994 -255293 -113545 -309859 -152257 -105465
15845 -105465 -126099 -331693 210762 52444 46144 -64719 25288 -294296 -22802 -28809 -50973
15834 -50973 -21729 -194419 -118098 -136908 26659 -394798 98040 -17461 -88242 121076 -155676
15822 207814 -107173 176854 -258914 -44293 81563 224390 -137791 6068 -161460 192804
15811 175346 23805 -87138 -190049 -114952 -222626 84114 58891 64616 -112642 20879 -9946
15799 696925 323105 173624 48724 71475 82109 -30755 46462 -172451 60133 197872 35915
15787 -104655 -1624 154983 98460 -104450 102101 141729 -103225 -45976 76749 7476 -8692
15775 -54048 -198937 326911 -318397 -143612 -173939 -186374 -173472 -17564 218755 -77725 -412229
15764 -412229 -360141 -333968 -22143 -258649 94952 -106486 -68862 139445 -259265 -94 3108
15752 41007 114538 -241894 221235 143340 -113889 92265 230681 -140126 159962 235869
15742 235869 282922 -48450 189846 -85830 40232 63247 -104762 25662 17695 -2949 218663
15730 -262800 309751 -90553 -6476 145305 -56884 -363972 61401 -256209 -132547 -229990 -94414
15718 -112868 -29637 -260920 -150737 -68512 -101080 -10063 198082 -108080 43084 -54665 -342039
15707 -342039 73579 181745 -51925 -89283 -550553 -91979 -92315 191385 -208768 -56078 123485
15695 -300631 179168 -354022 -233760 100034 -211892 148390 95966 144923 137697 -71069
15684 66716 -260490 64486 -135275 65502 246602 208388 -260427 455992 -28295 53649 6908
15672 23201 233549 77367 213066 308148 -235475 -416772 -145276 156490 18576 128270
15662 128270 -118610 -53081 97123 30349 -93263 -239902 -16083 265795 134440 202539 183936
15651 183936 10054 -47772 82766 -13951 203851 -344643 -56388 -319166 22838 -115150 -279257
15640 -279257 -185434 -52219 319464 6692 -22841 205263 6243 111972 -43245 120861 -102367
15628 54501 265273 -24317 -28216 11060 -206603 141410 -27611 -58335 -239325 25357 155163
15617 155163 -456338 -261266 205833 -72974 150486 -43901 -106402 47980 48 -67873 15341
15605 -370957 102633 -179248 134597 -327176 56517 223535 101685 -67897 -11680 -83726
15595 -83726 26029 -51731 -20622 -79112 76383 -219788 -262438 -153898 -287630 25461 246515
15584 246515 305858 -185856 -126489 136506 239571 15612 -251962 11681 -198229 -93787
15573 -160909 73815 -171706 -175111 93659 104659 -149967 -156152 207368 166903 -175728 -402451
15562 -402451 -52345 -9373 309155 192562 -280194 -146469 104623 -117951 -396838 -101287
15551 -206480 -95179 -315857 190060 -25119 -244403 241557 35149 117219 145913 96777 90329
15540 90329 73294 9220 74957 -78829 76297 -57964 359163 -137290 -75355 -12396 -231157
15529 -231157 -132455 168020 6452 121169 -117913 75224 141936 -14375 -46306 -117305 -161596
15518 -161596 226514 -58501 -316079 171376 -255498 14842 185137 134164 83967 220570
15508 220570 356011 -112328 -86499 201930 77675 274084 213791 95834 -100666 280226
15497 212717 276727 378403 249459 343130 266080 21161 -221151 -40567 82185 169483 240088
15486 240088 -151484 309776 68933 224835 24952 -224571 372967 67000 -249475 228829
15475 -240549 -2769 103283 -216318 -187921 58070 -70578 74430 221477 152380 126037 201569
15464 201569 56170 78700 248158 229063 157583 149435 417785 707604 411780 42097 276383
15453 276383 329177 373806 -52203 302623 -70539 -49078 150194 274388 64024 105248 -164538
15441 54554 4733 -249334 122562 170791 382488 -141425 131086 446083 -270574 -78649
15430 -160411 -63659 486117 419890 724454 508044 984896 924525 855320 415630 262690
15420 262690 208702 222926 366052 437608 179186 209432 -5957 -121915 366149 6039 -95892
15408 -124084 179071 -28487 5571 131522 22284 -64933 179044 55899 -332966 -40908 -79892
15397 -79892 240950 6798 180798 3848 -432679 168584 7430 -129562 29118 252160 -179896
15385 -20501 195033 373450 -68102 74203 82482 -237657 -100873 280102 318749 47980 -48137
15373 239064 102962 -17796 -15556 -101833 56008 219839 -142553 -39777 2608 -64170 -93368
15362 -93368 -319298 140435 -87278 291217 106371 188199 112352 201617 311082 315458 304021
15351 304021 155511 60929 98970 413107 4154 99812 295195 10555 137619 -10957 365982
15339 123046 161 63413 7236 42576 355083 7381 246460 43240 116320 280170 5360 242697
15327 242697 540023 226791 344518 66744 74692 77099 347076 -8010 183742 -40386 10597
15315 70357 39887 314090 -63313 217897 380891 178841 150977 101345 397267 214098
15305 214098 -306404 328796 50964 166100 -47883 225274 -227711 36441 -102057 91535
15294 277101 142662 252145 565133 -175320 -206462 139144 -11331 284745 -74571 286128
15283 196943 410437 320886 -141343 28147 -126252 -80145 380356 186316 58945 3662 210669
15272 210669 126331 11806 340069 43162 222024 -171793 -7780 -65938 10379 331261 91985
15260 -59036 -237922 -136791 -88963 49049 38380 -59010 291701 -25241 158384 193109 -57783
15248 93787 -136017 87972 -126218 -69596 230071 -78698 -173734 -47125 185892 -15138 -28724
15237 -28724 61776 188906 40620 50547 411942 365979 247939 724646 935669 1734597 1219871
15226 1219871 1637628 1575877 1104928 445102 293077 212167 422320 454157 49304 243803
15216 243803 196918 182851 -17038 259913 145681 306911 219489 165926 84595 207688 83238
15204 -246249 -91366 -169627 133939 308641 -81794 -44282 105472 137133 28021 -58776 -49883
15193 -49883 36466 249553 159913 -3628 -94899 -80255 60823 204855 159556 -95470 -103578 -46999
15180 -219816 -183189 -107842 55676 -299543 309547 262846 81183 206916 186315 -1834 -68498
15169 -68498 42964 213876 -61681 258551 48635 -51644 -184025 27798 228266 32472 -227144
15157 7960 231363 122363 -86687 -82213 124028 23648 109833 326024 243139 -101699 372975
15145 140174 -63413 225333 110480 267747 -85001 -9182 239369 -114882 35754 505299
15135 505299 112283 292316 252015 148454 -215265 146860 128286 127222 261834 198963
15125 198963 192549 91218 180513 241465 490412 224367 -303681 259756 48127 29664 -29059
15113 253004 106120 312149 426033 345686 333022 187281 213695 197240 94078 499921
15103 499921 161556 257014 495651 36398 213931 458004 74841 245133 -32185 -21803
15093 -21803 279095 154036 273698 -220161 -60827 -62460 201445 91127 30939 -23003 46408
15081 297227 198152 267163 107325 348582 43951 164329 340519 59777 284838 260608
15071 260608 59306 378475 29773 182501 299946 -119634 161301 374230 120660 368875
15061 368875 374638 465303 376053 309616 409340 13284 324478 193217 180376 346904 256149
15050 256149 38151 112491 391817 265593 125799 29064 99616 43693 122282 308943 443190
15039 443190 249865 403259 441 273131 342470 281128 105090 449565 266188 598978
15029 598978 15406 439313 386554 505386 498791 381890 465373 471645 364482 570986 315178
15018 315178 358741 317303 539478 507021 633560 936564 773072 556929 647273 722573
15008 722573 462959 612117 494937 171007 443219 475456 508837 493251 361117 550291
14998 550291 644595 247332 636279 259282 307737 270751 393527 146141 349312 444703
14988 444703 279773 512386 304946 301748 319464 423888 560069 428943 557935 316191
14978 316191 369721 264469 678025 549495 425323 692204 357786 542490 617867 417047
14968 417047 568729 476433 602052 907707 704375 704377 684610 294137 135479 339761 504765
14957 504765 293550 391619 256907 725806 309718 586665 550131 203519 330256 590821
14947 590821 509661 176828 299089 449578 421317 306361 174434 67281 541281 247509
14936 205004 97825 465013 196438 571206 635855 585275 405497 478050 331327 494955
14926 494955 828955 761263 618463 639975 548722 287900 470278 540345 558100 829567
14916 829567 991448 791155 1013969 883961 1368321 891154 1275614 1521741 1388177 1594749
14906 1594749 1393361 1477231 1355716 1488337 1255599 1692536 2183098 1938531 1823359 1351027
14896 1351027 1201226 1165902 1065113 705895 815382 964155 296680 316700 380623 473974
14886 473974 431640 571717 693558 465271 604312 601455 634420 405083 706754 716279 552784
14875 552784 539348 311859 355617 368944 319825 898909 700439 493531 886121 627222
14865 627222 755080 512405 979597 703650 668952 930163 557957 739035 677437 339996
14855 339996 677241 535398 633620 767535 753027 776444 848984 675075 1121882 824747
14845 824747 542418 695878 441683 500129 869300 590587 39977 368508 507847 436788
14835 436788 589970 906990 744269 717997 371866 805085 610160 677273 790560 771129
14825 771129 923223 1318474 899446 926327 965741 1055865 1137134 794632 867169 1088035
14815 1088035 611437 744919 510113 950418 435838 557067 710477 834140 840983 569717
14805 569717 355904 481692 469527 354416 840137 587553 603240 573684 700315 894804
14795 894804 458869 418713 793731 667185 981340 466252 1000875 1014182 1047740 850800
14785 850800 562045 821382 720790 954070 549153 505123 627985 410865 678030 370643
14775 370643 457816 988786 381615 624135 656981 830528 455490 903030 919464 750730
14765 750730 622907 794581 660096 731680 680098 881637 662292 875463 1030614 1050120
14755 1050120 963640 773652 627571 596729 865737 832584 683180 703047 895455 756545
14745 756545 730842 823800 736503 796739 732806 1009494 858942 742248 620893 775035
14735 775035 846826 605090 873282 523532 569408 820280 868393 839395 693322 793554
14725 793554 915234 705186 664996 717009 818742 982118 960789 887685 757703 1170065
14715 1170065 1185877 839136 1129900 1369178 1241353 1216467 1501576 1780217 1605756 1674360
14705 1674360 1447235 1193029 1106621 891945 847773 995971 756473 883603 975749 1007917
14695 1007917 713795 1124264 873307 1188210 979854 890407 819165 960212 1173296 1168488
14685 1168488 1621863 1896296 1831557 1625197 1329666 1377588 1240668 1405554 1292300 1042637
14675 1042637 1236550 1024432 1211280 980564 1306182 1054672 1040624 1049051 1037231 1094001
14665 1094001 880819 1015112 1092122 847080 661255 989134 810948 823707 991492 1160197
14655 1160197 911804 1122091 779229 1094415 1094168 1094336 753353 1041600 1046457 1121306 878805
14644 878805 1446821 1261435 768076 1528778 1483156 1277375 1292280 1492349 1333688 1267727
14634 1267727 1240891 1167689 1552528 1417850 1448003 1438175 1118872 1340751 1414864 1309357
14624 1309357 1402247 1084930 1127008 1469034 1114335 1052968 1362718 1340750 1261878 1504812
14614 1504812 1567590 1340264 1508621 1106138 1749559 1355843 1324105 1649841 1313957 1362547
14604 1362547 1360390 1330280 1483178 1362557 1599039 1578079 1586949 1507319 1421210 1221664 1589988
14593 1589988 1464833 1509082 1418572 1713014 1678260 1445046 1689826 1674941 1547933 2045216
14583 2045216 1730380 1642262 1849830 1885983 1545899 1693361 1642802 2014742 1829337 1775600
14573 1775600 1787901 2101604 1865319 2232597 1997636 2077928 2044217 2059945 1792468 2114392
14563 2114392 2256172 2073295 1623713 2319044 2336783 2260342 2584602 1915449 2253713 2069014
14553 2069014 2202681 2422585 2067281 2468515 2608382 2704252 2792830 2455475 2734597 2571884
14543 2571884 3238650 3597295 3553310 4122622 4475208 4891606 5181877 5977534 7341332
14534 7341332 9664782 13528801 19856365 28656863 31628513 20271274 11783439 7886293
14526 7886293 5907367 5432358 5222975 5067729 4167601 3521977 2574377 2534347 2613208 2687882
14516 2687882 2435861 2368118 2232025 2341759 2763372 2329252 2558815 2419007 2476549 2446835
14506 2446835 2423270 2563026 2655165 2526054 2952480 2829362 2626216 2484120 2888321 2586218
14496 2586218 2874616 2664906 2904708 2899068 2927487 3276107 3324745 2679783 3389141 3041580
14486 3041580 3309387 3075140 3216810 3315385 3510489 3318003 3596866 3480032 3290996 3577034
14476 3577034 3852598 3527638 3646951 4003499 3594516 3499777 3727442 3911509 4049901 4016506
14466 4016506 4004026 4091019 3752235 4095073 4005071 4239985 3962122 4287651 4383259 4199443
14456 4199443 4343306 4236054 4623997 4548336 4566487 4712108 4539938 4479420 4684857 5124052
14446 5124052 5175594 4963734 4970231 5065451 5287286 5250356 5100757 5223623 5555333 5799261
14436 5799261 5324407 5884487 5676521 5756925 5793842 5854274 5954557 5822988 6079654 6238129
14426 6238129 6076914 5876818 6344997 6769443 6658313 6526711 6520073 6795214 7075640 6886058
14416 6886058 6786467 7195024 7455154 7128725 7591866 7649012 8038972 7775106 7960779 8204269
14406 8204269 8088652 8385161 8482293 8663584 8783786 9095509 9215944 9074893 9337577 9545751
14396 9545751 9332843 9371163 9546606 9995936 10083027 10224606 10383498 10585342 10616574 11182060
14386 11182060 11105327 11509145 11389019 11556754 11682083 11858027 11739906 12183316 12405834
14377 12405834 12546959 12982098 13001857 12953277 13783205 13853698 13663557 14240149 13786542 14589543
14367 14589543 14912580 15266360 15533485 16055394 16242875 16343526 16957047 17032700 17607067
14358 17607067 17901862 17872558 18444010 18559854 18978836 19620788 20068798 20589788 20730461
14349 20730461 21500577 21652416 22265265 22686519 22899333 23475947 24130561 24555279 25422645
14340 25422645 25661536 26517046 26948553 27720916 28207002 28881724 29990671 30460865 31210425
14331 31210425 32090627 32897242 33899715 34476441 35604658 36865464 37477856 39198820 39924336
14322 39924336 40976315 42179332 43291555 44774548 45776736 47382543 49038057 50296503
14314 50296503 51922359 53401475 55780951 57502389 59569765 61639566 63851381 66136776
14306 66136776 68399569 70857232 73630533 76289018 79141127 82134562 85078498 88574436
14298 88574436 91876385 95642835 99939221 103670353 108341445 113046906 117981195 123257188
14290 123257188 129323810 135242285 141083305 147696032 154634502 162340487 170162859 178602426
14282 178602426 187181327 196515927 206469353 216655656 227479011 239186797 251475939
14275 251475939 264436998 277567144 291452624 305624273 320231188 334891555 349677426
14268 349677426 363415944 376862994 389686842 401374595 412573114 422676392 431673490
14261 431673490 439932703 447788496 455009546 459845806 461781518 461747049 462134873 459080646
14253 459080646 452707390 447750002 439465778 429374803 416960856 405343137 391522524
14246 391522524 377795780 364134510 349926833 336039061 322182475 308422637 294660733
14239 294660733 281891725 268970545 256115914 244447520 232869057 222562155 212023071
14232 212023071 201430461 190872427 180779125 171720771 163458201 155141432 147668510
14225 147668510 141048741 134078366 128272590 122816774 117201044 112224224 107563746 102867908
14217 102867908 98648340 94931237 91138466 87514611 83977186 80645689 77567676 74658876
14209 74658876 72190139 69359392 66827352 64607898 62724226 60198275 58516706 56370772
14201 56370772 54588763 52967019 51203191 50086845 48763580 46782012 45519234 43964051
14193 43964051 43108602 41605506 40967050 39538526 38329066 37131220 35957847 35645462
14185 35645462 34648838 33713544 32886706 31558507 30669206 30283309 29731267 28832233 27888756
14176 27888756 27326068 26648291 26051600 25445654 24924957 24332748 23892539 23388708 22672414
14167 22672414 22147664 22054512 21289126 20693092 20356879 20057738 19738294 19466692 18857017
14158 18857017 18260804 18118752 17572626 17235830 17167658 17010523 16429287 16245760 15965641
14149 15965641 15783179 14946471 14801297 14927924 14324504 14237209 14024120 13467118 13548630 13060290
14139 13060290 12743243 13027390 12955203 12500901 12194596 11879674 12293163 11744886 11331272
14130 11331272 11178334 11092806 10925291 10663776 10878456 10031311 10538341 10116471 10179444 9817379
14120 9817379 9757780 9359521 9253309 9499074 8867423 9135472 9287179 9018548 8311901 8648290
14110 8648290 8368313 8571770 8228113 7970986 8146664 7941958 7710054 7538080 7340446
14101 7340446 7598669 7201448 7203793 7266909 7058603 6816785 7162594 7113782 6937689 6652476
14091 6652476 6281761 6249784 6201289 6202699 6396678 6202241 5880553 6216976 5978085 5987688
14081 5987688 5782122 5571235 5869380 5639248 5477613 5545998 5509697 5327396 5255325 5443512
14071 5443512 5255355 5378344 4903738 4689308 5095472 4873363 4948252 4646543 4846209 4793975
14061 4793975 4651488 4467947 4680736 4441741 4479624 4491084 4151502 4126054 4525208 4576572
14051 4576572 4264445 4225460 4262903 4210508 4202706 4573307 3783197 4067386 4125411 3908616
14041 3908616 3984682 3859793 3808335 3936113 3850011 3660736 3603553 3727412 3430576 3562641
14031 3562641 3780503 3374754 3261500 3404464 2896149 3382912 3060880 3136181 3355286 3059986
14021 3059986 3433217 3202928 3231345 3019085 3065884 3154625 3116505 3051253 3316334 3145554
14011 3145554 2939711 3212948 2760989 2770933 2737289 2860409 2684268 2565055 2813344 2784115
14001 2784115 2695694 2532825 2497297 2457028 2333532 2547152 2213288 2388524 2513685 2422997
13991 2422997 2296428 2157194 2445511 2367465 2628148 2251563 2523980 2120940 2665278 2222903
13981 2222903 2447797 2777673 2814288 3110336 3404596 3567964 4269504 5680440 9008144
13972 9008144 14553596 24169060 31948158 23551014 15739866 10579089 7820793 6189418
13964 6189418 5217155 4667859 4103934 3706349 3481015 3453872 3118023 2858053 3075858 2520627
13954 2520627 2775797 2736047 2243484 2659340 2402157 2391489 2175943 2507407 1988321 2265918
13944 2265918 1949169 2366000 2147335 2082260 2104047 1840736 1884856 2084134 1815842 2140592
13934 2140592 1620077 1766492 1929363 2189803 1659350 2049217 1856542 2070488 1934123
13925 1934123 1541514 1548213 1673190 1873036 1519912 1889186 1703906 1740863 1853976 1852216
13915 1852216 1720255 1497089 1862777 1533479 1492510 1672001 1846898 1726348 1936968 1751729
13905 1751729 1863493 1670974 1810122 1357912 1393342 1297970 1221809 1549298 1734569 1410722
13895 1410722 1517516 1510451 1498825 1361003 1564900 1275170 1557741 1230430 1402953 1448780
13885 1448780 1488689 1291752 1465902 1271462 1226205 1603202 1241034 1215437 1445456 1484055
13875 1484055 1376281 1339811 1278642 1400772 1040409 1221650 1229044 1371424 1608307 1375184
13865 1375184 963973 1342710 888018 1055963 1489373 1124909 848409 1033659 1137320
13856 1137320 768852 1190818 1237669 1009506 962811 811560 1059901 1093975 977743 1144467
13846 1144467 829689 1209972 802800 1146957 1064258 843132 1068865 1054272 966058 1205183
13836 1205183 1108062 1056731 849995 1062236 863059 1008917 852486 910094 1040096 1379045
13826 1379045 851893 867285 1128303 1220961 876655 1031243 1187213 651983 978065 945086
13816 945086 1089422 538821 1146125 1123172 635793 1007785 1021126 888540 1019713 930957
13806 930957 758996 860589 712727 1143216 958059 711646 1008638 903138 885481 1149446
13796 1149446 738263 691976 1031606 714430 888935 914990 837697 863276 724008 772228
13786 772228 667032 736393 473768 642478 1006003 842879 1206993 697977 798815 705712
13776 705712 770119 829914 972873 874863 440978 577632 321587 556850 651432 764691
13766 764691 530143 830581 734330 638297 759845 771864 563764 747092 634246 451918
13756 451918 783378 519773 610687 777273 1160826 528491 551834 329900 679422 457593
13746 457593 847827 785849 595921 335306 826139 498765 1015978 874412 440989 578442
13736 578442 543264 558583 482472 748759 713938 447399 520922 255828 369462 821691
13726 821691 520225 616169 278657 665782 671492 754268 538145 630963 474163 883245
13716 883245 340523 860332 871678 300834 608001 317406 759158 424973 811990 422568
13706 422568 629554 446319 568040 193017 544598 588215 552325 568824 519961 211459
13695 804654 425921 640555 774302 317007 551702 396094 476200 337044 675332 530226
13685 530226 571745 620207 332925 500080 497433 779780 516567 502886 614558 604145 586857
13674 586857 380047 569429 499579 394272 834106 515158 392114 550666 277903 536053
13664 536053 222287 358631 281793 543628 415354 275840 381509 304418 247852 479090
13654 479090 353318 540190 347344 346692 611802 388687 343906 127800 192654 561524
13644 561524 535083 637249 670595 321629 249069 523295 413707 473619 351912 450948
13634 450948 356404 360247 596592 233961 340380 436983 294126 635305 428514 432448 553339
13623 553339 542471 496795 444634 552899 373961 447041 195593 399520 167221 644203
13613 644203 184236 506944 701198 302337 271883 480387 289254 360156 507174 524431
13603 524431 46803 472844 425559 303589 252829 213598 439317 437630 221875 378492 469231
13592 469231 374822 193284 465113 350247 630096 138020 416437 158247 -55507 306185
13581 222130 376357 70549 384917 470672 178512 362364 554199 127057 614198 663384
13571 663384 321393 664780 504596 46945 184384 274582 145192 465612 37896 240169
13561 240169 381900 518251 397956 133803 259345 224098 231761 319301 308693 263776 225362
13550 225362 359087 158299 318433 9535 211887 306122 411481 215268 511875 201466
13539 397180 186859 85199 -57144 293763 244002 554554 511529 524300 278628 281241 287567
13528 287567 424061 -37390 123867 364506 127858 623815 126816 156236 153320 502565
13518 502565 67414 242324 409135 121750 105137 388304 214896 210598 219085 59915 263223
13507 263223 74877 395911 6649 361013 670878 286772 186055 340185 -76984 202483
13496 234838 413293 354819 166771 360708 70935 629395 174455 68773 668148 91166
13485 466696 431335 235073 265410 68172 657382 461591 223243 98322 82737 396996
13475 396996 303076 201919 119884 -167055 55244 418575 315780 -160541 118278 204593
13465 204593 241535 224352 242602 148983 76171 322013 280988 127104 258490 234870 87865
13453 139487 31691 462448 648247 286948 225487 305376 151945 310070 241884 307297
13443 307297 452247 393494 147420 358115 200244 80312 160781 -139325 -59133 344154
13432 271632 343823 180218 119068 401814 334087 152097 113448 343926 239400 350640
13422 350640 321455 10308 196334 283925 198086 134888 -210546 66912 55366 313160 251897
13411 251897 -136342 140190 617514 152094 51942 212710 25306 -68527 82712 228406
13401 228406 384307 -93540 260719 295756 -112404 18406 508569 171521 293569 533234
13391 533234 13285 206542 264024 278905 324428 2844 181664 89243 249542 268263 47820
13379 -52187 311958 -203063 433841 17996 111721 376870 -95546 390008 48201 98194 -175815
13367 184813 -62187 261545 432664 -33961 -110311 135958 102280 275194 332267 295671 -140627
13355 -26024 193211 141203 196363 365939 402421 32960 157103 292291 263755 300639 273524
13344 273524 162009 219521 46295 127523 251528 190157 196789 99166 -79776 254307 249256
13333 249256 309639 164664 -19751 112967 116892 408186 478327 12265 318494 154612 312412
13322 312412 154933 160655 12583 124672 -187398 -42448 183712 137729 51417 23679 3706
13310 271516 -80376 346887 131728 125146 134301 332700 372690 280201 99319 59365 -6138
13298 45755 161637 -75306 126123 357834 182518 351374 162203 -361928 25445 96632
13288 96632 175657 -117192 284650 210161 -32895 317675 176995 -42223 232547 -21239 194902
13276 23762 311306 247472 315409 104785 72460 39643 105721 175895 -9288 -139871 -288072
13265 -288072 -5076 75887 178307 113234 631792 212598 -88230 199326 23685 456539 341461
13254 341461 266887 165719 -207252 9372 156897 249188 137469 -71107 83077 -154510 -266852
13243 -266852 327015 285861 247047 50283 -32553 391650 64970 108142 258327 232475 -103373
13231 125315 -329320 -48304 35450 458195 271110 -103436 67413 -1720 -22715 140168 -46519
13219 -45873 93360 162905 -91384 -24552 -11462 -78211 241771 -81688 -35621 252165 -34658
13207 215757 11784 -180789 -360785 143834 102741 106492 -14051 13086 195775 181959 -103799
13195 -46611 -376865 101824 87334 -16543 -75572 66498 -360062 29937 97877 125199 349566
13184 349566 -64680 389535 -32608 8085 102602 -49594 100516 155036 350198 32643 99843
13173 99843 -22013 292337 -47629 -73575 1327 -205324 216649 15854 420927 197207 -206085
13161 243402 123887 -328900 -19906 46513 274880 51166 257850 160698 56722 221323
13151 221323 60727 238075 305914 74664 100531 126797 205388 -200533 38378 -350442 141140
13139 184730 338323 -30883 13740 107369 -291283 69876 275584 135453 166043 303765
13129 303765 -22411 200278 55678 60822 118429 264812 -294557 257010 163622 246659 4940
13117 235017 -18463 -57445 97132 216817 -117371 224163 -50183 269987 -6872 -65245 191251
13105 -50064 -392399 -235684 284120 -214719 80481 -25063 63284 57090 176523 52711 370868
13094 370868 33492 -45855 -376983 29993 -182548 37320 82653 236240 323915 8734 131865
13083 131865 167779 4557 198339 153857 117337 355252 105878 251276 -341662 -305228 106350
13071 -7827 -128063 -85721 -12440 162044 -5191 370727 -43924 17600 219100 238705 52663
13059 -124917 66869 -286455 -102721 211281 -45667 200262 -63242 -86977 289702 62434
13048 94907 61880 -147645 63839 59743 -71194 -297330 -242281 240683 44073 -20608 88507
13036 -12044 251813 195495 351660 57035 -223068 186554 222371 -160326 -79406 102314
13025 -188401 82338 19287 109869 192485 188283 -3738 -147887 -34726 139827 161202 43327
13013 267346 30203 -222419 238693 -33527 34965 256912 92601 160453 -168986 161317
13002 52081 -108581 -107077 156941 195383 314450 152789 -21188 100878 149286 111125 -12071
12990 -160846 -175976 -28963 339867 46386 172683 -193700 72889 76448 -97328 138281 248983
12979 248983 -133626 -67159 100378 206274 -72246 18261 -207489 58329 -8664 21810 127132
12968 127132 -132275 87150 -75220 75485 149107 -141954 -177659 -50268 -57932 -390982 -140684
12956 172068 -458249 -130181 304352 96580 -239972 123571 200192 40103 203761 178483
12946 178483 22326 112933 -203981 122879 359005 3675 200259 -287234 -104320 35916
12935 73504 129455 193248 199349 70900 45930 -118200 132089 -17802 146063 107226 223744
12924 223744 -66956 -238978 39512 34927 275303 135076 156696 55608 -28978 105374 2931
12912 164694 -316083 -203304 -52263 179802 -67618 -17142 -298379 -92216 52682 -140031
12901 -20082 5354 91390 -27021 -169286 -29459 -192673 68711 -190135 45997 -295736 136514
12889 22681 -319556 250025 -46756 11738 357947 262181 -2243 -136987 17025 48184 36383
12878 36383 27886 107651 -9602 15430 22182 177884 -188046 -3149 79008 77152 -155748 200808
12865 -367008 24592 146552 19502 144206 -134051 -111475 35987 -98436 61718 174825 168167
12854 168167 101060 -147780 127971 -51741 27309 87636 -50542 -11024 -174193 159716 -164953
12842 260163 8219 216470 -26012 304248 106773 -29973 142330 -16392 -79702 9981 -13185
12830 211402 -256513 -27576 265956 99666 -86129 -30096 -61661 55331 79654 -107364 -75268
12819 -75268 367819 -120221 -182944 77781 139371 -94024 149747 -401421 -101005 184336
12808 31708 -255 -103147 -1489 -369 467880 49680 27549 82816 -303908 -174263 -183751 -2064
12795 -9903 138681 -174390 -142059 -125337 -78440 223940 188105 -185671 -55188 -274056 -198176
12784 -198176 52740 216704 88080 -332202 -233464 65779 -116550 -21630 -22607 -308409 -292005
12773 -292005 189522 -58652 234681 5182 -291175 98269 -183096 29507 -272211 -35793 -56097
12762 -56097 70967 108382 172145 311618 -121920 117227 45627 211648 208605 84360 632
12750 -68491 -11736 -96720 -279252 -134404 -50343 -152330 296373 235772 -311359 -166760
12740 -166760 -135449 -227677 53477 34569 -19782 114671 -81025 -52005 99270 34722 139943
12729 139943 -90777 -98786 -142904 -94951 127285 61076 45324 124730 53800 1022 91079 -94480
12716 88730 -95191 274369 -13774 -259902 -280128 -222071 299716 63074 5706 -15049 29595
12704 -78203 -380010 -176376 253867 109280 -774 -34965 -174593 -68541 297198 160651 6590
12692 -41317 233381 427249 260552 -22333 -266605 -47111 17967 310605 291475 -89975 28906
12680 46312 -67084 -44469 109482 153461 -72999 -109143 -218459 128846 106455 -76233 237738
12668 65193 94930 147403 -265341 85990 51841 17036 222192 122634 46120 51638 240308
12657 240308 281558 190435 82136 -220948 -59750 73227 -112801 -313611 366829 -84360 -271595
12646 -271595 18457 -316007 191272 217506 285654 -232204 16763 -24257 -20584 429673 -114732
12634 -110524 31355 -209791 240177 195495 -110322 908 -206569 -3211 219543 239763 -51837
12622 104117 270376 -233329 29286 -3113 -56917 -35890 56371 183372 505846 129535 297643
12611 297643 144542 158491 -32415 161412 144815 247173 391953 -312831 -203042 11329
12600 142835 101371 34860 326904 -202587 -117187 165273 9414 -182976 -59995 96422 -174793
12588 84748 -25425 -118844 168978 56619 46723 417455 123016 85684 -95710 -31331 -219470
12577 -219470 -152959 -176268 200656 69824 88767 -8094 -97775 -129800 76524 -84558 20766
12565 -101641 -254942 -136194 -381648 -238870 -23275 141200 -223909 -252103 -63229 -91744
12555 -91744 24757 224794 -29715 451637 124256 -162917 -31748 52654 166755 -117101
12544 -31445 -12955 296288 21884 -197751 372745 37358 85147 70000 117907 -107310 84334
12532 -141521 -192798 72653 16049 136311 -336116 14194 -316277 95544 164387 72146 343708
12521 343708 -98826 69591 -129947 -127495 220351 -230515 51341 244538 97780 33111 70431
12510 70431 16925 161240 -180679 -2413 -17165 -85801 372237 -208151 -30372 -102065 59319
12498 -309481 -237731 88178 -275124 -322452 -76183 -99588 55339 48405 -110880 1384 85178
12487 85178 21133 91552 262310 92977 158436 159705 293533 186986 115763 -345335 203676
12475 5311 254026 -193230 161394 -38571 98376 -91196 -137683 34023 -282178 104663 -88693
12463 -303825 -1336 232309 7660 -426494 -81903 101198 -120747 -53875 56329 349151 135092
12451 -45002 -4768 385552 -190759 273120 34125 -208974 -64858 -345783 -100929 -218511
12441 -218511 1427 -270675 223633 62814 53111 -86800 -144289 37635 186577 -100129 -224913
12430 -224913 -55595 -245480 173160 156400 -280004 -85740 226447 46687 -31518 -29114 37326
12418 -250251 13093 112863 -6404 -151084 -79743 49988 -103810 23715 -37170 41164 -198990
12406 -258897 253856 247142 87082 -162789 -313178 -148147 -8674 -237234 -96190 156709 162467
12395 162467 -229474 -107021 32798 -113251 -163083 171798 -16663 -169049 33386 103204
12385 103204 -4034 -29319 -229718 -116789 -14018 -240847 110562 58795 97018 135520 -22790
12373 39254 -168949 1606 124235 -38134 63949 -110750 -197384 -40219 210657 123421 397549
12362 397549 400811 244033 -38674 96698 250404 -22620 171636 62092 -105494 93686 -59644
12350 -9577 -105625 -70713 312346 109758 -47580 -126281 14213 105285 331398 102686 -491486
12338 -154794 206245 309819 -336129 -216631 186518 184293 -179023 -71169 341425 -53768
12327 306242 150908 46512 52718 28710 -48732 -240625 -308994 70869 292882 79457 44382
12316 44382 68273 345274 -67078 -100859 163564 211813 63769 -108756 149393 -69349 115912
12304 22443 235370 9450 100186 104588 172625 52484 95226 79953 121251 227217 289932 10951
12291 199045 48854 24287 319741 2831 283324 -57192 351856 313577 -377452 129906 6919
12279 93334 124577 -48325 175907 -142850 204495 269312 -13463 164201 58936 147851 184472
12268 184472 -8751 74616 -248434 19558 107722 43080 85337 65932 5162 142897 5133 -143957
12255 461994 121768 442054 358016 245217 482574 -22398 134902 222826 111253 15424
12244 -26802 243853 -305316 92346 241279 -21983 249002 -310663 128184 85408 102380
12234 102380 -99755 22446 -267767 198630 145341 740 169243 214239 91635 459133 174844
12222 55860 -135102 -33915 414535 49942 -91452 43790 -250928 -194029 60556 141788 315934
12211 315934 271893 225015 377163 399318 62398 200046 179782 254681 197431 154146 111644
12200 111644 247236 66771 123175 -207411 -178358 43101 154285 -40910 -300011 262587
12189 14077 72309 12624 257033 -245046 272414 -34460 -97138 131096 575476 310743
12179 310743 362019 224760 96344 222847 253865 86778 214267 -177629 -38497 276618
12168 184635 49097 10333 572364 92821 142815 151685 95482 220586 178462 176234 187720
12157 187720 114550 -153546 -74798 306074 -76978 317819 127749 423715 17021 188534
12147 188534 278271 337626 18867 280789 -204292 190391 117466 -327007 173427 -260378
12136 -154885 366048 88470 73040 -203144 251180 -108469 236962 34713 392155 232751
12126 232751 30713 -14444 232480 -37244 -129414 63636 283598 48803 -170495 144035 118211
12115 118211 36233 105207 237957 173693 -77947 311490 -255660 282665 176385 363275
12105 363275 140261 35542 320419 185736 213682 443479 -122651 232435 252860 159291
12095 159291 206597 143337 349780 7790 183231 288247 32433 83981 -68045 291973 -16697
12083 65981 -301801 130574 142668 100111 -346379 56776 -87399 -52741 -49910 -203953 -92228
12071 -137275 93203 60491 234885 -135712 -72691 -123966 212697 -45666 473743 209104
12060 -71466 -244858 29137 -117395 -196546 63716 113757 98100 213475 236671 -50589 61561
12048 -49826 -89523 137436 101580 -22006 -65979 -131651 64267 103157 218138 -186407 10742
12036 18682 299344 24977 -16825 -228720 2488 47558 -179687 79767 -232572 -224697 -37734
12024 -104679 248486 105905 151561 19733 35188 -153044 -126464 52617 15182 -83293 -78300
12013 -78300 -60225 -225052 242135 -169591 124922 -143047 -199963 48858 -36944 254847
12002 282269 15919 12647 -38512 210983 45018 31851 -28190 369502 210683 80159 279403
11991 279403 -235212 19579 370902 -183830 -319806 -60070 -205607 268281 -125155 67102
11980 112884 -298008 124200 -228683 -145096 24593 -130427 -194273 -225500 -297316 -27740 76
11968 138770 -46228 105325 -2172 258382 17588 295901 132129 -55765 -252560 91668 -183870
11956 -47084 -108231 -304336 -307382 -188859 -55110 269217 -179828 -65864 -41957 67804 -26197
11944 17963 153312 -62281 -193485 -220435 -116410 -55291 -107773 71484 322465 36211 -47418
11932 156872 -61443 101584 -173404 185160 10603 61573 114522 -187768 41694 10063 -125949
11920 -25904 -277113 222714 11265 23562 -226946 33208 52646 -2215 120495 -29298 46010
11908 154753 -38549 130710 -33964 -96299 -15711 105366 -18500 -244050 10463 100564 -381498
11896 -145043 -28020 -86816 -224539 127057 98095 -212650 -224227 130492 -163051 -177315
11886 -177315 -70053 -112564 97673 47041 -147357 330673 143697 -236225 -145112 -84551 60684
11874 145000 -37963 -124777 1899 247156 -28407 350401 -115678 -149326 -286598 94199 -54553
11862 -275066 -464204 4720 -34793 -52630 118380 148953 -87094 -260668 265584 -139277 -186820
11851 -186820 282773 126613 -62549 -61817 -4133 87714 148583 -136293 -34219 -196015 -334636
11840 -334636 -321589 -105789 -122204 -306931 -275525 41596 209569 -106936 106174 131785
11830 131785 44854 -182646 168156 -27574 437309 34654 -91771 -184311 -217110 106834 -121785
11818 181940 -453497 12299 123197 71954 -229829 -426720 -46341 74443 17626 72782 139152
11807 139152 10426 -228873 -442891 -193857 -104541 185284 -289633 -132274 -59501 7881
11796 80611 215330 -295446 -106915 -49889 112394 62218 -48166 200764 -7940 144712 -207597
11784 -121385 -223537 505029 -125518 75285 -113859 193176 139997 -25732 -203278 287066
11773 -176752 -20193 9865 -229429 -136840 26059 -37885 -81050 43786 260472 268152 49655
11761 -28353 310498 -92871 -135427 -67413 140887 44852 223951 -40493 140750 -129991 -145440
11750 -145440 -282509 130765 25390 -243876 -323650 166739 -151518 -152858 -20975 -130349
11740 -130349 -141853 -128286 142499 125026 -45845 382843 -310003 146224 21121 -296148
11729 128929 -29089 144298 183544 53574 83810 184473 -73860 -469134 118895 -153956
11718 -384501 -193889 -42146 -81166 -505137 -61745 -180336 181096 -68309 -312103 253010
11707 -67024 -21270 38093 -84044 84538 261441 -60247 -173466 13902 -128962 43700 -96386
11695 -95348 -86432 49733 293241 -184094 -304628 -91109 -43630 26016 -218769 117779 -50243
11683 349520 -41809 244271 35142 -163849 -258175 -365049 -71817 15 -31371 29307 102812
11672 102812 30204 27831 168077 -257953 -22935 -188163 225506 -175120 219840 -90521
11661 360596 105676 113785 58402 -278595 372239 -88106 99857 -334634 15989 82570 90882
11650 90882 -222329 -60290 49360 35306 -419074 209122 -185473 -85967 -174630 96618 -50246
11638 -242324 -13580 46306 399312 -128317 194503 -256741 32122 121198 -119321 -33629
11627 56270 208306 265087 -84391 119331 -77051 283516 -5962 -175886 2631 -104584 -98721
11616 -98721 -5692 -103453 -413994 -15615 148293 -218129 147873 28663 -101922 475726 270960
11605 270960 32198 25415 -21464 112806 -39508 -201678 273543 23359 -81000 -85461 -279701
11594 -279701 -149329 106377 -101421 -297565 190124 62788 94286 -73648 -26356 -106888
11584 -106888 -253828 14385 131311 511995 103565 303373 8247 37437 67696 -258913
11573 -122046 16644 34881 187930 293775 143210 372268 148617 -262430 -45773 28253
11562 -142867 -64086 21728 24883 46427 224300 -104330 285268 174913 468515 147078
11551 -144604 70471 6861 123511 241739 -16642 174859 307027 36082 378372 113918
11540 -71484 -146565 105485 218936 -372445 -177206 -77728 -169666 -24776 187148 169450 -169559
11528 -79210 319076 -221059 52697 82556 -138063 79841 -104075 99673 -129205 -20455 -301006
11517 -301006 257260 311402 98881 -32714 -11553 8296 14675 102936 -9009 -31565 -181186 -41657
11504 -96690 201864 391682 148842 -42830 86708 -39294 156683 98986 -171596 -31033 -105951
11493 -105951 95169 -22649 -304888 232832 -193286 192617 16448 495067 69997 223676
11483 223676 238338 -232557 234671 252329 -185640 99275 207961 -112317 -312869 56972
11472 353437 -59332 135572 176611 408653 -98017 308490 115342 7777 350380 113552
11461 -68681 294732 226989 82964 494439 157597 115326 103997 165524 -93097 -1464 81492
11449 104607 52702 14939 268320 -58447 51101 175645 243654 -222494 316032 -136005
11438 177700 230948 -114076 211667 -93375 151329 184976 -18197 263914 59353 47216 -83811
11426 72368 83873 155597 -19094 -331600 162659 -130281 -1815 -172356 77167 120629 -57883
11414 -122455 128359 194723 169084 32163 220745 -57199 -54026 109662 -227698 3540 158626
11403 158626 -148449 -147015 186971 -79298 3088 -453426 54960 -97680 -38053 24369 20121
11392 20121 184070 -152351 54311 -168245 -129429 288745 -38674 28903 80280 -186916 248593
11380 -284185 391471 16484 -163479 31033 25217 236010 -167964 22868 212537 -100146
11369 -282854 18188 -109888 5834 98229 -197837 154227 -242125 -5178 9339 -93520 568259
11357 -350705 -117894 92508 282931 -96030 -289588 -193529 -6335 112915 -125831 -218347 -343473
11346 -343473 84997 -327629 6972 -136160 46060 116872 -266011 -126393 -50934 -15340 235162
11334 -19174 -5130 224003 -140722 106083 68318 -45686 190367 -8325 -135573 107783 -33245
11322 -173325 -253910 -185780 -62379 188400 228056 -359076 90883 6149 -169593 173810 -45741
11310 -45092 -251649 329528 61695 -142258 -21064 315875 -239079 -25346 -60432 -243424
11300 -243424 -156668 65343 59500 65104 196443 96440 273404 -296670 -220449 260547 433964
11289 433964 58044 107194 94724 -372650 -477870 12077 -103687 -64039 -223882 -257662 91977
11277 12160 -34898 -360598 47975 109625 9930 -169499 -52916 -224590 -355194 -99131 -516793
11266 -516793 -56703 -52944 29658 48036 -287755 -223536 -154103 -28906 77591 -61484 -360105
11255 -360105 169188 153719 36028 298791 -90889 -158201 171986 -165731 239249 -125048
11244 22758 -398888 8413 -339555 187535 47844 -125601 140114 -137142 -58740 -136440 12144
11232 -137874 162533 -212397 -21842 -312 -320302 -120566 -13003 93849 387792 319677 -199586
11220 -73439 -45472 -261308 134037 -116592 -122877 -101607 2177 -217684 -360536 -267752 148930
11208 -191863 163762 -11458 -279981 225800 136282 -247348 -74864 -149183 -143311 -304341 -18383
11196 -25693 45152 81004 228383 97763 -90316 -235382 -44447 -70174 -117719 -31649 -51137
11185 -51137 -125254 18865 36758 40201 -357523 -60728 7353 -10320 -274868 295625 92992
11173 -11160 34868 -111105 -218527 198278 -79806 -1816 -268486 176308 13899 206050 -8359
11161 -187566 -285429 58046 -217417 -30313 -74186 -20516 284470 -33206 -40199 -803 -201905
11150 -201905 36741 119099 -44273 -258363 13264 53617 12764 39617 46183 -170320 -174824
11139 -174824 28175 236 -201432 -271445 -106795 -149807 273887 20609 -269352 -96240 -207935
11128 -207935 -305576 -29595 79848 308346 333304 -321875 -225339 -66207 193911 23863 -86621
11116 -54343 39330 182103 245356 70032 38707 297073 120970 260988 39125 -464 35963
11104 -158418 72310 162430 189282 -72892 -62406 -95126 193487 39949 13050 -37496 -72806
11093 -72806 -99333 25621 490817 339990 223728 -64225 7389 131262 214688 131543 98239
11082 98239 217400 37388 89921 -31624 -123878 -19177 89892 378633 92362 175231 -20328
11070 96260 190708 25654 613267 32242 140924 349098 96933 124193 -13104 255831 142926
11059 142926 289230 220171 251128 245708 227347 318439 454596 318655 276672 334142 89873
11047 229893 275096 167128 536952 417458 408460 720486 174144 248355 491723 570489
11037 570489 445064 655857 765212 615033 483451 668759 723631 433607 724637 457432
11027 457432 370576 409916 544401 736734 806400 564494 744763 656300 341149 812147
11017 812147 575274 443517 459371 769027 757779 607961 449781 354824 412117 705522
11007 705522 740958 575745 587707 150211 545913 428113 562734 521581 506311 426170
10997 426170 449985 474541 443327 136024 473185 580952 446747 406283 550773 425581
10987 425581 314851 434156 683329 283730 665594 486428 330741 727459 373853 473145
10977 473145 806929 418243 777118 1169938 584241 636509 444757 1009600 377300 715763
10967 715763 828311 857038 690958 860173 686309 944601 1124098 1248314 1492520 1364883
10957 1364883 1677175 2167465 2040115 2229439 2419340 2233594 1855003 2571645 1626091
10948 1626091 2021299 2188867 1602895 1487305 1394937 1115731 1720560 1245597 1409855 1663229
10938 1663229 1584303 1436108 1269375 995135 1032704 855511 1005257 545759 577560 436881
10928 436881 452589 136782 315232 -87121 86760 565810 214467 12910 269645 -228586
10917 135851 -111669 -14107 -155769 -139779 -14564 67207 -234984 117951 245332 158751
10907 158751 51601 36323 206764 242970 201575 106500 33144 -95341 172017 105713 -47404
10895 -36256 -45926 -82824 112335 175107 226491 -47921 -168542 72759 -271172 67995 -264390
10883 -2868 -128231 -47581 -155015 23329 132375 -154698 147597 112464 -31318 -291402 -11030
10871 3026 -93717 205565 386865 -24628 111854 14106 -99567 -76724 -32319 233835 -83195
10859 -10300 -169364 261824 436518 65138 163080 -124071 6411 -230456 258475 117206
10848 -40193 635 -138481 223482 228589 158015 143814 -131248 48450 -22366 -128468 148372
10836 -12664 -28809 54253 -67005 -12422 -73107 -136307 6497 -200875 47389 -334681 -156800
10824 -133894 -126125 -30861 93589 -112378 -16647 -148669 14233 23170 -70789 105890 95681
10813 95681 -91314 75131 -220708 246221 -149906 -385346 -118773 124985 112670 65922
10803 65922 -19803 -62107 -109419 -149737 169719 164613 -190611 -98812 -77995 121433 16846
10791 -42488 -28524 -72966 -49116 -332626 -219474 300 -253820 -278447 -84830 81470 23534
10779 136230 -111826 80440 41165 -56741 134387 -235630 -139853 207977 -113685 -72690
10769 -72690 58727 39787 -218012 81531 217126 78986 35787 -161413 -183557 -187574 4023
10757 -437287 -70801 27668 -100614 -258116 -304752 -117839 -103092 -166469 153519 -217421
10746 -77810 -62182 129612 -58876 129914 -285134 233708 -141213 -11128 73358 -246442
10735 -96147 -44088 335259 -225622 -184222 -151940 -264123 -187839 78672 -175532 57437 -242461
10723 -247814 296506 -158971 98658 -55959 -228705 36670 12336 14848 -92377 -45353 -207384
10712 -207384 -102458 -73306 137053 -314590 173875 69330 -92370 204819 53073 97878
10702 97878 -299435 1384 -36757 78961 -170624 -197068 114907 -350023 161699 47630 -245114
10690 30311 399590 194067 -230049 -17459 -195817 -135041 134784 -7785 -171757 -472358
10680 -472358 -323746 -48468 249462 -134585 -42072 9239 -76890 -128876 -365861 187026 -232904
10668 -30488 -350060 -232604 35319 80573 107256 78664 44890 -61679 -376558 -27225 -166650
10657 -166650 52159 -203018 -250046 31192 -102570 -131194 -161200 -273152 71819 32036 -255355
10645 -185372 83607 311921 -8410 -98085 -128047 28324 -288480 250065 -150105 35196 266137
10634 266137 -19283 -34383 -104934 33616 -202795 -130528 74290 200794 -224387 36996 -21604
10622 -83403 -384332 140513 -100534 151666 -299596 -117615 103702 69671 -13855 -111584
10612 -111584 158638 -316578 -132275 -145155 -329913 -383571 -133984 -162911 -183526 -263863
10602 -263863 -258795 129165 164389 -32142 -189443 -104747 71484 -340066 -30859 -234413 -81368
10590 -168546 -339194 -432182 -51746 -76665 -20162 11625 -204763 -62887 -320086 -293917 125726
10578 178144 -121237 -36193 -247314 -156832 -54004 -382888 -297471 -77324 -336535 -509 -115470
10567 -115470 90703 -66107 -231674 -266598 318706 12622 -7161 -608672 -9864 -59942 -74077
10556 -74077 243243 20080 -52980 198956 215722 107768 218837 122669 -46433 -3864 -159332
10545 -159332 -119452 282614 51424 309397 -214659 13797 46151 29400 -161992 -70789 45247
10533 -340399 -113227 193189 18867 158265 -355562 337308 -222855 -261024 16605 -152240
10522 35958 -25651 -37709 -67481 106711 195219 -150714 -388597 102045 -12548 -60999 -303466
10511 -303466 -47743 64461 -80369 40673 107788 -37182 164814 134948 -89470 -259770 161199
10499 9975 94366 87442 -105905 234983 10713 -105129 -88206 -139811 -145529 273845 -149846
10487 -17138 150084 55642 -104687 -125157 139838 125028 155858 248707 -123286 -141188 -160884
10476 -160884 60281 -109351 219789 20066 96085 79360 -116071 67100 -145577 -73416 294276
10464 -206852 130873 -7268 35928 409811 407134 498439 282191 -45370 360034 119323 110795
10453 110795 197091 153266 4782 327269 -207916 14471 191206 152482 57478 -202378 165341
10441 -41868 46473 -7257 -3385 385007 319123 153077 -128703 -219855 271322 -241151 165525
10429 -214291 -45000 -80457 376439 -206513 62869 114065 -260392 -33605 -170692 -100870 -201055
10418 -201055 -425711 -261724 -54464 229774 -101044 -184201 -362656 207256 372368 88299
10407 120080 35060 269713 79274 -66211 37060 184346 -146621 -286715 -18333 147796
10396 32532 77481 -222294 171070 217413 -178060 -70296 -241404 97229 148920 -286277 -99412
10384 129424 -80194 -80254 -236927 -307545 -98864 36784 -97252 -160359 -52441 202736 -153708
10372 103440 -27311 265043 -138814 -255035 -128036 376055 182964 126002 27076 -8535
10361 5092 168402 133366 554416 166580 72494 24233 172244 -46334 157856 147075 176557
10350 176557 168220 271543 249886 663454 176317 331977 -20563 249039 65994 237606
10340 237606 343128 273971 168878 -74017 107425 102737 431795 349907 454702 292520
10330 292520 298544 372521 -13086 279870 358489 151656 -324448 233317 104872 -1388 81317
10318 347125 -11305 23520 36988 140505 -53801 212703 -290153 76574 83803 173183 249962
10307 249962 89008 605167 -224065 348172 217385 115158 48858 -129345 -65758 150225
10296 98184 239576 6768 -112958 -32317 213164 177515 150260 -360782 -41961 92501 138961
10285 138961 -300106 -14006 418919 77067 -212275 133028 158209 3991 92937 211259 251921
10274 251921 -53957 109648 -311908 -90455 106213 -114044 -106462 -174519 -207756 -180264 -78358
10262 25040 10179 7757 -154031 -267895 -67379 -236801 35930 68448 149915 -135134 -84426
10251 -84426 -69922 190714 -236430 173052 148800 89763 -82006 110764 -19179 -1910 178871
10239 301096 180216 195496 266363 139716 -25618 -177783 -156300 138196 -209744 407343
10228 -27187 -221202 129745 106565 -49086 52405 -6550 129981 30148 -127150 -303219 -3998
10216 -66416 53136 113181 -31740 -472731 20552 -26841 -97116 -269142 3446 -273837 -52265
10204 66068 -210866 36823 -465433 -253431 -436343 -218800 -16374 -148060 68057 -24274
10193 -216497 -105653 122434 402262 86627 166855 203395 -57535 82923 -368230 -39866 -346474
10182 -346474 114231 -114651 198310 190363 316230 -58964 19384 23400 -181558 -125323 4108
10170 -140055 -131662 -53296 -214158 241061 -101314 -224582 254088 248645 -100436 -523971
10160 -523971 147143 16529 -334445 -62559 57341 -165901 -240279 -124972 -161471 171557
10149 -306087 28442 -408036 166374 129746 -379238 -92737 94300 -41895 -166551 -64352 106918
10137 -167436 -108587 160240 192401 -81198 -415504 -237736 -174049 -117327 -358229 33575 -148586
10125 137171 -123828 18323 -220298 -55262 -104668 1710 53348 -83079 66187 -197853 -180361
10114 -180361 -518385 -33386 -118391 -139423 -136747 149404 -80999 -118769 -239077 -97263 107545
10102 -214852 -84899 -209927 -114465 35297 58876 -101611 76638 -102545 11341 11065 -420078
10090 259036 -140428 -7228 -158635 58989 -108410 -69295 25691 -36004 41873 -72141 -48305
10079 -48305 -151293 -120814 -564345 51827 3796 -107319 -28867 -225649 -146014 -159912 -122179
10068 -122179 -129148 145495 -83012 245781 -71056 -324544 -392046 -41481 -151973 -282211 146330
10056 56468 -92619 28665 -83219 -85319 -18256 29809 -28286 -267038 -148855 -9755 -19682 -270940
10044 -270940 55704 17176 93466 65705 177520 -191824 -116363 -124772 13355 66953 -24922
10032 18510 35964 76462 778 170116 -210375 -110840 35880 165912 -93815 -187900 -256079
10021 -256079 -52493 -111444 -146896 -134582 -209961 -150946 -12587 254468 70979 -214327 280212
10009 51962 -110390 313020 -70446 -51521 210730 -167456 108423 189976 -12952 -230548
9999 -230548 -51015 -292712 -50155 2227 18902 -433439 -125076 107233 366268 -308581 11016
9987 -348396 -142747 39054 -232259 186548 403953 67587 -10618 -95983 -152902 -255479 -124733
9975 134680 -167042 -212606 261634 -257644 51939 46294 -267953 99393 -199286 103101 -190301
9963 64856 191144 -3907 2760 83276 -15237 -490112 -252336 110392 -147433 -189790 -247228
9952 -247228 -119071 -123971 -61940 -231034 -178207 -186543 222959 41500 37597 -149282 -62140
9940 213574 -151370 -140014 55297 -145959 -183947 -124791 -25826 -38075 -422244 -286342 -250726
9929 -250726 -145220 198008 -34688 -489803 -17473 -96689 99421 -79917 -78274 34541 72602
9918 72602 270614 -166049 -251222 -291411 -313456 -244710 175574 -224037 -198118 -36485 136415
9906 -128394 -174223 179547 56931 72294 -300139 -195073 50838 85071 38797 -31174 70196
9894 -114519 -175387 -139745 -217163 -122957 5706 -35611 871 1909 -251840 98688 -180143 -229592
9882 -229592 -403666 -200815 -109974 -24158 -90533 38504 204830 -261804 -248125 -404547 148521
9870 -8009 61763 -191441 149 -328990 -44031 -222000 236840 -108265 73800 242816 218534
9859 218534 -214342 168957 37687 -24091 -236575 47086 -202772 -35043 153878 -90772 -207044
9848 -207044 63192 -71036 -279576 -58713 -308428 -219867 -82359 -2782 -193887 -121098 -36547
9836 1516 -251846 -494183 26787 -123324 -169045 58682 76615 50999 -16396 -129357 -160372
9825 -160372 -296039 199584 2273 -368474 3550 137919 -81282 64357 32128 -37902 -210013
9814 -210013 125983 -227310 -112483 -10009 -106432 -125768 -115879 55115 82786 -173592 13027
9802 -53831 -440913 -211871 -18498 -261161 57678 38970 -66030 203911 16783 -3680 28632
9790 -207626 6618 -72477 -65214 36879 -11316 -88712 -170708 -132393 -222489 97016 -256986 -347497
9778 -347497 -391178 -6093 -87167 -337571 -245830 -101330 70956 -100739 -118726 162554 59812
9766 102107 -99186 58764 -90270 72271 -36935 -141983 -91192 -104199 111724 -98846 -85956
9755 -85956 -110878 -216422 70745 210942 -157569 -320697 -89794 -85562 -34725 38371 -251630
9743 -125464 49518 -279473 100107 132635 -109444 44311 68696 76648 -129147 -114193 -74723
9732 -74723 -412401 71134 -276730 -243347 -72844 -152318 -26590 -167848 35612 -191241 283661
9720 -298684 222669 -367463 -260917 -19981 -68046 81572 113981 31738 -175316 67045 -341331
9708 -269558 140361 207271 31725 80448 -71827 65038 -395285 -107657 64174 -161353 -272873
9697 -272873 -24444 -501233 132704 9327 -131968 -57363 -111077 91451 -15202 -370511 -186113
9686 -186113 49867 117394 -251084 -154961 19906 -48728 -100614 -45114 -269283 -227477 -11556
9674 -149922 -3320 245113 -22660 -335112 190922 -224813 7378 39994 7437 -124580 -2119
9662 -25939 -177333 13389 -107870 259909 135028 -195464 -34405 278238 -67000 32527 -39208
9650 -169808 277198 -194920 -305248 -249177 -121682 -267293 -154839 15268 15846 96683 -126772
9638 -165726 -134547 13248 158273 87181 -116966 -403283 -153540 -180047 58485 -480792 -116336
9626 262791 28589 -302246 -366839 -304208 8478 -238381 -207085 -154777 -471799 64742 -279082
9614 -98346 -43229 -198119 -260921 188216 -500161 -276262 -19872 -35533 -353306 68945 -116473
9602 -191272 -216058 69149 -258278 -103365 193615 74791 101133 14021 17472 -8090 -163667
9591 -163667 -159366 -8969 -62320 290414 -73564 -344775 -153825 -368107 -251935 70750 -286926
9579 -34703 -197883 -364296 -54566 -198536 -19301 -41245 -43977 -264136 94387 -34252 212526
9567 -49936 130192 -190984 -171365 -50854 258272 48409 -143227 106298 -75941 268224 28797
9555 38928 -179321 -297052 38526 -244262 86811 -57095 -166941 47274 -303313 -108997 -153281
9544 -153281 67813 -118461 311127 3049 -9647 -177265 53249 -164782 -114325 -296733 236766
9532 -126658 210403 305536 -12601 -158803 -141074 9630 -121275 -21884 17770 -162270 -42663
9520 10487 -1936 -73673 -121995 -179051 60355 -320184 -162367 -60165 -99539 -95703 124760 35926
9507 -90809 -46673 -350621 187648 133335 25072 -26179 229865 -145320 -297483 -48213 -250182
9496 -250182 -251446 134395 -40726 -205272 -53735 -153800 73381 66793 -125737 -194616 -191248
9485 -191248 -14509 -515084 106151 -74167 73121 153654 -77889 -148000 -176016 -97345 -50121
9474 -50121 33525 -169422 -192200 -75251 35850 221916 -201832 -370702 -187950 -54088 144221
9462 -83324 243034 -29522 -165274 -281836 -325855 28074 55071 -221469 -59943 -138644 -258683
9451 -258683 -78857 137296 45343 88788 -50704 94256 -282872 -258243 102519 368232 -114273
9439 123340 -131236 -27350 -327337 -165413 134748 -326139 216723 -84992 -134166 103188
9428 -137578 -487910 -19106 -99973 192477 109339 -65755 231389 -254915 -197675 -151169 -169085
9417 -169085 41534 286118 -218906 -220577 -239632 -124391 80431 -181399 817 -104088 150065
9405 86287 -371101 36027 75023 -14635 25275 -205397 -165077 -1082 6028 -48102 -139162 -380110
9393 -380110 -181813 -472889 91505 148430 -345776 -14997 -261582 -31255 -59302 -393458 -11208
9381 105020 253221 189695 -251413 -90155 -59456 -92915 13348 -399792 -101026 204372 -36922
9369 133522 144128 -448893 -10023 -421122 -142442 -25680 -50482 -109854 -22614 -127527 172735
9357 -337933 -465113 -109258 -232939 -199101 -38654 -128238 -249993 -266712 133786 136588 -83356
9345 -181158 -47025 -36005 197 17118 -9767 -82600 134212 -355213 72004 -41159 -54242 -14406
9332 -76429 -258260 -57244 64226 -105899 130956 19437 -181593 -44787 -182496 -8516 -138655
9321 -138655 -50254 17607 53177 131894 -171016 45011 -215655 21503 -93834 -91993 29117
9309 74001 -72342 -387584 -17320 -21250 -112962 150349 -301148 200662 -194643 -88845 219898
9297 202253 -125585 -193394 -175904 -49289 105038 51183 7223 -15976 -15149 -254678 222965
9285 -20379 49046 -281756 -64170 -140699 14240 -48338 -50041 -117320 92688 -250243 19452 -183363
9272 -329764 -467564 124854 52055 -48330 109250 -161970 121177 -58228 -195640 -120352
9262 -120352 16393 -269061 -260000 45439 -170880 -189890 -136849 -213336 -77495 -149533 -141400 1495
9249 21873 11861 -31091 -162144 -53299 -203357 -22877 -57345 -96553 -42229 266222 90491
9237 -88534 123254 -36744 -297301 59422 -50435 -112272 199053 -98651 38656 70967 -10551
9225 -194424 -267122 -516837 78410 -216507 -106128 -181623 -11795 -99776 370905 -81757 39021
9213 167566 -147017 -194807 -77785 45903 -146493 -140 66946 -111941 -143045 -107481 124093
9201 -298226 -23248 -111960 -64492 128523 -247853 4512 -3915 -101950 -7646 -27589 166221 -34959
9188 -5823 -55568 54768 -269549 996 -154923 -163705 -19865 -151305 -80886 -140124 -221651 -187388
9176 -187388 -286205 94291 23096 23663 98591 -164581 50381 -136890 319623 -30976 -175284
9165 -175284 -220313 123472 -94593 -200152 -179025 -260026 -182384 -144499 -243278 -19291 -49111
9154 -49111 35556 -6222 -195196 -17591 -131741 -162875 -203684 -275928 56554 212729 -48273
9142 147212 -353319 48804 49222 -98838 77073 4227 139371 -289351 65420 28450 -81617 71009
9129 -13313 192527 -132647 -102835 -150667 -19064 -177906 -163367 122236 379393 -278337 76734
9117 -129908 115529 257827 188007 -79265 120161 118485 -203753 -131011 106356 -79320 -66818
9106 -66818 117450 171000 121717 128281 130516 -233172 72453 -143126 -113088 -39359 -147830
9095 -147830 -191504 -137679 63403 -64868 75930 -26410 117389 -96198 -308670 -78975 228174
9083 -66297 -208675 -268015 -52399 44217 -269393 72172 -133436 328658 -294248 -260055 -182458
9072 -182458 104014 47440 -104291 -248543 -228233 -64556 159869 -249901 99205 52229 -52500
9060 -108607 114791 95927 -72694 -361902 328972 -13953 1716 -307087 -128680 54794 -31240
9048 207462 174105 -179531 41156 -17658 62257 305864 129814 -9327 54948 45077 162058
9037 162058 84116 224529 -235677 -72744 -167211 52438 -17377 -190352 -101623 -212397 -75477
9025 -10193 164195 58735 311632 -73016 -43476 -74458 -193928 128109 144581 139160 -158466
9013 307205 242993 66664 4129 -162730 20976 -287885 -211797 -21056 261979 -71819 -10129
9001 -75501 6795 -38180 136521 -191764 48190 -143830 -25691 255351 -269148 57265 -166664
8989 -190185 -147285 -233198 -96627 -137041 -334632 -144177 -63681 32888 -268428 -41767 64043
8977 -227275 -158700 -225951 -111602 34704 53487 26556 -181416 -175922 -15227 -155654 -353563
8966 -353563 -406296 161916 275862 299433 47354 -364493 -51610 138873 227449 9734 -42671
8954 200356 -277473 -42110 -332505 -381251 -264855 -291092 50328 123611 -109786 -46038 -217907
8943 -217907 -224230 -104118 -466160 -205064 -61062 49877 -127172 113636 -334184 -216494
8933 -216494 -93582 -50354 -179091 -121855 -175202 104874 59075 106792 -45670 3886 -45934
8921 -438279 214788 -123663 45031 182760 100630 -266218 -45682 -210032 40882 118679 287905
8910 287905 42916 116985 604215 805158 1212826 2218080 4417807 7373893 3893838
8901 3893838 1956193 937730 442049 356304 313852 311001 -662 27694 -77453 -97927 38030
8889 201669 79589 5260 -61785 189005 -127387 -183350 41622 55693 -104706 -40179 -161477
8878 -161477 220969 51061 -91000 110434 61043 -332145 -247460 220139 -71556 -187766 219626
8866 152084 238725 -203067 -30066 -125350 1929 34070 -165782 252854 -120883 224635 -354208
8854 -96875 84572 -217553 -515667 -168988 -102632 482796 -25738 -208391 40208 96458 94295
8843 94295 -292345 -209682 166828 61016 215657 -266907 244955 -234092 88612 -380506
8832 -308664 -31200 -216344 317336 -198967 -368534 -195279 -226466 -300764 7835 -158958 -131160
8821 -131160 62416 -36903 15579 274642 -107847 -64898 272083 249523 -82490 -605760 -83125
8809 43563 -22212 -7975 120519 40143 -192315 -151052 -25171 -126275 -93981 80949 -249742
8797 158723 -10549 -27623 -70501 99081 94487 -171450 -121561 -77670 15943 -73561 -55331 -4080
8784 24081 -160349 14016 17801 59416 12508 270030 56684 225040 28872 -197636 -343997
8773 -343997 33520 -51586 -111981 252571 -174676 -538311 2513 21218 97322 -184020 194968
8761 -282895 -93612 -53152 -205346 594 94087 169463 24671 -120781 -188560 -34284 -242241
8750 -242241 312318 293938 -455661 -133721 -254969 -117348 -26088 -206177 -27753 -141572
8740 -141572 -104414 -103404 -108264 56135 278309 208616 85539 10675 -102241 -75991 1265 -23691
8727 -154492 -212571 52573 -169394 -89204 204967 -75003 -545354 170586 -82530 -50277 67445
8715 -296560 -26708 -292012 1548 -191661 -188141 114782 -34545 241250 -119086 52644 -13214
8703 148556 -109997 135558 -109722 131817 -6822 -283695 -131859 92896 -172641 154890
8692 71757 -264117 -123007 -59327 -116007 -47036 -218413 -177643 -84047 -2474 52333 -207492
8680 -35431 27436 -96198 -85279 139489 -190431 -57466 63519 -156937 159753 247896 -35559
8668 -182949 -63845 188403 -12887 22062 -255191 -69420 233085 -239074 231179 -62221 -171712
8657 -171712 -15119 134214 65843 128567 116482 -40786 -24009 -105965 138513 -27124 -9748
8645 -103750 150216 156814 201109 400 -258281 -193213 133574 208619 4904 -28594 -142254 135236
8632 -158818 -247495 -349736 -466876 114335 57703 -223797 7306 -108365 -191077 -21320 135054
8620 -438784 145873 29124 263828 -138466 -168577 -71651 36249 191996 279791 -69728 302160
8608 14449 45118 -90029 -130201 16287 20053 8643 -168161 134645 214949 -221095 -229385 -259638
8596 -259638 -104868 130491 -204755 -370860 44403 -364940 -285130 -65106 246406 399 382457
8585 382457 36041 -63590 109064 -87884 85088 -166926 266825 -167985 -355830 -92037 -311247
8574 -311247 -121502 -102053 92905 -360194 -19171 -35919 57226 -153399 221533 -238936 -57343
8562 -265224 55690 -11292 -168923 37291 -20134 -243387 -315452 -239759 -53056 45156 -267966
8550 -66786 -39772 -121372 -92754 -99625 -56522 79631 17167 81340 -9572 -396583 -19363 -55180
8538 -55180 230065 41952 33391 -71938 75173 -205156 138878 -137811 -241248 -17880 -176412
8527 -176412 232569 201039 103903 -53184 237194 163947 8828 -10425 -177143 85468 -198185
8515 -524047 -100847 253055 -448460 -189713 181630 233677 -20298 -240839 -463384 196130
8504 -25851 -326808 121073 -250828 208797 -241682 172598 161944 -110311 -123083 -175156
8494 -175156 -118281 -50350 -62429 -73351 21193 56607 -42644 -167075 -241980 -205684 -28917
8482 238500 -101401 49103 -183535 347354 -191223 -388626 -50305 -345486 -186310 -131108
8472 -131108 -134683 -160964 151306 -21378 -392341 -230299 4316 150446 -318605 -136719 -23184
8460 -100891 -144059 -122132 -99208 -283036 276990 -183948 -126182 110047 -429018 -88096 235012
8448 139382 -18458 25578 31522 -156520 -18119 -216014 -632 344428 -327312 84145 -122404
8436 161587 -184002 111511 -72260 -390321 354747 -362620 -164254 78922 -253003 -17976
8425 -31752 53819 164976 148887 81763 244487 -35204 37092 -136941 74259 77403 7022 -363685
8412 -55962 -289582 122731 -136160 -141335 -8667 -421895 -221929 -59602 -173156 226658 38607
8400 -164708 122030 -229477 -14248 -122887 -34714 -30879 18443 318934 -107389 228964 -145103
8388 22323 -48810 -205097 -25704 -179113 -4052 -197870 400182 66341 -123326 -457 94009
8376 44569 75736 -127519 42646 58185 -35441 8594 20707 168642 31847 -75729 101747
8364 47334 -3302 -264729 -22335 -252265 -164461 -259054 -166086 175719 -107843 2756 -129961
8352 -314567 53015 -64641 363038 -323074 -229806 70038 -14074 -32713 70541 226448 -279091
8340 -27132 -233388 127700 96355 -129755 -51433 -12429 68536 88643 -54543 -126226 202755
8328 -51913 -44038 -38574 -187873 -17215 -163959 148954 32318 -230191 -97790 92041 -49061
8316 -88042 -77171 233056 -223349 -206064 46493 187336 -95842 68329 -244287 -13083 -42452
8305 -42452 7017 214607 -168049 -187929 -246473 132635 128739 120686 -165265 -54453 313802
8293 -136281 -29799 43581 -99698 -48246 12463 88681 -175217 -247359 100412 -258671 266622
8281 -153511 -250086 -184279 19281 146577 225089 -235068 200909 272614 -268129 -161257 -319975
8270 -319975 -197392 -13190 59566 -251240 -80413 -74697 171249 -14501 221193 10455 -224011
8258 -104126 -341442 -20525 56947 -194916 -5085 -125135 -291891 586063 -45235 -75748 -343219
8247 -343219 -11168 -38247 -75303 -279440 219484 209479 95148 80876 -13371 -324785 298475
8235 8035 -270616 -86037 20346 84589 -215767 -250797 -69904 52695 -84723 135659 70753
8224 70753 146576 -31734 -404895 -30233 -78938 -224707 117155 -104997 -76643 -111606 231935
8212 -173843 -42045 -47647 -97481 31514 -280118 57936 267498 126176 -262198 67315 29823
8200 -373683 271089 -38392 -556 80328 -21132 128115 -194595 92372 192610 336312 -6367
8188 175976 124896 -198016 -269768 230361 -198167 40152 154282 -81921 -31938 -161853 67116
8176 176767 45144 200766 -11342 348012 -113144 177913 -326809 188113 -117536 20546
8165 51269 -86351 -329731 -145211 386751 -80201 235949 -31055 -154514 -309146 -244196 -87946
8153 -114309 -41044 17269 -9955 -92469 29654 -137417 -119368 51095 -228825 -23137 -229180
8142 -229180 -42176 -2790 -43139 -107872 -152947 6125 -136127 -130536 -193334 -200790 32294 53948
8130 53948 -148886 -233555 41386 41526 79695 -56205 27810 -198459 208867 42995 -161765
8118 105713 52371 134178 -127756 240177 -98921 153792 -425661 111266 -30560 -117988 -24780
8106 240546 -140305 -274726 -64080 -260851 31486 91836 -119139 -232912 20606 -180176
8095 42823 -100616 -124511 -104391 192916 393292 50427 -183523 -291229 237 211003 -308992
8083 -190664 198844 16408 -328162 -97261 -165073 13555 257750 -316655 82545 -283126 -15007
8071 -126779 -82062 -227330 80355 -218799 -148854 123875 -13910 -51403 -97078 -97949 -264739
8060 -264739 199397 195742 -144707 -18206 -229711 -175860 -27731 -25921 -77973 -76094 70891 115275
8048 115275 17163 5620 -321030 -51556 100031 8067 -420646 -199000 -170019 -121921 99730
8036 151219 167330 -386919 -150649 81096 -61405 -103037 25898 73222 130367 -251807 -33033
8024 -164544 243593 -229187 -82480 -77544 -54448 115608 -72279 -71012 -150163 17341 -355699
8012 363544 -220939 -38883 273681 57248 61222 276008 25595 -26064 -13476 517205 77946
8000 -199890 37038 -117367 -159996 188103 168727 -209967 297337 -59509 133174 -208640
7989 195007 14341 -144403 -232031 -113698 -1316 -169989 178927 -211948 110944 36676 95181
7978 95181 -48866 -294246 136619 97490 -13348 -275309 -37620 -76140 -33242 -181091 62099
7966 -252491 376328 -331101 158322 -320659 -72169 -157097 -111851 112450 299762 -229033
7955 -262863 -253085 20547 -46373 138573 -397892 -191403 -6045 245803 -76753 -296063 -138969
7943 417555 -95201 72820 -114125 -118666 74082 -25960 16051 106421 41287 -9087 132654 8798
7930 -50658 -79667 38312 -78618 -115709 -275343 100279 -262529 -57235 -76296 -206664 117063
7918 -7283 73674 -98114 -242618 -11773 -129028 -6447 55094 -344717 -221704 -110048 195421
7906 134984 -214365 -15475 -142501 154189 196524 -63314 36755 -147343 -18010 -116385 251443
7894 -57063 79352 226638 2182 -41874 -29871 121975 117957 101748 393412 -201066 -259883
7883 -259883 197399 70198 -99910 -51687 -271747 -190430 -241670 -18626 -148342 73088 -148009
7871 68922 -240993 -25804 -224029 55258 -189111 -34843 -202580 30685 -110976 179374 -48253
7859 -146994 -165854 -396169 20087 -115075 291838 -193274 164679 110553 155943 -120264
7848 -54087 40990 -103903 -63617 -110965 36618 -87718 -192367 -266725 -252024 -74389 -283618
7837 -283618 17637 140195 -72798 -224980 106648 163672 -86198 915 33667 31916 -165448
7825 -401506 209397 70939 160775 155122 21526 -65519 -194070 -82245 131923 445358 -91373
7813 51112 -52371 97982 -464331 260168 -188623 -45425 -71192 -63589 130382 81195 238448
7802 238448 92780 -54479 -57032 39692 143789 -22588 56812 -78489 49536 -25609 -86198 -17501
7789 -74353 -118794 201513 82504 -189417 91942 -15420 -228072 -170589 78101 -2746 -33806
7778 -33806 37173 -7016 -171005 -135984 -102358 -101340 -258321 152243 88054 128877 -298703
7766 -11650 -250016 -156513 -73792 -42104 -131237 72436 33531 304059 -174246 65741 -299185
7754 -291612 -23276 201500 -127193 -29862 -412599 -41242 137373 -56020 52200 -160061 -163054
7743 -163054 238604 -228581 98948 53068 -211755 -193557 -1464 -69904 66515 -91550 391846
7731 -126883 -264903 200815 232185 204857 225994 -317424 143819 -315821 6610 -21582 -1546
7719 -380602 373608 -70131 -182227 -150794 -28396 199429 -48680 -64484 17511 142646 -98079
7707 -284422 -243183 -417060 108285 123494 231057 38089 -144431 -17185 119635 62442 57620
7696 57620 -181365 -36041 27020 -134797 125429 31886 16963 -76319 -97339 1158 -87905
7684 173527 191176 101124 19152 -114184 76258 221785 -222301 -100787 53693 184368 100479
7673 100479 -166529 -129315 98316 -126221 49214 -143157 43776 68375 93905 -349271 -72172
7661 -110780 -27936 129005 223692 -42720 -176548 -185859 362194 18972 -57084 -14163 -162240
7650 -162240 85169 38876 -970 -2354 144127 -131307 -61936 -302226 -188562 13236 -38095
7638 -5209 48941 6590 313671 -252880 -184507 279818 196543 6612 186034 328413 -164340
7626 7855 68354 2693 -89601 80281 -174916 19564 33899 253150 -22446 34960 -143594 -86442
7614 -86442 -11606 23947 -238821 199039 -212972 -257151 117887 30086 152235 -56704 -120495
7603 -120495 204856 -29671 -236464 -8108 1220 142285 -93730 -348144 -198931 101248 -193156
7591 -184227 185889 -65921 -389374 -35928 111708 -190415 140827 103803 -394134 -88180
7580 -220482 -120989 -26646 -157714 -71332 -310613 -67435 215688 338869 246439 -218477 -160181
7569 -160181 -88636 -68039 -273157 -119581 -117021 -84548 -50251 96278 -56853 50802 -325868
7557 -290617 -113982 -275590 -206871 -50867 167060 -204310 19474 120900 49853 -249567
7546 -240012 -461372 27848 16917 61631 -30359 -552511 -235191 -368740 -149765 127507
7535 -68423 11860 -66642 177767 -48425 -150343 70623 -80913 234074 -104646 328923 -266861
7523 218636 70543 -21584 -150398 -115435 -55116 -131311 5158 -125260 -14208 -128372 122098
7511 263629 68811 199951 66421 -85965 178843 185944 -172269 325391 -412470 240014 -122583
7499 -15776 -142983 -274953 -148037 95423 -54018 9439 171348 -129755 105406 384541 34358
7487 -131118 166570 199053 -211526 -127800 -63428 105961 -57389 137545 127564 42420 -34344
7475 -182766 214090 117042 -28775 -22107 5663 -114614 57793 104874 -175424 -285500 -208505
7464 -208505 -21405 135875 23335 7780 132275 152884 -139480 91536 -78496 252639 -103312
7452 251472 -127947 -47071 -161442 -30581 66285 166083 181166 413200 -12605 -284819 -57667
7440 202542 -103434 70501 -192969 -36953 -413051 -179694 -190163 438732 430454 7680 63282
7429 63282 -117709 146264 -153662 104860 4248 1392 -31543 4895 180651 -75981 -84479 -143843
7417 -143843 283124 -18476 134155 -22011 -231690 -240333 238876 -218894 -258548 -139339 160271
7405 19116 -172990 67233 82752 -128364 -155673 -52683 49092 -212319 -72499 5641 -181642
7393 -368255 189750 -108741 4906 -138166 -57208 -67118 -36460 2371 -197946 6149 -51682 31891
7380 286750 112298 238813 129654 -33528 106847 -141939 30327 -60341 -104350 -29476 236633
7368 27581 65376 180948 211108 -6517 -175441 44962 245499 -653 113800 96228 287450
7357 287450 -41555 -383424 4688 -180935 -163701 -76481 -150149 75578 -309891 136430 41380
7345 -122921 77325 -7874 -23072 165705 -218519 116030 -72841 39227 514384 -109644 10777
7333 79584 101464 -194753 -22101 -187342 -37448 137609 9627 -272142 120354 199594 218241
7322 218241 -266864 213593 64210 196410 -252780 -276016 -143989 93315 -154376 92905
7311 45821 112467 81093 -394812 -247479 -272466 -82434 -219535 -147529 -60338 -1900 -8856 -113489
7299 -113489 9161 -175874 106746 -142743 213964 -138870 -108248 149584 -60704 -16629 -119599
7288 -119599 -360535 24571 82169 -18099 -313999 -307975 301730 -256389 171281 -67406 119934
7276 204012 -48215 129558 9827 -105946 -69930 -20548 -89178 195471 -75721 -367683 110952
7264 220543 81723 -152395 -15509 67959 203315 34065 -85325 -156441 -4852 -49978 275411
7252 -36014 -221729 -99970 15079 128049 109379 48124 -115907 -22056 174871 47505 135114
7241 135114 4793 -52685 7077 -149764 5918 -81485 27676 -262951 -146046 -52929 -77902 -109455
7229 -109455 -203174 -119504 -32006 265567 -6208 -220161 -240572 231499 290091 88562 331498
7218 331498 -140089 46663 -70165 -181164 -29491 -31955 -358208 -41743 23549 380217 -391276
7206 -217141 -134981 -391471 220871 88965 1205 -41795 -234825 -57702 73583 -37081 -121712
7195 -121712 -325888 -50290 -185097 -160597 -182647 184483 249605 286803 -281919 -107715 -199900
7184 -199900 636 12166 162038 113080 -120862 -105035 93934 17723 -199316 -10233 4529 92799
7172 92799 25144 15841 -359507 -214223 248263 94203 12440 -756 -309478 -195756 217567
7160 -190497 -281233 -141840 -152348 -278285 -14855 -51859 103113 -186980 -206778 55483 123639
7149 123639 118955 -256911 62936 93519 -38317 186721 -289566 163435 -141342 -33766 105749
7137 30866 -243289 182909 114907 -205647 81501 -219775 -110794 177429 -43571 -164442
7127 -164442 -215779 -183565 130977 -71806 -233075 255064 -140452 158117 -6987 122134 8223
7115 24195 59997 97869 -69107 138269 7207 98142 30801 13994 -169511 -297456 -123604
7103 -250374 -58775 -62841 -9541 205297 -57287 335375 31145 65306 182676 -193292 11945
7091 -84662 40841 404156 53287 -298876 -130352 310938 -245278 -75490 -166548 -6347 -194168
7080 -194168 113276 2954 44325 -94437 -102085 33287 -237586 130160 367315 389722 -143703
7068 -253849 -189364 -54844 187213 189979 -40486 238106 -204794 318240 37447 -65471 -123154
7057 -123154 196574 8534 -4430 -83793 -22013 74616 -159734 -62266 -237294 118859 -155984
7045 -128097 15377 119475 -60537 116649 -245528 16175 -67165 268092 -278020 -11982 -191761
7034 -191761 -2709 -46963 -158997 -7658 186962 -56396 75966 53953 -63702 26355 99401 105172
7022 105172 -170079 109839 -21204 -168533 -123902 -33067 -116430 173621 111452 -10942 199879
7010 5435 -95924 34522 -131738 166520 -205798 -201983 182362 6589 -144247 -262552 46873
6998 171693 -5932 170566 -69640 16697 405881 -99121 -187074 -77530 -37360 87397 29146
6986 -234869 21895 -6970 -41719 -364319 22233 -16776 -79572 -35881 92950 -48067 -56210 312041
6973 237010 53549 36150 -93256 -66227 -156532 79602 17531 -128779 227449 25264 -204948
6961 235717 6759 34136 -142189 -62817 -65295 -41758 112296 105097 62724 404560 -181128
6949 245976 -166944 -112409 -472625 -276979 26484 -333681 54589 64686 244459 -160606
6938 -133271 89096 -82666 269387 53523 -12912 36317 29780 -80370 242485 1118 68626 206322
6926 206322 -91668 -161453 200785 3196 1883 -44553 33346 -234718 -374215 2674 -101803
6914 217335 38296 12779 41884 102897 78543 -123118 21038 -367814 368768 35868 23249
6903 23249 79732 19939 197821 112731 82537 164864 154121 -80403 224288 -267285 -54665
6891 23338 249883 5454 292082 82704 235781 -53556 -542 309099 257170 278183 -144208
6879 198291 -184069 -2418 60621 -140945 -5537 127374 -347859 -95684 -105852 -69647 -392043
6868 -392043 -98534 -74615 284404 -117949 -65686 -54322 -484633 -67080 -53416 -32349 -220802
6857 -220802 -1054 -21868 229860 -54969 6057 15292 49003 -11856 -141157 -30886 474402 204245
6844 -153651 -103005 148520 65910 -72831 -195376 -260495 247060 197720 -63753 -20825 92389
6832 -166105 -226050 20717 -242652 -77476 134999 46741 -32815 197260 -227753 38247 -147135
6820 18202 106428 -66684 219560 -11500 -103611 9394 -49475 -208908 -138551 294719 85156
6808 -205123 -36179 282412 -111801 133237 -150006 -16098 -80134 155312 158422 -483819 -414704
6797 -414704 253789 40778 -86579 -31250 -202333 77178 -126219 -116093 -253903 -149519 33021
6785 -120141 -102772 137680 -101148 143821 46867 316553 94613 -33502 -112665 -191858 -340578
6774 -340578 -112940 -3537 106628 -46243 236781 111382 48077 -279639 -20739 37545 50432
6763 50432 -385752 64862 -112311 -290240 -24350 105141 -54289 -66112 -162663 236736 -127796
6751 -375421 168579 323132 63226 -17522 -2731 -25034 -54001 130775 113511 1487 -109673
6739 187872 -389097 198106 -55345 -162442 51558 -75321 435 26879 34076 -215274 196341
6727 -221190 -305939 -28121 -120666 -257839 -33041 -285140 -101227 -35421 -100400 -81440 480943
6715 124548 230261 53481 27704 -269944 -164490 330663 -147002 -167421 -263400 -118293
6704 154467 240204 264092 33284 -30315 -354830 307892 -278711 317191 110904 -52069 32785
6692 -44512 103458 -240441 189536 175892 152729 35065 178123 -56798 425307 -213104 251574
6680 -64935 -337738 222405 -59496 171399 281803 -106556 -112971 47150 75484 353207 -117676
6668 -177258 70292 8490 30039 -153541 -320654 -321214 69465 107392 -164478 237547 -61056
6656 -231249 -184291 -132793 242157 60124 162395 -40009 -11581 127203 -19921 14805 -141557
6644 -100112 -41457 -125399 236372 114572 -15361 -235269 -184040 -404476 -205175 -63877 -162677
6633 -162677 88450 -147199 -132127 -41013 -245132 -317016 5160 49426 66663 269918 146942
6622 146942 114348 160499 38524 31607 245467 189989 -326391 28324 56359 -156003 41144
6610 -87767 -31140 186055 -131102 79238 378056 -260698 74404 301232 -25611 -89550 8646
6598 154654 135513 397415 -110648 -7346 354650 -89639 -100688 -28713 -109958 139826 -161388
6586 -15287 -115758 41295 -26819 -187823 58993 399940 416704 206905 -174308 -25650 -387141
6575 -387141 -33404 34214 -126327 247488 -237969 23242 160995 -151329 -228123 -68035 -157420
6564 -157420 -253871 -134006 315774 -171077 -84789 37809 -218324 255496 -201186 124444
6553 3165 419189 -7537 -480977 31332 -88672 -232247 -92683 -112020 176818 21429 254248
6542 254248 183681 -325463 -167720 -114409 80846 36077 -55503 -88825 4818 82996 -277767
6530 36372 -245992 -40340 -19964 91061 -133786 119792 164200 13993 -12197 -168489 394308
6518 -250233 -82342 -68894 -79906 70627 148659 223204 285669 -23456 268369 243921 -33601
6506 126213 94209 81329 55771 291816 -32520 -114785 -117985 -161449 -24256 59014 -21519 -37355
6494 -37355 342138 -169873 -67076 137514 96059 329146 166555 -77079 -76016 135088 -288849
6482 117967 98445 -53382 -16046 193103 258650 -372754 49897 -130976 -317529 -195803 -6590
6470 302066 10309 -68480 -182541 -12525 -3921 -39713 -156827 -238861 64435 365592 3037
6458 159459 -40865 -64814 -107436 -206134 21576 147605 -40685 76711 -76832 -46853 -52606 140672
6445 -10993 -10213 162557 27833 -141374 -206697 -51683 -182285 -404654 -218857 57291 142938
6434 142938 146891 -130583 224063 21899 -61425 81974 -184212 104873 -67112 -238413 -178370
6423 -178370 -323936 98888 -133724 -98196 -219000 -154217 126551 187514 -273547 147189
6412 146578 -116907 175848 116289 366532 -9501 -148217 109037 140265 -96220 -350 19412
6400 56026 327128 -248091 170237 -326622 99003 86449 -245049 -162920 -11974 33672 112927
6389 112927 -206977 -65012 -234901 80519 -26760 42192 64407 -81312 -57255 -262071 -102046
6377 214188 -36790 169511 -78286 -121445 -181963 -81557 -73498 -213090 -187550 67785 -174472
6365 51118 64044 -7940 226018 -194828 70101 178164 282627 61856 246360 -284955 252033
6353 -270539 20721 -40588 -81840 170993 170015 -130328 88748 -102752 -167664 -37780 5231 -19097
6340 -219712 -151929 223539 -22668 189151 4476 -113748 45325 -120342 121014 -285309 24014
6328 -20972 -68839 55934 -53581 -105498 -193607 5445 -104778 -539255 -118653 5287 -244764
6316 56142 83788 -40140 147138 -165146 -37397 324182 -287365 -128857 -60425 101675 109595
6305 109595 154692 -16160 79387 -123655 -2683 257212 45595 185470 222818 154689 -139504
6293 -109776 13205 188431 24607 -38973 156680 -227730 143091 42498 73001 16843 132371
6282 132371 -67013 124392 236406 115195 132400 111543 82545 16886 306358 -107434 197066
6270 178810 -34117 23880 -95491 -240526 196589 188567 -21494 107473 -6059 -317283 -307956
6259 -307956 -117508 -29145 16668 20211 -62748 78688 13582 155468 -56142 21165 -173208
6247 -527 318435 104211 -263694 -149736 -176446 73580 426742 -98430 -132939 -553208 220363
6235 462832 101741 38249 184280 38660 164672 -33401 107107 2757 248254 63581 17969
6223 295766 121008 -256865 -92125 -279887 -39432 -8245 -181696 89875 52005 211440 225667
6212 225667 -57070 -132215 -143078 182574 234218 -92220 214082 39926 -9492 -294596 -6763
6200 -97654 -74988 93506 -214127 -56907 155873 -143377 -157811 -92531 -25114 152933 -321369
6188 73957 89937 185851 -5436 375714 -440 -119796 -80344 147061 -105978 72887 59897 43109
6176 43109 237969 383152 -185216 -142358 -92009 69082 160658 114771 105834 -340149 -189399
6165 -189399 -90050 1756 29164 92060 151714 158204 226260 -360865 -273218 122506 -42836 -172292
6153 -172292 148920 -161283 271833 -39931 -38682 79980 23667 82033 55370 -7490 49860
6141 -166988 185564 -232847 -821 -7963 288930 56530 -70225 -129007 133058 329209 153016
6129 -171266 10691 31450 256271 -78222 103146 -270705 52565 -26373 306967 287863 -137334
6117 -311924 -310782 106513 -189720 -93896 -155321 -154859 288005 -174039 -266646 -51024 -345587
6106 -345587 143265 -126949 182079 -18953 -196053 196474 40497 -153964 -172473 -61600
6095 -192096 199613 435201 27937 146216 136637 -289016 -328166 78366 -18625 -65618 553011
6083 -150606 115939 -21842 -116597 93053 -54025 -307637 349207 -213235 -222360 -118458 -55716
6071 29402 -473063 58340 232836 -112058 -254369 -155649 -150570 295629 135938 -27031 -169278
6060 -169278 -9218 -157475 50483 -27753 -95525 229980 114232 -345230 88638 -121194 -169467
6049 -169467 372854 105321 -154652 -190475 -309151 -140020 -21602 -187357 215961 71817
6038 -23206 19417 378455 144591 -237178 188410 -80658 -4759 -342849 314925 -31318 40718
6026 -226607 418723 104427 392902 146967 50042 31689 114082 -97392 -177564 56147 -355834
6014 -164366 -61174 -44754 -50992 106937 23057 13925 142608 -59884 -54426 41521 437742 -84152
6001 -115816 36366 -260378 48445 245724 -104690 -30179 169672 123770 17126 -34633 -12574
5989 -197106 49089 -226552 50962 -127513 133696 90496 -192009 -24606 -2894 140445 -148665
5977 -113501 -32288 12545 -225611 -27320 2220 -252282 33280 -6345 293897 -94660 -7880 28416
5964 -138885 125323 93783 -285597 55657 -20769 -25869 -179620 298235 180944 318871 154301
5952 -173091 -118383 140145 163549 192323 -37937 -278563 -209324 -24031 118832 -12868 12500
5940 50493 226790 109212 77457 -328972 101020 239307 -159835 4378 126436 184519 -129624
5928 6544 -115387 -66018 127929 -149643 2540 230790 -1857 51152 -208041 155699 121375
5917 121375 168028 71712 299619 79825 -174953 246885 -65724 84790 -158901 -202598 -101108
5905 -230595 60478 -250411 205734 -4592 63087 183857 -41098 -100352 -96617 191854 -50758
5893 -30304 67020 205084 63646 141562 153273 -30811 92165 -205112 -39126 -118494 -231594
5882 -231594 33976 220814 59596 5760 77443 -20982 145505 -79981 69059 116272 351901
5871 351901 -93035 -125633 -191487 101666 -189582 -13278 30419 -147286 -70203 156693 -284718
5859 -84609 37892 124592 48592 -47414 -52147 -905 211504 -163335 -340303 59003 84908 166548
5847 166548 -39312 201520 165356 248153 125457 -48475 90978 297667 259318 245311 110833
5835 -176437 -2648 207575 116791 27607 263237 78964 89411 24383 64313 -445248 81797
5823 -319248 317695 268028 -24321 156435 -72622 -37994 205907 -42988 -20743 119901 281898
5812 281898 156557 354769 137897 -207613 -146967 -165761 -224158 -47938 53933 66799 151205
5801 151205 121159 35129 120148 -114603 -178299 -187307 243225 -9278 -12004 -184776 -57514 -56139
5789 -56139 90940 -97987 70513 256047 -218392 -109828 -134460 -139743 -126864 -33005 -17236
5778 -17236 -834 -86015 90726 -126480 261911 -117315 123811 -137979 -11251 -11374 80720 110300
5766 110300 -75107 203724 -544 89025 91232 -182723 -210705 -254386 -126218 -44712 -322632
5755 -322632 -59688 -211688 74078 -90643 98120 274086 87704 84404 -93856 11658 200149
5744 200149 -154404 -129568 116957 -141234 -252228 -121866 -60343 -81002 -35663 201917
5733 84049 13895 272521 46671 23578 -81184 142610 150838 27535 -132350 22472 -239807
5721 34368 -165868 -21138 127420 -579 97390 104865 82310 -126253 228450 -153702 22351
5709 8540 55588 161487 -117370 176677 -234996 -10835 157754 149430 -57809 5815 42525
5698 42525 -137435 -270067 18005 188887 214489 70923 198264 152382 192489 102707 -144978
5686 -212212 20836 29833 -276557 -110530 150924 20850 84536 -274990 -2578 -199436 -411166
5675 -411166 -132882 68458 138166 180746 55799 245560 -44179 253754 24858 83374 -204750
5663 82101 53110 -57654 64423 106458 100484 -125045 132300 -305635 -148936 159119 -174878
5651 214036 -48411 100069 23917 326224 122153 508965 -13762 148499 248732 106263
5640 -38783 41905 -213609 178300 238431 201081 -71332 130928 110940 -123964 -232283 -58017
5628 347355 -75696 -52132 225717 6735 170692 158471 62650 -94359 75192 -386019 -85259
5616 -197913 -99748 -35106 -54086 77872 133211 9731 143463 77744 115832 382845 90204
5604 186919 -132125 227086 -16708 -291281 -53083 -260554 114885 178618 98046 87720 109217
5593 109217 -24514 -193316 -42288 166051 10866 55262 187938 -61226 92699 -32325 124777
5581 -193454 -329786 3728 37845 -145940 152846 104028 2419 -73208 -158301 -7122 -76102 -178618
5569 -178618 70176 243436 -84512 307965 -355875 325059 -204876 -376626 -241190 -219826
5559 -219826 -165216 -143987 -38064 -175417 -192882 -263136 48863 -112067 -42107 -213201 106610
5547 141601 34195 197000 89843 56852 76595 170725 140720 -59325 -170222 11106 276253
5536 276253 109101 19502 179348 -340392 112678 -111353 -21751 -156536 -284340 -419157
5526 -419157 -54879 26679 310878 3055 124708 140807 46772 -52393 205858 30443 -118212
5514 91111 -104361 -13993 1701 -182906 106301 214288 39617 -291275 -112033 -207198 -142635
5503 -142635 357492 205189 -333050 152388 37649 293649 -366998 84236 -191536 358416
5492 189835 322485 -115085 197029 177001 -140335 -117350 -249055 89205 143151 -93004 -415802
5481 -415802 -42571 -161770 -125994 -102467 113129 119850 -238036 54222 -268136 -10792 -58765
5470 -58765 -43906 5775 291253 -140762 -112277 -30273 223932 -318753 -195507 356908 154281
5458 -21699 98531 -83580 -132899 54346 -143090 7891 -56663 -33861 -160554 205461 -10232
5446 -198173 100796 -21592 118667 206664 -169227 9723 94324 -39029 -992 -186515 -226688
5435 -226688 144087 104340 29059 68335 -7507 245760 -74328 93789 -30244 30444 -155178
5423 -208471 135099 -213955 82714 5984 -289240 132182 -51961 -104808 -45709 -112723 -80382
5412 -80382 -161853 -141437 -213908 -284568 428273 460086 -229937 101398 180965 -134322 -26453
5400 129519 184240 -316955 -186859 -157282 100634 -55509 19153 -2265 -228060 -181541 -4442
5388 -133014 185292 413820 -154925 351829 154879 260266 -16608 -179168 -219977 23374
5377 -325122 152030 1380 72767 -154036 -24067 22789 170499 -62468 6853 262627 129923
5365 86018 -68739 51750 86613 -144254 64991 -79762 90107 -36357 389577 -46487 -154159
5354 -154159 339658 -28411 13588 -27099 -73152 102898 141873 -878 137225 -9788 -135094
5343 -135094 -125118 145466 -13261 -49251 -146505 78660 -37965 -11073 78305 -253130 191156
5331 206137 89580 -93846 62212 7233 -94932 225946 -142548 71608 -88683 66848 449117
5320 449117 101084 -9908 -116637 89824 200686 -89574 16894 -29016 18020 24740 315 -173648
5307 -40121 217231 209986 63808 275359 -58919 384706 202847 381 71418 -207116 -42815
5295 -176451 -45283 240043 145877 147221 -177467 -460890 -874 -107068 -131422 13150 148523
5284 148523 232803 182703 98683 -255428 209153 14061 11776 -146233 5534 57672 95833
5273 95833 160918 172819 -104940 47643 125063 -65974 203293 58783 93440 24033 149783
5262 149783 -113385 -9884 115507 65774 -64511 147456 -1082 207722 -300451 22560 -5900
5250 -65500 58369 -274211 43795 -117332 -73644 9237 -114406 -68302 196804 109866 -240052
5238 -353360 240822 -156964 79534 -7799 -33822 -211882 -34618 -230517 -172758 166525 6578
5226 65525 171835 -47024 213063 15136 -49496 222083 91128 39921 -97730 -314133 -203901
5215 -203901 -148616 -177333 -6 67561 -23310 -172383 196521 347977 -99428 -22999 -47345 3691
5202 -118228 205038 -328442 94973 -223074 -16103 -17797 -20826 56115 5901 326779 -127176
5190 69418 -128770 -178106 154337 -18514 -200619 -64733 236499 -132877 -137950 295704 -38866
5178 -213014 6041 -134909 80637 -82336 -208827 -68807 336228 -77948 -166794 166496 106971
5167 106971 435980 207049 -121605 39475 254383 -19028 -85279 129471 -147675 -80065
5157 -80065 26961 -71931 -292812 104313 172637 -128377 -188277 106445 122101 -112397 -146636
5146 -146636 -89979 170793 -287481 238473 -84371 279129 63924 301444 37080 -78650 154638
5134 143724 -168227 281764 -263847 224711 -222006 -36533 89797 51117 258271 -99804
5123 -54911 -357846 217707 -303504 -55890 -22536 -52701 -309967 46788 -66626 -107233 18588
5111 -18055 49110 -163090 -42413 -100277 -88183 58372 -77110 75562 135954 -375832 -26703
5099 -213998 -8365 79875 172140 -147572 71701 -12868 -67883 -135116 174637 183994 -324581
5087 354060 -40066 254246 -115281 45850 116054 31820 28549 -220028 -219006 -34325 139724
5075 232813 -4361 -108943 145607 -13629 -127130 -8030 -184490 240277 23247 1739 37184
5064 37184 -150302 -88759 51554 -156766 46132 -94255 -237500 120785 143883 107889 -387336
5052 -89359 -254019 101611 212157 -61930 96344 -121602 -31461 386988 47666 -187097 -130164
5041 -130164 92999 73791 -60025 225156 -31543 59194 33370 129732 -120332 -192077 27918
5029 -121557 -82888 65156 -101282 152562 256553 -301164 105865 69133 178803 -43130
5018 315126 -201970 69657 209783 229936 117563 -307257 17148 167379 -39707 274810
5007 7409 324829 99525 82257 250752 -44040 87520 -28514 102946 -137742 12112 185971
4996 185971 14521 121280 -119454 166609 39330 -263339 -39888 -439815 -47169 517797
4985 -276847 190813 -192919 8888 -255340 -395047 -41600 126541 -89285 -162933 150832 -35205
4973 -192247 -20312 153364 24863 -123636 160144 110049 -106770 46012 -111209 78076 13882
4961 247116 -111974 -82670 -83000 -87669 -250550 385478 147340 242637 243305 -114652 -151725 -58319
4948 254859 -106302 147974 -32621 14079 -382717 -205113 44243 -89857 -127741 -65044 -37775
4937 -37775 172390 -369982 -6627 138569 -503117 260773 7916 196203 231348 -171380 -49046
4925 64416 -32199 87430 -86639 -68033 147476 47978 -30500 43591 193965 11611 -240364
4913 53438 171553 91633 137476 52996 146508 197608 -234558 176346 130807 11095 -16767
4901 -83834 98896 251460 99774 -116085 153461 189177 119929 261796 40547 230963 101083
4889 170881 -189791 -13503 -200904 330097 -18331 357282 -162568 33888 -147658 161731
4878 -53482 -198970 245895 72119 -47613 -128157 206405 -76234 -87285 -174412 -152186 -95681
4867 -95681 -16906 -212000 -27423 166582 -108988 55446 -144952 58731 256639 206120 -138246
4855 42573 -300539 105484 186766 -98927 -279256 184300 329593 -136847 8798 213805 -158465
4843 150477 23899 -37586 279803 82264 -263526 86999 -57744 -60057 199482 96754 -167566
4831 255777 62264 155102 242424 -196278 78365 -42856 314571 -143363 -131626 297830 75649
4819 -41309 -75078 -220851 426468 68540 118642 127061 44312 -213908 -22638 56757 222719
4808 222719 -52840 -290244 -9094 -41311 176241 393561 -191431 219285 434137 6597 -83312
4796 122413 -143650 -145557 135890 -94247 157983 -4413 56685 -133161 71344 -58980 49507
4784 100435 -7168 59371 -153603 27723 -170514 7687 275545 -105897 -7279 -15274 -151666
4773 -151666 119434 227027 217529 139427 -24150 91000 -146178 201421 74947 62864 -5686
4761 -73546 34994 208713 103420 209796 212064 303592 116273 231435 25253 -60585 61947
4749 210521 -103221 -56941 310833 -85054 28471 80960 -154134 -130851 -6273 122322 108085
4738 108085 3615 26446 168804 215534 35774 -58536 -227856 -86051 36210 103967 22566
4726 -135300 -21874 -28855 -172144 -157653 277095 294166 -39867 -63874 -355419 -183270 -46296
4714 -129413 -37773 -138436 -146721 -161177 90499 -94065 -45368 -16687 107783 183745 -250907
4702 64880 -38581 -6798 118135 -33767 343932 -231801 -203825 -19028 112454 117910 -170923
4690 196865 -77963 -117394 84027 -169525 -50275 -118593 186773 -75265 229546 -10303 105995
4678 -155452 -28373 115751 20303 21512 -217306 401026 166137 -16619 -144653 162735 -144267
4666 114819 -260377 39609 89990 -204636 188424 81084 17799 -257595 5239 169348 41511
4654 50057 93134 -47497 204681 88089 -20932 366830 59787 -10293 -224208 -91252 93182
4642 -95530 140429 30981 -177463 92675 42323 -194585 -43366 -144209 562460 142876 -34711
4630 85455 140876 -117430 70468 -130923 178633 51985 123888 -7008 105445 -270385 -211308
4619 -211308 306169 -203903 68235 -88237 -214386 -109718 -116712 285894 -106493 -135449 -171919
4608 -171919 136749 65807 -115967 141769 -187938 389388 -71343 -15404 246094 195830
4598 195830 -140989 -152916 164627 68642 -129384 191706 358656 -63023 170288 80593
4587 -365603 204665 -64613 20210 221119 61579 -375731 -8376 -292592 15341 -53926 -256894
4576 -256894 -10502 -83143 68039 -68878 -3999 -93506 -60951 28867 -13154 52297 97596 30707
4563 147570 139462 -5242 -42959 105416 289034 -200593 227356 101292 7197 -26934 -142800
4552 -142800 -223095 -71867 -66823 24969 174514 -14190 38725 -247455 180618 92759 427524
4541 427524 130336 135521 19218 83891 116945 77702 -175627 -196513 44179 193630 176367
4530 176367 183443 -112439 -72268 -121651 -202010 -293531 389462 -95159 -186750 -140918 49080
4518 -85900 143074 129411 -63640 282958 -116011 -46456 114136 -26459 60877 123561 -82906
4506 110287 -112226 -59714 93769 323895 -169374 145869 244148 -299089 -30785 -97124 151435
4494 -220218 -245597 111343 -717460 -54232 -191216 103273 -5040 -5652 -126777 377316 285343
4483 285343 -183983 -244247 -112724 202808 -31319 3159 65079 567970 139891 -175615 59939
4471 227188 370794 12562 117747 67633 -224427 41262 93425 288259 88467 21239 204453
$$ [...]
##END NTUPLES=NMR SPECTRUM
##END=
