
##TITLE=AC1175_Popayan-timbio-cauca-CTiAH12017_5898312_MqStoMD3g8
##JCAMPDX= 6.0         $$ Bruker NMR JCAMP-DX V2.0
##DATA TYPE= NMR SPECTRUM
##DATA CLASS= NTUPLES
##ORIGIN= BRUKER
##OWNER= Administrator
$$ 1.72 TOPSPIN		Version 2.1
$$ 2012-04-10 10:40:30.203 -0500  Administrator@TOPSPIN
$$ Compression mode = diff/dup
##.OBSERVE FREQUENCY= 400.13188235
##.OBSERVE NUCLEUS= ^1H
##.ACQUISITION MODE= SIMULTANEOUS (DQD)
##.ACQUISITION SCHEME= undefined
##.AVERAGES= 64
##.DIGITISER RES= 22
##SPECTROMETER/DATA SYSTEM= spect
##.PULSE SEQUENCE= noesygpps1d.comp
##.SOLVENT NAME= COFFEE_meoh
##.SHIFT REFERENCE= INTERNAL, COFFEE_meoh, 1, 14.96825
##AUDIT TRAIL= $$ (NUMBER, WHEN, WHO, WHERE, PROCESS, VERSION, WHAT)
$$ ##TITLE= Audit trail, TOPSPIN		Version 2.1
$$ ##JCAMPDX= 5.01
$$ ##ORIGIN= Bruker BioSpin GmbH
$$ ##OWNER= Administrator
$$ $$ C:\Bruker\TOPSPIN/data/COFFEE/nmr/AC1175_Popayan-timbio-cauca-CTiAH12017_5898312_MqStoMD3g8/12/pdata/1/auditp.txt
$$ ##AUDIT TRAIL=  $$ (NUMBER, WHEN, WHO, WHERE, PROCESS, VERSION, WHAT)
(   1,<2012-04-03 16:17:51.890 -0500>,<Administrator>,<TOPSPIN>,<go>,<TOPSPIN 2.1>,
      <created by zg
	started at 2012-04-03 16:06:20.171 -0500,
	POWCHK enabled, PULCHK disabled,
       configuration hash MD5:
       1A 1E CE 29 27 FD 77 03 67 4E F0 E3 C4 B2 CB 90
       data hash MD5: 64K
       F5 03 B7 61 B4 05 5A 3C 6E 6D D7 7E 06 16 BC 22>)
(   2,<2012-04-03 16:17:54.859 -0500>,<Administrator>,<TOPSPIN>,<proc1d>,<TOPSPIN 2.1>,
      <Start of raw data processing
       efp LB = 0.3 FT_mod = 6 PKNL = 1 PHC0 = 0 PHC1 = 0 SI = 128K 
       data hash MD5: 128K
       AD 49 59 EF 48 3B C6 01 6D 38 0B A3 14 49 10 01>)
(   3,<2012-04-03 16:17:56.031 -0500>,<Administrator>,<TOPSPIN>,<proc1d>,<TOPSPIN 2.1>,
      <pk PHC0 = 33.68408 PHC1 = 0 
       data hash MD5: 128K
       4B F8 88 00 1A 39 87 F0 F7 D8 A0 6B 7A EA C6 33>)
(   4,<2012-04-03 16:17:56.453 -0500>,<Administrator>,<TOPSPIN>,<proc1d>,<TOPSPIN 2.1>,
      <abs ABSG = 1 
       data hash MD5: 128K
       A3 99 4B 3C CC 99 2C C6 96 B0 04 B5 D6 E9 55 2C>)
(   5,<2012-04-03 16:17:56.515 -0500>,<Administrator>,<TOPSPIN>,<proc1d>,<TOPSPIN 2.1>,
      <abs ABSG = 2 
       data hash MD5: 128K
       9C 65 90 46 2B 63 BB 0A 55 0B DD 4E 88 F1 12 5C>)
(   6,<2012-04-03 16:17:56.578 -0500>,<Administrator>,<TOPSPIN>,<proc1d>,<TOPSPIN 2.1>,
      <abs ABSG = 3 
       data hash MD5: 128K
       87 F2 DF 49 F8 D7 CD 33 51 37 ED E4 75 F5 01 6B>)
(   7,<2012-04-03 16:17:56.625 -0500>,<Administrator>,<TOPSPIN>,<proc1d>,<TOPSPIN 2.1>,
      <abs ABSG = 4 
       data hash MD5: 128K
       1E AB 8B 63 5B 9F DF BF 66 4F 56 96 79 B6 58 97>)
(   8,<2012-04-03 16:17:56.671 -0500>,<Administrator>,<TOPSPIN>,<proc1d>,<TOPSPIN 2.1>,
      <abs ABSG = 5 
       data hash MD5: 128K
       11 25 E3 94 05 66 7D D8 14 C3 61 89 48 40 2D C2>)
(   9,<2012-04-03 16:17:58.625 -0500>,<Administrator>,<TOPSPIN>,<audit>,<TOPSPIN 2.1>,
      <user comment:
       ICON-NMR User ID: COFFEE
       data hash MD5: 128K
$$ [...]
##$TP07= 0
##$TPNAME0= <>
##$TPNAME1= <>
##$TPNAME2= <>
##$TPNAME3= <>
##$TPNAME4= <>
##$TPNAME5= <>
##$TPNAME6= <>
##$TPNAME7= <>
##$TPOAL= (0..7)
0.5 0.5 0.5 0.5 0.5 0.5 0.5 0.5
##$TPOFFS= (0..7)
0 0 0 0 0 0 0 0
##$TUNHIN= 0
##$TUNHOUT= 0
##$TUNXOUT= 0
##$USERA1= <user>
##$USERA2= <user>
##$USERA3= <user>
##$USERA4= <user>
##$USERA5= <user>
##$V9= 5
##$VALIST= <valist>
##$VCLIST= <CCCCCCCCCCCCCCC>
##$VD= 0
##$VDLIST= <DDDDDDDDDDDDDDD>
##$VPLIST= <PPPPPPPPPPPPPPP>
##$VTLIST= <TTTTTTTTTTTTTTT>
##$WBST= 2048
##$WBSW= 25
##$XGAIN= (0..3)
0 0 0 0
##$XL= 0
##$YL= 0
##$YMAX_a= 13530577
##$YMIN_a= -6001262
##$ZGOPTNS= <>
##$ZL1= 120
##$ZL2= 120
##$ZL3= 120
##$ZL4= 120
##$ABSF1= 14.96825
##$ABSF2= -5.58428
##$ABSG= 5
##$ABSL= 3
##$ALPHA= 0
##$AQORDER= 0
##$ASSFAC= 0
##$ASSFACI= 0
##$ASSFACX= 0
##$ASSWID= 0
##$AUNMP= <proc_prof1d_extract.lims>
##$AXLEFT= 0
##$AXNAME= <>
##$AXNUC= <1H>
##$AXRIGHT= 0
##$AXTYPE= 0
##$AXUNIT= <>
##$AZFE= 0.1
##$AZFW= 0.1
##$BCFW= 0
##$BC_mod= 0
##$BYTORDP= 0
##$COROFFS= 0
##$CY= 15
##$DATMOD= 1
##$DC= 0
##$DFILT= <>
##$DTYPP= 0
##$F1P= 0
##$F2P= 0
##$FCOR= 0.5
##$FTSIZE= 131072
##$FT_mod= 6
##$GAMMA= 0
##$GB= 0
##$INTBC= 1
##$INTSCL= 1
##$ISEN= 128
##$LB= 0.3
##$LEV0= 0
##$LPBIN= 0
##$MAXI= 10000
##$MC2= 0
##$MEAN= 0
##$ME_mod= 0
##$MI= 0
##$NCOEF= 0
##$NC_proc= -3
##$NLEV= 6
##$NOISF1= 0
##$NOISF2= 0
##$NSP= 0
##$NTH_PI= 0
##$NZP= 0
##$OFFSET= 14.96825
##$PC= 1
##$PHC0= 33.68408
##$PHC1= 0
##$PH_mod= 1
##$PKNL= yes
##$PPARMOD= 0
##$PPDIAG= 0
##$PPIPTYP= 0
##$PPMPNUM= 2147483647
##$PPRESOL= 1
##$PSCAL= 4
##$PSIGN= 0
##$PYNMP= <proc.py>
##$REVERSE= no
##$SF= 400.130004945934
##$SI= 131072
##$SIGF1= 0
##$SIGF2= 0
##$SINO= 400
##$SIOLD= 131072
##$SPECTYP= <>
##$SREGLST= <1H.CDCl3>
##$SSB= 0
##$STSI= 131072
##$STSR= 0
##$SW_p= 8223.68421052632
##$SYMM= 0
##$S_DEV= 0
##$TDeff= 65536
##$TDoff= 0
##$TI= <>
##$TILT= no
##$TM1= 0
##$TM2= 0
##$TOPLEV= 0
##$USERP1= <user>
##$USERP2= <user>
##$USERP3= <user>
##$USERP4= <user>
##$USERP5= <user>
##$WDW= 1
##$XDIM= 131072
##$YMAX_p= 466714019
##$YMIN_p= -385203208
##$CURPLOT= <Network HP LaserJet P1505>
##$CURPRIN= <$Network HP LaserJet P1505>
##$DFORMAT= <normdp>
##$LAYOUT= <+/1D_H.xwp>
##$LFORMAT= <normlp>
##$PFORMAT= <normpl>
##$SURQMSG= 1
$$ End of Bruker specific parameters
$$ ---------------------------------
##NTUPLES= NMR SPECTRUM
##VAR_NAME=  FREQUENCY,     SPECTRUM/REAL,   SPECTRUM/IMAG
##SYMBOL=    X,             R,               I
##VAR_TYPE=  INDEPENDENT,   DEPENDENT,       DEPENDENT
##VAR_FORM=  AFFN,          ASDF,            ASDF
##VAR_DIM=   131072,        131072,          131072
##UNITS=     HZ,            ARBITRARY UNITS, ARBITRARY UNITS
##FACTOR=    0.0627417313425165, 1,          1
##FIRST=     8223.62146879498, 178,          -102710
##LAST=      0,             3935,            -104361
##MIN=       0,             -385203208,      0
##MAX=       8223.62146879498, 466714019,    0
$$ Real data points
##PAGE= N=1
##DATA TABLE= (X++(R..R)), XYDATA
$$ [...]
66806 4978069 4954039 4929446 4904632 4878815 4851322 4822313 4792084 4760623 4728355 4696427 4665354
66795 4665354 4633855 4599824 4562277 4521957 4480395 4438858 4397722 4356199 4313040 4268197 4223412
66784 4223412 4180383 4138559 4095656 4050292 4003344 3956702 3911531 3867793 3824632 3780894 3735925
66773 3735925 3690194 3644735 3599929 3555461 3511469 3468737 3427365 3386182 3344192 3301830 3259901
66762 3259901 3217840 3174194 3128818 3083527 3040195 2998883 2958296 2917654 2877479 2838585 2800837
66751 2800837 2763290 2725399 2687533 2650096 2612761 2575239 2538427 2503655 2470679 2437518 2402864
66740 2402864 2367741 2333987 2301848 2270101 2237988 2205835 2173974 2142320 2111179 2081412 2053428
66729 2053428 2026666 2000366 1974220 1948218 1922605 1898119 1875445 1854105 1832638 1810137 1786821
66718 1786821 1762851 1737671 1711209 1684821 1660193 1637838 1617312 1598154 1579666 1560499 1539770
66707 1539770 1518456 1498590 1481021 1464776 1448553 1431915 1414993 1398005 1381370 1365508 1350082
66696 1350082 1334064 1316967 1299613 1283308 1268533 1254659 1240700 1226158 1211300 1196688 1182396
66685 1182396 1167954 1153244 1138954 1125599 1112532 1098826 1084873 1072017 1060556 1049321 1037542
66674 1037542 1025957 1015408 1005398 994945 984146 973843 964211 954648 944790 934721 924386 913793
66662 913793 903809 895706 889590 883969 877246 869109 860144 850664 840548 829973 819736 810659 802846
66649 802846 795567 787901 779605 771376 764091 757750 751389 744181 736377 728844 721795 714478 706377 698295
66635 698295 691730 687202 683810 680525 677183 673666 668844 661480 652180 643329 636719 631985 627734 623305
66621 623305 618710 613734 608259 603170 599683 597614 595225 591173 585878 580574 575634 570446 564547 558284
66607 558284 552377 547303 543178 539924 537290 534723 531466 527051 521881 517110 513611 511061 508313 504630
66593 504630 500224 495543 490566 485141 479675 474889 470945 467252 463300 459263 455520 451891 447844 443371
66579 443371 439113 435399 431661 427270 422738 419429 418000 417570 416627 414434 411340 408099 405190 402623 400092
66564 400092 397417 394895 392969 391476 389729 387520 385438 383710 381389 377503 372637 368371 365350 362941
66550 362941 360820 359623 359528 359323 357734 355037 352524 350867 349823 349141 348824 348659 348317 347843 347307 346079
66534 346079 343342 339453 335942 333915 333142 332958 333177 333587 333257 331159 327178 322047 316621 311691 308006
66519 308006 305798 304534 303706 303549 304296 305153 304981 303814 302705 302072 301378 300657 301062 303132 305475 306173 304967
66502 304967 303112 301490 299828 297652 295054 292399 289872 287431 284791 281550 277828 274652 273062 272832
66488 272832 272681 271782 270466 269342 268348 266962 264888 262265 259438 256659 253873 250890 248005 246080 245445
66473 245445 245072 243710 241634 240212 239723 238848 236763 234569 233885 234917 236693 238384 239492 239386 237714
66458 237714 234993 231998 228858 225505 222490 220389 218756 216683 214223 212243 210933 209596 208002 206888
66444 206888 206759 207043 206881 206064 204856 203471 202186 201480 201698 202767 204221 205105 204127 200829 196717 194175
66428 194175 193816 193837 192606 190961 190972 193060 195544 196893 197284 197688 198316 198457 197431 195245 192516 190107
66412 190107 188742 188580 189049 189269 188930 188702 189458 190912 191428 189628 185944 182092 179226 177335 176270 176297
66396 176297 177236 178156 178709 180044 183341 187802 191096 191745 190236 187865 185421 183240 181623 180677 180231 180329
66380 180329 181316 182978 184030 183142 180426 177363 175146 173500 171394 168682 166594 166363 167646 168771 168693
66365 168693 168208 168744 170324 171592 171835 171991 173068 174301 173880 171248 167774 165089 163609 162904 162622 162401
66349 162401 161528 159631 157506 156367 156201 155680 154004 152063 151199 151415 151596 151273 151211 152080 153388 154274 154862
66332 154862 156071 158090 159681 159361 157036 154222 152697 153059 154481 155588 155495 154282 152836 152219 152870 154146
66316 154146 154741 153772 151500 148926 146774 145041 143414 141801 140332 139076 138027 137269 136923 136897 136867 136599
66300 136599 136177 135799 135399 134656 133404 131969 131033 131194 132608 134955 137664 140206 142184 143128 142422 139796
66284 139796 135980 132448 130259 129430 129590 130607 131993 132369 130717 128118 127104 128963 132592 136293 139500
66269 139500 142099 143272 142408 140574 139709 140389 141365 141155 139182 135592 131179 127572 126238 126879 127746 127850
66253 127850 127875 128482 128909 128098 126408 125202 125116 125530 125349 123693 120338 116383 114123 115207 118811 122378
66237 122378 124191 124540 124472 124361 124062 123580 122917 121740 119910 118107 117268 117448 117833 117983 118401 119530 120752
66220 120752 121072 120582 120439 121247 122231 122418 122053 122228 123471 125327 127078 128203 128239 126897 124422 121463 118721
66203 118721 117092 117595 120173 122805 123096 121020 118993 118873 120017 120850 121151 121733 122713 123349 123252 122719 121970
66186 121970 120838 119206 117180 114999 113114 111967 111240 109895 107666 105919 106134 107895 109392 109658 109248
66171 109248 108790 107935 106054 103269 100574 99324 100313 102751 104468 104068 102649 102382 103608 104696 104725 104712
66155 104712 105620 106675 106691 106006 105905 106788 108079 109532 111426 113503 114728 114400 112908 111099 109353 107603
66139 107603 106078 105615 106926 109568 112068 113480 114470 116270 118749 120406 120383 119527 119090 119265 119627 120249
66123 120249 121486 123087 124292 124704 124467 123778 122749 121599 120565 119817 119687 120509 121766 121995 120266 117368
66107 117368 114737 112640 110402 108212 107418 108711 110945 112299 112045 110796 109629 109388 110363 112094 113643
66092 113643 114390 114428 113982 112758 110310 107041 104480 104192 106183 108555 109234 108291 108005 110137 113620 115748
66076 115748 115402 114052 113517 113835 113742 112295 109357 105313 101224 98774 99036 101188 103006 102671 99993 96353
66060 96353 93926 94367 97335 100479 101598 100713 99460 98854 98778 99403 101563 105165 108487 109978 109956 109620 109042
66043 109042 107335 104517 102048 101245 101943 102988 103491 103336 102871 102411 101877 100832 99030 96855 95084 94298
66027 94298 94651 95772 96612 95927 93643 91412 90919 91823 92406 92166 92525 94546 97220 98830 99172 99452 100562
66010 100562 102317 104028 105021 104946 104332 104479 105995 107782 108354 107827 107540 107902 107871 106692 104927 103299 101663
65993 101663 99826 98575 98961 101013 103822 106541 108660 109678 109374 108430 108070 108832 109953 110145 108851 106736
65977 106736 105049 104478 104555 104289 103354 102469 102578 103982 106311 108854 110599 110561 108764 106841 106894 109418 112736
65960 112736 114760 115083 115005 115665 116742 117174 116640 115761 115025 114297 113580 113472 114209 114784 113871 111512 109163 108097
65942 108097 108503 110173 113072 116751 119931 121470 121498 121005 120423 119151 116604 113341 110818 110022 110515 111031
65926 111031 110929 110732 111113 111898 112427 112429 111941 110801 109090 107800 108095 109863 111864 113305 114393 115331 115940
65909 115940 116480 117609 119053 119439 118102 116021 114322 112968 111702 111049 111161 110746 108632 105767 104155
65894 104155 104218 104696 104908 105574 107240 109297 110956 112159 113152 113961 114607 115250 115975 116893 118290 119999 120933
65877 120933 120177 118414 117266 117286 117594 117400 116686 115382 113246 110966 110111 111334 113536 115326 116392 116988
65861 116988 117158 117214 118091 120304 123071 125175 126221 126510 126267 125671 125139 124833 124240 122784 120638 118472 116662
65844 116662 115086 113412 111362 109078 107411 107278 108547 110181 111671 113507 115868 117731 117945 116602 114843
65829 114843 113912 114671 117110 119769 120586 119113 117047 115898 115174 113887 112633 112666 113688 114219 113816 113314
65813 113314 113120 112928 113083 114480 116719 117963 117312 116074 115867 116480 116526 115522 114377 114131 114930 116110 116918
65796 116918 117196 117444 118090 118818 118999 118543 117709 116305 113966 111210 109199 108215 107377 106306 106067 107709 110555
65779 110555 112759 113142 111877 109902 108455 108834 111548 115491 118459 118847 116809 113949 112114 112306 114308
65764 114308 117158 119886 121754 122094 120584 117908 115659 115050 115919 117322 118839 120845 123513 126034 127113
65749 127113 126260 124461 123440 124172 126228 128633 130983 133372 135601 137149 137901 138246 138379 138145 137738 137847
65733 137847 138759 139873 140490 140586 140419 139890 138848 137671 136972 136880 137000 137006 136983 137281 138109 138975 138544 135708 131150
65714 131150 127207 125643 125987 126514 126293 125533 124487 123104 121673 120796 120417 119698 118169 116365 114909 113478
65698 113478 111286 108389 105845 104507 104110 103809 103286 102800 102200 100729 98288 96348 96678 99260 102229 103938
65682 103938 104257 103821 103047 102316 102051 101936 100889 98637 96498 95648 95442 94616 93475 93370 94451 95577 96505
65665 96505 98346 101331 103657 103534 101370 99056 97869 97860 98546 99257 99293 98633 98200 98723 99700 100189 100219 100537
65647 100537 101143 101056 99604 97160 94447 91900 90000 89438 90199 90820 89478 86041 82483 80851 81125 81678
65631 81678 81698 82249 84417 87209 88400 87277 85419 84547 84751 85378 86523 88496 90539 91525 91830 93179
65615 93179 96256 99515 100991 100565 99757 99778 100548 101401 101999 102510 103463 105553 109049 113095 116000 116642 115480
65598 115480 113877 112638 111666 110976 111318 113300 116213 118364 118632 117288 115235 112976 110683 108895 108447
65583 108447 109487 110905 111130 109529 106870 104418 102809 101973 101875 102758 104575 106649 108241 109158 109567 109585
65567 109585 109500 109877 110759 111032 109572 107010 105363 105612 106569 106573 105416 103874 102166 99909 97238 95007 93884
65550 93884 93907 94703 95548 95493 94310 93136 93238 94143 93994 91966 89378 88009 88151 88895 89553 90073 90495 90742
65532 90742 90855 91090 91975 94354 98667 103755 107164 107483 105891 104511 103725 102248 99611 97031 95430 93961
65516 93961 91480 88606 87128 87645 88864 89324 88988 88758 88970 88956 88031 86597 86044 87477 90569 93751 95473
65499 95473 95143 93008 89778 86712 85440 86812 89946 93081 95533 98190 101894 105927 108656 109309 108533
65484 108533 107382 106298 105159 103842 102394 100772 98746 96251 93866 92664 93267 95137 97190 99141
65470 99141 101653 104921 107697 108346 106616 103848 101623 100627 100469 100029 98264 95513 93830 95113 98863
65455 98863 102733 105356 107438 109768 111593 112036 111985 113083 115312 117022 117339 117285 118283 120611 123597 126401
65439 126401 128136 128105 126619 125108 124834 125740 126863 127488 127565 127417 127459 127974 128810 129575 130353 131821 134261 136840
65421 136840 138459 139095 139746 141072 142599 143387 143217 142981 143932 146481 149711 152300 153929 155368 157062 158273
65405 158273 158084 156668 154913 153158 151106 148718 146325 143914 141123 138012 135018 132072 128698 125231
65391 125231 122939 122352 122341 121556 120117 118974 118193 116974 115129 113410 112198 110841 108719 106317 104727
65376 104727 104434 104896 105090 104278 102519 100694 99804 100067 100818 101338 101520 101682 102035 102501 102722 102083 100107 97220
65358 97220 94904 94641 96632 99683 102340 103983 104905 105543 105858 105604 105149 105582 107521 109944 110868 109507
65342 109507 107317 106550 108113 111165 114425 117272 119726 121943 123974 125788 127392 128920 130485 131907
65328 131907 132963 134040 136065 139323 142755 145059 146169 146909 147406 146976 145801 145664 148176 152816 157486
65313 157486 160868 163586 167096 172009 177720 183398 189066 195693 204269 214822 226336 237521 247515
65300 247515 256102 263757 271542 280405 290072 298831 304842 307685 308436 308295 307359 304777 299870 292930 284903
65285 284903 276470 267670 258439 249132 240261 232055 224690 218551 213592 208615 202171 194325 186701 180469
65271 180469 175079 169462 163658 158574 154787 152312 151027 150407 149231 146449 142232 137537 132931 128679
65257 128679 125626 124779 125823 126926 126349 123689 119587 115058 111242 108866 107441 105606 102673 99404 97059
65242 97059 96246 96823 98158 99151 98790 97257 95878 95556 95913 96446 97657 100137 103153 105173 105522 104633 102925
65225 102925 100453 97669 95601 94986 95747 97402 99394 100959 101366 100614 99462 98610 98253 98563 100013 102822
65209 102822 106292 108985 109576 107697 104252 100874 98696 97647 97165 97294 98479 100517 102522 104003 105141
65194 105141 105873 105701 104862 104684 106060 108273 110215 112030 114450 116965 118065 117340 116080 115413 114960 113970
65178 113970 112904 112965 114406 116130 116915 116512 115516 114597 113995 113601 113335 113223 112848 111048 106915 101323 96709
65161 96709 94767 94811 95012 94785 95142 96929 99570 101665 102066 100241 96387 91623 87514 84882 83341 82224
65145 82224 81495 81385 81605 81607 81506 82128 83940 86265 87780 87721 86520 85273 84568 83906 82346 79651 76640
65128 76640 74525 74161 75754 78668 81432 82642 82400 82476 84460 87905 90702 91120 89095 85783 82530 80310
65112 80310 79509 79838 80640 81580 82986 85363 88590 91653 93391 93646 93599 94656 96936 99148 99974 99189 97423
65095 97423 95464 94089 93921 94883 96104 96849 97178 97333 97017 95940 94545 93450 92579 91752 91705 93383 96289
65078 96289 98679 99591 99711 100085 101033 102563 104749 107035 108054 106887 104048 100787 98044 96501 96798 98843
65062 98843 101387 103098 103887 104649 105992 107740 109444 110777 111575 111958 112404 113448 115335 117908 120538 122268
65046 122268 122703 122816 124002 126090 127317 126805 125993 126711 128849 131256 134188 139210 146731 155162 162868
65031 162868 169793 176662 183571 190053 195979 201677 207350 212689 217013 219766 221169 222354 224522 227842
65017 227842 231321 233587 233651 231353 227614 223867 220553 216444 210247 202624 195568 189819 184104 177285 170112
65002 170112 164064 159270 154490 148761 142192 135327 128484 121857 115744 110501 106378 103429 101439 100049
64988 100049 99084 98659 98906 99731 100910 102132 102876 102600 101342 99891 98999 98512 97631 96056 94562 94192 94984
64971 94984 95803 95586 94573 93978 94505 95643 96568 97228 98129 99420 100741 101836 102751 103414 103477 102669 101043
64954 101043 98883 96587 94519 92674 90752 88930 88239 89442 91654 92806 91757 89463 87858 87919 88914
64939 88914 89189 87709 85210 83842 85267 89079 93395 96682 98476 98682 97264 94768 92310 90628 89727
64924 89727 89493 89892 90411 90207 89266 88661 89174 90300 91066 91151 90764 90073 89358 89115 89441 89856 90258 91325 93313
64905 93313 95163 95763 95546 95770 96504 96549 95393 94102 93874 94529 95010 94899 94757 95029 95105 93933 91492 89196
64887 89196 88406 88873 89346 89539 90426 92388 94182 94514 93761 93262 93549 94195 94796 95003 94058 91587 88787 87717
64869 87717 89215 92290 95462 97794 98653 97617 95041 92009 89344 87161 85381 83988 82788 81739 81568
64854 81568 83119 85859 88017 88551 88092 87589 87014 86073 85255 85330 86425 88265 90691 93129 94152 92673
64838 92673 89352 85973 83630 82207 81322 80788 80171 78873 76981 75443 75190 76447 78844 81665 84069
64823 84069 85794 87690 90851 94985 98323 99417 98389 96152 93186 89735 86582 84732 84445 85137 86138
64808 86138 87001 87247 86442 84704 82730 81198 80360 80133 80339 80870 81832 83291 84675 84827 83195 80688 78711
64791 78711 77609 76895 76704 77799 79962 81687 81992 81502 81082 80555 79669 79203 79822 80606 80265 79302 79419 81026
64773 81026 82992 84793 87172 90263 92715 93405 92728 91491 89782 87784 86446 86336 86729 86778 86637 86480
64757 86480 85586 83692 82274 82871 84774 85992 86061 86171 86823 87310 87686 89300 92659 96287 98632 99883
64741 99883 100955 101658 101055 99094 96891 95622 95768 97086 98680 99298 98190 95678 92605 89498 86580
64726 86580 84272 83130 83255 83999 84363 83773 82685 82344 83521 85508 86831 86976 86790 87039 87352 87057 86465
64709 86465 86637 88090 90234 91996 92704 92458 91896 91579 91556 91652 91950 92576 93154 93155 92727 92452 92290 91798 91516
64690 91516 92865 95953 98745 99475 98944 99128 100288 101038 100839 100685 101242 101998 102647 103807 105594 106787 106421
64673 106421 105233 104500 104200 103532 102757 103216 105523 108776 111722 113829 115018 115134 114133 112364 110348 108600
64657 108600 107689 107944 108869 109400 109035 108196 107194 105563 103052 100721 100080 101312 103210 104811 106127 107120
64641 107120 106983 105085 101988 98867 96349 94534 93722 94353 96355 99123 102074 104738 106512 107104 107216
64626 107216 108064 109933 111725 112228 111401 110142 109201 108675 108354 108125 108052 108277 108950 110236 112260 114764 116722
64609 116722 116812 114813 112312 111321 112164 113342 113398 112070 109468 105319 99924 95161 93229 94339 96487 97760
64593 97760 98196 99047 100851 102829 103990 104214 104126 104312 104859 105406 105310 103992 101582 99244 98356 99175 100648
64576 100648 101649 101850 101206 99401 96560 93958 92965 93410 93900 93688 93377 93753 94895 96611 98821 101164
64560 101164 103046 104517 106374 108996 111711 113569 114074 113037 110806 108935 109249 111427 112747 111241 107982
64545 107982 105099 102767 99880 96764 95122 95577 97226 99578 102905 106384 107917 106682 104315 102703
64531 102703 101973 101516 101447 101823 101624 100109 98409 98313 99888 101675 102876 104045 105770 107955 110452 113224
64515 113224 115785 117482 118548 119925 121803 123310 123899 124052 124135 123507 121555 118979 117260 117129 118112 119296
64499 119296 120026 120131 120008 120380 121595 123253 124732 125775 126272 125892 124433 122311 120218 118522 117323 116698
64483 116698 116287 115122 112763 110345 109511 110287 111087 111006 110918 111716 112596 112165 110578 109450 109854 111356 112906
64466 112906 113739 113356 111621 109311 107866 108023 109032 109620 109460 109200 109247 109142 108452 107878 108792 111408 113920
64449 113920 114198 112212 109978 108922 108267 106666 104510 103434 103911 104659 104597 104268 104840 106385 107686 107492
64433 107492 105773 104059 104392 107360 111149 113257 113217 112870 113922 116160 118386 120064 121449 122854 124417
64418 124417 125962 126614 125311 122316 119431 118037 117681 117317 116958 117034 117001 115989 114316 112888 111541 109508
64402 109508 107414 107085 109140 112225 114944 117084 118512 118503 117152 116138 116880 118748 120081 120208 119449 117961
64386 117961 115915 114352 114493 116208 118147 119236 119172 117767 115133 112487 111431 112036 112728 112474 111998 112282
64370 112282 113074 113847 115261 118240 121958 124181 123791 121976 120663 120671 121796 123833 126789 130397 134024 136920
64354 136920 138347 137798 135510 132597 130319 129311 129601 130845 132112 131969 129594 125851 122638 121072 120728
64339 120728 120578 120088 119272 118330 117584 117390 117705 117991 117795 117343 117380 118527 120739 123131 124395 123779 121762
64322 121762 119492 117670 116422 116098 117357 120112 123081 124868 125152 124566 123943 124022 125217 126999 127852 126630
64306 126630 123937 121725 121557 123458 126228 128558 130109 131782 134680 138642 142238 144461 145786 147081
64292 147081 148135 148034 146606 144706 143314 143027 144101 146212 148315 149406 149318 148358 146559 143990 141301
64277 141301 139110 137296 135868 136019 138912 143685 148196 151765 155503 159569 161969 161194 158651 157072 157348
64262 157348 158239 158633 158685 158925 159516 160582 162322 164485 166391 167789 169260 171519 174607 177949 181032 183790
64246 183790 186375 188682 190258 190847 190837 190882 191100 191090 190823 191060 192630 195575 199131 202284 204293 205156 205833
64229 205833 207606 210975 215423 220289 225304 230088 233940 236749 239482 242986 246539 248479 248285 247318 247346
64214 247346 248860 251110 253297 255229 256892 257854 257438 255449 252458 249253 246224 243504 241340 239793 238251
64199 238251 235951 233130 230943 229920 229111 227284 224490 221867 220239 219591 219731 220642 221988 222951 223047 222836
64183 222836 223321 224715 226202 227073 227702 228967 231009 233287 235957 240279 246981 254827 261748 267250 272738
64168 272738 279362 286362 291811 294480 294732 294068 293919 294510 294791 293787 291693 289098 285635 280636 275004
64153 275004 271000 269707 269983 270432 271109 272465 273869 274536 275092 276780 279414 281379 281604 280629 279713 279698 280772
64136 280772 282734 285348 288620 292533 296481 299566 301766 304064 306958 309758 311984 314405 317674 320818
64122 320818 322280 321753 319781 316465 312191 308889 308446 310001 310861 310240 310036 311414 312831 312621 311757 312429
64106 312429 315035 318221 321131 324013 326875 329070 330543 332518 336490 342905 350946 359331 367331 375275
64092 375275 384107 394392 405915 418221 431188 444966 459757 475739 492751 509903 525984 540452
64080 540452 553480 564891 573764 579505 582622 583912 583479 581166 577388 572701 566797 558773 548415 536646
64066 536646 524669 513128 502073 491265 480384 469299 458355 448350 440238 434787 432156 431495
64054 431495 431203 429982 427690 425158 423487 423658 426264 430981 436398 440980 444353 447428 451326 456481 462664
64039 462664 469342 475917 482130 488658 497051 508552 522833 538143 552903 567001 581323 596260
64027 596260 611110 624883 637099 647598 656167 662824 667889 671137 671344 667619 660932 653260 645249
64014 645249 635907 624930 613978 604761 596784 588173 578397 569127 562412 558708 556803 555090 552812 550499
64000 550499 549391 550316 553089 556910 560998 564803 568234 572136 578017 586690 597433 608987 621016 634040
63986 634040 648357 663934 681101 700312 721023 741710 761426 780763 800886 822043 843376
63975 843376 863811 882743 900074 915910 930252 942903 953863 963718 973273 982755 991734 999995
63963 999995 1008089 1016866 1026864 1038456 1052152 1068172 1085803 1103687 1120864 1137324 1153451 1169184
63951 1169184 1183946 1197321 1209620 1221701 1234272 1247497 1261262 1275638 1290980 1307747 1326461
63940 1326461 1347695 1371777 1398493 1427376 1458364 1491982 1528889 1569529 1614293 1663587 1717467
63929 1717467 1775565 1837812 1905070 1978581 2058734 2144783 2235951 2332540 2435680 2546121 2663599
63918 2663599 2787436 2917562 3054857 3200635 3356076 3522277 3700611 3892693 4099799
63909 4099799 4322519 4561351 4817840 5095066 5397037 5727854 6091555 6492507 6935462
63900 6935462 7425252 7966872 8566039 9229243 9962821 10771991 11660680 12631419 13684301
63891 13684301 14815737 16018572 17283393 18599096 19952069 21325584 22700439 24055379
63883 24055379 25365962 26603597 27737604 28739846 29588118 30265788 30759558 31058706 31156318
63874 31156318 31050188 30741965 30236018 29540244 28668458 27641689 26486526 25231635 23904850
63865 23904850 22531886 21136003 19738071 18357117 17010942 15715749 14484728 13327077
63857 13327077 12248481 11252190 10339384 9508963 8757654 8080515 7471469 6924005 6432094
63848 6432094 5990363 5593281 5234866 4910051 4615919 4350511 4110592 3891924 3691816
63839 3691816 3509729 3344443 3192035 3048114 2911178 2781983 2660046 2542745 2428272
63830 2428272 2317714 2213192 2115037 2021865 1932609 1847341 1766478 1690205 1618522 1550941 1486174
63819 1486174 1422941 1361232 1302264 1247220 1196537 1150160 1107596 1067646 1029014 991638 956769
63808 956769 925350 896886 870321 845387 822434 801368 781544 762564 744566 727807 712469
63797 712469 698811 686952 676469 666786 658003 650866 645754 642280 640154 639785 641353 643584 644299 642371
63783 642371 638567 634071 628648 620874 610089 597446 584766 572793 560989 548720 536087 523511
63771 523511 510976 497923 483807 468690 453340 438720 425287 412909 401406 390777 380641
63760 380641 370066 358654 347506 338213 330934 324319 317369 310445 304209 298605 293376 288649 284334
63747 284334 279752 274659 269950 266492 263835 260973 257775 254663 251492 248047 245252 244389 245054 245285 244034
63732 244034 242278 241294 241043 240861 240613 240357 239759 238769 238175 238416 238326 236169 231944 227742 225584 225489 225870 225319
63714 225319 223624 221317 218769 215981 213101 210735 209529 209572 210357 211207 211573 211253 210640 210455 210872 211263 211274
63697 211274 211651 213137 214902 215213 213731 212116 212139 214148 217602 221988 226619 230475 233043 234780 236268
63682 236268 237516 238523 239796 241778 244432 247844 252351 257500 261908 265076 268490 273896 281251 289415
63668 289415 298036 307361 316880 325750 334249 343090 351455 357464 360822 363199 365430 366095 363844 359771
63654 359771 356192 353952 352141 349727 346287 341601 335809 329880 325015 321674 319810 319594 320835 321993
63640 321993 321214 318577 316078 314832 313468 310183 305471 301557 299468 297977 295582 292418 289712 288076
63626 288076 287067 286098 285152 284610 284727 285418 286542 288380 291667 296785 303091 309611 316408 324444 333866
63611 333866 343389 351987 360259 369067 377559 383928 387772 390239 391837 391635 388972 384533 379106 372534
63597 372534 364775 356928 350164 344466 339387 335260 332388 329584 325063 318869 313283 310453 310363 311406 312318
63582 312318 313152 314728 317620 321788 327055 333576 341436 349967 358163 365872 373884 382713 392222 402799
63568 402799 415786 431870 449865 468000 485744 503582 521897 541334 563488 589542 618364
63557 618364 647485 676095 705805 738316 773552 810391 848034 886067 923870 960267 993186
63546 993186 1019865 1038498 1049860 1056334 1059266 1058400 1053987 1047846 1041584 1034994 1027140 1018023 1008076 996841
63532 996841 983400 967707 950334 931065 908895 883765 857600 833093 811533 791956 772522
63521 772522 752759 734268 718915 706587 695410 684210 673893 665966 660421 655859 651403 647746
63509 647746 646153 646868 648892 651406 655094 661499 671068 682707 695742 711312 730700 753081 776500
63496 776500 800697 827166 856459 887469 919785 954559 991882 1029169 1063701 1095313 1124942
63485 1124942 1151709 1173385 1189013 1199316 1205142 1207370 1207867 1208447 1208799 1207267 1203786 1200212 1197353 1193440
63471 1193440 1186125 1174324 1157363 1134094 1104295 1069829 1033047 994787 955115 915172 876626
63460 876626 839533 802304 764167 726680 692368 662497 636418 612545 589614 567403 546608
63449 546608 528000 511665 497175 484298 473149 463608 455060 446964 439491 433359 429071 426415 424701
63436 424701 423435 422757 423151 424794 427404 430855 435667 442559 451585 462018 473083 484507 496306 508421
63422 508421 520840 533856 547748 562014 575098 585145 591279 594154 595108 594710 592342 587302 579890
63409 579890 571015 561155 550530 540136 531468 524778 518673 512199 506519 503390 502692 502872 503467 505537
63395 505537 509429 513873 518013 522759 528959 535402 540060 542646 544650 547354 551198 556740 564680 574745
63381 574745 585841 597686 611379 628003 647351 668329 690037 712346 736079 762744 793443
63370 793443 827915 865160 904801 947027 991374 1036691 1082498 1129433 1178098 1228325 1279642
63359 1279642 1331286 1381384 1427270 1467158 1500622 1527110 1545285 1554579 1556274 1552161 1543091 1529773
63347 1529773 1513896 1497067 1479231 1459358 1437240 1413399 1387653 1359065 1327267 1292758 1255895
63336 1255895 1216646 1175456 1133534 1092072 1051751 1013072 976601 942861 912449 886145 864363
63325 864363 846614 832025 820256 811427 805321 801265 798787 798034 799694 804674 813441 825316 838968
63312 838968 854027 871527 892233 915477 940516 968176 999855 1035520 1074056 1115144 1159245
63301 1159245 1205802 1252945 1299079 1343527 1385538 1423946 1457898 1486587 1508190 1520682 1524238
63290 1524238 1521580 1515357 1506387 1494747 1481012 1465488 1447523 1426697 1403729 1379277 1352697 1323027
63278 1323027 1290401 1255494 1218385 1179135 1138949 1099604 1061987 1026131 992264 960801 931520
63267 931520 903656 876684 850384 824525 799354 776058 755811 738498 723184 709547 697820
63256 697820 687489 677191 666208 655308 645901 638880 634220 631008 627914 624414 621625 621047 622286
63243 622286 622937 621109 617432 614103 612447 611868 610813 608271 604411 600051 595585 590737 585586 581270 578812
63228 578812 577464 575335 571905 568853 567818 568272 568428 567542 566364 565749 565843 566538 567817 569489 571296 573507
63212 573507 576813 581324 586003 589437 591046 591467 591946 593455 596248 600031 604339 608645 612364 615426 619022
63197 619022 625057 634198 644915 655233 665204 676791 691326 707970 724789 740526 755047 768945
63185 768945 783326 799423 817790 838203 860620 885577 913154 942288 972013 1002890 1036186
63174 1036186 1071859 1108329 1144265 1179692 1215306 1251653 1289266 1328738 1369997 1411950 1453217
63163 1453217 1492958 1530915 1567260 1602652 1637865 1672906 1706981 1739678 1771554 1802958 1832713
63152 1832713 1858656 1879202 1893754 1901800 1902495 1895302 1880511 1858871 1831071 1797754 1759710 1717858
63140 1717858 1673192 1626933 1580593 1535654 1493095 1453225 1416001 1381626 1350848 1324601 1303242
63129 1303242 1286240 1272681 1262114 1254932 1251983 1253708 1259567 1268433 1279596 1293008 1308297 1324083
63117 1324083 1339026 1353386 1368721 1385987 1404696 1423967 1443440 1462773 1481219 1498351 1514413
63106 1514413 1529261 1541706 1550709 1556555 1559758 1559314 1553291 1541108 1524044 1503358 1479002 1450723
63094 1450723 1419607 1387782 1356854 1327073 1297903 1269046 1240845 1213822 1188111 1163692 1141227
63083 1141227 1122068 1106923 1094829 1083932 1073115 1062471 1052530 1043691 1036302 1030577 1026342 1023289
63071 1023289 1021436 1020854 1021041 1021111 1020630 1019888 1019370 1019482 1020726 1023587 1028011 1033229 1038113 1041692 1043773 1045412
63055 1045412 1048186 1052272 1055676 1056302 1054595 1053184 1054078 1057181 1061533 1066649 1072256 1077840 1083258 1089081
63041 1089081 1095622 1102157 1107782 1112698 1118051 1124735 1132790 1141774 1151232 1160845 1170439 1179886 1188912 1197133
63027 1197133 1204498 1211685 1219911 1230143 1242235 1254940 1267176 1279384 1293185 1309572 1328042 1347736
63015 1347736 1368431 1389872 1411213 1432316 1454810 1480490 1509119 1539145 1570161 1603072 1638183
63004 1638183 1674872 1713195 1753970 1797056 1841380 1887148 1936147 1989192 2045063 2102909 2163898
62993 2163898 2229280 2298433 2370270 2445181 2523913 2605659 2688871 2773023 2858011 2942767 3026223
62982 3026223 3108913 3191781 3274064 3354284 3432824 3511327 3589651 3665680 3738518 3809752 3880683
62971 3880683 3950041 4015425 4075367 4128561 4172150 4202514 4217757 4218398 4205609 4179375 4138526 4082240
62959 4082240 4011413 3928709 3837298 3739683 3637820 3533954 3430799 3330986 3236615 3149018 3068405
62948 3068405 2994150 2926266 2866447 2816812 2777751 2747830 2725618 2710469 2701460 2697002 2696190 2699543
62936 2699543 2707560 2719335 2733359 2749038 2766434 2784908 2803048 2820028 2836274 2852482 2868358
62925 2868358 2882486 2893203 2899414 2900655 2896513 2886186 2868812 2844163 2812706 2774828 2730185 2677940
62913 2677940 2617633 2549951 2476911 2401212 2324976 2248949 2173043 2097664 2024205 1954239 1888540
62902 1888540 1826948 1768812 1713472 1660664 1610706 1564131 1521077 1481280 1444660 1411468 1381629
62891 1381629 1354336 1328669 1304426 1282018 1261652 1242953 1225360 1208619 1192818 1178092 1164323
62880 1164323 1150967 1137178 1122414 1107180 1093005 1081163 1071206 1061076 1049022 1035279 1021548
62869 1021548 1009122 998060 987974 978724 970041 961319 952368 943912 936689 930424 924308 918209 912753
62856 912753 908345 904758 901707 899287 897723 897049 897036 897195 897012 896571 896773 898481 901472 904588 906826 907935
62840 907935 908203 908184 908503 909406 910554 911732 913495 916451 919992 922642 923903 924963 927157 930198 932410
62825 932410 932428 930342 927420 925047 923891 923924 925110 927711 931578 935493 937952 938694 938889 939574 940419 940327 938895
62808 938895 936901 935546 935359 935650 934924 932081 927402 922332 918364 916324 916346 917868 919628 920427 920287 920371
62792 920371 921493 923255 925032 927187 930459 934451 937691 939486 941034 944142 949125 954508 958737 961694
62778 961694 964378 967593 971412 975671 980386 985570 991072 996748 1002499 1008027 1012862 1016785 1019984 1022817
62764 1022817 1025879 1030276 1037072 1046092 1055800 1064757 1072719 1080037 1086713 1092629 1098032 1103018 1107001 1109438
62750 1109438 1110641 1111185 1111168 1111032 1112567 1117663 1126108 1135786 1145233 1154918 1165849 1178052 1191024 1204912
62736 1204912 1220722 1239684 1262517 1288745 1316704 1345025 1374414 1407391 1446016 1490315 1538987
62725 1538987 1591022 1646490 1706406 1772102 1844345 1922980 2007792 2099348 2198293 2304066 2415321
62714 2415321 2531513 2653074 2779970 2911113 3045116 3180250 3313346 3440106 3557097
62705 3557097 3662435 3754122 3829118 3884865 3920519 3935614 3928565 3897761 3843610 3768516 3675424
62694 3675424 3567328 3447676 3320063 3187429 3051971 2915467 2779218 2644211 2511901
62685 2511901 2384270 2262742 2147786 2040042 1940610 1849286 1763747 1682052 1605233 1535777
62675 1535777 1473954 1417358 1364079 1314613 1270249 1230958 1195619 1163478 1134698 1109903 1089441
62664 1089441 1072641 1057750 1043246 1029289 1017334 1008368 1002230 998526 997170 997740 999359 1001790 1005962
62651 1005962 1012866 1022491 1034346 1048509 1065458 1085175 1107164 1131380 1158645 1189907 1225346 1264451
62639 1264451 1307018 1353826 1405969 1463322 1523876 1584999 1645479 1706354 1769920 1837923 1910179
62628 1910179 1984211 2056161 2122528 2181461 2232640 2276261 2312279 2340182 2358879 2366698 2361872 2343332
62616 2343332 2311283 2267390 2214396 2154975 2090529 2021303 1947911 1872261 1796701 1722746 1651102
62605 1651102 1582335 1516727 1453883 1393363 1335604 1281540 1231504 1185149 1142204 1102486 1065348
62594 1065348 1030145 997310 968080 943009 921567 903207 887759 874429 861485 847584 832813
62583 832813 817997 803763 790783 780015 771771 765080 758734 752556 746827 741088 734586 727739 721986
62570 721986 718005 715033 712283 710145 709534 710708 713259 716796 721103 726024 731778 739046 748125 758202
62556 758202 768118 777767 788114 799986 813634 829446 848007 868930 890572 911736 933120 956224
62544 956224 981232 1007025 1033133 1060634 1090903 1124235 1159989 1197534 1236805 1278421 1323441
62533 1323441 1372541 1425322 1480852 1538881 1599884 1663925 1730258 1798134 1867061 1935796 2001818
62522 2001818 2062330 2115260 2159073 2192369 2214209 2224231 2222130 2207835 2182622 2149025 2108833
62511 2108833 2061914 2007751 1947339 1882714 1815467 1746779 1678219 1611241 1546384 1484043 1425475
62500 1425475 1371729 1322077 1274985 1230317 1189052 1151072 1115093 1080990 1050287 1023581 999035
62489 999035 974444 949659 925923 903675 882119 860497 838940 818377 800136 785190 773225
62478 773225 762817 752923 743770 735999 729640 724518 721034 719762 720612 723012 726527 730719 734780 738167
62464 738167 741491 746142 752967 761770 772020 783550 796540 811224 827808 846464 867398 890944
62452 890944 917334 946188 976544 1007857 1040810 1076635 1115508 1155911 1195746 1233788 1269861
62441 1269861 1303745 1334271 1359660 1378627 1390993 1397276 1397954 1393208 1383138 1368067 1348736 1326261
62429 1326261 1301564 1274719 1245252 1213322 1180115 1146795 1113714 1081360 1051433 1025791 1004401
62418 1004401 985329 967011 949718 934651 922432 912758 904750 897182 889086 880718 873564 868920 866664
62405 866664 865591 864571 863244 862048 861779 862762 864389 865974 868019 871794 877499 883887 890251 897744 907810
62390 907810 920010 932559 944700 957369 971315 985463 997653 1006706 1013441 1019628 1025958 1031067
62378 1031067 1032808 1030416 1024994 1017873 1009165 998412 986028 973300 961116 949234 936774 923051
62366 923051 908116 892899 878764 866544 856055 846788 838848 832846 828991 826678 824950 823219 821659
62353 821659 821082 822249 825162 829242 834248 840498 848005 856006 863854 871782 880187 888708 896925 905643
62339 905643 916435 929759 944313 958364 971079 982476 992995 1003483 1014806 1026731 1037526
62328 1037526 1045269 1049424 1050767 1050102 1047721 1044106 1040402 1037706 1036141 1035092 1034363 1034776 1037501 1042992 1050835
62313 1050835 1060567 1072384 1086979 1104947 1126531 1151929 1181655 1216486 1257040 1303429 1355339
62302 1355339 1412381 1474262 1540659 1611177 1685459 1763032 1842867 1923420 2003327 2081684 2157146
62291 2157146 2227022 2287953 2337586 2375260 2401233 2415896 2419756 2413434 2397271 2371298 2335811 2291672
62279 2291672 2239918 2181528 2117730 2050061 1979914 1908519 1837606 1769522 1706179 1648066 1594517
62268 1594517 1544675 1497948 1453857 1411822 1371056 1330797 1291130 1253554 1219994 1190924 1165113
62257 1165113 1141557 1120869 1104153 1091215 1080734 1071706 1063842 1056894 1050669 1045672 1042734 1041793 1041847
62244 1041847 1042352 1043909 1046975 1050424 1052169 1051162 1048307 1045255 1042650 1039859 1036220 1032059 1028253 1025179
62230 1025179 1022592 1020410 1019147 1019450 1021542 1025096 1029340 1033431 1037360 1042460 1050236 1060430 1070934 1079998
62216 1079998 1087948 1096605 1107841 1123045 1142855 1166470 1191918 1217989 1245360 1275009 1306394 1338676
62204 1338676 1373250 1413203 1459944 1511873 1567043 1625793 1689705 1758847 1831323 1905220 1979808
62193 1979808 2054599 2128022 2197424 2260047 2313677 2356707 2388079 2407356 2414703 2410686 2396136 2372127
62181 2372127 2339729 2299473 2251193 2194862 2131737 2064483 1996014 1928273 1862042 1797668 1735883
62170 1735883 1678058 1625527 1578545 1536250 1498169 1465376 1439377 1419928 1404856 1392141 1381297
62159 1381297 1372574 1365900 1361195 1358776 1358674 1360198 1362713 1366146 1370151 1373700 1376352 1379196 1383487 1388949
62145 1388949 1394408 1399520 1404758 1410236 1415856 1422325 1430627 1440436 1450221 1459202 1468304 1479013 1492060
62132 1492060 1507402 1524845 1544554 1567334 1594066 1624223 1655466 1685709 1715246 1745811 1777972
62121 1777972 1810754 1843444 1876020 1907712 1937044 1963931 1990298 2017921 2047076 2078159 2113035
62110 2113035 2153348 2198394 2246193 2296149 2349309 2406159 2465445 2525310 2584584 2642356 2696769
62099 2696769 2744908 2784249 2814389 2837091 2854278 2866084 2871329 2869690 2862528 2851562 2837667 2821278
62087 2821278 2802892 2782590 2759923 2735167 2710191 2687352 2667971 2652437 2641135 2634318 2631369 2631098
62075 2631098 2632757 2636178 2641151 2647345 2654726 2663373 2672958 2683127 2694479 2708471 2726073 2746874 2769624
62062 2769624 2793217 2816986 2840658 2864599 2889937 2917834 2948391 2980596 3013560 3047489 3083076
62051 3083076 3120299 3158666 3198634 3241677 3288336 3337097 3386167 3435695 3487075 3540583 3595279
62040 3595279 3651176 3709784 3771861 3836011 3900253 3963821 4026407 4086684 4143067 4195737 4246976
62029 4246976 4299523 4355070 4413912 4475152 4537141 4598201 4657099 4713058 4766051 4817459 4869685
62018 4869685 4924414 4981560 5040271 5100248 5161355 5222664 5282981 5342178 5401214 5461090 5522528
62007 5522528 5586453 5653725 5724200 5796557 5869060 5939985 6007490 6069772 6125465 6173404 6212210
61996 6212210 6240952 6260375 6272768 6280113 6282608 6279095 6268584 6251161 6227701 6199093 6165872 6128578
61984 6128578 6088328 6046696 6004980 5963810 5923491 5884293 5846318 5809588 5774561 5742047 5712202
61973 5712202 5684139 5657020 5631151 5607467 5586227 5566730 5548096 5529874 5512106 5495163 5479264
61962 5479264 5463958 5448502 5432977 5418324 5404907 5391866 5378396 5364774 5351265 5336965 5320928
61951 5320928 5303707 5286469 5269012 5250068 5229378 5208218 5187978 5169278 5152091 5135396 5117046
61940 5117046 5095675 5072659 5050546 5029573 5007578 4983472 4958451 4932961 4904756 4871505 4833627
61929 4833627 4792873 4749582 4703318 4655141 4606998 4559239 4510749 4461488 4413006 4366131 4319803
61918 4319803 4272884 4225931 4180493 4137460 4096736 4057981 4021116 3986280 3953474 3922092 3891093
61907 3891093 3860149 3830262 3802443 3776106 3749883 3724008 3700492 3680482 3662562 3644429 3625370
61896 3625370 3606318 3588267 3571513 3555976 3541364 3527394 3514569 3504311 3497504 3493367 3490826 3490616
61884 3490616 3494620 3502911 3512813 3521669 3529780 3540015 3555180 3576289 3602656 3632734 3665197 3700065
61872 3700065 3738836 3783044 3832908 3887807 3947763 4013801 4087034 4168032 4256897 4353246 4456312
61861 4456312 4565972 4683754 4812011 4952040 5103961 5268617 5448474 5646057 5862496
61852 5862496 6098462 6355889 6637984 6948118 7289641 7666354 8082095 8539792 9041476
61843 9041476 9588981 10183927 10827097 11518187 12255394 13033875 13844156 14672226 15500362
61834 15500362 16306414 17062237 17734452 18288336 18692566 18923217 18967387 18825488 18510024
61825 18510024 18041382 17444436 16747425 15980322 15171097 14342737 13513689 12699565 11912942
61816 11912942 11162391 10453412 9790137 9174943 8606961 8082999 7600575 7158900 6756648
61807 6756648 6390305 6055666 5750012 5471806 5218890 4988031 4776123 4581179 4402265
61798 4402265 4239041 4091147 3957532 3836443 3726409 3626982 3537958 3458029 3384880 3316806
61788 3316806 3253739 3196440 3145035 3098646 3056326 3018013 2984391 2955838 2931696 2910697 2892009
61777 2892009 2875456 2860810 2847533 2835619 2826183 2820457 2818421 2819149 2822328 2828518 2837704 2848590 2860086
61764 2860086 2872945 2889105 2909519 2933100 2957759 2982171 3006870 3034119 3066446 3104594 3146924
61753 3146924 3191352 3237845 3288396 3344643 3406390 3472752 3543879 3620865 3704513 3795045 3892941
61742 3892941 3999413 4115873 4243074 4380653 4527291 4681671 4843847 5015703 5199706
61733 5199706 5397269 5608651 5834289 6075607 6334383 6611892 6909173 7227912 7570596
61724 7570596 7939762 8337478 8765926 9228594 9730771 10278691 10878119 11533821 12250246
61715 12250246 13032286 13885082 14813334 15821038 16911552 18087011 19346793 20685814
61707 20685814 22093339 23552175 25037715 26516768 27946708 29276020 30447267 31402492
61699 31402492 32089778 32469452 32519142 32237093 31642609 30772755 29676189 28406327 27015716
61690 27015716 25552306 24057688 22566963 21109038 19706213 18373324 17118125 15943672
61682 15943672 14851227 13841388 12913065 12062230 11282461 10567102 9910983 9310345 8761789
61673 8761789 8261775 7806678 7392450 7014152 6666621 6346058 6050553 5778870 5529299
61664 5529299 5299871 5088693 4893371 4711009 4539799 4379995 4232065 4094415 3964391
61655 3964391 3841218 3726148 3619455 3519230 3423925 3334281 3251336 3173922 3099898 3028983
61645 3028983 2962581 2901258 2844173 2790723 2740776 2693088 2645567 2597921 2552323 2510256 2470096
61634 2470096 2429285 2387826 2347865 2310332 2273889 2237285 2200991 2165857 2131485 2096985 2062631
61623 2062631 2029736 1999143 1970527 1943079 1916327 1890359 1865609 1842395 1820468 1799159 1778167
61612 1778167 1757893 1738791 1720844 1704088 1689069 1675994 1663726 1650620 1636435 1622556 1610157
61601 1610157 1599006 1588488 1578868 1570805 1564178 1558191 1552313 1546388 1540160 1533611 1527682 1523674 1521692
61588 1521692 1520398 1518668 1516780 1515607 1515361 1515819 1517167 1519572 1522027 1522673 1520681 1517118 1513538 1510320 1507008
61573 1507008 1503741 1501277 1499672 1497881 1495123 1491877 1489023 1486542 1483740 1480387 1476848 1473270 1469421 1465409
61559 1465409 1461811 1458844 1455854 1451836 1446142 1438782 1430615 1423256 1418042 1414740 1411785 1407944 1403091 1397301
61545 1397301 1390253 1382169 1374443 1368327 1363501 1358756 1353791 1349478 1346602 1345188 1344957 1345669 1347048 1349007
61531 1349007 1351982 1356603 1363148 1371653 1382058 1393752 1405604 1417317 1430137 1445118 1461182 1476377
61519 1476377 1490823 1506778 1525760 1547375 1571383 1598955 1630683 1664872 1699325 1733959 1770283
61508 1770283 1808963 1849365 1891159 1934894 1980875 2028515 2077021 2125999 2175258 2224509 2273179
61497 2273179 2320109 2363802 2403729 2441151 2477867 2514270 2549302 2581893 2611337 2636505 2656278
61486 2656278 2671246 2683748 2695308 2704774 2709874 2710069 2707047 2702749 2697773 2691601 2683587 2673641 2662682
61473 2662682 2652691 2645820 2643039 2643755 2646908 2652250 2660546 2672926 2690278 2713010 2741053 2774180 2812599
61460 2812599 2857262 2909449 2970140 3039843 3118693 3206407 3302554 3407657 3524043 3654746 3801172
61449 3801172 3962386 4137065 4325555 4529594 4750837 4990515 5249838 5529152 5826385
61440 5826385 6137274 6457332 6782578 7107828 7425208 7725153 7998477 8237014 8433037
61431 8433037 8579482 8671404 8707223 8688662 8619804 8506193 8354631 8173361 7971551 7757549
61421 7757549 7537401 7315359 7095535 6882170 6678362 6485803 6306417 6143330 5999455
61412 5999455 5875750 5771435 5685156 5615262 5559984 5518720 5492772 5483581 5490404 5510639 5542118
61401 5542118 5583945 5635364 5695167 5762391 5836390 5915869 5998833 6083775 6170064 6256974 6343406
61390 6343406 6428938 6514042 6598574 6680988 6759816 6835161 6907918 6978162 7045303 7109409 7171404
61379 7171404 7231939 7290687 7346605 7398275 7444117 7483017 7515022 7541066 7561861 7577142 7585857
61368 7585857 7586929 7580101 7566380 7547566 7525129 7499515 7470476 7437708 7401227 7361816 7321404 7282385
61356 7282385 7246091 7212540 7182046 7155997 7134982 7116972 7098931 7080105 7062221 7046346 7031186
61345 7031186 7015023 6997743 6979789 6960357 6938228 6913943 6889782 6867835 6849302 6835579 6828652
61334 6828652 6830184 6841410 6864372 6902150 6957185 7030184 7121415 7232246 7364622 7519773 7698471
61323 7698471 7901957 8131203 8385377 8662239 8960013 9277340 9610876 9954121 10299356
61314 10299356 10639590 10967617 11274152 11548502 11781093 11964496 12092616 12160865 12168049 12117246
61304 12117246 12013924 11863280 11669554 11437161 11171586 10879110 10565995 10237924 9899943
61295 9899943 9556806 9213267 8873811 8542077 8220747 7912024 7617815 7339284 7076702
61286 7076702 6830255 6600998 6390667 6200493 6030308 5878827 5744701 5627356 5526948
61277 5526948 5443591 5376763 5325514 5289104 5267166 5259232 5264356 5281243 5308567 5345145 5390058 5442529
61265 5442529 5501280 5563994 5627979 5691729 5755435 5819525 5882961 5943402 5998904 6049037 6094437
61254 6094437 6135754 6173165 6206526 6235687 6260655 6281521 6298266 6310585 6317813 6318846 6312253 6296878
61242 6296878 6272511 6239714 6198880 6149961 6093378 6030702 5963795 5893476 5819639 5742585 5663569
61231 5663569 5583988 5504638 5426105 5349468 5276149 5207032 5141870 5079800 5020798 4966664 4919880
61220 4919880 4880875 4846881 4814422 4782659 4753207 4726693 4701020 4673730 4644870 4616339 4589157
61209 4589157 4562760 4536800 4512291 4490657 4472601 4458417 4448881 4445291 4448803 4459936 4478691 4505121
61197 4505121 4539878 4583872 4637089 4698280 4766638 4843781 4933161 5037112 5154949 5284033 5421786
61186 5421786 5565997 5713577 5859764 5998531 6123464 6228526 6308545 6359222 6376728 6357765
61176 6357765 6300628 6206472 6079469 5925676 5751610 5563369 5366380 5165441 4964780 4767946
61166 4767946 4577709 4396037 4224103 4062393 3911265 3771703 3645033 3531330 3428469
61157 3428469 3333634 3245757 3165667 3094031 3030353 2974223 2926016 2885346 2849954 2817546 2788208
61146 2788208 2763750 2745019 2731292 2722205 2718744 2721735 2730405 2743078 2758452 2775473 2792686 2808661
61134 2808661 2822936 2835728 2846581 2853833 2855795 2852321 2844926 2835283 2823753 2809578 2792220 2771945
61122 2771945 2748979 2722813 2692958 2659977 2625109 2589071 2551926 2513957 2475896 2438144 2400397
61111 2400397 2362261 2323788 2285217 2246496 2207184 2166595 2124198 2080335 2036421 1993903 1953091
61100 1953091 1913570 1875579 1840127 1807684 1777630 1749274 1722597 1697557 1673447 1649577 1626117
61089 1626117 1603580 1581635 1558986 1534376 1507504 1479110 1450418 1422432 1395623 1370124 1345939
61078 1345939 1322777 1300204 1278577 1259498 1244428 1232918 1223134 1214245 1207334 1203570 1202451 1202412 1202639
61065 1202639 1203744 1207145 1214052 1224487 1236908 1249317 1261038 1272961 1285982 1299882 1313857 1327181
61053 1327181 1339198 1349849 1360681 1373915 1389569 1404660 1416420 1425365 1433874 1442605 1449907 1454322
61041 1454322 1456007 1455664 1453522 1449724 1444626 1438337 1430695 1421861 1412365 1402612 1392961 1384066 1376282 1368966
61027 1368966 1361381 1354139 1348473 1344022 1338772 1331803 1324818 1319954 1317002 1314036 1310317 1307181 1305885 1305751
61013 1305751 1305104 1303349 1301193 1299009 1296087 1291968 1287735 1285078 1284367 1284564 1284965 1286104 1288749 1292920 1298215
60998 1298215 1304300 1310618 1316424 1321688 1327384 1334406 1342846 1352627 1363880 1376079 1387828 1398393 1408766
60985 1408766 1420420 1433935 1449681 1468681 1491318 1515943 1540282 1563840 1587685 1612513 1638535
60974 1638535 1666732 1698324 1732981 1769308 1807333 1848922 1895421 1946353 2000855 2058982 2121010
60963 2121010 2186792 2256589 2331539 2412492 2499072 2590491 2686651 2788018 2895033 3008186 3128301
60952 3128301 3256466 3393819 3541227 3698806 3866015 4042699 4229548 4427073 4635085
60943 4635085 4854365 5088075 5340029 5612175 5905339 6221944 6566170 6941837 7352182
60934 7352182 7801728 8296775 8844512 9453865 10136956 10907635 11779552 12769029 13899324
60925 13899324 15197793 16688155 18389373 20321891 22509430 24974888 27742256 30837175
60917 30837175 34251068 37862153 41383396 44427715 46682292 48062089 48718972 48922074
60909 48922074 48934249 48964507 49153357 49518318 49885279 49911522 49241135 47691727 45327892
60900 45327892 42384736 39133818 35796673 32527366 29423797 26538718 23892609 21490752
60892 21490752 19333798 17416964 15727312 14246490 12954606 11830461 10851179 9994406
60884 9994406 9240428 8572119 7975268 7440297 6961717 6534201 6150131 5801779 5484322
60875 5484322 5195294 4932121 4691445 4470013 4264889 4073102 3892052 3720131 3556470
60866 3556470 3400404 3251607 3110364 2977208 2852322 2735275 2625069 2520660 2421869 2329440
60856 2329440 2243546 2162670 2084900 2010060 1939532 1874264 1814074 1758633 1707631 1659953 1614181
60845 1614181 1570280 1529508 1492381 1458003 1425666 1395645 1367989 1341956 1317327 1294968 1275362
60834 1275362 1257813 1241812 1227902 1216340 1206138 1196525 1188255 1182370 1178522 1175592 1173171 1171334 1169693
60821 1169693 1167867 1166308 1165521 1164883 1163234 1160324 1156800 1153199 1149756 1146655 1143428 1138655 1131390 1122613
60807 1122613 1114154 1106336 1097837 1087904 1077731 1069406 1064118 1061447 1059846 1057879 1055620 1054736 1056710 1061310
60793 1061310 1067501 1075402 1086178 1099966 1115102 1129915 1144557 1160522 1178892 1199490 1221428 1243867
60781 1243867 1266227 1287882 1308011 1326028 1342215 1357498 1372356 1386331 1398894 1410266 1420772
60770 1420772 1429817 1436394 1440453 1443009 1444790 1445542 1444817 1442924 1440854 1439568 1439379 1439636 1439176 1437560 1435697
60755 1435697 1434599 1433700 1431291 1426593 1420337 1413041 1404021 1392892 1380983 1370031 1359933 1349054 1336588
60742 1336588 1323457 1310773 1298555 1286529 1275314 1265970 1258684 1252578 1246779 1241319 1237082 1235192 1236299
60729 1236299 1240061 1245297 1250937 1256849 1263613 1271616 1280699 1290593 1301341 1313219 1326480 1341237 1357356
60716 1357356 1374511 1392575 1411906 1432945 1455566 1479233 1503724 1529136 1555066 1580412 1604279
60705 1604279 1626609 1647647 1667344 1685691 1703023 1719268 1733186 1743048 1748072 1748870 1746812 1743373
60693 1743373 1739689 1736016 1731733 1726419 1720669 1715331 1710380 1705460 1701179 1698504 1696660 1692930 1685309 1674592
60679 1674592 1663145 1652213 1641239 1629465 1617196 1605321 1594062 1582612 1570069 1556687 1543982
60668 1543982 1533331 1524625 1516764 1509308 1502924 1498133 1494524 1491765 1490637 1492192 1496116 1500803 1505133 1509603
60654 1509603 1515505 1523440 1532876 1542789 1552316 1560849 1567990 1573702 1578303 1581963 1584215 1584319 1582127 1578223
60640 1578223 1573179 1567221 1560798 1554678 1548830 1541832 1532215 1520149 1506949 1493218 1478444 1462425 1446080
60627 1446080 1430616 1416503 1403359 1390047 1374981 1357332 1338230 1319906 1303329 1287517 1271444
60616 1271444 1255597 1241119 1228332 1216894 1206745 1198078 1190767 1184464 1178974 1174153 1169851 1166388 1164563
60603 1164563 1164831 1166927 1170577 1175805 1182176 1188654 1194912 1201891 1210154 1218460 1225145 1230515 1236714 1245355
60589 1245355 1256176 1267818 1279005 1289055 1298098 1306870 1315743 1324163 1331568 1338384 1345309 1352137 1358432
60576 1358432 1364999 1373226 1382915 1392252 1400384 1408757 1419222 1431874 1445530 1459461 1473732 1488481
60564 1488481 1503879 1520419 1538368 1557123 1575905 1594908 1614948 1635979 1656750 1676089 1693856
60553 1693856 1710412 1725925 1740695 1755463 1770493 1784627 1796172 1804823 1811783 1817568 1820475 1818009
60541 1818009 1809418 1796017 1779256 1759338 1735733 1708296 1677794 1646157 1616274 1590482 1568649
60530 1568649 1548481 1528388 1509458 1494051 1483148 1475945 1471401 1468950 1467839 1467008 1466025 1465392 1465575 1466339
60516 1466339 1467308 1468608 1470544 1473078 1476017 1479469 1483711 1488775 1494522 1501035 1508637 1517462 1527232 1537578
60502 1537578 1548442 1559956 1571934 1583728 1594801 1605340 1616044 1627286 1638677 1649464 1659172
60491 1659172 1667838 1675869 1683742 1691691 1699695 1707892 1716936 1727718 1740933 1757200 1777315 1801836 1830566
60478 1830566 1863154 1900141 1942627 1990671 2042542 2095625 2147446 2195793 2238750 2274870 2302614
60467 2302614 2319615 2323609 2314618 2295434 2269633 2240066 2209458 2180835 2156184 2135681 2119321 2108466
60455 2108466 2104662 2107747 2116243 2128908 2144851 2162994 2182880 2205368 2231190 2259472 2289227 2321690
60443 2321690 2359442 2403637 2453937 2510901 2576277 2650865 2734213 2826932 2931207 3048174 3176671
60432 3176671 3315696 3466433 3630562 3807965 3997791 4200986 4420454 4659502 4921591
60423 4921591 5211139 5532869 5889844 6282495 6708752 7163296 7635425 8107368 8554849
60414 8554849 8950050 9266084 9480994 9579549 9553436 9402282 9135747 8773561 8341412 7865196
60404 7865196 7367514 6866788 6376980 5907382 5463508 5048896 4666163 4316845 4001021
60395 4001021 3717377 3463532 3236585 3033781 2852770 2691182 2546357 2415959 2298677
60386 2298677 2194021 2101435 2019746 1947146 1881526 1821208 1765746 1715786 1671743 1632721 1596971
60375 1596971 1563199 1531175 1501283 1473804 1448508 1424702 1401792 1379895 1359644 1341222 1323877
60364 1323877 1306615 1289157 1272013 1255906 1241345 1228513 1217338 1207782 1200036 1194043 1188859 1183046
60352 1183046 1176079 1169054 1163811 1161544 1162160 1164386 1166465 1167485 1168386 1171113 1176489 1183457 1190555 1197224
60338 1197224 1203339 1208606 1213304 1218744 1225890 1233996 1241676 1248885 1256723 1265518 1274278 1282057 1288799 1294711
60324 1294711 1299843 1304576 1309627 1315043 1319816 1322789 1323453 1321645 1317339 1311313 1305385 1301113 1298397 1295855
60310 1295855 1292513 1288698 1285445 1283539 1283202 1284220 1286165 1288641 1291436 1294342 1296893 1298665 1300076 1302628
60296 1302628 1307886 1316131 1326137 1336252 1345487 1353774 1361762 1370511 1380880 1392799 1405491 1418634
60284 1418634 1432838 1448511 1464813 1480468 1495249 1509780 1524086 1537332 1549063 1559753 1569950
60273 1569950 1579742 1589344 1599359 1610101 1621468 1633852 1648357 1665583 1684852 1704908 1724405 1741126
60261 1741126 1751882 1754517 1749709 1739906 1726851 1710890 1692247 1671805 1650579 1629153 1607825 1586863
60249 1586863 1566701 1548098 1531853 1518063 1506133 1495802 1487537 1481456 1476646 1472243 1468424 1465449
60237 1465449 1462593 1459284 1456690 1456689 1459377 1462895 1465595 1467054 1467104 1465522 1463191 1462228 1464184 1468827 1475004
60222 1475004 1481786 1488524 1495019 1502292 1512222 1525556 1540875 1556155 1570758 1585414 1600974 1617948
60210 1617948 1636660 1656898 1677607 1697590 1716534 1735025 1753836 1773503 1794171 1815414 1836536
60199 1836536 1857596 1880042 1905945 1936661 1972355 2012544 2056783 2104974 2157228 2213481 2273535
60188 2273535 2337856 2407992 2485461 2570312 2661711 2760003 2866991 2983665 3108783 3240612
60178 3240612 3379313 3526620 3683643 3849857 4023841 4203898 4387976 4573675 4758441
60169 4758441 4939448 5113706 5278756 5432881 5574101 5699512 5806364 5893344 5960123 6006449
60159 6006449 6032941 6042251 6037824 6021499 5993736 5956308 5913197 5868333 5823909 5781720 5744705 5715968
60147 5715968 5697283 5689889 5695973 5717860 5756134 5810108 5880182 5968230 6075185 6199410 6338079
60136 6338079 6489180 6651203 6821468 6995831 7169928 7339872 7501668 7650835 7783161
60127 7783161 7895550 7985789 8051817 8091788 8104933 8092007 8054855 7995789 7917384 7822374 7713519
60116 7713519 7593975 7468162 7341835 7220579 7108279 7007487 6920982 6851953 6802541 6773302
60106 6773302 6764636 6777722 6812991 6868443 6940841 7028351 7130536 7245484 7368242 7492792 7614503
60095 7614503 7729966 7835543 7927635 8004241 8065174 8110841 8141835 8159848 8167893 8169127 8166101
60084 8166101 8161628 8159765 8165328 8182680 8215209 8265405 8334869 8424632 8536080 8671392 8832664
60073 8832664 9020962 9236949 9482245 9759319 10069947 10414355 10791909 11201749 11642330
60064 11642330 12111036 12604781 13120437 13653829 14198417 14745588 15286329 15812248 16315239
60055 16315239 16786917 17218798 17602790 17931359 18197573 18395445 18520518 18570401 18544954 18445747
60045 18445747 18275010 18035297 17730840 17369534 16963159 16525250 16068573 15604123 15141399
60036 15141399 14688839 14254303 13845753 13471193 13137218 12847407 12602492 12402115 12246182
60027 12246182 12134766 12067309 12041825 12054155 12097742 12164846 12248677 12344187 12446558 12549286
60017 12549286 12644311 12724044 12783082 12818240 12827582 12809767 12764132 12690935 12591058 12465311 12314276
60006 12314276 12139094 11942180 11726751 11495864 11252487 11000309 10743475 10485265 10227936
59997 10227936 9974416 9729371 9497889 9283681 9089299 8917341 8770178 8648858 8553620
59988 8553620 8485615 8446884 8438247 8458203 8504456 8575732 8671413 8789847 8927757 9081091 9245926
59977 9245926 9418339 9593409 9764358 9923202 10063098 10180219 10272871 10338859 10374655 10377364
59967 10377364 10346487 10283211 10188790 10064606 9913406 9739724 9549239 9348134 9142474 8937315
59957 8937315 8736415 8543198 8361673 8195849 8048722 7922529 7819567 7741724 7689434 7662199
59947 7662199 7660276 7684832 7736279 7813622 7916161 8044900 8201286 8384856 8592788 8821342
59937 8821342 9066717 9324411 9588507 9852026 10107699 10348406 10567549 10759656 10920732
59928 10920732 11047916 11138983 11192283 11206822 11182004 11117518 11014179 10875233 10706644 10515942
59918 10515942 10310961 10099493 9889278 9687429 9499737 9330734 9184029 9062073 8965868
59909 8965868 8895750 8852573 8837609 8851167 8891947 8957942 9047390 9158591 9289383 9437257 9599455
59898 9599455 9772481 9951940 10133343 10312848 10486932 10651972 10804979 10944601 11070780
59889 11070780 11183623 11283320 11371171 11449839 11522183 11590207 11655589 11721144 11791598 11872939 11971056
59878 11971056 12090844 12236377 12411646 12620802 12867646 13155133 13485319 13859243 14276358
59869 14276358 14734045 15227679 15750747 16294671 16848756 17400470 17935296 18436214 18884327
59860 18884327 19261286 19551774 19744302 19831119 19808955 19680073 19451866 19135202 18743276 18291320
59850 18291320 17795810 17272893 16737360 16202696 15681146 15183090 14716390 14286306 13895971
59841 13895971 13547444 13243116 12986146 12778910 12621124 12510324 12444398 12422804 12444913 12507908
59831 12507908 12606903 12736481 12891302 13065453 13251897 13442466 13627718 13796714 13937575
59822 13937575 14038871 14090949 14086647 14021733 13895154 13708647 13465818 13171511 12832029 12455520
59812 12455520 12051595 11630130 11200172 10769555 10344966 9931937 9534855 9157215 8801927
59803 8801927 8471206 8166228 7887208 7634064 7406927 7205913 7030327 6878064 6745844
59794 6745844 6630394 6529648 6442507 6367152 6300057 6237335 6176821 6118200 6061450 6006305 5953149
59783 5953149 5902852 5855100 5808189 5761490 5716981 5676820 5639994 5602691 5561725 5516280 5466606
59772 5466606 5412765 5355277 5295805 5236350 5178226 5122132 5068531 5017562 4969233 4924164 4883778
59761 4883778 4849343 4821254 4799546 4784728 4777594 4778378 4786405 4800553 4819953 4844389 4874216 4910016
59749 4910016 4952476 5002603 5061557 5129834 5206745 5291029 5381562 5476902 5574374 5670470 5762335
59738 5762335 5848479 5928232 6001154 6067112 6126376 6179492 6227466 6272079 6315634 6360326 6408172
59727 6408172 6461419 6522646 6594661 6680559 6783301 6904574 7044608 7204237 7386857 7597218
59717 7597218 7838359 8110882 8415168 8752875 9125904 9535093 9980194 10459459 10967829
59708 10967829 11495718 12029360 12550490 13034566 13451279 13770525 13970885 14044606 13997072 13843435
59698 13843435 13605013 13305898 12969823 12617793 12266710 11928952 11613190 11326010 11072831
59689 11072831 10857284 10680429 10541450 10439227 10373034 10342049 10344921 10380240 10447412 10546906
59679 10546906 10679332 10844092 11039271 11263378 11517050 11802576 12122061 12476851 12868491
59670 12868491 13298981 13769788 14281788 14836786 15438164 16089243 16791732 17546364 18354205
59661 18354205 19216299 20132473 21101220 22120045 23184689 24288000 25420209 26570093
59653 26570093 27725243 28871836 29995871 31085939 32135305 33142003 34107710 35036661
59645 35036661 35935026 36810520 37671513 38525038 39374306 40217525 41048674 41858794 42636418
59636 42636418 43367619 44036681 44627443 45125228 45519378 45805256 45983968 46060427 46042729 45943581
59626 45943581 45780759 45574575 45344958 45111187 44893001 44710027 44579783 44516871 44533724 44641227
59616 44641227 44848659 45163752 45592589 46138633 46801893 47579254 48464735 49447964 50512201
59607 50512201 51634368 52786479 53935781 55043422 56064318 56949522 57649891 58120016
59599 58120016 58322538 58232311 57839187 57149157 56184179 54979850 53580481 52033761 50387747
59590 50387747 48689348 46981385 45298607 43666238 42101944 40617576 39217725 37896965
59582 37896965 36639377 35421243 34215411 32996330 31745412 30455289 29130809 27785991
59574 27785991 26438851 25107370 23808217 22556744 21365738 20243243 19192333 18213743
59566 18213743 17308117 16475182 15711749 15012121 14370590 13782875 13245639 12755909 12310975
59557 12310975 11907671 11541662 11208491 10905504 10631503 10384116 10158836 9951497 9760595
59548 9760595 9585939 9425375 9273974 9126280 8978553 8828966 8676784 8522004 8365268
59539 8365268 8207276 8048156 7887732 7726605 7566706 7410577 7260359 7117711 6984190
59530 6984190 6860912 6747868 6644542 6551427 6470110 6401428 6344463 6297998 6262017 6236812 6221331
59519 6221331 6213755 6213472 6221379 6238250 6263655 6296373 6335070 6378805 6427767 6483210 6545653 6613472
59507 6613472 6684564 6759167 6839523 6926668 7019348 7116805 7221089 7335607 7462562 7603076
59497 7603076 7758772 7931640 8122387 8330225 8554596 8796484 9057786 9339821 9642680
59488 9642680 9965773 10308679 10671157 11052172 11449151 11858451 12276287 12698681 13120785
59479 13120785 13537153 13942964 14334376 14707400 15056849 15376736 15661544 15907358 16112473
59470 16112473 16277298 16403689 16494636 16554634 16589325 16603501 16599797 16580693 16551853 16522292 16501062
59459 16501062 16494907 16509148 16548973 16618751 16720979 16856506 17024394 17220269 17435443 17658631
59449 17658631 17878010 18080975 18253157 18379473 18446357 18442641 18359554 18191944 17940028 17609153
59439 17609153 17207681 16745620 16234743 15688340 15119901 14542159 13967232 13406658 12870411
59430 12870411 12365693 11896671 11465272 11072425 10718877 10404989 10130038 9892359 9690425
59421 9690425 9523272 9389703 9288066 9217674 9179677 9175202 9202843 9259218 9342051 9451572 9588503
59410 9588503 9751909 9939797 10150914 10384697 10639524 10911874 11197269 11491130 11788002
59401 11788002 12080135 12357373 12608750 12824337 12995942 13116894 13181935 13187543 13132052 13015362
59391 13015362 12838889 12606133 12323205 11998452 11641221 11260609 10864784 10460969 10055716
59382 10055716 9654933 9263462 8884714 8520991 8174230 7846366 7539041 7253259 6989280
59373 6989280 6746624 6524191 6320743 6135442 5967752 5816975 5682241 5563011 5459152
59364 5459152 5370266 5295100 5231733 5178275 5133584 5097651 5071204 5054552 5046820 5046669 5053709 5068874
59352 5068874 5093537 5128516 5173353 5225395 5279458 5329576 5372138 5407701 5440138 5474468 5514946
59341 5514946 5563835 5621441 5687942 5765231 5855948 5960279 6074691 6194453 6316942 6442562
59331 6442562 6573941 6715218 6871008 7044651 7237613 7451153 7687793 7950320 8240278
59322 8240278 8558743 8908043 9291293 9710501 10166632 10661675 11199264 11782794 12413745
59313 12413745 13092134 13817500 14588578 15402143 16252331 17130598 18026089 18926472 19818741
59304 19818741 20689441 21525088 22313903 23047817 23722478 24335431 24885098 25371609 25797356
59295 25797356 26165501 26477799 26733867 26931681 27067780 27137052 27133236 27050414 26884444 26633456
59285 26633456 26297364 25877182 25375049 24795339 24145874 23437621 22682693 21892437 21077232
59276 21077232 20247426 19413586 18585625 17771992 16979827 16215409 15484028 14789547 14134569
59267 14134569 13521116 12950841 12424411 11940954 11498373 11094218 10726346 10393226 10093864
59258 10093864 9827143 9590832 9381539 9196163 9033385 8893285 8775551 8678382 8599045 8534894
59248 8534894 8483829 8444269 8414918 8394260 8380360 8371597 8367457 8367832 8371343 8375142 8376794 8375783 8372780
59235 8372780 8368033 8361137 8351996 8341362 8330565 8321267 8315407 8314867 8321076 8335191 8358646 8393317 8441083
59222 8441083 8503254 8580447 8673087 8782116 8908905 9054065 9216249 9392335 9578625 9771520
59212 9771520 9967331 10162195 10352248 10533364 10700847 10850202 10978363 11083411 11162994 11213995
59202 11213995 11234368 11224558 11186595 11122383 11033566 10922759 10794264 10653434 10505218 10352899
59192 10352899 10198111 10042358 9888166 9738076 9592955 9452570 9317678 9189975 9069696
59183 9069696 8955017 8844649 8739542 8641120 8549550 8465315 8391005 8329515 8281183 8244804 8221179
59172 8221179 8213702 8225338 8256857 8308538 8382166 8480571 8606202 8760917 8946561 9165046 9418078
59161 9418078 9707085 10033261 10397480 10799970 11239454 11712121 12211611 12730161 13258998
59152 13258998 13787111 14300321 14782453 15217165 15588378 15880298 16078885 16173791 16158908 16032381
59142 16032381 15797690 15464276 15045556 14556054 14010844 13426428 12819644 12205023 11594159
59133 11594159 10997357 10424065 9881094 9371685 8896943 8457318 8052531 7681359 7342405
59124 7342405 7034483 6755980 6504553 6277854 6073959 5891034 5727362 5581786 5453218
59115 5453218 5339554 5237998 5146790 5065897 4995897 4937044 4889399 4852597 4824999 4804122 4788540
59104 4788540 4778821 4776298 4781666 4794870 4815398 4842223 4874286 4911414 4954053 5001959 5054051 5109809
59092 5109809 5169672 5233684 5300691 5369301 5438592 5507466 5574466 5638882 5700906 5759920 5813686
59081 5813686 5860121 5898988 5930968 5956042 5973838 5984720 5989289 5987449 5979311 5966690 5952525 5938974
59069 5938974 5927005 5917630 5912301 5911991 5916918 5927580 5945408 5972085 6008590 6055187 6112073 6179841
59057 6179841 6259329 6351079 6454995 6570725 6698186 6837343 6987574 7147984 7318381 7499203
59047 7499203 7690314 7890894 8101034 8322354 8556078 8801075 9054783 9315520 9582710
59038 9582710 9854930 10128728 10399337 10661359 10908209 11131565 11322121 11470979 11570437 11614158
59028 11614158 11597610 11518950 11379532 11183253 10935303 10641852 10310913 9952500 9576708 9191473
59018 9191473 8802664 8415808 8036383 7668313 7313553 6973791 6651411 6348009 6063019
59009 6063019 5795004 5543728 5309942 5093572 4893162 4706951 4533603 4372090 4221766
59000 4221766 4082552 3954282 3835788 3725290 3621836 3525796 3437682 3356791 3281271 3209552
58990 3209552 3141725 3079370 3023656 2973680 2927228 2883104 2841818 2803718 2767557 2731684 2695799
58979 2695799 2660519 2625839 2591120 2556319 2522194 2489519 2459026 2431778 2408281 2387203 2366304
58968 2366304 2345230 2326493 2313061 2305505 2301978 2300437 2300217 2301658 2304852 2309004 2312935 2315946 2318035
58955 2318035 2319277 2319459 2318635 2317667 2317668 2319040 2321538 2325193 2330526 2337710 2346017 2354438 2362701 2371489 2381693
58940 2381693 2393396 2405538 2416688 2426232 2434672 2442752 2450660 2458230 2465398 2472002 2477500 2481496 2484437
58927 2484437 2487485 2491889 2498763 2508970 2522502 2538149 2554401 2570642 2587114 2604117 2621952 2641356
58915 2641356 2663053 2686799 2711653 2737302 2764476 2794024 2826387 2862075 2901630 2944621 2989471
58904 2989471 3034965 3081387 3129642 3179905 3231842 3285574 3341307 3398140 3454401 3509642 3565676
58893 3565676 3625085 3689011 3756721 3827141 3900444 3978118 4061642 4151110 4245161 4342436 4443063
58882 4443063 4548560 4660391 4779106 4904967 5038763 5181457 5333338 5494082 5663546
58873 5663546 5842118 6030664 6230846 6445249 6676083 6923455 7185781 7462399 7755156
58864 7755156 8067154 8400804 8757584 9138736 9545222 9977754 10437927 10928811 11453341
58855 11453341 12012562 12606648 13237176 13906943 14617735 15369899 16164138 17001662 17881641
58846 17881641 18799848 19750500 20727773 21723900 22726581 23719554 24685032 25604301 26456633
58837 26456633 27219511 27870584 28389198 28757229 28960983 28993811 28856823 28557183 28106461
58828 28106461 27520540 26819332 26024682 25157802 24238421 23285447 22317165 21350200 20398347
58819 20398347 19472248 18579595 17725243 16911588 16139743 15410861 14726088 14085079 13485056
58810 13485056 12921899 12392229 11894303 11427314 10990266 10581377 10198141 9838112 9500050
58801 9500050 9184046 8890093 8617019 8363455 8129249 7914719 7718660 7538365 7371802
58792 7371802 7218721 7079551 6954451 6843770 6748056 6666824 6598373 6541531 6496725 6464684
58782 6464684 6445121 6437519 6442210 6459589 6489107 6530152 6583173 6648715 6726018 6814077 6913707 7027012
58770 7027012 7154733 7295452 7447754 7612059 7789988 7983048 8192560 8420066 8666917
58761 8666917 8933709 9220737 9528948 9860137 10216277 10598999 11009759 11450311 11922783
58752 11922783 12429348 12972040 13553071 14175075 14840674 15551695 16308680 17110616 17954583
58743 17954583 18835865 19748766 20686735 21640782 22597911 23541966 24455599 25320081 26113394
58734 26113394 26810659 27387930 27825481 28108014 28224373 28169346 27945551 27562504 27034037
58725 27034037 26377028 25611267 24758464 23840355 22877488 21888870 20891689 19901004 18929442
58716 18929442 17986347 17077057 16204087 15369709 14576721 13826585 13118345 12450368 11822012
58707 11822012 11232623 10680224 10162676 9679188 9229084 8809829 8417893 8051177 7708993
58698 7708993 7389999 7091810 6812656 6551925 6308822 6081765 5869386 5671098 5486355
58689 5486355 5314160 5153486 5003467 4863036 4731058 4606943 4490774 4382850 4283312 4191581
58679 4191581 4105624 4022505 3940592 3860815 3785037 3713804 3646462 3582641 3522288 3464758 3409165
58668 3409165 3355373 3303553 3253094 3203135 3153797 3105731 3058717 3011804 2964389 2915965 2865364
58657 2865364 2811743 2756031 2700001 2644188 2588178 2532575 2478854 2427245 2376451 2325752 2275927
58646 2275927 2227916 2182025 2138629 2098142 2059963 2022827 1986538 1951963 1919078 1886529 1853598
58635 1853598 1821149 1790043 1759975 1730496 1701906 1674345 1647189 1620239 1594551 1571265 1550304
58624 1550304 1530900 1512751 1496216 1481956 1470727 1462808 1457371 1453367 1451239 1452706 1458346 1466377 1474483
58611 1474483 1482040 1489827 1498206 1506287 1512579 1516051 1516749 1515515 1512875 1508438 1501860 1494045 1486582 1480279
58597 1480279 1475136 1471235 1468338 1464915 1459265 1451912 1445507 1441993 1441129 1442088 1445001 1450295 1457789 1467405
58583 1467405 1479798 1495517 1514195 1535179 1558271 1583407 1610273 1638831 1669711 1703718 1741196
58572 1741196 1781863 1824843 1869288 1915801 1966863 2024704 2088976 2157681 2230081 2307245 2390007
58561 2390007 2478220 2572256 2673493 2782881 2900617 3027687 3166120 3316965 3479479 3653059
58551 3653059 3838794 4038457 4253061 4482780 4726926 4983476 5249849 5524477 5805986
58542 5805986 6090208 6369439 6635225 6880235 7096894 7276308 7410202 7493017 7521596 7494789
58532 7494789 7414862 7287944 7121491 6922127 6696639 6453254 6199908 5941948 5682944 5426955
58522 5426955 5178528 4941078 4716667 4507056 4313714 4136877 3975410 3827540 3691479
58513 3691479 3566042 3451148 3347008 3252366 3164337 3080434 2999906 2922794 2848921 2778451 2712229
58502 2712229 2650708 2593396 2539848 2490063 2443376 2398231 2353724 2310134 2267347 2224208 2180198
58491 2180198 2136207 2092726 2048917 2004589 1961459 1921024 1882547 1844595 1807242 1771288 1736552
58480 1736552 1702639 1670433 1641234 1615131 1591570 1570569 1551998 1534622 1517366 1500775 1485776
58469 1485776 1471810 1457624 1443203 1429494 1416917 1405544 1396062 1388989 1383229 1376631 1367690 1355952
58457 1355952 1341536 1325235 1308375 1291626 1274666 1257642 1241623 1226707 1211261 1194425 1177885
58446 1177885 1163480 1150457 1137046 1123578 1111910 1102599 1094752 1088012 1082545 1077541 1071920 1066496 1063557
58433 1063557 1064041 1066393 1068093 1067184 1062922 1056473 1050666 1047599 1046678 1046006 1044902 1043641 1041722 1038459 1034870
58418 1034870 1032837 1032345 1031417 1028964 1026039 1023863 1022194 1020293 1018490 1018038 1019697 1022657 1024879 1024989 1024012
58403 1024012 1024330 1026514 1028358 1027810 1025626 1024007 1023798 1024299 1024850 1025211 1025169 1024961 1025296 1026002 1025787 1024341 1023242
58386 1023242 1023474 1023590 1021962 1019307 1017173 1015361 1012953 1010498 1008848 1006916 1003027 997737 992996 989266
58372 989266 985737 982764 981705 982701 984637 986873 989159 990583 990577 990144 990107 989258 986490 983576 983018 984145
58356 984145 984427 983918 985048 988286 991452 993596 996395 1001235 1007825 1016287 1027676 1041469 1055004 1066451
58342 1066451 1076339 1085517 1093823 1101461 1109629 1118787 1127984 1136537 1144719 1152333 1158340 1162429 1165332 1167209
58328 1167209 1167309 1165610 1163306 1161381 1160001 1159229 1158925 1158316 1157423 1158511 1164021 1173242 1183148 1192376 1202142
58313 1202142 1213279 1224808 1235753 1246201 1256145 1265173 1273611 1282218 1290702 1298389 1306209 1315970 1327718
58300 1327718 1339891 1352086 1365471 1380454 1396105 1411984 1428421 1444886 1460121 1473910 1486828
58289 1486828 1498482 1508074 1516370 1524801 1532932 1539252 1544187 1549904 1557414 1566275 1576646 1588813 1601093
58276 1601093 1611298 1620255 1631018 1644732 1660062 1676367 1694160 1712619 1730134 1747562 1767569
58265 1767569 1790400 1813472 1835468 1857697 1881173 1905665 1931856 1961064 1992375 2023300 2053505
58254 2053505 2084611 2116317 2146493 2175274 2205073 2236059 2265658 2293127 2320525 2348340 2374460
58243 2374460 2398502 2422960 2448761 2473766 2497182 2521550 2548798 2578033 2608747 2642541 2680136
58232 2680136 2720118 2761959 2806843 2854456 2902592 2950852 3001001 3052996 3104981 3157965 3215667
58221 3215667 3278468 3342451 3406010 3472301 3543204 3616016 3688698 3763630 3843399 3927339 4015002
58210 4015002 4108815 4210275 4317284 4427897 4543200 4664185 4789440 4918039 5051204 5189487
58200 5189487 5332193 5480815 5638587 5805342 5977747 6156001 6345050 6547693 6762261
58191 6762261 6988860 7231536 7491732 7765888 8052451 8355458 8678402 9020626 9382571
58182 9382571 9768143 10178776 10611619 11066925 11550871 12067900 12617025 13198934 13819399
58173 13819399 14481628 15182148 15918029 16691245 17502757 18350664 19238466 20177180 21175228
58164 21175228 22234723 23361499 24568777 25865513 27250667 28724346 30294776 31969226
58156 31969226 33749874 35645754 37677457 39861920 42203000 44704437 47381150 50251479
58148 50251479 53332763 56654918 60266746 64220920 68567465 73372131 78727184 84735332
58140 84735332 91499862 99140626 107802826 117644890 128845708 141634553 156274873 172983362
58132 172983362 191875942 213003770 236427370 262287800 290880145 322562132 357169693
58125 357169693 393016582 426339202 452125350 466136952 466714019 455084787 434257783
58118 434257783 407593813 377938305 347383567 317331519 288645518 261829296 237171003
58111 237171003 214810925 194770821 176993756 161385858 147835466 136216135 126388263
58104 126388263 118202853 111511174 106174803 102054612 98984738 96775769 95244055 94185786
58096 94185786 93275131 92025868 89947097 86789427 82638003 77781789 72532320 67151134
58088 67151134 61854873 56805637 52092393 47750802 43799166 40242393 37059031 34211703
58080 34211703 31668764 29403265 27380452 25563513 23927146 22453101 21118345 19899479
58072 19899479 18782897 17759117 16812294 15925879 15093685 14315480 13586350 12899414 12253914
58063 12253914 11651326 11087641 10557758 10063033 9606243 9183397 8788293 8420453 8080188
58054 8080188 7759873 7448606 7142713 6844476 6553983 6269806 5994590 5732324 5482116
58045 5482116 5241052 5010598 4793815 4588920 4392024 4203708 4026494 3858209 3694386
58036 3694386 3535432 3385336 3244856 3111744 2986066 2869577 2761108 2657979 2560972 2472911
58026 2472911 2393329 2319040 2248864 2183436 2121675 2061748 2004395 1951377 1901919 1854282 1809083
58015 1809083 1767260 1726709 1684957 1643398 1604899 1569014 1533513 1498661 1465844 1433898 1401216
58004 1401216 1369804 1342762 1319147 1295823 1273092 1253951 1238647 1224355 1209684 1195498 1181808
57993 1181808 1167647 1153530 1140600 1127833 1113367 1097892 1083680 1071231 1059908 1050521 1043804 1037490
57981 1037490 1028592 1017715 1007783 999524 991697 984677 980024 977187 974212 971176 969599 969140 968259 967408
57967 967408 968190 970067 971219 971763 972629 972236 968302 962393 958563 957594 956425 953237 949118 944442 937648
57952 937648 928548 919259 910736 901402 890338 879114 869293 860390 851324 842025 832861 824042 815910 808396
57938 808396 800427 791485 783303 778042 775325 773151 771194 770898 772791 775948 779623 783175 785109 784730 783994
57923 783994 784993 786285 784772 780721 777565 776783 776287 774281 771548 769240 767209 765385 764413 764066 763009
57908 763009 760671 757698 754538 751443 749421 748906 747850 743810 737748 732971 730411 727885 724063 719975
57894 719975 716046 710822 703641 695956 689154 683430 679386 678038 678522 678486 677681 678432 681573 684722 685967
57879 685967 686629 688658 691595 693948 695681 697486 699053 699664 699249 697500 693210 685794 676459 666744 656838
57864 656838 646099 634219 621251 607642 594798 584354 576300 568997 561501 554607 549339 545930 544657
57851 544657 545988 549323 553161 557114 562219 568773 575502 581446 586970 592397 597473 602883 610269 619671
57837 619671 628716 635576 641160 647195 653657 659363 663767 666835 668291 668262 667672 666807 664299 658722 650518
57822 650518 641361 632247 623127 613854 604652 595930 588116 581360 575303 569624 564767 561445 559606 558788
57808 558788 559199 561238 564217 566958 569568 573222 578345 584458 591575 599919 608336 615033 620001 624739
57794 624739 629427 632637 634068 635102 635921 634584 630032 623775 617378 610330 601704 591985 581913 571427
57780 571427 561133 552857 547100 541619 534310 525984 518693 512748 507172 501743 496680 491364 485131 478472
57766 478472 471929 464796 456546 448522 442358 437403 431437 423476 414239 404260 393262 381357 369594
57753 369594 359113 350403 343192 336600 329970 323991 320140 318486 317194 315049 313232 313487 315695 318707
57739 318707 322596 328377 335911 343553 349834 354563 358524 362774 367894 373322 377893 381435 385005 389233
57725 389233 393643 398195 403932 411060 417789 422508 425882 429288 432280 433258 431863 428916 424569 418268
57711 418268 410355 402180 394597 387420 380133 372205 363101 353067 343598 336235 331250 328232 327266 328568
57697 328568 331573 335394 339572 343564 346470 348422 351334 356926 364649 372877 381254 390412 400189 409968
57683 409968 420344 432544 446236 459442 470747 480398 489403 498797 509557 521849 534386 545785
57671 545785 556344 567273 578480 588646 597396 605794 614538 623232 631856 641573 653526 667919 684663
57658 684663 703795 724669 745741 765990 786013 807167 830053 854220 878952 903898 929034
57647 929034 954267 979311 1004247 1030265 1059258 1092185 1128284 1166437 1207012 1251750 1302001
57636 1302001 1357422 1416153 1475973 1535676 1595610 1656515 1718072 1779668 1842766 1911059 1987500
57625 1987500 2072477 2165789 2269042 2384781 2514408 2658525 2818428 2995660 3190784 3404099
57615 3404099 3636827 3889865 4161856 4450159 4753150 5069545 5395396 5723130 6042791
57606 6042791 6341779 6603108 6806717 6934916 6977514 6933412 6809906 6620994 6383935 6114884
57596 6114884 5826735 5529806 5232685 4941880 4661962 4396706 4149253 3920961 3711342
57587 3711342 3519736 3346264 3190878 3052640 2930609 2824548 2734011 2657254 2591670 2534976
57577 2534976 2485730 2443276 2407811 2380379 2362268 2354038 2354852 2362847 2376694 2396909 2424982 2461176
57565 2461176 2504241 2553793 2611683 2680007 2758867 2847344 2945575 3054298 3173299 3302188 3442179
57554 3442179 3594970 3759763 3932979 4110936 4291180 4471096 4646687 4812717 4962516
57545 4962516 5087713 5180145 5234857 5250341 5226073 5161640 5058652 4921906 4757893 4573161
57535 4573161 4374127 4166800 3955909 3745165 3538407 3339115 3148677 2966730 2793691
57526 2793691 2631486 2481419 2342862 2214646 2096254 1987016 1885580 1791060 1703686 1623735
57516 1623735 1550904 1485111 1426526 1374268 1326379 1281658 1240269 1202175 1166579 1133539 1104388
57505 1104388 1079552 1057535 1037137 1019142 1004492 992105 980024 967819 956532 947032 939590 934314
57493 934314 930912 928736 928036 930306 936374 944989 954452 964903 977843 994027 1012996 1034157 1057211
57480 1057211 1081942 1108599 1138182 1171488 1208242 1247783 1290146 1335812 1384981 1437778 1494557
57469 1494557 1555459 1620491 1690768 1768704 1855935 1951790 2054755 2164684 2282351 2407607
57459 2407607 2539420 2677395 2821721 2971299 3122798 3271676 3413517 3544237 3659464
57450 3659464 3753972 3822117 3859661 3865472 3840960 3787862 3707710 3603666 3481356 3346843 3204531
57439 3204531 3057724 2909934 2764491 2623716 2489529 2363989 2248207 2141612 2043489 1954400
57429 1954400 1874943 1804144 1740638 1684670 1637200 1597560 1563736 1534811 1511587 1494747 1483809
57418 1483809 1477965 1476731 1479739 1486981 1499242 1517211 1540240 1567027 1597497 1632932 1674376 1721973
57406 1721973 1775759 1835885 1902134 1974502 2054333 2143619 2242893 2350839 2465999 2587531 2713991
57395 2713991 2842683 2970721 3095599 3213996 3320982 3411172 3480073 3523880 3538957 3522643
57385 3522643 3474466 3396167 3291018 3163653 3019921 2865749 2705795 2543415 2381714 2223914
57375 2223914 2072426 1928029 1790555 1660314 1538317 1424930 1319012 1219096 1125152 1038365
57365 1038365 959244 886882 820177 758803 702585 650920 603390 560097 520669 483792 448523
57354 448523 415390 385306 358120 333146 310400 290042 271079 252003 232668 214436 198491
57343 198491 184995 173789 164802 157459 150610 143380 135579 127256 118505 109775 101720 94658 88722 84399
57329 84399 82162 81369 80322 77888 74661 72146 70955 70114 68193 64933 61458 58799 56653 54147 51382
57314 51382 49208 47598 45500 42521 39411 36290 31855 25344 18059 11649 5858 -605 -7672 -13888 -18357
57299 -18357 -21396 -23531 -25155 -26982 -29676 -33075 -36595 -40007 -42838 -43629 -41266 -36920 -33337 -32141 -32834
57284 -32834 -34208 -35437 -35744 -34326 -31125 -26985 -22768 -18761 -14688 -9728 -2978 5270 13224 19435 24585
57269 24585 30377 37167 43850 49641 54685 59290 64012 70363 79888 92245 105296 117280 128068
57256 128068 138374 148728 159171 169119 177739 185294 193705 204930 219247 235931 254663 274983
57244 274983 295476 315336 336122 360032 386900 414825 443297 473559 506135 540326 576266
57233 576266 615291 657979 703650 751856 802265 853002 901563 947933 994758 1043923 1094940
57222 1094940 1146906 1199490 1251353 1300223 1345694 1389658 1432830 1473127 1508763 1540570 1569618
57211 1569618 1594647 1613812 1627177 1635437 1637623 1632213 1619582 1601684 1580184 1556414 1532142 1508797
57199 1508797 1486715 1466539 1450484 1440781 1437604 1439803 1446833 1458716 1474914 1494650 1517646 1543290
57187 1543290 1569752 1595124 1618883 1641122 1661049 1677450 1690165 1700182 1708700 1716807 1725347 1734431
57175 1734431 1743800 1754291 1767933 1785953 1807791 1832767 1861387 1894178 1930720 1971025 2016413
57164 2016413 2067590 2123021 2180595 2239785 2300631 2361682 2420750 2477218 2532277 2587435 2643779
57153 2643779 2701780 2760535 2817967 2872881 2926094 2978670 3030217 3079956 3128074 3174583 3218173
57142 3218173 3257836 3294479 3329325 3361833 3391022 3417734 3443622 3468811 3492578 3515582 3539281
57131 3539281 3563570 3586924 3608585 3628845 3647522 3663943 3678190 3690805 3701575 3710077 3717007 3723354
57119 3723354 3728714 3732110 3734125 3736492 3739794 3743176 3746123 3748895 3751331 3752827 3753564 3754307 3754830 3753822 3750493
57104 3750493 3745343 3739256 3732549 3724861 3715589 3704898 3694485 3686317 3680060 3672886 3662277 3647488 3627752
57091 3627752 3601450 3568626 3532258 3494933 3455810 3412812 3366180 3317626 3267422 3214618 3158857
57080 3158857 3099592 3034558 2961294 2879237 2788433 2687548 2575314 2452361 2319128 2173123
57070 2173123 2010413 1828136 1623015 1389123 1120068 811989 461709 63729 -387771 -895575
57060 -895575 -1461325 -2089567 -2787076 -3560095 -4415565 -5363241 -6413243 -7573895 -8856058
57051 -8856058 -10277660 -11860001 -13621922 -15581975 -17763839 -20194937 -22902890 -25919598
57043 -25919598 -29287509 -33057492 -37284337 -42031041 -47374752 -53401986 -60201455 -67869012
57035 -67869012 -76515464 -86259545 -97212528 -109469291 -123096280 -138105205 -154435912
57028 -154435912 -171970625 -190553077 -209990081 -230085031 -250736080 -271974513 -293765047
57021 -293765047 -315636348 -336499873 -354912399 -369590012 -379733954 -384982370 -385203208
57014 -385203208 -380407689 -370814967 -356920978 -339478580 -319406083 -297663068 -275122845
57007 -275122845 -252486790 -230272697 -208848842 -188460580 -169242516 -151246277 -134486752
57000 -134486752 -118975424 -104725732 -91746354 -80035301 -69571201 -60303506 -52153133
56993 -52153133 -45024007 -38813169 -33415033 -28726465 -24653490 -21113124 -18031086 -15342228
56985 -15342228 -12992546 -10936389 -9131499 -7539713 -6131052 -4882692 -3774094 -2786630
56977 -2786630 -1906894 -1125569 -432374 184644 735230 1226136 1664636 2059312 2416906
56968 2416906 2741398 3036478 3305871 3550853 3770474 3964960 4136367 4285442 4410651
56959 4410651 4511382 4590301 4651987 4701033 4741741 4777711 4811153 4843832 4878377 4916878 4958496
56948 4958496 5000335 5040322 5077706 5112363 5147110 5189549 5245766 5308849 5355778 5358417 5297987
56937 5297987 5170377 4982210 4745165 4472159 4174551 3860710 3537005 3209879 2886592
56928 2886592 2574418 2279425 2005547 1754598 1527509 1325348 1148487 995139 861745
56919 861745 744781 641364 548667 464416 388183 320899 262779 212793 170180 135138 107713
56908 107713 87230 73197 65607 64013 67414 75482 88904 108145 132730 161929 195041 230738
56896 230738 267217 303438 339069 372786 401816 424033 439839 451392 460627 468516 475545 482135
56884 482135 488653 495204 501280 505940 509022 512048 517193 525504 536793 550705 566632 582942 598049
56871 598049 612480 628212 645263 660276 669283 670803 665619 654779 638936 618837 595331 569237
56859 569237 541832 515014 490340 468234 448440 430773 415226 401989 391612 384364 379300 374926
56847 374926 371070 368863 368379 367717 365471 362982 362780 365465 369403 373090 376546 380539 385581 391874 399462
56832 399462 408213 417989 428706 439993 451303 463003 476917 494886 516724 540049 562052 581162
56820 581162 597379 611589 624453 635567 643909 649379 653491 658037 663392 668625 673017 677064 682341
56807 682341 690829 703964 721741 742979 766872 793767 823864 855766 887173 916613 943437 966364
56795 966364 983215 992325 993401 986950 973879 956099 936512 917530 899910 883668 869856 860692
56783 860692 857820 860961 868689 880376 897000 919942 949399 984335 1023638 1066600 1112169 1158371
56771 1158371 1202607 1241698 1271296 1286473 1284417 1266687 1238042 1203131 1164935 1125939 1089014
56760 1089014 1056149 1027123 1000640 976829 957833 945621 939717 937690 937946 941622 951405 968689
56748 968689 992374 1020236 1050579 1081900 1111487 1135221 1149054 1150636 1139954 1119096 1091444 1060400
56736 1060400 1028330 996423 965268 935381 907454 882547 861909 846218 834975 826998 821591 819101
56724 819101 820358 825677 834282 844657 855712 867477 880022 891499 898160 897087 888384 874058 855519
56711 855519 833317 808741 783872 759698 735445 710313 684971 660900 639291 621177 607525
56700 607525 598029 590334 581672 571341 560976 552439 546067 540920 536067 531318 527029 523497 520543 517723
56686 517723 514903 512498 511073 510869 511692 513051 514405 515483 516283 516481 515158 511869 507887 505371 504911
56671 504911 504849 503622 501787 500751 500233 498523 495169 491924 490484 490362 489882 488555 487363 486807 485864 483527
56655 483527 480624 479071 479291 479426 477679 474670 472531 472066 471972 470829 468633 466042 463325 460815 459388
56640 459388 459424 459879 459473 458432 458025 458572 458999 458470 457573 457558 458954 461167 463100 464112 464664 465890 468213
56623 468213 470565 471371 470107 467574 465110 463997 464976 467470 469722 470666 471225 472790 475002 476490 477442
56608 477442 479480 482799 485349 485667 484895 484916 485903 486970 488063 489628 491153 491644 491356 491730 493616 496523
56592 496523 499523 501970 503352 503273 501765 499176 495938 492775 490598 489407 487809 484589 480420 476962 474540
56577 474540 471951 468602 465476 463498 461967 459290 454638 448442 441760 435647 430690 426729 423201 419904
56563 419904 417065 414674 412317 409932 408165 407622 408030 408436 407998 406572 404829 403844 404144 405093 405579 405293
56547 405293 404835 404603 404240 403330 401922 400146 398030 396042 395124 395667 397014 398488 400357 403161 406517 409355
56531 409355 411160 412376 413741 415760 418619 422005 425034 426861 427313 426600 424715 421822 419054 417987 419043
56516 419043 421140 423242 425556 428706 432355 435536 438034 440514 443254 445656 447394 449228 452061 455774
56502 455774 459818 464508 470632 477713 483880 487969 490853 493992 497539 500858 504323 509154 515506 521807
56488 521807 526405 529137 531076 533400 536676 540391 542981 543096 541182 538945 536995 534188 530004 526239
56474 526239 524954 525469 525046 522273 518222 514270 510512 506859 504156 502934 502106 500210 497455 495235 493809
56459 493809 491804 488330 484474 481980 481062 480291 478415 475588 472796 470584 468653 466492 464109 462018 460620
56444 460620 459738 458858 457689 456222 454348 451862 449005 446594 445196 444521 444087 444261 445874 448746 451391
56429 451391 452660 453172 454474 457028 459623 460860 460672 460129 460018 460106 459880 459632 460311 462224 464452 466001
56413 466001 467226 469436 473228 477930 482758 487680 492906 498386 504333 511444 519923 528845 537224 545168
56399 545168 553241 561203 568336 574528 579972 584144 586378 587403 588990 591692 594066 594518 593022 590576
56385 590576 587916 585379 583177 581119 578589 575446 572409 570095 568259 566440 564537 562060 557695 550814
56371 550814 542914 536234 531122 526103 520657 516433 514900 514924 513959 511195 508339 507163 507374 507402 506476 505046
56355 505046 503557 501907 500320 499767 500747 502095 501877 499501 496359 494277 493697 493512 492404 490148 487760
56340 487760 486410 486163 485944 484845 483180 482086 482525 484909 489079 493963 497767 499465 499939 500803 502337
56325 502337 503557 504106 504735 505756 506456 506645 507560 510267 514048 517348 519690 521668 523620 525416 527295
56310 527295 529850 533102 536369 539144 541478 543519 545295 547052 549143 551357 553004 554065 555756 559266
56296 559266 563983 567651 568659 567836 567531 569121 572069 575369 578844 582447 585223 586254 586352 587622 591123
56281 591123 595841 600123 603271 605535 607533 610158 614293 620002 626443 632953 639646 646614 653138 658272
56267 658272 661976 665391 670310 678302 689673 702981 716173 728431 740443 752928 765817 779023
56255 779023 792839 807087 820854 833822 846982 861283 876295 890958 905027 918921 932689
56244 932689 945959 958604 970795 982722 994690 1006994 1019211 1030240 1039666 1048487 1057818 1067504
56232 1067504 1076799 1085854 1095601 1106450 1117976 1129826 1142301 1156144 1172115 1190552 1211067 1233002
56220 1233002 1256385 1281882 1309686 1339290 1370717 1405025 1442986 1484303 1528929 1578294 1634163
56209 1634163 1696872 1765523 1839349 1917942 2000883 2088329 2181789 2283482 2395063 2517411 2651012
56198 2651012 2795834 2951372 3117557 3295066 3484118 3683547 3891626 4106790 4326683
56189 4326683 4547448 4765056 4976700 5179938 5371318 5546975 5703808 5838885 5948504
56180 5948504 6029339 6080240 6101947 6095738 6063532 6008607 5934762 5845018 5742061 5629202 5509579
56169 5509579 5384851 5255783 5123467 4988819 4851761 4712179 4570886 4428355 4283627
56160 4283627 4136216 3988056 3841532 3696382 3550788 3404991 3261536 3122285 2987537
56151 2987537 2857901 2734538 2617353 2505351 2399196 2301093 2211499 2128120 2049101 1975237
56141 1975237 1907924 1846559 1789331 1735584 1686192 1642111 1603222 1568306 1535970 1505892 1478738
56130 1478738 1454358 1430999 1407568 1385783 1368388 1355791 1346208 1338435 1332373 1327241 1321721 1316079
56118 1316079 1312065 1310668 1311878 1316384 1324974 1336153 1347039 1357144 1368813 1383494 1400211 1418405
56106 1418405 1439342 1463421 1488628 1513256 1538150 1564797 1593174 1622853 1654313 1687651 1721719
56095 1721719 1755956 1791330 1828082 1864257 1898096 1930330 1962664 1995561 2029130 2064756 2104221
56084 2104221 2148442 2198497 2256549 2324266 2401728 2489537 2590536 2707447 2839790 2985142
56074 2985142 3142765 3314101 3499918 3698295 3904930 4114040 4319309 4515515 4699929
56065 4699929 4872317 5034310 5188748 5337903 5480729 5611826 5723164 5806245 5853432 5860189
56055 5860189 5827888 5763379 5674430 5565871 5439849 5297510 5139197 4964803 4775758 4575992
56045 4575992 4370190 4162340 3956837 3759280 3574586 3405106 3251369 3113371 2990275
56036 2990275 2880554 2783796 2701156 2632851 2576594 2529694 2491216 2460693 2436212 2415506 2397911
56025 2397911 2383601 2371664 2360450 2349232 2338310 2327975 2318326 2309518 2301513 2294183 2288073 2284156
56013 2284156 2282533 2282395 2283478 2286328 2291099 2297641 2306873 2320242 2337542 2356924 2377034 2397114 2415457
56000 2415457 2430743 2445139 2462975 2485721 2511203 2538181 2568129 2601647 2637021 2673884 2714626
55989 2714626 2760251 2808254 2856466 2905615 2956233 3006856 3057529 3111271 3169359 3228804 3287317
55978 3287317 3347131 3410829 3477131 3544321 3614216 3688764 3765952 3843393 3923297 4009877 4104375
55967 4104375 4206443 4317432 4437709 4563093 4688811 4815435 4946923 5084725 5227974
55958 5227974 5377580 5535720 5702569 5877558 6062495 6259815 6469183 6689237 6921001
55949 6921001 7166281 7424692 7695642 7981139 8283382 8601976 8936763 9290496 9665307
55940 9665307 10059798 10473404 10910325 11375274 11869113 12392840 12951441 13548594 14181566
55931 14181566 14846652 15545684 16281832 17053807 17860831 18709406 19608791 20564014 21579784
55922 21579784 22666313 23833430 25083047 26414743 27834152 29348486 30960060 32674040
55914 32674040 34507351 36479390 38598015 40864543 43287965 45884925 48673126 51678369
55906 51678369 54944204 58523434 62466755 66833276 71706089 77183835 83364873 90355447
55898 90355447 98285939 107305881 117580609 129319328 142794818 158305642 176123173
55891 176123173 196490540 219638786 245752348 274918268 307074073 341757843 377504214
55884 377504214 411280028 438773515 455822580 460137402 452055957 433924964 408834594
55877 408834594 379649376 348636686 317447608 287203250 258622672 232154201 208048159
55870 208048159 186380329 167089537 150036818 135041835 121891861 110358289 100223304
55863 100223304 91290718 83384353 76356696 70098672 64526642 59559614 55117684 51135579
55855 51135579 47562002 44346240 41436968 38792666 36382150 34175531 32144432 30270085
55847 30270085 28541664 26946409 25468536 24096147 22820974 21632088 20517294 19469964
55839 19469964 18487768 17565754 16697230 15880117 15115475 14400257 13727651 13093761 12497961
55830 12497961 11937316 11406500 10902908 10426629 9975753 9546560 9137849 8750573 8383889
55821 8383889 8035787 7706587 7397572 7107293 6833224 6575522 6334729 6107219 5887599
55812 5887599 5674456 5469423 5272020 5080236 4895108 4719815 4554588 4396841 4245758
55803 4245758 4102691 3967697 3839739 3719469 3607525 3500515 3392792 3282027 3169586
55794 3169586 3056239 2941629 2827542 2717597 2613529 2514979 2422510 2337409 2258924 2185141
55784 2185141 2116283 2054003 1997949 1946314 1899091 1857420 1820281 1785282 1752271 1722898 1697134
55773 1697134 1673566 1652552 1635511 1621442 1607548 1593045 1579097 1565310 1549677 1531790 1512937
55762 1512937 1493178 1471282 1447235 1421893 1394803 1365399 1335474 1307203 1279625 1250707 1221906
55751 1221906 1196561 1174403 1151979 1128302 1105700 1085113 1065191 1046418 1031390 1019942 1008503
55740 1008503 995853 985520 980680 980185 981411 983703 987139 990832 994418 998768 1003678 1007098 1007994 1007620
55726 1007620 1006774 1004214 998995 992030 984222 975462 966548 959546 954859 950227 943909 936461 928139 917102
55712 917102 902016 884362 866347 848259 829439 810335 792004 774839 758974 744689 731555
55701 731555 718513 705510 693519 682423 670778 658383 647119 638224 630632 623074 616118 610955
55689 610955 607616 605233 602596 597890 589698 579023 568525 558999 548529 535802 522138 509256 497220
55676 497220 485892 476395 469680 465200 462181 460552 459607 457613 453962 449966 446369 441976 435993 429724
55662 429724 424443 419495 414108 409207 405641 402271 397792 392921 388884 385118 380563 376056 373349 372656
55648 372656 373075 374599 377749 381796 385216 387552 389315 390480 390481 389262 387119 384008 380213 377028 375476
55633 375476 374952 374273 373439 373108 373127 373045 373499 375623 379383 383841 388764 394730 401800 409212 416360 423209
55617 423209 429917 436660 443405 449250 452581 452667 450516 447434 443500 438368 432760 427932 424147 420778 417587
55602 417587 415027 413589 413650 415432 418400 421303 423687 426631 431025 435832 439284 441317 443606 447399 452364
55587 452364 457283 460826 461875 460272 457350 454927 453609 452572 450827 448080 444509 440341 435654 430253
55573 430253 423850 416538 408664 400104 390256 379097 367533 356414 345954 336437 328445 321689 314678
55560 314678 306545 298440 292017 287161 282364 277037 272280 269246 267512 265275 261016 255087 249654 246629
55546 246629 245649 244791 243152 241664 241276 241700 242436 243631 245194 246317 246744 247342 248579 249700 250245 250993
55530 250993 252198 252366 250333 247431 246005 246689 248646 251443 254982 258476 261398 264798 269910 276041 281682
55515 281682 287154 294168 303220 313471 324982 338863 355174 372737 391364 412238 435570 459707
55503 459707 483063 505171 525084 540482 549446 551891 548422 539065 524128 505264 484532 462998
55491 462998 440934 418725 396888 375774 355775 337354 320497 304839 290603 278688 269450 262187
55479 262187 256106 250866 245824 239959 233265 227274 223261 220727 218534 216732 216079 216230 215656 213339 209634
55464 209634 205577 202238 200729 201722 204499 207107 207979 207033 205040 202569 200094 198540 198642 199664 199664 197528
55448 197528 194268 191768 190702 190353 190014 189569 188746 186977 184429 182181 180785 179390 177024 174026 171393
55433 171393 169233 166744 163450 159558 155293 150650 145787 141145 137287 134901 134417 135066 134998 133233 130936
55418 130936 129783 129626 129033 127571 126003 124415 122040 119209 117599 117648 117344 114822 111004 108271 107248
55403 107248 106461 104955 103845 104884 108323 112576 115596 116335 115177 113293 111753 111214 112016 113932 115873
55388 115873 116604 116121 115740 116444 117692 118338 118118 117587 117046 116319 115344 114200 112628 110288 107545 105324 104069
55371 104069 103438 103083 103036 103261 103625 104596 107069 110804 113844 114435 113039 111414 110106 108181 105419 103193
55355 103193 102577 102976 103631 105376 109403 114816 118944 120158 119238 117879 116984 116645 116705 116741 116209 115163 114391
55338 114391 114608 115960 118265 120890 122329 121068 117437 113681 111648 111186 111296 111749 112626 113253 112916 112222
55322 112222 112567 114416 117068 119895 122860 125830 128286 129791 130076 128721 125426 120635 115267 109876 104584
55307 104584 99733 95960 93571 92338 91871 91712 91259 90180 88844 87821 87113 86426 85999 86394 87444 88126
55291 88126 87664 86266 84695 83630 83534 84624 86638 88844 90417 90873 90404 89970 90632 92444 94292 95102
55275 95102 94742 93407 90859 87102 83274 80930 80647 81965 84218 86519 87536 86575 84834 84301 85324
55260 85324 86299 85850 84221 82412 81096 80756 81786 83880 86065 87698 88730 88779 87036 83693 80593 79699
55244 79699 81300 84093 86463 87349 86589 84984 83595 82621 81459 79989 78986 78913 79171 79017 78381 77326
55228 77326 75786 74586 75507 79031 82846 84201 83298 82722 83702 84749 84369 83353 83352 84486 85729 86890
55212 86890 88672 90962 92383 91872 89713 86727 83342 80014 77772 77475 78788 80621 82400 84300 86441
55197 86441 88599 90717 92931 94912 95892 95636 94794 93983 93081 91717 89891 87717 85220 82924 81964 82896
55181 82896 84798 86348 87458 89042 91356 93424 94185 93559 92272 91095 90278 89381 87812 85882 85001 86111
55165 86111 88110 88653 86670 83539 81621 82076 84140 86142 87123 87737 89504 92898 96509 98511 98702 98536
55149 98536 99477 101923 105426 109027 111435 111801 110612 109280 108771 109061 109727 110350 110421 109709 108841 108740 109336
55132 109336 109536 108663 107234 106121 105620 105603 105951 106470 106781 106584 105757 104287 102547 101503 101971 103632 105420
55115 105420 106862 108234 109353 109197 107225 104402 102287 101434 100999 99666 96832 93240 90531 89855 90880
55100 90880 92398 93587 94198 93895 92406 90312 88820 88590 89456 91187 93592 95856 96826 96304 95250 94486
55084 94486 93991 93596 93358 92956 91769 90008 88843 88812 88985 88315 87055 86124 85844 86034 86807 88423 90685
55067 90685 93129 95631 98259 100794 102881 104568 106303 108316 110065 110460 109025 107152 107622 112052 119002
55052 119002 125330 129186 130916 131578 131919 132667 134250 135923 136467 136065 136205 137413 138537 138762 138830 139544 140457
55035 140457 140915 141181 141665 142220 142976 144520 146334 146508 144279 141572 140675 141492 142524 143386 144645 146055
55019 146055 146832 147214 148056 149230 149962 150463 151702 153772 155818 157390 158557 159044 158673 158398 159359 161023
55003 161023 161730 160967 159529 157546 154219 149866 146391 144945 144509 143529 141696 139302 136136 132131 128290
54988 128290 125817 124847 124961 126415 129744 134264 138023 139640 139668 139788 140880 142252 142723 142061 141047 140364
54972 140364 140001 139786 139714 139479 138489 137062 137022 140093 145782 151582 155246 156348 155873 155065 154729 154987 155382
54955 155382 155444 155131 154673 154311 154374 155038 155663 155068 153098 151341 151572 153942 157359 160933 164069 165784 165266
54938 165266 162996 160405 158614 158291 160043 163577 166782 167196 164562 160837 157686 155126 152567 149749 146551
54923 146551 143260 141249 141892 144385 146105 145768 144810 144936 145863 146624 147749 150471 154478 158126 160762 163377
54907 163377 166744 170049 171901 172103 171840 172322 173590 174741 175236 175788 177715 181462 186082 190257 193610
54892 193610 196945 201362 207190 213714 220008 226117 233046 241455 250921 260993 272281 285563 300215
54879 300215 314678 328426 342406 357337 372490 386334 397515 404988 408098 406959 402062 393355
54867 393355 380556 364566 347617 331491 316369 301738 287568 274119 261544 250284 241032 233620
54855 233620 226732 219487 212661 207552 204258 201906 200003 198704 198275 199295 202930 209802 218744 227760
54841 227760 236269 245295 255314 265158 273763 282052 292108 304813 319149 333606 347232 359115
54829 359115 367866 372496 373379 371439 366454 357182 343404 326993 310373 294551 279253 264287 249865
54816 249865 236038 222903 211250 202068 195400 190417 186498 183313 180060 175837 171052 167319 165470
54803 165470 164555 163286 161641 160542 160705 162339 165195 168297 170288 170772 170812 171552 172897 174141 175139 175967
54787 175967 175957 174276 171381 168805 167179 165267 161535 156274 151521 148838 147631 146074 143440 140834 139385
54772 139385 138503 136656 133450 130018 127547 126377 126502 127788 129419 130189 129833 129223 128922 128499 127855 128066
54756 128066 129972 132815 135392 137894 141278 145114 147548 147685 146851 146888 148020 149193 150204 152526 157669
54741 157669 165266 173446 180872 187611 193861 198909 202295 205217 209492 215358 221622 227975 235699 245724
54727 245724 257305 269314 281736 295135 309579 324916 341277 358422 375114 389764 401080
54716 401080 407792 408919 405228 399350 393265 386481 377897 368488 360383 353732 346452 337382 328012 320329
54702 320329 314201 307982 301075 294797 290690 288823 288340 289329 293174 300496 309465 317305 323346 329423 337332
54687 337332 347380 359802 375714 395414 417116 438832 460591 483414 507075 530417 552873
54676 552873 573596 589703 597759 597151 590202 578782 562765 542163 518734 494548 470390 446434
54664 446434 423117 400558 378458 357449 339237 324329 310889 297086 283537 272066 262978 255231
54652 255231 248667 244175 241562 238961 234827 229463 224080 219341 215365 212364 210452 209227 208122 207082
54638 207082 206510 206699 207564 208755 209768 210130 209754 209036 208367 207686 206829 206209 206653 208371 210455 211764 212168
54621 212168 212566 213643 214926 215320 214534 213757 214653 217611 221233 223967 226082 229338 234503 240073 244172
54606 244172 247015 250397 254990 259464 262462 264327 266384 269392 273291 277746 282297 286466 290201 293836
54592 293836 297425 300799 304479 309517 315798 321530 325337 328139 332098 338389 346966 357733 370542 384433
54578 384433 398226 411909 426504 442683 460441 479883 501203 523890 546963 569889 592216
54567 592216 612272 627397 635795 637445 633154 623610 609422 591264 569867 546558 523500 502282
54555 502282 482413 462459 442617 424695 409462 395757 382755 371355 362280 354274 345546 335942
54543 335942 326357 316942 307415 298553 291575 286127 280408 273615 267036 262218 258998 255963 252195 247835
54529 247835 243261 238467 233305 227887 222443 216984 211418 206037 201550 198414 196274 194346 192237 190139
54515 190139 188322 186725 184962 182531 179159 175154 171136 167159 162644 157682 153799 152461 153150 154048 154506
54500 154506 155547 157722 159793 160178 158775 156699 154948 153926 153651 153835 154210 155147 157351 160679 163977
54485 163977 166462 168353 169808 170409 170554 172168 176707 183110 189051 193728 198179 203211 208501 213727 219121
54470 219121 224534 229237 233342 238524 246512 257283 269340 281420 293368 305546 317883 329532
54458 329532 339148 345449 347842 346763 343404 338832 333191 325927 317030 307726 299293 291250 281632 269508
54444 269508 256554 245412 236952 229882 222788 215770 209991 206224 203973 201636 197596 191628 185312 180695
54430 180695 178478 177747 177371 177151 177516 178485 179312 179152 178022 176930 176824 177433 177643 177208 177461 179731 183480
54413 183480 186849 188945 190733 193475 197019 200073 201617 201542 200181 197971 195660 194253 194171 194580 194112 192560
54397 192560 191484 192631 195830 198972 200086 198961 196714 194380 192256 190063 187245 183414 178917 174796
54383 174796 171960 170603 170455 170958 170949 168996 164928 160592 158280 158555 160285 162439 164882 167473 169543 170753
54367 170753 171795 173617 176185 178391 179078 178064 176274 174950 174587 174704 174697 174645 174959 175644 176583 178370 181941
54350 181941 187019 191627 193777 193465 192626 193197 195503 198497 201274 204182 208451 214878 222967 231322 238657
54335 238657 244396 248598 251555 253407 253976 253053 250905 248298 246017 244557 244165 244574 244592 242739 238766 234002
54319 234002 229724 225851 221863 218238 215872 214559 213182 211281 209277 207200 204490 201288 198688 197216
54305 197216 196123 194840 194155 195018 196807 197752 196780 194293 191425 189305 188731 189731 191300 192106 191589 190207
54289 190207 188854 188474 189951 193636 198723 203565 206929 208897 210530 212816 215879 218940 221028 221872 222071
54274 222071 222286 222502 222419 222359 223138 224801 226016 225217 222174 218048 214031 210436 207067 203805 200501 196824
54258 196824 192783 189072 186246 183762 180556 176571 172862 170079 167807 165713 164223 163250 161367 157598
54244 157598 153500 151883 153465 156045 157164 156323 154388 152184 150349 149412 149084 148231 146290 144003 142043
54229 142043 139798 136520 132950 130597 129874 130131 131073 132778 134480 134901 134170 134052 135678 138097 139796 140631
54213 140631 141455 142601 143801 145135 146974 149107 150795 151677 151899 151445 150211 148898 148958 151064 154082 156121
54197 156121 156462 156092 156447 157930 159693 160642 160451 159520 158083 155901 153147 151042 150654 151060 149788 145736
54181 145736 140957 138702 140028 143019 145039 144903 143058 140820 139712 140611 142900 144986 146157 147440 150130
54166 150130 153971 157459 159693 161192 162917 165082 167065 168136 168112 167448 166658 165598 163664 160966 158971
54151 158971 159375 162371 166507 170127 172481 173480 173145 171726 170009 168997 169155 169965 170119 168379 164656 160397
54135 160397 157631 157488 159659 163029 166360 168457 168448 166405 163495 161099 159767 159102 158458 157551 156430 155167
54119 155167 153764 152419 151619 151551 151504 150520 148996 148886 151474 155438 158146 158744 158716 159242 159411 157775 154628
54102 154628 151611 149654 148333 147040 145806 145033 145142 146433 148608 150481 150910 150088 149320 149366 149583 148789
54086 148789 146424 142722 138365 134319 131502 130152 129725 129641 129901 130737 131981 133058 133460 132987 131745 130167
54070 130167 128967 128841 130113 132504 135025 136282 135519 133594 132406 132932 134100 133963 131720 128163 124549
54055 124549 121650 119796 119062 119159 119589 120166 121075 122297 123392 124008 124276 124495 124776 125214 125939 126618 126367 124880
54037 124880 123397 123698 125898 127964 127941 126273 125287 126531 129281 131824 133592 135439 138114 141182 143680
54022 143680 145177 145762 145483 144576 143990 144677 146124 146589 145336 143881 144199 146333 148744 150551 152147 153613
54006 153613 154010 152841 151248 150979 152661 155660 159115 162517 165654 168506 170910 172081 171110 168476 166423
53991 166423 166967 169913 173489 176460 178785 180782 182946 186412 192153 199374 205915 210869 215713 222108
53977 222108 229425 235549 239659 243153 247884 254391 262020 269947 277604 284586 290810 296855 303722 311951
53963 311951 321060 329998 338106 345355 351777 357123 361402 365291 369489 373800 377318 379471 380463 380772 380679
53948 380679 380348 379846 378850 376637 372585 366664 359562 352468 346424 341458 336547 330967 325388 321047 317976
53933 317976 314917 310975 306548 302443 298901 295708 292525 288891 284693 280864 278733 278319 278233 277706 277596
53918 277596 278665 279977 280112 279098 277931 276904 275826 275438 276905 279808 282058 282268 281201 280515 280906
53903 280906 281878 282645 282823 282683 282899 283624 283897 282482 279214 274907 270341 266271 264075 264748 266995 267924
53887 267924 266433 264611 264905 267204 269932 272842 276981 282503 288368 294208 300803 308354 315712 322021
53873 322021 328016 334892 342645 350260 356910 362132 365308 365953 364583 362605 361261 360992 361706 363118 364804
53858 364804 366542 368874 372893 379083 386565 393881 400397 406613 413198 420206 427432 435073 443549 452722
53844 452722 461805 470211 478141 486025 493620 500093 504938 508334 510498 511162 510062 507571 504270 500040
53830 500040 494314 487355 480602 475230 470766 465750 459487 452376 444628 435645 425182 414386 404807 396495
53816 396495 387883 377763 366898 357327 350310 345308 340926 336462 332247 328650 325304 321645 317835 314424
53802 314424 311093 306546 300047 292466 285183 278453 271668 264882 259009 254400 250216 245598 240628 235651
53788 235651 230433 224838 219841 216889 216271 216810 217151 216791 215910 214885 214117 213700 212995 211089 208067 205412
53772 205412 204676 206009 208244 210078 210799 210359 209489 209552 211377 213952 214919 212761 208187 203269 199837 199011
53756 199011 201339 206235 211584 215142 216719 218120 220550 223053 224234 224704 226516 230395 234820 238172
53742 238172 240749 244023 248656 254130 259978 266479 274036 282460 291066 299211 306612 313392 319833 325881
53728 325881 331033 335055 338713 343236 348893 354542 358909 361954 364625 367494 370117 371710 372053 371539 370551
53713 370551 369126 367371 366034 366147 367733 369092 368061 364213 359321 355349 352515 349773 346616 343530
53699 343530 340834 338100 335062 332348 330754 330076 329073 326471 321918 316183 310548 305677 301054 295888
53685 295888 290539 286356 283891 282115 279914 277552 275830 274377 271950 268202 264101 260583 257866 256220
53671 256220 256198 257558 258906 259201 258912 258923 258809 257238 253939 250415 248559 249105 251472 254528 257231 258968
53655 258968 259718 259916 260114 260788 262338 265015 268699 272828 276614 279463 281439 283318 285899 289100 292101
53640 292101 294560 297261 301103 305704 309673 312267 314227 316818 320469 324595 328395 331573 334320 336878
53626 336878 339199 341107 342794 344894 347830 351273 354561 357471 360123 362224 363046 362308 360605 358773 357196
53611 357196 355932 355037 354435 353818 353027 352160 351033 349035 346093 343319 341878 341372 340189 337573 334638 333089
53595 333089 333684 336191 339994 344090 347085 348126 347716 347017 346597 346432 346665 347305 347360 345603 342604 340774
53579 340774 341622 343890 345357 345678 346279 348049 350621 353799 358002 362836 366642 368442 369441 371563 375059
53564 375059 378584 381276 383648 386424 389516 392541 395653 399239 403105 406574 409504 412805 417576 423793
53550 423793 430276 436232 442415 450104 459023 467191 473120 477426 481778 486939 492621 498673 505299 512235
53536 512235 518739 524586 530308 536190 541737 546423 550422 554313 558537 563398 569042 575115 580795 585442
53522 585442 588797 590477 590011 587869 585780 585244 586088 587188 588240 589923 592372 594548 595549 595843 596641
53507 596641 598337 600140 601120 601122 600548 599649 598474 597412 597307 598541 600208 600796 599924 598922 599344 601289 603729
53490 603729 606061 608529 611243 613848 616421 619726 623971 628111 631304 634515 639542 646566 653762 659474
53476 659474 663742 667410 670946 674956 680955 690210 701950 713736 723888 732882 742273 752983 764966
53463 764966 778045 792472 808686 826648 845499 864056 881942 900071 919703 941204 964186
53452 964186 988492 1014245 1041033 1068065 1095413 1124138 1154745 1186404 1218273 1250709 1284309
53441 1284309 1318629 1352992 1388074 1425345 1465026 1505860 1547040 1589199 1633080 1678141 1722959
53430 1722959 1766329 1807584 1846617 1884231 1921884 1960314 1998666 2035558 2070839 2105819 2141869
53419 2141869 2179222 2216993 2254010 2289693 2324543 2359729 2395851 2432099 2466828 2498964 2528574
53408 2528574 2556138 2581673 2604800 2625420 2643943 2660776 2675749 2688286 2698108 2705564 2711044 2714148
53396 2714148 2713713 2708803 2699679 2687788 2674710 2660925 2645513 2627168 2605507 2581161 2554596 2525515
53384 2525515 2493921 2461239 2429542 2399667 2370808 2341945 2312852 2283536 2253619 2222935 2192166
53373 2192166 2162268 2133650 2106453 2081206 2058506 2038340 2020419 2005023 1992641 1982735 1973672 1964235
53361 1964235 1954724 1946270 1939682 1935374 1933965 1936257 1942721 1953322 1967576 1984360 2002042 2019639 2037881
53348 2037881 2058414 2081781 2106944 2133096 2161048 2192075 2226050 2261797 2299049 2338987 2382770
53337 2382770 2430521 2481905 2536616 2593799 2652042 2710890 2771773 2836492 2905077 2975815 3047142
53326 3047142 3118851 3191737 3266876 3345107 3426438 3509849 3594116 3678626 3762965 3846062 3926525
53315 3926525 4003696 4077678 4148591 4216540 4281973 4344915 4403899 4456790 4502848 4542961 4577756
53304 4577756 4606767 4629827 4647891 4661602 4670015 4671666 4666063 4653231 4632558 4603320 4566037 4522295
53292 4522295 4473368 4419792 4362170 4301526 4238719 4173973 4107026 4037524 3965441 3891400 3816390
53281 3816390 3741050 3665695 3591234 3519262 3450616 3384418 3319169 3254343 3190309 3127357 3065632
53270 3065632 3005520 2947211 2890289 2834676 2781501 2731939 2685562 2641079 2598495 2559226 2524035
53259 2524035 2492237 2463167 2436986 2413427 2390995 2368288 2345304 2322659 2300258 2277627 2255106
53248 2255106 2233838 2214638 2197359 2181247 2165638 2150648 2137436 2127344 2120507 2115848 2112737 2111954
53236 2111954 2114463 2120008 2127646 2137007 2147983 2159706 2171247 2183327 2198021 2216379 2237408 2259978
53224 2259978 2284694 2312935 2344669 2378323 2412570 2447242 2482397 2517458 2551662 2584724 2616499
53213 2616499 2646403 2673675 2697996 2719446 2738062 2753867 2767142 2778096 2786183 2790230 2789466 2784271
53201 2784271 2775888 2765591 2753960 2740519 2724053 2703736 2680098 2654485 2627517 2598540 2566755
53190 2566755 2532364 2496261 2459124 2421237 2382801 2343894 2304292 2263771 2222451 2180613 2138508
53179 2138508 2096717 2056350 2018366 1982758 1948719 1915439 1882375 1849095 1815422 1781760 1748937
53168 1748937 1717775 1688887 1662500 1638157 1614967 1592539 1571290 1551467 1532472 1513718 1495566
53157 1495566 1478579 1462433 1446568 1431493 1418174 1406277 1394288 1381407 1367997 1353984 1338280
53146 1338280 1320399 1301389 1282275 1262693 1242163 1221850 1203607 1187407 1170955 1152159 1131342
53135 1131342 1110758 1092363 1076317 1061405 1046544 1031582 1016643 1001254 984759 967406 950163
53124 950163 933337 916207 898300 880232 862812 846072 829702 813754 798215 782587 766709
53113 766709 751502 738061 726351 715625 705695 696727 688047 678318 667130 655526 644706 634954
53101 634954 626021 617834 610427 603663 597251 590655 583049 574082 564783 556874 550730 544791 537485 529005
53087 529005 520551 512596 504919 497854 492173 487694 483190 478061 473069 468806 464367 458557 451896 446236
53073 446236 442418 439387 435899 432203 429492 428299 428090 428007 427378 425753 423101 419955 416874 413831 410552
53058 410552 407296 404671 402664 400442 397373 393750 390277 387206 384262 381153 377885 374711 372007 370055
53044 370055 368814 367912 366912 365478 363381 360507 356879 352617 348065 343997 341210 339590 338025 335931
53030 335931 334442 335248 338396 342179 345215 347660 350189 352809 355204 357430 359690 361967 364349 367108
53016 367108 370045 372369 373677 374446 375108 375377 375032 374601 374457 373900 372012 368865 364993 360233 354247 347805
53000 347805 342220 337491 332178 325403 317979 311228 305548 300613 296328 292930 290408 288268 285858 282840
52986 282840 279413 275966 272428 268251 263351 258595 254841 251879 249011 246265 244133 242303 239856 236917
52972 236917 235010 235235 236879 238330 238711 238031 236429 234088 231618 229755 228595 227582 226242 224636 223092
52957 223092 221764 220480 218920 216951 214840 213077 211969 211483 211370 211229 210553 209070 207173 205675 205057
52942 205057 205136 205518 206098 206962 208005 208849 209083 208483 207137 205462 204183 204094 205468 207426 208319 207453 206338
52925 206338 207250 210289 212917 213091 211774 211290 212025 212327 211244 209685 208735 208356 208272 208768 209924 211098 211949
52908 211949 213158 215412 218364 221312 224219 227372 230591 233539 236390 239469 242564 245169 247090 248291
52894 248291 248514 247605 245878 243794 241787 240855 242494 247122 253047 257994 261474 264870 269399 275017 281220
52879 281220 287815 294483 300315 304491 307279 310090 314427 320543 327004 331914 334900 337533 341388 346062
52865 346062 349779 351620 352424 353680 356338 360578 365688 369864 371091 368920 364987 361328 358535 355948
52851 355948 353223 351001 349899 349417 348235 345635 342406 340189 339943 341157 342411 342461 340891 338203 335411
52836 335411 333177 331249 329127 327280 326825 327740 328413 327795 327037 327775 329432 329844 328524 327625 329125 332270
52820 332270 334605 334722 333192 331489 330833 331745 333911 336402 338252 338838 337847 335566 333386 333159 335412 338681
52804 338681 341166 342545 343524 344134 343640 342068 340784 341057 342647 344309 345320 345935 346422 346311 344986 342814
52788 342814 341087 340679 341218 341936 342954 344991 348020 351008 353200 354873 356602 358449 360229 361820 362642
52773 362642 361661 358835 356067 355537 357217 359031 359523 359303 359555 360125 359838 358149 355787 354099 354213 356478
52757 356478 359950 362632 363020 361684 360794 361823 364089 365872 366572 367184 368756 370941 372367 372061 370162
52742 370162 367447 364603 362021 359878 358081 356183 353567 349828 345136 340302 336349 333679 331543 328614
52728 328614 324299 319343 314959 311490 308142 303967 298844 293430 288371 283776 279475 275606 272717 271091
52714 271091 270041 268209 264785 260298 255993 252532 249661 247164 245618 245648 246640 246908 245475 243119 241148
52699 241148 239575 237411 234598 232492 232031 232386 232100 230756 228617 225426 220837 215753 211825 209534 207896
52684 207896 206114 204255 202127 198878 194401 189876 186126 182642 179187 177174 177964 180561 182583 183145 183288
52669 183288 183807 184263 184368 184772 185874 186895 186807 185497 183618 181928 181001 180877 180700 179548 177860 177095 177488
52652 177488 177180 174459 170161 166843 165985 166915 168225 169234 169964 170420 170314 169249 167095 164267 161535 159427
52636 159427 158009 157350 157768 159315 161341 163079 164389 165549 166533 167000 166858 166345 165578 164532 163570 163551 165124
52619 165124 167993 170997 172956 173479 173030 172264 171487 170931 171236 173048 176098 179335 182208 185209 188888 193103
52603 193103 197697 203128 209433 215186 218672 220045 221209 223335 225473 225982 224574 222361 220424 218995
52589 218995 217770 216401 214611 212162 209019 205544 202521 200667 199891 199239 197891 196064 194484 193113 191069
52574 191069 187983 184833 183118 183562 185852 189215 192787 195744 197596 198398 198387 197484 195422 192333 188930
52559 188930 185995 183862 182448 181668 181590 182152 182926 183383 183330 182842 181768 179808 177356 175720 175839 176848 176677
52542 176677 174296 170981 169124 170082 173249 176887 179586 181130 182271 183683 185243 186500 187678 189656
52528 189656 192812 196287 198727 199578 199461 199477 200243 201413 201985 201292 199824 198876 199392 201395 204429 207945
52512 207945 211066 212777 213089 213610 216127 220548 224885 227393 228225 228754 229869 231438 233126 235015 237169
52497 237169 239080 240056 240128 240155 240915 242308 243629 244462 245124 246322 248508 251428 254152 255754 256201 256443 257427
52480 257427 259166 260932 262151 262847 263469 264589 266454 268454 269437 269138 268948 270489 273578 276444 277805
52465 277805 277812 276998 275530 273976 273649 275373 278555 282175 286027 290147 293595 294963 294091 292467 291717 292117
52449 292117 292637 292125 290350 288073 286160 284778 283688 283102 283511 284610 285246 284809 283970 283568 283598 283903 284939
52432 284939 286906 288765 289276 288565 287668 286933 286073 285509 286154 287800 289061 289336 289655 291052 293112 294844
52416 294844 296175 297727 299613 301251 302285 303131 304466 306325 307730 307499 305744 304167 304209 305157 305134 303930
52400 303930 303526 305306 308020 309456 309284 309048 309818 311061 311702 311323 310231 309115 308753 309417 310395 310633 309867
52383 309867 308666 307516 306694 307011 309529 313887 317820 319268 318562 317645 317500 317485 317117 317099 317924 318542 317572
52366 317572 315376 313782 313815 314656 315042 314786 314440 314095 313149 311038 307900 304664 302614 302493 303840 305474
52350 305474 306649 307379 307722 307555 307192 307395 308384 309632 311125 313806 317930 321749 323008 321378 318543 316346
52334 316346 315842 317641 321709 326737 330859 333256 334352 334521 333607 331845 330242 329700 330378 331979 333920
52319 333920 335223 335144 334065 333072 332605 332346 332289 332921 334284 335913 337728 339898 341869 342958 344064 347161
52303 347161 352503 357840 361152 362787 364148 365883 368485 373078 379842 386700 391347 393959 396348 399106
52289 399106 401395 403259 406149 410857 416395 421450 425853 430189 434842 439864 445119 450196 454624 458279
52275 458279 461296 463802 466280 469837 475237 481770 487935 493189 498232 503611 508995 513949 518608 523366
52261 523366 528593 534817 542447 551108 559977 569041 579280 591222 604021 616534 628879 642211 657126
52248 657126 672876 688381 703633 719670 737098 755120 772563 789739 808538 830442 855058
52237 855058 880903 906906 932678 958118 983674 1010496 1039438 1070127 1101670 1133772 1166357
52226 1166357 1198568 1229164 1257693 1284413 1309404 1332752 1355235 1377589 1399191 1418625 1435552
52215 1435552 1450888 1465171 1478011 1489320 1499755 1509502 1517715 1523720 1527847 1530606 1531850 1531240 1528846
52202 1528846 1524985 1520165 1515357 1511512 1508586 1505860 1503358 1501948 1501961 1502858 1504493 1507442 1511700 1516518 1522087
52187 1522087 1529889 1540411 1551965 1562981 1574281 1587596 1602900 1618887 1635441 1653763 1674115
52176 1674115 1694951 1714562 1732507 1749256 1765298 1780832 1795680 1809348 1821533 1832336 1841552
52165 1841552 1848272 1851911 1853102 1852583 1849596 1842657 1831935 1819650 1807732 1795866 1782203 1765402 1745676
52152 1745676 1724391 1702885 1681410 1659151 1635556 1611487 1588581 1567638 1548157 1529260 1510399
52141 1510399 1491275 1471910 1453002 1435596 1420227 1406744 1394813 1383892 1372776 1360249 1346658
52130 1346658 1334076 1324275 1316934 1310336 1303512 1297028 1291793 1287684 1283658 1278985 1273979 1269496 1265925 1262916
52116 1262916 1259860 1256276 1251868 1246755 1241689 1237445 1233766 1229590 1224631 1219936 1216354 1213198 1209197 1204146
52102 1204146 1198700 1193090 1187116 1181061 1175500 1170368 1165288 1160607 1156912 1153606 1149344 1144060 1139241 1135748
52088 1135748 1132693 1129043 1125085 1121432 1117608 1112734 1106957 1101305 1096659 1093683 1093058 1094616 1096590 1096925
52074 1096925 1095421 1093772 1093481 1094454 1095632 1096220 1096072 1095474 1094782 1093906 1092168 1089188 1085987 1084568 1086016 1089395
52058 1089395 1092841 1095488 1098061 1101866 1107723 1115880 1126414 1139171 1153334 1167609 1181297 1195091
52046 1195091 1210389 1227815 1246810 1266729 1287801 1310765 1336086 1363962 1394738 1428602 1464972
52035 1464972 1502716 1541021 1579657 1618370 1656470 1693133 1727833 1760503 1791548 1821722 1851521
52024 1851521 1880452 1907164 1930417 1949718 1965119 1977019 1986484 1995073 2003549 2010886 2015243 2015945 2013876
52011 2013876 2009801 2003178 1993228 1980612 1967168 1953989 1940500 1925553 1908844 1890969 1872686 1854640
51999 1854640 1837598 1822366 1809506 1799295 1791829 1786863 1783642 1781262 1779246 1777708 1777056 1777725 1779969
51986 1779969 1783668 1788466 1794239 1801178 1809203 1817802 1826833 1837006 1848802 1861268 1872837 1883284 1893836
51973 1893836 1905106 1915897 1924525 1930521 1934433 1936754 1937787 1937890 1936836 1933311 1926107 1915735 1903877
51960 1903877 1891168 1876462 1858717 1838770 1818583 1799060 1779253 1757600 1733489 1707494 1680400
51949 1680400 1652240 1622439 1590758 1557788 1524232 1490053 1454881 1419136 1383965 1349746 1315399
51938 1315399 1279832 1243624 1208487 1175192 1142829 1110116 1076644 1042595 1008155 973917 941242
51927 941242 911299 883864 857725 832063 806698 781228 755141 729088 704897 683550 663900
51916 663900 644303 624837 606895 590969 576075 561307 546857 533266 520764 509674 500452 492701
51904 492701 484998 476519 468218 461514 456269 451059 445195 439466 434696 430522 426059 421156 416470 412499
51890 412499 409004 405357 401175 396598 392097 388088 384629 381365 377685 373057 367521 361937 357391 354049
51876 354049 350755 346191 340369 334677 330400 327516 325043 322240 319214 316400 313748 310526 306018 300404
51862 300404 294928 291090 289629 290192 291783 293346 294065 293499 291770 289619 288108 287984 289109 290505 291092
51847 291092 290405 288561 285619 281366 275884 270075 265304 262496 261583 261627 261314 259612 256422 252657 249478
51832 249478 247371 246098 245429 245529 246425 247372 247170 245248 242262 239427 237398 235940 234643 233533 232793 232240
51816 232240 231595 231183 231954 234637 239063 244197 248588 251001 251273 250607 250434 250770 250343 248539 246431 245408
51800 245408 245536 246165 247573 250870 256369 262998 269531 275591 281157 285822 288981 290278 289597 287138 283938
51785 283938 281810 281975 283705 284772 283490 280205 276800 274943 274964 276216 278052 280182 282321 284070 285307
51770 285307 286292 287149 287601 287418 286823 286192 285788 286004 287246 289133 290577 291408 293140 296919 301175 302817
51754 302817 300776 296969 293580 290988 288967 288222 289338 291141 291645 290432 289022 289002 290561 292708 294108
51739 294108 293727 291381 287906 284585 282526 282485 284537 287414 289030 288556 287422 287355 288043 288018 287442 288444 292433
51722 292433 298300 303671 306903 307588 306361 304893 305040 307087 309332 310111 309576 308893 308460 307908 307453 308071
51706 308071 310315 313725 317450 320847 323403 324821 325468 326353 328364 331704 336086 341237 347154 354095 362293
51691 362293 371508 380925 389824 398389 407567 418060 429589 441168 451887 461430 470098 478476 486923
51678 486923 495259 502855 508953 512857 514155 513133 510885 508574 506392 503503 499164 493761 488590 484868
51664 484868 483091 483094 484228 485486 485882 485100 483722 482605 482089 481972 482100 482569 483255 483583 483105 482092 481240
51647 481240 480973 481326 482280 483761 485474 487189 489079 491183 492684 492634 491676 492126 495652 501308 506529 509775
51631 509775 511630 513576 516501 520420 525050 530379 536848 544957 554532 564536 573920 582445 590364 597561
51617 597561 603543 608022 610911 611876 610753 608508 607037 607598 609802 612354 614250 615081 614761 613579 612211
51602 612211 611180 610442 609755 609258 609266 609593 609454 608082 605265 601300 596555 591065 584475 576445 567226 557729
51586 557729 548999 541717 536130 532141 529297 526950 524629 522155 519313 515744 511368 506653 502147 497872
51572 497872 493353 488165 482325 476353 471175 467641 465741 464307 461936 458337 454562 451852 450362 449139
51558 449139 447196 444491 441837 439966 438829 437901 436918 436029 435355 434850 434691 435323 436733 438024 438111 436771
51542 436771 434697 432652 430916 429502 428556 428432 429561 432166 435911 439906 443404 446437 449550 452864 455845
51527 455845 458076 459837 461618 463365 464707 465815 467445 469847 472085 472955 472456 471759 471674 471792 471518 471272
51511 471272 471737 472122 470343 465488 459367 454835 452870 452049 450758 448987 447644 446932 446216 445267 444761 445327
51495 445327 446717 448334 450127 452289 454314 455218 454910 454631 455601 457753 460273 462875 465857 469155 472002
51480 472002 473493 473210 471585 470023 470050 471602 472735 471976 470498 470705 473025 475642 477334 478765 480559
51465 480559 481991 482619 483589 485973 488932 490915 491723 492046 491843 490773 489564 489216 489128 487608 484147 479751
51449 479751 475119 469991 464396 459011 453978 448675 443129 438435 435341 433451 432182 431460 431112 430670 430207
51434 430207 430212 430193 428715 425587 422868 422682 424928 427984 430804 433157 434646 434914 434688 435416 437737 440969
51418 440969 444147 446998 449970 453795 458986 465328 471983 478397 484917 492171 500047 507626 513984 518906
51404 518906 523085 527713 533418 539439 544359 547815 550777 553911 556605 558130 558878 559661 560593 561632 563475
51389 563475 566602 569787 570998 569948 568675 569201 571445 573884 575712 577815 581716 587745 594310 599093
51375 599093 601065 601033 600244 599105 597531 595650 593313 589535 583522 576106 569263 564316 561311 559872 559656
51360 559656 560022 560282 560514 561335 562759 563975 564483 564739 565465 566886 568709 570268 570734 570062 569770 571746 575874
51343 575874 579829 581809 582628 584210 586588 587554 585356 580919 576942 575108 574574 573264 570274 566494 562914
51328 562914 559104 554002 547656 541198 535231 529149 522090 513757 504235 494004 484375 476865 471471 466479
51314 466479 460619 454677 450131 446867 443299 438390 432458 426025 418993 411325 403802 397544 393081 390164
51300 390164 388151 386277 383838 380676 377429 374901 372953 370341 366011 360414 355137 351289 348735 346973
51286 346973 346013 345914 346027 345447 343944 341796 339084 335978 333531 333080 334647 336772 338161 338724 338768 338115 336571
51269 336571 334624 333111 332616 333467 335686 338617 341334 343864 347287 352140 357508 362310 366608 370787 374283
51254 374283 376241 376891 377117 377041 376165 374527 372441 369416 364833 359769 356502 355765 355839 354896 352805 349833
51238 349833 345125 338013 329905 323144 318260 313757 308517 302969 297656 292100 285858 279750 275184 272762
51224 272762 272189 273042 274813 276509 277034 276080 274215 272170 270407 269171 268403 267746 267211 267629 269624 272113
51208 272113 272801 270543 266439 262217 258435 254928 252123 250738 250594 250709 250470 249780 248399 246248 244373
51193 244373 244437 246897 250547 254026 256811 258513 258460 256690 254439 252802 251566 250087 248607 247863 247919 248241
51177 248241 248525 248679 248401 247610 246875 246607 246266 245326 244576 245337 247565 249894 251497 252724 253870 254642 255159
51160 255159 256207 257897 259078 258790 257476 256200 255515 255823 257917 262070 267136 271637 275448 279382 283291
51145 283291 285748 285902 284749 284017 284186 284121 282655 280142 278235 278123 279300 280435 281067 281661 282044 281083 278608
51128 278608 276573 277078 279769 282386 283525 283592 283215 282216 280427 278226 275830 273184 270995 270541 271701 272412
51112 272412 271150 268946 267715 267515 266939 265577 264255 262967 260462 256381 252325 250024 249462 249534 249659 249889
51096 249889 250045 249610 248296 246300 244255 243026 242966 243169 242213 239974 237915 237078 236812 236222 235979 237436 240467
51079 240467 243382 244865 245011 244556 244087 244065 244743 245860 246931 247831 248596 248967 248871 249052 250276 252015 252879
51062 252879 252269 250651 248339 245288 242177 240373 240282 240858 241212 241606 242302 242622 241999 240995 240318 239764 239120
51045 239120 239246 240942 243269 244374 243793 242786 242467 242844 243768 245584 248186 250315 250701 249769 249637 252195
51029 252195 257236 262600 266362 268670 271072 274191 276937 278298 278953 280317 282669 285205 287392 289148
51015 289148 289951 289006 286469 283521 281067 279252 278460 279632 282894 286644 288987 289848 290951 293671 297476
51000 297476 300700 302463 303380 304417 305662 306713 307908 310153 313304 315789 316601 316896 318483 321194 323071
50985 323071 323175 322880 323902 326049 327617 327476 326142 325070 325386 327129 329374 331116 332056 332406 332144 331043
50969 331043 329459 328434 328743 330225 332179 333941 334954 334925 334395 334684 336680 339888 343164 346232 349848
50954 349848 354393 358902 362061 364051 366713 371461 377547 383148 387957 393531 400770 408331 414464 419409
50940 419409 424719 430974 437733 445338 454834 465967 477151 487993 500100 514415 529304 542724
50928 542724 555157 568860 584965 602962 622600 644519 668817 694344 719887 745164 770484
50917 770484 796385 824019 855085 890839 931572 977198 1027643 1082285 1139763 1199155 1261114
50906 1261114 1327362 1399174 1476723 1559621 1647451 1739684 1835514 1934110 2034866 2137236 2240259
50895 2240259 2342359 2441535 2535818 2623655 2703958 2775839 2838373 2890784 2932757 2964163 2984275
50884 2984275 2991841 2986638 2970822 2947840 2919770 2886518 2848001 2806140 2763831 2722585 2682194 2642292
50872 2642292 2602981 2563935 2524087 2482526 2438972 2393261 2345306 2295713 2245384 2194053 2140093
50861 2140093 2082181 2020521 1956235 1890529 1824861 1760751 1698659 1637904 1578356 1521260 1467705
50850 1467705 1417490 1370610 1328692 1293252 1263212 1235837 1209912 1186410 1166155 1148644 1133534
50839 1133534 1121647 1113642 1108825 1106056 1105072 1106134 1109050 1113293 1118788 1125955 1135033 1145566 1156396
50826 1156396 1166330 1175299 1184656 1195528 1206878 1216308 1223181 1229851 1239073 1251041 1263985 1277034 1291210
50813 1291210 1307716 1326492 1346862 1368726 1392390 1417594 1443465 1469536 1496416 1525307 1557250
50802 1557250 1593201 1634481 1682289 1736569 1796059 1860019 1929488 2006268 2091183 2184189 2286018
50791 2286018 2398649 2523963 2662589 2814184 2978097 3153480 3339385 3535146 3740263
50782 3740263 3953794 4174224 4399730 4627710 4854088 5074236 5284939 5484288 5668986
50773 5668986 5833003 5970168 6077569 6155439 6204371 6224054 6214704 6178563 6119670 6042873 5953083
50762 5953083 5854629 5750896 5644797 5539478 5437944 5341941 5251573 5165877 5083234 5001394
50752 5001394 4918049 4831654 4741295 4645769 4543440 4433182 4314820 4188407 4053696 3910789
50742 3910789 3761034 3606998 3451760 3298253 3148889 3005557 2869941 2743528 2626954
50733 2626954 2519675 2421031 2331429 2251593 2180789 2117079 2059749 2010289 1970195 1938738 1913792
50722 1913792 1894018 1879058 1868162 1860062 1854269 1851377 1851836 1855164 1860509 1867194 1874515 1881638 1888057
50709 1888057 1893702 1898459 1901993 1904094 1904714 1903598 1900436 1895401 1888902 1880743 1870326 1858019 1845620
50696 1845620 1834994 1826715 1820366 1815570 1812324 1810895 1811983 1816547 1824937 1836718 1851870 1871510 1896552
50683 1896552 1926194 1958876 1994667 2035606 2083482 2138162 2198416 2263464 2333304 2408388 2489799
50672 2489799 2579164 2677308 2782926 2893333 3006785 3123576 3244614 3369417 3496000 3622360
50662 3622360 3747144 3868589 3983621 4088816 4182020 4262125 4327296 4374461 4401106 4406820 4392406
50651 4392406 4358335 4305233 4235733 4154602 4066741 3975659 3883846 3793580 3706749 3624496 3547613
50640 3547613 3476907 3412689 3354158 3299767 3248035 3197582 3146454 3091951 3031517 2963928 2889555
50629 2889555 2809410 2724080 2634013 2540906 2448074 2358641 2273568 2192122 2114166 2041143 1974729
50618 1974729 1915399 1862654 1815909 1774743 1738936 1708846 1685391 1669152 1659741 1656256 1657836 1663453
50606 1663453 1671877 1682625 1696700 1715699 1740014 1768167 1797836 1827460 1857188 1888485 1922476
50595 1922476 1958608 1995467 2032992 2072934 2116695 2163559 2211932 2261600 2313701 2368951 2427080
50584 2427080 2487870 2551606 2618450 2688348 2761691 2839012 2919741 3002157 3085107 3169020 3254653
50573 3254653 3341338 3427061 3509878 3588661 3662605 3730607 3791291 3843586 3887209 3922479 3949499
50562 3949499 3967668 3976526 3977166 3972254 3964226 3953707 3940130 3923728 3906504 3891154 3879395 3871452
50550 3871452 3866835 3865227 3866601 3870868 3877617 3885915 3893943 3899031 3898699 3891811 3878330 3857784 3828571
50537 3828571 3789066 3738868 3678454 3608047 3527591 3437803 3340742 3239148 3135407 3030937 2926210
50526 2926210 2821324 2716755 2613654 2513590 2418287 2329515 2248519 2175325 2109017 2048840
50516 2048840 1994390 1944731 1898495 1855527 1817425 1785686 1760180 1740252 1726069 1717435 1712364 1708916
50504 1708916 1708101 1712794 1723666 1738219 1754308 1772589 1794514 1819672 1846619 1875214 1906592 1941407
50492 1941407 1979465 2020760 2065652 2113995 2164967 2217920 2272912 2330296 2390013 2451196 2512436
50481 2512436 2572786 2632751 2693981 2757891 2824993 2895582 2970256 3049333 3132421 3219220 3310528
50470 3310528 3408115 3513849 3628913 3753274 3885722 4025094 4171648 4326437 4488977 4656412
50460 4656412 4825456 4994372 5162418 5328233 5489620 5644269 5789663 5922785 6040935
50451 6040935 6142704 6227292 6292983 6337041 6357177 6352766 6324735 6274681 6203986 6113656 6005430
50440 6005430 5883164 5752330 5617746 5482577 5350105 5225308 5113413 5017378 4937840 4875009
50430 4875009 4829266 4800170 4786195 4785612 4796451 4815360 4837407 4857295 4870063 4870630 4853869 4815878
50418 4815878 4754916 4671040 4565529 4440902 4300734 4148906 3989151 3825270 3661068 3499653
50408 3499653 3342939 3191905 3047064 2908875 2778273 2656868 2545960 2445227 2352953 2267880
50398 2267880 2190426 2121854 2062622 2011875 1968327 1931316 1901032 1877770 1861024 1849541 1842378
50387 1842378 1839559 1841265 1846770 1854962 1865943 1881358 1902692 1929559 1959959 1992049 2025477 2061079
50375 2061079 2099503 2140291 2182337 2224998 2268378 2312687 2357901 2404144 2451620 2499772 2547144
50364 2547144 2592503 2635609 2676625 2715794 2754352 2794573 2837537 2881456 2923618 2963704 3003870
50353 3003870 3045901 3089888 3135763 3184491 3237158 3294050 3355128 3420256 3488414 3557742 3627095
50342 3627095 3696688 3766476 3834600 3898185 3955109 4004448 4045820 4078981 4103577 4118472 4121557
50331 4121557 4110828 4085567 4046118 3992748 3925309 3844035 3750520 3647794 3539294 3427554 3314179
50320 3314179 3201527 3093946 2996303 2911102 2837827 2775282 2723707 2684169 2656666 2639504 2630304
50309 2630304 2627334 2630148 2638805 2651873 2665149 2673157 2672242 2661739 2642196 2613471 2574943 2526706
50297 2526706 2470073 2407435 2341738 2275277 2208672 2141684 2075027 2010412 1948822 1890075 1834365
50286 1834365 1782637 1734859 1689606 1646428 1607124 1573367 1544264 1517768 1493409 1471959 1453264
50275 1453264 1436284 1420965 1408453 1399557 1394216 1392187 1393015 1395661 1399437 1404931 1412789 1422193 1432171
50262 1432171 1443887 1459662 1479863 1502692 1526963 1552781 1579117 1603285 1624252 1644643 1667924
50251 1667924 1694815 1723702 1753164 1782359 1809935 1834674 1857147 1879175 1901454 1922746 1941469
50240 1941469 1957095 1969874 1980116 1988008 1993522 1996207 1995578 1991851 1985821 1977859 1967518 1954336 1938621
50227 1938621 1921163 1902413 1882256 1860340 1836294 1809736 1780605 1749718 1718617 1688435 1659024
50216 1659024 1629679 1600544 1572625 1546342 1520972 1495920 1471710 1448932 1426922 1404538 1381807
50205 1381807 1359708 1338574 1317952 1298020 1279865 1264113 1250387 1238476 1228818 1221301 1214692 1208121
50193 1208121 1202286 1198314 1196034 1194177 1191746 1188457 1184255 1179142 1173140 1165967 1157235 1147482 1138289 1130594
50179 1130594 1123486 1115489 1106502 1097476 1088790 1080183 1071981 1065038 1059437 1054402 1049594 1045319 1041325 1036711
50165 1036711 1031540 1027378 1025469 1025238 1025409 1025816 1027144 1029462 1032097 1034810 1038148 1042546 1047678 1052806 1057257
50150 1057257 1060609 1062991 1065236 1068148 1071331 1073189 1072322 1068629 1062992 1056440 1049976 1044577 1040446 1036279
50136 1036279 1030133 1021424 1011731 1003188 996380 990195 983511 976444 969932 964709 960933 958348 956277 953704
50122 953704 949885 944983 939848 935129 930845 926664 922249 917306 911869 906815 903623 903065 904073 904385 902478
50107 902478 898760 894931 892497 891874 892357 892575 891237 887921 883113 877244 869958 860763 850216 839776
50093 839776 830471 822351 815367 809917 806023 802788 799408 796117 793229 789847 784853 779126 775290 774725
50079 774725 775886 776300 775482 775195 777378 782548 789627 796596 801704 804918 807972 812374 817705 822692 827562
50064 827562 834119 843419 854445 865480 875917 886229 896927 908105 919449 930061 938862 945997
50052 945997 953506 963604 976197 988808 999117 1006944 1013535 1019704 1025367 1030473 1035507 1040959 1046908
50039 1046908 1053327 1060287 1067534 1074322 1080103 1085120 1089836 1094111 1097591 1100744 1104614 1109447 1114433 1119185
50025 1119185 1124523 1131127 1138296 1145111 1152193 1160888 1170801 1179703 1186445 1192818 1201649 1213822 1227998
50012 1227998 1242710 1257768 1273786 1291317 1310548 1331217 1352615 1373998 1395066 1415815 1436112
50001 1436112 1455827 1475166 1494258 1512516 1529087 1543961 1557831 1570705 1581560 1589935 1597012 1604216
49989 1604216 1611248 1616558 1619499 1620881 1621195 1619439 1614291 1605753 1594998 1583153 1570846 1558496 1546254
49976 1546254 1533844 1521104 1508488 1496518 1485076 1474076 1464500 1457632 1453220 1449650 1446417 1445284
49964 1445284 1448207 1454976 1463790 1473498 1484336 1497104 1512663 1531835 1554509 1578947 1603102 1626533
49952 1626533 1649825 1672139 1690930 1704683 1714536 1722409 1728596 1732308 1733587 1733250 1731350 1727158 1720784
49939 1720784 1713548 1706224 1697556 1684935 1666247 1640952 1609855 1574234 1535185 1493739 1451394 1409944
49927 1409944 1370381 1332292 1294903 1258374 1223501 1190517 1159076 1129331 1102058 1077479 1054823
49916 1054823 1033459 1013763 996369 981166 967658 955903 946346 938759 931952 924740 916927 909095
49904 909095 901615 894091 885967 877474 869527 862544 855924 849086 842443 836560 830685 823313 814264 805186
49890 805186 797550 791053 784475 777320 769957 762816 756157 750226 745052 740592 737529 737139 739508 742555
49876 742555 744001 743981 744641 747316 751340 755693 760523 766514 773620 781119 788480 795734 803335 811958 822152
49861 822152 833954 847026 861122 876034 891198 905848 919668 932932 946121 959870 975114
49850 975114 992517 1011819 1032429 1054492 1078450 1103694 1129058 1154965 1183749 1216981 1253482
49839 1253482 1290822 1327842 1364677 1401167 1436602 1470637 1503219 1533780 1561766 1587937 1613929
49828 1613929 1640230 1665499 1688273 1708584 1727451 1745348 1761645 1775030 1783900 1786533 1781557 1768671
49816 1768671 1748878 1723690 1693874 1659139 1619373 1575975 1531316 1486903 1442962 1399905 1358836
49805 1358836 1319837 1281105 1241313 1202111 1166532 1135181 1105792 1076646 1048588 1023033 999702
49794 999702 977514 956510 937531 920643 905273 891564 880316 871455 863510 854972 845713 836774
49782 836774 829008 822178 815247 807493 799161 790916 782819 774328 765267 756259 748059 740976 735137 730681
49768 730681 727291 724119 720697 717537 715229 713242 710178 705220 699038 693448 690354 690624 693537 697417
49754 697417 701008 704028 706479 708130 709083 710270 712751 716833 722154 728119 733832 738346 741777 745613
49740 745613 751063 757532 763624 769247 775605 783335 791834 800490 809359 818289 826487 833665 840947 849945
49726 849945 861228 874020 887147 900169 913977 930352 950435 973538 997968 1022989 1049185
49715 1049185 1076766 1104443 1130436 1153884 1174808 1193408 1210041 1225263 1239147 1250914 1259995
49704 1259995 1267188 1274166 1281990 1290454 1298542 1305001 1308789 1309499 1307026 1300377 1287454 1266996 1240458
49691 1240458 1211110 1181303 1151447 1121356 1091369 1061910 1033157 1005728 980751 958537 937982
49680 937982 918109 899677 884346 872615 863510 856083 850145 845410 840915 835910 830725 826299 823187
49667 823187 821405 820770 820859 820913 820422 819750 819633 820078 820336 820058 819785 819894 819541 817337 812965 807552 802527 798701
49649 798701 796539 796478 798270 800402 801072 799984 798594 798327 798955 799127 798024 795850 792936 789373 785811 783775
49633 783775 784402 787159 790443 793246 795612 797679 799209 800198 801070 801904 802216 801981 802153 803525 805708 807974
49617 807974 810528 813848 817157 818922 819100 819692 822413 826545 829708 830380 829305 828806 831001 836167 842403
49602 842403 847266 849990 851747 853731 855827 857548 859127 860742 861459 860364 858496 858265 860687 864276 867096
49587 867096 868949 870932 873600 876383 878605 880404 882562 885625 889185 892078 893569 894269 895378 896980
49573 896980 897842 897229 896168 896143 897119 897834 897830 898114 899611 901934 904161 906091 908006 909864 911656 914287 918982
49556 918982 925569 932315 938068 943887 951747 962011 973089 983495 993324 1003427 1014052 1024864 1035748
49543 1035748 1046918 1058539 1070819 1084200 1098848 1114091 1129020 1143596 1158602 1174506 1190939
49532 1190939 1207395 1223871 1240727 1258448 1277692 1299009 1322339 1347285 1373925 1402556 1432388
49521 1432388 1461497 1488874 1515949 1545131 1577214 1611013 1645281 1680001 1715829 1753191 1792214
49510 1792214 1832829 1874540 1916543 1958454 2000712 2044221 2089750 2137506 2186774 2236097 2284475
49499 2284475 2332518 2381787 2432853 2484661 2536002 2586773 2637352 2687429 2736202 2783274 2828716
49488 2828716 2872525 2914689 2955490 2995092 3032943 3068153 3100342 3129687 3156298 3180153 3201443
49477 3201443 3220298 3236173 3248201 3256339 3261704 3265686 3269137 3272380 3275387 3277845 3279606 3281107 3282860
49464 3282860 3284576 3285635 3286492 3288596 3292479 3296964 3301130 3306320 3315060 3328298 3344685 3362356 3380345
49451 3380345 3398221 3415479 3431926 3448041 3464368 3480817 3496888 3512221 3526470 3538880 3548540
49440 3548540 3555119 3558998 3560484 3559080 3553824 3544366 3531470 3516209 3498819 3478712 3455469 3429188
49428 3429188 3399686 3366097 3327949 3286203 3242498 3197596 3151368 3104140 3056919 3009914 2961815
49417 2961815 2911317 2858973 2806921 2756986 2709432 2663277 2617234 2570451 2522974 2475714 2429784
49406 2429784 2385712 2343390 2302746 2264255 2228698 2196349 2166368 2137225 2108063 2079624 2053452
49395 2053452 2030142 2008873 1988760 1970016 1953312 1938602 1925347 1913572 1903834 1896057 1889121 1881953
49383 1881953 1874607 1868011 1862915 1859381 1857116 1856064 1856538 1858740 1862160 1865706 1868730 1871861 1876566 1883911
49369 1883911 1893868 1905665 1918512 1932125 1946963 1964045 1984178 2007277 2032602 2059783 2089545
49358 2089545 2123490 2162926 2207072 2251787 2290632 2318506 2334839 2343071 2347272 2349875 2352192 2355501
49346 2355501 2360734 2368002 2377316 2389259 2404194 2421280 2439246 2457947 2478327 2500827 2524631 2548540
49334 2548540 2572014 2595144 2618180 2641268 2664324 2686981 2708921 2730216 2751027 2771084 2790027
49323 2790027 2808214 2826436 2844600 2861439 2876185 2890059 2905329 2922867 2941260 2958514 2974248
49312 2974248 2989841 3006608 3024310 3041696 3058293 3075199 3093961 3115013 3137526 3160509 3183604
49301 3183604 3206929 3230731 3255467 3281807 3310307 3341197 3374415 3409481 3445263 3480521 3515180
49290 3515180 3550837 3589401 3631227 3674921 3718994 3763406 3809386 3858047 3909464 3963105 4018835
49279 4018835 4077183 4138534 4202354 4267523 4333318 4399716 4466834 4534590 4603063 4672674 4743587
49268 4743587 4815255 4887025 4959051 5032112 5106433 5181061 5254618 5326506 5397145 5467084 5536085
49257 5536085 5603316 5668391 5731864 5794313 5855118 5912656 5965798 6014746 6060161 6101921 6139167
49246 6139167 6171364 6198915 6222680 6242994 6259084 6269460 6273289 6271544 6266493 6259912 6252167 6243023
49234 6243023 6232591 6220954 6207687 6192725 6177399 6163630 6152126 6142212 6133462 6126620 6122575 6121112
49222 6121112 6121118 6121652 6122577 6124518 6128475 6135228 6144926 6157244 6171642 6187035 6201600 6213787 6223599 6232106
49208 6232106 6239502 6244453 6245724 6243621 6239182 6232395 6221864 6206010 6184180 6156896 6125398 6090786
49196 6090786 6053315 6012591 5968383 5920877 5870308 5817088 5762326 5707236 5651688 5594368 5534912
49185 5534912 5474912 5415941 5357549 5298377 5238606 5180029 5124024 5070568 5018981 4968478 4918192
49174 4918192 4867921 4818860 4772336 4727696 4682760 4636715 4591421 4549317 4511121 4476134 4443753
49163 4443753 4413714 4385557 4358817 4333546 4310159 4289118 4271141 4257000 4246449 4237831 4229467 4221161
49151 4221161 4213876 4208419 4205130 4204377 4206302 4210089 4214282 4218110 4222177 4227842 4236222 4247541 4260909 4274792
49137 4274792 4288198 4301478 4315706 4331502 4348813 4367549 4387764 4409293 4431841 4455472 4480381
49126 4480381 4506102 4531492 4555771 4579313 4603370 4629248 4657484 4687175 4716238 4743171 4768790
49115 4768790 4795498 4824589 4855096 4885724 4916967 4950350 4986134 5022823 5058804 5093614 5127600
49104 5127600 5161300 5195359 5230274 5265848 5301406 5336864 5372953 5410073 5447581 5484814 5522257
49093 5522257 5560822 5600268 5639326 5677497 5715837 5755463 5795904 5835648 5874100 5912246 5951107
49082 5951107 5989958 6026527 6058956 6087271 6112741 6136217 6157670 6177363 6196563 6216402 6236432
49071 6236432 6255177 6272146 6288576 6305957 6324466 6343102 6360911 6377708 6393986 6410383 6426916
49060 6426916 6442504 6455656 6465845 6473863 6480823 6487522 6494857 6503701 6513571 6522364 6528589 6533251 6538395
49047 6538395 6544217 6549045 6552081 6554668 6558427 6563406 6568645 6573583 6578133 6582101 6585302 6587910 6590190 6592185
49033 6592185 6594028 6596179 6598956 6602151 6605401 6608655 6612000 6615344 6618421 6620847 6622226 6622643 6622986 6624055
49019 6624055 6625456 6626279 6626898 6628859 6632609 6636525 6638937 6639957 6640373 6639821 6637394 6633353 6628685 6623226 6615674
49004 6615674 6605523 6593789 6581522 6568525 6553898 6537085 6518011 6496650 6472756 6445908 6415924
48993 6415924 6383476 6349988 6316422 6282491 6247602 6212159 6177187 6142960 6108933 6074842 6040941
48982 6040941 6007118 5972795 5937935 5903381 5870001 5838150 5808157 5780599 5755753 5733258 5712498
48971 5712498 5692906 5673924 5655230 5637123 5620305 5605470 5593539 5585640 5581784 5579810 5577068 5573245
48959 5573245 5570314 5569621 5570537 5572354 5575696 5580951 5586729 5591445 5595669 5601447 5609654 5619232 5628898 5638531
48945 5638531 5648862 5660505 5673145 5685153 5694398 5700138 5703630 5706153 5707164 5705623 5702447 5699784 5697758
48932 5697758 5693730 5685533 5673978 5661113 5647198 5630833 5611488 5590378 5568705 5546257 5522080 5495649
48920 5495649 5466809 5435224 5400692 5363834 5325893 5287783 5249746 5211862 5174307 5136866 5098767
48909 5098767 5059622 5020367 4982684 4947464 4914284 4882451 4852005 4823448 4797043 4772949 4751723
48898 4751723 4734035 4719818 4708169 4698326 4690385 4684874 4681932 4681290 4682987 4687616 4695711 4707133 4721314
$$ [...]
##END NTUPLES=NMR SPECTRUM
##END=
