
##TITLE=AC1176_Popayan-tambo-cauca-CTAAH12018_5891292_11tmnTrQaV
##JCAMPDX= 6.0         $$ Bruker NMR JCAMP-DX V2.0
##DATA TYPE= NMR SPECTRUM
##DATA CLASS= NTUPLES
##ORIGIN= BRUKER
##OWNER= Administrator
$$ 1.72 TOPSPIN		Version 2.1
$$ 2012-04-02 23:27:40.500 -0500  Administrator@TOPSPIN
$$ Compression mode = diff/dup
##.OBSERVE FREQUENCY= 400.13188235
##.OBSERVE NUCLEUS= ^1H
##.ACQUISITION MODE= SIMULTANEOUS (DQD)
##.ACQUISITION SCHEME= undefined
##.AVERAGES= 8
##.DIGITISER RES= 22
##SPECTROMETER/DATA SYSTEM= spect
##.PULSE SEQUENCE= zg30
##.SOLVENT NAME= COFFEE_meoh
##.SHIFT REFERENCE= INTERNAL, COFFEE_meoh, 1, 14.98061
##AUDIT TRAIL= $$ (NUMBER, WHEN, WHO, WHERE, PROCESS, VERSION, WHAT)
$$ ##TITLE= Audit trail, TOPSPIN		Version 2.1
$$ ##JCAMPDX= 5.01
$$ ##ORIGIN= Bruker BioSpin GmbH
$$ ##OWNER= Administrator
$$ $$ C:\Bruker\TOPSPIN/data/COFFEE/nmr/AC1176_Popayan-tambo-cauca-CTAAH12018_5891292_11tmnTrQaV/10/pdata/1/auditp.txt
$$ ##AUDIT TRAIL=  $$ (NUMBER, WHEN, WHO, WHERE, PROCESS, VERSION, WHAT)
(   1,<2012-04-02 23:27:32.250 -0500>,<Administrator>,<TOPSPIN>,<go>,<TOPSPIN 2.1>,
      <created by zg
	started at 2012-04-02 23:26:24.968 -0500,
	POWCHK enabled, PULCHK disabled,
       configuration hash MD5:
       1A 1E CE 29 27 FD 77 03 67 4E F0 E3 C4 B2 CB 90
       data hash MD5: 64K
       E4 B8 36 6C E8 6D 83 9D D3 2B 41 48 78 A4 75 45>)
(   2,<2012-04-02 23:27:35.281 -0500>,<Administrator>,<TOPSPIN>,<proc1d>,<TOPSPIN 2.1>,
      <Start of raw data processing
       efp LB = 0 FT_mod = 6 PKNL = 1 PHC0 = 0 PHC1 = 0 SI = 32K 
       data hash MD5: 32K
       5B 82 E8 F7 57 1A 19 E9 62 F9 60 2E 82 5A 2F C7>)
(   3,<2012-04-02 23:27:35.718 -0500>,<Administrator>,<TOPSPIN>,<proc1d>,<TOPSPIN 2.1>,
      <pk PHC0 = 213.1952 PHC1 = 0 
       data hash MD5: 32K
       54 0D 48 2D FB A8 5A 46 94 D6 0C B6 6C 89 F5 69>)
(   4,<2012-04-02 23:27:35.781 -0500>,<Administrator>,<TOPSPIN>,<proc1d>,<TOPSPIN 2.1>,
      <abs ABSG = 1 
       data hash MD5: 32K
       7A 9E D7 07 3E 47 AF 56 2C 77 77 D3 7D 4D ED 84>)
(   5,<2012-04-02 23:27:35.812 -0500>,<Administrator>,<TOPSPIN>,<proc1d>,<TOPSPIN 2.1>,
      <abs ABSG = 2 
       data hash MD5: 32K
       67 6A 14 17 88 BB C3 6E 98 D8 D3 FD 22 0E FC D2>)
(   6,<2012-04-02 23:27:35.859 -0500>,<Administrator>,<TOPSPIN>,<proc1d>,<TOPSPIN 2.1>,
      <abs ABSG = 3 
       data hash MD5: 32K
       41 FE CD E1 A5 81 85 E1 E4 6E E7 89 12 F8 3D 53>)
(   7,<2012-04-02 23:27:35.890 -0500>,<Administrator>,<TOPSPIN>,<proc1d>,<TOPSPIN 2.1>,
      <abs ABSG = 4 
       data hash MD5: 32K
       A8 CA 4C 9D EC 36 4F 4D D1 C2 31 1A 7F 29 41 1B>)
(   8,<2012-04-02 23:27:35.984 -0500>,<Administrator>,<TOPSPIN>,<proc1d>,<TOPSPIN 2.1>,
      <abs ABSG = 5 
       data hash MD5: 32K
       2F 02 CE 2A E5 46 27 4A D9 F5 8C B8 F8 24 23 83>)
$$ ##END=
$$ 
$$ $$ hash MD5
$$ $$ 60 04 BF 0D CE 11 4A 2E E1 F0 CB B6 D2 FD 8A 8C
##$RELAX= 
##$RELAX= 
##$RELAX= 
##$RELAX= 
##$RELAX= 
##$RELAX= 
##$RELAX= 
$$ Bruker specific parameters
$$ [...]
##$TP= (0..7)
150 150 150 150 150 150 150 150
##$TP07= 0
##$TPNAME0= <>
##$TPNAME1= <>
##$TPNAME2= <>
##$TPNAME3= <>
##$TPNAME4= <>
##$TPNAME5= <>
##$TPNAME6= <>
##$TPNAME7= <>
##$TPOAL= (0..7)
0.5 0.5 0.5 0.5 0.5 0.5 0.5 0.5
##$TPOFFS= (0..7)
0 0 0 0 0 0 0 0
##$TUNHIN= 0
##$TUNHOUT= 0
##$TUNXOUT= 0
##$USERA1= <user>
##$USERA2= <user>
##$USERA3= <user>
##$USERA4= <user>
##$USERA5= <user>
##$V9= 5
##$VALIST= <valist>
##$VCLIST= <CCCCCCCCCCCCCCC>
##$VD= 0
##$VDLIST= <DDDDDDDDDDDDDDD>
##$VPLIST= <PPPPPPPPPPPPPPP>
##$VTLIST= <TTTTTTTTTTTTTTT>
##$WBST= 2048
##$WBSW= 25
##$XGAIN= (0..3)
0 0 0 0
##$XL= 0
##$YL= 0
##$YMAX_a= 523240
##$YMIN_a= -640354
##$ZGOPTNS= <>
##$ZL1= 120
##$ZL2= 120
##$ZL3= 120
##$ZL4= 120
##$ABSF1= 14.98061
##$ABSF2= -5.57192
##$ABSG= 5
##$ABSL= 3
##$ALPHA= 0
##$AQORDER= 0
##$ASSFAC= 0
##$ASSFACI= 0
##$ASSFACX= 0
##$ASSWID= 0
##$AUNMP= <proc_prof1d_extract_pilot.lims>
##$AXLEFT= 0
##$AXNAME= <>
##$AXNUC= <1H>
##$AXRIGHT= 0
##$AXTYPE= 0
##$AXUNIT= <>
##$AZFE= 0.1
##$AZFW= 0.1
##$BCFW= 0
##$BC_mod= 0
##$BYTORDP= 0
##$COROFFS= 0
##$CY= 15
##$DATMOD= 1
##$DC= 0
##$DFILT= <>
##$DTYPP= 0
##$F1P= 0
##$F2P= 0
##$FCOR= 0.5
##$FTSIZE= 32768
##$FT_mod= 6
##$GAMMA= 0
##$GB= 0
##$INTBC= 1
##$INTSCL= 1
##$ISEN= 128
##$LB= 0
##$LEV0= 0
##$LPBIN= 0
##$MAXI= 10000
##$MC2= 0
##$MEAN= 0
##$ME_mod= 0
##$MI= 0
##$NCOEF= 0
##$NC_proc= -8
##$NLEV= 6
##$NOISF1= 0
##$NOISF2= 0
##$NSP= 0
##$NTH_PI= 0
##$NZP= 0
##$OFFSET= 14.98061
##$PC= 1
##$PHC0= 213.1952
##$PHC1= 0
##$PH_mod= 1
##$PKNL= yes
##$PPARMOD= 0
##$PPDIAG= 0
##$PPIPTYP= 0
##$PPMPNUM= 2147483647
##$PPRESOL= 1
##$PSCAL= 4
##$PSIGN= 0
##$PYNMP= <proc.py>
##$REVERSE= no
##$SF= 400.13
##$SI= 32768
##$SIGF1= 0
##$SIGF2= 0
##$SINO= 400
##$SIOLD= 32768
##$SPECTYP= <>
##$SREGLST= <1H.CDCl3>
##$SSB= 0
##$STSI= 32768
##$STSR= 0
##$SW_p= 8223.68421052632
##$SYMM= 0
##$S_DEV= 0
##$TDeff= 65536
##$TDoff= 0
##$TI= <>
##$TILT= no
##$TM1= 0
##$TM2= 0
##$TOPLEV= 0
##$USERP1= <user>
##$USERP2= <user>
##$USERP3= <user>
##$USERP4= <user>
##$USERP5= <user>
##$WDW= 1
##$XDIM= 32768
##$YMAX_p= 467878082
##$YMIN_p= -715151
##$CURPLOT= <Network HP LaserJet P1505>
##$CURPRIN= <$Network HP LaserJet P1505>
##$DFORMAT= <normdp>
##$LAYOUT= <+/1D_H.xwp>
##$LFORMAT= <normlp>
##$PFORMAT= <normpl>
##$SURQMSG= 1
$$ End of Bruker specific parameters
$$ ---------------------------------
##NTUPLES= NMR SPECTRUM
##VAR_NAME=  FREQUENCY,     SPECTRUM/REAL,   SPECTRUM/IMAG
##SYMBOL=    X,             R,               I
##VAR_TYPE=  INDEPENDENT,   DEPENDENT,       DEPENDENT
##VAR_FORM=  AFFN,          ASDF,            ASDF
##VAR_DIM=   32768,         32768,           32768
##UNITS=     HZ,            ARBITRARY UNITS, ARBITRARY UNITS
##FACTOR=    0.250966925370066, 1,           1
##FIRST=     8223.43324360095, -204920,      70546
##LAST=      0,             -115351,         16768
##MIN=       0,             -715151,         0
##MAX=       8223.43324360095, 467878082,    0
$$ Real data points
##PAGE= N=1
##DATA TABLE= (X++(R..R)), XYDATA
$$ [...]
19457a71321J7365c8030o3959j0644B31165b53604e4128n6691n6991A13077P4757
19446A87834b4302B1483a75165j2170j19347b4731G8408C5413a74176f9528L697
19435f5831A07421n3684d20579A67396E1638a09659B14252a03803l14571J89587
19425b28787B1381J04457a637A23197a70912g3149l2917L6599I4027L8135i3556
19413G1659B8635b73218g8837c1140k54705i7534B55492a21313M3704q1236j91068
19402c49913a43653O6348A61760f3606g936D3578h8250k77526g0380q9072k37282
19391c96734A03918l189a32691B7168A1132J50086b88932a03166a0869j6631J3556
19380a3944B42125A6297J01469a14430c9524A43235b72378P7764G769b8640A46616
$$ plain form
19457 -171321 -153956 -38030 -101989 -112633 231165 -253604 -54128 -110819 -167810 113077 187834
19446 187834 -24302 21483 -175165 -187335 -306682 -24731 78408 35413 -174176 -69528 -65831
19435 -65831 107421 53737 -420579 167396 51638 -109659 214252 -103803 -418374 -228787
19425 -228787 21381 125838 -1637 123197 -170912 -73149 -106066 -69467 94027 132162 -93556
19413 71659 28635 -273218 -78837 -31140 -285845 -97534 255492 -121313 -77609 -158845 -349913
19402 -349913 -143653 -77305 161760 -63606 -7936 43578 -88250 -365776 -70380 -159452 -396734
19391 -396734 103918 100729 -132691 27168 11132 161218 -288932 -103166 -10869 -27500 -13944
19380 -13944 242125 16297 117766 -114430 -39524 143235 -272378 -194614 7769 -28640 146616
19368A84018q4556I244b91375J41178k80182g7166C42P7759k9592J87472J65327
19357D01308a31463N8139q0001E9650b42619Q2193G926a30095A56012e83667b47918
19345d6667n4092k6471B12693c4373k52417C036a88204f1814k26077K2589f8591
19333b72006a34922q5062b7386B31595h4271B10372a86269P2466A7702a79174
19322e57983h4785j08215e4207I5009J10237a1384j37691A90120F7787c7623k58338
19311b95961P0345N9038j57679a08808B05123F4013e3633B7446b47634o1202e7998
19299b7147j90797P4275f9431F7842f4079A13657b01650l9521B8247g1374K6276
19288d5098I0966K35914c36027f0993j79910h305A06807c32804A75907F7176a62781
$$ plain form
19368 184018 99462 9244 -291375 -150197 -430379 -77166 342 78101 48509 235981 401308
19357 401308 -131463 -73324 -153325 59650 -242619 -160426 7926 -130095 156012 -583667 -247918
19345 -46667 -100759 -127230 212693 -34373 -286790 3036 -188204 -61814 -287891 -265302 -68591
19333 -272006 -134922 -219984 -27386 231595 -84271 210372 -186269 -113803 17702 -179174
19322 -557983 -84785 -193000 -54207 95009 205246 -11384 -149075 190120 67787 -37623 -295961
19311 -295961 -225616 -166578 -324257 -108808 205123 64013 -53633 27446 -247634 -308836 -57998
19299 -27147 -217944 -143669 -69431 67842 -64079 113657 -201650 -241171 28247 -71374 -45098
19288 -45098 90966 326880 -336027 -60993 -240903 -8305 106807 -332804 175907 67176 -162781
19276E7559D299a59341B24024e4047o7991M3045B0929e2032j3196j35388C9522
19264a02888F5363b86664A60578b39738k67443b03739k85468a05928k400H417
19253a46459F5790i4764a9393E2357a35007n0044d8781l752H4409L1927c23488
19241c96567Q3977a49097b3701J984A35043c2146j31630B21103a75612k4429A39506
19229B009c30275E6912d63129a76790B01154J80922b1975k6085r3132e7400n5512
19218a12912M3907k8320j91788a41722D6806o76d7437j1555A08424a33641r0171
19207b23812A22093b51024J1944A60817G4100a75456d2786B9773a60149M9447
19197a10702K4519l71140B58361a44414A68785D0169b5630B02933b62855d6327
$$ plain form
19276 57559 4299 -159341 224024 -54047 -122038 -78993 20929 -52032 -65228 -200616 39522
19264 -102888 65363 -286664 160578 -239738 -507181 -203739 -489207 -105928 -108328 8417
19253 -146459 65790 -94764 -19393 52357 -135007 -185051 -48781 -52533 84409 116336 -323488
19241 -396567 -312590 -149097 -23701 -21717 135043 -32146 -163776 221103 -175612 -200041 139506
19229 2009 -330275 56912 -463129 -176790 201154 382076 -21975 -48060 -141192 -57400 -112912
19218 -112912 -69005 -97325 -289113 -141722 46806 46130 -47437 -58992 108424 -133641 -223812
19207 -223812 122093 -251024 -239080 160817 74100 -175456 -42786 29773 -160149 -110702
19197 -110702 -86183 -457323 258361 -144414 168785 40169 -25630 202933 -262855 -46327
19186A72958o6900b03734j62114a59088A9187a89346K1196k780H0142J90700o1106
19175B09736J28843I0637J12649g5575j66338a7927F5085a41250G492b44181D9774
19163b12513A8156b01996L0866f1274A71247p461a58142E2700B3993a59533D57608
19151b69981A07527a20553e8106A22129e7911l4938n700c4292A4692J40477d1876
19139B16053c03994E5399a81748C167a90883C49343a2631q4638A4124a57124B23368
19127b86892f3162B73374b8085p1726j20333e7218F1931e0331j49182j49689a59541
19115a11469M7071k5382d4709A37949a41213G7197b32941A20400l2289b66695
19104f3490a4055k81569d9427H5771c84642D0069R0283M6104o6373C8717b6186
$$ plain form
19186 172958 106058 -203734 -365848 -159088 19187 -189346 -168150 -170930 80142 270842 209736
19175 209736 338579 90637 203286 -75575 -241913 -17927 65085 -141250 7492 -244181 49774
19163 -212513 18156 -201996 -171130 -61274 171247 163786 -158142 52700 23993 -159533 457608
19151 -269981 107527 -120553 -58106 122129 -57911 -92849 -98549 -34292 14692 155169 -41876
19139 216053 -303994 55399 -181748 3167 -190883 349343 -12631 -97269 14124 -157124 223368
19127 -286892 -63162 273374 -28085 -99811 -220144 -57218 61931 -50331 -199513 -349202 -159541
19115 -111469 -64398 -89780 -44709 137949 -141213 77197 -232941 120400 88111 -266695
19104 -63490 -14055 -295624 -49427 85771 -384642 40069 130352 176456 110083 38717 -26186
19092G7023B2056a22029j41566j29158i8214A0079f7664k9688j55489a26363k13875
19081c40238j26560i6904k19520J46271b0779B33882b31173R9447D2785K9621
19071G2406a06384n7397A76647a79861F6771f5936j06299K8036F3336J41203a06716
19059B7080r269J11554a76B58670e9777j45976q029j32802A40321d917l10676
19048c15593A67614j5444R126J23119C8368a15992B77215K9311a88062j54730
19038c42792D635d26916A59724q416R801b03228B3767d0469C04405E0094J10820
19027A60914a69372c3419H4939d42476f1719D8491J54251D078b06445e5058n7777
19016a12835B1645K8131e7343C94301j60661C7880L040J29493a68685K7118d8258
$$ plain form
19092 77023 22056 -122029 -263595 -392753 -98214 10079 -67664 -97352 -252841 -126363 -340238
19081 -340238 -466798 -96904 -316424 -170153 -20779 233882 -231173 -131726 42785 72406
19071 72406 -106384 -163781 176647 -179861 66771 -65936 -172235 -144199 63336 204539 -106716
19059 27080 17811 129365 -176 258670 -59777 -205753 -213782 -346584 140321 -4917 -315593
19048 -315593 167614 152170 161296 284415 38368 -115992 277215 306526 -188062 -342792
19038 -342792 4635 -426916 159724 151308 161109 -203228 23767 -40469 304405 50094 160914
19027 160914 -169372 -33419 84939 -442476 -61719 48491 202742 4078 -206445 -55058 -112835
19016 -112835 21645 49776 -57343 394301 233640 37880 40920 170413 -168685 -141567 -48258
19004G9807a33820k9313P9292j25927J1368p7295I3743a59352o277A15421R2167
18993B07588a03308p162A9286g7598D0179J52432E069O5138P7859d1592B36371
18981E8952a185G7282a01277k45667c5534j68133H8874a70201j67719b4227k94790
18970c19017J20656A76734j0497a65137d8846n9967J7264j0537k09246B6682a88290
18958D39175j71913j23926K32795A82759J5964J57774d27047e9589j45127M6071
18948a58645l64428D3469q500b4798A53613C8274e1478A12177a46432H1780b565
18936a94665h4023j83487i6707j32801L0878b5651G4987b36427J02148A46697
18925c94318J86696R9881B0586b9778G3272a3075A53630h0136K9202l871H3338
$$ plain form
19004 79807 -133820 -163133 -83841 -209768 -198400 -275695 93743 -159352 -165629 115421 207588
18993 207588 -103308 -110470 19286 -77598 40179 192611 5069 70207 148066 -41592 236371
18981 58952 -1185 77282 -101277 -346944 -35534 -203667 88874 -170201 -337920 -24227 -319017
18970 -319017 -198361 176734 166237 -165137 -48846 -108813 -91549 -102086 -311332 26682 -188290
18958 439175 267262 143336 376131 182759 198723 356497 -427047 -59589 -204716 -158645
18948 -158645 -523073 43469 34969 -24798 153613 38274 -51478 112177 -146432 81780 -2565
18936 -194665 -84023 -267510 -96707 -229508 -198630 -25651 74987 -236427 -134279 146697
18925 -394318 -207622 -107741 20586 -29778 73272 -13075 153630 -80136 -50934 -54805 83338
18913c2471a4138n1680j3821L7361j12007A30076i3555A19737J34452q4274J73250
18902C43165b17624A3980a9315m785k04388h0720R818D89998B22090J05004r3282
18891B33812K2955J92082F1926M4413f3485C6448K01491c3419r3682k05916a10933
18879A17197O7514b65696A57735d42575A21534A2808J58379g2840k0731k35938
18869c29509A83075g6971K7440q3401A67199q0187f7721B18001b18437k14990
18859d33427a62856b9939j55175D4464J4144a18867m59719f169j82736A25996
18848A15881i4805A75017B5997K85531F6624k5448h7764d2886j30630a8663f428
18836f404A00331a04897B04983a48326C4177i7500A85317A4978R3187f0776A19815
$$ plain form
18913 -32471 -14138 -65818 -79639 -42278 -154285 130076 -93555 119737 254189 169915 343165
18902 343165 -217624 13980 -19315 -24100 -228488 -80720 -70902 489998 222090 327094 233812
18891 233812 256767 448849 61926 106339 -63485 36448 237939 -33419 -127101 -333017 -110933
18879 117197 184711 -265696 157735 -442575 121534 12808 171187 -72840 -93571 -329509
18869 -329509 183075 -76971 -49531 -132932 167199 87012 -67721 218001 -218437 -433427
18859 -433427 -162856 -29939 -185114 44464 58608 -118867 -578586 -6169 -188905 125996
18848 115881 -94805 175017 25997 311528 66624 41176 -87764 -42886 -173516 -18663 -6428
18836 -6404 100331 -104897 204983 -148326 34177 -97500 185317 14978 108165 -60776 119815
18824b06669N2487L8940b5309k02693P2753G7460c37714A50746b29549k12686
18814d42235J55730C144f0866a5543p6695M2971A02992l8029d7062A01663O5849
18803A67512d22686C68965B2151d6815A56323e37340C35706E0975a88101H0348
18792B1954J16997b30291c5730j48738L0773F7742e18674G7520i6743j60871A45631
18780H1075b31442g0380A68892N3401a1554j36531k2029B20039a48926K4127j6056
18769a40855c3190k51312d0004A78084E554J01683a07426C74196c4506k24803
18759b59309R6449A67920c0130H7600a152n2060m706A29690A1881b44316C06686
18747a08481k06712e5183F574M8611f4462o6268M0907C09751a2935A42848b54419
$$ plain form
18824 -206669 -154182 -115242 -25309 -228002 -155249 77460 -337714 150746 -229549 -442235
18814 -442235 -286505 3144 -60866 -15543 -92238 -49267 102992 64963 -47062 101663 167512
18803 167512 -422686 368965 22151 -46815 156323 -537340 335706 50975 -188101 80348
18792 21954 138951 -230291 -35730 -184468 -153695 67742 -518674 77520 -96743 -257614 145631
18780 81075 -231442 -70380 168892 222293 -11554 -148085 -170114 220039 -148926 -124799 -140855
18769 -140855 -33190 -284502 -40004 178084 5554 107237 -107426 374196 -34506 -259309
18759 -259309 -162860 167920 -30130 87600 -1152 -53212 -57918 129690 11881 -244316 306686
18747 -108481 -315193 -55183 6574 55185 -64462 -130730 -89823 309751 -12935 142848 -254419
18735B8195J88014g9450j05059e8305L031j20689A52843a56769l2542j3947P7860
18724a25398F0782b23045g2562p0266D00202b79981H7677g5856E883e0687A00610
18712a63037c5359B15913j6176a81407N489N09G6267d62099a99046e2274m99516
18701e51790K10252B7908b78725B83073a15510B51498a39321f7249B94085C2809
18690B0744D06d2193j11107r267M2175L8117A40623b65560B82548g4720K3878
18679e0842k12981R4010P9945C1994Q4310E520N2519b69347j24712a906j48872
18668a50778B1260b35640a8086B6186K01595q9646A3686P4566i2306m4647A50070
18656d8877C13774d2863l15986e7469H9819b95458i9132l0990r2418e899k11270
$$ plain form
18735 28195 216209 -79450 -184509 -58305 -55274 -175963 152843 -156769 -189311 -203258 -125398
18724 -125398 60782 -223045 -72562 -142828 400202 -279981 87677 -75856 5883 -50687 100610
18712 -163037 -35359 215913 199737 -181407 -175918 -175409 76267 -462099 -199046 -52274 -551790
18701 -551790 -341538 27908 -278725 283073 -115510 251498 -139321 -67249 294085 32809
18690 20744 406 -42193 -153300 -162567 -120392 -82275 140623 -265560 282548 -74720 -50842
18679 -50842 -263823 -169813 -89868 31994 116304 5520 58039 -269347 -394059 -1906 -150778
18668 -150778 21260 -235640 -18086 26186 227781 138135 13686 88252 -92306 -136953 150070
18656 -48877 313774 -42863 -358849 -57469 89819 -295458 -99132 -130122 -222540 -5899 -217169
18645b17169N0521J76k40287a42703M5435k62941A68462b9469A0487J4001a54946
18633e7743l73653f5262b9694n66718e423m59845G2512a62397E1647a12654H539
18621d161n29229a15490a0432B5969R1797c66880D47605a54788F113a66026A60767
18609A03131a91220A65249a60296a3949j34118n2892P2299k25178a01188A30725
18598A45480h2122C21137a03287B1034c10186c2228l93887b7252j92233K1443
18588a98042A47808f0749A9992c20182A1382b57238M4870B8545M163N30i0621
18576f8314c0341j31324A09622b22297j4432j29294a54891j05349A83575a63676
18565c57582A95319l7989B931c36960a61119A26136m5295Q9060a31529j56803
$$ plain form
18645 -217169 -166648 -166472 -406759 -142703 -97268 -360209 168462 -29469 10487 24488 -154946
18633 -57743 -431396 -65262 -29694 -596412 -5423 -465268 72512 -162397 51647 -112654 8539
18621 -4161 -533390 -115490 -10432 25969 117766 -366880 447605 -154788 6113 -166026 160767
18609 103131 -191220 165249 -160296 -13949 -148067 -200959 -128660 -353838 -101188 130725
18598 145480 -82122 321137 -103287 21034 -310186 -32228 -426115 -27252 -219485 -198042
18588 -198042 147808 -60749 19992 -320182 11382 -257238 -212368 28545 32708 33238 -90621
18576 -68314 -30341 -161665 109622 -222297 -236729 -366023 -154891 -260240 183575 -163676
18565 -357582 195319 157330 2931 -336960 -161119 126136 80841 169901 -131529 -288332
18555b88332O8085A98092b20670a07754j00172c7573B2394K9184b66288d6311
18544G1204I484Q0864g1451k68080b7827k97606A27803c26400J1505a38859C5424
18532A88890b30412A73131h2929I2160a91245P2661e4888l15523B31374a03128
18521a22855J6589D1032c1965a0457A23187b22088R3470N1963A09959a43542B44248
18509C23013b40990G017a72235e1665k5748B232a03154p1895D10432D588a3154
18497a66842O3475K3250I8089c70266o6236e5988n0624o4727r7905A14698b05818
18485a7058C46610a19550j960i802k66157R106A9363b53473I7243J6491Q5557
18474A99291b30045O62d3350H2597a00485A7590d5890o5436B40204b21707C39774
$$ plain form
18555 -288332 -220247 198092 -220670 -107754 -207926 -37573 22394 51578 -266288 -46311
18544 71204 9484 90348 -71451 -339531 -27827 -325433 127803 -326400 -314895 -138859 35424
18532 188890 -230412 173131 -82929 92160 -191245 -118584 -54888 -370411 231374 -103128
18521 -122855 -106266 41032 -31965 -10457 123187 -222088 -128618 -76655 109959 -143542 244248
18509 323013 -240990 7017 -172235 -51665 -77413 2232 -103154 -175049 410432 4588 -13154
18497 -166842 -103367 -80117 98089 -370266 -436502 -55988 -106612 -171339 -269244 114698 -205818
18485 -17058 346610 -119550 -121510 -9802 -275959 -266853 19363 -253473 97243 113734 199291
18474 199291 -230045 -229383 -43350 82597 -100485 17590 -45890 -111326 240204 -221707 339774
18462g3896J8436A42069F9045g0835j26914B46386c47493A71874b3561B11465
18451D8490b1458l0206n8407B3384J82762C5469F702a97940h2684j29893e5309
18439g8459E259a1898F01J15889A1539a2422l74513J71489A74309F817d1813B4012
18426b36037D7595i3456l46421C28176A4207K60523b3717A32216N2964J05128
18416B90308a09413P616B87334b91591a31897o0603A56272j4423B8157J32610
18406A60767B7737J5577a4737m5855A20599A2271f032k13986q155O4944F8237
18394g9412C4845b00644A68941l9504j9109b42379A35816K12456A49759a1424
18383A50765b56667H9443d7556k798j71383R2086c0095p3123E4822K15869b54051
$$ plain form
18462 -73896 -55460 142069 69045 -70835 -197749 246386 -347493 171874 -23561 211465
18451 48490 -21458 -51664 -110071 23384 206146 35469 6702 -197940 -82684 -212577 -55309
18439 -78459 5259 -11898 601 116490 11539 -12422 -386935 -215446 174309 6817 -41813 24012
18426 -236037 47595 -93456 -439877 328176 14207 274730 -23717 132216 185180 290308
18416 290308 -109413 -101797 287334 -291591 -131897 -192500 156272 141849 28157 160767
18406 160767 27737 43314 -14737 -60592 120599 12271 -6032 -220018 -228173 -163229 68237
18394 -79412 34845 -200644 168941 129437 110328 -242379 135816 348272 149759 -11424
18383 150765 -256667 89443 -47556 -50354 -221737 -129651 -30095 -103218 54822 270691 -254051
18371d00751g59j88376I471a49061k2915a6335l1201j5318b5408j15739f8912
18359a44342C7604J0736e3063k96373C5177R0469b412F3915a27920J9434A22852
18347A41632c19428M6362D49101d4786j3637l78104B90332b59092J02878e0054
18336A32727g2622k34027A7349e0202E5274b24264M5881G6183k6356a30871M4661
18325h6210B25754b60221A65486B8852f4542D2675c8974j77420j30684A21458
18314e1183f617A62501b80731P396a7487r8672A07733l7205d6785H669d12721
18302g2275r9827l03668a44100d9325A86857M3118a84875f6649A01735C7513L52511
18291C90024G4368H687J64476K64415j03811b38353A54791M3835C599K52970p6258
$$ plain form
18371 -400751 -759 -189135 9471 -149061 -171976 -16335 -47536 -62854 -25408 -141147 -68912
18359 -144342 37604 48340 -53063 -349436 35177 125646 -2412 63915 -127920 -108486 122852
18347 141632 -319428 -273066 449101 -44786 -58423 -436527 290332 -259092 -156214 -50054
18336 132727 -72622 -306649 17349 -50202 55274 -224264 -178383 76183 49827 -130871 -86210
18325 -86210 225754 -260221 165486 28852 -64542 42675 -38974 -216394 -347078 121458
18314 -51183 -6617 162501 -280731 -273335 -17487 -116159 107733 70528 -46785 8669 -412721
18302 -72275 -172102 -475770 -144100 -49325 186857 229975 -184875 -66649 101735 37513 390024
18291 390024 74368 8687 173163 437578 333767 -238353 154791 198626 3599 256569 180311
18280A80311c3929G1373b69883H7816b03350b224l55376F1270a42714n5263m8356
18269b46333C6010b9559A6412b62375a15960A12139d57484b22624A6059b15023
18258h8992o9612J1508n9575J9850f921E7251a50285j36291D8798c8953l6680
18247g5633j40755E40509f8650J5371j06223B51056a75290f1605J3174B77405
18236D5926b89510J0897F1305b74199a14444a2622A07679d8875r8070M179H5155
18224F0729K9403R897b1927A21719J64318c54807A10105B8727a36806A31948A1476
18212b02252a8774k89275I4284a00193D6349c59738C2342b29851B27595d1883
18201b97468A44681J31266f0807j06804B17855b24958l7153h9507n9035N3365
$$ plain form
18280 180311 -33929 71373 -269883 87816 -203350 -2224 -357600 61270 -142714 -197977 -246333
18269 -246333 36010 -29559 16412 -262375 -115960 112139 -457484 -222624 16059 -215023
18258 -88992 -158604 -147096 -206671 -186821 -6921 57251 -150285 -286576 48798 -38953 -75633
18247 -75633 -216388 540509 -68650 -53279 -159502 251056 -175290 -61605 -48431 277405
18236 45926 -289510 -278613 61305 -274199 -114444 -12622 107679 -48875 -146945 -142766 85155
18224 60729 90132 100029 -21927 121719 286037 -354807 110105 28727 -136806 131948 11476
18212 -202252 -18774 -308049 94284 -100193 46349 -359738 32342 -229851 227595 -41883
18201 -297468 144681 275947 -60807 -167611 217855 -224958 -262111 -89507 -148542 -95177
18191i5177M2021j48167B43486b9066B27675j02815J12889i4505k42884B41403
18180a53640B51611f0224K8602l0745D3970j9539J12877L4926K816e0480A21595
18168C80030f4870r5152A68044a03981K0536b7003k44068Q9025j13682A77442
18157C39246b28450i7373M1107B14220b17079m7245A21256c14223B60635M8157
18147C08792i5359q5376O6299K3016L1405A66024E6052c14847f6906k82845F5646
18135f9230G9624C5950J6930a01057k6484E4788b12788d956A02556c30189a34142
18123E5009e9654H2949A9780c72498D0399L13633a62513a3009l37809J41655F6196
18111F470c2305A05734l7279b44305C5179b6728p6572k59439i6058E39b021j65597
$$ plain form
18191 -95177 -53156 -201323 243486 -29066 227675 124860 237749 -94505 -337389 241403
18180 -153640 251611 -60224 -31622 -62367 43970 24431 137308 172234 175050 -50480 121595
18168 380030 -64870 -160022 168044 -103981 -83445 -27003 -271071 -182046 -295728 177442
18157 339246 -228450 -97373 -56266 214220 -217079 -264324 121256 -314223 260635 308792
18147 308792 -95359 -180735 -114436 -91420 -60015 166024 56052 -314847 -66906 -349751 65646
18135 -69230 79624 35950 52880 -101057 -127541 54788 -212788 -4956 102556 -330189 -134142
18123 55009 -59654 82949 19780 -372498 40399 354032 -162513 -13009 -350818 -209163 66196
18111 6470 -32305 105734 68455 -244305 35179 -26728 -103300 -362739 -96058 539 -2021 -167618
18099a67618G7661f9990a7554j36160L3334A84824C1166a14479j31944B22586
18088A64473m6589P3867J34605C7588a55963q956r1751E16013d8414b2396C7165
18076b6109r850A06541D0805g4033j07343h5565I7459a83286M7604A88529q1184
18065A07345C4224d35908A54426c62804J46776A52850a52319I2022d18114i3698
18054E75048C8969e22455a33043O3824i442l68568a02488c9604G9386c74970h496
18042h8105l0245B45875J47124b06138A88934R4475Q6893F4405c5110F1300a92567
18030a42035A92211a02472p7347I7942J54700j20627c5331A03242e0160A99660
18019c49709B85296n6847a67485A02652d511A30220j4060d0503j4953j45816C35192
$$ plain form
18099 -167618 77661 -69990 -17554 -153714 -120380 184824 31166 -114479 -246423 222586
18088 164473 117884 191751 326356 37588 -155963 -164919 -256670 516013 -48414 -22396 37165
18076 -26109 -35959 106541 40805 -74033 -181376 -85565 97459 -183286 -135682 188529 107345
18065 107345 34224 -435908 154426 -362804 -216028 152850 -152319 92022 -418114 -93698
18054 575048 38969 -522455 -133043 -69219 -9442 -378010 -102488 -39604 79386 -374970 -8496
18042 -88105 -118350 245875 392999 -206138 188934 283409 370302 64405 -35110 61300 -192567
18030 -142035 192211 -102472 -179819 97942 252642 132015 -35331 103242 -50160 199660
18019 -349709 285296 228449 -167485 102652 -4511 130220 116160 -40503 -55456 -201272 335192
18007e8983B15914a15027A2927J46627c60016B38365A8596i488o937A61289D4596
17995b51359R2367A67742o3161J0576e5208j93599K3043f6491k665N969k17790
17984b80977A37895A5267i6279A21456B3138a59121n8044F5182P3682h9336A20767
17972c6047n864j10026A36542f5430b2867l5250j34428f526B65688R983o1937
17961B13734k4563f2620n6633A32582a96076E4363b0031A6519J34541E9247B7209
17949f3023h550A31592Q692a01970A45117E7955J12806o3179b1146C74051A22559
17937A69493a31650e6188B87480b72147A30383f3846F8023J20488f576o5988j41656
17926b14220b4309k00151c9157A12438b631A34415h7884E58N1844O3134L04255
$$ plain form
18007 -58983 215914 -115027 12927 159554 -360016 238365 18596 -9488 -16425 161289 44596
17995 -251359 -158992 167742 104581 115157 -55208 -248807 -225764 -66491 -69156 -63187 -280977
17984 -280977 137895 15267 -96279 121456 23138 -159121 -217165 65182 138864 -89336 120767
17972 -36047 -41911 -151937 136542 -65430 -22867 -58117 -192545 -6526 265688 275671 213734
17961 213734 189171 -62620 -119253 132582 -196076 54363 -20031 16519 151060 59247 27209
17949 -63023 -8550 131592 140284 -101970 145117 57955 170761 107582 -21146 374051 122559
17937 169493 -131650 -56188 287480 -272147 130383 -63846 68023 188511 -6576 -72564 -214220
17926 -214220 -24309 -224460 -39157 112438 -2631 134415 -87884 558 52402 115536 419791
17915D19791A12069K77508B9344d14414i73C2992b03934f8594a2388A3219J98468
17904B11687B4528a96557E865Q7727b44129Q7715r2122H7025a01931B3247a11253
17892A28512m054a61585P27B51030A16618K4247g0374n0068D2991L05604l9032
17881C09563A05483e3109k10451J07760E5823J09489h5593A04950d41504a37931
17870i7217B02216l6109b22163O7621c8611i386j25918E4233b4503B66430c02893
17858c85876B99054a3126l01062i8317D49364A59555F8802a30980E2203P1484
17848A23687J71613b61341h3171K3476r170I1945J59897e68468c078G4853A9796
17836b33464B23605a09209A56075j3332c2313j69349q058A48426d6756j25410
$$ plain form
17915 419791 112069 389577 29344 -414414 -973 32992 -203934 -68594 -12388 13219 211687
17904 211687 24528 -196557 5865 93592 -244129 -156414 -248536 87025 -101931 23247 -111253
17892 128512 124458 -161585 -160858 251030 116618 140865 -70374 -120442 42991 348595 309563
17881 309563 105483 -53109 -263560 -155800 55823 165312 -85593 104950 -441504 -137931
17870 -97217 202216 166107 -222163 -154542 -38611 -9386 -135304 54233 -24503 266430 -302893
17858 -385876 299054 -13126 -314188 -98317 449364 159555 68802 -130980 52203 123687
17848 123687 295300 -261341 -83171 -59695 -68865 91945 251842 -568468 -3078 74853 19796
17836 -233464 223605 -109209 156075 142743 -32313 -201662 -209720 148426 -46756 -172166
17826a72166m9191B3054J44642a91607L2582B96401a21016j9079F62020a72966
17815A70997a25569B47418j16899l0220E86J60525p2384N534a7997F4526a61552
17803A87474J25772b06608A02617a23364A37141a49803O8578j61179j51567a29358
17792i410C52872a74152R283B36917b12162F6800b5650C8129L54118C3180a13164
17780a50254B21866j00410m5958e1491k0812p087B96091h0536B3032J61873e2879
17768a935A25308a32764B53926A12321a94724B23758N5912n6098B1819g7038B94268
17756b83776J35200r8834D3498g2139l08252B85043f1202E6886b51757C05733
17745f5446A96793N7507j21068f2974E180a33682c99C0724K95132j1214K46726
$$ plain form
17826 -172166 -221357 23054 167696 -191607 -159025 296401 -121016 -140095 662020 -172966
17815 170997 -125569 247418 130519 100299 586 161111 88727 94261 -17997 64526 -161552
17803 187474 313246 -206608 102617 -123364 137141 -149803 -81225 -242404 -393971 -129358
17792 -9410 352872 -174152 -164869 236917 -212162 66800 -25650 38129 392247 33180 -113164
17780 -150254 221866 121456 75498 -51491 -72303 -79390 296091 -80536 23032 184905 -52879
17768 -1935 125308 -132764 253926 112321 -194724 223758 279670 223572 21819 -77038 294268
17756 -283776 -148576 -247410 43498 -72139 -380391 285043 -61202 56886 -251757 305733
17745 -65446 196793 254300 133232 -62974 5180 -133682 -399 30724 325856 314642 561368
17734E61368f8616B42473E2542J70519o1389K30133a08740A6669Q47Q2657i0717
17722b95664J39905A70616a21118G4945Q5328J33445K00040b12938i8433A91451
17711G4873K03553O3199l1868q0748K12f6233B75448Q1084j49748k0060J08910
17700B95634o5658h5995H0689a83987F6823l28d27061C03863b8164E5355J52108
17689B07463a01553F0835b10095e9950b8751j54271I7033J00926I8060K32331
17679C30391d1728M636A87934c6071B8661f7109A18466m9839a48405I6391p165
17668H9226L1332r407D3944c67599a17441d7419B55289E2080a37370D73660A70724
17656a37647A23390L2211M9825D0814J18861a59636E3553e6450A43633M0049k879
$$ plain form
17734 561368 -68616 242473 52542 223061 161672 391805 -108740 16669 17516 100173 -90717
17722 -295664 -155759 170616 -121118 74945 160273 293718 493758 -212938 -98433 191451
17711 74873 278426 341625 309757 229009 229221 -66233 275448 356532 206784 186724 295634
17700 295634 229976 -85995 80689 -183987 66823 66495 -427061 303863 -28164 55355 207463
17689 207463 -101553 60835 -210095 -59950 -28751 -183022 97033 197959 98060 330391
17679 330391 -41728 -37092 187934 -36071 28661 -67109 118466 68627 -148405 96391 89226
17668 89226 120558 111151 43944 -367599 -117441 -47419 255289 52080 -137370 473660 170724
17656 -137647 123390 155601 205426 40814 159675 -159636 53553 -56450 143633 183682 180803
17645A80803a87794C2835J09648N3721m4292p2571h6385A29885K56083G2661h9069
17633A48890L92754F6717O6854J93563F3614K37348f9350C139J22441n0134J02518
17622A77964F8771C4192a45328B52654b43548c4449E97240e5472B94200I5147
17611B60434K2240M112q8228K42604F8069A1668M63554k15835F6993J98944p0396
17600A95541R2150A3825R6644k1631c04605J48304N0103G3786K15400A32978C2505
17588B04878m0881K36b50256B47332a02279F8058L982a00781c5201p1675C84978
17576e6719G4562J69521d5160A75244J88327A6717K93944j38856N4269D055K67837
17565B71892J00488n1928m3966H0178J11141p1859O8564J8087J80565n3788j27137
$$ plain form
17645 180803 -187794 32835 142483 196204 151912 79341 -86385 129885 385968 72661 -89069
17633 148890 541644 66717 133571 327134 63614 300962 -69350 3139 125580 75446 177964
17622 177964 68771 34192 -145328 252654 -243548 -34449 597240 -55472 294200 95147
17611 260434 282674 286786 198558 441162 68069 11668 475222 259387 66993 265937 195541
17600 195541 287691 13825 110469 88838 -304605 -156301 -106198 73786 289186 132978 32505
17588 204878 163997 164233 -250256 247332 -102279 68058 72040 -100781 -35201 -106876 384978
17576 -56719 74562 244083 -45160 175244 363571 16717 310661 171805 226074 4055 271892
17565 271892 372380 320452 276486 80178 191319 119460 188024 206111 386676 332888 205751
17554B05751M2467m7813N8884F5520K32717A25973m6677a97816d8250A57460P6803
17543B34263D5888K38620J28615o2882A54093m4066L08089A09151Q9602Q3171
17533B81924o4806k0777I3005J71306K24470k40071Q3746M6238j24255K52886
17523E07325A64315l062d8268A26647J86990j56447N57475A10987n217K35224
17513C40994K83757j94167K0244L98922k2953K61633k11332l65280K74702C38500
17502C22548K5968L54105L9411j95504j55841P7563M1367K21233n2334L84767
17492A063283D88941K3325p4969L29338B75376M58877l28948J11121k00438q6002
17482B29986l0399J61157J25387I3524j8516f3981A66871H3241M14714M6502A77741
$$ plain form
17554 205751 248218 200405 259289 65520 298237 125973 79296 -197816 -48250 157460 234263
17543 234263 45888 284508 413123 350241 154093 110027 418116 109151 198753 281924
17533 281924 217118 196341 93005 264311 488781 248710 332456 378694 254439 507325
17523 507325 164315 161253 -48268 126647 313637 157190 714665 110987 105770 340994
17513 340994 624751 430584 450828 849750 826797 1088430 877098 511818 786520 338500
17502 322548 348516 702621 742032 546528 390687 468250 509617 730850 678516 1063283
17492 1063283 488941 512266 437297 766635 275376 734253 405305 516426 315988 229986
17482 229986 199587 360744 486131 93524 75008 -63981 166871 83241 497955 544457 177741
17470D03822I2836L97767j9273A93009J47946j07616J48725q9032Q726O6839A04299
17458D66553A93807K14831G3791J36242J00449P6009J46564a43110L9519E5996
17447B24970C7470N45575A10839J28695b7833B99384J12564j81476H8430j2516
17437G5914g612D47775N5940A56650K24300A76240F3007L66891A41018J96889
17427C37907R4767K18093l24683A9501J47456K92620j3216B22568K39711n9241
17417D03038E2864O3974L91360P9178A72407K91218n3641j34705L61302B41926
17406A23861N2755L17537B18538m4977O2238q9324P8937J18218P0499j05072a47436
17394C17078j11781J17647d049B21325b9136B99860K54286k68293N6428j49180
$$ plain form
17470 403822 92836 490603 471330 193009 340955 233339 382064 293032 301758 368597 104299
17458 466553 193807 408638 73791 210033 310482 386491 533055 -143110 -103591 55996
17447 224970 37470 583045 110839 239534 -27833 299384 411948 230472 88430 75914
17437 75914 -7612 447775 503715 156650 380950 176240 63007 429898 141018 337907
17427 337907 432674 650767 326084 19501 166957 459577 446361 222568 462279 403038
17417 403038 52864 116838 508198 587376 172407 463625 409984 275279 636581 241926
17406 123861 176616 494153 218538 173561 235799 146475 225412 343630 414129 309057 -147436
17394 317078 205297 322944 -4049 221325 -29136 299860 554146 285853 342281 193101
17384A93101b16084G7606P9333q514i3461B60868D5676J64719o6634K1250J5459
17373A80470L00176j46294C7916a1036B46343J13357G1591N533N4447J16947J31252
17362C79770j83434J15196J97592A52416f7318B0261K76766o364a40930A13496
17351B33888k23L33159j10496j70380P4056A11267K56737j3727A61782J00924
17341B62706q9878j2304J93926A62935J02779J40108F9827L13164J77063E6623
17330A70494k3535K77822e8826A78763C8437J78341p3096B7329L32657j19566
17320B40420J87185r8356K17262a30894A65453O6598J07394A19654J52204l5182
17310B36676E2381K34169A37576L17708K22105B17395J01457C7540N87803C11177
$$ plain form
17384 193101 -216084 77606 156939 148425 -93461 260868 45676 210395 143761 165011 180470
17373 180470 480646 334352 37916 -11036 246343 359700 71591 77124 131571 248518 379770
17362 379770 196336 311532 509124 152416 -67318 20261 297027 290663 -140930 113496
17351 233888 233665 566824 456328 285948 360004 111267 368004 354277 161782 262706
17341 262706 172828 160524 354450 162935 265714 405822 69827 382991 560054 56623
17330 170494 146959 424781 -58826 178763 38437 216778 143682 27329 359986 240420
17320 240420 427605 329249 546511 -130894 165453 232051 339445 119654 271858 236676
17310 236676 52381 286550 137576 455284 677389 217395 318852 37540 625343 311177
17299C70362A18743K80218n7453p1098N643B4733L67069j41285I8377Q0054F3149
17287A10510J41365j03299K36218j2065K171P5145A24656n555J81303q7867q5209
17276A27328J79854J0868J20317J80958B00632J46086b27502j4392D88868j6989
17266D71879A34469L35955A47904k1853K94756j92284J37764j06043M50657C35238
17255E67371k80901r1686J13340p9988a4093D33153l8026l594F5351M18047D973
17243B39001R8214J57801b6556C40931j16374E9353J35539H7817L00390A89158
17232D35300E6780N33239D3743P04371B99458j4728K39075A28394E5435M70993
17222E26428B10766K55972j96337K70760B48738K68139k35630J77482J6003A30613
$$ plain form
17299 370362 118743 398961 341508 270410 276053 24733 391802 250517 98377 178431 63149
17287 110510 251875 148576 384794 372729 374900 450045 124656 119101 300404 212537 127328
17276 127328 307182 318050 438367 619325 200632 346718 -227502 -241894 488868 471879
17266 471879 134469 470424 147904 126051 420807 228523 366287 260244 710901 335238
17255 567371 286470 194784 308124 228136 -14093 433153 395127 391533 65351 483398 4973
17243 239001 337215 495016 -26556 340931 224557 59353 194892 87817 388207 189158
17232 435300 56780 590019 43743 748114 299458 284730 523805 128394 55435 526428
17222 526428 210766 466738 270401 541161 248738 516877 281247 458729 474732 130613
17211D40166K251j50990Q8658N9032A44678N69521r8407j80022n7989J05899A10352
17199C65820K96080A93186J96145j11120k9489K53982g7649E10852I1589M18582
17189E10171B48670j01207K88667M3203k27640K57519J79750B53938L10026A07353
17178E47217P0661m2785k59904O0246l5978J58556m9693J03862j37826l0718j06680
17167B76958K49993J83767C26867J64336r8831L0323r5949J61518J57278j43594
17157E01948k08816k1868j11676L65307l4204L27357B90965K0746K40965k18304
17147C34372L98689k89915J97182j14627j56390q2342j0489K77138j47627j09210
17137B96781L05802m1681j91194L94788l59719J80509P287k55933J52582j3143
$$ plain form
17211 440166 442417 291427 380085 439117 144678 714199 615792 435770 377781 483680 110352
17199 365820 661900 193186 389331 278211 248722 502704 -77649 510852 91589 510171
17189 510171 248670 147463 436130 479333 251693 509212 688962 253938 563964 107353
17178 547217 617878 575093 315189 375435 339457 498013 448320 552182 414356 383638 276958
17167 276958 526951 710718 326867 491203 392372 422695 326746 488264 645542 501948
17157 501948 293132 271264 159588 524895 490691 818048 290965 311711 552676 334372
17147 334372 733061 443146 640328 525701 369311 286969 276480 553618 405991 296781
17137 296781 602583 560902 369708 764496 404777 585286 592573 336640 489222 476079
17127D76079M27404m42703J63661P6447k50281K82302k66416m0525P2396n7528
17117D40836k1493j00447Q4221K75421P974C31531M21181k59471J20204r2743
17107E20702l3889M1650j60282J40091p7692K9174K71707k15330K13404j1291
17097G18244r8201j39939J93253k9243k4145k2504O2248K91125D40423J37839
17087E78262J92759k24516q5678J67268n440k28497K33342j25748j93827N19707
17077H27632l30330J50985J64922J93593j34672k7561l78920K67656j66124R3614
17067F60795j86192J00343M2429M8061M8270J56434l50437j01218p268J24286
17057E35503J30193q7782K12346n4272J57100p8116j47506j65614K77670Q7495
$$ plain form
17127 476079 903483 460780 624441 700888 450607 732909 466493 425968 498364 440836
17117 440836 419343 318896 403117 678538 686512 331531 752712 493241 613445 520702
17107 520702 486813 528463 368181 508272 430580 459754 731461 516131 729535 718244
17097 718244 620043 480104 673357 644114 619969 597465 659713 950838 440423 578262
17087 578262 771021 546505 460827 628095 622655 394158 627500 501752 307925 827632
17077 827632 497302 648287 813209 1006802 872130 844569 465649 733305 567181 660795
17067 660795 474603 574946 617375 665436 713706 870140 519703 418485 411217 535503
17057 535503 665696 577914 790260 735988 893088 814972 667466 501852 779522 867017
17047H67017r4145K02783j91519Q8483L30623m03183J48918n0147J91976l42848
17037G47958q4524J55178L95584m00152j24287J29987j62268J53828J11407k3857
17027H98854P3411J33637n29875K49226K6082L7093j30393L3995M19376l52114
17017H59292Q0264o5880l9341K32866p9120k35891K38713p2993J73247K33008
17007A324165l96378K52108M515k17398j60527J90885P9357J59944j24015k35370
16997H77286J66928K9718J1928k96748M61939k70172n5970K98591j35525K08988
16987A296963M48052o45354k06583J42694K78790j94032K42990J8987j97562j95939
16977I89006K32385q3339n3016K95216k49593M66505l97354J56709j2125k40156
$$ plain form
17047 867017 772872 975655 784136 872619 1203242 800059 948977 898830 1090806 747958
17037 747958 663434 818612 1214196 814044 689757 819744 657476 811304 922711 898854
17027 898854 972265 1105902 576027 825253 851335 888428 758035 792030 1211406 859292
17017 859292 939556 873676 834335 1067201 988081 752190 990903 917910 1091157 1324165
17007 1324165 927787 1179895 1184410 967012 806485 997370 1076727 1236671 1112656 877286
16997 877286 1044214 1073932 1085860 789112 1251051 980879 924909 1223500 1087975 1296963
16987 1296963 1745015 1099661 893078 1035772 1314562 1120530 1363520 1382507 1184945 989006
16977 989006 1221391 1138052 1085036 1380252 1130659 1597164 1199810 1356519 1344394 1104238
16967A104238R9726J04224K93008n58636N45226j82870k1502J82939j72217M43562
16957A837698l50335j56869J22864k9940n9436l4708P0831K06858K15757k43574
16947A579146K64361k03446j7871j88041M3968P0732K6643K45520m64964K01049
16937A557097Q2881j9626l2813J34745k9321K27914k85496L11291j84023J27807
16927A890456k97497N73271k92911j86333K21360j10054L18852m39564K35390
16918A912970J02775J36594r7630J16532q9336J91690j57255j27643K34188p6193
16908B146692m3226n6989L61218k40766K66132J00836p9480R0969l04358K61912
16898B502940q9301K61441k65580J78784K78798l95507J13022j49240L40067o7800
$$ plain form
16967 1104238 1203964 1308188 1601196 1042560 1587786 1404916 1383414 1566353 1394136 1837698
16957 1837698 1487363 1330494 1453358 1423418 1363982 1329274 1400105 1606963 1822720 1579146
16947 1579146 1843507 1640061 1622190 1434149 1478117 1548849 1575492 1821012 1356048 1557097
16937 1557097 1639978 1620352 1587539 1722284 1692963 1920877 1635381 1946672 1762649 1890456
16927 1890456 1592959 2166230 1873319 1686986 1908346 1798292 2117144 1677580 1912970
16918 1912970 2015745 2152339 2054709 2171241 2081905 2273595 2116340 1988697 2222885 2146692
16908 2146692 2103466 2046477 2407695 2166929 2433061 2533897 2454417 2545386 2241028 2502940
16898 2502940 2413639 2675080 2409500 2588284 2867082 2471575 2584597 2435357 2775424 2707624
16888B707624l09708J68258O1581K81223m464m03583L15965J6577L1267J71973
16878C036713p0934M93196n57514M25312r7940J2738L67764n72686Q129N77488
16868C622266l30801J46295r5067N90557n25824K68227q8330R9771P5095k23730
16858C538459J36168O22705m04639R8040J22630m2296P84K9786M54071m31301
16848D124407K01219j5033O0260M13184M602k02272K06589J02151K0269P6064
16838D991440M84262o16406J71181J98786J17836J29117m8068P8717K43783n3800
16828E696848K24786N6174K54477J30738N5362j01314J24229r5298O44681k44351
16818F746332J78217j24679K19523O14716k05154N4398K42001k15361O46295l19164
$$ plain form
16888 2707624 2397916 2566174 2627755 2908978 2904514 2500931 2816896 2833473 2864740 3036713
16878 3036713 2965779 3458975 2901461 3326773 3228833 3241571 3609335 3036649 3044778 3622266
16868 3622266 3291465 3437760 3342693 3933250 3407426 3675653 3587323 3687094 3762189 3538459
16858 3538459 3674627 4297332 3892693 3990733 4113363 4071067 4071851 4101637 4555708 4124407
16848 4124407 4325626 4310593 4370853 4784037 4788639 4586367 4792956 4895107 4915376 4991440
16838 4991440 5475702 4859296 5030477 5229263 5347099 5476216 5428148 5506865 5750648 5696848
16828 5696848 5921634 5977808 6232285 6363023 6418385 6317071 6441300 6346002 6990683 6746332
16818 6746332 6924549 6799870 7019393 7634109 7428955 7483353 7725354 7509993 8156288 7837124
16808G837124K40972K56976k4011M55806J41404J89439N52228n46008L17352L44616
16798I765898m2303N48469l7906N42485l77728O39071L17476O04768k01309J16989
16788A1875910M72535P9632L01842N60693r1440N08220L17942L19913N00393J84271
16778A5029911M71553K14612N06325M64060M34467M31864N09479N22112K73463
16769A8857846P23703N18547K87443N43704R84354N49281O05586R33869M63559
16760B4467892Q68434N61869N40148Q00117R46184J113655O07434J252347J152329
16751C2310409Q16536J314059Q83727J373206J186824J345041J428104J585096
16743D2243002J411464J368836K003279J621175K027830J611790K133681J902565
$$ plain form
16808 7837124 8078096 8335072 8311061 8766867 8908271 9097710 9649938 9103930 9421282 9765898
16798 9765898 9723595 10272064 10234158 10776643 10398915 11037986 11355462 11960230 11758921 11875910
16788 11875910 12348445 12428077 12729919 13290612 13199172 13707392 14025334 14345247 14845640 15029911
16778 15029911 15501464 15716076 16222401 16686461 17120928 17552792 18062271 18584383 18857846
16769 18857846 19581549 20100096 20387539 20931243 21915597 22464878 23070464 24004333 24467892
16760 24467892 25336326 25898195 26438343 27238460 28184644 29298299 29905733 31158080 32310409
16751 32310409 33126945 34441004 35324731 36697937 37884761 39229802 40657906 42243002
16743 42243002 43654466 45023302 47026581 48647756 50675586 52287376 54421057 56323622
16735E6323622K397487J876503K610028K331216K858774K413614K643903L030069
16727G6485216K775050L285089L017149L165552K946579L430755L274775L237146
16719A01617311L489288L168206L291348K791599K942526L043974K548222K117839
16711A25010313J745545J960092J059136R25657O96387N97912k11660m95892r50436
16702A30337054j469205j682642k047039k058931k649326k705831l001001k981431
16694A11741648l464639l423422l063416l622718l353010l299951l351967l106406
16686H5056119l288571l100817k904182k838002l057875k890705k638477k524443
16678F1813047k622602k051435k671988j712780k241703k042548j476858k300719
$$ plain form
16735 56323622 58721109 60597612 63207640 65538856 68397630 70811244 73455147 76485216
16727 76485216 79260266 82545355 85562504 88728056 91674635 95105390 98380165 101617311
16719 101617311 105106599 108274805 111566153 114357752 117300278 120344252 122892474 125010313
16711 125010313 126755858 128715950 129775086 130700743 131397130 131995042 131783382 131287490 130337054
16702 130337054 128867849 127185207 125138168 123079237 120429911 117724080 114723079 111741648
16694 111741648 108277009 104853587 101790171 98167453 94814443 91514492 88162525 85056119
16686 85056119 81767548 78666731 75762549 72924547 69866672 66975967 64337490 61813047
16678 61813047 59190445 57139010 54467022 52754242 50512539 48469991 46993133 44692414
16670D4692414j469946j398791j758650j252514j548127j329853r94096j314521
16662C3625916j512655p72192j255278j003404o99135j189547m71583j316589
16654B5405533o71788m84806j116064m82538j210820j46153o81534m32129n92168
16645A9587533r18976j16611n61099o57934l59787o84200n405q54862l41892k86345
16635A4800422l04858m78293n88799M9097m73523q6862n45787j62895l69982j37562
16625A1700958l58672l28488k51062J67550o52632l04597K8332k80906R0986l32862
16615I478607m03747k11673O3026k59252j07502m52679j3473k41706K88824l80212
16605G760213o9903j66546P5734q18781J29817J70n68320L31447N7935k78296
$$ plain form
16670 44692414 43222468 41823677 40065027 38812513 37264386 35934533 34940437 33625916
16662 33625916 32113261 31341069 30085791 29082387 28383252 27193705 26722122 25405533
16654 25405533 24733745 24248939 23132875 22650337 21439517 21293364 20611830 20179701 19587533
16645 19587533 18668557 18551946 17990847 17332913 16973126 16288926 16283521 15428659 15086767 14800422
16635 14800422 14495564 14017271 13428472 13477569 13004046 12917184 12371397 12208502 11838520 11700958
16625 11700958 11342286 11013798 10762736 10930286 10277654 9973057 10001389 9720483 9811469 9478607
16615 9478607 9074860 8863187 8926213 8666961 8559459 8106780 8093307 7851601 8140425 7760213
16605 7760213 7690310 7523764 7599498 6780717 6910534 6910704 6342384 6673831 6731766 6453470
16595F453470j32395M9124l53122K34178l57513M5132n04101Q8232N2900J57561
16585E733466l01313J39205l62748j83052k70918K58263o8697l49250o9290M82917
16575E008583l52144K24724n28454j78565M51536j49959o0859m804m54762N28211
16565D483507m98782K01966k52844P6449k83619p417n1563k51007J33567K46181
16555C796438n78913M34128l32437k20522O09696l1028l97175Q1708k46685J70113
16545C285323k03333L7800Q2808k79336M80309l89556k60796k02254O16465n32747
16535B634683L75969J36836j12148j77284m26650J65205O7254j1803m9068J13369
16525B716363k65521j3976k03389K15792p349n1695j16052k54636M36577n86977
$$ plain form
16595 6453470 6321075 6370199 6017077 6251255 5893742 5938874 5434773 5523005 5575905 5733466
16585 5733466 5432153 5571358 5208610 5025558 4754640 5012903 4944206 4594956 4525666 5008583
16575 5008583 4656439 4881163 4352709 4174144 4625680 4475721 4414862 4410058 3955296 4483507
16565 4483507 3984725 4186691 3933847 4010296 3726677 3719260 3667697 3416690 3550257 3796438
16555 3796438 3217525 3651653 3319216 3098694 3708390 3677362 3280187 3361895 3115210 3285323
16545 3285323 3081990 3119790 3202598 2923262 3403571 3014015 2753219 2550965 3167430 2634683
16535 2634683 3010652 3147488 3035340 2858056 2431406 2596611 2663865 2652062 2602994 2716363
16525 2716363 2450842 2436866 2233477 2449269 2441920 2390225 2274173 2019537 2456114 1869137
16515A869137L80077M9962l34904J02872P5124K02116j85575N7513o4164k4339
16505B127819P4213n2189o1985j14442j79153J16501Q7435o301J36155l37548
16495A790505l8350J94221J16968m82362N1651p9742J08613J94144p4099J71090
16485A952639k23009j59773k21461M95212j98488l2443k01308J98415J35088J08506
16475A853378m42789l0654L74255l93919O47066k35110o16929J40433L3974O7388
16465A397093k35942J81642l4682J1007p5549K97877k03830j28859K27547J54544
16455A590848l46356J51262L53830m18210K42751j10986j51851Q5118k01574j93933
16445A000899J31825P9756J52112N9602L1490j05404j49918R842M2455J99005
$$ plain form
16515 1869137 2249214 2299176 1964272 2067144 2142268 2344384 2158809 2216322 2152158 2127819
16505 2127819 2202032 2149843 2087858 1973416 1794263 1910764 1998199 1991898 2128053 1790505
16495 1790505 1752155 1946376 2063344 1580982 1632633 1552891 1661504 1855648 1781549 1952639
16485 1952639 1729630 1569857 1348396 1843608 1645120 1612677 1411369 1609784 1744872 1853378
16475 1853378 1410589 1379935 1754190 1360271 2007337 1772227 1155298 1295731 1329705 1397093
16465 1397093 1161151 1342793 1308111 1319118 1243569 1541446 1337616 1208757 1436304 1590848
16455 1590848 1244492 1395754 1749584 1331374 1574125 1463139 1311288 1396406 1194832 1000899
16445 1000899 1132724 1212480 1364592 1424194 1455684 1350280 1200362 1210204 1252659 1451664
16435A451664j71270o254N4033l4241J10842j52000j64689r420j9592J77848k52176
16424I84745R9003j60029l65010M89700K43268l51844J36136l20440N62472k87549
16414A030452J32997K15431j57199l59377K76978k52335q432M8261J93953l5542
16404A085187k26253n1029P396P3153N83833l43466j71628J81652J13446m29589
16394H22702L84227m94996K43066j81872l3499L07866j33498p8139m6696J32686
16384I21847l8937R0447l2965k3883k28076L34544m00811r0881O13979j03565
16374A041699l4284P2002j17889j87395L83315l00373j76877L83499l79593J21833
16364H05937J4351j04234J96024J63752k89627k9063L88913m55634J92134l89804
$$ plain form
16435 1451664 1280394 1274140 1328173 1293932 1404774 1252774 1088085 1078665 1059073 1236921 984745
16424 984745 1083748 923719 558709 1048409 1291677 939833 1075969 755529 1318001 1030452
16414 1030452 1163449 1378880 1221681 862304 1139282 886947 878515 926776 1120729 1085187
16404 1085187 858934 807905 815301 888454 1472287 1128821 957193 1138845 1252291 822702
16394 822702 1206929 711933 954999 773127 739628 1047494 913996 835857 789161 921847
16384 921847 882910 973357 940392 916509 688433 1022977 622166 531285 1145264 1041699
16374 1041699 1007415 1079417 961528 774133 1157448 857075 680198 1063697 684104 805937
16364 805937 820288 716054 912078 1075830 786203 757140 1146053 690419 882553 492749
16354D92749M37794D13651O21151l18246J01765j85672J66027O6166N9721m55786
16344D68777j05568K37595P24311m07030n1952k92478J47648J79172l20479P5803
16334F55799j31157l375M28591l32575j6314J34534j41l09262J84812J02539l5007
16323F78444A92540L89678L54202r7899k64936J10349R2783k92539K6993M8656
16313E59827J97084j41580m7619Q9600r8170K61124l46180j52290K6279M15459
16303G63534l4263k20533J06506I9345L31214K27775r3605K62176k04482J46882
16293G69305j24558l7089k71643L25538P4730o3740j28633K1973N2914L1901O0580
16282G11278j29649m7682j7951j50043R2159K04877A33305K35248M50799l13013
$$ plain form
16354 492749 930543 413651 1034802 716556 818321 632649 798676 864842 924563 468777
16344 468777 363209 600804 1325115 918085 866133 573655 721303 900475 579996 655799
16334 655799 524642 521267 949858 617283 600969 735503 735362 426100 610912 713451 678444
16323 678444 192540 582218 936420 838521 573585 683934 776717 484178 511171 559827
16313 559827 756911 615331 567712 657312 559142 820266 474086 321796 348075 763534
16303 763534 729271 508738 615244 99345 430559 658334 564729 826905 622423 769305
16293 769305 644747 607658 336015 661553 736283 672543 543910 565883 618797 650698 711278
16282 711278 581629 533947 515996 365953 458112 662989 133305 368553 819352 506339
16272E06339K47297k0799l1636k70319j2584J35199j05245J29974J56700R3160
16262H28086k02088B76394K91503k04057o6176j6493J48112L13702j1441B72763
16251D68620j359n4297N5849N8049k24091J89109j58277M60997k90215L47968
16241H52353B43583M11577A93422J77592P5584r6236j6948J73201k28220A33372
16230B43016Q9124q958J47295n3404K38488C15360K64948k40424o8715j05704
16220A65465L42956k22649j04206L39957j38713L47825C23343A47381J28891j14930
16210A61342K76232r3211O0314J12679j05327A27713M92021B90492k4109H3469
16199A45027C8275O3300J66624J50167j47229j09698L35922k8309j22581R3945
$$ plain form
16272 506339 753636 732837 701201 430882 418298 553497 448252 578226 734926 828086
16262 828086 625998 276394 567897 363840 297664 281171 429283 742985 731544 272763
16251 468620 467261 412964 468813 526862 302771 491880 333603 794600 504385 852353
16241 852353 243583 655160 193422 371014 446598 350362 333414 506615 278395 133372
16230 243016 332140 323182 470477 417073 655561 315360 580308 339884 271169 165465
16220 165465 508421 285772 181566 521523 382810 730635 323343 147381 276272 161342
16210 161342 437574 344363 404677 517356 412029 127713 619734 290492 266383 83469
16199 145027 38275 101575 268199 418366 271137 161439 497361 469052 346471 440416
16189D40416J111O0535G0023J61599p7700k8998L82690F1872K70350j8047p8982
16178B35193O7555J5743l3723K02394j93777M8751q5777M95052k64306A03387
16167A70254Q9118O1978A58458J06353j343N87R3885j62390J3860J98075p0519
16156C36966A23450J03167R9987B3866D898J77013K32524B01040K2531J31231
16146C54802J61663A32066l5592L12056A49280P910J76422j34083J76364p4134
16136C01759C554J22367O6072H5303L64634I0024B0951b03789E41073B31464n1860
16125A79604J88378a64033C78172A07250J33289P0133e00169A41200P0400J71890
16115C83490J75113A32535l3426J46737P66f9804A93767r6465J10422f7078A56895
$$ plain form
16189 440416 441527 502062 70023 231622 153922 124924 507614 61872 332222 314175 235193
16178 235193 302748 318491 284768 487162 293385 342136 256359 751411 487105 103387
16167 170254 259372 321350 158458 264811 263468 264055 357940 195550 209410 407485 336966
16156 336966 123450 226617 326604 23866 4898 181911 414435 201040 223571 354802
16146 354802 516465 132066 96474 408530 149280 157190 333612 199529 375893 301759
16136 301759 3554 125921 191993 85303 449937 90024 20951 -203789 541073 231464 179604
16125 179604 367982 -164033 378172 107250 240539 310672 -500169 141200 211600 383490
16115 383490 558603 132535 99109 245846 246612 -69804 193767 97302 207724 -67078 156895
16103I6162K55929p0256J24723j94349F3547M02586C4473c08260a11859A32840
16092A42309E2419a62430E0193j7215M6623C0550R7266J24837K84561c1371j11860
16081a43231A57857K8734l6192b7282F0472J98479M3188G5667K80113a50095A23678
16069b19902e5656A73691J32594B8460J81624K49024a12606A37709N9546b17380
16058a39194r3897A98492a97854B38256a30918c5644H9531k2507J83998A14645
16047B38231q2956J4942m7425E9892J63710a08083L5667H387h8639B97264D9891
16035A44235A9676b0205n7962A56830b26004C38606a00551m7676D01048d5268
16024h2383a8785A2120M0069J5502a26778N1865A15038q242a8593A09104E2218
$$ plain form
16103 96162 352091 281835 406558 212209 63547 466133 34473 -308260 -111859 132840
16092 142309 52419 -162430 50193 32978 79601 30550 127816 252653 537214 -31371 -143231
16081 -143231 157857 186591 150399 -27282 60472 258951 302139 75667 355780 -150095 123678
16069 -219902 -55656 173691 306285 28460 210084 459108 -112606 137709 197255 -217380
16058 -139194 -233091 198492 -197854 238256 -130918 -35644 89531 67024 251022 114645
16047 238231 155275 170217 122792 59892 223602 -108083 -72416 8387 -88639 297264 49891
16035 144235 19676 -20205 -78167 156830 -226004 338606 -100551 -148227 401048 -45268
16024 -82383 -18785 12120 52189 67691 -126778 -74913 115038 106796 -18593 109104 52218
16012G4270R8771J70876g5780q4081A56291a3861A38080c04600I2091N062J65299
16001B62452a19248F3127K62189c50192a37244j25630e3597Q623B03689b34088
15990B34508b60093B29732J9036b61182F1142J82639r4063b6088A64219j7473
15980A46746N0745l8846c2116R681B96709q6128l91L14117J97580P3897M0101
15969H35885p9466M2347j40360k95945K70686C15372q6309d9421F0192a05012
15958d8203A11957J139a36077k5012A89082M9978a01742k01491a44270B02654
15947g4958p0571o621e079C32752H8581a64170j37252e9967A36837a93072I9461
15935E5810b8424j88127P3310I3301J0141e4039B21526C2375O7579b5101j3549
$$ plain form
16012 74270 173041 343917 -75780 -159861 156291 -13861 138080 -304600 92091 97153 262452
16001 262452 -119248 63127 325316 -350192 -137244 -262874 -53597 -44974 203689 -234088
15990 234508 -260093 229732 248768 -261182 61142 243781 149718 -26088 164219 146746
15980 146746 197491 158645 -32116 -22435 296709 210581 210190 524307 721887 795784 835885
15969 835885 756419 798766 658406 362461 633147 315372 229063 -49421 60192 -105012
15958 -48203 111957 113096 -136077 -161089 189082 239060 -101742 -303233 -144270 202654
15947 -74958 -145529 -152150 -5079 332752 88581 -164170 -301422 -59967 136837 -193072 99461
15935 55810 -28424 -216551 -143241 93301 103442 -54039 221526 32375 99954 -25101 -38650
15924c8650B73351A34477c41805a05613A95465b472B27502a28743m9498B10539
15913a14872n5933c5746B13342f5802A86a32361M7543l02534g1662C94973a16861
15901C4718a94516D1106a29987n4378D51804c4430L767j01251B5686K237b06940
15889a32697d6049e427A75985d6726C83961b49863A35737b66551d2584A88670
15878a02364j49813j6368K983O7620j70405A16586R9128a57796n9122q8605k6354
15867c31877B11116d24811c9194j21113N7423j83661G2915b90863G9911q402l4024
15856C7485J54985J52113a21771A96903e5497l3314C3001b84536a04766a0437
15845i8433J070B51691e3735B25953B0734a38455H1486b9325A8592a59505A61328
$$ plain form
15924 -38650 273351 134477 -341805 -105613 195465 -2472 227502 -128743 -178241 210539
15913 -114872 -170805 -35746 213342 -65802 186 -132361 -84818 -387352 -71662 394973 -116861
15901 34718 -194516 41106 -129987 -184365 451804 -34430 -30663 -131914 25686 27923 -206940
15889 -132697 -46049 -5427 175985 -46726 383961 -249863 135737 -266551 -42584 188670
15878 -102364 -252177 -268545 -265562 -197942 -368347 116586 215714 -157796 -216918 -305523 -331877
15867 -331877 211116 -424811 -39194 -160307 -102884 -286545 72915 -290863 79911 71509 37485
15856 37485 192470 344583 -121771 196903 -55497 -88811 33001 -284536 -104766 -10437
15845 -98433 -97363 251691 -53735 225953 20734 -138455 81486 -29325 18592 -159505 161328
15833E548a69467j43468b5472B43974b3239D33662a6785o973A6072R0361K74627
15822C81060b9116o3446j93443A3237c72232J79111c4308p5765H2032d6861q2415
15811a29276A77502G5146k9565a51937j9533j15160Q7195B91004D1964a43702
15800C05353b01539A49277a12019p111C00828A4327g3558k6486r1268C72666c40342
15788H1192K32414F6701J33937a96789a6404k60796A899h1486M0281A34106J38297
15777B72403j04990a12999A62034F0455a62826C15533G7001A8699a70030D9122
15766a14134p2114A25633b12271B49230c1757A45460h6811B51708b90120B75202
15755A51015c04701p7475D5568e2177n5680A74972a49660B68017H5073k3142d2722
$$ plain form
15833 5548 -169467 -312935 -25472 243974 -23239 433662 -16785 -23758 16072 106433 381060
15822 381060 -29116 -92562 -286005 13237 -372232 -193121 -34308 -110073 82032 -46861 -129276
15811 -129276 177502 75146 45581 -151937 -171470 -286630 -199435 291004 41964 -143702
15800 305353 -201539 149277 -112019 -119130 300828 14327 -73558 -100044 -191312 372666 -340342
15788 81192 313606 66701 200638 -196789 -16404 -277200 1899 -81486 -41205 134106 272403
15777 272403 167413 -112999 162034 60455 -162826 315533 77001 18699 -170030 49122
15766 -114134 -186248 125633 -212271 249230 -31757 145460 -86811 251708 -290120 275202
15755 151015 -304701 -382176 45568 -52177 -107857 174972 -149660 268017 85073 61931 -42722
15743E4287L69830a84083E6238a04235j8020F7093J87223a06643I9510b91689
15732I4299d2002A80890P0181j676b5686j09796A61593k4103R4581F175a21031
15720A30872a24525e0162B12993n9539b96104m2464A10633a13155Q23A07549g9836
15708B9898Q0540h501D0063b2531j76666k25219A74671b96356J39508B00257a96354
15696A3200a64407j31547B5935f1679m6406B60498r5250a56643E0281b18699O5291
15685a53408A92769g9014A18477f9702E247b47633A1835L2503K07973A09106L9566
15674A48672D7483J45354c859A85530b81889A5444a41043D2068e46398C3072K45180
15663B78252g8589j5975F0623h7156c9952j76420D2102c7284k7537k2617C1388
$$ plain form
15743 54287 424117 -184083 56238 -104235 -122255 67093 254316 -106643 99510 -291689
15732 94299 -42002 180890 251071 249395 -25686 -135482 161593 137490 232071 6175 -121031
15720 130872 -124525 -50162 212993 153454 -296104 -338568 110633 -113155 -112332 107549 -79836
15708 29898 110438 -8501 40063 -22531 -199197 -424416 174671 -296356 -156848 200257 -196354
15696 13200 -164407 -295954 25935 -61679 -108085 260498 165248 -156643 50281 -218699 -153408
15685 -153408 192769 -79014 118477 -69702 5247 -247633 11835 44338 252311 109106 148672
15674 148672 47483 192837 -3859 185530 -281889 15444 -141043 42068 -546398 33072 278252
15663 278252 -78589 -94564 60623 -87156 -39952 -216372 42102 -37284 -64821 -87438 31388
15651A22059a32454c4349j76685B79911a44114l5932L8556b1333l57125B404c7119
15639c60397M2929O5084B019d9034A58236D5654J6054b54763A12544b8040j37660
15628a65700I9123a04802p5929j53363B29268b88604B87d9860A45803b33318L9896
15617a93422k1192G5078a422F0312b80694C8113M8119D1186J07266g3278k72521
15606c45799P5961J07495A18245a10940j13610G2492g2003C29181B7107e2339
15595c5760A88163i0615l3749M2801C3300i9510k03779J38192A03407g5098B0874
15583A47982G3147a36580N1764p1676I9333b02084h724r0821c9377F9916b64258
15571H0268i5525L0971A33598i4051j73988e3173j59009A31308b09869A37977
$$ plain form
15651 122059 -132454 -34349 -211034 279911 -144114 -180046 -141490 -21333 -378458 2404 -37119
15639 -360397 -317468 -252384 2019 -49034 158236 45654 61708 -254763 112544 -28040 -165700
15628 -165700 99123 -104802 -180731 -334094 229268 -288604 287 -49860 145803 -233318 -193422
15617 -193422 -214614 75078 -1422 60312 -280694 38113 86232 41186 148452 -73278 -345799
15606 -345799 -269838 -162343 118245 -110940 -224550 72492 -72003 329181 27107 -52339
15595 -35760 188163 -90615 -124364 -81563 33300 -99510 -303289 -165097 103407 -75098 20874
15583 147982 73147 -136580 -84816 -156492 99333 -202084 -8724 -99545 -39377 69916 -264258
15571 80268 -95525 -64554 133598 -94051 -268039 -53173 -212182 131308 -209869 137977
15560A79754h2669k4497k16990a25155B92196l6070a80250l0865g8670B26811
15549e3536p2589C9027c42016L9882A73258K85747a79295A07857a15288B81300
15538H7519b04988A56889a4249o0047R787D6510M2499h1881k7476B86762c8872
15526B75080h1970F5827K5013a14915B93585b35891A13819b09109e9144a2582
15515a54805a6039j39216A75062a82940D30670b15925a6066C16542A27945J27139
15505B55084a25977A86690H4329j2479J65110Q3662f4888m1554F3999h003A09714
15493A08713O1375H3215f0754B7714b06990F9763P7406p423A6915d4095A18211
15481c8760E2914J30262C9098J14557B4097H320b10273e4659A04983a00783H6884
$$ plain form
15560 179754 -82669 -107166 -324156 -125155 292196 256126 -180250 -211115 -78670 226811
15549 -53536 -126125 39027 -342016 -302134 173258 459005 -179295 107857 -115288 281300
15538 87519 -204988 156889 -14249 -74296 -64509 46510 89009 -81881 -109357 286762 -38872
15526 275080 -81970 65827 90840 -114915 293585 -235891 113819 -209109 -59144 -12582
15515 -154805 -16039 -155255 175062 -182940 430670 -215925 -16066 316542 127945 255084
15505 255084 -125977 186690 84329 71850 236960 320622 -64888 -106442 63999 -8003 109714
15493 108713 170088 83215 -60754 27714 -206990 69763 147169 139746 16915 -44095 118211
15481 -38760 52914 183176 39098 153655 24097 8320 -210273 -54659 104983 -100783 86884
15469f2103B40743L74677E1853g4737B61047p4345o2232a78537E31168A69837
15458E46852J61864j86813p5603q3750a7151F7845A594b63024e6373A45936d7998
15446C34759D2603h7778J5209k64509B72914A7082a49176B74713o9687J341E0731
15434B24960F7871h2246J3619A69470L40051j14782j88400N16194j22043M34040
15424A034530k06998k50197j74581n7488k0041j17726a53309F4416A7276J76236
15414A93512i4532B17873q2368Q6109a6065G8607n119f8300K1647j37603n3795
15403b38051l483C0007M9456g2968A3202c36250C6380R6896b6227p36A48041e5831
15390b398q7697d219n0905q8779N9315A33000A1922b420D2522b33299A35037a28677
$$ plain form
15469 -62103 240743 615420 51853 -74737 261047 186702 124470 -178537 531168 169837
15458 546852 708716 521903 446300 362550 -17151 67845 1594 -263024 -56373 145936 -47998
15446 334759 42603 -87778 -72569 -337078 272914 17082 -149176 274713 205026 206367 50731
15434 224960 67871 -82246 -68627 169470 509521 394739 206339 722533 600490 1034530
15424 1034530 827532 577335 402754 345266 325225 207499 -153309 64416 17276 193512
15414 193512 -94532 217873 135505 221614 -16065 78607 73488 -68300 -46653 -184256 -238051
15403 -238051 -241534 30007 79463 -72968 13202 -336250 36380 133276 -26227 -26963 148041 -55831
15390 -2398 -90095 -4219 -55124 -143903 -84588 133000 11922 -2420 42522 -233299 135037 -128677
15377a49q4481j17269H205P9934h7315D56714A70370f9422H802J57475o5435J2673
15365A13515P9407E9983i4163H5974P0207j0750J01752G521K86735R4151a11129
15353D01896i0750A38219J05047R4622B74K0574J79331K9760A4537K52974h3840
15341E8173L11972j77898b71666I8525c18354C61531b7720D38075i9703M6555
15331e3148A75059n7169b9836B79340A24404J97814A19394K23353A13894a66357
15320C64155r0688H0390J62074J18281A37705j5544M720L0910a06631C14500A1746
15308B40179a52364O5057B32600J75651j61962q0450b82216B36329J14375b93636
15297I89L59064C9353J84185K1747o9546d552B69910a21385C8599L54127e2674
$$ plain form
15377 -149 -84630 -201899 8205 88139 -87315 456714 170370 -69422 8802 166277 100842 113515
15365 113515 192922 59983 -94163 85974 156181 145431 247183 7521 294256 388407 -111129
15353 401896 -90750 138219 243266 337888 274 20848 200179 229939 14537 267511 -83840
15341 58173 370145 192247 -271666 98525 -318354 361531 -27720 438075 -99703 -53148
15331 -53148 175059 117890 -29836 279340 124404 322218 119394 342747 113894 -166357
15320 364155 273467 80390 242464 360745 137705 122161 126881 157791 -106631 314500 11746
15308 240179 -152364 -87307 232600 408251 246289 165839 -282216 236329 350704 -293636
15297 989 360053 39353 223538 245285 175739 -4552 269910 -121385 38599 392726 -52674
15285d2344C2602J55025G9330L35478A64034l1022F3121K77379h0856E07562A63838
15273a10597K7902I4387Q8411C9318a21093E7858j5985g6110H7800b36323d500
15261A4337L28953a4253p6446B27279b41150Q1949B55764c0864B08948N0274J7278
15250B76500g1986j41446A33929g7066I1803a91604e006B11092a53719j7703A38490
15238C27583b05071D22835j77335J35504I6104J58002q9009Q9298K63256P11143
15228A228794M08324m66050K71451l56448m04305B24981f0403j8476E5372Q280
15218F3652Q3711K76132M5964A35549J6642H967a6061A16868D5641J11734i8911
15206b43251A87268a71394r0894A97487k6655O1604E4488J04458A6658J04737
$$ plain form
15285 -42344 32602 187627 79330 414808 164034 133012 63121 340500 -80856 507562 163838
15273 -110597 -82695 94387 182798 39318 -121093 57858 41873 -76110 87800 -236323 -4500
15261 14337 343290 -14253 -90699 227279 -241150 -159201 255764 -30864 208948 259222 276500
15250 276500 -71986 -213432 133929 -77066 91803 -191604 -5006 211092 -153719 -171422 138490
15238 327583 -205071 422835 245500 381004 96104 254106 165097 254395 517651 1228794
15228 1228794 1637118 1171068 1442519 1086071 681766 224981 -60403 -78879 55372 63652
15218 63652 147363 423495 469459 135549 152191 8967 -16061 116868 45641 157375 -98911
15206 -243251 187268 -171394 -262288 197487 170832 232436 54488 158946 16658 121395
15196A21395c7554B18988P4377m0343e2825A87407J03707L2068j20445b33654
15185A66411m7444K8615Q768F4301M3589k6258a79807h2645A81066j2345b7131
15173A26603m365a06671m2174B70637G4230j1782g8038l4214B7334J27685D7476
15161a84137A07516c9898A8862I415Q4612h698H0067P295l5231J22967k383J1711
15149A84426a37720D8392a22226D42661o6803j1460I5989K74207A69534D3133
15138a69721e2202B7267d6853b490G2630N5150C9859A3142K13029n9925i1878
15126E02290B29907b26586D10725A24311L0518Q0494l1951m0608k0281L2093g9702
15114A3761G04h1310A44747Q35i3529B51497I6167K39060A25809J19493M44029
$$ plain form
15196 121395 -37554 218988 293365 253022 -52825 187407 291114 323182 202737 -233654
15185 166411 118967 147582 156350 64301 107890 81632 -179807 -82645 181066 168721 -27131
15173 126603 122238 -106671 -148845 270637 74230 62448 -78038 -112252 27334 155019 47476
15161 -184137 107516 -39898 18862 9415 94027 -8698 80067 87362 52131 175098 172715 184426
15149 184426 -137720 48392 -122226 442661 375858 364398 95989 370196 169534 43133
15138 -169721 -52202 27267 -46853 -2490 72630 127780 39859 13142 226171 166246 -91878
15126 502290 229907 -226586 410725 124311 154829 235323 203372 162764 142483 174576 -79702
15114 13761 704 -81310 144747 145582 -93529 251497 96167 335227 125809 245302 689331
15103F89331l30190A65052p9497Q0970b4427A5941J83414p7726M3974m4034N6298
15092A77867n2468c26618C16488a14601C09533I4544L96018A26835E3251L52529
15082D05780I8582b49331B95253F1396J41182c2618D35879l1510A14852O4484
15072A79336b5800E7677L8622P1278Q2446N1481f1078A14417c1407A29380M6494
15061A75874n5197J71230m8400A07848K6855e2929C7184d058F7297Q9148p3431
15050H3014K4155J18508J72655i3027G1286B9504K76792M6461M4787A13310K44244
15039C57554D6734K67348A00618L10880p3789r4006J09875J86340k24023r2542
15029B23353B6500L08698A29438J19042K34938j43937L9379q0926J8887j37544
$$ plain form
15103 689331 359141 165052 85555 166525 -24427 15941 199355 121629 165603 121569 177867
15092 177867 125399 -326618 316488 -114601 309533 94544 490562 126835 53251 405780
15082 405780 98582 -249331 295253 61396 202578 -32618 435879 404369 114852 179336
15072 179336 -25800 57677 96299 167577 250023 301504 -61078 114417 -31407 129380 175874
15061 175874 120677 291907 243507 107848 134703 -52929 37184 -4058 67297 156445 83014
15050 83014 107169 225677 398332 -93027 71286 29504 306296 352757 397544 113310 357554
15039 357554 46734 314082 100618 411498 337709 243703 353578 539918 315895 223353
15029 223353 26500 335198 129438 248480 483418 339481 378860 297934 316821 179277
15019A79277C7249N03930j4801k36436M04764j16988J91529r6159R0687m2737
15009G21038A3726L78982K11171l3707j64883O2423A98328K62192o9324j45046
14999B46150J76609o7758J58787j67964K2737N78992l17308j60561J05892A30903
14988A18107K23748R234q4766J84627Q3371q5431J06986j41477J09291N5374j94394
14977C84670m555j8474L41263k16177L34502l13003j10652j44412R2663o0359
14967B85466J61268L08129k20262L76066M1037m45597J24234B64401R2017o231
14957C50187J54718K31453l40389J67015J59633j98224B59923O6933j3929n94
14947C12333J52379P748j26995J27891A16803N92853j44382r7770L7223A06474
$$ plain form
15019 179277 37249 541179 526378 289942 694706 577718 769247 673088 763775 721038
15009 721038 13726 392708 603879 570172 405289 467712 198328 460520 391196 246150
14999 246150 422759 355001 513788 345824 368561 947553 630245 469684 575576 130903
14988 118107 341855 351089 266323 450950 534321 448890 555876 414399 523690 579064 384670
14977 384670 380115 361641 702904 486727 821229 508226 397574 253162 345825 285466
14967 285466 446734 754863 534601 910667 951704 506107 630341 264401 356418 350187
14957 350187 504905 736358 395969 562984 722617 524393 259923 326856 312927 312333
14947 312333 464712 472460 345465 473356 116803 709656 565274 467504 504727 106474
14936D66787j53935r7968F0781L16691m4902R8769O4706p5367J54375r0584O729
14925D91198N5673K61921j52896k36900L5594J39828k48323O23069k65160J88933
14915H92937k75880K44369M37915K62414l29965O89729k49776j75048j10716j6945
14905A369034k90640J98153M11540J48988K91524l09024L3725m56270J28215o80660
14895H44585L27809l43537j13620k48454J88832k85252A66384K76893J48386j85396
14885D06267L9293k22645L48839m5520p8833j5453j73426J11617Q7051q0136o6124
14874C10930M43498j01450J30985r4532L48013P7569m44742P4012N831k2074N1195
14863G79235P8572l82024p1806N56198l23578N6151l3427k20420L4958m4112J45480
$$ plain form
14936 466787 312852 214884 60781 377472 332570 431339 496045 420678 575053 484469 491198
14925 491198 546871 808792 655896 418996 454590 594418 346095 969164 704004 892937
14915 892937 617057 861426 1299341 1561755 1231790 1921519 1671743 1496695 1385979 1369034
14905 1369034 1078394 1276547 1688087 1837075 2128599 1819575 1853300 1397030 1525245 844585
14895 844585 1172394 828857 715237 466783 655615 370363 166384 443277 591663 406267
14885 406267 445560 222915 571754 526234 447401 431948 258522 370139 457190 377054 310930
14874 310930 754428 652978 783963 689431 1037444 1115013 670271 744283 750114 728040 779235
14863 779235 857807 475783 403977 960175 636597 692748 659321 438901 473859 429747 575227
14852E75227O6722p2715R0929K75521l25799j53110J72696k43033L24729j45660
14842E65507j43530m3894N08433j30711l71224N1883J93883B29160J74681m1680
14832C62161M41218R8277k74786j24882K14420K04920k16048K41914j29086N05283
14822A323391r9515j95876j76808l67229M2119N08653m84065j44881K44798j34327
14812E16260k7450q6651O4660J3499L48315k32160K82126J0762k87628K8997O1160
14801F91890K06520j04379k2022K131l52499M33895j55664j95921K38801N6402
14791G99154r7479O0600L85234k71886J8832k19759N942N6734J30908m05715K98739
14780G61304k63716J95507j07081j75538L83892j60196k37024O1986j65000M80361
$$ plain form
14852 575227 641949 569234 660163 935684 609885 456775 629471 386438 711167 565507
14842 565507 421977 378083 886516 755805 384581 436464 630347 229160 403841 362161
14832 362161 803379 901656 626870 501988 716408 921328 705280 947194 818108 1323391
14822 1323391 1223876 1028000 851192 483963 526082 1034735 550670 405789 650587 516260
14812 516260 488810 402159 466819 480318 828633 596473 878599 889361 601733 630730 691890
14801 691890 898410 794031 772009 774140 421641 855536 699872 503951 742752 799154
14791 799154 701675 762275 1147509 875623 894455 674696 680638 737372 868280 462565 761304
14780 761304 497588 693095 586014 410476 794368 634172 397148 459134 294134 774495
14770G74495n284o4880k30343L21137J82601k26380k88046K59541j0416k6917
14760F85508k4782L27483l3945j17733J10021k84991N61467n81828j45464n0655
14750D45081L53334k29360O2825P1415J53637j08929j42345J03508m3921Q1744
14740G46989k9592K35532j67488N9693n3459B85178J74324J29427J68637m127
14730G53439l114o9679J79605M7231L30187m42416p3817J58873n0054P504l94083
14719D43676L44063J34934j253n6727l0157L92953K64167n46482O28615k0746
14709A553043j70453K06010l9210j89735k16869j92297K15500k41083J30314k05787
14699H49433J44928k53573L04659k39416K45087j06068J18104k50967K38972K31805
$$ plain form
14770 774495 769211 704331 473988 795125 977726 751346 463300 722841 712425 685508
14760 685508 660726 988209 954264 836531 946552 661561 1223028 641200 495736 445081
14750 445081 798415 569055 631880 703295 856932 748003 605658 709166 665245 746989
14740 746989 717397 952929 785441 845134 791675 285178 459502 588929 757566 753439
14730 753439 750325 680646 860251 907482 1237669 795253 721436 880309 830255 837759 443676
14719 443676 787739 922673 921420 864693 834536 1227489 1491656 945174 1573789 1553043
14709 1553043 1382590 1588600 1549390 1359655 1142786 950489 1165989 924906 1055220 849433
14699 849433 994361 740788 1045447 806031 1051118 945050 1063154 812187 1051159 1282964
14689A282964P0590k82786K68265J19488o5295K97343J51772l32336J33430o16256
14679A027179L19731j43732J86152j64469l80506N84474n69494K41537J27795
14670A228667k95962K8607j08800K08629q9769J11265j13710o0684J96641k19637
14660H85247M7795M8419K69480j72208Q4131P9139k5837K6359j93599Q5168m22335
14649G11759J50344K23592l4851J07530j40719J14250N2065J69218K07527m18163
14639A142552K7163K67729k31396K54832l72603N27145k57703k24591K37445m9896
14629A320677j22110L14982k06462j6682J09215l4179j58555k75449L88968L2330
14619A352735r3226O4745L855N1126k36889K25878K06183j20834N608J65117j14537
$$ plain form
14689 1282964 1353554 1070768 1339033 1458521 1393226 1690569 1842341 1510005 1643435 1027179
14679 1027179 1346910 1203178 1389330 1224861 844355 1428829 859335 1100872 1228667
14670 1228667 932705 961312 852512 1061141 971372 1082637 968927 908243 1104884 885247
14660 885247 933042 981461 1250941 1078733 1162864 1242003 1216166 1242525 1048926 1134094 711759
14649 711759 862103 1085695 1050844 1158374 1017655 1131905 1183970 1353188 1560715 1142552
14639 1142552 1169715 1437444 1206048 1460880 1088277 1615422 1357719 1133128 1370573 1320677
14629 1320677 1198567 1513549 1307087 1290405 1399620 1365441 1206886 931437 1320405 1352735
14619 1352735 1259509 1324254 1328109 1379235 1142346 1368224 1574407 1453573 1459181 1624298 1509761
14608A509761k07492j63312O74706l24805j24658K61796N7111j32974N9389p2149
14598A537373j22503M44947j43055j36484L38P6456j259p2678K20566n2937j82675
14587A568089r4947M56388j65722L0470K06649k94152L7787k13612K52896M1627
14577A825473J50063m3504J52690m34200M28160m8022k56270k12654M25441J39135
14567B126312J39180l41486N5860P2438J16105M26738o36020J59497O2662J6610
14557B197896L29245j42111J77519j96664K44834m1841n0992J01437K49677K6274
14547B895274j8694k0997P0062K89055R1120M74453l81132P54681K34534N03206
14537D891562N15880Q59719J321001K145669M027774O452093R945354L118983
$$ plain form
14608 1509761 1302269 1138957 1813663 1488858 1364200 1625996 1683107 1550133 1609522 1537373
14598 1537373 1414870 1859817 1716762 1580278 1580616 1657072 1655813 1583135 1803701 1750764 1568089
14587 1568089 1473142 1929530 1763808 1794278 2000927 1706775 1744562 1530950 1783846 1825473
14577 1825473 1975536 1932032 2084722 1650522 2078682 2030660 1774390 1561736 1987177 2126312
14567 2126312 2265492 1924006 1979866 2052304 2168409 2595147 1959127 2118624 2181286 2197896
14557 2197896 2527141 2385030 2562549 2365885 2610719 2568878 2517886 2619323 2869000 2895274
14547 2895274 2876580 2855583 2925645 3214700 3305820 3780273 3399141 4153822 4388356 4891562
14537 4891562 5407442 6267161 7588162 9733831 13761605 20213698 30159052 33278035
14529C3278035j4597429q680612l352397j384755j63969N11702r41697j351876
14521C317002p46126K82707k32835L2641k93562k18351L54106P0733p8902N8880
14511B546293O6861m06276M29964m4751K21917k07900J15579m48522N87065l9988
14501B820242J66277Q4836n42798K21497R7535N33716k60745o1467L598J70924
14491C233615j49214L09820k88135J07926J16655K11871J7695m1435M38872m80229
14481C477441O1434j50992J86176K90645j97781P3130j27710L04461P7634j62426
14471C832012J0629J23004k6370l2064K78755P0210j76992L37433K5886j15753
14461D326750K87046l09946Q1258J34386P9703q4242J42806J6160m0886J62174
$$ plain form
14529 33278035 18680606 9999994 6647597 5262842 5098873 5610575 4668878 3317002
14521 3317002 2570876 2853583 2620748 2653389 2359827 2141476 2495582 2566315 2487413 2546293
14511 2546293 2613154 2206878 2636842 2592091 2814008 2606108 2721687 2273165 2860230 2820242
14501 2820242 2986519 3071355 2528557 2750054 2847589 3381305 3120560 3059093 3062691 3233615
14491 3233615 3084401 3394221 3106086 3214012 3330667 3542538 3560233 3518798 3957670 3477441
14481 3477441 3538875 3387883 3574059 3864704 3666923 3740053 3612343 3916804 3994438 3832012
14471 3832012 3842641 3965645 3939275 3907211 4185966 4256176 4079184 4416617 4442503 4326750
14461 4326750 4613796 4303850 4385108 4519494 4599197 4514955 4657761 4673921 4633035 4795209
14451D795209Q7820M29999m45063J05139L29147j38117K45953j09134K81512q4390
14441E498075q4195L50934r5631N2203L76054l85081K54790k75455N10617m35958
14431E766353N87077R3993k19181M7768J40060O6736K35820j16595K74665j98568
14421F678128J80197K17164J75287K29676k22018J10779K19657j68249M87310
14412G907931J74004J6081N6117J53212L04286j4274L23027L68350q3050J1500
14402I217184N25207J49621q5324l9466J76593m1482J88372K05415m34798N86767
14392A0448089L35611J4442L03770K14700L91488k76278M22613P356o2461J60191
14382A1959521O01600K37851r6698K02888M14352k03343L21676K32221N35583
$$ plain form
14451 4795209 4883029 5313028 4867965 4973104 5302251 5164134 5410087 5300953 5582465 5498075
14441 5498075 5413880 5764814 5669183 5721386 6097440 5712359 5967149 5691694 6202311 5766353
14431 5766353 6353430 6447423 6228242 6276010 6416070 6482806 6718626 6602031 6876696 6678128
14421 6678128 6858325 7075489 7250776 7480452 7258434 7369213 7588870 7420621 7907931
14412 7907931 8081935 8098016 8154133 8307345 8611631 8597357 8920384 9288734 9205684 9217184
14402 9217184 9742391 9892012 9806688 9767222 9943815 9902333 10090705 10296120 9861322 10448089
14392 10448089 10783700 10798142 11101912 11316612 11708100 11431822 11854435 11861791 11799330 11959521
14382 11959521 12561121 12798972 12702274 12905162 13319514 13116171 13437847 13670068 14205651
14373A4205651J75675j44467O38179M02729L1910K41572L10616K75546O63465
14364A6800876M52189l8178M00432L91900J02574L41695R8464N92515M02915L04190
14354A9849572L93245J86076Q53039J54604P10426K83345N55014J21242Q02500
14345B3909063P75527J8134K34234J182490M68196J045715L51654L30332O64259
14336B8979604N99201J026014N14781Q92530O78162R80235R75751N60440J094145
14327C6300863J013630J018483P70501J396495P88967J014256J468037J193358
14319D4964590J152427J900369J035597J486816J743922J777471J407343J975319
14311E7443854J368384K141287K069661K232005K605521J838427K437823K291512
$$ plain form
14373 14205651 14381326 14236859 14875038 15277767 15309677 15551249 15861865 16137411 16800876
14364 16800876 17253065 17214887 17615319 18007219 18109793 18451488 18549952 19142467 19545382 19849572
14354 19849572 20242817 20428893 21281932 21436536 22146962 22430307 22985321 23106563 23909063
14345 23909063 24684590 24702724 24936958 26119448 26587644 27633359 27985013 28315345 28979604
14336 28979604 29578805 30604819 31119600 32012130 32690292 33670527 34646278 35206718 36300863
14327 36300863 37314493 38332976 39103477 40499972 41288939 42303195 43771232 44964590
14319 44964590 46117017 48017386 49052983 50539799 52283721 54061192 55468535 57443854
14311 57443854 58812238 60953525 63023186 65255191 67860712 69699139 72136962 74428474
14303G4428474K815837K736842K692481L136606K866698L659702L175353L894034
14295I9406027M063277L801735M677310M787298M985964M739438N582616N964065
14287A38007730O313519O367245P318643O942276P903235P846719Q994986R171259
14279A98865612R557790J0322475J1070604J1208086J1933175J2520506J3099897
14272B78578145J3862030J3740027J4465707J4782381J4851915J5162673J4089462
14265C79532340J4013592J3508690J2346962J1265031J0056468R035525P979998
14258D57738606N150354J765538J193929J835325J94330o268450o915679q711035
14250D45982918j1079152j2382940j2948987j3195455j3878268j4599963j4649114
$$ plain form
14303 74428474 77244311 79981153 82673634 85810240 88676938 92336640 95511993 99406027
14295 99406027 103469304 107271039 111948349 116735647 121721611 126461049 132043665 138007730
14287 138007730 144321249 150688494 158007137 164949413 172852648 180699367 189694353 198865612
14279 198865612 208423402 218745877 229816481 241024567 252957742 265478248 278578145
14272 278578145 292440175 306180202 320645909 335428290 350280205 365442878 379532340
14265 379532340 393545932 407054622 419401584 430666615 440723083 449758608 457738606
14258 457738606 462888960 464654498 465848427 467683752 467878082 461609632 454693953 445982918
14250 445982918 434903766 422520826 409571839 396376384 382498116 367898153 353249039
14243C53249039j4393348j4318367j4856633j5014653j4018952j4114334j3967217
14236B52565535j2992442j2207665j1359690j1251262j0754167r829702r251458
14229A74919149q586381p780256q157247o828427o614687o613096n676322n210459
14221A19452274n250670n000062m833186m471878l984339l571319l825001l731092
14213H4784727k885049l513360l233033k823928k416035k166836k531283k371499
14205F2843704k059055k021156j980692j754767j675624j724277k002966j225972
14197D8399195j415000j579682j185334p95529j444452j110863r34581j537718
14189C8396036j217628q18729j087108n14940o62303r54816j267785r46222l40633
$$ plain form
14243 353249039 338855691 324537324 309680691 294666038 280647086 266532752 252565535
14236 252565535 239573093 227365428 216005738 204754476 194000309 184170607 174919149
14229 174919149 166332768 158552512 150395265 143566838 136952151 130339055 124662733 119452274
14221 119452274 114201604 109201542 104368356 99896478 95912139 92340820 88515819 84784727
14213 84784727 81899678 78386318 75153285 72329357 69913322 67746486 65215203 62843704
14205 62843704 60784649 58763493 56782801 55028034 53352410 51628133 49625167 48399195
14197 48399195 46984195 45404513 44219179 43423650 41979198 40868335 39933754 38396036
14189 38396036 37178408 36359679 35272571 34757631 34095328 33140512 31872727 30926505 30585872
14180C0585872r96500p33277l05202j227312l69122r42772o42388m63929m22058
14171B4483312p52488l66345n26326m43322q51751l89550l27063n73440n85899
14162A9667128j33688n15897j62294m08378m84592p6636k96898n70351j52726
14153A6865668o11419Q0020n10205j54797k58257m03841k89271k43525l23691
14144A4150682l81119j48610r5238j48720M5974n18014o03728K34229k09385l96579
14134A1929492Q4594n21028K27531j14902o00158q685j10510l71895j13144K20026
14124A0621321m64955m16049K83569o2156j71792l04095j66107j06656M3863k47015
14114I009928k05049l39962J22751j48644l77974L26920j74548Q1354p71723J07973
$$ plain form
14180 30585872 29589372 28856095 28550893 27323581 26954459 26011687 25369299 24905370 24483312
14171 24483312 23730824 23364479 22838153 22394831 21543080 21153530 20826467 20253027 19667128
14162 19667128 19533440 19017543 18855249 18446871 17962279 17885643 17588745 17018394 16865668
14153 16865668 16254249 16334269 15824064 15669267 15411010 15007169 14717898 14474373 14150682
14144 14150682 13769563 13620953 13525715 13376995 13422969 12904955 12301227 12535456 12326071 11929492
14134 11929492 12014086 11493058 11720589 11605687 11005529 10996844 10886334 10514439 10401295 10621321
14124 10621321 10156366 9740317 10023886 9961730 9789938 9485843 9319736 9213080 9256943 9009928
14114 9009928 8804879 8464917 8587668 8439024 8061050 8387970 8213422 8294776 7523053 7631026
14104G631026K42863m68989J34110j91986q4290q0625n3410K7213k64372o2796
14094F828744j33284R1396J01531l49053l14904K31962j88847l6253O2354L2900
14084F326546p9440N9568K1286m59380l80951J87818L4304M6293m79582K09796
14074E486258j27702l5017q1520k75965J98168k1297j61569K20426k57940k32671
14064D711171K42348k81534N1139K07410l10311Q0081k52077K31209l86046n9013
14054D234377M69556m17227k55722K60655l03386K34517l0351J86265j92008o684
14044D179992N7481m1037Q9381l25046j78111l2856K55251j51736j78892q1360
14034C593067j01144J90395j28392k01065M35067n0004k77673j47360L36235m70308
$$ plain form
14104 7631026 7873889 7404900 7539010 7347024 7262734 7182109 7128699 7155912 6891540 6828744
14094 6828744 6695460 6786856 6888387 6539334 6224430 6456392 6267545 6231292 6293646 6326546
14084 6326546 6247106 6306674 6327960 5868580 5487629 5675447 5709751 5756044 5276462 5486258
14074 5486258 5358556 5323539 5242019 4966054 5164222 5142925 4981356 5201782 4943842 4711171
14064 4711171 4953519 4671985 4723124 4930534 4620223 4700304 4448227 4679436 4293390 4234377
14054 4234377 4703933 4286706 4030984 4291639 3988253 4222770 4192419 4378684 4186676 4179992
14044 4179992 4237473 4196436 4285817 3960771 3782660 3749804 4005055 3853319 3674427 3593067
14034 3593067 3491923 3682318 3553926 3352861 3787928 3737924 3460251 3312891 3649126 3178818
14024C178818K82696j25505k12500L17746l24452J59312j52988K10395p8488N8932
14014C313966K51255m31335K42496n38801P7520j0511q8555J28723j72819j37886
14004B634053j18648J40350J10612j96638k10854K64473J98498k20725K52941
13995B854062k94518p9295l0414K17171j0713k22755k25251J90296L6215j25514
13985B309284J46013j48733K55377J04479j67268N26486n62070O19747M92204
13976C575519K52520O77229J393083L663012N846158R581822R311039j1515424
13968B2784958q763170m411074k451447j634477q97617k41522l96458l97309j73216
13959C418668m32611j8318j17937k05007J3119j07037N3741k78524J86187l37007
$$ plain form
14024 3178818 3461514 3336009 3123509 3441255 3116803 3276115 3123127 3333522 3255034 3313966
14014 3313966 3565221 3133886 3376382 2837581 2915101 2904590 2816035 2944758 2771939 2634053
14004 2634053 2515405 2655755 2766367 2569729 2358875 2623348 2821846 2601121 2854062
13995 2854062 2559544 2480249 2449835 2667006 2656293 2433538 2208287 2398583 2434798 2309284
13985 2309284 2455297 2306564 2561941 2666420 2499152 3025638 2463568 3083315 3575519
13976 3575519 3828039 4505268 5898351 9561363 15407521 24989343 34300382 22784958
13968 22784958 14021788 9610714 7159267 5524790 4627173 4385651 3989193 3591884 3418668
13959 3418668 2986057 2967739 2849802 2644795 2657914 2550877 2604618 2326094 2512281 2175274
13949B175274R9031P0348j51092l2612q293l24969M53371j82597J00603q7892
13939B111172R0909m482j56816j82315N12103m08835M56397p00919K59558j86322
13929A790450L11866k44981m5189o8366L2220K35252l51424K4247K18807k32540
13919A670342M6918N3897J23556k10293m8155J11745j78172j62732R4659K86533
13909A788298m93178P18878p15334K57676l06026M85206l72196N7730J15699K56081
13899A792834q7253l24110J00811l7474L97453k76720j28400j9981J17390L8771
13889A573321k53465J29360J12130j25099o8426K56549P9512j48531k50415j62316
13879A142620o8805j36588L29480j49574L24525j37046p145J79856n05178K51270
$$ plain form
13949 2175274 2274305 2344653 2193561 2160949 2152656 1827687 2281058 2098461 2199064 2111172
13939 2111172 2202081 2197599 2040783 1858468 2370571 1961736 2418133 1717214 1976772 1790450
13929 1790450 2102316 1857335 1812146 1743780 1776000 2011252 1659828 1684075 1902882 1670342
13919 1670342 1717260 1771157 1894713 1684420 1636265 1748010 1569838 1407106 1501765 1788298
13909 1788298 1295120 2013998 1298664 1556340 1250314 1735520 1363324 1421054 1536753 1792834
13899 1792834 1705581 1381471 1482282 1444808 1842261 1565541 1437141 1417160 1534550 1573321
13889 1573321 1319856 1449216 1561346 1436247 1367821 1624370 1703882 1555351 1304936 1142620
13879 1142620 1073815 937227 1266707 1117133 1441658 1304612 1297467 1477323 972145 1223415
13869A223415J91200l54068K54677l8107j83628j48392k1594J27537L58434l80165
13859A029309K50372j43586Q1462l66642N02846j10907j7271p68M8703k43070
13849A030448k9026N3037L7053j54203o7121J16805N1431K3080J9312l7779k320
13838A040717l21925Q03343n62109R3559k069j76528M49763j44190l02403J15255
13828I93413J60823j36483O5372l54398K89616J74428j42452j50919j79298L04954
13818A025056r6778k7496K97340j90947Q2552k45096j8285j28407J71811J89266
13808A059016k60688J00502k05331L35946J18714j042J0618l27380J85228l00654
13798G14929J29179k40129M88296j43810r9417j77639K40842J03797k87120r2912
$$ plain form
13869 1223415 1414615 1060547 1315224 1277117 1093489 945097 923503 1051040 1409474 1029309
13859 1029309 1279681 1136095 1217557 850915 1353761 1242854 1225583 1224815 1273518 1030448
13849 1030448 1001422 1054459 1091512 937309 870188 986993 1038424 1061504 1080816 1043037 1040717
13838 1040717 718792 1522135 960026 1053585 1051516 874988 1324751 1180561 878158 993413
13828 993413 1154236 1017753 1083125 728727 1018343 1192771 1050319 899400 720102 1025056
13818 1025056 928278 900782 1198122 1007175 1089727 844631 826346 697939 869750 1059016
13808 1059016 798328 898830 693499 1029445 1148159 1147117 1157735 830355 1015583 714929
13798 714929 844108 603979 1092275 948465 849048 671409 912251 1016048 728928 636016
13788F36016Q2426m3998P7786P1641L77813n12461L8769j54423R2599J69215M9964
13777H85347l3001K57178l88472K92795k08620j63866L1371R0210j31320K26347
13767H57969r6193r6052J39077k67651L27266J156r5477C74394L35339L8155l347
13756G44541k85391L49385l5650j275k07885N9181r6326K7740P241K62369B82972
13744C57115R4318J32667K87686P7829m17107m7422J00495L48478C53482L18303
13734F71785o3574J9545B64805Q6456P41898C76191M19199J21052k10020q0358
13724F26064j51478L02176k01827J66635q9595o3688R2502n4868J72454j42818
13714F55557J5164j15762O4678j64250k04993L07649p072J26261J58428j13732
$$ plain form
13788 636016 718442 674444 752230 823871 1201684 689223 727992 573569 666168 835383 885347
13777 885347 852346 1109524 721052 1013847 805227 641361 672732 762942 631622 857969
13767 857969 761776 665724 804801 537150 864416 865572 770095 374394 709733 747888 744541
13756 744541 459150 808535 772885 771610 563725 622906 526580 554320 561561 823930 282972
13744 357115 451433 584100 871786 949615 532508 485086 585581 934059 353482 671785
13734 671785 608211 627756 264805 351261 1093159 376191 795390 916442 706422 626064
13724 626064 474586 776762 574935 741570 651975 588287 680789 625921 798375 655557
13714 655557 670721 554959 619637 455387 250394 558043 550971 677232 835660 721928
13704G21928k43018L01157l65280j14229L97536B86194M04312J6643j7252m3819
13694F46078l7462O3141n1379J13784l42505K50125o4673J60078O8140k98876
13684E06451K6880P2127L41139l27646K71232l06817J31156j71263N7350q4159
13674E16450j06478J01697k44532K29012P0351j20685K82068k7508B93445J76026
13664D69471j3709J37869l3813B40559K62020A72931M74907A79267L23814N4481
13654E57562k33425J96305N5582B75135N138N95143B83903J94727j5734r1314
13644C71582J94134k39774p2702K13653J46033j63217j75309n9839N72090C68217
13633F09239P1760k15719J3098J05848L5214B84735J3130P1785J26273j23572
$$ plain form
13704 721928 478910 780067 414787 300558 698094 286194 690506 707149 689897 646078
13694 646078 608616 671757 620378 734162 391657 641782 577109 737187 805327 506451
13684 506451 533331 605458 946597 618951 890183 583366 714522 543259 600609 516450
13674 516450 409972 511669 267137 496149 566500 445815 727883 700375 293445 469471
13664 469471 455762 593631 559818 240559 502579 172931 647838 179267 503081 557562
13654 557562 324137 520442 576024 275135 280273 875416 283903 478630 462896 371582
13644 371582 565716 325942 253240 466893 612926 449709 274400 214561 786651 368217
13633 609239 680999 465280 478378 584226 619440 284735 297865 369650 495923 372351
13623C72351L34109A49534R7786K96104L0257B86202k7212N9257J20094A21264
13612D17433q0996K96132B50455j4838K22990J64961j70308j67656K1936q792
13602B98748o1614M25178j22570B07029J61855j9035M0864k6607J1267b9920D00681
13590C15914J42977p4902K08377k27586m3575J4777J74054k1563k14466R1475
13580C65482r0710K10911A67498g0252E80421B69887K63691j267k45875R3882
13570C80318J97511b7132C28173j32794J37573K38981Q85d0669A52409N32458
13560F84867B09296N1031J06981r9489K09470J28307B97799r7502p6552J62908
13550B86653j6766O5636j5353E2492K03637l393j18727K66134Q9245I5894Q1256
$$ plain form
13623 372351 706460 149534 247320 543424 573681 286202 258990 318247 438341 121264
13612 417433 336437 632569 250455 235617 458607 623568 453260 285604 307540 298748
13602 298748 237134 662312 539742 207029 368884 349849 390713 364106 375373 -29920 400681
13590 315914 458891 383989 592366 364780 321205 335982 510036 488473 274007 365482
13580 365482 274772 485683 167498 -70252 580421 269887 533578 532311 286436 380318
13570 380318 577829 -27132 328173 195379 332952 571933 572818 -40669 152409 684867
13560 684867 209296 260327 367308 267819 477289 605596 297799 200297 123745 286653
13550 286653 269887 335523 320170 52492 256129 252736 134009 400143 489388 95894 177150
13539A77150M8498Q9429i2072G71785C62457a55613A41351m392K14385N4425J08264
13528E14033j89197l632K09349H6657M04200j64681j32683D0211L29631J54912
13518E24754k44131A29800M12923j64077A01047J33061L0869G3919K32709J68300
13508D74928k3723N97J03981j59239A14285J13129J01730A39482R5334h0059C14609
13496G889L86536R3544A83067R7675Q2819a0934A94759D1817P9267m5008J07154
13485A83230K17356c4961D04613J43170j19666j24862L616J48170C2478K25379
13475B57857K74134A84177L0981L85937F1605M8028L98296E0617J23865m5572
13465A28910l1632J38918K48474A53914J09796o5349K64052j57188p3915J95623
$$ plain form
13539 177150 225648 315077 -92072 771785 362457 -155613 141351 136959 351344 405769 514033
13528 514033 324836 321204 530553 86657 490857 326176 193493 40211 369842 524754
13518 524754 280623 129800 542723 378646 101047 234108 264977 73919 306628 474928
13508 474928 451205 451802 555783 396544 114285 227414 329144 139482 234816 -80059 314609
13496 7889 394425 487969 183067 280742 363561 -10934 194759 41817 121084 76076 183230
13485 183230 400586 -34961 404613 547783 428117 303255 306871 455041 32478 257857
13475 257857 531991 184177 215158 601095 61605 109633 507929 50617 174482 128910
13465 128910 97278 236196 484670 153914 263710 198361 462413 305225 231310 426933
13455D26933c4879A44380J05601K9533L4592H9765K96543j12420F4128J84502
13445B48630N5000l805q5937L41450A09399K27592K73893B06959j442c1238D92936
13433A91503J88369p1281j44901D4027K22477A167K79466f1622k03481a2465B76128
13421a11327A38899J81530q7167a24163A34375J82556J55479j73100j38808J24440
13411B84942o6842C5090P0969K9255l9138L3921K73350A84530r1919L27141o4534
13400C55218j62882G8380K69112j18471Q9025A37636F1354L08722J7698i3704
13389A11221R5888J75580A61413Q3371k0357J80134k9238a06972B28584M5863
13379B74447j06333E4724K30494P5896K99849k57187j39158L71614B59055L18443
$$ plain form
13455 426933 -34879 144380 249981 279514 314106 89765 386308 273888 64128 248630
13445 248630 303630 299825 213888 555338 109399 336991 610884 206959 205517 -31238 492936
13433 191503 379872 308591 163690 44027 266504 1167 280633 -61622 -265103 -12465 276128
13421 -111327 138899 320429 233262 -124163 134375 316931 472410 299310 160502 284942
13411 284942 218100 35090 106059 135314 96176 130097 403447 184530 92611 419752 355218
13400 355218 192336 78380 347492 229021 318046 137636 61354 370076 387774 -93704
13389 111221 207109 382689 161413 244784 224427 404561 375323 -106972 228584 274447
13379 274447 168114 54724 285218 361114 660963 403776 264618 636232 259055 577498
13369E77498B5439K11762l3417n5165k4775M12477a32723C38050K20648D4451
13358B14184A03152O027M12887I5953L00848F5411J86200l2508k0457J85335A83385
13346A39020l9899J55871P5826j64723a12269C32245I5926l3848K32600N7149
13336C51827E0481j4881K97195G1495f2411C35875l0823o0990L96871k19619k8336
13325C92978j35955J05338L4991j05467m8962G5571K20411k0930o1075J1443E3387
13313B51643a94292f1445F88258A36986K34151j31756J94965q7594A10648L89176
13303D99824f0713B02059q0854O9838K62834A08787K8933J28926A9107K43912
13293B63019K3295E0026M24717k6637H3448k3913L12274J4488j57563N2638I7417
$$ plain form
13369 577498 25439 237201 203784 148619 123844 536321 -132723 338050 558698 44451
13358 214184 103152 109179 522066 95953 396801 65411 251611 219103 198646 383981 183385
13346 139020 99121 254992 330818 166095 -112269 332245 95926 62078 294678 351827
13336 351827 50481 35600 332795 71495 -62411 335875 305052 244062 640933 421314 392978
13325 392978 257023 362361 397352 291885 242923 75571 295982 275052 213977 225420 53387
13313 251643 -194292 -61445 688258 136986 371137 239381 434346 346752 110648 499824
13303 499824 -60713 202059 121205 191043 453877 108787 137720 266646 19107 263019
13293 263019 286314 50026 474743 448106 83448 59535 371809 386297 228734 281372 97417
13281g9011C15017A41728J7515M95874h6366A31084J71142I7823A2543a16568
13270c0938E7115J36961L1706b3271A74638h0012A20093B1706K53805q6406k416
13259A86689I0570L32725d9095j60595B09355J08609I3420K10692g4204B18617
13248B54017B025b68466B88806J00812a23970F1991a77845E88335C6481J12146
13238A48627E4430J46850m4442p5786M2149a11758A09855D1844j4383b01652B37898
13226B23659l0792K31410o0641j69897Q1675M354A00753P3815j4732p5321f280
13214h4722a1504C00165a1221D7808M994a3525D5805P8020b45250B2199J42348
13203A64547P6693F0859A3207L66918A11023M4867a14336A26961f2458q7625F6419
$$ plain form
13281 -79011 315017 141728 159243 655117 -86366 131084 302226 97823 12543 -116568
13270 -30938 57115 194076 225782 -23271 174638 -80012 120093 21706 275511 189105 186689
13259 186689 90570 423295 -49095 -209690 209355 317964 93420 304112 -74204 218617
13248 254017 2025 -268466 288806 389618 -123970 61991 -177845 588335 36481 148627
13238 148627 54430 201280 156838 81052 123201 -111758 109855 41844 27461 -201652 237898
13226 223659 192867 424277 363636 193739 275414 279768 100753 174568 159836 84515 -6280
13214 -84722 -11504 300165 -11221 47808 52802 -13525 45805 123825 -245250 22199 164547
13203 164547 241240 60859 13207 380125 111023 155890 -114336 126961 -62458 -150083 66419
13191A83653O614n1612b745A31282K6356f4488A09352f8477A42012J71351A49976
13179e5784A76465A267J22093K14468A20160D5406a70153B57974a48005h121j32681
13168a40802A39712g6170I1463Q2363l1181B0962R8479c8189C69877A10285c36707
13156A5261J44138J47192n44e5388j05235A12791K54639r415A19581H896J16632
13145A25528a62017e93E67522B09265P4913b54894A32415a49022A7123L3756i2714
13133A52811C0165J00952A4503h9903A41037C8244R160J84119a03187j51766B86412
13121F2517e5069A97255J20829A16702N5816L6991L59885a16810C43263B7674
13110a91278A55645Q6968i5105C09656b8692p2780l5709i195p9513A34171K89725
$$ plain form
13191 183653 190267 138655 -2745 131282 157638 -64488 109352 -68477 142012 313363 149976
13179 -55784 176465 1267 123360 337828 120160 45406 -170153 257974 -148005 -8121 -140802
13168 -140802 139712 -76170 91463 173826 142645 20962 119441 -38189 369877 110285 -336707
13156 15261 159399 306591 306047 -55388 -160623 112791 367430 358015 119581 8896 125528
13145 125528 -162017 -593 567522 209265 284178 -254894 132415 -149022 17123 50879 -92714
13133 152811 30165 131117 14503 -89903 141037 38244 47404 231523 -103187 -254953 286412
13121 62517 -55069 197255 318084 116702 172518 209509 569394 -116810 343263 27674
13110 -191278 155645 242613 -95105 309656 -28692 -101472 -137181 -9195 -88708 134171 423896
13099D23896a39642f9219B15846C9700A27L14633H4602J79913j27698a79902B72801
13087e4608p7435f2389B745K9090J9917P0798m7487a23009G1625l0560J78727
13076B19792E2889R8620M6643B965f860k59499g6357A11421k1032a6310C74953
13064B59930e1485B3368K95037e6085r8714B75925F8711h0893B03457m7552a33968
13052D4041R6748F5440a40663D1971J73421d6666C2981a6186I5442j8056K14775
13041B92161L4856h3324D74853a06253j08078Q9692B18323b04469B35443l9455
13031A95988K09403a85655j02949J36492D8423M0721J695B5077R2074J12762c5130
13019A50632a8001B418J77349q8274L7509J15396j7123p1074C1243b42652a2873
$$ plain form
13099 423896 -139642 -69219 215846 39700 127 314760 84602 264515 136817 -179902 272801
13087 -54608 -132043 -62389 2745 31835 51752 122550 75063 -123009 71625 41065 219792
13076 219792 52889 151509 198152 2965 -6860 -266359 -76357 111421 90389 -16310 374953
13064 259930 -51485 23368 318405 -56085 -154799 275925 68711 -80893 203457 155905 -133968
13052 44041 140789 65440 -140663 41971 215392 -46666 32981 -16186 95442 77386 292161
13041 292161 327017 -83324 474853 -106253 -214331 -124639 218323 -204469 235443 195988
13031 195988 405391 -185655 -288604 -152112 48423 89144 90839 25077 117151 229913 -35130
13019 150632 -18001 2418 179767 91493 129002 244398 227275 156201 31243 -242652 -12873
13007A69814k3567J14450j06926o3110k3022J97624N0602C5783d2270C45700a98041
12995C25736j41904J14509q9574f4345C17789c12726B67244E1719K8609J62068
12985B42396A03899j8426J71410H379i9703K8317I464L7211b80552J11171f9287
12973G2280J49204a53668N3033B72886A3491N7122e0960j66958R9214C60694b2659
12961a69340B7059C673a4349F1198O174k855B1728a55130a1168B4633K17394a80991
12948C40903a86064e6575G4356d3971A11436J26233A09971a00554h196A75013
12937b26431A78564a57551j01715A69395a60321b4271A22911N0668a05523A8754
12926c6247j3396a2732A83309A5920M74759d4251m30429C6262h6512B7885d6407
$$ plain form
13007 169814 146247 260697 153771 90661 67639 265263 315865 35783 -42270 345700 -198041
12995 325736 183832 298341 208767 -64345 317789 -312726 267244 51719 80328 242396
12985 242396 103899 85473 256883 8379 -99703 -71386 9464 46675 -280552 -169381 -69287
12973 72280 221484 -153668 -100635 272886 13491 70613 -50960 -217918 -118704 360694 -22659
12961 -169340 27059 3673 -14349 61198 67372 64517 21728 -155130 -11168 24633 242027 -180991
12948 340903 -186064 -56575 74356 -43971 111436 237669 109971 -100554 -8196 175013
12937 -226431 178564 -157551 -259266 169395 -160321 -24271 122911 173579 -105523 18754
12926 -36247 -49643 -12732 183309 15920 490679 -44251 -474680 36262 -86512 27885 -46407
12914B65267J4420A731J93353a64264A31030i597j68910B19069a09114m3025H4411
12902b02320A66622D7201O5231K59034G3680R8640o6671B0615K2907N12K40552
12891B84586a0174B79363J45954H577J13343J10076q1358P2402b07601F7682J18874
12880A86556b05926A7608a36153A17446R561h9547A39547A6003L4714a2367j01006
12869a13373A3336b23209r4212a3944A7383f162B54094A16516c1794C44137d53022
12857A34814K00069q5536F4005L1247K02808j47150i1786N233k22393a22206G8608
12845A578h7422B09967o23c0921j57733J0634l5433C09691g7811j86645C16441
12833B28272G7831C8236K49859a68699n2257A36290O5184O3747G7274a93936I5172
$$ plain form
12914 265267 279687 1731 195084 -164264 131030 -9597 -178507 219069 -109114 -152139 84411
12902 -202320 166622 47201 112432 371466 73680 172320 105649 20615 43522 44034 284586
12891 284586 -10174 279363 425317 8577 121920 231996 150638 223040 -207601 67682 186556
12880 186556 -205926 17608 -136153 117446 127007 -89547 139547 16003 50717 -12367 -113373
12869 -113373 13336 -223209 -317421 -13944 17383 -6162 254094 116516 -31794 344137 -453022
12857 134814 334883 249347 64005 95252 298060 150910 -91786 -86553 -308946 -122206 78608
12845 1578 -87422 209967 209344 -30921 -188654 -178020 -213453 309691 -77811 -264456 316441
12833 228272 77831 38236 288095 -168699 -220956 136290 201474 265221 77274 -193936 95172
12821C17600E7466c54484A17176g0415G5735a5689B08775q3875i2031M3474o1488
12810a10045m1388j00739J0042J02973B03865P6356a18190A22077c2261B29950
12799c01684d997B7841a65088A10173b03083E0023B1410O8608J9621a00761F2183
12787D8096d3862j75080A87586b57565D3259b1748j718A31725D5153Q8078a10591
12775B21226b96751a1507j29078A04079i7500B200a19256B75013A00900J36679
12765B37579E6634B498J37997b86749I7888e9077A76902M5001a17883C09266F9445
12753H4938e5489C8158J69104b3392A92522J6152b40663B04292d4576j7291j03908
12742a65775r4037A43751c23729B20375c4728A19183c95877B3834a55640B94049
$$ plain form
12821 317600 57466 -354484 117176 -70415 75735 -15689 208775 124900 -92031 -48557 -110045
12810 -110045 -151433 -252172 -242130 -139157 203865 280221 -118190 122077 -32261 229950
12799 -301684 -4997 27841 -165088 110173 -203083 50023 21410 90018 109639 -100761 62183
12787 48096 -43862 -218942 187586 -257565 43259 -21748 -23466 131725 45153 133231 -110591
12775 221226 -296751 -11507 -140585 104079 -97500 2200 -119256 275013 100900 237579
12765 237579 56634 2498 140495 -286749 97888 -59077 176902 221903 -117883 309266 69445
12753 84938 -55489 38158 207262 -23392 192522 208674 -240663 204292 -44576 -61867 -165775
12742 -165775 -259812 143751 -323729 220375 -34728 119183 -395877 23834 -155640 294049
12731B72470a50091l4644h8331k34601A35417d02506B11218J67078D3565K2064
12721F5629b8311A53166a88186N5617D3635J90627b29568G2883f8976C9408j7279
12710B2129c16520D50233a62132G3777A6046c50342G3347a49685q6698b196k5211
12699b7407k5604C9269P3616E4459J79118j268J18940A36778J33800e5066a8593
12687C49030a07505j27784L0811A80372a01561A05743b14081l8634h9914C6018
12676e8770I3313J02739K34022k12157a19770d5462A1861a13221B46567c8686
12665a41778C19930g2762A49881d3685j2854C20876k7073j12880K5307k4502a10982
12653A45938k172F6980c2071r8202j44208J21211A84849G0469a90608A43550a52136
$$ plain form
12731 272470 -150091 -184735 -88331 -322932 135417 -402506 211218 378296 43565 65629
12721 65629 -28311 153166 -188186 -132569 43635 234262 -229568 72883 -68976 39408 22129
12710 22129 -316520 450233 -162132 73777 16046 -350342 73347 -149685 -236383 -2196 -27407
12699 -27407 -53011 39269 112885 54459 233577 232309 351249 136778 270578 -55066 -18593
12687 349030 -107505 -235289 -204478 180372 -101561 105743 -214081 -252715 -89914 36018
12676 -58770 93313 196052 430074 217917 -119770 -45462 11861 -113221 246567 -38686
12665 -141778 319930 -72762 149881 -43685 -56539 320876 293803 180923 206230 181728 -110982
12653 145938 143766 66980 -32071 -130273 -274481 -153270 184849 70469 -190608 143550 -152136
12641a45234A03078K67912b13721I6836a6765A28344a22321C05049f9647A02061
12630A17148a83531G7588c21954B07031d9446n462q6347f6668C37200A1701J29625
12619A41326a15617B82294i3601D8608K30712J24222o2277L3399a03191A70280
12608A49021J6902E1786b12010L7548C11557H8047a08585b6516r9378A29395b2248
12596e9559J5327D2617p544K80983d5680A56465A006d9025A8248J0581N74823
12585F03652A84762J03747p7718F3188k0969J8775L99809b22559d6312p3205H5746
12573A67273N8508K9226a1488k3092j78708A86313I1838A7859a01564G7784L588
12562H1372P8847h2361b0013B03072l7249k9125c0245B9659Q0028d0534j18335
$$ plain form
12641 -145234 103078 370990 -213721 96836 -16765 128344 -122321 305049 -69647 102061
12630 117148 -183531 77588 -321954 207031 -49446 -54908 -141255 -66668 337200 11701 141326
12619 141326 -115617 282294 -93601 48608 279320 403542 341265 374664 -103191 170280
12608 149021 165923 51786 -212010 -174462 311557 88047 -108585 -26516 -125894 129395 -22248
12596 -59559 -44232 42617 35073 316056 -45680 156465 1006 -49025 18248 28829 603652
12585 603652 184762 288509 210791 63188 42219 60994 460803 -222559 -46312 -119517 85746
12573 167273 225781 255007 -11488 -34580 -213288 186313 91838 17859 -101564 77784 81372
12562 81372 160219 -82361 -20013 203072 165823 136698 -30245 29659 109687 -40534 -158869
12551a58869D2280b29423B75871h49r586c302B16710a26553B29351C7423a67208
12539D9953R5505b73664B58300g4302j51471P9110A12609d2645A64134G4374f1769
12527a28585A63181a89628A48732a45849c0773C77690a9762r8493j4546B33883
12516f9705C329K95553b22356D9772a5600j90028a6335l13483a10671A58042c72305
12504g8657j29074C11059a41275C6841d8730D1879N2563b38460N0343A78453b24273
12492A87524B0330J49716c5374q9099j16190b8324k1844B77634i370D570K21824
12481B26394c76425F8982h5707C49694d9040C36210a72522A40652M450m5416J8537
12470A18223D4361d9211k8867n5245k59001B2485a59563B20504R1956b35546A48230
$$ plain form
12551 -158869 42280 -229423 275871 -849 -10435 -3302 216710 -126553 229351 37423 -167208
12539 49953 145458 -273664 258300 -74302 -225773 -146663 112609 -42645 164134 74374 -61769
12527 -128585 163181 -189628 148732 -145849 -30773 377690 -19762 -118255 -132801 233883
12516 -69705 3329 298882 -222356 49772 -15600 -205628 -16335 -329818 -110671 158042 -372305
12504 -78657 -207731 311059 -141275 36841 -48730 41879 94442 -238460 -188117 178453 -224273
12492 187524 20330 170046 -35374 -124473 -240663 -28324 -50168 277634 -9370 4570 226394
12481 226394 -376425 68982 -85707 349694 -49040 336210 -172522 140652 145102 99686 118223
12470 118223 44361 -49211 -78078 -133323 -392324 22485 -159563 220504 312460 -235546 148230
12458b21982L0912Q86A59345b69458A88140K9511J1365d6726A60972g3899j17902
12447a91801L6474a651j60923A36778E1492O3666C2049b71997N3042B5879J21793
12436A47672b16455i2437A32979B6311b40082h3042j14485C4919a14978k0837
12426a35815B67665a41056I1450J42664b28915c7825j4718A91339a0564F4071
12415E9690i1577D2655b42016i043j29433B02737A5161a80361C6471e558A42938
12403A41765a5700j99694j0041b3354j99945B24455e8610k76964B32940a55797
12392A50881g8488A21819b31431B33643f220j29741B62380a43931B07974d7691
12381C04668b15361p2382e9856q599B65726b05134B29832J12617h9821k0706B33485
$$ plain form
12458 -221982 -191070 -190184 159345 -269458 188140 217651 229016 -46726 160972 -73899 -191801
12447 -191801 -155327 -1651 -162574 136778 51492 115158 32049 -271997 -218955 25879 147672
12436 147672 -216455 -92437 132979 26311 -240082 -83042 -197527 34919 -114978 -135815
12426 -135815 267665 -141056 91450 234114 -228915 -37825 -52543 191339 -10564 64071
12415 59690 -91577 42655 -242016 -9043 -138476 202737 15161 -180361 36471 -5558 142938
12403 141765 -15700 -215394 -225435 -23354 -223299 224455 -58610 -335574 232940 -155797
12392 150881 -78488 121819 -231431 233643 -6220 -135961 262380 -143931 207974 -47691
12381 304668 -215361 -287743 -59856 -68455 265726 -205134 229832 342449 -89821 -110527 233485
12369h582k68041A54336p2965J40258a4611j87177h4555c9151B94175d9634A25001
12357D47094j05840F1846n525f4652A0922K00235a27586A25848f0446j43936e0986
12345I6561b418l3306j55652C5936J19696a09546L7481b782G2643g7578B12305
12333c3631A3383J57406a95000G5902J70794j17700a74617D5148j7030P4296m1209
12322F1205R9738J38800j44053e877B31358K3798A18782K46599a25289j9062a8484
12310C21203f2665D6652J62282g3454B30284K6917A4056K65803d5915H8296P6409
12299A64705K10393j67463A3596g0457B30434r0853J4823e9607B5101N1259g2667
12287A62163E4710N8568L5186E4971K92853a30166C2630d9645A3180R3233J71219
$$ plain form
12369 -8582 -276623 154336 81371 221629 -14611 -201788 -84555 -39151 294175 -49634 125001
12357 447094 341254 61846 56321 -64652 10922 211157 -127586 125848 -60446 -204382 -50986
12345 96561 -2418 -35724 -191376 35936 155632 -109546 -72065 -2782 72643 -77578 212305
12333 -33631 13383 170789 -195000 75902 246696 128996 -174617 45148 28118 102414 61205
12322 61205 160943 299743 155690 -5877 231358 255156 118782 365381 -125289 -144351 -18484
12310 321203 -62665 46652 208934 -73454 230284 257201 14056 279859 -45915 88296 164705
12299 164705 375098 207635 13596 -70457 230434 139581 154404 -59607 25101 76360 -72667
12287 162163 54710 113278 148464 54971 347824 -130166 32630 -49645 13180 106413 277632
12276B77632d9398E170a40587H0989M6526J8523K9183d0511A05473l4406f1323
12264B04578o2238C2251d7066A10175O5277J94075p7685C8395O7165a10559B3624
12252A65097J15905A16340m9258J45326r6065J17719K01612r2540C4545a21390
12241A78775q6701J49092H1542N4657b9517j53713g500F3949j117I604L5696g33
12228b9239D0907K65649i2896j89994b7494I2679b01976B02157k2088p3980L28250
12217D34339I1384a70478H6880J8144J84706b53080H0613K96284A33740a07425
12206C99308A43529d7270A92787q4530J4962J4665C6027Q0801K0767M9976L28864
12195E16435m6038A55322E6071K60595o7539j09031e795A62702M2314l1865k8911
$$ plain form
12276 277632 -49398 5170 -140587 80989 127515 146038 175221 -40511 105473 71067 -61323
12264 204578 142340 32251 -47066 110175 175452 369527 291842 38395 105560 -110559 23624
12252 165097 281002 116340 67082 212408 116343 234062 435674 343134 34545 -121390
12241 178775 92074 241166 81542 136199 -29517 -183230 -7500 63949 62832 9604 45300 -733
12228 -29239 40907 306556 -92896 -282890 -27494 92679 -201976 202157 180069 106089 434339
12217 434339 91384 -170478 86880 105024 289730 -253080 80613 376897 133740 -107425
12206 399308 143529 -47270 192787 108257 123219 137884 36027 116828 137595 187571 516435
12195 516435 470397 155322 56071 316666 249127 140096 -5795 162702 205016 173151 144240
12184A44240a28269c464A56307K34931j74164o0421J74298B1572K12835J0001
12174B44408B267a07221C50729H5038L6817Q1794F1079K6324o082b76595A50790
12162E8667h5037D61752o1874p708Q4765a32632o5116D2695K07005P1446A1848
12150f6439F79970B66179E1965J29597j4890g0515G4651K53988A10518a65378
12139b64657i1851A41165a18020C8812a7491A50972b292j05843H5723H740n73
12128H167b06001c6667m3996F0891J82469b22950P5033D6969N7145j1483I120
12116a66622C82828a07421j01913C4623p946C957M5938Q7632b1749A244g7045
12104B1807P0509J19526b73021A60060J43597F7567G162J42327j4223e0857B35042
$$ plain form
12184 144240 -128269 -3464 156307 391238 217074 156653 330951 21572 234407 244408
12174 244408 2267 -107221 350729 85038 121855 203649 61079 87403 81321 -276595 150790
12162 58667 -85037 461752 399878 392170 476935 -132632 -197748 42695 249700 321146 11848
12150 -66439 679970 266179 51965 181562 166672 -70515 74651 328639 110518 -165378
12139 -264657 -91851 141165 -118020 38812 -17491 150972 -2292 -108135 85723 8740 8167
12128 8167 -206001 -36667 -80663 60891 243360 -222950 -147917 46969 104114 92631 9120
12116 -166622 382828 -107421 -209334 34623 26677 3957 49895 137527 -21749 1244 -77045
12104 21807 92316 211842 -273021 160060 303657 67567 7162 149489 135266 -50857 235042
12092H1663J22360K20458a59492B2046Q6294O8360J8626j1098i1870B8806J52283
12081A81089a23087m5009c9516B32811k4627P7990a93792B00345a73640A54941
12070F2426G143J5009J9723P2233j8471J87620A3047M36501F1516a92564B68313
12058a60277B23163o9143J55078a66831A33710e9900a095r7049o5868B18014k7436
12047A90578l0115L0554J44698a50410C7959h5148H94J11553l8055F701J06220
12036A12921d9794k05471g5045k23989a26524B04189C9919L1754e17951H6630
12025a9717A20781b5378B13405g6660A11852N5825e1667B24169J65044a96226
12014F8317J37928c1600A94064q8953K12309h5072r2397n5695j29249B07177d09660
$$ plain form
12092 81663 204023 424481 -159492 22046 108340 176700 195326 184228 -91870 28806 181089
12081 181089 -123087 -168096 -39516 232811 208184 286174 -193792 200345 -173640 154941
12070 62426 7143 22152 41875 114108 95637 283257 13047 449548 61516 -192564 268313
12058 -160277 223163 154020 309098 -166831 133710 -59900 -1095 -98144 -164012 218014 190578
12047 190578 160463 191017 335715 -150410 37959 -85148 894 112447 74392 6701 112921
12036 112921 -49794 -255265 -75045 -299034 -126524 204189 39919 71673 -517951 86630
12025 -19717 120781 -25378 213405 -76660 111852 167677 -51667 224169 389213 -196226
12014 68317 206245 -31600 194064 105111 317420 -85072 -177469 -233164 -362413 207177 -409660
12002A0157N0750Q9194D3530h1972p6620A07707d3989C75877a43539a1008j91840
11991b02848A65031D9033a93592f9915n1996A59799l2048e9347C4141L50801D839
11979A79022O7691h910j19481d054G8177J2047C1226K31729b7500j33551a2016
11967B22422a4580k91072r5357a57E8415N5258f048C8654b69380J1560B04711
11955a20391k28315A25821J3076g088j58659b4119k20471J10239D10778A33705
11944A3215K08447A06299a4732A42088m4344N0475d12646A17483a41047D7257
11933A02719b59322b4566J144h565K35k5696A23270i9048r0533P6411j02611h8094
11920D3325J63714c28168o0175g0612k2628k73529A63380c02000j99276C7656
$$ plain form
12002 10157 60907 150101 43530 -81972 -158592 107707 -43989 375877 -143539 -11008 -202848
11991 -202848 165031 49033 -193592 -69915 -121911 159799 127751 -59347 34141 384942 4839
11979 179022 246713 -8910 -128391 -4054 78177 90224 31226 262955 -27500 -161051 -12016
11967 222422 -14580 -305652 -401009 -157 58415 113673 -6048 38654 -269380 -257820 204711
11955 -120391 -348706 125821 138897 -7088 -165747 -24119 -244590 -134351 410778 133705
11944 13215 221662 106299 -14732 142088 97744 148219 -412646 117483 -141047 47257
11933 102719 -259322 -24566 -23422 -8565 -8330 -34026 123270 -99048 -189581 -113170 -215781 -88094
11920 43325 207039 -328168 -388343 -70612 -93240 -366769 163380 -302000 -501276 37656
11909h3987C73788P6607h4455b8738A39634B1947N3970b3786H7762J09081A0656
11897a81388P2072j00900I0019J73327I5027C9919a59972A79599Q2220H3576J20809
11886B04385a41355C8313P2442a47546B6185g128D51J57200d378l19583d3773
11874i194k21774F0634c68891A32211g2867A33586k6413D8370b08118h7629o872
11863i4501k15449A11358i2661j32337G0715a27026j09393K8500k0648p603B08330
11851C33973a10692m03587b6108o6570b400j74192E5161b8554k87446H4290g0997
11839B17771c643r9181A86660I176b89380B89396a96988B64237a42541H6498J52994
11828B39492d0104A13492J38881J82399A44562N8054a86008Q5684C6185N5982
$$ plain form
11909 -83987 373788 450395 -84455 -28738 139634 21947 75917 -23786 87762 196843 10656
11897 -181388 -109316 -210216 90019 263346 95027 39919 -159972 179599 261819 83576 204385
11886 204385 -141355 38313 110755 -147546 26185 -7128 451 157651 -4378 -323961 -43773
11874 -9194 -230968 60634 -368891 132211 -72867 133586 107173 48370 -208118 -87629 -94501
11863 -94501 -309950 111358 -92661 -224998 70715 -127026 -236419 -207919 -228567 -236170 208330
11851 333973 -110692 -514279 -26108 -92678 -2400 -176592 55161 -28554 -316000 84290 -70997
11839 217771 -3643 -102824 186660 9176 -289380 289396 -196988 264237 -142541 86498 239492
11828 239492 -40104 113492 252373 434772 144562 202616 -186008 -100324 36185 92167
11818I2167j8726d745j75243E7827J06607E0438g4887j89293E5796N9528c09882
11806a7573I711g5051B45411d7469l73343D02161H6209k6669b933G5568f5822
11794h7040k17862J11070h7287K1551K9450J6404B73987a07318F5302F481g0294
11782d8151j24239K3873f4176k33456B0485a1692j03097A71545i3103A56657g0079
11770B4552o541a27833k47485C21408j42752b2185k49929B09522F585b7247k2018
11759d9265j81459B60045h6657B4273d5113k43839J34617o499p8997h3818o1894
11748a45712c3017m2600C72986j84596c3208B24638a71776d276B64354b76682
11737b4665B63619H3764h1024G2727g393j46751f9257j58123G8798a84181G2694
$$ plain form
11818 92167 73441 -4745 -179988 57827 164434 50438 -74887 -264180 55796 115324 -309882
11806 -17573 9711 -75051 245411 -47469 -420812 402161 86209 59540 -2933 75568 -65822
11794 -87040 -304902 -193832 -87287 -65736 -36286 -19882 273987 -107318 65302 6481 -70294
11782 -48151 -172390 -148517 -64176 -297632 20485 -11692 -114789 171545 -93103 156657 -70079
11770 24552 18011 -127833 -375318 321408 178656 -22185 -272114 209522 6585 -27247 -49265
11759 -49265 -230724 260045 -86657 24273 -45113 -288952 -154335 -160834 -239831 -83818 -145712
11748 -145712 -33017 -75617 372986 188390 -33208 224638 -171776 -4276 264354 -276682
11737 -24665 263619 83764 -81024 72727 -7393 -154144 -69257 -227380 78798 -184181 72694
11725B00551B8957a61264k9105k03854m6508R4194a50094D6244K3141c19641a18864
11713B23404a09747q6777B48792i2271k81563D5404a26428I7005b326m27918a75463
11701a27207M0641B44957c02347n9855i8873k77280G7765R5110a9969f271C73886
11689C52490c4573j03664a7715n47F1305f8118l09283a74171H5104l3757a03379
11677c6022A73541A1583a35384C24020D8565L5842b1937q6981J2628C6444f1277
11665H2763K5355B4274i0138B00708e7046H6785j0317K8458d0641D9366Q1387
11654A30753e9716j61461B60914a07069A1382a0759l97437c2328A87039e9446
11643b11227j02149q7058R0312c1059j86860B38546b90536A96385n2779b8646
$$ plain form
11725 200551 28957 -161264 -190369 -394223 -440731 -346537 -150094 46244 69385 -319641 -118864
11713 223404 -109747 -196524 248792 -92271 -373834 45404 -126428 97005 -2326 -430244 -175463
11701 -127207 -86566 244957 -302347 -362202 -98873 -376153 77765 172875 -19969 -6271 373886
11689 352490 -34573 -138237 -17715 -18262 61305 -68118 -377401 -174171 85104 51347 -103379
11677 -36022 173541 11583 -135384 324020 48565 84407 -21937 -108918 -96290 36444 -61277
11665 82763 108118 24274 -90138 200708 -57046 86785 76468 104926 -40641 49366 130753
11654 130753 -59716 -221177 260914 -107069 11382 -10759 -408196 -32328 187039 -59446
11643 -211227 -313376 -400434 -310122 -31059 -217919 238546 -290536 196385 143606 -28646
11632A72918B6669a95884A90278b62995B38183g9252L5337G8488M0514j9631M2584
11621A41955e4857K1803P954G2154k8161K74953A0874J77199p9421B1872F30b96152
11608A18081K7646b44885A35781L3857a17511n03602g1974n3585k09431B04233
11597A22139A0276J97955r4693J23235b21567B95687o251j29284k9921B7553d697
11585F7304f1238D1451a56705k64385A12084K32593A9818J08334k9609b24102
11574h4632B16764C0849b9648B45606j00673N398B7544O6714N9429d6865C26820
11562d6384b2741o1489A89562b38216B37500a91792C28738a61125B34905o2104
11552A72801n8029P4519M19157o6188c03544B561c74409Q0527A8079L07385f5412
$$ plain form
11632 172918 26669 -195884 190278 -262995 238183 -79252 -43915 78488 119002 99371 141955
11621 141955 -54857 -33054 -25100 72154 43993 318946 10874 188073 108652 21872 630 -296152
11608 118081 145727 -244885 135781 169638 -117511 -621113 -71974 -125559 -334990 204233
11597 122139 10276 208231 113538 236773 -221567 295687 289436 160152 130231 27553 -4697
11585 67304 -61238 41451 -156705 -421090 112084 344677 19818 128152 98543 -224102
11574 -84632 216764 30849 -29648 245606 144933 150331 27544 94258 153687 -46865 326820
11562 -46384 -22741 -84230 189562 -238216 237500 -191792 328738 -161125 234905 172801
11552 172801 114772 189291 608448 542260 -303544 2561 -374409 -293882 18079 325464 -65412
11540a97058Q0033E9862q372M8122H085J57651f3892A2473f3379m8550M6826L950
11528f1153i334H4513b1668G1845J3292M07008C1444L30453a40155I432d1125
11516E0255a29097o1231B01706a32673B96668F0973J27815a81304k72676K15630
11506b38350E5779J08378C9577N7418L6422J30973a86428M580g2632B6973P2448
11495I9421K57212j18717L2311I4834i772j07980e1272B60839b658G8552d8711
11483b5450J793A01328l673K73311G290K8543J37577A1909c40613i6976A03228
11471h9493b1626D00603j90834c79215A68627E101a07244A99306q52E2318f0386
11459a56936c6605A34366J71789c3835A62526l1246f7912a2944A22202J05859
$$ plain form
11540 -197058 -117025 59862 51490 99612 8085 165736 -63892 12473 -63379 -111929 -65103 -61153
11528 -61153 -9334 84513 -21668 71845 85137 492145 31444 361897 -140155 9432 -41125
11516 50255 -129097 -190328 201706 -132673 296668 60973 188788 -181304 -453980 -238350
11506 -238350 55779 164157 39577 96995 133417 264390 -186428 -181848 -72632 26973 99421
11495 99421 356633 237916 270227 94834 -9772 -117752 -51272 260839 -2658 78552 -48711
11483 -25450 -23657 101328 97655 370966 7290 35833 173410 11909 -340613 -96976 103228
11471 -89493 -21626 400603 209769 -379215 168627 5101 -107244 199306 198454 52318 -60386
11459 -156936 -36605 134366 306155 -33835 162526 131280 -67912 -12944 122202 228061
11449B28061a01222j8792A84450D5801J2609b30114E8969L18208A40264J86363
11439C26627h4251B59347a67741C5826e4004j3700C86862A77801n9296E5202J20045
11428A75247n0078a88921B65216a37832a0856q637A46896f4908F1526c37905A94958
11416B32817C8875b4266l07053A98978I5950J06204f7553H1415d12072G6446j2941
11405F3505c9013l04731A55595k1105C8872b07821h5884E5144K95498f239j78272
11394a84511A69549N4531m6827j9431N3203L5831p3183b0186B45212i5827F9032
11382g8578j44034j3811O7011A22240o1057a75013H0969A1639J85722E8904A856
11370d4132E9176e6495q2525A07383c50950b6468j6869B369i5839K414B20968
$$ plain form
11449 228061 -101222 -120014 184450 45801 58410 -230114 58969 377177 140264 326627
11439 326627 -84251 259347 -167741 35826 -54004 -67704 386862 177801 118505 55202 175247
11428 175247 125169 -188921 265216 -137832 -10856 -19493 146896 -64908 61526 -337905 194958
11416 232817 38875 -24266 -331319 198978 95950 202154 -67553 81415 -412072 76446 63505
11405 63505 -39013 -343744 155595 134490 38872 -207821 -85884 55144 350642 -6239 -184511
11394 -184511 169549 224080 177253 157822 211025 246856 173673 -20186 245212 -95827 69032
11382 -78578 -222612 -236423 -169412 122240 61183 -175013 80969 11639 197361 58904 1856
11370 -44132 59176 -56495 -139020 107383 -350950 -26468 -43337 2369 -95839 -93425 220968
11358a11024D6994q447N1114O2874J8703E2162J00079a54487k17854B89759g4036
11346B13692p816d1122j6404A79317G40g1030F0294h3684j64740o7617f8430K2604
11334d5826A40894R839b1711k67850a40852A44196a03622B0813K17398J52745
11324C90956f759k35280j1843G2940A9568a12836A42442A0065i7388D9052e3724
11312A19868B974g610k48393a681E9719M9637N3798L434b39088i6282l21605G1225
11299a43510j50659B4811R7613P017k5347A6798f0306D6152b34247N6174P1476
11288a06597l2287L1880F5398A9389b48589e5713j66329A85711c5118d307j80930
11277a85237N5903A82898d21694a19557j05283A78000D8445a31557q0423E2355
$$ plain form
11358 -111024 46994 38547 89661 152535 171238 52162 152241 -154487 -372341 289759 -74036
11346 213692 205876 -41122 -57526 179317 740 -71030 60294 -83684 -248424 -316041 -68430 -45826
11334 -45826 140894 150733 -21711 -289561 -140852 144196 -103622 20813 238211 390956
11324 390956 -6759 -242039 -253882 72940 19568 -112836 142442 10065 -97388 49052 -53724
11312 119868 2974 -7610 -256003 -1681 59719 109356 163154 166588 -239088 -96282 -417887 71225
11299 -143510 -294169 24811 122424 129441 104094 16798 -60306 46152 -234247 -178073 -106597
11288 -106597 -138884 -107004 65398 19389 -248589 -55713 -222042 185711 -35118 -4307 -185237
11277 -185237 -129334 182898 -421694 -119557 -224840 178000 48445 -131557 -211980 52355
11266B5214c36920a06900D4129j7516c33486a22047l8987A68249p7279B5347e2516
11254g2618l56322J77373h1821D1221b43320J03490H5491g9436D4792a52636D0910
11242a47923B41963a47298A6259O2548b04177p8488i028m975B5212J02360j9800
11231A07772a34649H3500a66168c6698j21480M3845J8094k91214J38877j04239
11221c52815E9297n597h7960p7056M3512l33677d8067C4094b87332E2439b84845
11209d0434j2068j17774E2692R407a32245A02888d7425m01940B66838d5270p5874
11198a21144G3371d01796J99171h801j69587r636A08232b05224C80c24801e3192
11186H0901d8102p004j66995A84033d0219A45537B4953L4571a8500D7037d7746
$$ plain form
11266 25214 -336920 -106900 44129 26613 -333486 -122047 -161034 168249 90970 25347 -52516
11254 -72618 -428940 -251567 -81821 41221 -243320 -139830 85491 -79436 44792 -152636 40910
11242 -147923 241963 -147298 16259 78807 -204177 -282665 -9028 -14003 25212 127572 107772
11231 107772 -134649 83500 -166168 -36698 -158178 -114333 -96239 -387453 -248576 -352815
11221 -352815 59297 53700 -87960 -165016 -121504 -455181 -48067 34094 -287332 52439 -284845
11209 -40434 -52502 -170276 52692 62099 -132245 102888 -47425 -449365 266838 -45270 -121144
11198 -121144 73371 -401796 -202625 -8801 -178388 -188024 108232 -205224 380 -324801 -53192
11186 80901 -48102 -55106 -222101 184033 -40219 145537 24953 59524 -18500 47037 -47746
11174C7520d0260a3539A06670a2087H3145a52157K4319C40984A64812c51558a480
11162A55074m8755a75760L3076k74842A4033b78032B28433a01295B35141c12038
11151B9835J75629c29955A9840f5049A482a4862B1024J73314E5036a88092j917
11140a90009h9185m0822C72021a52107A19103c3339k97181f7804A65904a16067
11129a1544k95802B10869C5909K29964b11032C43657D6580P9668b63155C23121
11118b50361m8790J26456e354A208i9715A38915c59055j12960B80027j3663b5685
11106A414b4585E8353L7864a13700F1463K01863f7634l215G2082K02393J53309
11095D27784A29978J25071A00818h9047I8442q315a959I7409R3267F6374J67819
$$ plain form
11174 37520 -40260 -13539 106670 -12087 83145 -152157 -127838 340984 164812 -351558 -1480
11162 155074 106319 -175760 -142684 -417526 14033 -278032 228433 -101295 235141 -312038
11151 29835 205464 -329955 19840 -65049 1482 -14862 21024 194338 55036 -188092 -190009
11140 -190009 -89185 -130007 372021 -152107 119103 -33339 -330520 -67804 165904 -116067
11129 -11544 -307346 210869 35909 265873 -211032 343657 46580 126248 -263155 323121
11118 -250361 -299151 -172695 -5354 1208 -99715 138915 -359055 -472015 280027 266364 -25685
11106 1414 -24585 58353 96217 -113700 61463 263326 -67634 -70849 72082 274475 427784
11095 427784 129978 255049 100818 -89047 98442 90127 -1959 97409 190676 66374 234193
11084B34193H0969e3568j36505B10605g7810P605A43083e056A75856g3997o2903
11073a36900F4346g5868C07287A09749K74487j36766H6924J49388i254A48043
11062A96827m4979f0143G707L5189J07118j9532K59361o4112L097Q4928j27592
11051B86164j31304J22194N424L35965m0997k72018J14605k00248L08600k21258
11041C07127K359F1443L80133B02954J38978L1401L02265j28395L468l9690j35088
11030C75893L65054B16487J09087K36994B64037L72733k44600J8918j12448J50452
11020D49092J86344k68731K1378j70729K57320o5389A86447J00880L84743B69413
11009H66038C89226K40055k33858K17081J0470q0549l1386m3421K80042C66186
$$ plain form
11084 234193 80969 -53568 -190073 210605 -77810 -70205 143083 -5056 175856 -73997 -136900
11073 -136900 64346 -75868 307287 109749 384236 247470 86924 236312 -9254 148043
11062 196827 151848 -60143 7707 42896 150014 130482 389843 325731 328828 413756 286164
11051 286164 154860 277054 282478 618443 577446 305428 420033 219785 528385 307127
11041 307127 309486 61443 441576 202954 341932 373333 675598 547203 550671 510981 375893
11030 375893 740947 216487 325574 562568 264037 636770 392170 411088 298640 449092
11020 449092 635436 366705 388083 217354 474674 409285 186447 287327 672070 269413
11009 866038 389226 629281 395423 612504 622974 542425 511039 467618 747660 366186
10998F11533j32800K41828j98991A69977L55627j87632M07622l68792M7245N3613
10988D77660J71343k55336J27849L4620p8896N1997P921j29552K65752B72312
10977C12817J73087J39111j96074N3952M01029j55250k26098J03818L0026p6120
10967E60298K28452N3591q9930m9358L8642J29237K61460k0634J19312M38334
10957A669404l90649K37147K74623P6313J01653p0506l10550K76983j80698k50722
10947A432998L2922M0340j69583p452M9742j52635j09484K26818J0766J0534L00095
10936A665061l58131j37238k3651j70283j22769k10178l141K59121C87128L7749
10926D24877j17942H6382c1250A20629J70164N6955C4649K66575p9815A8439b40340
$$ plain form
10998 611533 478733 720561 521570 169977 525604 337972 745594 376802 424047 477660
10988 477660 649003 393667 521516 556136 477240 529237 537158 407606 673358 272312
10977 312817 485904 625015 428941 482893 883922 728672 502574 606392 636418 560298
10967 560298 788750 842341 752411 703053 741695 870932 1132392 1111758 1231070 1669404
10957 1669404 1278755 1515902 1790525 1866838 1968491 1897985 1587435 1864418 1683720 1432998
10947 1432998 1465920 1506260 1336677 1329225 1378967 1226332 1116848 1343666 1354432 1364966 1665061
10936 1665061 1306930 1169692 1146041 975758 852989 642811 639670 898791 387128 424877
10926 424877 306935 86382 -31250 120629 290793 347748 34649 301224 221409 18439 -240340
10914A68230A3151c6238o5583B40083j00212A2122b27898A34954a17827F4427
10903a54743A53554F0476j5220j4569e3727b2320C0085b13076A81991N9448f6311
10891a6555k83226A03704j6114J36780g3706L1716l9603G1683K24023i6797n4502
10880a51299B7090O2145a27427B9668H123a18817G6897r640K80717a65783j5019
10869a80802K0881A32654a32801L7136B94528L9521a01520B65651h786k31288
10859b40074A72639a1221E8006b5403j63757P7695C34645A05256A9716m71i0385
10847b82358a0220G6086A3998a50444o1881f7280G3948l6384f2299p5349F6688
10835I5402F490a37286G8466c13568J44337B07434l0402b13197C391a18322C583
$$ plain form
10914 168230 13151 -36238 -101821 240083 139871 12122 -227898 134954 -117827 64427
10903 -154743 153554 60476 45256 30687 -53727 -22320 30085 -213076 181991 241439 -66311
10891 -16555 -299781 103704 87590 224370 -73706 -41990 -81593 71683 295706 -96797 -151299
10880 -151299 27090 89235 -127427 29668 8123 -118817 76897 67257 347974 -165783 -180802
10869 -180802 -159921 132654 -132801 -95665 294528 334049 -101520 265651 -8786 -240074
10859 -240074 172639 -11221 58006 -25403 -189160 -111465 334645 105256 19716 19245 -90385
10847 -282358 -10220 76086 13998 -150444 -212325 -67280 73948 37564 -62299 -137648 66688
10835 95402 6490 -137286 78466 -313568 -169231 207434 177032 -213197 3391 -118322 3583
10823D5323J3123K94269A18100j1339d7715j29146N832I3273a16039k04654J38883
10812a81810O9285c4516j78642G2158R7961c77607B06668f6770n3675j1386A76315
10800c2948A19461a00674j74728I6451a4251k07514K8706E1126c01640A64449
10789A57881a49966g3546j18495d730b107A52015m0918g9412A40378m6773J6147
10778A09752c82035A31850a60697L9223p7535B8229e1602F9832a60421I2908a938
10766B9513j4318d1896B43396a02841j7895k20646J03080A51764K8733f0830a4364
10754B30152j2078a76283C60239b5745k61411B94305e3625I3287A1746b6815B83156
10742a1481A54895C9643R998L3812h2616j08764B70394b28723g2965a3512A5516
$$ plain form
10823 45323 58446 352715 118100 106761 -47715 -176861 -171029 93273 -116039 -320693 -181810
10812 -181810 -112525 -34516 -213158 72158 170119 -377607 206668 -66770 -120445 -131831 176315
10800 -32948 119461 -100674 -275402 96451 -14251 -221765 -193059 51126 -301640 164449
10789 157881 -149966 -73546 -192041 -4730 -2107 152015 111097 -79412 140378 93605 109752
10778 109752 -382035 131850 -160697 -121474 -199009 28229 -51602 69832 -160421 92908 -1938
10766 29513 15195 -41896 243396 -102841 -120736 -341382 -238302 151764 180497 -60830 -14364
10754 230152 218074 -176283 360239 -25745 -287156 294305 -53625 93287 11746 -26815 283156
10742 -11481 154895 39643 49641 83453 -82616 -191380 270394 -228723 -72965 -13512 15516
10730g4416l7227C763c9876J1978H3022K9975i8063k41899I883P5747c21679c0435
10717a07765M7136k3670f317j1591A50918b95809j3324N7244J07907F5350e1653
10705f8677q2592M0471f208j89093j95095F7537c3088k9095m31442a26537f03
10693e3636l74867K04247E7789g6270q367C42652F3237L8216c4872B68382f9606
10681A82546B5640h2074o7347A2596b67467B2877c2585A265d15135J02709f54
10669a65470m2195i3206I3599N8313a48055J4136k78527E420P6721g68k3274A26294
10656a93445j04193m3319A18026c2200j27847O3160a3933A28741b07305M1233
10646a66072B6859b44513c9873l98472a60617I2655M9615N63a10673l46313a05688
$$ plain form
10730 -74416 -111643 3763 -39876 -27898 83022 112997 -98063 -339962 9883 85630 -321679 -30435
10717 -107765 -60629 -84299 -6317 -17908 150918 -295809 -309133 -251889 -143982 65350 -51653
10705 -68677 -151269 -110798 -6208 -195301 -390396 67537 -33088 -62183 -493625 -126537 -603
10693 -53636 -428503 -224256 57789 -76270 -84637 342652 63237 101453 -34872 268382 -69606
10681 182546 25640 -82074 -149421 12596 -267467 22877 -32585 1265 -415135 -312426 -654
10669 -165470 -207665 -93206 93599 151912 -148055 -133919 -412446 5420 82141 -768 -24042 126294
10656 -193445 -297638 -340957 118026 -32200 -160047 -96887 -13933 128741 -207305 -166072
10646 -166072 26859 -244513 -39873 -438345 -160617 92655 142270 142833 -110673 -456986 -105688
10634C1364c54214C42511b43993A08275b0146j5454A937a32031B4301h8595B3207
10622G9708b05932a4832l46655D6034L14902b73285b578o9807K822k18724h1720
10610a86679f166A91038E9945g9724o0681q0449q2476a45643d8061A60629c2287
10598b05439f5428E6176h7058m00334i8390A48815c3650j11777k603m167b9369
10586H9258K5157n6689a41099k47387A53805a0636D9587a00715C9017a16807j14167
10575b30974A57001a34209e3736a5035G1828b09997A51539B2801a76990k01757
10565c78747A41726J77501c19274J32484c0407k13545H2335a13386O340A730R5552
10554I7282J18765I9288C9254c9836m618E3099N1919h2202B18707b55668P9430
$$ plain form
10634 31364 -354214 342511 -243993 108275 -20146 -35600 1937 -132031 24301 -88595 23207
10622 79708 -205932 -14832 -361487 46034 360936 -273285 -2578 -72385 -69563 -288287 -81720
10610 -186679 -6166 191038 59945 -79724 -140405 -220854 -303330 -145643 -48061 160629 -32287
10598 -205439 -65428 56176 -87058 -487392 -98390 148815 -33650 -145427 -148030 -152197 -29369
10586 89258 114415 57726 -141099 -388486 153805 -10636 49587 -100715 39017 -116807 -230974
10575 -230974 157001 -134209 -53736 -15035 71828 -209997 151539 22801 -176990 -378747
10565 -378747 141726 319227 -319274 -186790 -30407 -243952 82335 -113386 -107046 1730 97282
10554 97282 216047 99288 39254 -39836 -44454 53099 105018 -82202 218707 -255668 -176238
10543a76238b9740n7333E727K63097N6099b45931P649a6756l55303D0890a77579
10531a07205E6686J13518c14103h1278c7730B58940l7352d0644l38585H6547J15308
10520B01855b08515H5418O5775C2855b34627o1482B85953i0875H2886c0973a1150
10508g0207A524d47980a35160j9035j05987B85044B5760L07928R212B7192b2916
10496A9312b06185A0885M5044h5808l1972k31442J74215a5048j04666L4377A00605
10484b1273B8314f2422j81783B46479F5733g2167O339K2340A73233h2494j31524
10473b14018A48440a71785B7106b70602L6050F6155a59322E8669a0646A06678
10462C44115p8155A12245L08580j25753G1912L85609A79336c8276m69316h6900
$$ plain form
10543 -176238 -29740 -87073 5727 268824 324923 -245931 -238282 -16756 -372059 40890 -177579
10531 -107205 56686 170204 -314103 -81278 -37730 258940 221588 -40644 -379229 86547 201855
10520 201855 -208515 85418 151193 32855 -234627 -296109 285953 -90875 82886 -30973 -11150
10508 -70207 1524 -447980 -135160 -154195 -260182 285044 25760 333688 342900 27192 -22916
10496 19312 -206185 10885 55929 -85808 -117780 -349222 -175007 -15048 -119714 -85337 100605
10484 -21273 28314 -62422 -244205 246479 65733 -72167 -65828 -43488 173233 -82494 -214018
10473 -214018 148440 -171785 27106 -270602 -234552 66155 -159322 58669 -10646 106678
10462 344115 265960 112245 420825 295072 71912 457521 179336 -38276 -507592 -86900
10451A1392a51752j0191r0780O6382N1798f5660l56985a68676c533I918a47359
10439I9650b20555D5160A6039P6806b44338A44892B7622b84183D23573a45906
10428B54994M1724G1914J20014a2056C07648A05216b3387j70742A83933a83489
10417A06088A3626a36818a4911j18949B7456J37000a00144k65380C564a80737
10406b0715A2764g4426A30201b87083d975E6755a20135A01366R3264a07454p2212
10395a79666e7979b7160j73868K6872A94667d80295i3705b5890a796j8917H6025
10383G5304C0588Q9211a84610A5063J14079K1476b35705B70368J04712m8551G4456
10371B2584a12569C02312a28704p8399Q7970B2720M3851J67261I793K2993a72834
$$ plain form
10451 11392 -151752 -161943 -252723 -186341 -134543 -65660 -422645 -168676 -3533 9918 -147359
10439 99650 -220555 45160 16039 92845 -244338 144892 27622 -284183 423573 -145906
10428 254994 296718 71914 191928 -12056 307648 105216 -23387 -194129 183933 -183489
10417 106088 13626 -136818 -14911 -133860 27456 164456 -100144 -365524 3564 -180737
10406 -20715 12764 -74426 130201 -287083 -4975 56755 -120135 101366 194630 -107454 -179666
10395 -179666 -57979 -27160 -201028 -174156 194667 -480295 -93705 -25890 -1796 -20713 86025
10383 75304 30588 119799 -184610 15063 129142 150618 -235705 270368 375080 326529 74456
10371 22584 -112569 302312 -128704 -207103 -119133 22720 66571 233832 9793 32786 -172834
10359B08728N4045b06653I885J41466M9838K02048H0829K01601b7083C08093m6423
10348B61670K90253k46978J32132g0425A9675N1561K04851L15474A69101d1604
10337C81873j72151A478K13926K07383r3146K79425j00803j65882G7481Q5523
10327A63004F812M22493k05553K60851k38911J72819O016A78304O907a00153A65724
10315H9516b08398F9866K19636a49260B59302h7297j65137B31084b37970G0340
10304I2520c4646B26770e3917B9330K75983a82578A3750J77935F5262J57123m2207
10293A80178g4403K8647K1560A84453G0846a44448A36422b32072j46738J13886
10283b64924D8019a2087D4323b0384r9253C0509A3710e33A84J031J8466b14114
$$ plain form
10359 208728 262773 -206653 9885 151351 201189 403237 80829 282430 -27083 308093 261670
10348 261670 551923 304945 437077 -70425 19675 71236 276087 591561 169101 -41604
10337 381873 209722 1478 215404 422787 329641 609066 508263 342381 77481 163004
10327 163004 6812 429305 223752 484603 245692 418511 424527 178304 185211 -100153 165724
10315 89516 -208398 69866 289502 -149260 259302 -87297 -252434 231084 -237970 70340
10304 92520 -34646 226770 -53917 29330 305313 -182578 13750 191685 65262 222385 180178
10293 180178 -74403 -45756 -24196 184453 70846 -144448 136422 -232072 -378810 -264924
10283 -264924 48019 -12087 44323 -20384 -119637 30509 13710 -533 184 1215 19681 -214114
10270b3465H5316l8132i8180E0771a68283f770p3651B61646J6420f9233C37979
10258A89482c44664J66213N2586g929j4265k24483M3193R6537r995A80005H6088
10246f4037B46759a4265A21276a04686A91510H9793L06615J3140H185L2132K21362
10235B61679K28862E4831J25172a17314A67951l1483a52930a2512j11049e3616
10224F1618O6030e05017B71019e791k18270A60871b2417n3839j76486M3859K0275
10213a88608c6693B63376B500c01402a06307l6234l86108d4601o1626C15367a47081
10201c9083k62104J9885C34059b24670l9545B19832a06588j26987A18324E445
10190A67979h7027B54646C4134c15640J14786g474j57646f6273j39061A27218
$$ plain form
10270 -23465 85316 47184 -98180 50771 -168283 -6770 -80421 261646 278066 -69233 337979
10258 189482 -344664 -178451 -125865 -7929 -22194 -246677 -203484 -106947 -116942 180005 86088
10246 -64037 246759 -14265 121276 -104686 191510 89793 396408 409548 8185 40317 261679
10235 261679 490541 54831 180003 -117314 167951 136468 -152930 -12512 -123561 -53616
10224 61618 127648 -505017 271019 -5791 -224061 160871 -22417 -76256 -252742 -208883 -188608
10213 -188608 -36693 263376 2500 -301402 -106307 -142541 -528649 -44601 -106227 315367 -147081
10201 -39083 -301187 -281302 334059 -224670 -264215 219832 -106588 -233575 118324 5445
10190 167979 -87027 254646 34134 -315640 -200854 -7474 -165120 -66273 -205334 127218
10179a874C2607d3005l08826J12042a1390j9613K450l38212I2734a10447B3374
10167g8394j34074d4808L194A7128f5223A95306a97411l30231C11543F0657a48280
10155A16488D7296b78962c0820B632b665G8076b63004b4271l23873Q8304F616
10143D34446a52501b4484j08080i404A44114K2327e4512l23037a58716A784b70309
10131A00344b18175B24688o7249a07949L9009j08910O4301A39791e1328K5518
10121b5810a2719m4450C69519D7750b54098J13883m7732o0228l4777J09731A82239
10109E4442a70897M1832c3937J0451k4464B26768a40406p4579a5711g308A40244
10097c38515R7554A16755a49506A38837a08700j30303B68082a13357k301q2709
$$ plain form
10179 -1874 32607 -43005 -351831 -239789 -11390 -31003 -28553 -366765 92734 -110447 23374
10167 -78394 -212468 -44808 -41614 17128 -65223 195306 -197411 -527642 311543 60657 -148280
10155 116488 47296 -278962 -30820 2632 -2665 78076 -263004 -24271 -348144 -259840 6616
10143 434446 -152501 -24484 -132564 -9404 144114 166441 -54512 -377549 -158716 1784 -270309
10131 100344 -218175 224688 157439 -107949 -68940 -177850 -113549 139791 -51328 -25810
10121 -25810 -12719 -57169 369519 47750 -254098 -140215 -187947 -248175 -282952 -173221 182239
10109 54442 -170897 -129065 -33937 -23486 -47950 226768 -140406 -214985 -15711 -7308 140244
10097 -338515 -240961 116755 -149506 138837 -108700 -239003 268082 -113357 -115658 -198367
10087a98367i310j0785Q382J635m82043a15478N0877F2562a4860k23272a7646
10075a90705e2771k92763A53599F6971a39777E1005N8303a33952b0032q9153A04367
10063A46882a73673A794Q8351g8806l1532N2344A34773g6679A35322C1674i0826
10051a75674l55439G6216K39735a56732D92813j73659F9588c25023J31129i5553
10040B39429a01240A83369a80954B20888r5356a57875A62929a46695L7242B01334
10029c03672e9620E9305d1542A79149d2777b569j0059H2203a88265h3768B6529
10017b14955b8575k55757i5162G8427h6226K6013k73848a49556I4658h7805r2541
10006a80346B50670a39697C2920b47981a16924j72946d6753n1110b2283j30513
$$ plain form
10087 -198367 -9310 -20095 -11713 -10078 -492121 -115478 -64601 62562 -14860 -238132 -17646
10075 -190705 -52771 -345534 153599 66971 -139777 51005 109308 -133952 -20032 -109185 104367
10063 146882 -173673 1794 90145 -78806 -110338 -57994 134773 -76679 135322 31674 -90826
10051 -175674 -531113 76216 315951 -156732 492813 319154 69588 -325023 -193894 -95553
10040 239429 -101240 183369 -180954 220888 125532 -157875 162929 -146695 -109453 201334
10029 -303672 -59620 59305 -41542 179149 -42777 -2569 -12628 82203 -188265 -83768 26529
10017 -214955 -28575 -284332 -95162 78427 -86226 -60213 -334061 -149556 94658 -87805 -180346
10006 -180346 250670 -139697 32920 -247981 -116924 -289870 -46753 -97863 -22283 -152796
9996a52796A96545a95750A20299b13535H8716a84164j22184a1385l1437A94842
9985A40546g8358J5806A56604b14644c3393l87067a95077M9727q9510p6868J19218
9974a92510D5256K90407D9374g8009l39079D9704d0083a0189A3247c46856n2394
9963c99250R5927a19183N3290j40912j4865h143G4834b37788I2502b69725F5686
9951a32714j51526N5906G4552k0668J2181B6954e64137b04256b3854B19897P0514
9940B90411G082a98767q7861B84951b08524d7391a940k78083K5989A34231O7367
9929B01598J8640g8331n9674j56617B2603i972G1789b7309C4607e2814J7388p6729
9917a12155b3094A15542c66069R9914N3814M4352Q3133j7491j78018B11292n6457
$$ plain form
9996 -152796 196545 -195750 120299 -213535 88716 -184164 -306348 -11385 -42822 194842
9985 140546 -78358 -62552 156604 -214644 -33393 -420460 -195077 -145350 -234860 -311728 -192510
9974 -192510 45256 335663 49374 -78009 -417088 49704 -40083 -10189 13247 -346856 -399250
9963 -399250 -303323 -119183 -65893 -206805 -221670 -8143 74834 -237788 92502 -269725 65686
9951 -132714 -284240 -228334 74552 53884 66065 26954 -564137 -204256 -23854 219897 290411
9940 290411 7082 -198767 -286628 284951 -208524 -47391 -1940 -280023 -254034 134231 201598
9929 201598 220238 -78331 -138005 -294622 22603 -9972 71789 -27309 34607 -52814 -35426 -112155
9917 -112155 -23094 115542 -366069 -266155 -212341 -167989 -84856 -102347 -280365 211292 154835
9906A54835h3773l44600a92393A39691a81664M784A22543f1415l2076j48692d5492
9894b6220C61944b1318B87394a28457H4855a4100o5145j26336A26543b07434c3653
9882h2923j37761E1734I723a00357G7489b60044A38208j9039l6045a22324k5791
9871a48115m7572B0334M3957L657k6098a09407p844J8189l19984I4202c1113J378
9859b9735B87061g7870D707a33630n4435B2136b77026d2376l42330A29735a66109
9847E2573a22659j01981j36213F5049f6578A81987g9485B02061B7166a12595b8932
9835a07279B49490b18231h6971H54a79933K3209q7350E0138f2500H4988l1199
9824E3789L78665E7976a75808g4078r6668d0023j34241h84k99346B1584M2038
$$ plain form
9906 154835 -83773 -428373 -192393 139691 -181664 -176880 122543 -61415 -93491 -242183 -45492
9894 -26220 361944 -21318 287394 -128457 84855 -14100 -79245 -205581 126543 -207434 -33653
9882 -82923 -220684 51734 9723 -100357 77489 -260044 138208 119169 83124 -122324 -148115
9871 -148115 -195687 20334 64291 67948 41850 -109407 -117251 -99062 -419046 94202 -31113 -29735
9859 -29735 287061 -77870 4707 -133630 -188065 22136 -277026 -42376 -384706 129735 -166109
9847 52573 -122659 -224640 -360853 65049 -66578 181987 -79485 202061 27166 -112595 -28932
9835 -107279 249490 -218231 -86971 854 -179933 -156724 -244074 50138 -62500 84988 53789
9824 53789 432454 57976 -175808 -74078 -170746 -40023 -174264 -884 -300230 21584 63622
9813F3622L5918d81955d1393A25170J36049c60333d8289m9707D1882i1678j10392
9802b02070A79314c80765B1572J15951i2053J8113j49610O6974d693j32864e2964
9790A44564b39618B11964b56186E0229j8285b11182J1531k29001a80728b2298
9779g3513A70043c91184H1056b80088j37473J30398M2396B97875A01179c019B64814
9767a89757A17007c19776J38470D28594a2551A37767c02146A10246b35457A53919
9756a59061B6106b44374f1127H0704a49471A28728g2048j07754M1978j05231J08983
9745a34072N2577k48922J34882I6686k3009b06701k5222B48207l8066a91218i0204
9733a14395C7992a39258M0398K7292a8282m4399A12608L64239k06569c14857P6399
$$ plain form
9813 63622 99540 -481955 -41393 125170 261219 -360333 -48289 -97996 41882 -91678 -202070
9802 -202070 179314 -380765 21572 137523 -92053 -73940 -223550 -156576 -4693 -137557 -52964
9790 144564 -239618 211964 -256186 50229 31944 -211182 -199651 -428652 -180728 -22298
9779 -73513 170043 -391184 81056 -280088 -417561 -287163 -244767 297875 101179 -3019 264814
9767 -189757 117007 -319776 -181306 428594 -12551 137767 -302146 110246 -235457 153919
9756 -159061 26106 -244374 -61127 80704 -149471 128728 -72048 -179802 -137824 -243055 -134072
9745 -134072 -81495 -330417 -195535 96686 73677 -206701 -231923 248207 210141 -191218 -90204
9733 -114395 37992 -139258 -98860 -71568 -18282 -62681 112608 476847 270278 -314857 -238458
9722b38458r0681e0527l0282k27832G3342a81047A43341a68100A18978b43892
9711H0629J50876j01692c7103r7532O5134j82731K5097a07288l0562K1452J6233
9700a00165I9258M0816a79577n5783M7244L8225C53483j51801I7890J6658a52336
9688B08633c66930e0575j24884C64176g1798j9787j98491g4263A71292b67117
9677C581c39808h7019q8099l1334D888K59944c63565A09637h7055p3272g2823
9665A91142c14827c6879A72299a72697L6061O6185B20148C2431b35703i6358n4272
9654a50630N47A0537a1293j45678P4871A19027a74467F6215J70686c40664A29548
9642h5307D6954D537a52620O8231N55o480j8925j90698C581N2057R3693f058q3117
$$ plain form
9722 -238458 -329139 -50527 -80809 -308641 73342 -181047 143341 -168100 118978 -243892
9711 80629 231505 129813 -37103 -134635 -69501 -252232 -227135 -107288 -137850 -116398 -100165
9700 -100165 99258 140074 -179577 -235360 -188116 -149891 353483 201682 97890 114548 -152336
9688 208633 -366930 -50575 -175459 364176 -71798 -91585 -290076 -74263 171292 -267117
9677 3581 -339808 -87019 -175118 -206452 4888 264832 -363565 109637 -87055 -160327 -72823
9665 191142 -314827 -36879 172299 -172697 -136636 -70451 220148 32431 -235703 -96358 -150630
9654 -150630 -150083 10537 -11293 -156971 -82100 119027 -174467 66215 236901 -340664 129548
9642 -85307 46954 4537 -152620 -84389 -83834 -90314 -109239 -299937 3581 55638 149331 -6058 -89175
9629h9175M0185j8291F8597Q8662a69221H7944c22985M7517A16304D3688L62689
9618D06377r6094f2491j18681A85002f7613j51043M9328I522g3729B37695o0417
9607A77278c59944B16852l9739a12763F8693i278F2474a74934j88345A78437D2725
9595a29009j93551A48287b86449M3973H9267e8026l42453i3274j06920d6402k36054
9584b82456A1264h7678B9833Q6957a64659D3008A7133P9712b7201j75313e6319
9572a14797q8305I1128a37448K7511D2882b48586j16290B09590a75553n5444B58592
9560a77078A8405a63180H408a09869B60859b52575a23019A34234a45230j44170
9550b89400P3282p6567i1277B49316b16974h941k05211F5965c48832a66831C6444
$$ plain form
9629 -89175 -48990 -67281 68597 157259 -169221 87944 -322985 -275468 116304 43688 406377
9618 406377 310283 -62491 -181172 185002 -67613 -218656 -169328 9522 -73729 237695 177278
9607 177278 -359944 216852 177113 -112763 68693 -9278 62474 -174934 -363279 178437 42725
9595 -129009 -322560 148287 -286449 -242476 89267 -58026 -400479 -93274 -200194 -46402 -282456
9584 -282456 11264 -87678 29833 116790 -164659 43008 17133 96845 -27201 -202514 -56319
9572 -114797 -203102 91128 -137448 -109937 42882 -248586 -364876 209590 -175553 -230997 258592
9560 -177078 18405 -163180 8408 -109869 260859 -252575 -123019 134234 -145230 -289400
9550 -289400 -216118 -292685 -91277 249316 -216974 -8941 -214152 65965 -348832 -166831 36444
9538b70730D3543d6377A1422K16930E6305e4830J8364j76730J06398d8852B9736
9526B33203i8724j5238H0191J43234a37797J3229m4469F3913h1018L6331j59071
9515b03758D885a20126L2225o0273N553A04217O8681b40370F1240a98450H9917
9503a88012g415l11896J35219A27801e6031G1780J37614j3278a53332N6703a2893
9491I8123B4580d0139j8024j12844k66457a68069m7860A12394a40078r939m2835
9480a92852M7842C05614a13097A8550O8304k9838f6545j53490H926e00467b16861
9468B53119b09476B2008K82449b08045O6421l21146a30074k17522M6279L1606
9458b69711J30320k4728N3970C25915b63299A67158a13322M6456A00940d1139
$$ plain form
9538 -270730 43543 -46377 11422 228352 56305 -54830 -36466 -213196 -106798 -48852 29736
9526 233203 -98724 -113962 80191 223425 -137797 -124568 -169037 63913 -81018 -44687 -203758
9515 -203758 4885 -120126 -87901 -148174 -142621 104217 172898 -240370 61240 -198450 89917
9503 -188012 -7415 -319311 -184092 127801 -56031 71780 209394 196116 -153332 -96629 -12893
9491 98123 24580 -40139 -58163 -171007 -437464 -168069 -215929 112394 -140078 -150017 -192852
9480 -192852 -145010 305614 -113097 18550 86854 57016 -66545 -220035 8926 -500467 -216861
9468 253119 -209476 22008 304457 -208045 -141624 -462770 -130074 -347596 -301317 -269711
9458 -269711 -139391 -164119 -110149 325915 -263299 167158 -113322 -66866 100940 -41139
9447c48880d4859j7261A5794K2472A0606K7634K1989b86425a02770j43335J22914
9436a23191B3856J11302c5820l2815A62957d12255C9548a98629j10178B04447
9425a37905n8585b5135A20051K17729a00302B31929J92182c47128E0136O5905
9415A16041D6744a89739b1964l51165A47028r404K1717i5787j83981g0858a3101
9403c11262b9481G3185M3273h0816m16054D1682b75051B52015r3279B2673J14445
9392A37118a7843A6120g3509K0351K4082e324m2604j16664g0740j43335d5889
9380i6564J5368K2160o1413a4207E5764a87111c8249H2919C4494c40047f3827
9368G0234J82936J32028a40296C53622g4232A39712l7234J94476H056K36713B240
$$ plain form
9447 -348880 -44859 -62120 15794 38266 10606 38240 60229 -286425 -102770 -246105 -123191
9436 -123191 23856 135158 -35820 -68635 162957 -412255 39548 -198629 -308807 204447
9425 -137905 -196490 -25135 120051 337780 -100302 231929 424111 -347128 50136 116041
9415 116041 46744 -189739 -21964 -373129 147028 137624 159341 -95787 -279768 -70858 -13101
9403 -311262 -29481 73185 116458 -80816 -496870 41682 -275051 252015 158736 22673 137118
9392 137118 -17843 16120 -73509 -53158 -29076 -5324 -47928 -164592 -70740 -214075 -45889
9380 -96564 -81196 -59036 -120449 -14207 55764 -187111 -38249 82919 34494 -340047 -63827
9368 70234 253170 385198 -140296 353622 -74232 139712 102478 296954 8056 244769 2240
9356c09298f6457b3038k0377A33759c5605O978k42987B68448b70843h774l11742
9345c20516A76654a18913K7359J0214k42052A68413l301D2096a1849j02839j19451
9334b34139N9070L7322q5803a04123q3280k1487N2145n4925I2468f7438A80703
9322a06864L0616m7356a3551A03755g5735m2600B28754c2310A81027E8583b37898
9310A06956a78219o5569A00203d182C2061c99732a41785d2910B8363a44920b3247
9298b27449k13635b07640B95177g9945r7014j35639C97941A26732f9774E7650
9287b5474m53490E6794d9k10779A31422b56984a21117J1244o8892h6562F1814
9275D1893l447b49814A5361c1272A47308A7184b75187A0224a78532b510n9345
$$ plain form
9356 -309298 -66457 -23038 -43415 133759 -35605 -28627 -271614 268448 -270843 -8774 -320516
9345 -320516 176654 -118913 -91554 -81340 -323392 168413 165112 42096 -11849 -114688 -234139
9334 -234139 -175069 -137747 -223550 -104123 -187403 -208890 -156745 -211670 92468 -67438 180703
9322 -106864 -76248 -123604 -13551 103755 -75735 -118335 228754 -32310 181027 58583 -237898
9310 106956 -178219 -243788 100203 -4182 32061 -399732 -141785 -42910 28363 -144920 -23247
9298 -227449 -441084 -207640 295177 -79945 -176959 -312598 397941 126732 -69774 57650
9287 -25474 -478964 56794 -49 -210828 131422 -256984 -121117 -109873 -178765 -86562 61814
9275 41893 38446 -249814 15361 -31272 147308 17184 -275187 10224 -178532 -2510 -61855
9264f1855p9099l1676F1063b01229A48929R6235b34414Q3242C56803b08240e8796
9252b15604h4693j85107a22478k1226n1497i4108J8372j46121G1489a50930a5447
9240c43448a34583e7017o068q2146k00544A29847a63687M1728k4784A30168D5316
9228a46824K3664l6824m9897f6640E579b48357J04901A43535a12763J6163P160
9217h9440B87835b19402I3242B029Q8661c83525a82680g7466E6831d4728K2319
9206b2409j16242A6820J59894a04884a6130C88170b33709R3656A9465b42598m8457
9195b91055A5490b82147Q2923b5510D55118a22657o2675j42694f390B8305a43266
9183A57895E1729A5049a15959k20144C8567d5862j6315j1668C1601K76703b40200
$$ plain form
9264 -61855 -140954 -172630 61063 -201229 148929 245164 -234414 -151172 356803 -208240 -58796
9252 -215604 -84693 -269800 -122478 -143704 -195201 -94108 -75736 -221857 71489 -150930 -15447
9240 -343448 -134583 -57017 -63085 -145231 -345775 129847 -163687 -121959 -146743 130168 45316
9228 -146824 -123160 -159984 -209881 -66640 5579 -248357 -143456 143535 -112763 -96600 -89440
9217 -89440 287835 -219402 93242 2029 90690 -383525 -182680 -77466 56831 -44728 -22409
9206 -22409 -138651 16820 176714 -104884 -16130 388170 -233709 -140053 19465 -242598 -291055
9195 -291055 15490 -282147 -199224 -25510 455118 -122657 -185332 -328026 -6390 28305 -143266
9183 157895 51729 15049 -115959 -336103 38567 -45862 -62177 -73845 31601 308304 -240200
9171I4793a58949M1396I9810B5055A06N5224a08187H5162K82608a60065G3654
9159c61179C6741a68008B6116d15184D0254b25385g6671B28046r0266a68396D0427
9147C7157c9553k10478h0924j10664i5484H9386a57464K5823L7371B14846c97216
9135G1222j7713c42053R7863C92994b1428j01162j2705A40346h8391C8358J03872
9124A42230b43379b2569C6497j5262K00665d09831A24701b4302k49729a6463r6616
9113a13079o4479j58376C826R2840J15744a78781j8655F2554b27352f2409B02991
9101E8309L1860a20042A74568g30H2690K2202c41724a13387N752q4550Q1754A0644
9088b96947a21440P909q2096A16687D3786K81413B1745K8552a08716A30639a39004
$$ plain form
9171 94793 -158949 -117553 99810 25055 106 55330 -108187 85162 367770 -160065 73654
9159 -361179 36741 -168008 26116 -415184 40254 -225385 -76671 228046 137780 -168396 40427
9147 37157 -39553 -250031 -80924 -191588 -95484 89386 -157464 -131641 -94270 214846 -397216
9135 71222 53509 -342053 -244190 392994 -21428 -122590 -135295 140346 -88391 38358 142230
9124 142230 -243379 -22569 36497 21235 221900 -409831 124701 -24302 -274031 -16463 -113079
9113 -113079 -177558 -335934 3826 96666 212410 -178781 -197436 62554 -227352 -62409 202991
9101 58309 90169 -120042 174568 -730 82690 104892 -341724 -113387 -107635 -192185 -110431 10644
9088 -296947 -121440 -113531 -195627 116687 43786 325199 21745 50297 -108716 130639 -139004
9076e8815Q900B0486c62218O2551N7617M8246I8265K75213a44506J1703M2707
9065i0096A15049a40390K068F8437a38291e1220A39504a80512k03928i4641J4505
9054h0136c324j45036j13817f9437j69092F7463G614L1115J45962a53266I8864
9042a84783N5368I6448J45489q9977a40988a1345j08079j11945h0469a1100A12835
9030a47224B11880b8529r3966e8447B61233h8520p0003p6014F5652L1284b9274
9018C0046b21439j22734E4156a82921H7399b02019m25459a40790f5222A73519
9007b17062A63961a40559B82476a86733A45661A9554o439M4678i5047J8120c3373
8995a02245j96368E461c70968a66748f5200G2073a62728I0505b46889n555m3689
$$ plain form
9076 -58815 -49915 20486 -362218 -299667 -242050 -193804 98265 373478 -144506 -132803 -90096
9065 -90096 115049 -140390 -138322 68437 -138291 -51220 139504 -180512 -384440 -94641 -80136
9054 -80136 -3324 -148360 -262177 -69437 -238529 67463 7614 38729 184691 -153266 98864
9042 -184783 -129415 96448 241937 151960 -140988 -11345 -119424 -231369 -80469 -11100 112835
9030 -147224 211880 -28529 -122495 -58447 261233 -88520 -158523 -234537 65652 96936 -29274
9018 30046 -221439 -344173 54156 -182921 87399 -202019 -627478 -140790 -65222 173519
9007 -217062 163961 -140559 282476 -186733 145661 19554 13115 57793 -95047 -76927 -33373
8995 -102245 -298613 5461 -370968 -166748 -65200 72073 -162728 90505 -246889 -252444 -296133
8984b96133C6652J29481a772A51584J8240a79218a023A04852h4489H8906i4533
8972a3244r7361J2536H5278L57208b65029e2392j45442c6946B38592b99013J02204
8961a96809m6095G7265h8945C729b1405j6429p5920L931A56131D1303c03743e3755
8948g0185F0735a74216L7937B89499o4822D0038c3413l32548J31610C1156b43436
8936a85441f5901A9165J51071o0622b06278Q4872F9465c46412G064J72595c23240
8924a23225B27302d06070l4201a86277B64597p9166H6689J25698E4353J10652
8914A65005K8321a07800D8137a30940C55195J38827k30516M90453P70141J353675
8904B877775K053570M521611D623518A862831q64404k74262k90041k7787q2053
$$ plain form
8984 -296133 36652 166133 -1772 151584 169824 -179218 -1023 104852 -84489 88906 -94533
8972 -13244 -110605 -98069 85278 442486 -265029 -52392 -197834 -36946 238592 -299013 -196809
8961 -196809 -242904 77265 -88945 3729 -21405 -37834 -113754 -109823 156131 41303 -303743 -53755
8948 -70185 60735 -174216 -136279 289499 224677 40038 -33413 -365961 -234351 31156 -243436
8936 -185441 -65901 19165 170236 109614 -206278 -121406 69465 -346412 7064 179659 -323240
8924 -123225 227302 -406070 -440271 -186277 264597 185431 86689 212387 54353 165005
8914 165005 193326 -107800 48137 -130940 355195 494022 263506 753959 1524100 2877775
8904 2877775 4931345 9452956 4623518 1862831 998427 724165 434124 406337 324284
8895C24284A48080d8525B64829e9141A64148J9740K18808G6121O3293K10855I8609
8883D0975i9642k03368E3806K31598A16877b53878A57195a23608a5546H4499g6768
8871c53318J15239A92174b36505h6631C5520c25244J59418A42966B8306a00502
8860b66885B5932M4625J67241a17371D3230B127b0252j5193d585j02808A0511
8848c4744j2261D4220b3048n7885j10449A4658Q8260R5031b93183M3722j49913
8837c99374d6768F9216a67467A83793b09067j02284b9553j94727A57609a15057
$$ plain form
8895 324284 148080 -48525 264829 -59141 164148 183888 402696 76121 139414 350269 98609
8883 40975 -99642 -303010 53806 285404 116877 -253878 157195 -123608 -15546 84499 -76768
8871 -353318 -238079 192174 -236505 -86631 35520 -325244 -165826 142966 28306 -100502
8860 -266885 25932 70557 237798 -117371 43230 2127 -20252 -35445 -4585 -107393 10511
8848 -34744 -47005 44220 -23048 -80933 -191382 14658 102918 197949 -293183 -249461 -399374
8837 -399374 -46768 69216 -167467 183793 -209067 -311351 -29553 -224280 157609 -115057
$$ [...]
##END NTUPLES=NMR SPECTRUM
##END=
