
##TITLE=AC1176_Popayan-tambo-cauca-CTAAH12018_5891292_11tmnTrQaV
##JCAMPDX= 6.0         $$ Bruker NMR JCAMP-DX V2.0
##DATA TYPE= NMR SPECTRUM
##DATA CLASS= NTUPLES
##ORIGIN= BRUKER
##OWNER= Administrator
$$ 1.72 TOPSPIN		Version 2.1
$$ 2012-04-02 23:41:18.000 -0500  Administrator@TOPSPIN
$$ Compression mode = diff/dup
##.OBSERVE FREQUENCY= 400.13188235
##.OBSERVE NUCLEUS= ^1H
##.ACQUISITION MODE= SIMULTANEOUS (DQD)
##.ACQUISITION SCHEME= undefined
##.AVERAGES= 64
##.DIGITISER RES= 22
##SPECTROMETER/DATA SYSTEM= spect
##.PULSE SEQUENCE= noesygpps1d.comp
##.SOLVENT NAME= COFFEE_meoh
##.SHIFT REFERENCE= INTERNAL, COFFEE_meoh, 1, 14.96835
##AUDIT TRAIL= $$ (NUMBER, WHEN, WHO, WHERE, PROCESS, VERSION, WHAT)
$$ ##TITLE= Audit trail, TOPSPIN		Version 2.1
$$ ##JCAMPDX= 5.01
$$ ##ORIGIN= Bruker BioSpin GmbH
$$ ##OWNER= Administrator
$$ $$ C:\Bruker\TOPSPIN/data/COFFEE/nmr/AC1176_Popayan-tambo-cauca-CTAAH12018_5891292_11tmnTrQaV/12/pdata/1/auditp.txt
$$ ##AUDIT TRAIL=  $$ (NUMBER, WHEN, WHO, WHERE, PROCESS, VERSION, WHAT)
(   1,<2012-04-02 23:41:12.531 -0500>,<Administrator>,<TOPSPIN>,<go>,<TOPSPIN 2.1>,
      <created by zg
	started at 2012-04-02 23:29:40.359 -0500,
	POWCHK enabled, PULCHK disabled,
       configuration hash MD5:
       1A 1E CE 29 27 FD 77 03 67 4E F0 E3 C4 B2 CB 90
       data hash MD5: 64K
       35 CD 31 69 52 6D CD 39 67 10 F0 1B 21 7B FA 7A>)
(   2,<2012-04-02 23:41:15.546 -0500>,<Administrator>,<TOPSPIN>,<proc1d>,<TOPSPIN 2.1>,
      <Start of raw data processing
       efp LB = 0.3 FT_mod = 6 PKNL = 1 PHC0 = 0 PHC1 = 0 SI = 128K 
       data hash MD5: 128K
       2B 5C C1 AF 75 02 A6 80 5B 8A 2B 69 69 82 B9 71>)
(   3,<2012-04-02 23:41:17.046 -0500>,<Administrator>,<TOPSPIN>,<proc1d>,<TOPSPIN 2.1>,
      <pk PHC0 = 35.32104 PHC1 = 0 
       data hash MD5: 128K
       98 71 8B D0 49 0A 88 E0 37 B3 11 BF A0 69 17 8E>)
(   4,<2012-04-02 23:41:17.375 -0500>,<Administrator>,<TOPSPIN>,<proc1d>,<TOPSPIN 2.1>,
      <abs ABSG = 1 
       data hash MD5: 128K
       BE 62 FA A7 55 77 60 E7 A2 21 2C CD 7D 02 1F C3>)
(   5,<2012-04-02 23:41:17.468 -0500>,<Administrator>,<TOPSPIN>,<proc1d>,<TOPSPIN 2.1>,
      <abs ABSG = 2 
       data hash MD5: 128K
       85 D5 C9 D1 11 87 CC 83 4B D8 B2 3F A7 A7 2B A2>)
(   6,<2012-04-02 23:41:17.546 -0500>,<Administrator>,<TOPSPIN>,<proc1d>,<TOPSPIN 2.1>,
      <abs ABSG = 3 
       data hash MD5: 128K
       C7 97 1F B4 6A F6 F5 A1 3F 6F 4F 03 E5 20 F2 53>)
(   7,<2012-04-02 23:41:17.718 -0500>,<Administrator>,<TOPSPIN>,<proc1d>,<TOPSPIN 2.1>,
      <abs ABSG = 4 
       data hash MD5: 128K
       73 DE 78 D8 73 E1 C5 9A FB C2 32 D7 BA 41 33 B3>)
(   8,<2012-04-02 23:41:17.890 -0500>,<Administrator>,<TOPSPIN>,<proc1d>,<TOPSPIN 2.1>,
      <abs ABSG = 5 
       data hash MD5: 128K
       5F C6 FB 79 40 ED 59 8E 4F 02 08 E4 36 76 44 42>)
$$ ##END=
$$ 
$$ $$ hash MD5
$$ $$ B6 48 B3 C1 37 A5 40 9E 1F CE 73 A8 2A A6 EB 89
##$RELAX= 
##$RELAX= 
##$RELAX= 
##$RELAX= 
##$RELAX= 
##$RELAX= 
##$RELAX= 
$$ [...]
##$TP07= 0
##$TPNAME0= <>
##$TPNAME1= <>
##$TPNAME2= <>
##$TPNAME3= <>
##$TPNAME4= <>
##$TPNAME5= <>
##$TPNAME6= <>
##$TPNAME7= <>
##$TPOAL= (0..7)
0.5 0.5 0.5 0.5 0.5 0.5 0.5 0.5
##$TPOFFS= (0..7)
0 0 0 0 0 0 0 0
##$TUNHIN= 0
##$TUNHOUT= 0
##$TUNXOUT= 0
##$USERA1= <user>
##$USERA2= <user>
##$USERA3= <user>
##$USERA4= <user>
##$USERA5= <user>
##$V9= 5
##$VALIST= <valist>
##$VCLIST= <CCCCCCCCCCCCCCC>
##$VD= 0
##$VDLIST= <DDDDDDDDDDDDDDD>
##$VPLIST= <PPPPPPPPPPPPPPP>
##$VTLIST= <TTTTTTTTTTTTTTT>
##$WBST= 2048
##$WBSW= 25
##$XGAIN= (0..3)
0 0 0 0
##$XL= 0
##$YL= 0
##$YMAX_a= 13813615
##$YMIN_a= -6030205
##$ZGOPTNS= <>
##$ZL1= 120
##$ZL2= 120
##$ZL3= 120
##$ZL4= 120
##$ABSF1= 14.96835
##$ABSF2= -5.58418
##$ABSG= 5
##$ABSL= 3
##$ALPHA= 0
##$AQORDER= 0
##$ASSFAC= 0
##$ASSFACI= 0
##$ASSFACX= 0
##$ASSWID= 0
##$AUNMP= <proc_prof1d_extract.lims>
##$AXLEFT= 0
##$AXNAME= <>
##$AXNUC= <1H>
##$AXRIGHT= 0
##$AXTYPE= 0
##$AXUNIT= <>
##$AZFE= 0.1
##$AZFW= 0.1
##$BCFW= 0
##$BC_mod= 0
##$BYTORDP= 0
##$COROFFS= 0
##$CY= 15
##$DATMOD= 1
##$DC= 0
##$DFILT= <>
##$DTYPP= 0
##$F1P= 0
##$F2P= 0
##$FCOR= 0.5
##$FTSIZE= 131072
##$FT_mod= 6
##$GAMMA= 0
##$GB= 0
##$INTBC= 1
##$INTSCL= 1
##$ISEN= 128
##$LB= 0.3
##$LEV0= 0
##$LPBIN= 0
##$MAXI= 10000
##$MC2= 0
##$MEAN= 0
##$ME_mod= 0
##$MI= 0
##$NCOEF= 0
##$NC_proc= -3
##$NLEV= 6
##$NOISF1= 0
##$NOISF2= 0
##$NSP= 0
##$NTH_PI= 0
##$NZP= 0
##$OFFSET= 14.96835
##$PC= 1
##$PHC0= 35.32104
##$PHC1= 0
##$PH_mod= 1
##$PKNL= yes
##$PPARMOD= 0
##$PPDIAG= 0
##$PPIPTYP= 0
##$PPMPNUM= 2147483647
##$PPRESOL= 1
##$PSCAL= 4
##$PSIGN= 0
##$PYNMP= <proc.py>
##$REVERSE= no
##$SF= 400.13000490623
##$SI= 131072
##$SIGF1= 0
##$SIGF2= 0
##$SINO= 400
##$SIOLD= 131072
##$SPECTYP= <>
##$SREGLST= <1H.CDCl3>
##$SSB= 0
##$STSI= 131072
##$STSR= 0
##$SW_p= 8223.68421052632
##$SYMM= 0
##$S_DEV= 0
##$TDeff= 65536
##$TDoff= 0
##$TI= <>
##$TILT= no
##$TM1= 0
##$TM2= 0
##$TOPLEV= 0
##$USERP1= <user>
##$USERP2= <user>
##$USERP3= <user>
##$USERP4= <user>
##$USERP5= <user>
##$WDW= 1
##$XDIM= 131072
##$YMAX_p= 500033836
##$YMIN_p= -442087489
##$CURPLOT= <Network HP LaserJet P1505>
##$CURPRIN= <$Network HP LaserJet P1505>
##$DFORMAT= <normdp>
##$LAYOUT= <+/1D_H.xwp>
##$LFORMAT= <normlp>
##$PFORMAT= <normpl>
##$SURQMSG= 1
$$ End of Bruker specific parameters
$$ ---------------------------------
##NTUPLES= NMR SPECTRUM
##VAR_NAME=  FREQUENCY,     SPECTRUM/REAL,   SPECTRUM/IMAG
##SYMBOL=    X,             R,               I
##VAR_TYPE=  INDEPENDENT,   DEPENDENT,       DEPENDENT
##VAR_FORM=  AFFN,          ASDF,            ASDF
##VAR_DIM=   131072,        131072,          131072
##UNITS=     HZ,            ARBITRARY UNITS, ARBITRARY UNITS
##FACTOR=    0.0627417313425165, 1,          1
##FIRST=     8223.62146879498, 1623,         -96809
##LAST=      0,             4046,            -96577
##MIN=       0,             -442087489,      0
##MAX=       8223.62146879498, 500033836,    0
$$ Real data points
##PAGE= N=1
##DATA TABLE= (X++(R..R)), XYDATA
$$ [...]
$$ plain form
62891 1415647 1385659 1358566 1332625 1307099 1283173 1262158 1243921 1227523 1212337 1197871 1183238
62880 1183238 1167635 1151050 1134060 1117295 1101360 1086681 1072941 1059162 1044885 1030869 1018049
62869 1018049 1006257 994761 983786 974560 967688 962194 956543 950258 944232 939639 936688 934327 931153
62856 931153 926689 921718 917301 913744 910779 908450 907194 907072 907380 907209 906108 904222 902156 900688 900189
62841 900189 900151 899691 898737 898403 899923 903343 907328 910028 910100 907363 902832 897995 893768 890130 886700 883437
62825 883437 880698 878898 878143 877918 877093 874735 871143 867729 865562 864331 862936 860704 857712 854428 851587
62810 851587 850031 849959 850449 850359 849592 848780 847710 844930 839418 832039 824779 818832 814045 810026 806941 804853
62794 804853 802836 799527 794630 789314 784902 781621 778990 776870 775252 773334 770046 765947 763527 764702
$$ packed form
62891A415647k9988k7093k5941k5526k3926k1015j8237j6398j5186j4466j4633
62880A183238j5603j6585j6990j6765j5935j4679j3740j3779j4277j4016j2820
62869A018049j1792j1496j0975r226o872n494n651o285o026m593k951k361l174
62856I31153m464m971m417l557k965k329j256j22L08j71j101j886k066j468m99
62841I00189l8m60r54l34J520L420L985K700P2k737m531m837m227l638l430l263
62825H83437k739j800p55k25q25k358l592l414k167j231j395k232k992l284k841
62810H51587j556p2M90r0p67q12j070k780n512p379p260n947m787m019l085k088
62794H04853k017l309m897n316m412l281k631k120j618j918l288m099k420J175
$$ plain form
62780 764702 768518 772187 774052 774581 774728 774533 773725 772847 773090 775290 779406 784772 790588 796225 801096 804285
62764 804285 804797 802692 799771 798502 800253 804922 811953 820809 830460 839467 846977 853092 858152 862592
62750 862592 867753 875643 886939 899890 912136 923221 934611 947783 963265 981208 1001677 1024208
62738 1024208 1047940 1072562 1098614 1126741 1157168 1189975 1225294 1263031 1302957 1345450 1391762
62727 1391762 1443216 1500246 1562292 1628353 1697613 1770055 1846858 1929928 2020618 2118844 2223572
62716 2223572 2334032 2450136 2571703 2697514 2825388 2953161 3079300 3202289 3319500
62707 3319500 3427052 3520895 3597845 3655610 3692529 3707934 3702537 3677709 3634219 3572089 3491862
62696 3491862 3395720 3287141 3169563 3045440 2916367 2783955 2650518 2518748 2390685 2267313
$$ packed form
62780G64702L816L669J865N29J47j95q08q78K43K200M116N366N816N637M871L189
62764H04285N12k105k921j269J751M669P031Q856R651R007P510O115N060M440
62750H62592N161P890J1296J2951J2246J1085J1390J3172J5482J7943K0469K2531
62738A024208K3732K4622K6052K8127L0427L2807L5319L7737L9926M2493M6312
62727A391762N1454N7030O2046O6061O9260P2442P6803Q3070R0690R8226J04728
62716B223572J10460J16104J21567J25811J27874J27773J26139J22989J17211
62707C319500J07552R3843P6950N7765L6919J5405n397k4828m3490o2130q0227
62696C491862r6142j08579j17578j24123j29073j32412j33437j31770j28063j23372
$$ plain form
62686 2267313 2149451 2038694 1936795 1844054 1758837 1678948 1603290 1532338 1467512 1410177 1360514
62675 1360514 1316846 1276474 1237723 1201067 1167903 1138532 1111827 1086682 1063102 1041815 1023459
62664 1023459 1008522 997552 990802 987670 986915 987625 989832 994196 1001228 1010931 1023046 1037381 1053869
62651 1053869 1072444 1093066 1115890 1141258 1169359 1200045 1233203 1269310 1309318 1353929 1403349
62640 1403349 1457973 1518739 1586123 1658962 1735176 1813899 1896199 1983302 2074695 2168400 2262351
62629 2262351 2354680 2443248 2526072 2602179 2670874 2729921 2775442 2804197 2815410 2810073 2789283
62618 2789283 2753812 2704599 2642758 2569336 2485717 2394139 2297350 2197889 2097994 1999770 1904773
62607 1904773 1813517 1725851 1641772 1561567 1485575 1414397 1349064 1290202 1236954 1187365 1140021
$$ packed form
62686B267313j17862j10757j01899r2741q5217p9889p5658p0952o4826n7335m9663
62675A360514m3668m0372l8751l6656l3164k9371k6705k5145k3580k1287j8356
62664A023459j4937j0970o750l132p55P10K207M364P032R703J2115J4335J6488
62651A053869J8575K0622K2824K5368K8101L0686L3158L6107M0008M4611M9420
62640A403349N4624O0766O7384P2839P6214P8723Q2300Q7103R1393R3705R3951
62629B262351R2329Q8568Q2824P6107O8695N9047M5521K8755J1213n337k0790
62618B789283l5471m9213o1841p3422q3619r1578r6789r9461r9895r8224r4997
62607A904773r1256q7666q4079q0205p5992p1178o5333n8862n3248m9589m7344
$$ plain form
62596 1140021 1095016 1053341 1015731 982071 951455 922856 896156 872452 852786 836460 821005
62585 821005 803961 784549 763916 744387 728292 716494 707626 699252 690085 680690 672029 664121 656574
62572 656574 649614 643750 638764 633834 628646 623816 620194 618138 617426 617421 617316 616726 616220 616935 619469 623474
62556 623474 628496 634792 642894 652569 662820 672990 683447 694957 707843 722094 737905 755526
62544 755526 774727 795060 816703 840562 867462 897748 931689 969531 1010996 1055588 1103855
62533 1103855 1157419 1216863 1280291 1345007 1410210 1476841 1544980 1612688 1677580 1738308 1793912
62522 1793912 1842676 1882437 1911687 1929850 1936873 1932931 1918266 1893090 1857996 1814579 1765067 1711054
62510 1711054 1653127 1592025 1529502 1467502 1407086 1348805 1293562 1242224 1194639 1150021 1108425
$$ packed form
62596A140021m5005m1675l7610l3660l0616k8599k6700k3704j9666j6326j5455
62585H21005j7044j9412k0633j9529j6095j1798q868q374r167r395q661p908p547
62572F56574o960n864m986m930n188m830l622k056p12nj05n90n06P15K534M005
62556F23474N022O296Q102R675J0251J0170J0457J1510J2886J4251J5811J7621
62544G55526J9201K0333K1643K3859K6900L0286L3941L7842M1465M4592M8267
62533A103855N3564N9444O3428O4716O5203O6631O8139O7708O4892O0728N5604
62522A793912M8764L9761K9250J8163P023l942j4665k5176l5094m3417m9512n4013
62510A711054n7927o1102o2523o2000o0416n8281n5243n1338m7585m4618m1596
$$ plain form
62499 1108425 1071114 1039133 1011955 987728 964509 941089 917194 893396 870773 850160 831494
62488 831494 813991 797064 781017 766666 754325 743365 732769 721908 710784 699926 690359 683257
62476 683257 679025 676807 675407 674732 675936 680158 687504 697202 708172 719351 730073 740456 751198
62463 751198 763001 776589 793068 813366 837062 862589 889113 917518 948957 983082 1018545
62452 1018545 1054983 1093681 1136240 1183146 1233623 1286346 1340084 1393813 1446272 1495406 1538607
62441 1538607 1573866 1600575 1618959 1628982 1630229 1622700 1607275 1585271 1557675 1524788 1486516 1443174
62429 1443174 1396161 1347703 1299767 1253331 1208733 1166366 1126822 1090670 1058356 1030072 1005467
62418 1005467 983692 964059 946557 931577 919181 908676 898785 888493 878083 869087 862591 857814
$$ packed form
62499A108425l7311l1981k7178k4227k3219k3420k3895k3798k2623k0613j8666
62488H31494j7503j6927j6047j4351j2341j0960j0596j0861j1124j0858r567p102
62476F83257m232k218j400o75J204M222P346R698J0970J1179J0722J0383J0742
62463G51198J1803J3588J6479K0298K3696K5527K6524K8405L1439L4125L5463
62452A018545L6438L8698M2559M6906N0477N2723N3738N3729N2459M9134M3201
62441A538607L5259K6709J8384J0023J247p529j5425k2004k7596l2887l8272m3342
62429A443174m7013m8458m7936m6436m4598m2367l9544l6152l2314k8284k4605
62418A005467k1775j9633j7502j4980j2396j0505r891j0292j0410q996o496m777
$$ plain form
62406 857814 853274 849250 847818 850038 854393 858730 862644 867017 872273 878350 885535 893897 902360 909838
62392 909838 917038 925701 936158 946969 956989 966412 975665 984705 993761 1003288 1012447 1018770 1020141
62379 1020141 1016319 1007962 995220 978232 958256 937207 916301 895794 875627 855736 836161 817539
62367 817539 801049 787177 774881 762787 750995 740927 733470 728095 723896 720737 719067 719210 721225
62354 721225 725018 730144 735797 741616 748412 757395 768375 779328 788437 796306 805377 817243 831379
62341 831379 846567 862277 877935 892107 903820 914018 924185 933868 941229 946054 950454 956087
62329 956087 962229 967255 970488 971589 969656 964599 958659 955009 955085 958248 963448 969973 977146 984946 994862
62314 994862 1008637 1026036 1045340 1066463 1092182 1125448 1166462 1213242 1264233 1319299 1378750
$$ packed form
62406H57814m540m024j432K220M355M337L914M373N256O077P185Q362Q463P478
62392I09838P200Q663J0457J0811J0020R423R253R040R056R527R159O323J371
62379A020141l822q357j2742j6988j9976k1049k0906k0507k0167j9891j9575j8622
62367H17539j6490j3872j2296j2094j1792j0068p457n375m199l159j670J43K015
62354G21225L793N126N653N819O796Q983J0980J0953R109P869R071J1866J4136
62341H31379J5188J5710J5658J4172J1713J0198J0167R683P361M825M400N633
62329I56087O142N026L233J101j933n057n940l650P6L163N200O525P173P800R916
62314I94862J3775J7399J9304K1123K5719L3266M1014M6780N0991N5066N9451
$$ plain form
62303 1378750 1442604 1510893 1583784 1660956 1741240 1823060 1904963 1985518 2062900 2134786 2198626
62292 2198626 2251932 2292604 2319571 2333500 2336567 2330848 2316753 2293393 2260585 2219809 2172777 2119711
62280 2119711 2059976 1994204 1924981 1855294 1787022 1721176 1658817 1601028 1548145 1499535 1454249
62269 1454249 1411759 1372027 1334904 1299651 1265368 1232119 1201323 1174541 1151902 1132038 1113496
62258 1113496 1095811 1079334 1064687 1052596 1043693 1038064 1035102 1033938 1033846 1034316 1035267 1037219 1040591 1044559
62244 1044559 1047176 1047122 1044880 1041783 1038370 1034275 1029337 1023955 1018403 1012627 1006998 1002703 1000916 1001726 1004077
62229 1004077 1006785 1009648 1013705 1020231 1029197 1038862 1047309 1054382 1061737 1071065 1082777 1096427 1111657
62216 1111657 1128267 1145875 1164209 1183645 1205023 1228979 1255698 1285181 1317439 1352598 1391158
$$ packed form
62303A378750O3854O8289P2891P7172Q0284Q1820Q1903Q0555P7382P1886O3840
62292B198626N3306M0672K6967J3929L067n719j4095k3360l2808m0776m7032n3066
62280B119711n9735o5772o9223o9687o8272o5846o2359n7789n2883m8610m5286
62269A454249m2490l9732l7123l5253l4283l3249l0796k6782k2639j9864j8542
62258A113496j7685j6477j4647j2091q903n629k962j164r2M70R51J952L372L968
62244A044559K617n4k242l097l413m095m938n382n552n776n629m295j787Q10K351
62229A004077K708K863M057O526Q966R665Q447P073P355R328J1712J3650J5230
62216A111657J6610J7608J8334J9436K1378K3956K6719K9483L2258L5159L8560
$$ plain form
62205 1391158 1433901 1481082 1531905 1585442 1642029 1703052 1769126 1839078 1910914 1983084 2054338
62194 2054338 2122915 2186462 2242461 2288313 2321648 2341492 2349034 2346461 2334970 2314436 2284791 2246778
62182 2246778 2201209 2148450 2089240 2025502 1959853 1894548 1831062 1770215 1712425 1658296 1609174
62171 1609174 1566485 1530142 1498234 1468852 1441782 1417943 1397823 1381242 1368155 1358779 1353014 1350416
62159 1350416 1350464 1352241 1354295 1355729 1357200 1359881 1363640 1367283 1370411 1373759 1377568 1381022 1383733 1386547
62145 1386547 1390243 1394573 1399382 1405517 1413520 1422229 1430012 1437042 1445330 1456744 1471792 1489979 1510389
62132 1510389 1532062 1554666 1578595 1603758 1628823 1652728 1676586 1702698 1731653 1761624 1790711
62121 1790711 1818833 1847047 1876265 1907118 1939971 1974374 2009435 2045418 2084220 2127589 2175629
$$ packed form
62205A391158M2743M7181N0823N3537N6587O1023O6074O9952P1836P2170P1254
62194B054338O8577O3547N5999M5852L3335J9844P542k573j1491k0534k9645l8013
62182B246778m5569n2759n9210o3738o5649o5305o3486o0847n7790n4129m9122
62171A609174m2689l6343l1908k9382k7070k3839k0120j6581j3087r376n765k598
62159A350416M8J777K054J434J471K681L759L643L128L348L809L454K711K814
62145A386547L696M330M809O135Q003Q709P783P030Q288J1414J5048J8187K0410
62132A510389K1673K2604K3929K5163K5065K3905K3858K6112K8955K9971K9087
62121A790711K8122K8214K9218L0853L2853L4403L5061L5983L8802M3369M8040
$$ plain form
62110 2175629 2227556 2282998 2341754 2403064 2466027 2529884 2592866 2651544 2702630 2745076 2779415
62099 2779415 2805871 2824683 2837587 2846702 2851675 2849970 2840763 2826825 2811507 2795371 2777103 2756484
62087 2756484 2734842 2713423 2693135 2675555 2662465 2654147 2649353 2647059 2647128 2649204 2652387 2656469 2662254
62074 2662254 2669944 2678322 2686433 2695254 2706593 2720748 2736273 2751940 2768186 2786740 2809347 2836537
62062 2836537 2866828 2897351 2926178 2954253 2984450 3018582 3055843 3094109 3132030 3169725 3208192
62051 3208192 3248423 3290550 3333577 3376490 3419953 3466293 3517267 3572259 3629143 3686539 3744794
62040 3744794 3805134 3868441 3934553 4002125 4069247 4134547 4197488 4257523 4313791 4366511 4418056
62029 4418056 4471455 4527906 4586608 4646637 4707499 4767762 4824988 4878146 4929114 4980750 5034141
$$ packed form
62110B175629N1927N5442N8756O1310O2963O3857O2982N8678N1086M2446L4339
62099B779415K6456J8812J2904R115M973j705r207j3938j5318j6136j8268k0619
62087B756484k1642k1419k0288j7580j3090q318m794k294O9K076L183M082N785
62074B662254P690Q378Q111Q821J1339J4155J5525J5667J6246J8554K2607K7190
62062B836537L0291L0523K8827K8075L0197L4132L7261L8266L7921L7695L8467
62051C208192M0231M2127M3027M2913M3463M6340N0974N4992N6884N7396N8255
62040C744794O0340O3307O6112O7572O7122O5300O2941O0035N6268N2720N1545
62029D418056N3399N6451N8702O0029O0862O0263N7226N3158N0968N1636N3391
$$ plain form
62018 5034141 5088676 5144098 5201119 5260249 5321354 5384548 5450508 5519499 5590829 5663714 5738094
62007 5738094 5814059 5890788 5966544 6039601 6108793 6173130 6231220 6281508 6323277 6357253 6384760
61996 6384760 6406162 6420520 6426941 6425669 6417381 6402097 6379797 6351841 6320619 6287483 6252050 6214063
61984 6214063 6174994 6136947 6100537 6064904 6029639 5995623 5963848 5934387 5907092 5882480 5861028
61973 5861028 5841920 5823501 5805121 5787702 5772078 5757566 5742817 5727557 5712526 5698014 5683573
61962 5683573 5669285 5656162 5644724 5633990 5622443 5609312 5594376 5577438 5559041 5540934 5524489
61951 5524489 5508810 5491608 5471967 5451118 5430405 5409726 5388345 5366128 5343319 5319907 5295862
61940 5295862 5271369 5246235 5219661 5191227 5161550 5131279 5099835 5065900 5028853 4989092 4947083
$$ packed form
62018E034141N4535N5422N7021N9130O1105O3194O5960O8991P1330P2885P4380
62007E738094P5965P6729P5756P3057O9192O4337N8090N0288M1769L3976K7507
61996F384760K1402J4358O421j272q288j5284k2300k7956l1222l3136l5433l7987
61984F214063l9069l8047l6410l5633l5265l4016l1775k9461k7295k4612k1452
61973E861028j9108j8419j8380j7419j5624j4512j4749j5260j5031j4512j4441
61962E683573j4288j3123j1438j0734j1547j3131j4936j6938j8397j8107j6445
61951E524489j5679j7202j9641k0849k0713k0679k1381k2217k2809k3412k4045
61940E295862k4493k5134k6574k8434k9677l0271l1444l3935l7047l9761m2009
$$ plain form
61929 4947083 4902801 4856072 4806968 4755851 4703510 4651322 4600872 4553085 4507754 4464002 4421253
61918 4421253 4379827 4340435 4303038 4266607 4230459 4195383 4162554 4131432 4099979 4067399 4035555
61907 4035555 4006892 3981632 3957869 3933802 3909018 3884095 3860009 3837699 3817233 3797365 3776731
61896 3776731 3755515 3735288 3717291 3701625 3688062 3676740 3667689 3660316 3653821 3647964 3643305 3640880
61884 3640880 3641596 3645564 3652094 3660642 3671775 3686800 3706447 3730225 3757142 3786848 3820201 3858821
61872 3858821 3903938 3955617 4013420 4077766 4149815 4229732 4316212 4408601 4508645 4619035 4740930
61861 4740930 4874289 5020071 5180369 5356477 5548671 5758420 5989308 6245067 6527951
61852 6527951 6839838 7183774 7563421 7981778 8441314 8944708 9494574 10092882 10741257
$$ packed form
61929D947083m4282m6729m9104n1117n2341n2188n0450m7787m5331m3752m2749
61918D421253m1426l9392l7397l6431l6148l5076l2829l1122l1453l2580l1844
61907D035555k8663k5260k3763k4067k4784k4923k4086k2310k0466j9868k0634
61896C776731k1216k0227j7997j5666j3563j1322r051p373o495n857m659k425
61884C640880P16L968O530Q548J1133J5025J9647K3778K6917K9706L3353L8620
61872C858821M5117N1679N7803O4346P2049P9917Q6480R2389J00044J10390J21895
61861D740930J33359J45782J60298J76108J92194K09749K30888K55759K82884
61852F527951L11887L43936L79647M18357M59536N03394N49866N98308O48375
$$ plain form
61843 10741257 11441102 12192286 12991551 13832178 14703954 15591845 16474083 17321622 18099248
61834 18099248 18767716 19287302 19623256 19751618 19663067 19363963 18874837 18226522 17454928
61825 17454928 16596730 15687023 14757529 13834202 12935981 12076248 11265056 10509204 9810966
61816 9810966 9168553 8578730 8038714 7545909 7097120 6688820 6317743 5980776 5674577
61807 5674577 5395729 5141199 4908514 4695728 4501400 4324507 4164065 4018632 3886116
61798 3886116 3764280 3651859 3549126 3456854 3374535 3300155 3231984 3169906 3114500 3065393 3021356
61787 3021356 2981600 2946096 2914735 2887026 2862665 2841688 2823948 2809018 2796687 2786997 2779758 2774629
61775 2774629 2771797 2771975 2775592 2782419 2792035 2804027 2817681 2832200 2847489 2864163 2882583 2902527
$$ packed form
61843A0741257O99845P51184P99265Q40627Q71776Q87891Q82238Q47539P77626
61834A8099248O68468N19586L35954J28362q8551k99104m89126o48315p71594
61825A7454928q58198r09707r29494r23327q98221q59733q11192p55852o98238
61816I810966o42413n89823n40016m92805m48789m08300l71077l36967l06199
61807E674577k78848k54530k32685k12786j94328j76893j60442j45433j32516
61798C886116j21836j12421j02733r2272q2319p4380o8171o2078n5406m9107m4037
61787C021356l9756l5504l1361k7709k4361k0977j7740j4930j2331r690p239n129
61775B774629k832J78L617O827R616J1992J3654J4519J5289J6674J8420J9944
$$ plain form
61763 2902527 2924082 2948048 2974977 3004478 3036206 3070932 3109733 3152517 3198445 3247918 3303114
61752 3303114 3365979 3436119 3511258 3589563 3671292 3758373 3852872 3955914 4067710 4188293 4318087
61741 4318087 4457702 4607328 4766642 4935603 5115218 5307223 5513004 5733221 5968690
61732 5968690 6221289 6493614 6787907 7105667 7448135 7816726 8213107 8639727 9100697
61723 9100697 9601740 10148843 10747185 11401686 12118168 12903222 13762848 14701558 15722776
61714 15722776 16829571 18024468 19308165 20677959 22126573 23641365 25203167 26784281
61706 26784281 28346473 29840284 31206095 32376651 33282205 33859964 34066161 33884900 33329139
61697 33329139 32435368 31256934 29858001 28306704 26667435 24995262 23334551 21720085
$$ packed form
61763B902527K1555K3966K6929K9501L1728L4726L8801M2784M5928M9473N5196
61752C303114O2865P0140P5139P8305Q1729Q7081R4499J03042J11796J20583J29794
61741D318087J39615J49626J59314J68961J79615J92005K05781K20217K35469
61732E968690K52599K72325K94293L17760L42468L68591L96381M26620M60970
61723I100697N01043N47103N98342O54501P16482P85054Q59626R38710J021218
61714A5722776J106795J194897J283697J369794J448614J514792J561802J581114
61706B6784281J562192J493811J365811J170556R05554N77759K06197j81261n55761
61697C3329139q93771j178434j398933j551297j639269j672173j660711j614466
$$ plain form
61689 21720085 20177842 18724992 17370579 16117439 14964474 13908205 12943378 12063306
61681 12063306 11260746 10529198 9863428 9258524 8708681 8207367 7748796 7328860 6944616
61672 6944616 6593149 6270921 5973938 5698629 5442937 5206458 4989099 4789623 4605845
61663 4605845 4435904 4278580 4132518 3996123 3868519 3749689 3639260 3535885 3438384 3346759
61653 3346759 3261312 3181325 3105454 3033158 2964912 2901197 2842104 2787839 2738614 2693629 2650857
61642 2650857 2608555 2566814 2527148 2490462 2455725 2420824 2384629 2347899 2312032 2277318 2243018
61631 2243018 2209050 2176631 2146693 2118391 2090169 2062019 2035487 2011246 1987870 1963862 1940088
61620 1940088 1918914 1901033 1884381 1866650 1847943 1830110 1814156 1799542 1785889 1773945 1764151
$$ packed form
61689B1720085j542243j452850j354413j253140j152965j056269r64827q80072
61681A2063306q02560p31548o65770o04904n49843n01314m58571m19936l84244
61672F944616l51467l22228k96983k75309k55692k36479k17359j99476j83778
61663D605845j69941j57324j46062j36395j27604j18830j10429j03375r7501r1625
61653C346759q5447p9987p5871p2296o8246o3715n9093n4265m9225m4985m2772
61642B650857m2302m1741l9666l6686l4737l4901l6195l6730l5867l4714l4300
61631B243018l3968l2419k9938k8302k8222k8150k6532k4241k3376k4008k3774
61620A940088k1174j7881j6652j7731j8707j7833j5954j4614j3653j1944r794
$$ plain form
61609 1764151 1755196 1745085 1733334 1721159 1709629 1698526 1687082 1675052 1662824 1651150 1641022
61598 1641022 1633148 1627143 1621751 1616199 1610801 1606009 1601687 1597865 1595419 1595025 1595922 1596639 1596735 1596836 1597185 1597142
61582 1597142 1596226 1594614 1592400 1589371 1585950 1583486 1582888 1583545 1584191 1584270 1583735 1581996 1578122 1572089 1565096 1558522
61566 1558522 1553069 1548840 1545520 1542228 1537819 1531801 1524803 1517995 1512289 1508150 1505629 1504221 1503013 1501381
61552 1501381 1499304 1496721 1492891 1486947 1478993 1470175 1461710 1454228 1448020 1443314 1440055 1437770 1435901 1434073
61538 1434073 1432043 1429788 1427870 1427216 1428186 1430264 1433133 1437659 1445096 1455372 1466946 1478597 1490718
61525 1490718 1504439 1519932 1536276 1552836 1570065 1588643 1608353 1628440 1649033 1671632 1697810
61514 1697810 1727686 1760108 1794251 1830571 1870026 1912784 1958010 2004772 2052897 2103007 2155730
$$ packed form
61609A764151q955j0111j1751j2175j1530j1103j1444j2030j2228j1674j0128
61598A641022p874o005n392n552n398m792m322l822k446l94Q97P17R6J01L49m3
61582A597142r16j612k214l029l421k464n98O57O46P9n35j739l874o033o993o574
61566A558522n453m229l320l292m409o018o998o808n706m139k521j408j208j632
61552A501381k077k583l830n944p954q818q465p482o208m706l259k285j869j828
61538A434073k030k255j918o54R70K078K869M526P437J0276J1574J1651J2121
61525A490718J3721J5493J6344J6560J7229J8578J9710K0087K0593K2599K6178
61514A697810K9876L2422L4143L6320L9455M2758M5226M6762M8125N0110N2723
$$ plain form
61503 2155730 2210572 2265408 2317540 2365655 2410578 2453814 2495752 2535755 2573517 2609384 2643451
61492 2643451 2675306 2704910 2732784 2758837 2781754 2800253 2814461 2825320 2833016 2836818 2836386 2832369
61480 2832369 2825590 2816279 2804469 2790758 2776371 2762731 2751123 2742452 2737014 2734692 2735523 2739920 2748177
61467 2748177 2760096 2775555 2795359 2821083 2853856 2893512 2939143 2990466 3048575 3115407 3192512
61456 3192512 3280292 3378353 3486535 3605469 3736206 3879648 4036776 4209249 4399074 4607350
61446 4607350 4833814 5078119 5341092 5623859 5925698 6243423 6573048 6911156 7253927
61437 7253927 7595100 7925385 8233635 8508277 8738349 8914674 9031176 9085393 9078011 9012344
61427 9012344 8894304 8732245 8535993 8315381 8079151 7834640 7588050 7344743 7109297
$$ packed form
61503B155730N4842N4836N2132M8115M4923M3236M1938M0003L7762L5867L4067
61492B643451L1855K9604K7874K6053K2917J8499J4208J0859P696L802m32m017
61480B832369o779r311j1810j3711j4387j3640j1608q671n438k322Q31M397Q257
61467B748177J1919J5459J9804K5724L2773L9656M5631N1323N8109O6832P7105
61456C192512Q7780R8061J08182J18934J30737J43442J57128J72473J89825K08276
61446D607350K26464K44305K62973K82767L01839L17725L29625L38108L42771
61437G253927L41173L30285L08250K74642K30072J76325J16502N4217p382o5667
61427I012344j18040j62059j96252k20612k36230k44511k46590k43307k35446
$$ plain form
61418 7109297 6885527 6676764 6485968 6315053 6164098 6032006 5918460 5824726 5751935 5699009
61408 5699009 5663038 5641449 5633031 5637161 5653303 5681526 5722310 5775015 5837089 5905506 5978673 6056327
61396 6056327 6137939 6221936 6306491 6390503 6473662 6555816 6636401 6714460 6789363 6861587 6932584
61385 6932584 7003682 7075257 7146970 7218424 7289188 7358438 7424937 7487429 7544998 7597260 7644384
61374 7644384 7686586 7723234 7752586 7772759 7782911 7783338 7774719 7757631 7732748 7701002 7663411 7620890
61362 7620890 7574327 7524841 7473995 7423750 7375948 7331582 7290700 7253199 7219650 7191176 7168583
61351 7168583 7151708 7139424 7130191 7122708 7116212 7110084 7103290 7094564 7083249 7069574 7054010 7036899
61339 7036899 7019115 7002594 6989650 6982019 6981161 6989274 7009288 7043760 7094288 7161976 7247891 7353047
$$ packed form
61418G109297k23770k08763j90796j70915j50955j32092j13546r3734p2791n2926
61408E699009l5971k1589q418M130J6142K8223M0784N2705O2074O8417P3167P7654
61396F056327Q1612Q3997Q4555Q4012Q3159Q2154Q0585P8059P4903P2224P0997
61385F932584P1098P1575P1713P1454P0764O9250O6499O2492N7569N2262M7124
61374G644384M2202L6648K9352K0173J0152M27q619j7088k4883l1746l7591m2521
61362G620890m6563m9486n0846n0245m7802m4366m0882l7501l3549k8474k2593
61351G168583j6875j2284r233p483o496o128o794q726j1315j3675j5564j7111
61339G036899j7784j6521j2944p631q58Q113K0014L4472N0528O7688Q5915J05156
$$ plain form
61327 7353047 7478768 7627404 7801964 8004226 8233409 8487403 8765170 9067089 9392542
61318 9392542 9737735 10096389 10462077 10828774 11188834 11531367 11843574 12113696 12332408
61309 12332408 12492277 12587657 12616139 12579580 12482894 12331775 12131692 11888310 11607829 11296665
61299 11296665 10961230 10608080 10243825 9874520 9505171 9139764 8781607 8433686 8098898
61290 8098898 7779980 7479110 7197591 6935985 6694486 6473131 6271867 6090634 5929343
61281 5929343 5787789 5665737 5563022 5479185 5412988 5362869 5328119 5308994 5305238 5315089 5336333
61270 5336333 5367790 5408808 5457716 5511972 5570044 5632109 5698448 5767835 5837970 5906881 5973366
61259 5973366 6036570 6095923 6151438 6203492 6252099 6296570 6335906 6369469 6397330 6420066 6438125
$$ packed form
61327G353047J25721J48636J74560K02262K29183K53994K77767L01919L25453
61318I392542L45193L58654L65688L66697L60060L42533L12207K70122K18712
61309A2332408J59869R5380K8482l6559r6686j51119k00083k43382k80481l11164
61299A1296665l35435l53150l64255l69305l69349l65407l58157l47921l34788
61290H098898l18918l00870k81519k61606k41499k21355k01264j81233j61291
61281E929343j41554j22052j02715q3837o6197n0119l4750j9125l756R851K1244
61270E336333L1457M1018M8908N4256N8072O2065O6339O9387P0135O8911O6485
61259E973366O3204N9353N5515N2054M8607M4471L9336L3563K7861K2736J8059
$$ plain form
61248 6438125 6451194 6458109 6457391 6447929 6429385 6402183 6367108 6324801 6275623 6219941 6158296 6091185
61236 6091185 6019044 5942732 5863713 5783311 5702040 5620152 5538592 5458881 5382189 5309157 5240442
61225 5240442 5176660 5117828 5063742 5015017 4972844 4937386 4907230 4880746 4857103 4835417 4813940
61214 4813940 4791147 4767053 4742504 4717611 4691937 4666032 4641642 4620285 4602440 4588206 4577834
61203 4577834 4571361 4568561 4569844 4576737 4591052 4613960 4646248 4689073 4743964 4812115 4893922 4989052
61191 4989052 5096814 5216614 5348150 5490941 5643510 5803080 5965798 6126620 6278808
61182 6278808 6414228 6524825 6603864 6645888 6646493 6603205 6516726 6390853 6231205 6044376 5837946
61171 5837946 5620123 5398426 5178453 4963806 4756907 4559805 4374474 4202511 4044478
$$ packed form
61248F438125J3069O915p18r462j8544k7202l5075m2307m9178n5682o1645o7111
61236F091185p2141p6312p9019q0402q1271q1888q1560p9711p6692p3032o8715
61225E240442o3782n8832n4086m8725m2173l5458l0156k6484k3643k1686k1477
61214D813940k2793k4094k4549k4893k5674k5905k4390k1357j7845j4234j0372
61203D577834o473k800J283O893J4315K2908L2288M2825N4891O8151Q1807R5130
61191D989052J07762J19800J31536J42791J52569J59570J62718J60822J52188
61182F278808J35420J10597P9039M2024O05m3288q6479j25873j59648j86829k06430
61171E837946k17823k21697k19973k14647k06899j97102j85331j71963j58033
$$ plain form
61162 4044478 3899643 3766715 3644918 3534190 3434392 3344761 3264173 3191475 3125448 3065081
61152 3065081 3010421 2962787 2923513 2892463 2868132 2849109 2835113 2826697 2824360 2827896 2836302 2848273
61140 2848273 2863073 2880770 2901255 2923090 2943784 2961198 2974273 2982480 2985383 2983132 2976842 2967859
61128 2967859 2956779 2943359 2926996 2906964 2882627 2854132 2822764 2790091 2756719 2722233 2686231
61117 2686231 2648882 2610451 2570942 2530589 2490368 2451529 2414596 2378923 2343178 2306257 2267888
61106 2267888 2228498 2188510 2147960 2106972 2066352 2027182 1989766 1953544 1918271 1884720 1853736
61095 1853736 1825068 1797827 1771812 1747366 1723701 1698382 1669302 1636853 1603451 1571095 1540120
61084 1540120 1510207 1481596 1454767 1429660 1406098 1384733 1366658 1351964 1339490 1328449 1319684
$$ packed form
61162D044478j44835j32928j21797j10728r9798q9631q0588p2698o6027o0367
61152C065081n4660m7634l9274l1050k4331j9023j3996q416k337L536Q406J1971
61140B848273J4800J7697K0485K1835K0694J7414J3075Q207K903k251o290q983
61128B967859j1080j3420j6363k0032k4337k8495l1368l2673l3372l4486l6002
61117B686231l7349l8431l9509m0353m0221l8839l6933l5673l5745l6921l8369
61106B267888l9390l9988m0550m0988m0620l9170l7416l6222l5273l3551l0984
61095A853736k8668k7241k6015k4446k3665k5319k9080l2449l3402l2356l0975
61084A540120k9913k8611k6829k5107k3562k1365j8075j4694j2474j1041q765
$$ plain form
61073 1319684 1314611 1313206 1313826 1315066 1317092 1320881 1326837 1334753 1344648 1356715 1370385 1384299 1397651
61060 1397651 1411025 1425385 1440609 1455702 1470281 1485157 1501204 1518258 1535447 1552211 1568510
61049 1568510 1584130 1598236 1609790 1618333 1624235 1628083 1629824 1628745 1624504 1617939 1610361 1602160 1592733
61036 1592733 1581951 1570989 1561263 1552968 1545235 1537440 1529824 1523014 1517362 1512699 1508417 1503909 1499204
61023 1499204 1494855 1490933 1486612 1481287 1475623 1470722 1466539 1462119 1457303 1453088 1449983 1447006 1442981 1438172
61009 1438172 1433943 1431244 1430109 1430335 1431873 1434537 1438022 1442417 1448145 1455033 1461910 1467841 1473649 1481443
60995 1481443 1492308 1505113 1518101 1530950 1544318 1557953 1570860 1583413 1597597 1614390 1632310
60984 1632310 1649689 1667201 1686720 1708519 1731224 1754167 1778199 1804193 1832012 1861073 1891019
$$ packed form
61073A319684n073j405O20J240K026L789N956P916R895J2067J3670J3914J3352
61060A397651J3374J4360J5224J5093J4579J4876J6047J7054J7189J6764J6299
61049A568510J5620J4106J1554Q543N902L848J741j079m241o565p578q201r427
61036A592733j0782j0962r726q295p733p795p616o810n652m663m282m508m705
61023A499204m349l922m321n325n664m901m183m420m816m215l105k977m025m809
61009A438172m229k699j135K26J538K664L485M395N728O888O877N931N808P794
60995A481443J0865J2805J2988J2849J3368J3635J2907J2553J4184J6793J7920
60984A632310J7379J7512J9519K1799K2705K2943K4032K5994K7819K9061K9946
$$ plain form
60973 1891019 1921959 1954859 1991237 2031455 2073934 2117337 2162867 2212905 2268074 2327519 2391346
60962 2391346 2460132 2532220 2604528 2676978 2753617 2838184 2930650 3029222 3133643 3245119 3364848
60951 3364848 3494163 3634562 3786188 3947613 4118185 4299075 4491131 4693954 4908592
60942 4908592 5139115 5389860 5663127 5961314 6289060 6651044 7049677 7487445 7969891
60933 7969891 8504573 9100203 9770144 10534126 11412244 12418511 13563317 14859499 16322067
60924 16322067 17966181 19812773 21894631 24250997 26920217 29943065 33349898 37088752
60916 37088752 40924094 44424999 47122469 48747755 49357963 49256278 48811723 48341807 48087250
60907 48087250 48177900 48539467 48840046 48600536 47436652 45250892 42235170 38723036 35036889
$$ packed form
60973A891019L0940L2900L6378M0218M2479M3403M5530N0038N5169N9445O3827
60962B391346O8786P2088P2308P2450P6639Q4567R2466R8572J04421J11476J19729
60951C364848J29315J40399J51626J61425J70572J80890J92056K02823K14638
60942D908592K30523K50745K73267K98187L27746L61984L98633M37768M82446
60933G969891N34682N95630O69941P63982Q78118J006267J144806J296182J462568
60924A6322067J644114J846592K081858K356366K669220L022848L406833L738854
60916C7088752L835342L500905K697470J625286O10208j01685m44555m69916k54557
60907D8087250R0650L61567L00579k39510j163884k185760l015722l512134l686147
$$ plain form
60898 35036889 31419405 28029689 24953791 22217311 19808595 17703609 15875987 14295409
60890 14295409 12929211 11748635 10730064 9850723 9087651 8421317 7836670 7319987 6857722
60881 6857722 6439254 6058295 5710608 5392041 5099234 4830256 4583527 4357127 4149372
60872 4149372 3958666 3782223 3615959 3456264 3301563 3152264 3009758 2875104 2747930
60863 2747930 2626847 2511448 2403067 2302734 2209281 2120790 2037108 1959401 1887781 1821034
60853 1821034 1758489 1700550 1647421 1598707 1554290 1514203 1477494 1442487 1408466 1376196 1346720
60842 1346720 1320439 1297155 1276068 1256027 1236872 1220237 1207837 1199150 1191923 1184666 1177503 1171045
60830 1171045 1166081 1164044 1165884 1170265 1174562 1177947 1181810 1186792 1191349 1194103 1195817 1197715 1199190 1198755
$$ packed form
60898C5036889l617484l389716l075898k736480k408716k104986j827622j580578
60890A4295409j366198j180576j018571q79341p63072o66334n84647n16683m62265
60881F857722m18468l80959l47687l18567k92807k68978k46729k26400k07755
60872D149372j90706j76443j66264j59695j54701j49299j42506j34654j27174
60863B747930j21083j15399j08381j00333r3453q8491q3682p7707p1620o6747
60853A821034o2545n7939n3129m8714m4417m0087l6709l5007l4021l2270k9476
60842A346720k6281k3284k1087k0041j9155j6635j2400q687p227p257p163o458
60830A171045m964k037J840M381M297L385L863M982M557K754J714J898J475m35
$$ plain form
60816 1198755 1196595 1194616 1193909 1193197 1190033 1183201 1173898 1164745 1157672 1152743 1148980 1145721 1142697 1139390
60802 1139390 1135367 1131122 1127625 1125082 1123026 1121568 1121623 1123948 1128901 1137034 1148608 1162423 1176482 1190339
60788 1190339 1205648 1223848 1244339 1265490 1286407 1306926 1326725 1345441 1363247 1380556 1397264
60777 1397264 1412690 1426108 1437247 1446582 1455120 1463455 1471070 1477014 1481026 1483385 1484132 1483494 1482653 1482715
60763 1482715 1483050 1482195 1480481 1479976 1481453 1483197 1483525 1482609 1480679 1476346 1468575 1459078 1450692 1443944 1436941
60748 1436941 1428298 1418497 1408453 1398279 1387698 1376505 1364398 1351385 1338534 1327412 1318466 1310720
60736 1310720 1303275 1296389 1290873 1287095 1284999 1284621 1286144 1289580 1294622 1300805 1307907 1316287 1326637 1339172
60722 1339172 1353322 1368509 1384904 1402989 1422599 1442908 1463340 1484085 1505859 1529489 1555447
$$ packed form
60816A198755k160j979p07p12l164o832r303r153p073m929l763l259l024l307
60802A139390m023m245l497k543k056j458N5K325M953Q133J1574J3815J4059J3857
60788A190339J5309J8200K0491K1151K0917K0519J9799J8716J7806J7309J6708
60777A397264J5426J3418J1139R335Q538Q335P615N944M012K359P47o38q41O2
60763A482715L35q55j714n05J477J744L28r16j930m333p771r497q386o748p003
60748A436941q643r801j0044j0174j0581j1193j2107j3013j2851j1122q946p746
60736A310720p445o886n516l778k096l78J523L436N042O183P102Q380J0350J2535
60722A339172J4150J5187J6395J8085J9610K0309K0432K0745K1774K3630K5958
$$ plain form
60711 1555447 1583155 1610733 1636083 1658616 1679605 1700573 1721398 1740180 1754981 1765578 1773478
60700 1773478 1780290 1786330 1790866 1793321 1793725 1792248 1788986 1784372 1779150 1773734 1768109 1762587 1757976 1754543
60686 1754543 1751399 1747498 1742799 1737791 1732264 1725412 1717055 1707878 1698214 1687235 1673904 1658560 1643129
60673 1643129 1629627 1618539 1608785 1599264 1590148 1582434 1576458 1571369 1566139 1560681 1555783 1552376 1551071
60660 1551071 1552082 1555165 1559738 1565262 1571459 1578136 1585023 1591819 1598119 1603233 1606469 1607753 1607676 1606740 1604751
60645 1604751 1601082 1595431 1588319 1581020 1574800 1569817 1564910 1558963 1552308 1546082 1540233 1533042 1522858 1509677
60631 1509677 1494797 1479638 1465132 1451435 1437738 1422944 1406999 1390968 1375538 1360141 1344016
60620 1344016 1327288 1310393 1293263 1275966 1259588 1245474 1233846 1223946 1215234 1207726 1201398 1196092
$$ packed form
60711A555447K7708K7578K5350K2533K0989K0968K0825J8782J4801J0597P900
60700A773478O812O040M536K455M04j477l262m614n222n416n625n522m611l433
60686A754543l144l901m699n008n527o852q357r177r664j0979j3331j5344j5431
60673A643129j3502j1088r754r521r116p714n976n089n230n458m898l407j305
60660A551071J011L083M573N524O197O677O887O796O300N114L236J284p7r36j989
60645A604751l669n651p112p299o220m983m907n947o655o226n849p191j0184j3181
60631A509677j4880j5159j4506j3697j3697j4794j5945j6031j5430j5397j6125
60620A344016j6728j6895j7130j7297j6378j4114j1628r900q712p508o328n306
$$ plain form
60608 1196092 1191946 1189326 1188419 1189284 1191971 1196003 1200107 1203302 1206089 1209965 1215954 1224128 1234147 1245262
60594 1245262 1255947 1264641 1271210 1277036 1283517 1291047 1299467 1308616 1318078 1327014 1334766 1341304 1346930 1352033
60580 1352033 1357406 1364261 1373317 1383961 1394717 1404615 1413963 1423845 1435005 1447221 1459769 1472465
60568 1472465 1486114 1501798 1519843 1539704 1560692 1582390 1604272 1625343 1644698 1662573 1680547
60557 1680547 1700281 1721904 1743826 1764301 1782878 1800023 1815737 1829309 1840486 1850078 1858904 1866571
60545 1866571 1871647 1872719 1868984 1860141 1846208 1827446 1804381 1777983 1749674 1720781 1692116 1664604
60533 1664604 1640057 1620160 1604440 1590433 1576607 1564211 1555376 1550136 1546414 1542474 1538305 1534878
60521 1534878 1533121 1533523 1535764 1538555 1540593 1541757 1542853 1544235 1545352 1545709 1545625 1545974 1547552 1550744 1555471
$$ packed form
60608A196092m146k620r07Q65K687M032M104L195K787L876N989Q174J0019J1115
60594A245262J0685Q694O569N826O481P530Q420R149R462Q936P752O538N626N103
60580A352033N373O855R056J0644J0756R898R348R882J1160J2216J2548J2696
60568A472465J3649J5684J8045J9861K0988K1698K1882K1071J9355J7875J7974
60557A680547J9734K1623K1922K0475J8577J7145J5714J3572J1177R592Q826P667
60545A866571N076J072l735q843j3933j8762k3065k6398k8309k8893k8665k7512
60533A664604k4547j9897j5720j4007j3826j2396q835n240l722l940m169l427
60521A534878j757M02K241K791K038J164J096J382J117L57q4L49J578L192M727
$$ plain form
60506 1555471 1561664 1569981 1581394 1595405 1609347 1620669 1629743 1639287 1651088 1664378 1677402 1689216
60494 1689216 1699578 1708469 1716629 1725600 1736160 1747197 1757156 1766361 1777040 1791077 1808428 1827920
60482 1827920 1849051 1872653 1900098 1932305 1969642 2012391 2060715 2113821 2169327 2223704 2273318
60471 2273318 2315115 2346793 2366866 2374564 2369502 2351798 2322968 2286472 2246780 2207794 2172322 2142497
60459 2142497 2119898 2105148 2097949 2097638 2103373 2113960 2128073 2144732 2163304 2183321 2204899 2229141
60447 2229141 2257363 2289921 2326465 2367378 2414221 2468602 2531233 2602288 2682055 2771009 2869815
60436 2869815 2979606 3101957 3238347 3389760 3556547 3738236 3933803 4142953 4367074
60427 4367074 4608296 4867995 5147515 5450392 5782291 6147787 6547595 6978587 7434008
$$ packed form
60506A555471O193Q317J1413J4011J3942J1322R074R544J1801J3290J3024J1814
60494A689216J0362Q891Q160Q971J0560J1037R959R205J0679J4037J7351J9492
60482A827920K1131K3602K7445L2207L7337M2749M8324N3106N5506N4377M9614
60471B273318M1797L1678K0073P698n062j7704k8830l6496l9692l8986l5472k9825
60459B142497k2599j4750p199l11N735J0587J4113J6659J8572K0017K1578K4242
60447B229141K8222L2558L6544M0913M6843N4381O2631P1055P9767Q8954R8806
60436B869815J09791J22351J36390J51413J66787J81689J95567K09150K24121
60427D367074K41222K59699K79520L02877L31899L65496L99808M30992M55421
$$ plain form
60418 7434008 7901213 8359073 8778802 9128396 9377830 9503436 9491403 9339830 9058638 8668021
60408 8668021 8196025 7674369 7132546 6593315 6072457 5581162 5127187 4714264 4342412
60399 4342412 4009844 3714219 3452240 3219650 3012687 2829006 2666579 2522489 2393720
60390 2393720 2278665 2176733 2086544 2005615 1932117 1866076 1808060 1757172 1711024 1667661 1626922
60379 1626922 1589765 1556610 1526565 1498056 1470056 1442764 1417125 1393704 1372081 1351429 1331387
60368 1331387 1312095 1293629 1275988 1259588 1245124 1232772 1222074 1212806 1205234 1199139 1193350 1187034
60356 1187034 1180982 1176799 1175097 1175234 1176533 1178748 1181350 1183408 1184597 1185656 1187563 1190754 1195336 1201317
60342 1201317 1208201 1214979 1221161 1227474 1234997 1243748 1252665 1260950 1268994 1277740 1287369 1296934 1305475 1313272
$$ packed form
60418G434008M67205M57860M19729L49594K49434J25606j2033j51573k81192l90617
60408H668021m71996n21656n41823n39231n20858m91295m53975m12923l71852
60399D342412l32568k95625k61979k32590k06963j83681j62427j44090j28769
60390B393720j15055j01932r0189q0929p3498o6041n8016n0888m6148m3363m0739
60379A626922l7157l3155l0045k8509k8000k7292k5639k3421k1623k0652k0042
60368A331387j9292j8466j7641j6400j4464j2352j0698r268p572o095n789o316
60356A187034o052m183j702J37J299K215K602K058J189J059J907L191M582N981
60342A201317O884O778O182O313P523Q751Q917Q285Q044Q746R629R565Q541P797
$$ plain form
60328 1313272 1321551 1330853 1340082 1347363 1351448 1352058 1349681 1345813 1342856 1342570 1344444 1346300 1346462 1344704 1341381
60313 1341381 1336802 1331616 1326712 1322353 1318216 1314512 1312081 1311016 1310312 1309454 1309322 1310824 1313650 1317358 1322749
60298 1322749 1330846 1340950 1350866 1358934 1365088 1370391 1376486 1385059 1396616 1409854 1423191 1436705 1451385
60285 1451385 1466608 1479970 1490085 1498237 1506425 1514791 1521998 1527471 1532087 1536798 1541578 1545922 1549687
60272 1549687 1553048 1556010 1558448 1560683 1563785 1568946 1576314 1584438 1591143 1595096 1596509 1596309 1594900 1591825
60258 1591825 1586545 1579389 1571739 1565217 1560522 1556953 1553178 1548425 1542858 1536990 1531175 1525830 1521688 1519300
60244 1519300 1518323 1517781 1517276 1517579 1519603 1522949 1526032 1527862 1529253 1531812 1536085 1541264 1546538 1551932 1557612
60229 1557612 1563177 1568227 1573190 1578920 1585649 1592897 1600351 1608320 1617323 1627677 1639559 1653096 1668223
$$ packed form
60328A313272Q279R302R229P281M085O10k377l868k957k86J874J856J62j758l323
60313A341381m579n186m904m359m137l704k431j065p04q58j32J502K826L708N391
60298A322749Q097J0104R916Q068O154N303O095Q573J1557J3238J3337J3514J4680
60285A451385J5223J3362J0115Q152Q188Q366P207N473M616M711M780M344L765
60272A549687L361K962K438K235L102N161P368Q124O705L953J413k00j409l075
60258A591825n280p156p650o522m695l569l775m753n567n868n815n345m142k388
60244A519300r77n42n05L03K024L346L083J830J391K559M273N179N274N394N680
60229A557612N565N050M963N730O729P248P454P969R003J0354J1882J3537J5127
$$ plain form
60216 1668223 1684602 1701660 1718504 1734081 1747973 1761089 1775128 1791215 1809378 1829257 1850701
60205 1850701 1873471 1897037 1921157 1946284 1973065 2001801 2032847 2067085 2105326 2147425 2192727
60194 2192727 2241344 2294332 2352550 2416016 2484593 2558675 2638888 2725727 2819971 2922920 3035408
60183 3035408 3156794 3285667 3421708 3566406 3721731 3888258 4064499 4247702 4435255
60174 4435255 4625598 4817852 5010396 5199966 5382371 5553881 5711597 5853018 5976311
60165 5976311 6081037 6167476 6234700 6280287 6302927 6304848 6290715 6264378 6227645 6182097 6130853
60154 6130853 6077942 6026720 5979700 5939475 5908858 5890037 5884282 5892859 5917710 5960732 6022615 6102962
60142 6102962 6201397 6317839 6451508 6600439 6762479 6936000 7118646 7305687 7490798 7668684
$$ packed form
60216A668223J6379J7058J6844J5577J3892J3116J4039J6087J8163J9879K1444
60205A850701K2770K3566K4120K5127K6781K8736L1046L4238L8241M2099M5302
60194B192727M8617N2988N8218O3466O8577P4082Q0213Q6839R4244J02949J12488
60183C035408J21386J28873J36041J44698J55325J66527J76241J83203J87553
60174D435255J90343J92254J92544J89570J82405J71510J57716J41421J23293
60165E976311J04726Q6439O7224M5587K2640J921j4133k6337l6733m5548n1244
60154F130853n2911n1222m7020m0225l0617j8821n755Q577K4851M3022O1883Q0347
60142F102962R8435J16442J33669J48931J62040J73521J82646J87041J85111J77886
$$ plain form
60132 7668684 7836150 7990567 8128350 8245453 8338388 8404209 8440467 8446351 8423545 8375159 8303975
60121 8303975 8212325 8103223 7980684 7849060 7712876 7577321 7447968 7329584 7225363 7137255
60111 7137255 7066681 7015045 6984013 6975290 6989855 7027458 7086946 7166650 7264091 7375850 7498277
60100 7498277 7627882 7760342 7889685 8009528 8115266 8204652 8276731 8331092 8367936 8387951
60090 8387951 8392191 8382929 8364407 8341671 8318566 8297742 8282564 8277859 8288473 8318008 8369272 8444974
60078 8444974 8547352 8677654 8836343 9023501 9239199 9484278 9760903 10071561 10417376
60069 10417376 10797951 11212513 11659914 12137432 12640956 13166721 13711399 14269768 14833462
60060 14833462 15392924 15939589 16465365 16961194 17417632 17826449 18180720 18473857 18699720
$$ packed form
60132G668684J67466J54417J37783J17103R2935O5821L6258N884k2806m8386p1184
60121H303975r1650j09102j22539j31624j36184j35555j29353j18384j04221q8108
60111G137255p0574n1636l1032q723J4565L7603N9488P9704R7441J11759J22427
60100G498277J29605J32460J29343J19843J05738Q9386P2079N4361L6844K0015
60090H387951M240r262j8522k2736k3105k0824j5178m705J0614K9535N1264P5702
60078H444974J02378J30302J58689J87158K15698K45079K76625L10658L45815
60069A0417376L80575M14562M47401M77518N03524N25765N44678N58369N63694
60060A4833462N59462N46665N25776M95829M56438M08817L54271K93137K25863
$$ plain form
60051 18699720 18853554 18932190 18933726 18857934 18706883 18484575 18196268 17848776 17451024 17013462
60041 17013462 16546916 16062428 15571805 15087419 14621104 14183050 13781024 13419971 13102662
60032 13102662 12831220 12607912 12434328 12310468 12235106 12206217 12220270 12271553 12353139 12458427
60022 12458427 12581298 12715223 12852911 12986530 13107779 13208526 13282542 13326582 13339177 13318794
60012 13318794 13264063 13175440 13055382 12906708 12731507 12531569 12308949 12066027 11806008 11533633
60002 11533633 11254577 10973613 10693870 10418213 10150928 9897739 9664371 9455170 9272527
59993 9272527 9117292 8989926 8891433 8823136 8785631 8778341 8800079 8849643 8925720 9026594 9150212
59982 9150212 9294302 9456070 9631604 9815422 10000649 10179916 10346575 10495358 10621983
$$ packed form
60051A8699720J53834P8636J536p5792j51051k22308k88307l47492l97752m37562
60041A7013462m66546m84488m90623m84386m66315m38054m02026l61053l17309
60032A3102662k71442k23308j73584j23860p5362k8889J4053N1283Q1586J05288
60022A2458427J22871J33925J37688J33619J21249J00747P4016M4040J2595k0383
60012A3318794n4731q8623j20058j48674j75201j99938k22620k42922k60019k72375
60002A1533633k79056k80964k79743k75657k67285k53189k33368k09201j82643
59993I272527j55235j27366r8493o8297l7505p290K1738M9564P6077J00874J23618
59982I150212J44090J61768J75534J83818J85227J79267J66659J48783J26625
$$ plain form
59973 10621983 10722284 10791947 10827246 10826233 10789219 10717877 10613689 10477687 10312164 10122262
59963 10122262 9915002 9696738 9472317 9246664 9026021 8816906 8624457 8452177 8302502
59954 8302502 8176882 8075831 7999779 7949754 7926873 7931519 7963468 8022533 8108777 8222465 8364039
59943 8364039 8533551 8729577 8949171 9189130 9446546 9717435 9995490 10272909 10542062
59934 10542062 10795709 11026369 11226764 11391162 11516031 11599683 11641717 11642401 11602150 11521819
59924 11521819 11403687 11251511 11069565 10862695 10637885 10404564 10172231 9948305 9738705
59915 9738705 9549040 9383739 9244916 9133688 9052121 9002410 8984630 8996849 9037247 9104701
59905 9104701 9197488 9312938 9448352 9601008 9767276 9943069 10125115 10310394 10494335 10671232
$$ packed form
59973A0621983J00301O9663L5299j013l7014p1342j04188j36002j65523j89902
59963A0122262k07260k18264k24421k25653k20643k09115j92449j72280j49675
59954H302502j25620j01051p6052n0025k2881M646L1949N9065Q6244J13688J41574
59943H364039J69512J96026K19594K39959K57416K70889K78055K77419K69153
59934A0542062K53647K30660K00395J64398J24869Q3652M2034O84m0251q0331
59924A1521819j18132j52176j81946k06870k24810k33321k32333k23926k09600
59915I738705j89665j65301j38823j11228q1567m9711j7780J2219M0398O7454
59905I104701R2787J15450J35414J52656J66268J75793J82046J85279J83941J76897
$$ plain form
59895 10671232 10836893 10989753 11129138 11253773 11362520 11455370 11533152 11597228 11650070 11695362
59885 11695362 11737013 11778727 11824843 11880973 11953436 12048405 12171394 12326768 12517695 12747122
59875 12747122 13018472 13334574 13696363 14103647 14556333 15053038 15588421 16153559 16738905
59866 16738905 17334922 17929279 18505248 19043634 19525034 19930078 20240215 20440771 20523266
59857 20523266 20484858 20327452 20058735 19692536 19246038 18736553 18181363 17599059 17008712
59848 17008712 16427183 15867572 15339600 14850421 14405267 14008031 13661252 13365723 13121200
59839 13121200 12927987 12786840 12696929 12655211 12658657 12705691 12794088 12918669 13072641 13250439
59829 13250439 13447514 13657607 13871650 14079023 14268563 14428604 14547683 14615696 14623942 14564932
$$ packed form
59895A0671232J65661J52860J39385J24635J08747R2850P7782O4076N2842M5292
59885A1695362M1651M1714M6116N6130P2463R4969J22989J55374J90927K29427
59875A2747122K71350L16102L61789M07284M52686M96705N35383N65138N85346
59866A6738905N96017N94357N75969N38386M81400M05044L10137K00556Q2495
59857B0523266l8408j57406k68717l66199m46498n09485n55190n82304n90347
59848A7008712n81529n59611n27972m89179m45154l97236l46779k95529k44523
59839A3121200j93213j41147q9911m1718L446M7034Q8397J24581J53972J77798
59829A3250439J97075K10093K14043K07373J89540J60041J19079O8013Q246n9010
$$ plain form
59819 14564932 14434072 14232122 13965246 13642499 13273729 12869187 12439349 11994361 11543886
59810 11543886 11097034 10661317 10241797 9842227 9466811 9119586 8802184 8513683 8252953
59801 8252953 8019853 7813731 7632218 7472371 7332019 7209199 7101102 7004429 6916132 6833181
59791 6833181 6752558 6672576 6593751 6517460 6444171 6374001 6308601 6251029 6203231 6164213 6130865
59780 6130865 6099884 6068666 6035084 5997170 5953203 5902207 5844663 5782719 5719209 5656212 5594749
59769 5594749 5535813 5481057 5432173 5390048 5354720 5325527 5300845 5278603 5258267 5242246 5234442
59758 5234442 5237377 5251460 5276601 5312873 5358989 5411708 5468282 5529097 5596791 5673025 5756997
59747 5756997 5846721 5940486 6036837 6134158 6230802 6325223 6415715 6500406 6577705 6646619 6706821
$$ packed form
59819A4564932j30860k01950k66876l22747l68770m04542m29838m44988m50475
59810A1543886m46852m35717m19520l99570l75416l47225l17402k88501k60730
59801H252953k33100k06122j81513j59847j40352j22820j08097r6673q8297q2951
59791F833181q0623p9982p8825p6291p3289p0170o5400n7572m7798l9018l3348
59780F130865l0981l1218l3582l7914m3967n0996n7544o1944o3510o2997o1463
59769E594749n8936n4756m8884m2125l5328k9193k4682k2242k0336j6021p804
59758E234442K935J4083K5141L6272M6116N2719N6574O0815O7694P6234Q3972
59747E756997Q9724R3765R6351R7321R6644R4421R0492Q4691P7299O8914O0202
$$ plain form
59736 6706821 6758861 6804298 6845332 6884494 6924928 6970400 7024267 7088707 7165664 7258236 7370211
59725 7370211 7504421 7662521 7846253 8057839 8299043 8571021 8875452 9214829 9591074
59716 9591074 10004510 10454363 10939190 11455890 11998176 12555278 13110133 13637424 14104226
59707 14104226 14475022 14719423 14819344 14773163 14595334 14311402 13951327 13544973 13120166 12700678
59697 12700678 12303631 11939061 11612507 11327495 11085721 10886816 10729534 10612827 10535229
59688 10535229 10494274 10487639 10514367 10574099 10665691 10787417 10938052 11117035 11324345 11561234
59678 11561234 11830498 12134837 12474977 12850148 13260252 13706968 14193164 14722011 15296490
59669 15296490 15919015 16591488 17315830 18093955 18926892 19814526 20756387 21751490 22796462
$$ packed form
59736F706821N2040M5437M1034L9162M0434M5472N3867O4440P6957R2572J11975
59725G370211J34210J58100J83732K11586K41204K71978L04431L39377L76245
59716I591074M13436M49853M84827N16700N42286N57102N54855N27291M66802
59707A4104226L70796K44401R9921m6181j77829k83932l60075m06354m24807m19488
59697A2700678l97047l64570l26554k85012k41774j98905j57282j16707p7598
59688A0535229m0955o635K6728N9732R1592J21726J50635J78983K07310K36889
59678A1561234K69264L04339L40140L75171M10104M46716M86196N28847N74479
59669A5296490O22525O72473P24342P78125Q32937Q87634R41861R95103J044972
$$ plain form
59660 22796462 23884500 25006813 26153908 27314212 28472468 29611551 30716404 31776169
59652 31776169 32784173 33738491 34643076 35507077 36342360 37161617 37977275 38799383 39632994
59643 39632994 40477639 41328655 42177480 43010607 43810022 44555894 45228798 45810317 46284275
59634 46284275 46639752 46873310 46988441 46993991 46903689 46735987 46512551 46256283 45990649 45739827
59624 45739827 45527728 45375686 45300670 45315551 45430871 45656164 45999460 46465760 47056647 47771630
59614 47771630 48608850 49563189 50623612 51773004 52990004 54248958 55516840 56750967
59606 56750967 57900845 58912409 59731117 60304108 60584460 60537872 60148187 59419063 58373000
59597 58373000 57049822 55503532 53795568 51986313 50129888 48273730 46458791 44716809
$$ packed form
59660B2796462J088038J122313J147095J160304J158256J139083J104853J059765
59652C1776169J008004R54318R04585Q64001Q35283Q19257Q15658Q22108Q33611
59643C9632994Q44645Q51016Q48825Q33127P99415P45872O72904N81519M73958
59634D6284275L55477K33558J15131N550r0302j67702k23436k56268k65634k50822
59624D5739827k12099j52042p5016J4881J15320K25293L43296M66300N90887P14983
59614D7771630Q37220R54339J060423J149392J217000J258954J267882J234127
59606E6750967J149878J011564Q18708N72991K80352m6588l89685p29124j046063
59597E8373000j323178j546290j707964j809255j856425j856158j814939j741982
$$ plain form
59589 44716809 43067167 41517445 40066073 38702236 37403472 36137017 34867429 33565589
59581 33565589 32214140 30809819 29364152 27900357 26445572 25023383 23651911 22345672
59573 22345672 21115956 19969309 18907630 17930108 17034082 16214648 15465662 14781936 14159497
59564 14159497 13593868 13079757 12612850 12190431 11809586 11466011 11155182 10873654 10618729
59555 10618729 10387919 10179263 9990919 9819672 9660973 9511373 9369796 9235232 9104085
59546 9104085 8971230 8833315 8689709 8540603 8385739 8225399 8061352 7896047 7731465
59537 7731465 7569308 7411778 7261348 7119702 6987441 6865004 6753616 6655096 6570831 6500990
59527 6500990 6444600 6400133 6366201 6342111 6327949 6323910 6329572 6344106 6367131 6398653 6437880 6482773
$$ packed form
59589D4716809j649642j549722j451372j363837j298764j266455j269588j301840
59581C3565589j351449j404321j445667j463795j454785j422189j371472j306239
59573B2345672j229716j146647j061679r77522q96026q19434p48986o83726o22439
59564A4159497n65629n14111m66907m22419l80845l43575l10829k81528k54925
59555A0618729k30810k08656j88344j71247j58699j49600j41577j34564j31147
59546I104085j32855j37915j43606j49106j54864j60340j64047j65305j64582
59537G731465j62157j57530j50430j41646j32261j22437j11388r8520q4265o9841
59527F500990n6390m4467l3932k4090j4162m039N662J4534K3025L1522L9227M4893
$$ plain form
59515 6482773 6531465 6583780 6640688 6702537 6768520 6837842 6910750 6988345 7071943 7162808 7262145
59504 7262145 7371146 7491089 7623248 7768600 7927888 8102191 8293023 8501515 8727943
59495 8727943 8972526 9236154 9519772 9823640 10148013 10494036 10862841 11253874 11664809
59486 11664809 12092600 12533358 12981543 13430921 13876646 14315060 14741192 15148207 15530237
59477 15530237 15884312 16207954 16495777 16740448 16937527 17088635 17199908 17278146 17328531 17354958
59467 17354958 17361501 17353383 17336868 17318605 17305284 17303790 17321169 17363881 17436833 17542907 17682923
59456 17682923 17855355 18055495 18274622 18500097 18716748 18908731 19060614 19157610 19186211 19135814
59446 19135814 18999992 18776243 18465138 18070691 17601418 17069975 16491022 15879509 15250747
$$ packed form
59515F482773M8692N2315N6908O1849O5983O9322P2908P7595Q3598R0865R9337
59504G262145J09001J19943J32159J45352J59288J74303J90832K08492K26428
59495H727943K44583K63628K83618L03868L24373L46023L68805L91033M10935
59486A1664809M27791M40758M48185M49378M45725M38414M26132M07015L82030
59477A5530237L54075L23642K87823K44671J97079J51108J11273P8238N0385K6427
59467A7354958O543q118j6515j8263j3321j494J7379M2712P2952J06074J40016
59456A7682923J72432K00140K19127K25475K16651J91983J51883R6996K8601n0397
59446A9135814j35822k23749l11105l94447m69273n31443n78953o11513o28762
$$ plain form
59437 15250747 14620640 14003998 13411806 12850397 12323657 11835739 11391223 10992959 10640652
59428 10640652 10331974 10064429 9835733 9643317 9484839 9359241 9266404 9205791 9176442 9178329
59418 9178329 9212310 9278080 9373201 9494917 9642226 9815550 10015144 10240509 10490517 10763109
59408 10763109 11055131 11362839 11681756 12005568 12326076 12634857 12923879 13183787 13403217
59399 13403217 13571544 13681725 13729438 13710785 13622942 13466578 13245974 12967255 12638214 12269124
59389 12269124 11871062 11452802 11020822 10582343 10146311 9720888 9311547 8922003 8555116
59380 8555116 8212033 7892003 7594174 7318712 7065559 6833395 6620770 6427447 6253776
59371 6253776 6099356 5962799 5842170 5735310 5640615 5558040 5488583 5432369 5387909 5353562
$$ packed form
59437A5250747o30107o16642n92192n61409n26740m87918m44516l98264l52307
59428A0640652l08678k67545k28696j92416j58478j25598r2837o0613k9349J887
59418I178329L3981O5770R5121J21716J47309J73324J99594K25365K50008K72592
59408A0763109K92022L07708L18917L23812L20508L08781K89022K59908K19430
59399A3403217J68327J10181M7713j8653q7843j56364k20604k78719l29041l69090
59389A2269124l98062m18260m31980m38479m36032m25423m09341l89544l66887
59380H555116l43083l20030k97829k75462k53153k32164k12625j93323j73671
59371F253776j54420j36557j20629j06860r4695q2575o9457n6214m4460l4347
$$ plain form
59361 5353562 5328848 5313831 5308023 5310506 5320540 5337617 5361336 5391612 5428663 5472524 5522489 5576400
59349 5576400 5629970 5677878 5717363 5751062 5785301 5825597 5874652 5934095 6006226 6093564 6197697
59338 6197697 6318306 6451895 6591950 6732962 6875303 7024829 7187469 7366029 7562444
59329 7562444 7780251 8023095 8292710 8590379 8919297 9283792 9686840 10129679 10613383
59320 10613383 11139892 11712015 12332904 13004573 13726364 14495784 15310904 16169906 17067139
59311 17067139 17991203 18927995 19863929 20785038 21675418 22519681 23306786 24030151 24685347
59302 24685347 25269935 25784841 26233344 26618308 26941533 27204992 27410320 27556576 27639927
59293 27639927 27655747 27599819 27467538 27253718 26954341 26568475 26098859 25551496 24934621 24257244
$$ packed form
59361E353562k4714j5017n808K483J0034J7077K3719L0276L7051M3861M9965N3911
59349E576400N3570M7908L9485L3699L4239M0296M9055N9443P2131Q7338J04133
59338F197697J20609J33589J40055J41012J42341J49526J62640J78560J96415
59329G562444K17807K42844K69615K97669L28918L64495M03048M42839M83704
59320A0613383N26509N72123O20889O71669P21791P69420Q15120Q59002Q97233
59311A7067139R24064R36792R35934R21109Q90380Q44263P87105P23365O55196
59302B4685347N84588N14906M48503L84964L23225K63459K05328J46256Q3351
59293B7639927J5820n5928j32281k13820k99377l85866m69616n47363o16875o77377
$$ plain form
59283 24257244 23528492 22758301 21957760 21137725 20307480 19475335 18649647 17838110 17046678
59274 17046678 16280430 15544999 14845958 14187162 13570691 12997812 12468656 11981511 11534045
59265 11534045 11125193 10754737 10421375 10122641 9856566 9621986 9417205 9239612 9086690
59256 9086690 8956297 8846115 8754017 8678930 8620136 8575909 8544067 8523596 8514111 8513727 8519133 8527989
59244 8527989 8539632 8553116 8566373 8577991 8588130 8596658 8601829 8602113 8598321 8592626 8586201 8579088 8571947
59231 8571947 8566802 8566241 8572834 8589183 8617633 8659645 8715804 8786501 8872418 8974710 9094924 9234351
59219 9234351 9392894 9568839 9760202 9965788 10183821 10409300 10633558 10847286 11044035
59210 11044035 11220707 11375294 11505070 11606992 11678820 11719125 11726743 11701220 11643898 11558000
$$ packed form
59283B4257244p28752p70191q00541q20035q30245q32145q25688q11537p91432
59274A7046678p66248p35431o99041o58796o16471n72879n29156m87145m47466
59265A1534045m08852l70456l33362k98734k66075k34580k04781j77593j52922
59256I086690j30393j10182r2098p5087n8794m4227l1842k0471r485l84N406Q856
59244H527989J1643J3484J3257J1618J0139Q528N171K84l792n695o425p113p141
59231H571947n145n61O593J6349K8450M2012N6159P0697Q5917J02292J20214J39427
59219I234351J58543J75945J91363K05586K18033K25479K24258K13728J96749
59210A1044035J76672J54587J29776J01922P1828M0305P618k5523n7322q5898
$$ plain form
59200 11558000 11447544 11316674 11169909 11012306 10848937 10684301 10521865 10363388 10208841
59191 10208841 10057944 9911882 9772583 9640325 9513419 9390811 9273758 9164179 9062519
59182 9062519 8968412 8882579 8806738 8742075 8688984 8648269 8621836 8612312 8622513 8654906 8710909
59171 8710909 8791174 8897232 9032551 9201394 9406937 9650812 9933674 10255397 10615309 11012978
59161 11012978 11448198 11919356 12422251 12950874 13498120 14054288 14605446 15134522 15623796
59152 15623796 16055659 16412169 16676178 16833891 16876304 16799198 16603264 16294219 15881867 15379241
59142 15379241 14803264 14174998 13516724 12847581 12181951 11531023 10904165 10308630 9749380
59133 9749380 9229726 8751538 8314899 7918426 7560051 7237077 6946170 6684424 6450209
$$ packed form
59200A1558000j10456j30870j46765j57603j63369j64636j62436j58477j54547
59191A0208841j50897j46062j39299j32258j26906j22608j17053j09579j01660
59182I062519r4107q5833p5841o4663n3091m0715k6433r524J0201L2393N6003
59171H710909Q0265J06058J35319J68843K05543K43875K82862L21723L59912L97669
59161A1012978M35220M71158N02895N28623N47246N56168N51158N29076M89274
59152A5623796M31863L56510K64009J57713M2413p7106j95934l09045m12352n02626
59142A5379241n75977o28266o58274o69143o65630o50928o26858n95535n59250
59133I749380n19654m78188m36639l96473l58375l22974k90907k61746k34215
$$ plain form
59124 6450209 6242016 6056883 5891089 5742053 5608394 5488613 5381193 5285735 5202470 5130707
59114 5130707 5069123 5017480 4976399 4945329 4922297 4905901 4896118 4893001 4896196 4906103 4923781 4948963
59102 4948963 4979563 5013959 5052635 5096971 5147559 5204338 5267091 5334915 5406197 5479985 5556457
59091 5556457 5635232 5714129 5790579 5863605 5933548 6000340 6062807 6119144 6167389 6205859 6233928
59080 6233928 6252209 6261617 6262599 6255662 6242097 6223646 6201736 6177504 6152273 6127681 6105600 6088234
59068 6088234 6077930 6076432 6084345 6101605 6128525 6166331 6216607 6280132 6356376 6444507 6544685
59057 6544685 6657615 6782728 6918058 7062684 7218196 7386657 7568049 7761162 7966187
59048 7966187 8184592 8416660 8660935 8916201 9182367 9458959 9744117 10035313 10329605
$$ packed form
59124F450209k08193j85133j65794j49036j33659j19781j07420r5458q3265p1763
59114E130707o1584n1643m1081l1070k3032j6396r783l117L195R907J7678K5182
59102D948963L0600L4396L8676M4336N0588N6779O2753O7824P1282P3788P6472
59091E556457P8775P8897P6450P3026O9943O6792O2467N6337M8245L8470K8069
59080F233928J8281R408R82o937j3565j8451k1910k4232k5231k4592k2081j7366
59068F088234j0304j498P913J7260K6920L7806N0276O3525P6244Q8131J00178
59057F544685J12930J25113J35330J44626J55512J68461J81392J93113K05025
59048G966187K18405K32068K44275K55266K66166K76592K85158K91196K94292
$$ plain form
59039 10329605 10622605 10908287 11180163 11431512 11654067 11837781 11972675 12050325 12063779 12007854
59029 12007854 11880859 11685655 11428715 11118846 10766656 10383505 9979635 9563529 9143124
59020 9143124 8726405 8320046 7928142 7552852 7195738 6858079 6540656 6243710 5966769
59011 5966769 5708506 5467506 5243266 5035747 4844064 4666599 4502316 4350714 4210444
59002 4210444 4079366 3956387 3841962 3736417 3638931 3548571 3464940 3387214 3313838 3243941
58992 3243941 3178019 3116600 3059390 3006336 2958227 2915248 2875930 2838463 2802186 2766965 2732074
58981 2732074 2696724 2661104 2625945 2591563 2557989 2525534 2494613 2465569 2439088 2416178 2397223
58970 2397223 2381746 2369473 2360923 2356424 2355250 2356141 2358056 2360296 2362720 2366089 2371236 2377709 2384252 2390691
$$ packed form
59039A0329605K93000K85682K71876K51349K22555J83714J34894P7650J3454n5925
59029A2007854j26995j95204k56940l09869l52190l83151m03870m16106m20405
59020I143124m16719m06359l91904l75290l57114l37659l17423k96946k76941
59011E966769k58263k41000k24240k07519j91683j77465j64283j51602j40270
59002D210444j31078j22979j14425j05545r7486r0360q3631p7726p3376o9897
58992C243941o5922o1419n7210n3054m8109m2979l9318l7467l6277l5221l4891
58981B732074l5350l5620l5159l4382l3574l2455l0921k9044k6481k2910j8955
58970B397223j5477j2273q550m499j174Q91J915K240K424L369N147O473O543O439
$$ plain form
58956 2390691 2397985 2406194 2414006 2420873 2428053 2436693 2446417 2456741 2468317 2481495 2494962 2507316 2519112
58943 2519112 2532016 2546584 2561970 2577110 2591187 2603714 2615198 2627139 2640517 2654923 2669747
58932 2669747 2685098 2700777 2715738 2729879 2745308 2764279 2786603 2810321 2834054 2857305 2879331
58921 2879331 2899499 2918604 2938547 2960907 2986626 3016349 3049689 3084659 3119195 3153094 3187522
58910 3187522 3223202 3260241 3299162 3340679 3384733 3430930 3479642 3531452 3585859 3641790 3699171
58899 3699171 3758691 3820207 3882688 3945743 4009996 4075867 4143182 4212101 4283488 4358204 4436872
58888 4436872 4520376 4609672 4704934 4805720 4912054 5024687 5144325 5271438 5406916 5552010
58878 5552010 5707263 5872227 6046818 6232500 6431515 6644902 6871792 7111192 7364381
$$ packed form
58956B390691P294Q209P812O867P180Q640R724J0324J1576J3178J3467J2354J1796
58943B519112J2904J4568J5386J5140J4077J2527J1484J1941J3378J4406J4824
58932B669747J5351J5679J4961J4141J5429J8971K2324K3718K3733K3251K2026
58921B879331K0168J9105J9943K2360K5719K9723L3340L4970L4536L3899L4428
58910C187522L5680L7039L8921M1517M4054M6197M8712N1810N4407N5931N7381
58899C699171N9520O1516O2481O3055O4253O5871O7315O8919P1387P4716P8668
58888D436872Q3504Q9296R5262J00786J06334J12633J19638J27113J35478J45094
58878E552010J55253J64964J74591J85682J99015K13387K26890K39400K53189
$$ plain form
58869 7364381 7634822 7925335 8236249 8567334 8920797 9300630 9709090 10145688 10610114
58860 10610114 11104523 11632304 12196275 12798959 13442906 14129443 14858513 15630973 16449597
58851 16449597 17316248 18229264 19184900 20179606 21208508 22262522 23328963 24394072 25442408
58842 25442408 26453962 27404236 28267640 29019624 29636338 30095211 30377626 30471161 30370664
58833 30370664 30079673 29611112 28984617 28222200 27346954 26384623 25363036 24308098 23241000
58824 23241000 22179217 21137996 20129407 19161223 18238241 17364312 16542323 15772863 15053947
58815 15053947 14382156 13753996 13166824 12618910 12108329 11631726 11184887 10764766 10370369
58806 10370369 10001437 9657063 9336030 9037795 8762331 8509062 8276417 8062400 7865454
$$ packed form
58869G364381K70441K90513L10914L31085L53463L79833M08460M36598M64426
58860A0610114M94409N27781N63971O02684O43947O86537P29070P72460Q18624
58851A6449597Q66651R13016R55636R94706J028902J054014J066441J065109J048336
58842B5442408J011554R50274Q63404P51984O16714M58873K82415R3535j00497
58833C0370664k90991m68561o26495p62417q75246r62331j021587j054938j067098
58824B3241000j061783j041221j008589r68184r22982q73929q21989p69460p18916
58815A5053947o71791o28160n87172n47914n10581m76603m46839m20121l94397
58806A0370369l68932l44374l21033k98235k75464k53269k32645k14017j96946
$$ plain form
58797 7865454 7684828 7520181 7370908 7236044 7114900 7007466 6913943 6834157 6767666 6714034
58787 6714034 6672668 6642723 6623687 6615838 6619761 6635628 6663191 6702154 6752261 6813452 6886201 6971383
58775 6971383 7069560 7180854 7305541 7444102 7596565 7762734 7943327 8139939 8353581 8584493
58765 8584493 8833779 9103692 9395453 9708458 10043104 10403140 10793411 11216057 11670669
58756 11670669 12157771 12680424 13242509 13846852 14495117 15188446 15928002 16715321 17551515
58747 17551515 18435274 19362153 20326396 21322146 22341238 23370279 24391218 25384143 26327990
58738 26327990 27199124 27971398 28618492 29116288 29444600 29589275 29543716 29308325 28889655
58729 28889655 28301443 27565324 26707737 25755012 24731639 23661710 22568988 21474323 20394021
$$ packed form
58797G865454j80626j64647j49273j34864j21144j07434r3523p9786o6491n3632
58787F714034m1366k9945j9036p849L923J5867K7563L8963N0107O1191P2749Q5182
58775F971383R8177J11294J24687J38561J52463J66169J80593J96612K13642K30912
58765H584493K49286K69913K91761L13005L34646L60036L90271M22646M54612
58756A1670669M87102N22653N62085O04343O48265O93329P39556P87319Q36194
58747A7551515Q83759R26879R64243R95750J019092J029041J020939R92925R43847
58738B6327990Q71134P72274O47094M97796L28312J44675m5559k35391m18670
58729B8889655n88212p36119q57587r52725j023373j069929j092722j094665j080302
$$ plain form
58720 20394021 19340764 18324620 17352638 16428764 15554976 14732172 13960082 13237205 12561083
58711 12561083 11928347 11335199 10778859 10258235 9772323 9318570 8893879 8496509 8125505
58702 8125505 7778883 7454007 7149536 6865346 6600684 6353911 6124010 5910727 5713155
58693 5713155 5529643 5359258 5201958 5057113 4923048 4798174 4681540 4572361 4470167
58684 4470167 4375195 4287362 4204983 4125869 4049667 3977929 3911950 3851544 3795514 3742031 3689041
58673 3689041 3635828 3583876 3534805 3487985 3441767 3396230 3352574 3310303 3267418 3223368 3179385
58662 3179385 3135688 3090634 3043093 2993622 2942819 2890570 2837342 2784176 2730879 2676308 2621029
58651 2621029 2567675 2517988 2471573 2428115 2388434 2352305 2317585 2283013 2249973 2219946 2191971
$$ packed form
58720B0394021j053257j016144r71982r23874q73788q22804p72090p22877o76122
58711A2561083o32736n93148n56340n20624m85912m53753m24691l97370l71004
58702H125505l46622l24876l04471k84190k64662k46773k29901k13283j97572
58693E713155j83512j70385j57300j44845j34065j24874j16634j09179j02194
58684D470167r4972q7833q2379p9114p6202p1738o5979o0406n6030n3483n2990
58673C689041n3213n1952m9071m6820m6218m5537m3656m2271m2885m4050m3983
58662C179385m3697m5054m7541m9471n0803n2249n3228n3166n3297n4571n5279
58651B621029n3354m9687m6415m3458l9681l6129l4720l4572l3040l0027k7975
$$ plain form
58640 2191971 2164234 2136610 2109901 2083875 2057860 2032345 2008276 1985395 1962792 1940600 1919819
58629 1919819 1900837 1883309 1867175 1852795 1840263 1829590 1821466 1817047 1816684 1819209 1822716 1826262 1830862
58616 1830862 1838305 1848609 1859296 1867967 1874867 1881665 1888230 1892235 1891871 1887487 1880505 1872302 1864414 1858391
58602 1858391 1854815 1853277 1853220 1853817 1853386 1850537 1845964 1841684 1838659 1836599 1835784 1837059 1840097 1843830 1848970
58587 1848970 1857999 1872104 1889942 1909951 1931879 1955483 1979823 2004915 2032385 2063502 2098034
58576 2098034 2135616 2176517 2220359 2265942 2313280 2364130 2419567 2478807 2541441 2609108 2683631
58565 2683631 2765006 2852594 2947105 3050118 3162498 3284323 3415684 3557045 3709658 3875839
58555 3875839 4057618 4254840 4465904 4690440 4929742 5184514 5453985 5737168 6032531
$$ packed form
58640B191971k7737k7624k6709k6026k6015k5515k4069k2881k2603k2192k0781
58629A919819j8982j7528j6134j4380j2532j0673q124m419l63K525L507L546M600
58616A830862P443J0304J0687Q671O900O798O565M005l64m384o982q203p888o023
58602A858391l576j538n7N97m31k849m573m280l025k060q15J275L038L733N140
58587A848970R029J4105J7838K0009K1928K3604K4340K5092K7470L1117L4532
58576B098034L7582M0901M3842M5583M7338N0850N5437N9240O2634O7667P4523
58565B683631Q1375Q7588R4511J03013J12380J21825J31361J41361J52613J66181
58555C875839J81779J97222K11064K24536K39302K54772K69471K83183K95363
$$ plain form
58546 6032531 6335897 6640923 6942076 7234513 7510248 7757269 7963999 8122451 8226243
58537 8226243 8269029 8247633 8164879 8027222 7841334 7614864 7358321 7083120 6798268 6510368
58527 6510368 6225334 5948005 5681164 5427013 5188908 4970018 4771017 4590460 4426682
58518 4426682 4278179 4143267 4020722 3909974 3809767 3717735 3632074 3552174 3476846 3403928
58508 3403928 3332922 3265972 3204527 3146867 3090718 3036588 2986413 2940377 2897107 2855731 2815525
58497 2815525 2774531 2730723 2684114 2636193 2588079 2540597 2495100 2452657 2413127 2376147 2341905
58486 2341905 2309917 2278659 2247825 2219394 2194861 2172979 2151931 2131964 2113864 2096500 2078323
58475 2078323 2060095 2043683 2029101 2015108 2001961 1991165 1982854 1975538 1968254 1961213 1954478 1947525
$$ packed form
58546F032531L03366L05026L01153K92437K75735K47021K06730J58452J03792
58537H226243M2786k1396q2754j37657j85888k26470k56543k75201k84852k87900
58527F510368k85034k77329k66841k54151k38105k18890j99001j80557j63778
58518D426682j48503j34912j22545j10748j00207r2032q5661p9900p5328p2918
58508C403928p1006o6950o1445n7660n6149n4130n0175m6036m3270m1376m0206
58497B815525m0994m3808m6609m7921m8114m7482m5497m2443l9530l6980l4242
58486B341905l1988l1258l0834k8431k4533k1882k1048j9967j8100j7364j8177
58475B078323j8228j6412j4582j3993j3147j0796q311p316p284p041o735o953
$$ plain form
58463 1947525 1939957 1931601 1922331 1912685 1903803 1895838 1887385 1877334 1866051 1854008 1840901 1827216 1814676
58450 1814676 1803737 1792557 1780111 1768299 1759085 1751580 1744197 1737802 1734141 1732738 1731915 1731574 1732390 1733467
58436 1733467 1733442 1732874 1733100 1733671 1733309 1732352 1731800 1730959 1728595 1725537 1723578 1722635 1721496 1720584 1721276 1723078 1724129
58419 1724129 1724188 1724739 1726351 1728036 1729003 1729236 1728862 1728579 1729919 1733313 1736864 1738803 1739934 1741829 1744156 1746103
58403 1746103 1748854 1753955 1760454 1766368 1771837 1778127 1784787 1790696 1796653 1803725 1810139 1813265 1813953 1815413
58389 1815413 1818293 1820337 1820650 1820790 1821473 1821495 1820328 1818984 1817988 1816998 1816438 1816977 1817489 1816187 1813644 1812008
58373 1812008 1811382 1809745 1806456 1803075 1800678 1799108 1798958 1801545 1806673 1812866 1819819 1828158 1836942 1844286
58359 1844286 1850588 1858368 1868573 1879600 1890266 1901234 1913090 1925414 1938195 1952020 1966570 1980928
$$ packed form
58463A947525p568q356r270r646q882p965q453j0051j1283j2043j3107j3685j2540
58450A814676j0939j1180j2446j1812r214p505p383o395l661j403q23l41Q16J077
58436A733467k5n68K26N71l62r57n52q41k364l058j959r43j139r12O92J802J051
58419A724129N9N51J612J685R67K33l74k83J340L394L551J939J131J895K327J947
58403A746103K751N101O499N914N469O290O660N909N957P072O414L126O88J460
58389A815413K880K044L13J40O83K2j167j344r96r90n60N39N12j302k543j636
58373A812008o26j637l289l381k397j570j50K587N128O193O953Q339Q784P344
58359A844286O302P780J0205J1027J0666J0968J1856J2324J2781J3825J4550J4358
$$ plain form
58347 1980928 1995560 2012114 2031131 2051563 2072195 2091881 2109129 2123506 2136800 2150863 2165281
58336 2165281 2179110 2193380 2209164 2224649 2237242 2247477 2257700 2268062 2277154 2285469 2294534 2303542
58324 2303542 2310711 2317239 2326016 2336987 2347746 2358190 2370407 2384368 2398134 2412291 2429664 2450277
58312 2450277 2470836 2489744 2508531 2527862 2546327 2563938 2582775 2603229 2623284 2642253 2661546
58301 2661546 2681145 2699227 2715965 2733803 2753077 2771260 2787485 2803979 2821925 2839636 2855938
58290 2855938 2871861 2887887 2902951 2917179 2932314 2948573 2964371 2979699 2996381 3014520 3032256
58279 3032256 3049399 3067499 3086005 3102547 3117612 3134768 3155581 3178418 3202817 3230518 3261399
58268 3261399 3292990 3325013 3359821 3397270 3433879 3468414 3503650 3541136 3578894 3615883 3654016
$$ packed form
58347A980928J4632J6554J9017K0432K0632J9686J7248J4377J3294J4063J4418
58336B165281J3829J4270J5784J5485J2593J0235J0223J0362R092Q315R065R008
58324B303542P169O528Q777J0971J0759J0444J2217J3961J3766J4157J7373K0613
58312B450277K0559J8908J8787J9331J8465J7611J8837K0454K0055J8969J9293
58301B661546J9599J8082J6738J7838J9274J8183J6225J6494J7946J7711J6302
58290B855938J5923J6026J5064J4228J5135J6259J5798J5328J6682J8139J7736
58279C032256J7143J8100J8506J6542J5065J7156K0813K2837K4399K7701L0881
58268C261399L1591L2023L4808L7449L6609L4535L5236L7486L7758L6989L8133
$$ plain form
58257 3654016 3693751 3732187 3767762 3802909 3840116 3879004 3918841 3960142 4002312 4043400 4083305
58246 4083305 4123527 4163371 4200932 4238197 4279998 4327041 4375327 4423394 4474356 4529455 4585666
58235 4585666 4641626 4699951 4761489 4823116 4883678 4946405 5012776 5079627 5145054 5211772 5281889
58224 5281889 5353791 5426876 5503936 5586079 5670617 5756650 5847406 5944525 6045549 6149402 6258605
58213 6258605 6373727 6491744 6612173 6738304 6869964 7002156 7133680 7269700 7412465
58204 7412465 7557262 7701518 7850137 8007199 8169880 8335594 8507945 8690204 8879574
58195 8879574 9073301 9274177 9485064 9704314 9931398 10170498 10423935 10688893 10965252
58186 10965252 11259374 11575286 11909312 12257949 12623176 13005472 13400619 13809083 14239934
$$ packed form
58257C654016L9735L8436L5575L5147L7207L8888L9837M1301M2170M1088L9905
58246D083305M0222L9844L7561L7265M1801M7043M8286M8067N0962N5099N6211
58235D585666N5960N8325O1538O1627O0562O2727O6371O6851O5427O6718P0117
58224E281889P1902P3085P7060Q2143Q4538Q6033R0756R7119J01024J03853J09203
58213F258605J15122J18017J20429J26131J31660J32192J31524J36020J42765
58204G412465J44797J44256J48619J57062J62681J65714J72351J82259J89370
58195H879574J93727K00876K10887K19250K27084K39100K53437K64958K76359
58186A0965252K94122L15912L34026L48637L65227L82296L95147M08464M30851
$$ plain form
58177 14239934 14699657 15185708 15696529 16238122 16814464 17421676 18058926 18735169 19457707
58168 19457707 20224274 21034249 21897377 22823565 23815039 24876895 26023831 27267013 28605133
58159 28605133 30037051 31571354 33215359 34969156 36840953 38853878 41026721 43363314
58151 43363314 45872385 48581133 51517112 54696304 58144924 61914645 66061443 70632329
58143 70632329 75693487 81351976 87732924 94962031 103191868 112613828 123413827 135742968
58135 135742968 149755941 165635710 183540734 203571036 225837891 250539999 277961135
58128 277961135 308480000 342535383 380109403 419555090 456660875 485331543 500033836
58121 500033836 498322756 481550422 453571790 418855831 381278961 343735820 308119248
$$ packed form
58177A4239934M59723M86051N10821N41593N76342O07212O37250O76243P22538
58168A9457707P66567Q09975Q63128R26188R91474J061856J146936J243182J338120
58159B8605133J431918J534303J644005J753797J871797K012925K172843K336593
58151D3363314K509071K708748K935979L179192L448620L769721M146798M570886
58143G0632329N061158N658489O380948P229107Q229837R421960J0799999J2329141
58135A35742968J4012973J5879769J7905024K0030302K2266855K4702108K7421136
58128B77961135L0518865L4055383L7574020L9445687L7105785K8670668J4702293
58121E00033836j711080j6772334k7978632l4715959l7576870l7543141l5616572
$$ plain form
58114 308119248 275448170 246134766 220264484 197732147 178281212 161579837 147318766
58107 147318766 135237226 125098074 116696502 109885707 104549415 100548601 97722284 95916803
58099 95916803 94940665 94446575 93881591 92611512 90156168 86367941 81439826 75765362
58091 75765362 69766786 63792319 58092777 52826104 48061761 43800767 40014177 36667901
58083 36667901 33719407 31114328 28801921 26746954 24919888 23286357 21815386 20488389
58075 20488389 19290131 18198405 17191579 16259015 15394886 14588044 13826918 13108935 12436539
58066 12436539 11808173 11220167 10672514 10165490 9694778 9256245 8850976 8479587 8136400
58057 8136400 7815236 7515820 7237970 6974495 6716933 6464548 6221401 5988615 5766010
$$ packed form
58114C08119248l2671078k9313404k5870282k2532337j9450935j6701375j4261071
58107A47318766j2081540j0139152q401572o810795n336292m000814k826317j805481
58099I5916803r76138m94090n64984j270079k455344l788227m928115n674464
58091G5765362n998576n974467n699542n266673m764343m260994l786590l346276
58083C6667901k948494k605079k312407k054967j827066j633531j470971j326997
58075B0488389j198258j091726j006826r32564q64129q06842p61126p17983o72396
58066A2436539o28366n88006n47653n07024m70712m38533m05269l71389l43187
58057H136400l21164k99416k77850k63475k57562k52385k43147k32786k22605
$$ plain form
58048 5766010 5557386 5367093 5193633 5032345 4881823 4742566 4612419 4488882 4373315
58039 4373315 4267784 4170136 4076801 3987789 3904579 3825999 3750612 3680234 3616656 3557763 3501057
58028 3501057 3447909 3399954 3354611 3308736 3263597 3221539 3180845 3138837 3097239 3059314 3023992
58017 3023992 2987679 2949820 2912171 2874830 2837473 2802406 2771836 2744055 2716596 2691051 2670485
58006 2670485 2654138 2639126 2625352 2614296 2604828 2594770 2585022 2577782 2572233 2566225 2560524 2556974 2553904
57993 2553904 2547924 2539119 2530247 2521930 2512913 2504009 2497386 2492624 2487489 2482055 2478320 2476449 2475099 2474634
57979 2474634 2476308 2478990 2480368 2480756 2482149 2484301 2485383 2485743 2487263 2489544 2490436 2489898 2489715 2489909 2489131 2488232
57963 2488232 2489515 2492448 2493762 2492072 2489091 2486150 2482757 2478792 2474998 2470968 2465511 2459198 2453837 2449494
$$ packed form
58048E766010k08624j90293j73460j61288j50522j39257j30147j23537j15567
58039D373315j05531r7648r3335q9012q3210p8580p5387p0378o3578n8893n6706
58028C501057n3148m7955m5343m5875m5139m2058m0694m2008m1598l7925l5322
58017C023992l6313l7859l7649l7341l7357l5067l0570k7781k7459k5545k0566
58006B670485j6347j5012j3774j1056r468j0058r748p240n549o008n701l550l070
57993B553904n980q805q872q317r017q904o623m762n135n434l735j871j350m65
57979B474634J674K682J378L88J393K152J082L60J520K281Q92n38j83J94p78q99
57963B488232J283K933J314j690k981k941l393l965l794m030n457o313n361m343
$$ plain form
57949 2449494 2444765 2439737 2435644 2431858 2426519 2420179 2415387 2412366 2408597 2403323 2399146 2398061 2399005 2400542
57935 2400542 2403237 2407931 2414058 2421136 2429884 2440425 2451117 2460468 2468881 2477422 2486108 2494360 2502063
57922 2502063 2509360 2516180 2522398 2527845 2532174 2535563 2539275 2544397 2550348 2555852 2560930 2566525 2572594 2578167
57908 2578167 2582892 2586908 2589614 2590393 2590297 2591178 2593379 2596048 2599390 2604423 2610576 2615792 2619406 2622869 2627187
57893 2627187 2631584 2635300 2638853 2642678 2646033 2648346 2650557 2654302 2660442 2668811 2678681 2689093 2699338
57880 2699338 2709262 2718701 2726966 2733628 2739389 2745205 2750845 2755252 2757922 2759034 2758755 2757400 2755703 2753734
57866 2753734 2750300 2744751 2738753 2734785 2733364 2733178 2733474 2734706 2737252 2741102 2746563 2753779 2761782 2769469
57852 2769469 2777196 2786093 2796230 2807013 2818900 2832997 2849124 2865890 2882516 2899203 2916029 2932881
$$ packed form
57949B449494m729n028m093l786n339o340m792l021l769n274m177j085R44J537
57935B400542K695M694O127P078Q748J0541J0692R351Q413Q541Q686Q252P703
57922B502063P297O820O218N447M329L389L712N122N951N504N078N595O069N573
57908B578167M725M016K706P79r6Q81K201K669L342N033O153N216L614L463M318
57893B627187M397L716L553L825L355K313K211L745O140Q369R870J0412J0245
57880B699338R924R439Q265O662N761N816N640M407K670J112k79j355j697j969
57866B753734l434n549n998l968j421j86K96J232K546L850N461P216Q003P687
57852B769469P727Q897J0137J0783J1887J4097J6127J6766J6626J6687J6826J6852
$$ plain form
57840 2932881 2949997 2967075 2982478 2995079 3006205 3017758 3029025 3037616 3043102 3047166 3050306 3051152
57828 3051152 3049489 3047377 3046487 3046528 3047084 3048729 3051263 3052947 3053001 3053294 3056051 3061066 3066548 3071962 3078692 3088241
57812 3088241 3100622 3114451 3128257 3141915 3156751 3173844 3192506 3211032 3228554 3245303 3261541
57801 3261541 3277390 3293343 3309630 3325345 3339458 3352295 3364524 3374979 3381405 3383548 3383910 3385140
57789 3385140 3387994 3391997 3396492 3400572 3403301 3404566 3404957 3404765 3404124 3403892 3405094 3407525 3410251 3413363 3417813
57774 3417813 3423585 3429532 3435026 3440283 3445104 3448844 3451654 3454213 3456383 3457676 3458832 3460920 3463005 3462884
57760 3462884 3460400 3457893 3457054 3457480 3458720 3461336 3465189 3468996 3472670 3478019 3486007 3495279 3504577 3514646
57746 3514646 3526436 3539314 3552693 3567687 3585371 3604692 3623936 3643211 3663713 3685310 3706452
$$ packed form
57840B932881J7116J7078J5403J2601J1126J1553J1267Q591N486M064L140Q46
57828C051152j663k112q90M1N56J645K534J684N4K93K757N015N482N414O730R549
57812C088241J2381J3829J3806J3658J4836J7093J8662J8526J7522J6749J6238
57801C261541J5849J5953J6287J5715J4113J2837J2229J0455O426K143L62J230
57789C385140K854M003M495M080K729J265L91j92o41k32J202K431K726L112M450
57774C417813N772N947N494N257M821L740K810K559K170J293J156K088K085j21
57760C462884k484k507q39M26J240K616L853L807L674N349P988R272R298J0069
57746C514646J1790J2878J3379J4994J7684J9321J9244J9275K0502K1597K1142
$$ plain form
57735 3706452 3725981 3743791 3760225 3775935 3791835 3808252 3824717 3841314 3859343 3879608 3900864
57724 3900864 3921051 3939404 3956291 3971571 3984368 3994314 4002210 4009404 4016840 4024331 4030709 4035274 4039125
57711 4039125 4044080 4050269 4056213 4061643 4068618 4078889 4091483 4104098 4115943 4128027 4141393 4156120
57699 4156120 4171679 4187513 4203658 4220981 4240006 4259448 4277308 4293843 4311830 4332960 4355554
57688 4355554 4377071 4397468 4418577 4441251 4464801 4488552 4512399 4536167 4559607 4582737 4605422
57677 4605422 4627214 4648280 4669636 4691561 4712802 4732427 4751577 4772226 4795062 4819710 4846023
57666 4846023 4873670 4901228 4927380 4952685 4978918 5007086 5037215 5069397 5103599 5138866 5174141
57655 5174141 5209617 5246153 5283890 5322692 5363310 5406531 5451585 5497056 5543106 5591138 5641415
$$ packed form
57735C706452J9529J7810J6434J5710J5900J6417J6465J6597J8029K0265K1256
57724C900864K0187J8353J6887J5280J2797R946P896P194P436P491O378M565L851
57711D039125M955O189N944N430O975J0271J2594J2615J1845J2084J3366J4727
57699D156120J5559J5834J6145J7323J9025J9442J7860J6535J7987K1130K2594
57688D355554K1517K0397K1109K2674K3550K3751K3847K3768K3440K3130K2685
57677D605422K1792K1066K1356K1925K1241J9625J9150K0649K2836K4648K6313
57666D846023K7647K7558K6152K5305K6233K8168L0129L2182L4202L5267L5275
57655E174141L5476L6536L7737L8802M0618M3221M5054M5471M6050M8032N0277
$$ plain form
57644 5641415 5692855 5745416 5800911 5860790 5924483 5990625 6059001 6130652 6206782 6288077 6374658
57633 6374658 6466547 6564525 6670214 6784589 6906824 7035682 7171983 7318669 7478519 7652911
57623 7652911 7842745 8049160 8272889 8513890 8772059 9047478 9339602 9646813 9966827
57614 9966827 10296509 10630867 10962905 11284884 11589253 11868381 12113985 12316532 12464061
57605 12464061 12541866 12535969 12439751 12258580 12008600 11711393 11388601 11058458 10734200 10424387
57595 10424387 10134591 9868650 9628463 9413656 9222634 9054133 8907420 8781178 8672936
57586 8672936 8579992 8500786 8435148 8383109 8343680 8315103 8296245 8287212 8288189 8298160 8315456 8339509
57574 8339509 8371442 8412760 8463726 8523068 8589021 8660738 8739026 8825834 8922981 9031528 9152275
$$ packed form
57644E641415N1440N2561N5495N9879O3693O6142O8376P1651P6130Q1295Q6581
57633F374658R1889R7978J05689J14375J22235J28858J36301J46686J59850J74392
57623G652911J89834K06415K23729K41001K58169K75419K92124L07211L20014
57614I966827L29682L34358L32038L21979L04369K79128K45604K02547J47529
57605A2464061P7805n897r6218j81171k49980k97207l22792l30143l24258l09813
57595A0424387k89796k65941k40187k14807j91022j68501j46713j26242j08242
57586H672936r2944p9206o5638n2039l9429k8577j8858r033R77R971J7296K4053
57574H339509L1933M1318N0966N9342O5953P1717P8288Q6808R7147J08547J20747
$$ plain form
57563 9152275 9286136 9433385 9592917 9763048 9943062 10133542 10335219 10547649 10768459
57554 10768459 10993143 11215736 11430271 11631456 11813524 11968995 12089524 12168167 12200662 12185441
57544 12185441 12123782 12020083 11880905 11713266 11524002 11320254 11109360 10897869 10690963
57535 10690963 10492423 10304353 10127260 9961508 9808585 9669953 9544911 9431035 9326803
57526 9326803 9232415 9147908 9072176 9004441 8945077 8894075 8850069 8811920 8779950 8754299 8733221
57515 8733221 8714474 8697550 8683052 8670821 8660532 8653573 8652134 8656241 8663513 8672303 8683449 8698302
57503 8698302 8716598 8737252 8759874 8784301 8809653 8835328 8862470 8893027 8927361 8963863 9001021
57492 9001021 9038939 9078623 9120628 9164868 9211162 9259438 9309672 9361988 9416715 9474199 9534686
$$ packed form
57563I152275J33861J47249J59532J70131J80014J90480K01677K12430K20810
57554A0768459K24684K22593K14535K01185J82068J55471J20529P8643L2495j5221
57544A2185441o1659j03699j39178j67639j89264k03748k10894k11491k06906
57535A0690963j98540j88070j77093j65752j52923j38632j25042j13876j04232
57526I326803r4388q4507p5732o7735n9364n1002m4006l8149l1970k5651k1078
57515H733221j8747j6924j4498j2231j0289o959j439M107P272Q790J1146J4853
57503H698302J8296K0654K2622K4427K5352K5675K7142L0557L4334L6502L7158
57492I001021L7918L9684M2005M4240M6294M8276N0234N2316N4727N7484O0487
$$ plain form
57481 9534686 9598434 9665628 9736153 9809896 9887344 9969376 10056122 10146738 10240941 10340338 10447306
57470 10447306 10562639 10685209 10814160 10950574 11096488 11252817 11418748 11592648 11772841
57461 11772841 11957711 12145625 12334626 12521503 12701089 12866927 13012815 13133517 13224322
57452 13224322 13281037 13301224 13285413 13236776 13159743 13059115 12940177 12808768 12670568 12530142
57442 12530142 12390828 12255494 12127045 12007982 11899676 11802509 11716692 11642570 11579982 11527751
57432 11527751 11484130 11447745 11418128 11395717 11381416 11375716 11377930 11386614 11400919 11421018 11446897 11477419
57420 11477419 11511397 11549185 11592326 11641808 11697526 11759316 11827413 11901653 11981190 12065522 12155179
57409 12155179 12251200 12354742 12467464 12591091 12725629 12868727 13017830 13172487 13333579
$$ packed form
57481I534686O3748O7194P0525P3743P7448Q2032Q6746R0616R4203R9397J06968
57470A0447306J15333J22570J28951J36414J45914J56329J65931J73900J80193
57461A1772841J84870J87914J89001J86877J79586J65838J45888J20702R0805
57452A3224322N6715K0187j5811m8637p7033j00628j18938j31409j38200j40426
57442A2530142j39314j35334j28449j19063j08306r7167q5817p4122o2588n2231
57432A1527751m3621l6385k9617k2411j4301n700K214Q684J4305K0099K5879L0522
57420A1477419L3978L7788M3141M9482N5718O1790O8097P4240P9537Q4332Q9657
57409A2155179R6021J03542J12722J23627J34538J43098J49103J54657J61092
$$ plain form
57400 13333579 13500759 13671791 13843906 14014016 14177073 14325596 14451915 14550426 14617362 14649550
57390 14649550 14644793 14603464 14528914 14426281 14301259 14159600 14006805 13847853 13687389 13529969
57380 13529969 13379532 13238551 13107999 12988048 12878330 12777768 12685105 12600030 12523302 12455459
57370 12455459 12395863 12343281 12296805 12255716 12219007 12185800 12156069 12130325 12108708 12090910 12076715
57359 12076715 12065741 12056587 12047341 12037569 12029151 12024324 12023198 12023945 12025279 12027760 12032439 12039131 12046760 12054776
57345 12054776 12063307 12072187 12081017 12090414 12101943 12115922 12130122 12141840 12150984 12160003 12170859 12183170
57333 12183170 12195385 12206403 12215601 12222657 12228446 12235174 12244398 12255397 12266445 12277012 12287469 12297142
57321 12297142 12304408 12308928 12312388 12316546 12321560 12326675 12331507 12336091 12340485 12344988 12350131 12355909 12361602 12366681
$$ packed form
57400A3333579J67180J71032J72115J70110J63057J48523J26319R8511O6936L2188
57390A4649550m757m1329p4550j02633j25022j41659j52795j58952j60464j57420
57380A3529969j50437j40981j30552j19951j09718j00562r2663q5075p6728o7843
57370A2455459n9596n2582m6476m1089l6709l3207k9731k5744k1617j7798j4195
57359A2076715j0974r154r246r772q418m827j126P47J334K481M679O692P629Q016
57345A2054776Q531Q880Q830R397J1529J3979J4200J1718R144R019J0856J2311
57333A2183170J2215J1018R198P056N789O728R224J0999J1048J0567J0457R673
57321A2297142P266M520L460M158N014N115M832M584M394M503N143N778N693N079
$$ plain form
57307 12366681 12371321 12375705 12379723 12383901 12389655 12397670 12406729 12415140 12422825 12430869 12439421 12447373 12454241 12461196
57293 12461196 12469753 12480085 12490958 12500838 12508867 12515225 12520837 12526399 12531686 12536196 12540429 12545896 12553660
57280 12553660 12563403 12574159 12585383 12596889 12608256 12619055 12629566 12640674 12652809 12665293 12676917
57269 12676917 12686963 12695399 12702241 12707227 12710444 12712941 12716104 12720375 12725058 12729620 12734567 12740580 12747261
57256 12747261 12753452 12758681 12763564 12768722 12773963 12778793 12783235 12787858 12793240 12799652 12807020 12815051 12823620 12833058
57242 12833058 12843678 12854994 12865989 12876445 12887379 12899661 12912746 12925522 12938021 12951264 12965344
57231 12965344 12978685 12989759 12998953 13008110 13018548 13030130 13042111 13054224 13066739 13079799 13092973
57220 13092973 13105443 13116669 13126923 13137071 13147709 13158561 13168683 13176913 13181937 13182311 13176915 13165299
$$ packed form
57307A2366681M640M384M018M178N754Q015R059Q411P685Q044Q552P952O868O955
57293A2461196Q557J0332J0873R880Q029O358N612N562N287M510M233N467P764
57280A2553660R743J0756J1224J1506J1367J0799J0511J1108J2135J2484J1624
57269A2676917J0046Q436O842M986L217K497L163M271M683M562M947O013O681
57256A2747261O191N229M883N158N241M830M442M623N382O412P368Q031Q569R438
57242A2833058J0620J1316J0995J0456J0934J2282J3085J2776J2499J3243J4080
57231A2965344J3341J1074R194R157J0438J1582J1981J2113J2515J3060J3174
57220A3092973J2470J1226J0254J0148J0638J0852J0122Q230N024L74n396j1616
$$ plain form
57208 13165299 13147353 13122936 13092325 13056736 13017783 12976506 12933467 12889585 12846046 12803396 12761502
57197 12761502 12720427 12680305 12640119 12597818 12552461 12505455 12458904 12413378 12368023 12322141 12275544
57186 12275544 12227857 12178766 12129085 12080659 12035004 11992485 11952728 11915278 11880003 11847516 11819136
57175 11819136 11795781 11776933 11761128 11747280 11734976 11723929 11714086 11706257 11701723 11701098 11704145 11710694
57163 11710694 11720976 11734984 11752219 11772149 11794299 11817835 11841621 11864809 11886881 11907172 11924911
57152 11924911 11939512 11950270 11956085 11956423 11952377 11945734 11936788 11923814 11904799 11878980 11846833 11809479
57140 11809479 11768196 11723622 11675258 11622406 11565356 11504803 11440392 11371043 11296585 11217679 11134037
57129 11134037 11044248 10947795 10845828 10739219 10627092 10508066 10381995 10249738 10111994 9969145
$$ packed form
57208A3165299j7946k4417l0611l5589l8953m1277m3039m3882m3539m2650m1894
57197A2761502m1075m0122m0186m2301m5357m7006m6551m5526m5355m5882m6597
57186A2275544m7687m9091m9681m8426m5655m2519l9757l7450l5275l2487k8380
57175A1819136k3355j8848j5805j3848j2304j1047r843p829m534o25L047O549
57163A1710694J0282J4008J7235J9930K2150K3536K3786K3188K2072K0291J7739
57152A1924911J4601J0758N815L38m046o643q946j2974j9015k5819l2147l7354
57140A1809479m1283m4574m8364n2852n7050o0553o4411o9349p4458p8906q3642
57129A1134037q9789r6453j01967j06609j12127j19026j26071j32257j37744j42849
$$ plain form
57119 9969145 9821576 9669571 9513389 9353802 9192039 9029014 8865320 8701956 8540057
57110 8540057 8379893 8221336 8065569 7915037 7771273 7633862 7501957 7375545 7254685
57101 7254685 7138603 7025996 6915077 6802904 6685999 6562197 6430641 6289447 6134778
57092 6134778 5962888 5771781 5560172 5326324 5068973 4788448 4486436 4166075 3832964
57083 3832964 3494621 3158022 2828537 2511216 2210600 1927757 1658632 1395891 1130725
57074 1130725 852482 549668 214133 -156072 -558750 -991076 -1450963 -1937766 -2454027
57065 -2454027 -3005430 -3597790 -4235074 -4920679 -5658325 -6450682 -7299805 -8210743 -9192859
57056 -9192859 -10256482 -11410769 -12666309 -14037036 -15537675 -17182058 -18986291 -20971495
$$ packed form
57119I969145j47569j52005j56182j59587j61763j63025j63694j63364j61899
57110H540057j60164j58557j55767j50532j43764j37411j31905j26412j20860
57101G254685j16082j12607j10919j12173j16905j23802j31556j41194j54669
57092F134778j71890j91107k11609k33848k57351k80525l02012l20361l33111
57083C832964l38343l36599l29485l17321l00616k82843k69125k62741k65166
57074A130725k78243l02814B14133a56072m02678m32326m59887m86803n16261
57065b454027n51403n92360o37284o85605p37646p92357q49123r10938r82116
57056i192859j063623j154287j255540j370727j500639j644383j804233j985204
$$ plain form
57048 -20971495 -23162023 -25584181 -28269048 -31253778 -34578200 -38283521 -42416955 -47034945
57040 -47034945 -52200992 -57986162 -64476182 -71775609 -80004267 -89295350 -99797019 -111661870
57032 -111661870 -125019885 -139957282 -156516271 -174697227 -194443367 -215619412 -238002737
57025 -238002737 -261288592 -285122154 -309179234 -333240169 -357107398 -380310520 -401817298
57018 -401817298 -420086875 -433525765 -441009181 -442087489 -436848950 -425709705 -409333230
57011 -409333230 -388630645 -364704145 -338707655 -311701782 -284566088 -257975317 -232420120
57004 -232420120 -208245624 -185680960 -164853579 -145806033 -128524611 -112964037 -99054979
56997 -99054979 -86704746 -75804202 -66235478 -57872664 -50582921 -44235975 -38713786 -33910719
$$ packed form
57048b0971495k190528k422158k684867k984730l324422l705321m133434m617990
57040d7034945n166047n785170o490020p299427q228658r291083j0501669j1864851
57032a11661870j3358015j4937397j6558989j8180956j9746140k1176045k2383325
57025b38002737k3285855k3833562k4057080k4060935k3867229k3203122k1506778
57018d01817298j8269577j3438890p483416j078308N238539J1139245J6376475
57011d09333230K0702585K3926500K5996490K7005873K7135694K6590771K5555197
57004b32420120K4174496K2564664K0827381J9047546J7281422J5560574J3909058
56997i9054979J2350233J0900544R568724Q362814P289743O346946N522189M803067
$$ plain form
56989 -33910719 -29730019 -26085691 -22905561 -20127917 -17696196 -15559554 -13676089 -12011517
56981 -12011517 -10535582 -9222308 -8051971 -7009480 -6081136 -5254554 -4519943 -3868749 -3291747
56972 -3291747 -2780362 -2328835 -1933139 -1588552 -1289580 -1031125 -808110 -614998 -447255
56963 -447255 -302478 -178932 -73992 14836 88552 147578 193286 227596 252138 269024 281763
56952 281763 294489 310824 333909 366695 411646 470697 545619 638090 750078 884105 1039263
56941 1039263 1202311 1344068 1431432 1447484 1399436 1307934 1192761 1068945 949013 841880
56931 841880 750320 673399 610785 562274 524865 494122 468340 448782 436007 428167 422700 417573
56919 417573 410888 401125 388087 372599 355633 338671 324122 313934 308226 306363 308667 315860 327651
$$ packed form
56989c3910719M180700L644328L180130K777644K431721K136642J883465J664572
56981a2011517J475935J313274J170337J042491R28344Q26582P34611O51194N77002
56972c291747N11385M51527L95696L44587K98972K58455K23015J93112J67743
56963d47255J44777J23546g3992A4836P3716N9026M5708L4310K4542J6886J2739
56952B81763J2726J6335K3085L2786M4951N9051P4922R2471J11988J34027J55158
56941A039263J63048J41757Q7364J6052m8048r1502j15173j23816j19932j07133
56931H41880r1560p6921o2614m8511l7409l0743k5782j9558j2775p840n467n127
56919D17573o685r763j3038j5488j6966j6962j4549j0188n708j863K304P193J1791
$$ plain form
56906 327651 343256 362660 386014 412293 439910 468386 498466 530956 566120 603449 641189
56895 641189 676798 708475 735454 756506 769865 775616 776621 775862 774259 772134 771007 772262 775493
56882 775493 779947 786205 794632 803573 811300 818736 828180 840190 853852 869309 887845 909811 934309
56869 934309 960259 985843 1007403 1021059 1025433 1021505 1010576 994132 974840 955313 936084 916602
56857 916602 897816 881718 868724 857736 848653 842573 839253 836440 832268 826913 821732 818197 817562
56844 817562 819899 823319 825596 826606 827867 830102 832922 836593 841985 848796 855774 862991 871968 883169
56830 883169 895078 906196 916411 926100 935444 945019 955425 965721 973412 976411 974129 966900 955941
56817 955941 943882 933708 926785 923095 923160 927991 937133 948691 961664 976689 994344 1014483 1037410
$$ packed form
56906C27651J5605J9404K3354K6279K7617K8476L0080L2490L5164L7329L7740
56895F41189L5609L1677K6979K1052J3359N751J005p59j603k125j127J255L231
56882G75493M454O258Q427Q941P727P436R444J2010J3662J5457J8536K1966K4498
56869I34309K5950K5584K1560J3656M374l928j0929j6444j9292j9527j9229j9482
56857I16602j8786j6098j2994j0988r083o080l320k813m172n355n181l535o35
56844H17562K337L420K277J010J261K235K820L671N392O811O978P217Q977J1201
56830H83169J1909J1118J0215R689R344R575J0406J0296P691K999k282p229j0959
56817I55941j2059j0174o923l690O5M831R142J1558J2973J5025J7655K0139K2927
$$ plain form
56804 1037410 1063738 1092665 1122356 1152710 1185961 1223714 1264678 1305484 1341858 1368750 1381838
56793 1381838 1380520 1368126 1348406 1323189 1293968 1263712 1235786 1212457 1195286 1185357 1182078 1183407
56781 1183407 1188583 1199396 1217834 1243898 1276761 1316388 1362741 1414759 1471354 1531598 1592062
56770 1592062 1645237 1682770 1700140 1697405 1676907 1642114 1597777 1548868 1498961 1450569 1406485
56759 1406485 1369286 1339613 1316123 1297390 1283274 1274741 1273046 1278838 1291465 1309311 1331149 1356765
56747 1356765 1386023 1417864 1450178 1479616 1501208 1509606 1501879 1478874 1443826 1400605 1353309 1305724
56735 1305724 1260124 1217437 1178911 1146200 1119412 1096878 1077815 1063457 1054541 1049610 1047364 1048911
56723 1048911 1055780 1067119 1080822 1096216 1113339 1130266 1143244 1149137 1146296 1133987 1113138 1087202
$$ packed form
56804A037410K6328K8927K9691L0354L3251L7753M0964M0806L6374K6892J3088
56793A381838j318j2394j9720k5217k9221l0256k7926k3329j7171r929l279J329
56781A183407N176J0813J8438K6064L2863L9627M6353N2018N6595O0244O0464
56770A592062N3175L7533J7370k735k0498l4793m4337m8909m9907m8392m4084
56759A406485l7199k9673k3490j8733j4116q533j695N792J2627J7846K1838K5616
56747A356765K9258L1841L2314K9438K1592Q398p727k3005l5048m3221m7296m7585
56735A305724m5600m2687l8526l2711k6788k2534j9063j4358q916m931k246J547
56723A048911O869J1339J3703J5394J7123J6927J2978N893k841j2309k0849k5936
$$ plain form
56711 1087202 1060165 1033540 1006736 979856 954301 930871 909269 889598 872600 858128 844922
56700 844922 832284 820792 811110 803225 797024 792548 789446 786965 784568 781967 778872 775436 772417 770003
56686 770003 767218 763608 760662 759927 760374 759428 756318 752562 749305 746155 742838 740034 737981 735838 733065
56671 733065 730113 727230 723841 719725 715642 712181 708973 705560 702168 699113 696249 693383 690514 687456
56657 687456 684042 680846 678765 677628 676166 673707 671045 669286 668557 668183 667530 666408 665155 664373 664099
56642 664099 663492 661976 660272 659391 658964 657726 655235 651885 647610 642268 637176 634380 633925 633466 631214
56627 631214 627909 625344 624339 624785 626259 627715 627827 626696 626246 628021 631390 634702 637238 639135 640235
56612 640235 640137 638951 637208 635412 634150 634035 634921 635806 636120 636439 637235 637623 636284 633320 630417 629221
$$ packed form
56711A087202k7037k6625k6804k6880k5555k3430k1602j9671j6998j4472j3206
56700H44922j2638j1492r682p885o201m476l102k481k397k601l095l436l019k414
56686G70003k785l610k946p35M47r46l110l756l257l150l317k804k053k143k773
56671G33065k952k883l389m116m083l461l208l413l392l055k864k866k869l058
56657F87456l414l196k081j137j462k459k662j759p29l74o53j122j253p82k74
56642F64099o07j516j704q81m27j238k491l350m275n342n092k796m55m59k252
56627F31214l305k565j005M46J474J456J12j131m50J775L369L312K536J897J100
56612F40235r8j186j743j796j262j15Q86Q85L14L19P96L88j339k964k903j196
$$ plain form
56596 629221 629962 631382 631711 630035 627034 624013 621210 617772 613562 609978 608303 608010 607482 605854 603389
56581 603389 600579 597829 595849 595600 597632 601688 606730 611227 613992 615310 616872 619980 623948 626795
56567 626795 627402 626497 625511 624999 624488 623638 622978 623142 623608 622898 620299 616860 614249 613115 613026 613424 613800 613460
56549 613460 612105 610402 608996 607262 604187 600422 598164 598728 601293 604310 607103 609681 611968 613804
56535 613804 615129 615920 616495 617779 620261 622684 623002 621055 619200 619740 622662 626325 629437 631658 633163
56520 633163 634436 636058 638146 640289 642260 644261 646435 648732 651238 653807 655508 655574 654939 655523 657761
56505 657761 660246 662197 664663 668480 672552 675473 677776 681204 686293 691853 696487 699756 702027 703838
56491 703838 705353 706290 706672 707478 709682 712724 715011 716016 716510 716582 715119 711920 708681 706908 706282 706053
$$ packed form
56596F29221P41J420L29j676l001l021k803l438m210l584j675k93n28j628k465
56581F03389k810k750j980k49K032M056N042M497K765J318J562L108L968K847
56567F26795O07r05r86n12n11q50o60J64M66p10k599l439k611j134q9L98L76l40
56549F13460j355j703j406j734l075l765k258N64K565L017K793K578K287J836
56535F13804J325P91N75J284K482K423L18j947j855N40K922L663L112K221J505
56520F33163J273J622K088K143J971K001K174K297K506K569J701O6o35N84K238
56505F57761K485J951K466L817M072K921K303L428N089N560M634L269K271J811
56491G03838J515R37L82Q06K204L042K287J005M94P2j463l199l239j773o26k29
$$ plain form
56475 706053 706498 707628 707835 705518 701236 696816 693111 690008 687797 686855 686426 685072 682116 677627 671634
56460 671634 664571 657868 652739 648814 645153 642034 640406 640079 639987 639948 640620 641811 642287 641424 639838 638276
56444 638276 636909 635764 634798 633496 631356 628862 627104 626359 625937 625396 625075 625242 625453 624906 623100 620441
56428 620441 618771 620632 626871 635103 641619 644887 646401 648212 650726 653213 655495 658351 662468 667452
56414 667452 672044 675473 678460 682484 688031 694107 699583 704248 708386 712313 716769 722648 729578 735765
56400 735765 740138 743736 748083 753203 758309 763406 768813 773930 778031 781721 786108 790856 794429 795950
56386 795950 795563 793418 789825 786158 784038 783558 783553 783454 783458 782941 780369 775257 769031 763474 759130 755449 751699
56369 751699 747473 742877 738324 733863 729183 724734 721984 721479 721386 719314 715181 711053 708562 707817 708292
$$ packed form
56475G06053M45J130K07k317m282m420l705l103k211r42m29j354k956m489n993
56460F71634p063o703n129l925l661l119j628l27r2l9O72J191M76q63j586j562
56444F38276j367j145r66j302k140k494j758p45m22n41l21J67K11n47j806k659
56428F20441j670J861O239Q232O516L268J514J811K514K487K282K856M117M984
56414F67452M592L429K987M024N547O076N476M665M138L927M456N879O930O187
56400G35765M373L598M347N120N106N097N407N117M101L690M387M748L573J521
56386G95950l87k145l593l667k120m80nr9Mn17k572n112o226n557m344l681l750
56369G51699m226m596m553m461m680m449k750n05r3k072m133m128k491p45M75
$$ plain form
56354 708292 709286 709773 709424 709482 711026 712708 712205 709833 708497 709656 711478 711814 711040 710746 711159 711253 710421
56337 710421 708879 707144 706062 706693 709231 712416 714702 715739 716376 717684 720177 723346 725676 725842 724292
56322 724292 723136 724158 727449 732029 736894 741118 743845 745033 745850 747742 751145 755353 759561 763846
56308 763846 769029 775448 782046 787269 790900 794180 797851 801309 804286 807920 812813 817313 819523 820244
56294 820244 821944 825322 828900 831750 834369 836886 838773 840823 845085 851811 858439 862899 866318 871096
56280 871096 877582 884280 890446 896854 904155 911698 918166 922861 926403 930441 936386 944151 952301 959616
56266 959616 966301 973728 983259 995089 1007768 1019218 1028852 1038455 1050239 1064412 1079387 1093789
56254 1093789 1107138 1119105 1129778 1140669 1153861 1169626 1185942 1200759 1213837 1226104 1238107
$$ packed form
56354G08292R94M87l49N8J544J682n03k372j336J159J822L36p74k94M13R4q32
56337G10421j542j735j082O31K538L185K286J037O37J308K493L169K330J66j550
56322G24292j156J022L291M580M865M224K727J188Q17J892L403M208M208M285
56308G63846N183O419O598N223L631L280L671L458K977L634M893M500K210P21
56294H20244J700L378L578K850K619K517J887K050M262O726O628M460L419M778
56280H71096O486O698O166O408P301P543O468M695L542M038N945P765Q150P315
56266I59616O685P427R531J1830J2679J1450R634R603J1784J4173J4975J4402
56254A093789J3349J1967J0673J0891J3192J5765J6316J4817J3078J2267J2003
$$ plain form
56243 1238107 1249457 1259125 1266203 1270992 1275342 1281288 1289457 1299199 1309658 1319867 1328667 1335858 1343068
56230 1343068 1352313 1364093 1377970 1394194 1413297 1434762 1457736 1482407 1509099 1536881 1565156
56219 1565156 1595893 1631872 1673102 1717467 1764577 1816334 1873707 1935846 2002698 2075599 2154630
56208 2154630 2238144 2325958 2420582 2524304 2637294 2759440 2891706 3034743 3188561 3354551
56198 3354551 3535183 3730281 3935945 4148553 4367470 4592422 4820813 5049474 5276506
56189 5276506 5498997 5711010 5906352 6081749 6234971 6361581 6456455 6517631 6546310 6543964
56179 6543964 6511973 6453533 6373367 6275359 6162132 6036744 5902973 5763845 5621116 5476109
56169 5476109 5329843 5182422 5033330 4882370 4729824 4576228 4422660 4270577 4120554
$$ packed form
56243A238107J1350R668P078M789M350N946Q169R742J0459J0209Q800P191P210
56230A343068R245J1780J3877J6224J9103K1465K2974K4671K6692K7782K8275
56219A565156L0737L5979M1230M4365M7110N1757N7373O2139O6852P2901P9031
56208B154630Q3514Q7814R4624J03722J12990J22146J32266J43037J53818J65990
56198C354551J80632J95098K05664K12608K18917K24952K28391K28661K27032
56189E276506K22491K12013J95342J75397J53222J26610R4874O1176K8679k346
56179F543964l1991n8440q0166r8008j13227j25388j33771j39128j42729j45007
56169E476109j46266j47421j49092j50960j52546j53596j53568j52083j50023
$$ plain form
56160 4120554 3971833 3823886 3677769 3535132 3396581 3261820 3130908 3004825 2885337
56151 2885337 2774526 2673452 2580839 2494128 2412149 2335655 2265043 2199381 2138364 2083446 2035775
56140 2035775 1994326 1957126 1923126 1891916 1862911 1835975 1811717 1790240 1770690 1752819 1737654
56129 1737654 1725730 1716074 1707763 1700994 1695685 1690708 1685864 1683118 1684456 1689598 1696905 1705337 1714554 1724521
56115 1724521 1736234 1751560 1771187 1793789 1817960 1843521 1870305 1897615 1925956 1957292 1992101
56104 1992101 2027993 2062737 2096859 2131688 2166619 2200096 2231769 2261772 2289225 2313367 2335259
56093 2335259 2356969 2380036 2405770 2435524 2469477 2506717 2547813 2595564 2651873 2715796 2786312
56082 2786312 2865172 2955237 3057729 3172989 3302339 3447228 3607754 3783362 3973036 4172772
$$ packed form
56160D120554j48721j47947j46117j42637j38551j34761j30912j26083j19488
56151B885337j10811j01074r2613q6711q1979p6494p0612o5662o1017n4918m7671
56140B035775m1449l7200l4000l1210k9005k6936k4258k1477j9550j7871j5165
56129A737654j1924r656q311o769n309m977m844k746J338N142P307Q432R217R967
56115A724521J1713J5326J9627K2602K4171K5561K6784K7310K8341L1336L4809
56104A992101L5892L4744L4122L4829L4931L3477L1673L0003K7453K4142K1892
56093B335259K1710K3067K5734K9754L3953L7240M1096M7751N6309O3923P0516
56082B786312P8860R0065J02492J15260J29350J44889J60526J75608J89674J99736
$$ plain form
56072 4172772 4374300 4568276 4747937 4909120 5049438 5169650 5274003 5366917 5450112 5523416
56062 5523416 5585500 5632035 5656126 5653727 5627425 5583327 5526419 5460327 5387865 5308062 5214724
56051 5214724 5101466 4967290 4815490 4649766 4474491 4296514 4122877 3957676 3803586
56042 3803586 3664526 3543635 3440183 3351503 3276663 3215551 3166007 3124952 3091065 3063817 3041503
56031 3041503 3022882 3008871 2999880 2993452 2987360 2982795 2981312 2980979 2979145 2976956 2977273 2979928 2982948 2986846
56017 2986846 2993806 3003920 3015811 3029544 3045416 3061565 3076520 3092499 3112466 3135667 3159989
56006 3159989 3186788 3218981 3255763 3293539 3330952 3368979 3407467 3445709 3485108 3527244 3570739
55995 3570739 3613890 3658446 3706437 3755369 3801561 3846518 3894881 3947615 4002430 4059410 4120558
$$ packed form
56072D172772K01528J93976J79661J61183J40318J20212J04353R2914Q3195P3304
56062E523416O2084M6535K4091k399k6302m4098n6908o6092p2462p9803r3338
56051E214724j13258j34176j51800j65724j75275j77977j73637j65201j54090
56042C803586j39060j20891j03452q8680p4840o1112m9544m1055l3887k7248k2314
56031C041503j8621j4011q991o428o092m565j483l33j834k189L17K655L020L898
56017B986846O960J0114J1891J3733J5872J6149J4955J5979J9967K3201K4322
56006C159989K6799L2193L6782L7776L7413L8027L8488L8242L9399M2136M3495
55995C570739M3151M4556M7991M8932M6192M4957M8363N2734N4815N6980O1148
$$ plain form
55984 4120558 4184672 4248395 4311920 4378462 4448594 4520273 4594007 4672821 4757292 4845365 4936645
55973 4936645 5032294 5131446 5232411 5336611 5446564 5560976 5676717 5794556 5918049 6047975
55963 6047975 6182870 6323531 6471590 6625058 6780748 6939612 7104320 7273649 7445329
55954 7445329 7622358 7809903 8007682 8212019 8423596 8646105 8879072 9119467 9369056
55945 9369056 9632744 9910868 10200479 10502838 10822309 11159491 11512956 11885916 12283428
55936 12283428 12705278 13149610 13620605 14123624 14655892 15211971 15795631 16415904 17074379
55927 17074379 17767834 18500829 19283654 20120253 21010992 21965297 22998078 24114847 25313261
55918 25313261 26597305 27976428 29453694 31030658 32722164 34550521 36527198 38656998
$$ packed form
55984D120558O4114O3723O3525O6542P0132P1679P3734P8814Q4471Q8073R1280
55973D936645R5649R9152J00965J04200J09953J14412J15741J17839J23493J29926
55963F047975J34895J40661J48059J53468J55690J58864J64708J69329J71680
55954G445329J77029J87545J97779K04337K11577K22509K32967K40395K49589
55945I369056K63688K78124K89611L02359L19471L37182L53465L72960L97512
55936A2283428M21850M44332M70995N03019N32268N56079N83660O20273O58475
55927A7074379O93455P32995P82825Q36599Q90739R54305J032781J116769J198414
55918B5313261J284044J379123J477266J576964J691506J828357J976677K129800
$$ plain form
55910 38656998 40957656 43457271 46175813 49129985 52354686 55899426 59808237 64128808
55902 64128808 68940929 74353180 80478208 87441008 95404381 104547471 115019082 126948973
55894 126948973 140502017 155880898 173288004 192945080 215145470 240215945 268419553
55887 268419553 299912288 334566143 371302318 407189822 437375811 456581035 461387344
55880 461387344 451597563 429788219 399786264 365344807 329532273 294570472 261840313
55873 261840313 232032955 205399408 181937627 161466407 143686211 128269999 114915962
55866 114915962 103340769 93278580 84506717 76847361 70137754 64222603 58977294 54311370
55858 54311370 50142978 46391129 42995508 39920651 37134258 34598652 32285573 30179544
$$ packed form
55910C8656998K300658K499615K718542K954172L224701L544740L908811M320571
55902F4128808M812121N412251O125028O962800P963373R143090J0471611J1929891
55894A26948973J3553044J5378881J7407106J9657076K2200390K5070475K8203608
55887B68419553L1492735L4653855L6736175L5887504L0185989J9205224M806309
55880D61387344r789781k1809344l0001955l4441457l5812534l4961801l2730159
55873B61840313k9807358k6633547k3461781k0471220j7780196j5416212j3354037
55866A14915962j1575193j0062189q771863p659356o709607n915151n245309m665924
55858E4311370m168392l751849l395621l074857k786393k535606k313079k106029
$$ plain form
55850 30179544 28261217 26503030 24884683 23397689 22031371 20768301 19595896 18508754
55842 18508754 17497178 16546571 15650361 14810869 14025365 13283390 12579517 11916392 11293148
55833 11293148 10702757 10143190 9619606 9132804 8676202 8246568 7846975 7476330 7126309
55824 7126309 6791965 6476192 6180722 5901482 5635612 5384779 5148915 4924532 4711525
55815 4711525 4513980 4332162 4161033 3998420 3847353 3708913 3580271 3461253 3355171
55806 3355171 3261401 3174404 3091779 3016162 2947946 2883650 2823004 2769871 2723889 2678245 2627805
55795 2627805 2572831 2513432 2447932 2378851 2313003 2252998 2195287 2138591 2086882 2041406 1997304
55784 1997304 1951718 1908525 1871248 1837444 1804033 1772599 1745447 1721324 1698721 1678856 1662093
$$ packed form
55850C0179544j918327j758187j618347j486994j366318j263070j172405j087142
55842A8508754j011576r50607q96210q39492p85504p41975p03873o63125o23244
55833A1293148n90391n59567n23584m86802m56602m29634l99593l70645l50021
55824G126309l34344l15773k95470k79240k65870k50833k35864k24383k13007
55815D711525j97545j81818j71129j62613j51067j38440j28642j19018j06082
55806C355171r3770q6997q2625p5617o8216o4296o0646n3133m5982m5644n0440
55795B627805n4974n9399o5500o9081o5848o0005n7711n6696n1709m5476m4102
55784A997304m5586m3193l7277l3804l3411l1434k7152k4123k2603j9865j6763
$$ plain form
55773 1662093 1645735 1628349 1612110 1598278 1584597 1569591 1554875 1540712 1523876 1502674 1479741
55762 1479741 1457149 1433005 1405664 1377208 1349908 1322939 1295101 1267071 1238800 1208704 1177805
55751 1177805 1150558 1129016 1110090 1091099 1074001 1061363 1052056 1043990 1037641 1033977 1032051 1031319 1033180
55738 1033180 1037637 1041548 1042646 1042197 1041385 1038435 1031909 1023554 1015147 1005540 993606 981225 970467 960419
55724 960419 949538 938761 929668 921815 914222 907333 901256 894244 884896 873793 861181 845534 826335
55711 826335 805909 786664 768777 752159 737980 726395 715384 703710 692566 682660 672467 661152
55699 661152 650257 640505 629897 617254 604928 595555 588591 582329 576906 572970 569634 565941 562266
55686 562266 558437 552915 545705 539421 535312 530846 523399 513759 503856 493840 483898 476168 471886 468932
$$ packed form
55773A662093j6358j7386j6239j3832j3681j5006j4716j4163j6836k1202k2933
55762A479741k2592k4144k7341k8456k7300k6969k7838k8030k8271l0096l0899
55751A177805k7247k1542j8926j8991j7098j2638r307q066o349l664j926p32J861
55738A033180M457L911J098m49q12k950o526q355q407r607j1934j2381j0758j0048
55724I60419j0881j0777r093p853p593o889o077p012r348j1103j2612j5647j9199
55711H26335k0426j9245j7887j6618j4179j1585j1011j1674j1144r906j0193j1315
55699F61152j0895r752j0608j2643j2326r373o964o262n423l936l336l693l675
55686E62266l829n522p210o284m109m466p447r640r903j0016r942p730m282k954
$$ plain form
55672 468932 464969 460904 458635 457606 456340 455213 454833 453629 449967 444973 440556 436391 431482 426726
55658 426726 422998 418531 411453 403641 398842 397756 397644 396112 393004 389546 387767 389621 394463 398601
55644 398601 399519 399274 401466 406269 410869 413492 414278 413212 409999 405608 401662 398646 396505 396184 398712
55629 398712 403487 409207 415642 422927 430216 436742 443039 449437 454698 457978 460834 465306 471190 476990
55615 476990 482042 485736 486265 482633 476715 471098 466081 460905 456409 453864 452400 450376 448334 447930 448799
55600 448799 449236 449426 451235 455035 459127 462167 464073 464957 465225 466224 468783 471596 473089 474080 476300 478922
55584 478922 479190 476172 471454 466201 459900 452138 443456 434194 424273 414195 404599 394986 384537 373986
55570 373986 364913 357414 350216 342865 335962 329433 322361 314423 305881 296533 286571 278117 273637 272641
$$ packed form
55672D68932l963m065k269j029j266j127l80j204l662m994m417m165m909m756
55658D26726l728m467p078p812m799j086j12j532l108l458j779J854M842M138
55644C98601R18k45K192M803M600K623P86j066l213m391l946l016k141l21K528
55629C98712M775N720O435P285P289O526O297O398N261L280K856M472N884N800
55615D76990N052L694N29l632n918n617n017n176m496k545j464k024k042m04Q69
55600D48799M37J90J809L800M092L040J906Q84K68R99K559K813J493R91K220K622
55584D78922K68l018m718n253o301p762q682r262r921j0078r596r613j0449j0551
55570C73986r073p499p198p351o903o529p072p938q542r348r962q454m480r96
$$ plain form
55556 272641 271869 269103 265133 261762 259512 257718 255419 251740 246505 240840 236229 232970 230380 228248
55542 228248 227054 226993 227801 229198 230585 230896 229883 228901 229170 229878 229296 227155 224583 222363 220700 219967
55526 219967 219985 219154 215988 211210 206940 204336 203360 203992 205860 207347 207025 205560 204522 203954 203011 202284
55510 202284 203201 205466 207323 208248 209235 210616 211846 213437 216705 221176 224415 224994 223857 222303 220403
55495 220403 217806 214368 209533 202894 195835 190856 188627 187285 185282 183333 182811 183746 185308 187010 188503
55480 188503 189237 189169 189070 189493 190080 190276 190013 189492 189109 189818 192655 197511 203009 207822 211603 214737 217888
55463 217888 221651 225897 229642 232228 234250 236497 238595 239779 240409 241258 241824 240922 238714 236498 234556
55448 234556 231882 228108 224010 219849 214807 208568 202048 196024 190265 184481 178987 173895 168679 163113
$$ packed form
55556B72641p72k766l970l371k250j794k299l679n235n665m611l259k590k132
55542B28248j194o1Q08J397J387L11j013r82K69P08n82k141k572k220j663p33
55526B19967J8q31l166m778m270k604r76O32J868J487l22j465j038n68r43p27
55510B02284R17K265J857R25R87J381J230J591L268M471L239N79j137j554j900
55495B20403k597l438m835o639p059m979k229j342k003j949n22R35J562J702J493
55480A88503P34o8r9M23N87J96k63n21l83P09K837M856N498M813L781L134L151
55463B17888L763M246L745K586K022K247K098J184O30Q49N66r02k208k216j942
55448B34556k674l774m098m161n042o239o520o024n759n784n494n092n216n566
$$ plain form
55434 163113 157837 153596 150545 148446 146794 144674 141403 137518 134368 132593 131609 130571 129186 127633
55420 127633 126280 125386 124644 123447 121999 121303 121328 120373 117544 114768 114622 116817 118692 118747 117815 116984 116270
55403 116270 115480 114720 113807 112520 111342 110687 109742 107700 105728 105708 107138 107396 105390 102858 101569 101123
55387 101123 100363 99322 98815 99230 100434 101955 102941 102884 102491 102789 103524 103751 103811 104984 107184 108918 109898
55370 109898 111721 115144 118332 118902 116707 113884 112943 115043 119040 121936 121350 117848 114069 111814 111192
55355 111192 112090 114456 117047 117944 116931 115777 115748 116403 117126 118092 119161 119511 118995 118410 117989 117157 116140
55338 116140 116049 116804 116713 114727 111579 108311 105499 104320 106108 109896 112396 111605 108815 106229 104504 103594
55322 103594 103864 104877 104928 103348 101696 101257 101040 99786 98306 97996 98513 98845 99488 101483 104180 105941
$$ packed form
55434A63113n276m241l051k099j652k120l271l885l150j775r84j038j385j553
55420A27633j353q94p42j197j448o96K5r55k829k776j46K195J875N5r32q31p14
55403A16270p90p60r13j287j178o55r45k042j972k0J430K58k006k532j289m46
55387A01123p60j041n07M15J204J521R86n7l93K98P35K27O0J173K200J734R80
55370A09898J823L423L188N70k195k823r41K100L997K896n86l502l779k255o22
55355A11192Q98K366K591Q97j013j154k9O55P23R66J069L50n16n85m21q32j017
55338A16140r1P55r1j986l148l268k812j179J788L788K500p91k790k586j725r10
55322A03594K70J013N1j580j652m39k17j254j480l10N17L32O43J995K697J761
$$ plain form
55306 105941 106472 106777 107261 107488 107371 107167 106569 105131 103292 101949 101313 101062 101112 101336 101144 100231 99176 98555
55288 98555 98175 97820 97768 97827 97042 95447 94826 96329 98427 98734 97083 95170 93884 92769 91735 91605 92760
55271 92760 94384 95279 94808 93355 92421 93618 96763 99646 100541 100136 100011 100149 99291 97082 94371 91777
55255 91777 89333 87330 86314 86385 87392 89488 92471 95119 96332 96524 96700 96655 95497 93723 93177 94650
55239 94650 96727 97480 96498 94909 94031 94232 94811 94942 94815 95476 97280 99146 99809 99123 97697 96112 95251
55222 95251 96372 99639 103251 105263 105776 106168 106663 106064 103727 100500 97739 96485 97515 100893 105173
55207 105173 108068 108352 106719 104672 103136 102131 101224 100185 99312 98880 98232 96224 93036 90586 90364 91680
55191 91680 93023 94191 95774 97358 98062 98566 100672 104484 107688 108370 107356 106986 108372 110649 112359
$$ packed form
55306A05941N31L05M84K27j17k04n98j438j839j343o36k51N0K24j92r13j055o21
55288I8555l80l55n2N9p85j595o21J503K098L07j651j913j286j115j034j30J155
55271I2760J624Q95m71j453r34J197L145K883Q95m05j25J38q58k209k711k594
55255I1777k444k003j016P1J007K096K983K648J213J92J76m5j158j774n46J473
55239I4650K077P53r82j589q78K01N79J31j27O61J804J866O63o86j426j585q61
55222I5251J121L267L612K012N13L92M95n99k337l227k761j254J030L378M280
55207A05173K895K84j633k047j536j005r07j039q73m32o48k008l188k450k22J316
55191I1680J343J168J583J584P04N04K106L812L204O82j014l70J386K277J710
$$ plain form
55176 112359 112712 111694 109628 106963 104319 102457 101886 102449 103517 104635 105641 106243 106175 105975 106801 108972
55160 108972 111330 112573 112625 112174 111593 111034 110962 111708 112809 113529 113744 113754 113694 113718 114293 115599 117040 117921 118177
55141 118177 117897 116802 114865 112901 111811 111752 112590 114374 116619 117995 117665 116262 114665 112689 110068
55126 110068 107895 107655 109332 111673 113786 115289 115577 114406 112806 111977 111640 110729 109175 107503 105265
55111 105265 101802 98326 97118 98425 100038 100438 100500 101360 102340 102187 101156 100589 101115 102248 103351 104134
55095 104134 104493 104465 104347 104598 105658 107671 109948 110915 109297 105507 101440 98925 98725 100671 103929 107159
55079 107159 109149 109537 108695 107324 106517 107522 110483 113858 116017 117035 117985 119048 119633 119969 121060 123063
55063 123063 125097 126731 128339 129810 130199 128998 126760 124374 122801 123380 126942 132330 137150 140360 142850
$$ packed form
55176A12359L53j018k066k665k644j862n71N63J068J118J006O02o8k00Q26K171
55160A08972K358J243N2m51n81n59p2P46J101P20K15J0o0K4N75J306J441Q81K56
55141A18177k80j095j937j964j090n9Q38J784K245J376l30j403j597j976k621
55126A10068k173k40J677K341K113J503K88j171j600q29l37r11j554j672k238
55111A05265l463l476j208J307J613M00O2Q60R80j53j031n67N26J133J103P83
55095A04134L59k8j18K51J060K013K277R67j618l790m067k515k00J946L258L230
55079A07159J990L88q42j371q07J005K961L375K159J018R50J063N85L36J091K003
55063A23063K034J634J608J471L89j201k238k386j573N79L562N388M820L210K490
$$ plain form
55048 142850 145213 146497 145778 143597 141037 138549 136457 135507 135906 136628 136520 135542 134426 133925 134826 137674
55032 137674 141771 145303 147184 147952 148321 147983 146757 145795 146387 148158 149712 150623 151659 153243 154818 155801
55016 155801 156374 157154 158449 159788 159934 157796 153765 149686 147006 145383 143769 142424 142893 145980 150439
55001 150439 153925 154982 154080 152847 152344 152122 151201 149696 148778 149026 149705 150065 150416 151227 151915 151510 150106
54984 150106 148737 147973 147569 147417 148009 149634 151696 153134 153292 152315 150989 150314 150944 152748 154854 156176
54968 156176 156115 155048 154124 154205 154946 155250 154755 154400 155274 157310 159461 160815 161165 160811 160268 160006 160083 160163 160196
54949 160196 160808 162585 165105 167238 168373 168837 169009 168727 168019 167951 169859 173512 176719 177361 175645 173741
54933 173741 173237 173665 173690 172924 171832 170449 168201 165006 161670 158951 156805 154811 152864 151175 150037
$$ packed form
55048A42850K363J284p19k181k560k488k092r50L99P22j08r78j116n01R01K848
55032A37674M097L532J881P68L69l38j226r62N92J771J554R11J036J584J575R83
55016A55801N73P80J295J339J46k138m031m079k680j623j614j345M69L087M459
55001A50439L486J057r02j233n03k22r21j505r18K48O79L60L51Q11O88m05j404
54984A50106j369p64m04j52N92J625K062J438J58r77j326o75O30J804K106J322
54968A56176o1j067r24Q1P41L04m95l55Q74K036K151J354L50l54n43k62P7Q0L3
54949A60196O12J777K520K133J135M64J72k82p08o8J908L653L207O42j716j904
54933A73741n04M28K5p66j092j383k248l195l336k719k146j994j947j689j138
$$ plain form
54918 150037 149875 151192 154137 158324 163151 168106 172646 176127 178135 178796 178699 178596 179105 180386 182062 183707
54902 183707 185486 188087 192006 197091 202729 208183 212884 216852 220879 225914 232151 239112 246691 255621
54888 255621 266687 279842 294348 309469 324705 339661 354198 368700 383680 398785 412291
54877 412291 421961 426503 426022 420988 411263 396746 378727 359722 341613 324497 307660 291118 275802
54864 275802 262767 252720 245810 241299 237688 233721 229135 224289 219707 216333 215353 216817 218990 220068
54850 220068 220287 221503 224963 230358 236780 243626 250645 258058 266726 277552 290701 305857 322852
54837 322852 341150 359054 374385 385913 393337 396282 394384 388160 378621 366163 350918 334046
54825 334046 317275 301147 285098 269403 255542 244196 234329 224898 216220 208887 202543 196669 191637
$$ packed form
54918A50037j62J317K945M187M827M955M540L481K008O61r7j03N09J281J676J645
54902A83707J779K601L919N085N638N454M701L968M027N035O237O961P579Q930
54888B55621J1066J3155J4506J5121J5236J4956J4537J4502J4980J5105J3506
54877D12291R670M542m81n034r725j4517j8019j9005j8109j7116j6837j6542j5316
54864B75802j3035j0047o910m511l611l967m586m846m582l374r80J464K173J078
54850B20068K19J216L460N395O422O846P019P413Q668J0826J3149J5156J6995
54837C22852J8298J7904J5331J1528P424K945j898o224r539j2458j5245j6872
54825C34046j6771j6128j6049j5695j3861j1346r867r431q678p333o344n874n032
$$ plain form
54812 191637 188009 185358 182606 179166 175305 171831 169623 168799 168211 166706 164950 164688 165778 165572 162254
54797 162254 157456 154259 153560 153834 153656 152885 151797 150680 150238 151033 152410 153124 153178 153907 155893 157965 158852
54780 158852 158924 159393 160266 160124 158027 154879 152453 151476 151300 151225 151316 151588 151298 149997 148834 149623 152492 155474
54762 155474 156830 156958 157459 158945 160542 161241 161097 161001 161658 162977 164493 166212 168583 171430 173568 174190
54746 174190 174321 176033 180341 186604 193740 200945 207349 212303 216476 221746 229526 239816 252003 265562
54732 265562 279706 293445 306599 319969 334094 348663 363529 379262 395996 412445 426556
54721 426556 436442 440434 437494 428460 416080 403032 390449 378719 368588 360519 353795 347242 340343
54708 340343 333043 325373 318130 313007 310811 310063 308474 305582 303080 302867 305514 310270 315862 321641 328473
$$ packed form
54812A91637l628k651k752l440l861l474k208q24n88j505j756k62J090k06l318
54797A62254m798l197o99K74j78p71j088j117m42P95J377P14N4P29J986K072Q87
54780A58852P2M69Q73j42k097l148k426r77j76p5R1K72k90j301j163P89K869K982
54762A55474J356J28N01J486J597O99j44r6O57J319J516J719K371K847K138O22
54746A74190J31J712M308O263P136P205O404M954M173N270P780J0290J2187J3559
54732B65562J4144J3739J3154J3370J4125J4569J4866J5733J6734J6449J4111
54721D26556R886L992k940r034j2380j3048j2583j1730j0131q069o724o553o899
54708C40343p300p670p243n123k196p48j589k892k502k13K647M756N592N779O832
$$ plain form
54693 328473 337948 350152 363104 375285 387942 403698 423401 445577 468670 492568 517891 544741
54681 544741 572229 598457 620966 637788 648066 651461 647602 636737 620250 599607 575254 547490
54669 547490 517968 489216 462811 438854 417004 397078 378802 361889 346336 332032 318443
54658 318443 305525 294530 286836 282059 278268 273960 268905 263339 257520 252194 248385 246379 245619 245646
54644 245646 246278 246798 246109 244218 242690 242918 244384 245281 244641 243287 242582 242718 242708 242015 241468 241923 242586 241834
54626 241834 239631 237776 237317 237143 235916 234122 233138 233407 234894 238271 243927 250427 255712 259614 263531
54611 263531 267833 271305 273342 275079 277932 282206 287490 293260 298768 303352 307182 310891 314441 317334
54597 317334 319883 323057 327004 331008 335000 339599 344405 348002 350474 354301 361519 371088 380366 388344
$$ packed form
54693C28473R475J2204J2952J2181J2657J5756J9703K2176K3093K3898K5323K6850
54681E44741K7488K6228K2509J6822J0278L395l859j0865j6487k0643k4353k7764
54669E47490k9522k8752k6405k3957k1850j9926j8276j6913j5553j4304j3589
54658C18443j2918j0995p694m777l791m308n055n566n819n326l809k006p60K7
54644B45646O32N20o89j891j528K28J466Q97o40j354p05J36j0o93n47M55O63p52
54626B41834k203j855m59j74j227j794r84K69J487L377N656O500N285L902L917
54611B63531M302L472K037J737K853M274N284N770N508M584L830L709L550K893
54597C17334K549L174L947M004L992M599M806L597K472L827P218R569R278P978
$$ plain form
54583 388344 396220 405432 416531 429659 444820 461543 479287 498454 520262 545208 572046 598660
54571 598660 623852 647961 671560 693601 711213 721621 724126 719888 710087 694892 674240 648956
54559 648956 620904 592268 564645 538415 513059 488496 465863 446460 430242 416180 403874
54548 403874 393692 385224 376879 367577 357956 349253 341654 334449 327255 320369 314085 308164 301830 294166
54534 294166 284946 275327 267239 261745 258305 255798 253666 251727 249523 246466 242294 237080 231232 225754
54520 225754 221773 219158 216271 212000 207591 205400 205861 206785 205873 202914 199026 194697 189685 184471 180557
54505 180557 178879 178622 178169 176854 175297 174304 174099 174617 175866 177669 179426 180475 180609 180162 179755 179899
54489 179899 180648 181714 183214 185971 190431 195536 199605 202311 204767 207559 209955 211553 213391 216529
$$ packed form
54583C88344P876R212J1099J3128J5161J6723J7744J9167K1808K4946K6838K6614
54571E98660K5192K4109K3599K2041J7612J0408K505m238r801j5195k0652k5284
54559F48956k8052k8636k7623k6230k5356k4563k2633j9403j6218j4062j2306
54548D03874j0182q468q345r302r621q703p599p205p194o886o284n921o334p664
54534B94166r220r619q088n494l440k507k132j939k204l057m172n214n848n478
54520B25754l981k615k887m271m409k191M61R24r12k959l888m329n012n214l914
54505A80557j678k57m53j315j557r93k05N18J249J803J757J049J34m47m07J44
54489A79899P49J066J500K757M460N105M069K706K456K792K396J598J838L138
$$ plain form
54475 216529 220717 225512 231609 239656 248618 256976 265070 274626 286166 298513 310767 323125 335418
54462 335418 346488 355687 363872 372223 380827 388753 394598 396641 393550 385581 374485 361869 348382
54449 348382 334656 321836 310457 299668 288394 276653 265067 253817 242989 233514 226613 222242
54437 222242 218806 214770 210180 206353 204246 203444 202905 202415 202697 203941 204903 204095 201439 198064 194815 191757
54421 191757 189005 187147 186773 188161 191351 195848 200373 203746 206043 208216 210707 213240 215849 219110
54407 219110 223228 227698 231893 235197 236718 235908 233535 231037 228874 226553 224114 222214 220544 217747
54393 217747 213456 209103 206049 204196 203088 203031 204048 204863 204129 202034 199710 197764 196295 195554 195383 194526
54377 194526 191747 187518 183624 181115 179485 177884 176390 175815 176551 177952 178890 178967 178850 179141 179346 178796
$$ packed form
54475B16529M188M795O097Q047Q962Q358Q094R556J1540J2347J2254J2358J2293
54462C35418J1070R199Q185Q351Q604P926N845K043l091p969j1096j2616j3487
54449C48382j3726j2820j1379j0789j1274j1741j1586j1250j0828r475o901m371
54437B22242l436m036m590l827k107q02n39m90K82J244R62q08k656l375l249l058
54421A91757k752j858l74J388L190M497M525L373K297K173K491K533K609L261
54407B19110M118M470M195L304J521q10k373k498k163k321k439j900j670k797
54393B17747m291m353l054j853j108n7J017Q15p34k095k324j946j469p41j71q57
54377A94526k779m229l894k509j630j601j494n75P36J401R38P7j17K91K05n50
$$ plain form
54361 178796 178305 179736 183677 188487 191988 193275 192831 191972 192498 195534 200101 203940 206311 208821 212827
54346 212827 217438 221116 224003 227348 231628 236529 241908 247371 251718 254387 256904 261246 266958 271369
54332 271369 272679 271592 269931 268896 268789 269275 269516 268805 267156 264756 261188 256118 250426 245401 240872
54317 240872 235427 228703 222220 217494 214380 211932 210005 209219 209702 210596 210706 209421 207151 204999 203728
54302 203728 203065 202225 201026 200024 199648 199845 200661 202470 205230 208003 209735 210351 210724 211610 212932 214215
54286 214215 215464 217320 220311 224247 228605 233203 237962 242155 244649 245129 244523 243915 243554 243165 242608 241669
54270 241669 239757 236431 232027 227367 223057 219400 216496 214040 211405 208360 205329 202556 199556 195943
54256 195943 192309 189583 187868 186551 185221 183815 182077 179598 176346 172802 169713 167885 167543 167459 165476
$$ packed form
54361A78796m91J431L941M810L501J287m44q59N26L036M567L839K371K510M006
54346B12827M611L678K887L345M280M901N379N463M347K669K517M342N712M411
54332B71369J310j087j661j035j07M86K41p11j649k400l568n070n692n025m529
54317B40872n445o724o483m726l114k448j927p86M83Q94J10j285k270k152j271
54302B03728o63q40j199j002l76J97Q16J809K760K773J732O16L73Q86J322J283
54286B14215J249J856K991L936M358M598M759M193K494M80o06o08l61l89n57r39
54270B41669j912l326m404m660m310l657k904k456k635l045l031k773l000l613
54256A95943l634k726j715j317j330j406j738k479l252l544l089j828l42q4j983
$$ plain form
54241 165476 160738 154845 149969 146454 143323 140521 139164 139668 141124 142730 144584 146681 148330 149138 149497
54226 149497 149423 147892 144355 140272 137947 137967 138794 139007 138975 139838 141593 143108 143805 144293 145006 145230 144341 143351
54208 143351 143959 146155 148072 148551 148541 149254 150087 149583 147784 146302 146258 147287 148587 149965 151596 153445
54192 153445 155271 156787 157759 158233 158586 158929 158653 157126 154778 152853 152043 151916 151843 151923 152631 153832 154615
54175 154615 154229 153050 152418 153407 155949 159325 163082 166874 169767 170721 169924 168762 168188 167978 167851 168259
54159 168259 169527 171262 173327 176381 180471 184021 185416 184942 184047 183287 182241 180938 179926 179089 177679
54144 177679 175570 173409 171488 169429 166968 164089 160490 155993 151586 148987 148774 149725 150278 150115 150135 151320
54128 151320 153681 156031 157000 156582 156212 156823 157501 156911 155379 154412 154597 155188 155434 155020 153452 150504 147361
$$ packed form
54241A65476m738n893m876l515l131k802j357N04J456J606J854K097J649Q08L59
54226A49497p4j531l537m083k325K0Q27K13l2Q63J755J515O97M88P13K24q89r90
54208A43351O08K196J917M79j0P13Q33n04j799j482m4J029J300J378J631J849
54192A53445J826J516R72M74L53L43k76j527k348j925q10j27p3Q0P08J201P83
54175A54615l86j179o32R89K542L376L757L792K893R54p97j162n74k10j27M08
54159A68259J268J735K065L054M090L550J395m74q95p60j046j303j012q37j410
54144A77679k109k161j921k059k461k879l599m497m407k599k13R51N53j63K0J185
54128A51320K361K350R69m18l70O11O78n90j532r67J85N91K46m14j568k948l143
$$ plain form
54111 147361 145944 146695 148116 148768 148717 148743 149151 149756 150208 150047 149082 147786 146699 145641 144373 143726 144797
54094 144797 147201 149458 151117 153002 155162 156170 155076 152718 150452 148636 146834 144502 141054 136458
54080 136458 132158 130070 130080 129918 128224 126287 125836 126570 127194 127671 128855 130685 132297 133538 135061 137078
54064 137078 139075 140562 141233 140680 138838 136524 134656 133117 131153 128768 127026 127051 129116 132436 135344
54049 135344 136194 134829 132861 131858 131612 130885 129388 128076 127663 127836 128054 128395 129341 131160 133582 135820
54033 135820 137034 137204 137314 138129 138964 138401 136385 134914 136146 139987 144008 145832 145415 144640 144830 145280
54017 145280 144661 143239 142699 143835 145473 146028 145321 144425 144395 145659 147968 150312 151393 150879 149953 150184 152155
54000 152155 155428 159257 162811 165384 167116 169135 172201 175460 177301 177288 176602 176658 177989 180532 184362
$$ packed form
54111A47361j417P51J421O52n1K6M08O05M52j61r65j296j087j058j268o47J071
54094A44797K404K257J659J885K160J008j094k358k266j816j802k332l448m596
54080A36458m300k088J0j62j694j937m51P34O24M77J184J830J612J241J523K017
54064A37078J997J487O71n53j842k314j868j539j964k385j742K5K065L320K908
54049A35344Q50j365j968j003k46p27j497j312m13J73K18L41R46J819K422K238
54033A35820J214J70J10Q15Q35n63k016j471J232L841M021J824m17p75J90M50
54017A45280o19j422n40J136J638N55p07q96l0J264K309K344J081n14r26K31J971
54000A52155L273L829L554K573J732K019L066L259J841j3o86N6J331K543L830
$$ plain form
53985 184362 189728 196452 203416 208847 211571 212266 213128 215936 220689 226325 232298 238939 246571 254917 263363
53970 263363 271439 279069 286604 294565 303180 312289 321685 331160 340185 348073 354742 360748 366252 370558
53956 370558 373265 375306 378068 381682 384884 386556 386755 386171 384969 382406 377538 370340 362077 354303 347521
53941 347521 341346 335883 331983 329727 327702 324760 321691 319888 318706 315631 309310 301223 293826 288007
53927 288007 283074 278491 274517 271308 268335 265011 261407 258099 255660 254574 255186 257166 259192 259830 258925
53912 258925 257642 256975 256724 256184 255224 254183 253286 252751 252956 253688 253696 252010 249441 247802 247798 248659 249638 250594
53894 250594 251128 250685 249898 250495 253148 256439 258644 259598 260292 261692 264592 269442 275322 280091 282680 284631
53878 284631 288419 294930 303398 312943 322920 332475 341133 349480 358019 365668 370628 372599 373047 373347 373874
$$ packed form
53985A84362N366O724O964N431K724O95Q62K808M753N636N973O641P632Q346Q446
53970B63363Q076P630P535P961Q615R109R396R475R025P888O669O006N504M306
53956C70558K707K041K762L614L202J672J99n84j202k563m868p198q263p774o782
53941C47521o175n463l900k256k025k942l069j803j182l075o321q087p397n819
53927B88007m933m583l974l209k973l324l604l308k439j086O12J980K026O38r05
53912B58925j283o67k51n40r60j041q97n35K05P32Qj686k569j639mQ61R79R56
53894B50594N34m43p87N97K653L291K205R54O94J400K900M850N880M769K589J951
53878B84631L788O511Q468R545R977R555Q658Q347Q539P649M960J971M48L00N27
$$ plain form
53863 373874 374831 376610 378965 380842 381679 382243 383820 386984 391461 396741 402527 408742 415268 421810 428284
53848 428284 435385 444078 454147 463917 472113 479429 487397 496087 503903 509432 512546 513669 512982 510626
53834 510626 507009 502625 497880 493139 488585 484112 479611 475088 470173 463979 456039 446960 437528 427575
53820 427575 416567 404923 393898 384414 376706 370637 365329 359002 350582 341432 334154 329501 325699
53807 325699 320942 315174 308908 301795 293495 285076 278290 273695 270327 267159 264133 261639 259485 256794
53793 256794 252948 248381 244050 240138 235920 231265 227561 226254 226868 227441 226754 225118 223058 220407 217062
53778 217062 213617 210686 208259 206116 204290 202746 201248 199988 199835 201455 204531 208122 211366 213572
53764 213572 214159 213109 211279 209931 209886 211132 212985 214639 215739 216429 216773 216620 216408 217491 220793 225459
$$ packed form
53863C73874R57J779K355J877Q37N64J577L164M477N280N786O215O526O542O474
53848D28284P101Q693J0069R770Q196P316P968Q690P816N529L114J123o87k356
53834E10626l617m384m745m741m554m473m501m523m915o194p940r079r432r953
53820D27575j1008j1644j1025r484p708o069n308o327q420r150p278m653l802
53807C25699m757n768o266p113q300q419o786m595l368l168l026k494k154k691
53793B56794l846m567m331l912m218m655l704j307O14N73o87j636k060k651l345
53778B17062l445k931k427k143j826j544j498j260j53J620L076L591L244K206
53764B13572N87j050j830j348m5J246J853J654J100O90L44j53k12J083L302M666
$$ plain form
53748 225459 229868 233733 238021 242904 247203 250262 253029 256666 261241 266578 273205 281343 289829 297332
53734 297332 304116 311333 318894 325336 329957 333891 338607 344066 348975 352469 354995 357510 360205 362339
53720 362339 363340 363722 364525 366040 367621 368658 369063 368607 366577 362580 357179 351289 345465 340153 335914
53705 335914 332669 329310 325000 320444 316827 313854 310193 305996 303480 304168 306486 307146 304508 299749 295072
53690 295072 291683 289500 287831 286022 283954 282135 280822 278995 275019 268812 262654 259102 258512 259263 259854
53675 259854 259821 258920 256774 253617 250382 247695 245609 244473 244949 246677 248118 248503 248884 250268 251697 251447
53659 251447 249478 247287 245822 244931 244539 244816 245176 244615 243351 242918 244348 247393 251627 256935 262496 266748
53643 266748 269195 271113 273661 276264 277809 278553 279874 282794 287567 293966 300886 306290 308844 309535 310697
$$ packed form
53748B25459M409L865M288M883M299L059K767L637M575N337O627Q138Q486P503
53734B97332O784P217P561O442M621L934M716N459M909L494K526K515K695K134
53720C62339J001L82Q03J515J581J037M05m56k030l997n401n890n824n312m239
53705C35914l245l359m310m556l617k973l661m197k516O88K318O60k638m759m677
53690B95072l389k183j669j809k068j819j313j827l976o207o158l552n90P51N91
53675B59854l3r01k146l157l235k687k086j136M76J728J441L85L81J384J429k50
53659B51447j969k191j465q91l92K77L60n61j264m33J430L045M234N308N561M252
53643B66748K447J918K548K603J545P44J321K920M773O399O920N404K554O91J162
$$ plain form
53628 310697 313562 317480 321288 324413 326628 327735 327930 327966 328704 330663 333729 336920 338814 339088 339391 341640
53612 341640 345362 347814 347224 344943 343591 343892 344466 344251 343719 343404 342530 340030 336305 332981 331078 330275
53596 330275 330004 330377 331657 333396 334640 334774 333898 332749 332451 333848 336626 339487 341498 342870 344034
53581 344034 344650 344231 343188 342362 341909 341665 342320 344913 349053 352769 354495 354429 353668 352967 352758 353428 354922
53564 354922 356699 358727 362014 367437 374324 380740 385141 387598 389570 392561 396789 401199 405050 409091
53550 409091 414416 420475 425450 428722 431749 436027 441377 446921 452638 458859 465015 470013 473606 476594
53536 476594 479950 484371 490245 497367 504973 512511 519937 526886 532362 536044 539121 542863 546910 549979
53522 549979 551744 552886 553793 554506 555678 558152 561506 564259 565734 566632 567530 567990 567499 566282 564713 562897
$$ packed form
53628C10697K865L918L808L125K215J107J95L6P38J959L066L191J894K74L03K249
53612C41640L722K452n90k281j352L01N74k15n32l15q74k500l725l324j903q03
53596C30275k71L73J280J739J244J34q76j149k98J397K778K861K011J372J164
53581C44034O16m19j043q26m53k44O55K593M140L716J726o6p61p01k09O70J494
53564C54922J777K028L287N423O887O416M401K457J972K991M228M410L851M041
53550D09091N325O059M975L272L027M278N350N544N717O221O156M998L593K988
53536D76594L356M421N874P122P606P538P426O949N476L682L077L742M047L069
53522E49979J765J142R07P13J172K474L354K753J475Q98Q98M60m91j217j569j816
$$ plain form
53506 562897 561392 561487 564012 568352 573160 577468 580727 582498 582768 582174 581323 580359 579615 580000 581962 584544
53490 584544 586401 587591 589441 592712 596708 600405 603725 607385 612008 617756 624438 631581 638537 644816
53476 644816 650230 654681 658073 660663 663345 667360 673726 682829 694171 706379 717936 728423 738861
53463 738861 750478 763317 776547 789964 804439 820772 838796 857935 877984 898851 920014
53452 920014 940906 961596 982588 1004247 1026983 1051662 1078950 1108201 1137821 1166892 1195855
53441 1195855 1225506 1256069 1287593 1320489 1355096 1391065 1427639 1464287 1500684 1536456 1571371
53430 1571371 1605604 1639532 1673452 1707675 1742444 1777467 1811940 1845432 1878341 1911027 1942985
53419 1942985 1973555 2003176 2033143 2064186 2095840 2127176 2157529 2186562 2214265 2241047 2267278
$$ packed form
53506E62897j505R5K525M340M808M308L259J771K70n94q51r64p44L85J962K582
53490E84544J857J190J850L271L996L697L320L660M623N748O682P143O956O279
53476F44816N414M451L392K590K682M015O366R103J1342J2208J1557J0487J0438
53463G38861J1617J2839J3230J3417J4475J6333J8024J9139K0049K0867K1163
53452I20014K0892K0690K0992K1659K2736K4679K7288K9251K9620K9071K8963
53441A195855K9651L0563L1524L2896L4607L5969L6574L6648L6397L5772L4915
53430A571371L4233L3928L3920L4223L4769L5023L4473L3492L2909L2686L1958
53419A942985L0570K9621K9967L1043L1654L1336L0353K9033K7703K6782K6231
$$ plain form
53408 2267278 2292656 2316510 2338620 2359018 2376976 2391262 2401880 2410565 2418716 2425555 2429319 2429765
53396 2429765 2428149 2424883 2418608 2408101 2394000 2377933 2360746 2342443 2323272 2303914 2284742 2265553
53384 2265553 2245796 2224523 2200554 2173591 2144986 2116597 2089068 2062134 2036151 2011781 1988048
53373 1988048 1962467 1934121 1905551 1880563 1860784 1845157 1831845 1819642 1808187 1798124 1790817
53362 1790817 1786990 1785795 1785834 1786621 1788338 1790872 1794129 1798713 1805214 1813278 1822524 1833685 1847455 1862785
53348 1862785 1878098 1893932 1912417 1934077 1957122 1980400 2005105 2032777 2063343 2096179 2131583
53337 2131583 2170014 2210972 2253886 2299230 2347669 2398868 2452188 2507820 2566209 2626922 2689059
53326 2689059 2752295 2816786 2882541 2949569 3017981 3087304 3156409 3224821 3293207 3361789 3429195
$$ packed form
53408B267278K5378K3854K2110K0398J7958J4286J0618Q685Q151O839L764M46
53396B429765j616l266o275j0507j4101j6067j7187j8303j9171j9358j9172j9189
53384B265553j9757k1273k3969k6963k8605k8389k7529k6934k5983k4370k3733
53373A988048k5581k8346k8570k4988j9779j5627j3312j2203j1455j0063p307
53362A790817l827j195L9P87J717K534L257M584O501Q064R246J1161J3770J5330
53348A862785J5313J5834J8485K1660K3045K3278K4705K7672L0566L2836L5404
53337B131583L8431M0958M2914M5344M8439N1199N3320N5632N8389O0713O2137
53326B689059O3236O4491O5755O7028O8412O9323O9105O8412O8386O8582O7406
$$ plain form
53315 3429195 3493933 3556115 3616644 3675533 3732285 3787103 3840081 3889637 3933386 3970497 4001892
53304 4001892 4028233 4049082 4064112 4073713 4078061 4076698 4069374 4056337 4037371 4011477 3978054 3937908
53292 3937908 3892773 3844224 3793092 3739448 3683135 3624724 3565763 3507355 3448635 3387522 3323205
53281 3323205 3257315 3192545 3130687 3072067 3016190 2962525 2910848 2860930 2811898 2762447 2712213
53270 2712213 2662512 2614938 2569524 2525119 2481402 2439547 2400802 2365310 2332579 2302309 2274369
53259 2274369 2248487 2224359 2201840 2180937 2161856 2144843 2129497 2114266 2097227 2077569 2056102
53248 2056102 2034469 2014149 1995931 1979734 1965031 1951780 1940690 1932165 1925473 1919677 1914969 1912256
53236 1912256 1911748 1912940 1915860 1921269 1929542 1940213 1952717 1966856 1982485 1999513 2018312 2039394
$$ packed form
53315C429195O4738O2182O0529N8889N6752N4818N2978M9556M3749L7111L1395
53304D001892K6341K0849J5030R601M348j363p324j3037j8966k5894l3423m0146
53292C937908m5135m8549n1132n3644n6313n8411n8961n8408n8720o1113o4317
53281C323205o5890o4770o1858n8620n5877n3665n1677m9918m9032m9451n0234
53270B712213m9701m7574m5414m4405m3717m1855l8745l5492l2731l0270k7940
53259B274369k5882k4128k2519k0903j9081j7013j5346j5231j7039j9658k1467
53248B056102k1633k0320j8218j6197j4703j3251j1090q525o692n796m708k713
53236A912256n08J192K920N409Q273J0671J2504J4139J5629J7028J8799K1082
$$ plain form
53224 2039394 2062602 2087283 2113178 2140343 2168275 2196034 2223289 2250311 2276840 2301968 2325319
53213 2325319 2347355 2368321 2387897 2406209 2423934 2440675 2454204 2462325 2465116 2464699 2463171 2461158
53201 2461158 2457947 2452331 2443472 2431261 2415875 2397163 2374967 2349879 2322879 2294199 2263468 2231301
53189 2231301 2199690 2170014 2141259 2111046 2078213 2043916 2010342 1978722 1948451 1917930 1886349
53178 1886349 1854604 1824223 1795661 1768229 1741427 1715414 1690100 1664886 1639724 1615535 1593038
53167 1593038 1571796 1550958 1530322 1510288 1491414 1474367 1459480 1445875 1431946 1417445 1404182
53156 1404182 1393632 1384550 1374219 1361713 1348624 1336593 1325310 1313304 1299786 1285097 1269886
53145 1269886 1254461 1238859 1223128 1207389 1191655 1175666 1159000 1141381 1122827 1103638 1084557
$$ packed form
53224B039394K3208K4681K5895K7165K7932K7759K7255K7022K6529K5128K3351
53213B325319K2036K0966J9576J8312J7725J6741J3529Q121K791m17j528k013
53201B461158l211n616q859j2211j5386j8712k2196k5088k7000k8680l0731l2167
53189B231301l1611k9676k8755l0213l2833l4297l3574l1620l0271l0521l1581
53178A886349l1745l0381k8562k7432k6802k6013k5314k5214k5162k4189k2497
53167A593038k1242k0838k0636k0034j8874j7047j4887j3605j3929j4501j3263
53156A404182j0550r082j0331j2506j3089j2031j1283j2006j3518j4689j5211
53145A269886j5425j5602j5731j5739j5734j5989j6666j7619j8554j9189j9081
$$ plain form
53134 1084557 1066741 1050909 1036329 1021292 1005054 988792 974088 960825 947271 932094 915570
53123 915570 898744 881988 864803 846936 829387 814016 801817 791488 780229 766421 751349
53112 751349 737794 726983 717477 707191 695820 684753 675004 666165 657566 649577 642962 637337 631278
53099 631278 624057 616342 608831 601086 592423 583306 575000 568130 562322 556922 551326 544868 537417 530077
53085 530077 524427 520814 517971 514313 509088 502468 495344 489047 484374 480812 477413 474304 472249 470651
53071 470651 467437 461648 455125 450792 449819 451105 452814 453589 452726 450129 446201 441428 436126 430757 426004
53056 426004 422263 419387 417206 415819 415039 414046 412060 409049 405455 401660 398044 395137 393130 391458 389298
53041 389298 386380 383061 379907 377477 376264 376418 377576 379183 381028 383356 386431 389964 393087 395278
$$ packed form
53134A084557j7816j5832j4580j5037j6238j6262j4704j3263j3554j5177j6524
53123I15570j6826j6756j7185j7867j7549j5371j2199j0329j1259j3808j5072
53112G51349j3555j0811r506j0286j1371j1067r749q839q599p989o615n625o059
53099F31278p221p715p511p745q663r117q306o870n808n400n596o458p451p340
53085E30077n650l613k843l658n225o620p124o297m673l562l399l109k055j598
53071D70651l214n789o523m333r73J286J709P75q63k597l928m773n302n369m753
53056D26004l741k876k181j387p80r93j986l011l594l795l616k907k007j672k160
53041C89298k918l319l154k430j213J54J158J607J845K328L075L533L123K191
$$ plain form
53027 395278 397312 400533 404737 407693 407708 405922 404807 404892 404550 402774 400338 397957 395142 391552 387789
53012 387789 383899 378548 371003 362811 356141 351271 346980 342705 338896 335587 332020 327781 323423 319726
52998 319726 316817 313959 310040 304681 299061 294978 292584 289787 284598 277578 271355 268169 268297 270220
52984 270220 271682 271298 269696 268559 268197 267061 264180 260776 258404 256619 253907 250150 246660 244277 242833
52969 242833 242093 241831 241181 239320 236735 234682 233526 232806 232692 233988 236508 238646 238917 237091 233817 230029
52953 230029 226835 224990 224292 224075 224125 224362 224044 222557 220903 220964 223040 225366 226460 226842 227841 229674 231427
52936 231427 232296 232249 231784 231374 230896 229580 227048 224218 222438 221777 221215 220555 220843 222359 223496 222776 221245
52919 221245 221564 224819 229235 232238 232988 232558 232330 232924 234439 236757 239229 240811 241290 242042 244656 248932
$$ packed form
53027C95278K034L221M204K956J5j786j115Q5l42j776k436k381k815l590l763
53012C87789l890n351p545q192o670m870m291m275l809l309l567m239m358l697
52998C19726k909k858l919n359n620m083k394k797n189p020o223l186J28J923
52984B70220J462l84j602j137l62j136k881l404k372j785k712l757l490k383j444
52969B42833p40k62o50j861k585k053j156p20j14J296K520K138K71j826l274l788
52953B30029l194j845o98k17N0K37l18j487j654O1K076K326J094L82R99J833J753
52936B31427Q69m7m65m10m78j316k532k830j780o61n62o60K88J516J137p20j531
52919B21245L19L255M416L003P50m30k28N94J515K318K472J582M79P52K614M276
$$ plain form
52903 248932 253268 256926 260548 264166 266433 266873 267364 269832 273459 275930 276819 278012 281117 286158 292612
52888 292612 299803 306146 309949 311639 313808 318347 324686 331238 337105 341751 344504 345567 346543 348807
52874 348807 352015 355063 357791 360664 363373 364934 365102 364718 364529 364295 363329 361542 359718 358671 358190 357140
52858 357140 354856 352073 349960 348550 346967 344900 342894 341120 339091 336905 335685 336103 337292 337860 337431
52843 337431 336617 336015 335778 335675 335173 333871 332204 331103 330705 330152 329110 328705 330320 334098 339243 344993
52827 344993 350403 353903 354276 351998 348783 345983 344172 343854 345309 347497 348253 346325 342754 339780 338637
52812 338637 338816 339215 339489 340206 342011 344853 347940 350316 351537 351937 352221 352778 353407 353834 354334 355498 357369
52795 357369 359201 360185 360116 359238 357924 356719 356171 356330 356862 357896 359949 362642 364485 364780 364830 366213 368597
$$ packed form
52903B48932M336L658L622L618K267M40M91K468L627K471Q89J193L105N041O454
52888B92612P191O343L803J690K169M539O339O552N867M646K753J063R76K264
52874C48807L208L048K728K873K709J561J68l84j89k34r66j787j824j047m81j050
52858C57140k284k783k113j410j583k067k006j774k029k186j220M18J189N68m29
52843C37431q14o02k37j03n02j302j667j101l98n53j042m05J615L778N145N750
52827C44993N410L500L73k278l215k800j811l18J455K188P56j928l571k974j143
52812C38637J79L99K74P17J805K842L087K376J221M00K84N57O29M27N00J164J871
52795C57369J832R84o9q78j314j205n48J59N32J034K053K693J843K95N0J383K384
$$ plain form
52778 368597 370598 372111 374113 376470 377759 377444 376566 375964 375385 374881 375445 377456 379889 381988 384474 388067
52762 388067 391887 394481 395589 395797 395316 394366 394142 395846 398812 400728 399916 396728 392756 389339 386902
52747 386902 385099 383257 380781 377272 372646 367538 363265 360458 357728 352785 345197 337016 330253 324875
52733 324875 320034 316023 313760 313031 312451 310848 307889 303850 299644 296532 294817 293227 290507 287136 284481
52718 284481 282712 280744 278077 275490 273786 272750 271459 269003 265012 260082 255492 251850 248391 244263
52704 244263 239947 236423 233507 230452 227922 227658 229879 232456 233276 232209 230115 227061 222609 217239 212440
52689 212440 209400 208097 207563 206740 205246 203456 201639 199225 195579 191475 188823 188428 188886 188403 187090
52674 187090 186464 187005 187344 186087 183525 181007 179139 177392 175375 173712 173199 173556 173681 173162 172874 173824
$$ packed form
52778C68597K001J513K002K357J289l15q78o02n79n04N64K011K433K099K486L593
52762C88067L820K594J108K08m81r50k24J704K966J916q12l188l972l417k437
52747C86902j803j842k476l509m626n108m273k807k730m943p588q181o763n378
52733C24875m841m011k263p29n80j603k959m039m206l112j715j590k720l371k655
52718B84481j769j968k667k587j704j036j291k456l991m930m590l642l459m128
52704B44263m316l524k916l055k530k64K221K577Q20j067k094l054m452n370m799
52689B12440l040j303n34q23j494j790j817k414l646m104k652l95M58m83j313
52674A87090o26N41L39j257k562k518j868j747k017j663n13L57J25n19k88R50
$$ plain form
52658 173824 175814 177724 178773 179037 178898 178535 177914 176839 174949 172098 168854 166321 165259 165576 166653
52643 166653 167891 168853 169291 169352 169549 170298 171472 172577 173283 173607 173572 172960 171698 170420 170226 171702 174376
52626 174376 177374 180246 182802 184594 185388 185990 187660 190414 192787 193706 193871 194716 196722 199479 202880
52611 202880 207215 212293 217267 221386 224348 226077 226908 227958 230390 233938 236706 236918 234698 231896 230325
52596 230325 230278 230539 229633 227103 223692 220409 217566 214793 211712 208427 205488 203579 203069 203616 204295 204283
52580 204283 203298 201406 198769 195815 193278 191696 191102 191444 193005 195906 199258 201258 200482 197274 193940
52565 193940 193070 195051 197349 197095 194345 191809 191137 190823 188529 184229 179836 176647 174652 173849 174512 176147
52549 176147 177597 178423 179035 179382 178890 177965 178095 179748 181452 181914 181987 183345 185953 188222 189365 190201 191570
$$ packed form
52658A73824J990J910J049K64j39l63o21j075j890k851l244k533j062L17J077
52643A66653J238R62M38O1J97P49J174J105P06L24l5o12j262j278j94J476K674
52626A74376K998K872K556J792P94O02J670K754K373R19J65Q45K006K757L401
52611B02880M335N078M974M119K962J729Q31J050K432L548K768K12k220k802j571
52596B30325m7K61r06k530l411l283k843k773l081l285k939j909n10N47O79j2
52580B04283r85j892k637k954k537j582n94L42J561K901L352K000p76l208l334
52565A93940q70J981K298k54k750k536o72l14k294m300m393l189j995q03O63J635
52549A76147J450Q26O12L47m92r25J30J653J704M62P3J358K608K269J143Q36J369
$$ plain form
52532 191570 193144 194299 195251 196650 198548 200408 201878 202978 203692 203993 204280 205156 206558 207741 208488 209766
52516 209766 212457 215921 218688 220398 222018 224039 225633 226134 226333 227311 228690 229224 228870 229148 231203 234404
52500 234404 237259 239184 240819 242826 244963 246570 247675 249034 250902 252430 253001 253649 255991 259771 262852
52485 262852 264142 265148 267687 271207 273726 274716 275615 277823 281445 285851 290165 293326 294855 295741 297439
52470 297439 299838 301205 300421 298371 296958 297520 300296 304452 308320 310490 311096 311421 312135 312714 312761 312802 313373
52453 313373 314129 314396 313956 312900 311397 309948 309164 308831 307886 305773 303204 301227 300151 299809 300041 300365
52437 300365 299939 298627 297537 297854 299514 301561 303182 303885 303354 302074 301486 302426 303749 303688 302481 302503 305457
$$ packed form
52532A91570J574J155R52J399J898J860J470J100P14L01K87Q76J402J183P47J278
52516B09766K691L464K767J710J620K021J594N01J99R78J379N34l54K78K055L201
52500B34404K855J925J635K007K137J607J105J359J868J528N71O48K342L780L081
52485B62852J290J006K539L520K519R90Q99K208L622M406M314L161J529Q86J698
52470B97439K399J367p84k050j413N62K776M156L868K170O06L25P14N79M7M1N71
52453C13373P56K67m40j056j503j449p84l33r45k113k569j977j076l42K32L24
52437C00365m26j312j090L17J660K047J621P03n31j280n88R40J323o1j207K2K954
$$ [...]
##END NTUPLES=NMR SPECTRUM
##END=
