
##TITLE=AC1177_popayan-inza-1-cauca-CINAH12012_5890806_j3gYLsKNoV
##JCAMPDX= 6.0         $$ Bruker NMR JCAMP-DX V2.0
##DATA TYPE= NMR SPECTRUM
##DATA CLASS= NTUPLES
##ORIGIN= BRUKER
##OWNER= Administrator
$$ 1.72 TOPSPIN		Version 2.1
$$ 2012-04-02 17:08:47.843 -0500  Administrator@TOPSPIN
$$ Compression mode = diff/dup
##.OBSERVE FREQUENCY= 400.13188235
##.OBSERVE NUCLEUS= ^1H
##.ACQUISITION MODE= SIMULTANEOUS (DQD)
##.ACQUISITION SCHEME= undefined
##.AVERAGES= 64
##.DIGITISER RES= 22
##SPECTROMETER/DATA SYSTEM= spect
##.PULSE SEQUENCE= noesygpps1d.comp
##.SOLVENT NAME= COFFEE_meoh
##.SHIFT REFERENCE= INTERNAL, COFFEE_meoh, 1, 14.96848
##AUDIT TRAIL= $$ (NUMBER, WHEN, WHO, WHERE, PROCESS, VERSION, WHAT)
$$ ##TITLE= Audit trail, TOPSPIN		Version 2.1
$$ ##JCAMPDX= 5.01
$$ ##ORIGIN= Bruker BioSpin GmbH
$$ ##OWNER= Administrator
$$ $$ C:\Bruker\TOPSPIN/data/COFFEE/nmr/AC1177_popayan-inza-1-cauca-CINAH12012_5890806_j3gYLsKNoV/12/pdata/1/auditp.txt
$$ ##AUDIT TRAIL=  $$ (NUMBER, WHEN, WHO, WHERE, PROCESS, VERSION, WHAT)
(   1,<2012-04-02 17:08:42.234 -0500>,<Administrator>,<TOPSPIN>,<go>,<TOPSPIN 2.1>,
      <created by zg
	started at 2012-04-02 16:57:10.140 -0500,
	POWCHK enabled, PULCHK disabled,
       configuration hash MD5:
       1A 1E CE 29 27 FD 77 03 67 4E F0 E3 C4 B2 CB 90
       data hash MD5: 64K
       34 18 B6 B9 AD D3 C3 F2 B2 5C 4D 71 13 56 AC FC>)
(   2,<2012-04-02 17:08:45.406 -0500>,<Administrator>,<TOPSPIN>,<proc1d>,<TOPSPIN 2.1>,
      <Start of raw data processing
       efp LB = 0.3 FT_mod = 6 PKNL = 1 PHC0 = 0 PHC1 = 0 SI = 128K 
       data hash MD5: 128K
       B6 5B 6A BD CD C5 05 BD 77 D2 FD 56 3A 85 00 6C>)
(   3,<2012-04-02 17:08:46.843 -0500>,<Administrator>,<TOPSPIN>,<proc1d>,<TOPSPIN 2.1>,
      <pk PHC0 = 31.75049 PHC1 = 0 
       data hash MD5: 128K
       20 30 89 91 62 A3 6D 98 46 F6 C7 B0 E3 AF 4E BF>)
(   4,<2012-04-02 17:08:47.453 -0500>,<Administrator>,<TOPSPIN>,<proc1d>,<TOPSPIN 2.1>,
      <abs ABSG = 1 
       data hash MD5: 128K
       50 8E DE 1B 78 D3 57 58 20 CB 70 F7 DA 36 A3 12>)
(   5,<2012-04-02 17:08:47.546 -0500>,<Administrator>,<TOPSPIN>,<proc1d>,<TOPSPIN 2.1>,
      <abs ABSG = 2 
       data hash MD5: 128K
       22 9D 3C 4A 42 FD A7 E5 B5 F5 D4 12 36 92 AC 2D>)
(   6,<2012-04-02 17:08:47.609 -0500>,<Administrator>,<TOPSPIN>,<proc1d>,<TOPSPIN 2.1>,
      <abs ABSG = 3 
       data hash MD5: 128K
       40 BA 3D 79 F4 79 08 57 DE EC C8 93 4D CA ED 26>)
(   7,<2012-04-02 17:08:47.671 -0500>,<Administrator>,<TOPSPIN>,<proc1d>,<TOPSPIN 2.1>,
      <abs ABSG = 4 
       data hash MD5: 128K
       C9 56 95 DA 55 F5 A0 52 D7 04 7C 4A AE 3B C4 A9>)
(   8,<2012-04-02 17:08:47.750 -0500>,<Administrator>,<TOPSPIN>,<proc1d>,<TOPSPIN 2.1>,
      <abs ABSG = 5 
       data hash MD5: 128K
       83 63 16 65 9B 08 D0 7B BD 96 1C E4 6C EA 41 7D>)
$$ ##END=
$$ 
$$ $$ hash MD5
$$ $$ 70 56 C1 61 09 30 99 A7 CA EC 93 2F C3 48 EE 2C
##$RELAX= 
##$RELAX= 
##$RELAX= 
##$RELAX= 
##$RELAX= 
##$RELAX= 
##$RELAX= 
$$ [...]
##$TP07= 0
##$TPNAME0= <>
##$TPNAME1= <>
##$TPNAME2= <>
##$TPNAME3= <>
##$TPNAME4= <>
##$TPNAME5= <>
##$TPNAME6= <>
##$TPNAME7= <>
##$TPOAL= (0..7)
0.5 0.5 0.5 0.5 0.5 0.5 0.5 0.5
##$TPOFFS= (0..7)
0 0 0 0 0 0 0 0
##$TUNHIN= 0
##$TUNHOUT= 0
##$TUNXOUT= 0
##$USERA1= <user>
##$USERA2= <user>
##$USERA3= <user>
##$USERA4= <user>
##$USERA5= <user>
##$V9= 5
##$VALIST= <valist>
##$VCLIST= <CCCCCCCCCCCCCCC>
##$VD= 0
##$VDLIST= <DDDDDDDDDDDDDDD>
##$VPLIST= <PPPPPPPPPPPPPPP>
##$VTLIST= <TTTTTTTTTTTTTTT>
##$WBST= 2048
##$WBSW= 25
##$XGAIN= (0..3)
0 0 0 0
##$XL= 0
##$YL= 0
##$YMAX_a= 13052017
##$YMIN_a= -5860026
##$ZGOPTNS= <>
##$ZL1= 120
##$ZL2= 120
##$ZL3= 120
##$ZL4= 120
##$ABSF1= 14.96848
##$ABSF2= -5.58405
##$ABSG= 5
##$ABSL= 3
##$ALPHA= 0
##$AQORDER= 0
##$ASSFAC= 0
##$ASSFACI= 0
##$ASSFACX= 0
##$ASSWID= 0
##$AUNMP= <proc_prof1d_extract.lims>
##$AXLEFT= 0
##$AXNAME= <>
##$AXNUC= <1H>
##$AXRIGHT= 0
##$AXTYPE= 0
##$AXUNIT= <>
##$AZFE= 0.1
##$AZFW= 0.1
##$BCFW= 0
##$BC_mod= 0
##$BYTORDP= 0
##$COROFFS= 0
##$CY= 15
##$DATMOD= 1
##$DC= 0
##$DFILT= <>
##$DTYPP= 0
##$F1P= 0
##$F2P= 0
##$FCOR= 0.5
##$FTSIZE= 131072
##$FT_mod= 6
##$GAMMA= 0
##$GB= 0
##$INTBC= 1
##$INTSCL= 1
##$ISEN= 128
##$LB= 0.3
##$LEV0= 0
##$LPBIN= 0
##$MAXI= 10000
##$MC2= 0
##$MEAN= 0
##$ME_mod= 0
##$MI= 0
##$NCOEF= 0
##$NC_proc= -3
##$NLEV= 6
##$NOISF1= 0
##$NOISF2= 0
##$NSP= 0
##$NTH_PI= 0
##$NZP= 0
##$OFFSET= 14.96848
##$PC= 1
##$PHC0= 31.75049
##$PHC1= 0
##$PH_mod= 1
##$PKNL= yes
##$PPARMOD= 0
##$PPDIAG= 0
##$PPIPTYP= 0
##$PPMPNUM= 2147483647
##$PPRESOL= 1
##$PSCAL= 4
##$PSIGN= 0
##$PYNMP= <proc.py>
##$REVERSE= no
##$SF= 400.130004855252
##$SI= 131072
##$SIGF1= 0
##$SIGF2= 0
##$SINO= 400
##$SIOLD= 131072
##$SPECTYP= <>
##$SREGLST= <1H.CDCl3>
##$SSB= 0
##$STSI= 131072
##$STSR= 0
##$SW_p= 8223.68421052632
##$SYMM= 0
##$S_DEV= 0
##$TDeff= 65536
##$TDoff= 0
##$TI= <>
##$TILT= no
##$TM1= 0
##$TM2= 0
##$TOPLEV= 0
##$USERP1= <user>
##$USERP2= <user>
##$USERP3= <user>
##$USERP4= <user>
##$USERP5= <user>
##$WDW= 1
##$XDIM= 131072
##$YMAX_p= 486205925
##$YMIN_p= -429848009
##$CURPLOT= <Network HP LaserJet P1505>
##$CURPRIN= <$Network HP LaserJet P1505>
##$DFORMAT= <normdp>
##$LAYOUT= <+/1D_H.xwp>
##$LFORMAT= <normlp>
##$PFORMAT= <normpl>
##$SURQMSG= 1
$$ End of Bruker specific parameters
$$ ---------------------------------
##NTUPLES= NMR SPECTRUM
##VAR_NAME=  FREQUENCY,     SPECTRUM/REAL,   SPECTRUM/IMAG
##SYMBOL=    X,             R,               I
##VAR_TYPE=  INDEPENDENT,   DEPENDENT,       DEPENDENT
##VAR_FORM=  AFFN,          ASDF,            ASDF
##VAR_DIM=   131072,        131072,          131072
##UNITS=     HZ,            ARBITRARY UNITS, ARBITRARY UNITS
##FACTOR=    0.0627417313425165, 1,          1
##FIRST=     8223.62146879498, -3020,        -92576
##LAST=      0,             -239,            -94036
##MIN=       0,             -429848009,      0
##MAX=       8223.62146879498, 486205925,    0
$$ Real data points
##PAGE= N=1
##DATA TABLE= (X++(R..R)), XYDATA
$$ [...]
60708A545154K5252K5388K5573K4844K2878K0449J8102J5589J3050J1522J1378
$$ 1545154 1570406 1595794 1621367 1646211 1669089 1689538 1707640 1723229 1736279 1747801 1759179
60697A759179J1186R241N725K444P40M98Q49J066Q03J52m87q88j286j983k946
$$ 1759179 1770365 1779606 1785331 1787775 1788515 1789013 1789862 1790928 1791731 1791883 1791396 1790508 1789222 1787239 1784293
60682A784293m015n142o210p004p665q667j0046j1158j1622j1934j2628j3288
$$ 1784293 1780278 1775136 1768926 1761922 1754257 1745590 1735544 1724386 1712764 1700830 1688202 1674914
60670A674914j3063j1808j0177q818q001p838q285r033r583r364p812m955j929
$$ 1674914 1661851 1650043 1639866 1631048 1623047 1615209 1606924 1597891 1588308 1578944 1571132 1566177 1564248
60657A564248q7P58K191M714O486N692L257J768K106K685J989L62j156k471l994
$$ 1564248 1564161 1564919 1567110 1571824 1578310 1584002 1587259 1589027 1591133 1593818 1595807 1596169 1595013 1592542 1588548
60642A588548n337n458m210l062l843o615r129q969o260l582k968l998n305o776
$$ 1588548 1583211 1577753 1573543 1570481 1566638 1560023 1550894 1541925 1535665 1532083 1529115 1525117 1519812 1513036
60628A513036q930j1010j1515j0669j0749j3437j7819k1421k2556k1395j9560
$$ 1513036 1504106 1493096 1481581 1470912 1460163 1446726 1428907 1407486 1384930 1363535 1343975
60617A343975j8915j9983k1292k0863j8399j5406j3219j1912j1063j0335r006
$$ 1343975 1325060 1305077 1283785 1262922 1244523 1229117 1215898 1203986 1192923 1182588 1173582
60606A173582o194k263R78K245K150K088K549L229L964M692N018M668L961L357
$$ 1173582 1167388 1165125 1166103 1168348 1170498 1172586 1175135 1178364 1182328 1187020 1192038 1196706 1200667 1204024
60592A204024K971L020M003N843P499Q095P814P151O085M841M435N363O482O501
$$ 1204024 1206995 1210015 1214018 1219861 1227360 1235455 1243269 1250420 1256505 1261346 1265781 1271144 1277626 1284127
60578A284127N926O089O896P192P120Q130J0469J2510J3217J3628J5014J7003
$$ 1284127 1290053 1296142 1303038 1310230 1317350 1325480 1335949 1348459 1361676 1375304 1390318 1407321
60566A407321J8582J9785K1132K2349K2912K3287K4242K5331K5403K4496K3963
$$ 1407321 1425903 1445688 1466820 1489169 1512081 1535368 1559610 1584941 1610344 1634840 1658803
60555A658803K4481K5107K4675K3162K1254J9282J7211J5054J2661R559N574J299
$$ 1658803 1683284 1708391 1733066 1756228 1777482 1796764 1813975 1829029 1841690 1851249 1856823 1858122
60543A858122k708o860j1970j7825k3073k6683k8853l0261l0993l0682k9246k6980
$$ 1858122 1855414 1848554 1836584 1818759 1795686 1769003 1740150 1709889 1678896 1648214 1618968 1591988
60531A591988k4202k1186j8245j5549j3092j1083r879r051p156l370R23L291K985
$$ 1591988 1567786 1546600 1528355 1512806 1499714 1488631 1478752 1469701 1462545 1459175 1460098 1463389 1466374
60518A466374J469K16q44k193l301l236j941o0J844L186L251K241J800L363O306
$$ 1466374 1467843 1468059 1467215 1465022 1461721 1458485 1456544 1456484 1458328 1461514 1464765 1467006 1468806 1472169 1478475
60503A478475Q779J0065J0932J1933J2721J3078J3331J3452J2861J1573J0493
$$ 1478475 1487254 1497319 1508251 1520184 1532905 1545983 1559314 1572766 1585627 1597200 1607693
60492A607693J0086R637Q434P023O680Q127J1043J4187J5850J5139J3463J3972
$$ 1607693 1617779 1627416 1635850 1642873 1649553 1657680 1668723 1682910 1698760 1713899 1727362 1741334
60480A741334J8597K6058L3293L8371M1462M3545M5025M5402M3690L9190L2096
$$ 1741334 1759931 1785989 1819282 1857653 1899115 1942660 1987685 2033087 2076777 2115967 2148063
60469B148063K3090J2351j23j2907k2965k8130k9110k8114k6110k2609j7570j1933
$$ 2148063 2171153 2183504 2183381 2170474 2147509 2119379 2090269 2062155 2036045 2013436 1995866 1983933
60457A983933o257j58O478J2736J7603K0851K2672K3223K3080K3568K5909L0243
$$ 1983933 1977676 1977518 1983996 1996732 2014335 2035186 2057858 2081081 2104161 2127729 2153638 2183881
60445B183881L5662M0999M5480M9234N3525O0136P0019Q2545R6261J10215J24376
$$ 2183881 2219543 2260542 2306022 2355256 2408781 2468917 2538936 2621481 2717742 2827957 2952333
60434B952333J39063J54283J69754J85409K01715K19298K38259K58252K79389
$$ 2952333 3091396 3245679 3415433 3600842 3802557 4021855 4260114 4518366 4797755
60425D797755L02720L29459L59831L92547M24401M49566M59978M48008M09398
$$ 4797755 5100475 5429934 5789765 6182312 6606713 7056279 7516257 7964265 8373663
60416H373663L43695K52786J40790J5535j11622k29116l28596m05413m57451m85033
$$ 8373663 8717358 8970144 9110934 9126469 9014847 8785731 8457135 8051722 7594271 7109238
60406G109238m91639m83032m64643m39717m09799l76403l41691l07807k76045
$$ 7109238 6617599 6134567 5669924 5230207 4820408 4444005 4102314 3794507 3518462
60397C518462k46823k20223j96155j74278j54369j36894j22462j10418r8854q6837
$$ 3518462 3271639 3051416 2855261 2680983 2526614 2389720 2267258 2156840 2057986 1971149
60387A971149p5887o8101o3177n8654n2975m6881m1644l7488l4292l2417l1740
$$ 1971149 1895262 1827161 1763984 1705330 1652355 1605474 1563830 1526342 1492050 1459633 1427893
60376A427893l1002k9155k6642k4326k1971j8926j5730j3764j3506j4158j4728
$$ 1427893 1396891 1367736 1341094 1316768 1294797 1275871 1260141 1246377 1232871 1218713 1203985
60365A203985j4584j3280j0952q727p675p419o768n587m827m642l858j833L61
$$ 1203985 1189401 1176121 1165169 1156442 1148767 1141348 1134580 1128993 1124166 1119524 1115666 1113833 1114194
60352A114194J332J219J255K070L208M091M737N442O219O722O640O133N770N954
$$ 1114194 1115526 1116745 1118000 1120070 1123278 1127369 1132106 1137548 1143767 1150489 1157129 1163262 1169032 1174986
60338A174986O498P016P539Q346R317R980J0184J0258J0431J0444R893Q601O736
$$ 1174986 1181484 1188500 1196039 1204385 1213702 1223682 1233866 1244124 1254555 1264999 1274892 1283493 1290229
60325A290229M880L759L510L326K377Q74m57j646l235m777m832k884l99P05nj446
$$ 1290229 1295109 1298868 1302378 1305704 1308081 1308955 1308498 1306852 1303617 1298840 1294008 1291124 1290725 1291430 1291425 1289979
60309A289979k319j994p62L59N82L52O58J285R54k98l69K111N502P247P270P491
$$ 1289979 1287660 1285666 1284904 1285263 1285845 1286197 1286855 1288140 1289094 1288796 1288427 1290538 1296040 1303287 1310557 1318048
60293A318048Q486Q891Q252Q258J0290J3291J5184J5296J4365J3176J2301J2366
$$ 1318048 1326534 1335425 1343677 1351935 1362225 1375516 1390700 1405996 1420361 1433537 1445838 1458204
60281A458204J3275J3589J1883Q590N506L585K324J260Q80J563K644L268L598
$$ 1458204 1471479 1485068 1496951 1505541 1511047 1514632 1516956 1518216 1519096 1520659 1523303 1526571 1530169
60268A530169M443O012P705Q905R390Q985P498N118K376m82l647p126j0383j2838
$$ 1530169 1534612 1540624 1548329 1557234 1566624 1575609 1583107 1588225 1590601 1590119 1586472 1579346 1568963 1556125
60254A556125j4324j4824j4280j3104j2303j2327j2179j0463p257m026j767j91
$$ 1556125 1541801 1526977 1512697 1499593 1487290 1474963 1462784 1452321 1445064 1441038 1439271 1439080
60242A439080J069J578J086M70Q17K099L523M628N246M893L419J976K097L649
$$ 1439080 1440149 1441727 1442813 1443283 1444100 1446199 1449722 1454350 1459596 1464489 1467908 1469884 1471981 1475630
60228A475630M828M509L715M152O064Q233R605J0139J0166R669Q543P292O976
$$ 1475630 1480458 1484967 1488682 1492834 1498898 1507131 1516736 1526875 1537041 1546710 1555253 1562545 1569521
60215A569521Q147R992J0987J0597R818R828J0694J1992J3906J6652J9280K0420
$$ 1569521 1577668 1587660 1598647 1609244 1619062 1628890 1639584 1651576 1665482 1682134 1701414 1721834
60203A721834K0268K0542K2207K4561K6988L0229L4928M0013M3808M6272M9050
$$ 1721834 1742102 1762644 1784851 1809412 1836400 1866629 1901557 1941570 1985378 2031650 2080700
60192B080700N3551N9798O6892P3787P9824Q5223R1140R8601J07509J16986J26406
$$ 2080700 2134251 2194049 2260941 2334728 2414552 2499775 2590915 2689516 2797025 2914011 3040417
60181C040417J35599J44544J53405J62513J71624J79616J85499J89240J90851
$$ 3040417 3176016 3320560 3473965 3636478 3808102 3987718 4173217 4362457 4553308
60172D553308J89437J84193J75871J65885J54343J40318J23873J06288Q8089O8564
$$ 4553308 4742745 4926938 5102809 5268694 5423037 5563355 5687228 5793516 5881605 5950169
60162E950169M7839K7884J0517m445j8014k9927l8844m4171m6616m7080m5642
$$ 5950169 5998008 6025892 6036409 6031964 6013950 5984023 5945179 5901008 5854392 5807312 5761670
60151E761670m1418l3266k1127o888P060K0619L6162N4978P4749R2066J06723
$$ 5761670 5720252 5686986 5665859 5658971 5666031 5686650 5722812 5777790 5852539 5944605 6051328
60140F051328J21579J38310J54988J68322J76741J80555J80266J75750J66635
$$ 6051328 6172907 6311217 6466205 6634527 6811268 6991823 7172089 7347839 7514474
60131G514474J52847J34934J14149R1704O7906M2560J6272r568l4270n8154q0744
$$ 7514474 7667321 7802255 7916404 8008108 8076014 8118574 8134846 8125278 8091008 8032854 7952110
60120G952110r9840j13404j21643j26013j26834j23277j15289j03981q9947p2808
$$ 7952110 7852270 7738866 7617223 7491210 7364376 7241099 7125810 7021829 6931882 6859074
60110F859074n2840l1696j0713J0358L2050N3591P3664R1832J07776J19835J26062
$$ 6859074 6806234 6774538 6763825 6774183 6806233 6859824 6933488 7025320 7133096 7252931 7378993
60099G378993J26589J23309J16965J06290R0750P2558N4830L8796K4050J0625
$$ 7378993 7505582 7628891 7745856 7852146 7942896 8015454 8070284 8109080 8133130 8143755
60089H143755o77r472j5681j8298j5708p514N057K0773L9277O0053Q1809J03732
$$ 8143755 8143078 8133606 8117925 8099627 8083919 8076405 8081462 8102235 8141512 8201565 8283374 8387106
60077H387106J26605J51826J79736K09512K40323K72034L05016L39692L75918
$$ 8387106 8513711 8665537 8845273 9054785 9295108 9567142 9872158 10211850 10587768
60068A0587768M12514M47641M79899N08629N32990N51537N63185N67868N65478
$$ 10587768 11000282 11447923 11927822 12436451 12969441 13520978 14084163 14652031 15217509
60059A5217509N54677N33739N02411M62111M14391L59824K98431K30520J57005
$$ 15217509 15772186 16305925 16808336 17270447 17684838 18044662 18343093 18573613 18730618
60050A8730618P9376l84q0177j58096k32241l00336l59940m09006m46230m71103
$$ 18730618 18809994 18809610 18729433 18571337 18339096 18038760 17678820 17269814 16823584 16352481
60040A6352481m83852m85159m75683m56139m27890l92806l52284l07095k58695
$$ 16352481 15868629 15383470 14907787 14451648 14023758 13630952 13278668 12971573 12712878
60031A2712878k09683j62032j15714p0352k7656R499M0301O6476Q9049J06190
$$ 12712878 12503195 12341163 12225449 12155097 12127441 12136940 12177241 12243717 12332766 12438956
60021A2438956J15130J14998J06672R0959O8466M0922J1117j8788m8161p6943
$$ 12438956 12554086 12669084 12775756 12866715 12935181 12976103 12987220 12968432 12920271 12843328
60011A2843328j04657j30738j55243j78556k00550k20438k37497k51548k62572
$$ 12843328 12738671 12607933 12452690 12274134 12073584 11853146 11615649 11364101 11101529
60002A1101529k70137k73484k72086k65782k54569k38821k19674j98531j75870
$$ 11101529 10831392 10557908 10285822 10020040 9765471 9526650 9306976 9108445 8932575
59993H932575j51223j24628r7331p0376m3322j5356J2921M0087O5903R1246J15888
$$ 8932575 8781352 8656724 8559393 8489017 8445695 8430339 8443260 8483347 8549250 8640496 8756384
59982H756384J37791J55020J67281J74982J77853J75114J66257J51019J29412
$$ 8756384 8894175 9049195 9216476 9391458 9569311 9744425 9910682 10061701 10191113
59973A0191113J02500P2482M1244R194k3948n7788r1143j22696j51110j74992
$$ 10191113 10293613 10366095 10407339 10416533 10392585 10334797 10243654 10120958 9969848 9794856
59963I794856j93396k06033k12682k13134k08185j99706j88729j74162j54580
$$ 9794856 9601460 9395427 9182745 8969611 8761426 8561720 8372991 8198829 8044249
59954H044249j30823j05582q0558n5322k9055k238K3970M9215P4211R9840J26277
$$ 8044249 7913426 7807844 7727286 7671964 7642909 7640671 7664641 7713856 7788067 7887907 8014184
59943H014184J52770J78160K01749K23465K42915K58568K68392K71177K66659
$$ 8014184 8166954 8345114 8546863 8770328 9013243 9271811 9540203 9811380 10078039
59934A0078039K54617K34699K07397J74601J38802J01789O4011K4891j6044n7917
$$ 10078039 10332656 10567355 10774752 10949353 11088155 11189944 11253955 11278846 11262802 11204885
59924A1204885r8272j34346j64584j88643k06323k16946k19747k14421k01436
$$ 11204885 11106613 10972267 10807683 10619040 10412717 10195771 9976024 9761603 9560167
59915I560167j82304j59313j34401j08280q1022n3170k5585J643K9210N7180Q4000
$$ 9560167 9377863 9218550 9084149 8975869 8894847 8841677 8816092 8817735 8846945 8904125 8988125
59904H988125J07356J25949J40556J53206J64893J73972J77649J75388J69757
$$ 8988125 9095481 9221430 9361986 9515192 9680085 9854057 10031706 10207094 10376851
59895A0376851J63131J54830J43041J28502J14128J01358Q9392P8184O9540O4374
$$ 10376851 10539982 10694812 10837853 10966355 11080483 11181841 11271233 11349417 11418957 11483331
59885A1483331O1407O0335O4118P5937R5194J18818J45518J76360K11802K50850
$$ 11483331 11544738 11605073 11669191 11745128 11840322 11959140 12104658 12281018 12492820 12743670
59875A2743670K93092L38931L87017M33720M76244N14519N48721N76417N93515
$$ 12743670 13036762 13375693 13762710 14196430 14672674 15187193 15735914 16312331 16905846
59866A6905846N96840N84238N53291N02047M30998L42911K40905J28164R523j08395
$$ 16905846 17502686 18086924 18640215 19142262 19573260 19916171 20157076 20285240 20294763 20186368
59856B0186368k19406l19277m04830m73155n22805n54865n71560n74066n62711
$$ 20186368 19966962 19647685 19242855 18769700 18246895 17692030 17120470 16546404 15983693
59847A5983693n38981n06083m67184m23859l76572l26035k73638k20988j69381
$$ 15983693 15444712 14938629 14471445 14047586 13671014 13344979 13071341 12850353 12680972
59838A2680972j19511p1334k4471K0957O3842J02588J36098J64179J87020K04097
$$ 12680972 12561461 12490127 12465656 12486613 12550455 12653043 12789141 12953320 13140340 13344437
59828A3344437K13488K12379J98695J72281J34391Q6310K9060l5547j04221j72870
$$ 13344437 13557925 13770304 13968999 14141280 14275671 14361981 14391041 14355494 14251273 14078403
59818A4078403k37702k95706l44812l84187m14087m35036m47316m51235m47346
$$ 14078403 13840701 13544995 13200183 12815996 12401909 11966873 11519557 11068322 10620976
59809A0620976m36128m18004l94184l67052l39105l11688k84986k58765k32778
$$ 10620976 10184848 9766844 9372660 9005608 8666503 8354815 8069829 7811064 7578286
59800G578286k07020j82275j59984j40943j24597j10290r8663r0775q6151q2749
$$ 7578286 7371266 7188991 7029007 6888064 6763467 6653177 6554514 6463739 6377588 6294839
59790F294839p8876p4296o9504o4920o0745n6690n1758m5288l8457l3689l2273
$$ 6294839 6215963 6141667 6072163 6007243 5946498 5889808 5838050 5792762 5754305 5720616 5688343
59779E688343l3412l5909l9706m5228n2083n9087o4983o8696o9548o7859o4658
$$ 5688343 5654931 5619022 5579316 5534088 5482005 5422918 5357935 5289239 5219691 5151832 5087174
59768E087174o0300n4087m5844l7098k9894k4936k1435j8137j3727p076J858J1666
$$ 5087174 5026874 4972787 4926943 4889845 4859951 4835015 4813580 4795443 4781716 4774640 4776498 4788164
59756D788164K1002K9952L9028M7446N3901N8839O4372P1546P9012Q4927Q8999
$$ 4788164 4809166 4839118 4878146 4925592 4979493 5038332 5102704 5174250 5253262 5338189 5427188
59745E427188R1806R3157R2302Q9262Q4751P8846P0847O0876N0811M2945L8019
$$ 5427188 5518994 5612151 5704453 5793715 5878466 5957312 6028159 6089035 6139846 6182791 6220810
59734F220810L5180L3807L4590L8568M5736N5256O6784Q0750R7431J16579J38114
$$ 6220810 6255990 6289797 6324387 6362955 6408691 6463947 6530731 6611481 6708912 6825491 6963605
59723F963605J62342J88989K16879K45344K75421L08696L45164L83083M20720
$$ 6963605 7125947 7314936 7531815 7777159 8052580 8361276 8706440 9089523 9510243
59714I510243M57321M92059N22632N44881N52899N39261M96456M20191L12853
$$ 9510243 9967564 10459623 10982255 11527136 12080035 12619296 13115752 13535943 13848796
59705A3848796J84414M9717p6362j83106k65419l22677l56774l70853l68620l53724
$$ 13848796 14033210 14082927 14006565 13823459 13558040 13235363 12878589 12507736 12139116 11785392
59695A1785392l29412k98627k63944k27096j88971j50435j12649p6219m0625n325
$$ 11785392 11455980 11157353 10893409 10666313 10477342 10326907 10214258 10138039 10097414 10092089
59685A0092089K9091O1746R3120J24677J56799J88367K18603K48386K79208L11729
$$ 10092089 10121180 10182926 10276046 10400723 10557522 10745889 10964492 11212878 11492086 11803815
59675A1803815L45911L81916M20185M60923N04057N49458N97053O46848O98902
$$ 11803815 12149726 12531642 12951827 13412750 13916807 14466265 15063318 15710166 16409068
59666A6409068P52906Q07907Q62992R18081R73033J025897J073061J111474J139722
$$ 16409068 17161974 17969881 18832873 19750954 20723987 21749884 22822945 23934419 25074141
59657B5074141J156515J159628J147410J120813J083102J038469R91820R48799
$$ 25074141 26230656 27390284 28537694 29658507 30741609 31780078 32771898 33720697
59649C3720697R14163Q89934Q75761Q70557Q72624Q78815Q84928Q86923Q80659
$$ 33720697 34634860 35524794 36400555 37271112 38143736 39022551 39907479 40794402 41675061
59640D1675061Q60972Q22817P63800O84723N87967M76910L56860K34523J15689
$$ 41675061 42536033 43358850 44122650 44807373 45395340 45872250 46229110 46463633 46579322
59631D6579322M658r3819j74014k31834k66493k78546k67862k34969j82850j15123
$$ 46579322 46583980 46490161 46316147 46084313 45817820 45539274 45271412 45036443 44853593 44738470
59621D4738470l3106O3269J72070K89024M10541N35142O61544P86973R07815J020146
$$ 44738470 44705364 44768633 44940703 45229727 45640268 46175410 46836954 47623927 48531742 49551888
59611D9551888J118757J196753J246913J262546J236766J162406J034072Q50055
$$ 49551888 50670645 51867398 53114311 54376857 55613623 56776029 57810101 58660156
59603E8660156O12572L28158R288l25643o56046r63538j233429j454511j620269
$$ 58660156 59272728 59600886 59610174 59284531 58628485 57664947 56431518 54977007 53356738
59594E3356738j730421j789585j803946j779854j724975j648700j560500j468988
$$ 53356738 51626317 49836732 48032786 46252932 44527957 42879257 41318757 39849769
59586C9849769j383152j313393j269664j257575j275314j313290j357043j392469
$$ 39849769 38466617 37153224 35883560 34625985 33350671 32037381 30680338 29287869
59578B9287869j410425j407632j384407j342754j286405j220552j149765j076275
$$ 29287869 27877444 26469812 25085405 23742651 22456246 21235694 20085929 19009654
59570A9009654j000962r25462q52197p82664p16748o53975n94524n38934m87631
$$ 19009654 18008692 17083230 16231033 15448369 14731621 14077646 13483122 12944188 12456557
59561A2456557m41107l99808l63279l29967k98545k69142k42645k19080j97538
$$ 12456557 12015450 11615642 11252363 10922396 10623851 10354709 10112064 9892984 9695446
59552I695446j77806j61236j49386j42193j38059j35611j34899j36845j41845
$$ 9695446 9517640 9356404 9207018 9064825 8926766 8791155 8656256 8519411 8377566
59543H377566j48946j56111j61363j63998j64664j64088j61893j57182j50012
$$ 8377566 8228620 8072509 7911146 7747148 7582484 7418396 7256503 7099321 6949309
59534F949309j41416j31984j21378j09649r7914q6845p5379o2226m8344l6356
$$ 6949309 6807893 6675909 6554531 6444882 6346968 6260123 6184744 6122518 6074174 6037818
59524F037818k7303j9212r515J961J3238K2684L0350L6998M2820M7523N1202N4600
$$ 6037818 6010515 5991303 5981788 5983749 5996987 6019671 6050021 6087019 6129839 6177362 6228564 6283164
59512F283164N8442O2776O7161P1448P6142Q1869Q8756R6570J05398J15804J28189
$$ 6283164 6341606 6404382 6471543 6542991 6619133 6701002 6789758 6886328 6991726 7107530 7235719
59501G235719J42234J57170J72591J88887K06810K26485K47087K67658K88126
$$ 7235719 7377953 7535123 7707714 7896601 8103411 8329896 8576983 8844641 9132767
59492I132767L09074L30539L51711L71973L91404M09740M25477M36865M43371
$$ 9132767 9441841 9772380 10124091 10496064 10887468 11297208 11722685 12159550 12602921
59483A2602921M45424M43039M35546M22633M04792L82771L57127L28102K95317
$$ 12602921 13048345 13491384 13926930 14349563 14754355 15137126 15494253 15822355 16117672
59474A6117672K57883K16036J72641J31974R6637O6571M1125K0906P051j64r85
$$ 16117672 16375555 16591591 16764232 16896206 16992843 17059414 17100539 17121445 17128496 17128332 17127347
59463A7127347M868J7933L7869O3243R2180J22613J51901J76724J93537J99317
$$ 17127347 17132215 17150148 17188017 17251260 17343440 17466053 17617954 17794678 17988215 18187532
59453A8187532J92270J71835J37867R0079K8938m3098j22264k05407k90137l72872
$$ 18187532 18379802 18551637 18689504 18779583 18808521 18765423 18643159 18437752 18147615 17774743
59443A7774743m48189n11170n59659n93542o12946o18308o11364n94500n69301
$$ 17774743 17326554 16815384 16255725 15662183 15049237 14430929 13819565 13225065 12655764
59434A2655764n36907m99467m59776m19285l77732l35207k93425k54281k17943
$$ 12655764 12118857 11619390 11159614 10740329 10362597 10027390 9733965 9479684 9261741
59425I261741j83244j49471j16826q5319n4159k2688Q636L8787O7507R5569J23700
$$ 9261741 9078497 8929026 8812200 8726881 8672722 8650034 8658670 8697457 8764964 8860533 8984233
59414H984233J51822J79504K06556K32661K56941K78519K97176L12712L23931
$$ 8984233 9136055 9315559 9522115 9754776 10011717 10290236 10587412 10900124 11224055
59405A1224055L29020L26707L16256K96605K66600K26230J76698J19358N5687
$$ 11224055 11553075 11879782 12196038 12492643 12759243 12985473 13162171 13281529 13337216
59396A3337216j1866q0296j47545k12164k71401l21508l60771l90593m12623m26475
$$ 13337216 13325350 13245054 13097509 12885345 12613944 12292436 11931665 11541072 11128449 10701974
59386A0701974m31504m29098m21360m08700l90876l69495l47378l25684l03727
$$ 10701974 10270470 9841372 9420012 9011312 8620436 8250941 7903563 7577879 7274152
59377G274152k81423k59954k39765k19795j99288j78963j59774j41760j24722
$$ 7274152 6992729 6732775 6493010 6273215 6073927 5894964 5735190 5593430 5468708
59368E468708j09069r5256q3018p1677o0701m9790l8914k8415j8552r035M51R302
$$ 5468708 5359639 5264383 5181365 5109688 5048987 4999197 4960283 4931868 4913316 4904281 4904732 4914034
59356D914034J6432K1719K6580L3002M2139N3124O2643O6575O3449N6200M9658
$$ 4914034 4930466 4952185 4978765 5011767 5053906 5107030 5169673 5236248 5299697 5355897 5405555
59345E405555M6626M7267N1196N8332O8117P9938R4428J12262J31230J46547J55225
$$ 5405555 5452181 5499448 5550644 5608976 5677093 5757031 5851459 5963721 6094951 6241498 6396723
59334F396723J59052J62668J69946J82773K01400K24563K50198K77435L07365
$$ 6396723 6555775 6718443 6888389 7071162 7272562 7497125 7747323 8024758 8332123
59325H332123L41126L78031M16447M55890M97265N41550N88976O38913O89936
$$ 8332123 8673249 9051280 9467727 9923617 10420882 10962432 11551408 12190321 12880257
59316A2880257P40301P88691Q33829Q72991R02028R17560R18451R04701Q76283
$$ 12880257 13620558 14409249 15243078 16116069 17018097 17935657 18854108 19758809 20635092
59307B0635092Q34174P81508P22193O58794N92816N26381M62020M00877L42217
$$ 20635092 21469266 22250774 22972967 23631761 24224577 24750958 25212978 25613855 25956072
59298B5956072K84743K27432J69088J08111M3063k6945j02115j81487k62700l42966
$$ 25956072 26240815 26468247 26637335 26745446 26788509 26761564 26659449 26477962 26215262 25872296
59288B5872296m20314m93265n59703o17306o65351p05111p37911p63442p80571
$$ 25872296 25451982 24958717 24399014 23781708 23116357 22411246 21673335 20909893 20129322
59279B0129322p89405p91660p88898p80867p66010p43539p14611o81336o45084
$$ 20129322 19339917 18548257 17759359 16978492 16212482 15468943 14754332 14072996 13427912
59270A3427912o06354n65976n25411m85497m45723m05614l66292l29739k96593
$$ 13427912 12821558 12255582 11730171 11244674 10798951 10393337 10027045 9697306 9400713
59261I400713k65533k35120k05552j78209j53865j31966j11511r2042p3585n6062
$$ 9400713 9135180 8900060 8694508 8516299 8362434 8230468 8118957 8026915 7953330 7897268
59251G897268l9321k3571r273L596J5640K7249L8145M8025N7103O5498P2487P6922
$$ 7897268 7857947 7834376 7825103 7828699 7844339 7871588 7909733 7957758 8014861 8080359 8152846 8229768
59239H229768P8220P6579P2691O7693O2807N8232N2935M6332L9636L4646L1844
$$ 8229768 8307988 8384567 8457258 8524951 8587758 8645990 8698925 8745257 8784893 8819539 8851383
59228H851383L0842L2100L6483M3506N1772O1237P3217Q7859J03427J18653J33998
$$ 8851383 8882225 8914325 8950808 8994314 9046086 9107323 9180540 9268399 9371826 9490479 9624477
59217I624477J49712J64379J76478J85735J91535J91402J82910J66505J44948
$$ 9624477 9774189 9938568 10115046 10300781 10492316 10683718 10866628 11033133 11178081
59208A1178081J20435R3331O3295L0486l894l7378o7071r1584j11745j28604j41496
$$ 11178081 11298516 11391847 11455142 11485628 11481734 11444356 11377285 11285701 11173956 11045352 10903856
59197A0903856j48942j50677j47750j41314j32383j22055j10749r7940q3939p1246
$$ 10903856 10754914 10604237 10456487 10315173 10182790 10060735 9949986 9852046 9768107 9696861
59187I696861o2473n7346n3384m9279m5850m3647m1504l8065l3256k7475k0460
$$ 9696861 9634388 9577042 9523658 9474379 9428529 9384882 9343378 9305313 9272057 9244582 9224122
59176I224122j1705j149J1344K6583M5421O7863R3283J21228J51798J85345K21955
$$ 9224122 9212417 9211268 9222612 9249195 9294616 9362479 9455762 9576990 9728788 9914133 10136088
59165A0136088K60949L00874L40381L79029M16787M52632M84086N08054N21692
$$ 10136088 10397037 10697911 11038292 11417321 11834108 12286740 12770826 13278880 13800572
59156A3800572N22362N07409M74623M23126L53811K68931J71243O3701m9983j64924
$$ 13800572 14322934 14830343 15304966 15728092 16081903 16350834 16522077 16585778 16535795 16370871
59146A6370871k75863l78361m68684n42994n98092o33410o51238o54468o45044
$$ 16370871 16095008 15716647 15247963 14704969 14106877 13473467 12822229 12167761 11522717
59137A1522717o25033n97702n66234n32078m95589m57607m19429l82031l46498
$$ 11522717 10897684 10299982 9733748 9201670 8706081 8248474 7829045 7447014 7100516
59128G100516l14377k86323k60965k36480k12895j91528j72704j55556j39743
$$ 7100516 6786139 6499816 6238851 6002371 5789476 5597948 5425244 5269688 5129945
59119E129945j25758j13546j02292r1593q1556p1807o1771n1997m3632l6413k8676
$$ 5129945 5004187 4890641 4788349 4696756 4615200 4543393 4481622 4429625 4385993 4349580 4320904
59108D320904j9679j0575k576M506J1431J8434K5599L3102M0424M6408N0997N5921
$$ 4320904 4301225 4290650 4288074 4292580 4304011 4322445 4348044 4381146 4421570 4467978 4518975 4574896
59096D574896O2750P0825P8082Q3476Q7866R2676R8199J03253J06340J07253J07422
$$ 4574896 4637646 4708471 4786553 4870029 4957895 5050571 5148770 5252023 5358363 5465616 5573038
59085E573038J08278J09459J09276J06625J01562R4144Q4074P1959N9744M9016
$$ 5573038 5681316 5790775 5900051 6006676 6108238 6202382 6286456 6358415 6418159 6467175
59075F467175L9455K9577J8663P479k480r959j4449j6186j5750j3488r411l321
$$ 6467175 6506630 6536207 6554870 6562349 6559869 6549910 6535461 6519275 6503525 6490037 6480626 6477305
59063F477305N156J6384K9988M4609N8994P3155Q7882J03431J19343J35236J50895
$$ 6477305 6482461 6498845 6528833 6573442 6632436 6705591 6793473 6896904 7016247 7151483 7302378
59052G302378J65986J80554J95490K11366K27196K41531K54525K67417K80191
$$ 7302378 7468364 7648918 7844408 8055774 8282970 8524501 8779026 9046443 9326634
59043I326634K91410L00334L07251L11153L08991K98187K78394K49910K11926
$$ 9326634 9618044 9918378 10225629 10536782 10845773 11143960 11422354 11672264 11884190
59034A1884190J63900J07594M6388j6781p9726j40077j95479k44533k86587l20911
$$ 11884190 12048090 12155684 12202072 12185291 12105565 11965488 11770009 11525476 11238889 10917978
59024A0917978l46864l64673l75337l80004l79939l76523l70552l61921l50513
$$ 10917978 10571114 10206441 9831104 9451100 9071161 8694638 8324086 7962165 7611652
59015G611652l37078l22633l07600k92131k76756k61905k47175k31820k15857
$$ 7611652 7274574 6951941 6644341 6352210 6075454 5813549 5566374 5334554 5118697
59006E118697k00151j85624j72747j61428j50898j40125j28903j18154j08804
$$ 5118697 4918546 4732922 4560175 4398747 4247849 4107724 3978821 3860667 3751863
58997C751863j00741r3380q6562q0323p4275o8058o2127n7287n3675n0764m8248
$$ 3751863 3651122 3557742 3471180 3390857 3316582 3248524 3186397 3129110 3075435 3024671 2976423
58986B976423m6289m5046m4456m4423m4682m4682m4007m2934m2084m1599m0863
$$ 2976423 2930134 2885088 2840632 2796209 2751527 2706845 2662838 2619904 2577820 2536221 2495358
58975B495358l9086l5973l1923k7651k3550j9547j5709j2603j0419q184m901j352
$$ 2495358 2456272 2420299 2388376 2360725 2337175 2317628 2301919 2289316 2278897 2270713 2265812 2264460
58963B264460M96K68j9J370L596M638M015K789J699P60M09J480L794O023P246
$$ 2264460 2264956 2265224 2265205 2266575 2270171 2274809 2278824 2281613 2283312 2284072 2284481 2285961 2289755 2295778 2303024
58948B303024P731P924P639O924O780Q126J0416J2035J2087J1055R726Q327P114
$$ 2303024 2310755 2318679 2326318 2333242 2340022 2348148 2358564 2370599 2382686 2393741 2403467 2411794 2418908
58935B418908P037Q766J1318J2693J2175J1094J0991J1928J3262J5010J7293J9204
$$ 2418908 2425945 2434711 2446029 2458722 2470897 2481991 2492982 2504910 2518172 2533182 2550475 2569679
58923B569679J9642J9004J8769J9474K0371K1026K1957K3562K5563K7726K9965
$$ 2569679 2589321 2608325 2627094 2646568 2666939 2687965 2709922 2733484 2759047 2786773 2816738
58912B816738L1816L3030L4734L8403M3461M7583M9864N1825N4615N7200N8613
$$ 2816738 2848554 2881584 2916318 2954721 2998182 3045765 3095629 3147454 3202069 3259269 3317882
58901C317882O0079O3064O6585O8411O8227O7813O8629P0809P4121P8161Q1787
$$ 3317882 3377961 3441025 3507610 3576021 3644248 3712061 3780690 3851499 3925620 4003781 4085568
58890D085568Q3964Q5221Q7167R0641R5424J01528J09300J18178J26800J34664
$$ 4085568 4169532 4254753 4341920 4432561 4527985 4629513 4738813 4856991 4983791 5118455
58880E118455J42703J51789J61674J71863J82638J94676K08132K22609K37851
$$ 5118455 5261158 5412947 5574621 5746484 5929122 6123798 6331930 6554539 6792390
58871F792390K54079K71766K91130L11893L33727L56929L82285M10046M39621
$$ 6792390 7046469 7318235 7609365 7921258 8254985 8611914 8994199 9404245 9843866
58862I843866M70567N03308N38521N76318O16560O59283P04145P50074P96265
$$ 9843866 10314433 10817741 11356262 11932580 12549140 13208423 13912568 14662642 15458907
58853A5458907Q42979Q90447R37339R81131J019641J051194J073512J083341J077156
$$ 15458907 16301886 17192333 18129672 19110803 20130444 21181638 22255150 23338491 24415647
58844B4415647J051506J002906R28467Q27055O99678N48993L79051J95300M300
$$ 24415647 25467153 26470059 27398526 28225581 28925259 29474252 29853303 30048603 30052903
58835C0052903j86659l69660n36943o82761q04494r01532r73771j021868j048179
$$ 30052903 29866244 29496584 28959641 28276880 27472386 26570854 25597083 24575215 23527036
58826B3527036j056011j047984j026063r92845r51558r04814q54457q02643p51793
$$ 23527036 22471025 21423041 20396978 19404133 18452575 17547761 16693304 15890661 15138868
58817A5138868p03120o56340o11336n69161n30868m96200m64109m34041m06050
$$ 15138868 14435748 13779408 13168072 12598911 12068043 11571843 11107734 10673693 10267643
58808A0267643l80070l55779l33002l11632k91180k70900k50624k31075k13085
$$ 10267643 9887573 9531794 9198792 8887160 8595980 8325080 8074456 7843381 7630296
58799G630296j96530j80457j64465j49360j35955j23457j09968r4638p8667o3849
$$ 7630296 7433766 7253309 7088844 6939484 6803529 6680072 6570104 6475466 6396799 6332950
58789F332950n0844l9200k8344j7819p048M492J6939L0068M3326N5774O6750P6944
$$ 6332950 6282106 6242906 6214562 6196743 6189695 6194187 6211126 6241194 6284520 6340294 6407044 6483988
58777F483988Q8058J00950J14724J28174J41347J55069J69621J84744K00511K17323
$$ 6483988 6572046 6672996 6787720 6915894 7057241 7212310 7381931 7566675 7767186 7984509
58767G984509K35256K54004K73441K93873L15878L39914L65784L92749M20890
$$ 7984509 8219765 8473769 8747210 9041083 9356961 9696875 10062659 10455408 10876298
58758A0876298M51891M87205N25682N64866O04779O48145O96040P45615P93604
$$ 10876298 11328189 11815394 12341076 12905942 13510721 14158866 14854906 15600521 16394125
58749A6394125Q39853Q85389R28805R67053R98223J020661J030095J020602R88449
$$ 16394125 17233978 18119367 19048172 20015225 21013448 22034109 23064204 24084806 25073255
58740B5073255R32648Q52027P44703O11077M55172K82315R7564r2767k80079m55506
$$ 25073255 26005903 26857930 27602633 28213710 28668882 28951197 29048761 28955994 28675915 28220409
58730B8220409o12502p47324q58431r45951j010518j052163j071343j071124j056692
$$ 28220409 27607907 26860583 26002152 25056201 24045683 22993520 21922177 20851053 19794361
58721A9794361j032100r98775r57727r11592q63459q14866p66065p17578o70613
$$ 19794361 18762261 17763486 16805759 15894167 15030708 14215842 13449777 12732199 12061586
58712A2061586o26453n86017n49446n15672m83102m51211m20987l93388l68106
$$ 12061586 11435133 10849116 10299670 9783998 9300896 8849685 8428698 8035310 7667204
58703G667204l44205l21396l00078k80529k62464k45209k28252k11802j96616
$$ 7667204 7322999 7001603 6701525 6420996 6158532 5913323 5685071 5473269 5276653
58694E276653j82877j69706j56341j43357j31837j21756j12309j03499r6111r0159
$$ 5276653 5093776 4924070 4767729 4624372 4492535 4370779 4258470 4154971 4058860 3968701
58684C968701q4613p8856p3332o8670o5102o2716o1138n9133n5741n1837m9153
$$ 3968701 3884088 3805232 3731900 3663230 3598128 3535412 3474274 3415141 3359400 3307563 3258410
58673C258410m7746m6048m3649m2241m2996m4615m5089m4359m4000m4925m6509
$$ 3258410 3210664 3164616 3120967 3078726 3035730 2991115 2946026 2901667 2857667 2812742 2766233
58662B766233m7616m7763m7325m6983m7014m7126m7121m7237m7478m7268m6496
$$ 2766233 2718617 2670854 2623529 2576546 2529532 2482406 2435285 2388048 2340570 2293302 2246806
58651B246806m6035m6088m4950m1282l6901l5034l5886l6348l4479l1829l0424
$$ 2246806 2200771 2154683 2109733 2068451 2031550 1996516 1960630 1924282 1889803 1857974 1827550
58640A827550k9796k8476k6592k5350k5128k5551k6360k6903k5914k3168k0380
$$ 1827550 1797754 1769278 1742686 1717336 1692208 1666657 1640297 1613394 1587480 1564312 1543932
58629A543932j9064j8416j6711j3947j1484r679p626n096k952j451M45L401O458
$$ 1543932 1524868 1506452 1489741 1475794 1464310 1454631 1447005 1441909 1438957 1437506 1437951 1441352 1447810
58616A447810Q149Q362Q265Q547Q462O999M519K427J120p23m047p522q858p633
$$ 1447810 1455959 1464321 1472586 1481133 1489595 1496594 1501113 1503540 1504660 1503937 1499890 1492368 1483510 1475877
58602A475877n550m093l432l501m570o189o968o184m590l106j647J87K283M415
$$ 1475877 1470327 1466234 1462802 1459301 1454731 1448542 1441574 1435390 1430800 1427694 1426047 1426234 1428517 1432932
58588A432932O659Q966J1160J3706J7344K1596K4848K6554K8136L0930L4384L7264
$$ 1432932 1439591 1448557 1459717 1473423 1490767 1512363 1537211 1563765 1591901 1622831 1657215 1694479
58576A694479L9607M2358M5838M9678N3779N8294O3028O7608P2075P6688Q1502
$$ 1694479 1734086 1776444 1822282 1871960 1925739 1984033 2047061 2114669 2186744 2263432 2344934
58565B344934Q6608R2481R9577J08059J18108J30047J43697J58051J71970J84961
$$ 2344934 2431542 2524023 2623600 2731659 2849767 2979814 3123511 3281562 3453532 3638493
58555C638493J97443K10670K26175K44294K63163K80021K93453L03410L09293
$$ 3638493 3835936 4046606 4272781 4517075 4780238 5060259 5353712 5657122 5966415
58546E966415L09451L02719K88826K66815K34598J91126J38131P9113J7548m3524
$$ 5966415 6275866 6578585 6867411 7134226 7368824 7559950 7698081 7777194 7794742 7751218
58536G751218j01312j53561j98480k34215k59478k74953k82789k84401k80044
$$ 7751218 7649906 7496345 7297865 7063650 6804172 6529219 6246430 5962029 5681985
58527E681985k70863k59510k47770k34932k19633k02172j84053j66319j49474
$$ 5681985 5411122 5151612 4903842 4668910 4449277 4247105 4063052 3896733 3747259
58518C747259j34073j20383j08098r7133q8051q1090p5645p1114o7344o3938o0367
$$ 3747259 3613186 3492803 3384705 3287572 3199521 3118431 3042786 2971672 2904328 2840390 2780023
58507B780023n7161n5480n4874n3128m9210m4874m2230m1199m0639m0527m1553
$$ 2780023 2722862 2667382 2612508 2559380 2510170 2465296 2423066 2381867 2341228 2300701 2259148
58496B259148m3524m5611m7392m8544m8401m6940m5306m4276m3073m0749l7827
$$ 2259148 2215624 2170013 2122621 2074077 2025676 1978736 1933430 1889154 1846081 1805332 1767505
58485A767505l5432l3630l1744k9590k7351k5000k2757k1250k0448j9350j7595
$$ 1767505 1732073 1698443 1666699 1637109 1609758 1584758 1562001 1540751 1520303 1500953 1483358
58474A483358j6185j5738j5239j3699j1801j0537r354p215m683l472m243o028
$$ 1483358 1467173 1451435 1436196 1422497 1410696 1400159 1390805 1383590 1378907 1375435 1371192 1365164
58462A365164p471p722o796n745n860p033p856p921q711j1294j4428j6167j6216
$$ 1365164 1357693 1349971 1343175 1337430 1331570 1324537 1316681 1308760 1300049 1288755 1274327 1258160 1241944
58449A241944j5478j4307j2609j0923j0118j0411j1291j1788j0537o968k889j242
$$ 1241944 1226466 1212159 1199550 1188627 1178509 1168098 1156807 1145019 1134482 1127514 1124625 1123383
58437A123383k436l696l013j853k462m345n334m790l862l513l945n100o274o166
$$ 1123383 1120947 1117251 1114238 1112385 1109923 1105578 1100244 1095454 1091592 1088079 1084134 1079034 1072760 1066594
58423A066594m530k794j974j301j14M52p54k797l891l631k670j495q04j604l487
$$ 1066594 1062064 1059270 1057296 1055995 1055881 1056333 1055579 1052782 1048891 1045260 1042590 1041095 1040291 1038687 1035200
58408A035200m275k847p98N1M7J27j7m10M97L408O321P271P134P545P987P383
$$ 1035200 1030925 1028078 1027280 1027331 1027378 1027505 1027488 1027078 1027575 1030983 1037304 1044575 1051709 1059254 1067241 1074624
58392A074624O579O547N987L717J581J785K803J441k166n077o114o622p320p758
$$ 1074624 1081203 1087750 1093737 1097454 1099035 1100820 1103623 1105064 1102898 1097821 1091707 1085085 1077765 1070007
58378A070007q355r848j1003r886p105n054m391m053m014m915n579m203j778r97
$$ 1070007 1061652 1051804 1040801 1030915 1023810 1018756 1014365 1010312 1006298 1001383 995804 991601 989823 988826
58364I88826j947k187j113p07j505j267J302M375N732N486N109N577P131R393
$$ 988826 986879 984692 983579 982872 981367 980100 981402 985777 991509 996995 1002104 1007681 1014812 1024205
58350A024205J1282J2043J2143J2076J1199R449Q821J0840J3675J4498J3663J3604
$$ 1024205 1035487 1047530 1059673 1071749 1082948 1092397 1101218 1112058 1125733 1140231 1153894 1167498
58338A167498J4558J4657J3670J3163J3190J2165R943P843N749K538p22j599n13
$$ 1167498 1182056 1196713 1210383 1223546 1236736 1248901 1258844 1266687 1272436 1274974 1274252 1272653 1272140
58325A272140n67k580l918l175k446l628n400n556l910j486J086L185M074M172
$$ 1272140 1271573 1268993 1265075 1261900 1259454 1255826 1250426 1244870 1240960 1239474 1240560 1243745 1247819 1251991
58311A251991M876O538Q083Q938R657J0502J1103J1588J2351J2871J2485J2001
$$ 1251991 1256867 1263405 1271488 1280426 1290083 1300585 1311688 1323276 1335627 1348498 1360983 1372984
58299A372984J2623J3769J3947J3224J2678J2141J0740R043Q316Q276P838P266
$$ 1372984 1385607 1399376 1413323 1426547 1439225 1451366 1462106 1471149 1479465 1487741 1495579 1502845
58287A502845P267P062N873N124O371Q326Q881Q695R624J0985J0828R625R239
$$ 1502845 1510112 1517174 1523047 1528171 1534542 1542868 1551749 1560444 1570068 1581053 1591881 1601506 1610745
58274A610745R568R673J0640J3476J6087J6404J6591J9434K2669K2383K0206K1041
$$ 1610745 1620313 1629986 1640626 1654102 1670189 1686593 1703184 1722618 1745287 1767670 1787876 1808917
58262A808917K4811K6935K6424K6866K9283L0501K9275K7808K6601K3841K0680
$$ 1808917 1833728 1860663 1887087 1913953 1943236 1973737 2003012 2030820 2057421 2081262 2101942
58251B101942K0838K3886K5071K3143K2189K4167K5806K4894K3831K4667K6047
$$ 2101942 2122780 2146666 2171737 2194880 2217069 2241236 2267042 2291936 2315767 2340434 2366481
58240B366481K7165K9637L3424L5877L6671L8704M2545M5131M5447M6258M8617
$$ 2366481 2393646 2423283 2456707 2492584 2529255 2567959 2610504 2655635 2701082 2747340 2795957
58229B795957N0000M9576N0019N2444N4709N6087N8387O1255O1932O0777O1301
$$ 2795957 2845957 2895533 2945552 2997996 3052705 3108792 3167179 3228434 3290366 3351143 3412444
58218C412444O3874O5330O5421O7167P0217P1069P0689P4092Q1185Q6134Q7553
$$ 3412444 3476318 3541648 3607069 3674236 3744453 3815522 3886211 3960303 4041488 4127622 4215175
58207D215175R0834R8219J05341J10287J17237J27751J37068J42764J48851J57570
$$ 4215175 4306009 4404228 4509569 4619856 4737093 4864844 5001912 5144676 5293527 5451097
58197E451097J65343J70625J77536J87984J98485K08272K21810K39497K55037
$$ 5451097 5616440 5787065 5964601 6152585 6351070 6559342 6781152 7020649 7275686
58188G275686K66138K78512K95185L11406L24715L40033L59838L79148L95559
$$ 7275686 7541824 7820336 8115521 8426927 8751642 9091675 9451513 9830661 10226220
58179A0226220M14365M38494M63462M87298N14882N47213N77615O04268O34782
$$ 10226220 10640585 11079079 11542541 12029839 12544721 13091934 13669549 14273817 14908599
58170A4908599O72505P10514P45466P84627Q32251Q82002R30108R82599J042456
$$ 14908599 15581104 16291618 17037084 17821711 18653962 19535964 20466072 21448671 22491127
58161B2491127J103938J167442J244669J340549J445701J555209J678050J819139
$$ 22491127 23595065 24762507 26007176 27347725 28793426 30348635 32026685 33845824
58153C3845824J970707K131551K314790K525213K749990K984266L243956L540620
$$ 33845824 35816531 37948082 40262872 42788085 45538075 48522341 51766297 55306917
58145E5306917L868963M234509M667136N190326N804915O520665P372701Q388883
$$ 55306917 59175880 63410389 68077525 73267851 79072766 85593431 92966132 101355015
58137A01355015R577871J0967207J2601520J4467316J6464826J8491884K0523060
$$ 101355015 110932886 121900093 134501613 148968929 165433755 183925639 204448699
58130B04448699K2620859K4985525K7976634L1738773L5420061L6839816L3486419
$$ 204448699 227069558 252055083 280031717 311770490 347190551 384030367 417516786
58123D17516786K4364680J1009756l356367j5700836k4451891k9503098l1548347
$$ 417516786 441881466 452891222 449534855 433834019 409382128 379879030 348330683
58116C48330683l1504189l0200790k8229407k5926452k3477395k1011596j8614516
$$ 348330683 316826494 286625704 258396297 232469845 208992450 187980854 169366338
58109A69366338j6328599j4189697j2238255j0482825q888629p417459o052990
$$ 169366338 153037739 138848042 126609787 116126962 107238333 99820874 93767884
58102I3767884m787758l622354k578292j675711r11208l17535m0937k69042j026999
$$ 93767884 88980126 85357772 82779480 81103769 80192561 79875026 79834089 79565047 78538048
58093G8538048k086069l116334l904347m405955m653938m689033m563404m340204
$$ 78538048 76451979 73335645 69431298 65025343 60371405 55682372 51118968 46778764
58085D6778764m064455l755108l426362l095416k771733k459916k172210j921463
$$ 46778764 42714309 38959201 35532839 32437423 29665690 27205774 25033564 23112101
58077B3112101j705080j511786j340245j196297j076750r71400q77902q00875
$$ 23112101 21407021 19895235 18554990 17358693 16281943 15310543 14432641 13631766
58069A3631766p39411o87736o44750o11225n81185n47264n11264m79255m50038
$$ 13631766 12892355 12204619 11559869 10948644 10367459 9820195 9308931 8829676 8379638
58060H379638m18558l86613l59695l36649l12417k88301k70174k58866k50551
$$ 8379638 7961080 7574467 7214772 6878123 6565706 6277405 6007231 5748365 5497814
58051E497814k44011k39769k34892k26105k15377k05885j95916j83004j70056
$$ 5497814 5253803 5014034 4779142 4553037 4337660 4131775 3935859 3752855 3582799
58042C582799j60721j52818j43062j33761j27927j22379j13124j03253r7899r5338
$$ 3582799 3422078 3269260 3126198 2992437 2864510 2742131 2629007 2525754 2427855 2332517
58032B332517r0764q4978q1527p8798p2957o5670o1121n8227n3477m8656m7875
$$ 2332517 2241753 2156775 2075248 1996450 1923493 1857823 1796702 1738475 1684998 1636342 1588467
58021A588467m9294m7804m3889m2054m2040l9500l4432l1382l1476l1196k8954
$$ 1588467 1539173 1491369 1447480 1405426 1363386 1323886 1289454 1258072 1226596 1195400 1166446
58010A166446k6766k5329k3180k0663j9516j8848j6440j3390j2607j3504j3120
$$ 1166446 1139680 1114351 1091171 1070508 1050992 1032144 1015704 1002314 989707 976203 963083
57999I63083j1681j2029j4123j5049j4127j3413j3399j2561j0951j0237j0392
$$ 963083 951402 939373 925250 910201 896074 882661 869262 856701 845750 835513 825121
57988H25121r879q611p500o067l627j603j378j490k37Q16m51k520k646j434r81
$$ 825121 815242 806631 799131 793064 789437 787834 786456 784966 784729 785545 785094 782574 779928 778494 777513
57973G77513o02J209K458K37l750n034k923q05p30j811l125m328m220k401j265
$$ 777513 776911 778120 780578 780815 777065 772031 769108 768303 767573 765762 762637 758309 754089 751688 750423
57958G50423k852n212n590n232o724q488p013l323j979m172o682p470p701q144
$$ 750423 747571 742359 736769 731537 724813 716325 709312 705989 704010 699838 693156 685686 677985 669841
57944F69841p945p234p213p477o520m622l050j193K054N027N120L098J837J654
$$ 669841 661896 654662 647449 639972 633452 628830 625780 624587 626641 631668 636788 639886 641723 643377
57930F43377P02q88j464j602l169n207n048l121k288k680j725P07J732M89n47
$$ 643377 644079 643191 641727 640125 636956 631749 626701 623580 621292 618612 616887 617594 619326 619815 619268
57915F19268L7Q06Q01J027J768J801R74N76N51o86l250n360o086n928m942l069
$$ 619268 619305 620111 620912 621939 623707 625508 626482 627058 627609 626923 623673 618313 612227 606299 601357 598288
57899E98288j837k683m144l994l400n206q686j0241r240q719r857j0057p589m223
$$ 598288 596451 593768 589624 585630 582230 577024 568338 558097 548857 540138 530281 520224 512635 508412
57885E08412j927k73J476K612K625K245J902J146P1o37j057j520j326k61l86l431
$$ 508412 506485 506212 507688 510300 512925 515170 517072 518218 518289 517652 516595 515075 513749 513488 513102 509671
57869E09671p409r002q377q123q469p605o008n977p125o795m894l814l599j933
$$ 509671 502262 493260 484883 476760 468291 460686 454678 448701 441576 434781 429887 426073 422474 420541
57855D20541Q29J626M09P23L473N245M485M324O974R938J0499R846R943R877Q199
$$ 420541 421370 422996 423405 424128 427601 432846 437331 441655 448629 458567 469066 478912 488855 498732 506931
57840E06931N888M356L176J992J847K588J837j257m110m711m729o328q647r941
$$ 506931 512819 517175 520351 522343 524190 526778 528615 527358 523248 518537 513808 507480 498833 488892
57826D88892j0666j1800j2241j0513p481n186m440n050o687p985o830l194J51
$$ 488892 478226 466426 454185 443672 436191 431005 426565 421515 414828 406843 400013 396819 396970
57813C96970J201J058J444K178K603L266M504N402N653O330P578P832O715O061
$$ 396970 398171 399229 400673 402851 405454 408720 413224 418626 424279 430609 438187 446019 452734 458795
57799D58795O565O162L565P15l47n10j251j816j176o32j804l859n124n830o995
$$ 458795 465360 471522 475087 475802 475455 474945 473694 471878 470702 470070 468266 464407 459283 453453 446458
57784D46458q250q843r302j0037r977q585p451p815q245p000n037m418n171n959
$$ 446458 438208 429365 420063 410026 400049 391464 384013 376198 367953 360953 355916 351498 346327 340368
57770C40368o445o984p259p184p707q891q909o881m943n336p155q273q687r331
$$ 340368 333923 326939 319680 312496 304789 295898 286989 280108 275165 269829 262674 254401 245714 236383
57756B36383r395p742n717n497o529o543n422n127o121o568n296l190j429o9J315
$$ 236383 226988 219246 213529 208032 201503 194960 189538 184411 178290 171722 166426 163236 161807 161738 163053
57741A63053K995M946O510O750O104O511Q577R978Q396M940K661K636L536M203
$$ 163053 166048 170994 177504 184254 190358 196869 205446 215424 223820 228760 231421 234057 237593 241796
57727B41796M618M774M570M495M888M932L788K042O88n01k121l583l996l808l959
$$ 241796 246414 251188 255758 260253 265141 270073 273861 275903 276591 276090 273969 270386 266390 262582 258623
57712B58623m254m091l954m490n039m760m174l917l182j350Nq15k406j711J680
$$ 258623 254369 250278 246324 241834 236795 232035 227861 223944 220762 219412 219417 218602 216196 214485 216165
57697B16165N123O706P069P338P444P024O371N845N481N360N490N478N097M851
$$ 216165 221288 227994 235063 242401 249845 256869 263240 269085 274566 279926 285416 290894 295991 300842
57683C00842N108N321N087N126O148P501Q198Q335Q299P661O371N870P319R652
$$ 300842 305950 311271 316358 321484 327632 335133 343331 351666 359965 367626 373997 379867 387186 396838
57669C96838J0995J1141J0931J0461R794J0335J3068J6284J7439J6645J6078J6518
$$ 396838 407833 418974 429905 440366 450160 460495 473563 489847 507286 523931 540009 556527
57657E56527J6963J7232J8319K0023K0773K0125J9561K0411K2660K5764K9017
$$ 556527 573490 590722 609041 629064 649837 669962 689523 709934 732594 758358 787375
57646G87375L1243L1975L2734L5348L9227M2265M4208M6890N1106N5562N9367
$$ 787375 818618 850593 883327 918675 957902 1000167 1044375 1091265 1142371 1197933 1257300
57635A257300O3415O8635P4580Q0501Q6488R3004J00404J09121J19353J30594
$$ 1257300 1320715 1389350 1463930 1544431 1630919 1723923 1824327 1933448 2052801 2183395
57625B183395J42478J55615J70440J85936K00991K16239K32657K49183K63808
$$ 2183395 2325873 2481488 2651928 2837864 3038855 3255094 3487751 3736934 4000742
57616D000742K76269K87034K94161K94024K85199K69032K46502K17543J83458
$$ 4000742 4277011 4564045 4858206 5152230 5437429 5706461 5952963 6170506 6353964
57607F353964J46237J04301N2357j2318q5176j57264k20579k69676l01164l14761
$$ 6353964 6500201 6604502 6656859 6644541 6559365 6402101 6181522 5911846 5610682 5295921
57597E295921l14036l04227k89428k72098k53521k33638k11913j89391j68538
$$ 5295921 4981885 4677658 4388230 4116132 3862611 3628973 3417060 3227669 3059131
57588C059131j50275j33019j15665r9562q6145p4565o3322n2472m2410l2246k1568
$$ 3059131 2908856 2775837 2660172 2560610 2474465 2399900 2336578 2284106 2241696 2209450 2187882
57577B187882j2326o298j669N232J5156K5379L3794M1188M9079N7604O6393P5921
$$ 2187882 2175556 2169258 2167589 2172821 2187977 2213356 2247150 2288338 2337417 2395021 2461414 2537335
57565B537335Q6850R8988J11646J24312J36461J47499J57509J67384J77489J86489
$$ 2537335 2624185 2723173 2834819 2959131 3095592 3243091 3400600 3567984 3745473 3931962
57555C931962J92080J92588J87368J75950J57516J31592R8884O0960J9302k4754
$$ 3931962 4124042 4316630 4503998 4679948 4837464 4969056 5067940 5128900 5148202 5123448
57545E123448o8919j09532j43134j68758j88029k02759k12814k16751k14342k07803
$$ 5123448 5054529 4944997 4801863 4633105 4445076 4242317 4029503 3812752 3598410 3390607
57535C390607k00206j92857j84691j74429j62633j51007j40120j29091j17728
$$ 3390607 3190401 2997544 2812853 2638424 2475791 2324784 2184664 2055573 1937845
57526A937845j07515r9592r2809q5001p5855o7289o1135n7411n4744n1632m7288
$$ 1937845 1830330 1730738 1637929 1552928 1477073 1409784 1348649 1291238 1236494 1184862 1137574
57515A137574m2049l7057l3170l0251k7759k5493k3350k0978j8420j6350j4849
$$ 1137574 1095525 1058468 1025298 995047 967288 941795 918445 897467 879047 862697 847848
57504H47848j2714r079n129k857k476k471j792p14M61K091M398P004R423J1318
$$ 847848 835134 826055 820926 818069 815593 813122 811330 810616 811077 813168 817566 824570 833993 845311
57490H45311J2370J2817J3815J6189J9122K1213K2601K4737K8190L1976L5170
$$ 845311 857681 870498 884313 900502 919624 940837 963438 988175 1016365 1048341 1083511
57479A083511L8065M1495M5921N1257N6924O2232O7316P3143P9961Q6747R3231
$$ 1083511 1121576 1163071 1208992 1260249 1317173 1379405 1446721 1519864 1599825 1686572 1779803
57468A779803J01105J11498J22446J31111J37656J44361J51361J56042J56628
$$ 1779803 1880908 1992406 2114852 2245963 2383619 2527980 2679341 2835383 2992011
57459B992011J53512J46682J34631J16725R4113O7385L5819K72l5382o7240r4147
$$ 2992011 3145523 3292205 3426836 3543561 3637674 3705059 3740878 3741150 3705768 3638528 3544381
57448C544381j16278j33063j43974j49910j52070j50688j46180j40179j33979
$$ 3544381 3428103 3295040 3151066 3001156 2849086 2698398 2552218 2412039 2278060
57439B278060j27115j18855j09987j01635r3342q3937p3648o3970n5884m9281
$$ 2278060 2150945 2032090 1922103 1820468 1727126 1643189 1569541 1505571 1449687 1400406
57429A400406m3627l8207l2191k5304j8084j1123m620J069N603R696J4770K0978
$$ 1400406 1356779 1318572 1286381 1261077 1242993 1231870 1227250 1228319 1233922 1243618 1258388 1279366
57417A279366K6833L1413L5478L9682M3452M6651N0831N7265O5076P2790Q0628
$$ 1279366 1306199 1337612 1373090 1412772 1456224 1502875 1553706 1610971 1676047 1748837 1829465
57406A829465Q9618R9347J08281J15781J22353J28282J33104J35947J35329J29274
$$ 1829465 1919083 2018430 2126711 2242492 2364845 2493127 2626231 2762178 2897507 3026781
57396C026781J16702R8263P5074M7496J6151j6881m9139p9359j06742j29491j45696
$$ 3026781 3143483 3241746 3316820 3364316 3380467 3363586 3314447 3235088 3128346 2998855 2853159
57385B853159j55463j60944j64239j65943j65274j60882j52122j40387j28667
$$ 2853159 2697696 2536752 2372513 2206570 2041296 1880414 1728292 1587905 1459238
57376A459238j19082j11345j04068r6508q8426p9646p0899o3841n8938n4453m8985
$$ 1459238 1340156 1228811 1124743 1028235 939809 860163 789264 725423 666485 612032 563047
57365E63047m3789m0720l8984l6066l1488k7371k5252k4272k2848k0578j7942
$$ 563047 519258 478538 439554 403488 372000 344629 319377 295105 272257 251679 233737
57354B33737j5334j3023j1254j0018r110q415p715o574m947l419k256r32O05J102
$$ 233737 218403 205380 194126 184108 174998 166583 158868 152294 147347 143928 141672 140740 141345 142447
57340A42447k36j990k123j029j147l448n986o561n487m826n575o527n858l254
$$ 142447 142211 140221 138098 137069 135922 132474 126488 119927 114440 109614 104039 97512 91654 88400
57326H8400l07J155Q54m2m63k54L99J420K554L465M388N764P146P561P175P193
$$ 88400 88093 89248 90102 90060 89597 89343 89742 91162 93716 97181 101569 107333 114479 122040 129215 136408
57310A36408P842Q055P636P795Q550P765M366P20k71R06J515O14l00O3J586L861
$$ 136408 144250 152305 159941 167736 176286 184051 188417 189137 188866 189772 191287 191901 191601 191664 193250 197111
57294A97111O543Q657R279Q791Q168P431O221N294N832P562R052R462Q753O895
$$ 197111 203654 212311 221590 230381 238549 245980 252201 257495 263327 270889 279941 289403 298156 305051
57280C05051M484L395M952P901R937J0577J0778J0618R720R231J0629J2813J3199
$$ 305051 309535 312930 317882 325783 335720 346297 357075 367693 377413 386644 397273 410086 423285
57267D23285J1750J1082J2118J2681J1364J0000J0696J2697J3935J4078J4243
$$ 423285 435035 446117 458235 470916 482280 492280 502976 515673 529608 543686 557929
57256E57929J4958J5917J6893J7544J7104J5442J3706J3013J3107J3131J3013
$$ 557929 572887 588804 605697 623241 640345 655787 669493 682506 695613 708744 721757
57245G21757J3257J3943J4772J5748J7158J9100K1370K3674K5829K7959L0369
$$ 721757 735014 748957 763729 779477 796635 815735 837105 860779 886608 914567 944936
57234I44936L2850L4546L5140L5660L7222L9531M1667M3836M6898N0520N3419
$$ 944936 977786 1012332 1047472 1083132 1120354 1159885 1201552 1245388 1292286 1342806 1396225
57223A396225N5413N7659O0785O4238O7583P0939P3875P5308P4808P2664O8529
$$ 1396225 1451638 1509297 1570082 1634320 1701903 1772842 1846717 1922025 1996833 2069497 2138026
57212B138026O1467N1592M0248K8397J6288M774m807j2444j9381k5813l0343l2131
$$ 2138026 2199493 2251085 2291333 2319730 2336018 2340792 2335985 2323541 2304160 2278347 2248004 2215873
57200B215873l1887l0158k6590k1628j7090j3892j0774o450j597K347N042O971
$$ 2215873 2183986 2153828 2127238 2105610 2088520 2074628 2063854 2057404 2055807 2058154 2063196 2070167
57188B070167Q730J1556J6990K4597L1345L4777L5823L7051L9114M0492M0050
$$ 2070167 2078897 2090453 2107443 2132040 2163385 2198162 2233985 2271036 2310150 2350642 2390692
57177B390692L8158L5569L2619K9736K7632K6607K6090K5219K3886K3216K4535
$$ 2390692 2428850 2464419 2497038 2526774 2554406 2581013 2607103 2632322 2656208 2679424 2703959
57166B703959K7526L0005L0410K9889L0673L3002L5378L7425M0342M4323M7870
$$ 2703959 2731485 2761490 2791900 2821789 2852462 2885464 2920842 2958267 2998609 3042932 3090802
57155C090802N0310N2801N5878N8048N8234N7853N8819O0690O1284N9418N5833
$$ 3090802 3141112 3193913 3249791 3307839 3366073 3423926 3482745 3543435 3604719 3664137 3719970
57144C719970N2113M9493M8082M6733M4396M1754M0371M0167L9440L7611L6008
$$ 3719970 3772083 3821576 3869658 3916391 3960787 4002541 4042912 4083079 4122519 4160130 4196138
57133D196138L5369L4613L3021L1557L0873K9905K7678K4721K1392J6700J0149
$$ 4196138 4231507 4266120 4299141 4330698 4361571 4391476 4419154 4443875 4465267 4481967 4492116
57122D492116L117l041q571j3745j7594j9759k1777k4887k8160l0429l2237l4303
$$ 4492116 4495233 4492192 4483621 4469876 4452282 4432523 4410746 4385859 4357699 4327270 4295033 4260730
57110D260730l5972l7161l9947m6071n4513o3425p2679q2338r0625r5971r9414
$$ 4260730 4224758 4187597 4147650 4101579 4047066 3983641 3910962 3828624 3737999 3642028 3542614
57099C542614j02495j04481j04382j03935j05414j07943j09185j09634j11782
$$ 3542614 3440119 3335638 3231256 3127321 3021907 2913964 2804779 2695145 2583363
57090B583363j15857j19775j22855j26333j30478j34418j38846j45868j55893
$$ 2583363 2467506 2347731 2224876 2098543 1968065 1833647 1694801 1548933 1393040
57081A393040j67302j79412j93294k09411k26711A72648h9233k79263k96272l13989
$$ 1393040 1225738 1046326 853032 643621 416910 172648 -89233 -368496 -664768 -978757
57071i78757l33672l55328l78896m05618m36316m69710n04772n43155n86619o33835
$$ -978757 -1312429 -1667757 -2046653 -2452271 -2888587 -3358297 -3863069 -4406224 -4992843 -5626678
57061e626678o83033p36177p96945q65900r41455j024299j116786j219155j330786
$$ -5626678 -6309711 -7045888 -7842833 -8708733 -9650188 -10674487 -11791273 -13010428 -14341214
57052a4341214j454418j594705j753380j930309k128436k353062k607211k892989
$$ -14341214 -15795632 -17390337 -19143717 -21074026 -23202462 -25555524 -28162735 -31055724
57044c1055724l217096l590027m020595m516636n090761n760609o544651p462155
$$ -31055724 -34272820 -37862847 -41883442 -46400078 -51490839 -57251448 -63796099 -71258254
57036g1258254q533274r770051j1165630j2693355j4310321j5961488j7600102
$$ -71258254 -79791528 -89561579 -100727209 -113420564 -127730885 -143692373 -161292475
57029a61292475j9214943k0802067k2264083k3364083k3874775k3821236k3503489
$$ -161292475 -180507418 -201309485 -223573568 -246937651 -270812426 -294633662 -318137151
57022c18137151k3168859k2637917k1311612j8593570j4323998q857841k817061
$$ -318137151 -341306010 -363943927 -385255539 -403849109 -418173107 -427030948 -429848009
57015d29848009L202305Q781496J3692431J7839115K1177771K3669426K5297912
$$ -429848009 -426645704 -417864208 -404171777 -386332662 -365154891 -341485465 -316187553
57008c16187553K6113178K6229111K5772848K4848378K3546225K1964194K0204454
$$ -316187553 -290074375 -263845264 -238072416 -213224038 -189677813 -167713619 -147509165
57001a47509165J8359020J6505363J4707124J3009517J1437499J0003950Q717140
$$ -147509165 -129150145 -112644782 -97937658 -84928141 -73490642 -63486692 -54769552
56994e4769552P578563O580111N708854M952176M296643L727351L232924K807842
$$ -54769552 -47190989 -40610878 -34902024 -29949848 -25653205 -21925854 -18692930 -15885088
56986a5885088K446519K138319J871597J639572J438853J265095J113475R81179
$$ -15885088 -13438569 -11300250 -9428653 -7789081 -6350228 -5085133 -3971658 -2990479
56978b990479Q65965P64077O72478i6509D25585M62757M10420L64323L25228K92235
$$ -2990479 -2124514 -1360437 -687959 -96509 425585 888342 1298762 1663085 1988313 2280548
56968B280548K62773K34993K08185J81835J56219J32783J11874R1359O9580M8349
$$ 2280548 2543321 2778314 2986499 3168334 3324553 3457336 3569210 3660569 3730149 3778498
56958C778498L0496J5825K441q936j5492j7077j7124j8243j9547j9021j5886r911
$$ 3778498 3808994 3824819 3827260 3818324 3802832 3785755 3768631 3750388 3730841 3711820 3695934 3686023
56946C686023j157Q334J5409K0357K7651L8474M3498K7380j7414q2378j49046
$$ 3686023 3684866 3693200 3708609 3728966 3756617 3795091 3838589 3865969 3848555 3766177 3617131
56935C617131k01897k35124k49910k49458k37708k19882k00834j82278j63172
$$ 3617131 3415234 3180110 2930200 2680742 2443034 2223152 2022318 1840040 1676868
56926A676868j43080j23872j07573r4131q2533p3052o6868o3890o2377o0724n8514
$$ 1676868 1533788 1409916 1302343 1208212 1125679 1052627 985759 921869 859492 798768 740254
56915G40254n5708n1943m7027m1386l5661l0237k5294k0751j6106j0843n040O95
$$ 740254 684546 632603 585576 544190 508529 478292 452998 432247 416141 405298 400258 400953
56903D00953N857J0203J3636J6516J9805K4018K8142L0383K9976K7413K3156J7311
$$ 400953 406810 417013 430649 447165 466970 490988 519130 549513 579489 606902 630058 647369
56891F47369J0740N113J294j446l899n536n454l874j846O4J859L252L818L923
$$ 647369 658109 663222 664516 663070 659171 653635 648181 644307 642461 642525 644384 647636 651454 655377
56877F55377M675O754R863J3371J6874K0001K2315K3688K4193K3201J9114J0985
$$ 655377 660052 666806 676669 690040 706914 726915 749230 772918 797111 820312 839426 850411
56865H50411L95r082j4809j7138j8103j8697j8275j6464j4286j2823j1738j0120
$$ 850411 850806 841724 826915 809777 791674 772977 754702 738238 723952 711129 699391 689271
56853F89271q098o585n802n244m933n470o577o841n455l326j760q02L69K018L662
$$ 689271 681173 674588 668786 663542 658609 653139 646562 639721 634266 630940 629180 628378 628747 630765 634427
56838F34427M896N564N343M118K854L181N526Q228R234Q524Q061R171J0717J0640
$$ 634427 639323 644887 650230 654348 657202 660383 665909 674137 683371 691895 699956 709127 719844 730484
56824G30484Q673O396M548J849k837q273j2076j3356j2905j1374q872o122m144
$$ 730484 739157 745553 750101 751950 749113 740840 728764 715408 702503 691129 682257 676135 671991
56811F71991k470O13N395R810J2107J3187J5173J8723K3121K8151L4267M0917
$$ 671991 669521 670134 675529 685339 697446 710633 725806 744529 767650 795801 830068 870985
56799H70985M5994M7214M3505L5277K4148J2349J603p551j5062k0331k2518k1688
$$ 870985 916979 964193 1007698 1042975 1067123 1079472 1081075 1073524 1058462 1038131 1015613 993925
56787I93925j8855j4878r902l988K364Q489J4029J9016K3827K9097L5406M2877
$$ 993925 975070 960192 950290 946302 948666 957155 971184 990200 1014027 1043124 1078530 1121407
56775A121407N1041N8891O4844O6895O3199N2812L6199J5430o067k4701l8343
$$ 1121407 1172448 1231339 1296183 1363078 1426277 1479089 1515288 1530718 1524651 1499950 1461607
56764A461607m6881n1228n2235n0593m7098m2316l6345k9290k1809j4735q403
$$ 1461607 1414726 1363498 1311263 1260670 1213572 1171256 1134911 1105621 1083812 1069077 1060674
56753A060674k600L050Q899J5103K1348K7058L1902L5487L6256L1699K0628M999
$$ 1060674 1058074 1061124 1070023 1085126 1106474 1133532 1165434 1200921 1237177 1268876 1289504 1294503
56741A294503j1206k4780l4653m1104m4694m5931m5257m2953l9281l4721k9858
$$ 1294503 1283297 1258517 1223864 1182760 1138066 1092135 1046878 1003925 964644 929923 900065
56730I00065k5071k0438j5852j1243o887l345p42J697M871Q616J1900J3799J3460
$$ 900065 874994 854556 838704 827461 820574 817229 816487 818184 823055 831671 843571 857370 870830
56717H70830R618J863p522j4787j8454k0288k2003k2936k2110k0539j9657j8906
$$ 870830 880448 882311 874789 860002 841548 821260 799257 776321 754211 733672 714015 695109
56705F95109j7008j4444j2573j1111q815o174m941n202n121l817k343j540j051
$$ 695109 678101 663657 651084 639973 631158 624984 620043 614841 609720 605903 603560 602020 600969
56692F00969r46k213m669o281n782m554m582n689n989m483k085m39m75j792l067
$$ 600969 600023 597810 593141 586860 581078 576524 571942 566253 560264 555781 553696 553257 552782 550990 547923
56677E47923l349l073l224l594k865o59J539K087R27q69k477l584l967l590k823
$$ 547923 544574 541501 538277 534683 531818 531159 532698 534785 535712 534843 532366 528782 524815 521225 518402
56662E18402k121j717j776k329k891k687j582l58J45k13r15j223o93K20K71j089
$$ 518402 516281 514564 512788 510459 507568 504881 503299 502941 503086 502873 501958 500735 500042 500262 500533 499444
56646D99444k728l234k970l434m651m747k531P08K660K338M60j499k137q83J317
$$ 499444 496716 493482 490512 487078 482427 477680 475149 475857 478517 480855 481315 479816 477679 476796 478113
56631D78113K650K275J097M49O69J267J807K143K260K223K034J560R72R14J630
$$ 478113 480763 483038 484135 484584 485253 486520 488327 490470 492730 494953 496987 498547 499519 500433 502063
56616E02063K318K206J795J945K265J779Q23N62P92J20j493k284j281M47J625
$$ 502063 504381 506587 508382 510327 512592 514371 515194 515756 516548 516668 515175 512891 511610 512057 513682
56601E13682K154K017P30j270k360k014j793l027m908n933n844n073l731k302
$$ 513682 515836 517853 518583 517313 514953 512939 511146 508119 503211 497278 491434 486361 482630 480328
56587D80328j922k702l119k236j196j200j527j165q25j552k557k458j616j261
$$ 480328 478406 475704 472585 470349 469153 467953 466426 465261 464436 462884 460327 457869 456253 454992
56573D54992j172m53J36j046l590n133m540l144k528k734l032l098k889k399j818
$$ 454992 453820 453367 453503 452457 448867 443734 439194 436050 433522 430788 427756 424658 421769 419370 417552
56558D17552j278n01M88O91o73k526k757q52J421K196J484Q02J404L092M407M203
$$ 417552 416274 415773 416261 416952 416279 413753 410996 410144 411565 413761 415245 416047 417451 420543 424950 429153
56542D29153L175L257N044O713O247L914J570L34J14P19K021L367M040M083L814
$$ 429153 432328 435585 440629 447342 453589 457503 459073 459407 459521 460240 462261 465628 469668 473751 477565
56527D77565L025J628L80k16r40k392l353k214L86K237K554K464K664K481J583
$$ 477565 480590 482218 482598 482382 481442 479050 475697 473483 473869 476106 478660 481124 483788 486269 487852
56512D87852Q61J083J991L206M749O115O162M645L103L422N887Q876J0235R079
$$ 487852 488713 489796 491787 494993 499742 505857 512019 516664 519767 523189 529076 537952 548187 557266
56498E57266O623M966M773M786M116L813N012O640O652M881K860J363O2p24j81
$$ 557266 563889 568855 573628 578414 582530 586343 591355 597995 604647 609528 612388 613751 613813 613089 612908
56483F12908R82P77j216l148l607l378l756m665n327n489n122m013k476j542j739
$$ 612908 613890 614667 613451 610303 606696 603318 599562 594897 589570 584081 578959 574946 572470 570928 569189
56468E69189k484l151l788m406m484l900l423l716m520n263n756n883n390m457
$$ 569189 566705 563554 559766 555360 550876 546976 543553 539837 535317 530054 524298 518415 513025 508568
56454E08568l721l431l080k218j030LM57lj194k169k183j786k064k952l371k866
$$ 508568 504847 501416 498336 496118 495088 495091 495548 495545 494351 492182 489999 488213 486149 483197 479826 476960
56438D76960j936q60M33J443J437Q15O71Q76K92r06r99O47K442K934K589K277
$$ 476960 475024 474164 474597 476040 477477 478292 478963 479839 480131 479225 478226 478873 481315 484249 486838 489115
56422D89115J623J85j055r14J85R83J285J864K998M273N420O385O839O512N666
$$ 489115 490738 490923 489868 488954 489139 490122 491407 493271 496269 500542 505962 512347 519186 525698 531364
56407E31364M650L381J929J085J549K954M413N639O784P492P069N644M363M204
$$ 531364 536014 539395 541324 542409 543958 546912 551325 556964 563748 571240 578309 583953 588316 592520
56393E92520M966N681N739N302M681L695K056J88r14q25p6P87J807K721K518P64
$$ 592520 597486 603167 608906 614208 618889 622584 624640 624828 623914 623089 623013 623800 625607 628328 630846 631610
56377F31610j277k042j699j749k981m867o581p459o945n230l651l234l269k569
$$ 631610 630333 628291 626592 624843 621862 616995 610414 602955 596010 590780 587129 583895 580626 578057
56363E78057j563j521k228k312j730j901l242m426m454l790l117k548k378k998
$$ 578057 576494 574973 572745 570433 568703 566802 563560 559134 554680 550890 547773 545225 542847 539849
56349E39849l711l265j901j219j622j687n34Q42J309R63K09r34j922j647j25J203
$$ 539849 536138 532873 530972 529753 528131 526444 525910 526752 528061 529024 529233 528299 526377 524730 524605 525808
56333E25808J522J632K363L355L915L749K527L07j453j065P89J552L60r38p45
$$ 525808 527330 528962 531325 534680 538595 542344 544871 545178 543725 542660 543449 545001 545361 544423 543678
56318E43678L82J468K490L196K754J566J250J972K124J524K125M340N665M751
$$ 543678 544060 545528 548018 551214 553968 555534 556784 558756 560880 562404 564529 568869 574534 579285
56304E79285L888N164O962O993O283O903P811O521L638K104K562K787J600L53
$$ 579285 583173 588337 595299 602292 608575 615478 623289 629810 633448 635552 638114 640901 642501 642854
56290F42854K44O29O55N90R58J645K279K651K763K948L552M149L990L648M631
$$ 642854 643098 643727 644382 644972 645930 647575 649854 652505 655268 658216 661768 665917 669907 673555 678186
56275F78186O792Q007P507P192Q263Q987Q012P293Q817J0646R823P607P838J0853
$$ 678186 684978 692985 700492 707684 715947 724934 732946 740239 749056 759702 769525 777132 784970 795823
56261G95823J3084J2752J2021J2853J4208J4587J4481J4783J4869J3912J2555
$$ 795823 808907 821659 833680 846533 860741 875328 889809 904592 919461 933373 945928
56250I45928J2009J2463J3228J3604J3248J2457J2138J2531J2273J0050O855N031
$$ 945928 957937 970400 983628 997232 1010480 1022937 1035075 1047606 1059879 1069929 1076784 1081815
56238A081815N144N570N240N057O057P792R232J0137J0992J2400J4824J8108K1133
$$ 1081815 1086959 1092529 1097769 1102826 1108883 1116675 1125907 1136044 1147036 1159436 1174260 1192368 1213501
56225A213501K2743K3161K3726K5367K8044L1403L5003L8190M0743M3518M7492
$$ 1213501 1236244 1259405 1283131 1308498 1336542 1367945 1402948 1441138 1481881 1525399 1572891
56214A572891N2362N6990O1032O5229P0241P6035Q2310Q8941R6173J04639J14720
$$ 1572891 1625253 1682243 1743275 1808504 1878745 1954780 2037090 2126031 2222204 2326843 2441563
56203B441563J25659J36333J47090J59463J73462J86895J98417K09564K22240
$$ 2441563 2567222 2703555 2850645 3010108 3183570 3370465 3568882 3778446 4000686
56194D000686K35554K46885K54855K59632K61323K59862K55390K47166K32997
$$ 4000686 4236240 4483125 4737980 4997612 5258935 5518797 5774187 6021353 6254350
56185F254350K11511J84141J53452J20598Q5966N0992J7408j4249m3621o9269
$$ 6254350 6465861 6650002 6803454 6924052 7010018 7061010 7078418 7064169 7020548 6951279
56175F951279r0315j08031j23757j36468j44594j49101j52434j55540j58169j60958
$$ 6951279 6860964 6752933 6629176 6492708 6348114 6199013 6046579 5891039 5732870 5571912
56165E571912j64679j68362j70663j72206j74276j76192j76525j75768j75196
$$ 5571912 5407233 5238871 5068208 4896002 4721726 4545534 4369009 4193241 4018045
56156D018045j74060j70723j65601j60239j54419j47059j38965j31665j24431
$$ 4018045 3843985 3673262 3507661 3347422 3193003 3045944 2906979 2775314 2650883
56147B650883j15688j06491r9222r3547q7035p9260p1841o5066n8056n1755m7888
$$ 2650883 2535195 2428704 2329482 2235935 2148900 2069640 1997799 1932733 1874677 1822922 1775034
56136A775034m5222m0796l4883l0730k9272k8053k5721k3532k1812j9003j5140
$$ 1775034 1729812 1689016 1654133 1623403 1594131 1566078 1540357 1516825 1495013 1476010 1460870
56125A460870j2495j1639j0444p960n793m599k826p6J838K440L818O910R819J1277
$$ 1460870 1448375 1436736 1426292 1418332 1412539 1407940 1405114 1405038 1406876 1409316 1413134 1420044 1429863 1441140
56111A441140J2539J4539J6216J7052J8280K0186K1324K1581K2899K5529K6848
$$ 1441140 1453679 1468218 1484434 1501486 1519766 1539952 1561276 1582857 1605756 1631285 1658133
56100A658133K5521K3657K3121K2726K0899J8369J6362J4822J3985J5074J7878
$$ 1658133 1683654 1707311 1730432 1753158 1774057 1792426 1808788 1823610 1837595 1852669 1870547
56089A870547K0389K2205K5423L0732L5794L9230M3044M9115N6311O3338P1569
$$ 1870547 1890936 1913141 1938564 1969296 2005090 2044320 2087364 2136479 2192790 2256128 2327697
56078B327697Q2645R5742J09470J24046J39226J52185J59802J61453J57901J49441
$$ 2327697 2410342 2506084 2615554 2739600 2878826 3031011 3190813 3352266 3510167 3659608
56068C659608J36972J23085J10353R9878R2090Q6667Q0751P0002N3049L2812J2639
$$ 3659608 3796580 3919665 4030018 4129896 4221986 4308653 4389404 4459406 4512455 4545267 4557906
56057D557906o282k2967l5680m4760n3625o5145p9114r4340j10289j25446j36983
$$ 4557906 4551624 4528657 4492977 4448217 4394592 4329447 4250333 4155993 4045704 3920258 3783275
56046C783275j43502j45689j43596j36510j26206j16351j07481r6450q2318o8593
$$ 3783275 3639773 3494084 3350488 3213978 3087772 2971421 2863940 2767490 2685172 2616579
56036B616579n7841m8406l8710l0568k5570k2022j8335j5832j5484j5404j4206
$$ 2616579 2558738 2510332 2471622 2441054 2415484 2393462 2375127 2359295 2343811 2328407 2314201
56025B314201j3362j3591j2604r186n931n026m819l387j844j234J45L235N660
$$ 2314201 2300839 2287248 2274644 2265458 2259527 2254501 2249682 2246295 2244451 2243217 2243362 2246597 2252257
56012B252257N904O503R877J4372J7510J9667K1563K1983K1139K2229K6137K8755
$$ 2252257 2258161 2264664 2274541 2288913 2306423 2326090 2347653 2369636 2390775 2413004 2439141 2467896
56000B467896K7356K5483K7317L1110L2939L3315L5213L8466M0919M2721M5094
$$ 2467896 2495252 2520735 2548052 2579162 2612101 2645416 2680629 2719095 2760014 2802735 2847829
55989B847829M7057M7288M7076M8137M9926N1953N5599O0763O4251O4628O4839
$$ 2847829 2894886 2942174 2989250 3037387 3087313 3139266 3194865 3255628 3319879 3384507 3449346
55978C449346O6964O8560O7652O6831O8532P0771P1637P3513P8549Q4458Q9134
$$ 3449346 3516310 3584870 3652522 3719353 3787885 3858656 3930293 4003806 4082355 4166813 4255947
55967D255947R4819J03228J11314J16471J21273J28406J35878J41884J49166J59582
$$ 4255947 4350766 4453994 4565308 4681779 4803052 4931458 5067336 5209220 5358386 5517968
55957E517968J69818J77466J85718J96879K07414K15056K24313K38799K54635
$$ 5517968 5687786 5865252 6050970 6247849 6455263 6670319 6894632 7133431 7388066
55948G388066K67865K81568K98701L14975L26478L37497L52939L70012L85541
$$ 7388066 7655931 7937499 8236200 8551175 8877653 9215150 9568089 9938101 10323642
55939A0323642M04137M30140M58737M84369N10630N42328N75379O04774O34906
$$ 10323642 10727779 11157919 11616656 12101025 12611655 13153983 13729362 14334136 14969042
55930A4969042O71263P09774P45638P84552Q33022Q85642R34631R83970J041158
$$ 14969042 15640305 16350079 17095717 17880269 18713291 19598933 20533564 21517534 22558692
55921B2558692J103655J167503J240405J331209J435081J544439J665229J806334
$$ 22558692 23662347 24829850 26070255 27401464 28836545 30380984 32046213 33852547
55913C3852547J963168K129256K313125K524710K756724L000435L268042L577209
$$ 33852547 35815715 37944971 40258096 42782806 45539530 48539965 51808007 55385216
55905E5385216L927068M315172M764953N308679N956858O714192P609773Q677878
$$ 55385216 59312284 63627456 68392409 73701088 79657946 86372138 93981911 102659789
55897A02659789R926136J1359767J3015728J4927883J7081737J9455319K2076457
$$ 102659789 112585925 123945692 136961420 151889303 168971040 188426359 210502816
55890B10502816K4981781K8163569L1610894L5225314L8359463L9385197L6159386
$$ 210502816 235484597 263648166 295259060 330484374 368843837 408229034 444388420
55883D44388420K7483734J4333771m39858j3736335k3685525k9939435l3064961
$$ 444388420 471872154 486205925 485766067 472029732 448344207 418404772 385339811
55876C85339811l3895132l3212078l1623845k9518210k7117971k4584795k2055978
$$ 385339811 351444679 318232601 286608756 257090546 229972575 205387780 183331802
55869A83331802j9621611j7331939j5231904j3356312j1701281j0237495q949811
$$ 183331802 163710191 146378252 131146348 117790036 106088755 95851260 86901449
55862H6901449p838024o887245o066857n356010m747044m227724l781324l400349
$$ 86901449 79063425 72176180 66109323 60753313 56006269 51778545 47997221 44596872
55854D4596872l081190k809352k567066k350504k163221j998380j843878j699618
$$ 44596872 41515682 38706330 36139264 33788760 31625539 29627159 27783281 26083663
55846B6083663j573157j462367j357829j258333j169140j088398j009411r33310
$$ 26083663 24510506 23048139 21690310 20431977 19262837 18174439 17165028 16231718
55838A6231718q66339q07467p50924o97579o51815o10693n68183n26841m93490
$$ 16231718 15365379 14557912 13806988 13109409 12457594 11846901 11278718 10751877 10258387
55829A0258387m66487m38876m11099l88818l70880l51142l30130l13452l00382
$$ 10258387 9791900 9353024 8941925 8553107 8182227 7831085 7500955 7187503 6887121
55820F887121k85075k67731k53791k43180k30773k16756k06271j99171j90049
$$ 6887121 6602046 6334315 6080524 5837344 5606571 5389815 5183544 4984373 4794324
55811D794324j78323j68929j62845j55815j46819j39356j33882j27021j18646
$$ 4794324 4616001 4447072 4284227 4128412 3981593 3842237 3708355 3581334 3462688
55802C462688j12071j06889r9107q8893q1150p7912p6754p6789p9535q3584q5014
$$ 3462688 3350617 3243728 3144621 3055728 2974578 2896666 2819912 2743123 2663588 2580004 2494990
55791B494990q3587q2492q1984p9186p4044o9405o5244n8843n0700m4331m0168
$$ 2494990 2411403 2328911 2246927 2167741 2093697 2024292 1959048 1900205 1849505 1805174 1765006
55780A765006l5398k9836k6170k4360k1443j7074j3913j2529j1094r895j0795
$$ 1765006 1729608 1699772 1673602 1649242 1627799 1610725 1596812 1584283 1573189 1563294 1552499
55769A552499j2663j2639j1620j3049j6778j9654k1531k4817k8616k9637k8633
$$ 1552499 1539836 1527197 1515577 1502528 1485750 1466096 1444565 1419748 1391132 1361495 1332862
55758A332862k9591l2398l2873l0420k9064k9982k9625k6552k3728k2292j9228
$$ 1332862 1303271 1270873 1238000 1207580 1178516 1148534 1118909 1092357 1068629 1046337 1027109
55747A027109j3333p867m946k720k92m3k358l168O9M199N233L643J938L67k034
$$ 1027109 1013776 1005909 1000963 998243 997951 997908 995550 992382 992451 996650 1001883 1005526 1007464 1007831 1005797
55732A005797m889p498j0155j2722j4096j4398j5057j5799j4520j1308r407j0729
$$ 1005797 1000908 993410 983255 970533 956437 942039 926982 911183 896663 885355 875948 865219
55720H65219j3102j3450j1156p375l737k585n571j0831j4328j4894j5231j7142
$$ 865219 852117 838667 827511 820136 816399 813814 808243 797412 783084 768190 752959 735817
55708G35817j8975j8920j7675j6392j4745j2557j1003j0797j1121j1277j1309
$$ 735817 716842 697922 680247 663855 649110 636553 625550 614753 603632 592355 581046
55697E81046j0623q331n524m579n655o418n707m915n112n630o129p442r576j1285
$$ 581046 570423 562092 556568 551989 546334 539916 534209 529294 524182 518552 512423 504981 495405 484120
55683D84120j2101j2519j2084j0052p810p556q299o688k255J628K746K483K437
$$ 484120 472019 459500 447416 437364 429554 421998 413699 407011 404756 406384 409130 411613 414050
55670D14050J973M42j296k754m404n518m500k195j631l546n375n677o021p362
$$ 414050 416023 416465 415169 412415 408011 402493 397993 395798 394167 390621 385246 379569 373548 366186
55656C66186q089p225o147n503l858j102K96n68j071N08K014J445Q10K792O093
$$ 366186 358097 350872 344725 339222 335364 334262 334558 333990 332919 333427 335441 336886 337696 340488 346581
55641C46581P293N587K815K77j891l237l203k041k15K096M067M544M163N005P128
$$ 346581 353874 359461 362276 362553 360662 357425 354222 352181 351966 354062 358129 362673 366836 371841 378969
55626C78969P960O437N015N796P312P378O628O661O807N422K787K17k291n053
$$ 378969 386929 393366 398381 404177 411489 418867 425495 432156 438963 444385 447172 447389 445098 440045
55612D40045o645n419k285J24N48k34j070j263m89Q44J810K321L167M156L883
$$ 440045 433400 427981 425696 425820 426368 426134 425064 423801 423312 424156 425966 428287 431454 435610 439493
55597D39493K207J021J447K192K033J777K320K775K321J824J760N68k622n502
$$ 439493 441700 442721 444168 446360 448393 450170 452490 455265 457586 459410 461170 461738 459116 453614
55583D53614n460l612l212n008o811p269p467q743j0792j2383j2773j2140j1227
$$ 453614 448154 444542 441330 436322 429511 422242 414775 406032 395240 382857 370084 357944 346717
55570C46717j0474r385p503n954o592r223j1264j0898q965p199o316o467p535
$$ 346717 336243 326858 319355 313401 306809 297586 286322 275424 266459 259260 252944 246477 238942
55557B38942q079o253k841r51j558j949k93J233J99j856k022p64p01k069k766
$$ 238942 230863 224610 221769 220818 219260 217311 217018 218251 218450 216594 214572 213808 213107 211038 208272
55542B08272k175j669j654j038K25N68p26k404l027k520j720j387j657j850j226
$$ 208272 206097 204428 202774 201736 201961 202529 201803 199399 196372 193852 192132 190745 189088 187238 186012
55527A86012l88q24k514l446k530j271j172j332m13O77L59p32q86l16m92j177
$$ 186012 185624 184800 182286 178840 176310 175039 173867 172535 172122 172799 173158 172426 171540 171224 170732 169555
55511A69555o78J105K194J389j28l78J385M182O056N649L682K093J305j43k454
$$ 169555 168877 169982 172176 173565 173437 173059 174444 178626 184682 190331 194013 196106 197411 197268 194814
55496A94814l252j159J362J203r51k122j828k248m115n499m921l188j631m41P01
$$ 194814 191562 190403 191765 192968 192017 189895 188067 185819 181704 176205 171284 168096 166465 166024 166725
55481A66725J868K927L282J931r49l103k522j44J462J545J460K038K742L267M020
$$ 166725 168593 171520 174802 176733 175784 172681 170159 170015 171477 173022 174482 176520 179262 182529 186549
55466A86549M929N450N679N922N520L802J837J340K046K097R64J8J57P53J141
$$ 186549 191478 196928 202607 208529 214049 217851 219688 221028 223074 225171 226135 226153 226310 227063 228204
55451B28204J286P09j386m385o286o092n051n000o454q463r548q700o406m502
$$ 228204 229490 230199 228813 224428 218142 212050 206999 201999 195545 187082 177534 168834 162428 157926
55437A57926m181m560m130k843j626p06m2n78k961n567n846l576q65Q73J961K622
$$ 157926 153745 149185 145055 142212 140586 139880 139838 139260 136299 130732 124886 121310 120445 121318 123279 125901
55421A25901K262R32m46j596k924l986l658k176j108r86p58nR1j335l427m753
$$ 125901 128163 129095 128649 127053 124129 120143 116485 114309 113201 112215 111457 111452 111543 110208 106781 102028
55405A02028m635l055o08J239J295L64K46R15M71j663l440k860m73J704K394J515
$$ 102028 97393 94338 93730 94969 96264 96628 96874 97789 98260 96597 93157 90297 89824 91528 93922 95437
55389I5437l02j745j583j30R85R86P68J083J224L15j134j884j483m35O05J220
$$ 95437 95135 93390 91807 91677 92662 93648 94416 95499 96723 97038 95904 94020 92537 92102 92707 93927
55373I3927J303J105R11O76M04M62Q51P11l79j263p02M56L38j050j839j249n77
$$ 93927 95230 96335 97246 97922 98326 98788 99639 100350 99971 98708 98006 98462 98800 97750 95911 94662 94085
55356I4085q49j431j578j658k003j887n79J587L599M465L458R66j039r22K03k39
$$ 94085 93236 91805 90227 88569 86566 84679 84100 85687 89286 93751 97209 98175 97136 96214 96417 96178
55340I6178k452l797k668o41K29J68M39J019J139Q62P00M57k50j066j474j583
$$ 96178 93726 89929 87261 86620 86849 87017 87456 88475 89614 90476 91176 91633 91383 90317 88843 87260
55324H7260j594j141M1J574K934L697L037L37l223n100m146j791Q2J006J165M78
$$ 87260 85666 84525 84566 86140 89074 92771 95808 96145 92922 87822 83676 81885 81967 82973 84138 84616
55308H4616n57p52j12l35k099l457k499k37R87P43K70q9r72j992j875o42J23m00
$$ 84616 84059 83307 83195 82860 80761 77304 74805 74568 75555 76298 76568 76479 75507 73515 71640 70998 71121 70721
55290G0721j194j134n30l33n71l41Q99K398K641J015j136j707k51J510J806P08
$$ 70721 69527 68393 67863 67530 66959 66618 67517 69915 72556 73571 72435 70728 70477 71987 73793 74501
55274G4501n47j188j191p27j72j25p02j237j219r37p50l81L79J097J440J746K120
$$ 74501 73954 72766 71575 70848 70676 70551 69849 68612 67393 66456 65706 65325 65704 66801 68241 69987 72107
55257G2107J841N74o17m71P87J862J875O81j504l713m222k216R10K941L096K003
$$ 72107 73948 74522 73905 73434 74221 76083 77958 78639 77135 73422 69200 66984 67894 70835 73931 75934
55241G5934K80j504k058m37K176L374K445J109R97J713J882J011l50j529k102
$$ 75934 76214 74710 72652 72215 74391 77765 80210 81319 82316 84029 85911 86922 86572 85043 82941
55226H2941j956j540j595k160k288j220M79J549J573J342J648K182K004Q82k63
$$ 82941 80985 79445 77850 75690 73402 72182 72661 74210 75783 77125 78773 80955 82959 83841 83578
55211H3578n11j56k98j287k137j701j08J386J747J221R58J670K587K066m61l437
$$ 83578 83067 82911 82613 81326 79189 77488 77380 78766 80513 81734 82692 84362 86949 89015 88554 85117
55195H5117m568l269j114L5k50j116j511r12L64J232P99n31j385r81J59J182J849
$$ 85117 80549 77280 76166 76201 75951 74835 73324 72412 72776 74008 74807 74276 72891 71910 72069 73251 75100
55178G5100K222K095J304J78o68q92o16m08q30j667j893r64K13N38M72J270K686
$$ 75100 77322 79417 80721 80899 80231 79339 78723 78315 77485 75818 73925 72961 73174 73712 74184 75454 78140
55161G8140L039J695l7q79r90q53l23M64O89K05R8R48J834J930J879K449L047
$$ 78140 81179 82874 82837 81958 80968 80115 79792 80256 80945 81150 81248 82196 84030 85960 87839 90288 93335
55144I3335K716J640M46r07k308k630j132J119K554L016L064K417P89o03k78J144
$$ 93335 96051 97691 98137 97230 94922 92292 91160 92279 94833 97849 100913 103330 104119 103516 103238 104382
55128A04382J616N63n94p59m33m66r43j513j892j808j349j188j638j848r82K50
$$ 104382 105998 106561 105967 105208 104775 104309 103366 101853 99961 98153 96804 95616 93978 92130 91148 91398
55112I1398M51m02j089j083r54j050j166j377j858j952r28M37O33k03m39L89Q52
$$ 91398 91849 91447 90358 89275 88321 87271 86105 84728 82870 80918 79990 80427 81060 80857 80418 80807 81659
55095H1659M1j050j336j112q36N1J799L131K725J177J88L43Q35R25O82M02K53
$$ 81659 81700 80650 79314 78202 77366 77417 79216 82347 85072 86249 86437 86780 87615 88540 89222 89624 89877
55078H9877L45N49L20o89j899k203j154N65J779J836J084M61N61J153J780K462
$$ 89877 90222 90771 91091 90402 88503 86300 85146 85711 87490 89326 90410 90871 91432 92585 94365 96827
55062I6827L264L491K233j75k086k205p99R28K033K312K270K775M063N023M291
$$ 96827 100091 103582 105815 105640 103554 101349 100550 101478 103511 105823 108093 110868 114931 119954 124245
55047A24245K167M48N1K3o12j213p27M52J044P28K97L12O39J092J548J598R87
$$ 124245 126412 126860 126911 126934 126322 125109 124382 124834 125878 126606 126903 127215 127854 128946 130494 132092 133079
55030A33079L30M21R72J038O53Q13J711K190J614J020J471K150J437n02j595n06
$$ 133079 133409 133830 134802 135840 136493 137306 139017 141207 142821 143841 145312 147462 148899 148397 146802 146296
55014A46296J761L233L055J664k70k204l503l748l181k234r50N12J195L49r64
$$ 146296 148057 151290 154345 156009 155739 153535 150032 146284 143103 140869 139919 140431 141626 141975 141011
54999A41011o73J420K802J344j707l139j776L25P75l46j222q54Q1O00O24N93N23
$$ 141011 140338 141758 144560 145904 144197 141058 139282 139607 140382 140036 138814 137960 138041 138641 139265 139858 140381
54982A40381R7m40k66P52J461Q61k46j21J395K507K015R15O26P93K41p58p82L48
$$ 140381 140478 140038 139772 140524 141985 142846 142600 142479 143874 146381 148396 149311 149937 150730 150971 150213 149431 149779
54964A49779J178P36l36j094j459j621j383p35j92N7N41J429K022J929J904K596
$$ 149779 150957 151693 151357 150263 148804 147183 145800 145065 144873 144930 145471 146900 148922 150851 152755 155351
54948A55351L271K903J818J057N16p71k540l090j728j07j59j556k306j454n0N31
$$ 155351 158622 161525 163343 164400 164916 164145 161605 158515 156787 156680 156521 154965 152659 151205 151155 151686
54932A51686K98K01O28R47M38p26j536j205j18L83n74k246k877j654L63J506J458
$$ 151686 151984 152185 152813 153760 154198 153472 151936 150731 150613 150996 150422 148176 145299 143645 144008 145514 146972
54915A46972J312J734J897P38j165j953q76N90O33l24j02K176M637N064L719K684
$$ 146972 148284 150018 151915 152653 151488 149535 148659 149249 149882 149558 149456 151632 156269 161333 165052 167736
54899A67736K902L424L580M198N954P875Q751Q978R726J0934J1626J1904J3042
$$ 167736 170638 174062 177642 181840 187794 195669 204420 213398 223124 234058 245684 257588 270630
54886B70630J5449J7889J9130J9293J9143J8841J7976J6183J3412J0030O676L485
$$ 270630 286079 303968 323098 342391 361534 380375 398351 414534 427946 437976 444652 448137
54874D48137m10n694j1315j5333j7439j9220k1490k2789k1468j8118j4819j2756
$$ 448137 447727 442033 430718 415385 397946 378726 357236 334447 312979 294861 280042 267286
54862B67286j1592j0620r399p676n598l786k549j392K7J034Q41l5j29J328L802
$$ 267286 255694 245074 235675 227999 222401 218615 216066 214674 214701 215735 216576 216541 216412 217740 221542
54847B21542O312Q245R579J0754J2293J4117J5589J6413J6955J7363J7048J5582
$$ 221542 227854 236099 245678 256432 268725 282842 298431 314844 331799 349162 366210 381792
54835C81792J3345J0623O885J832l400p266r699j2055j5226j8515k0367j9714
$$ 381792 395137 405760 412645 414477 411077 403811 394112 382057 366831 348316 327949 308235
54823C08235j6947j4016j3025j4088j5090j4132j1593r159p563o338n171m305
$$ 308235 291288 277272 264247 250159 235069 220937 209344 200185 192622 186284 181113 176808
54811A76808l826l556l429l259k513j131o6j17p34q66n49n44r62j288j394j444
$$ 176808 172982 169426 165997 162738 160225 159094 159028 158911 158177 157311 156762 156218 155256 153968 152574 151130
54795A51130j283r34j115k098k710j952q60j093k185k156p02L01l06j534k164
$$ 151130 149847 148913 147798 145700 142990 141038 140178 139085 136900 134744 134042 134343 134037 132503 130339
54780A30339k262k188j631n84J41O0k56k44j04p8J9J59O6J34J152K749L364K265
$$ 130339 128077 125889 124258 123674 123815 123875 123619 123375 123271 123193 123212 123371 123437 123571 124723 127472 130836 133101
54762A33101L82j202k268k496j221J033K305J626M63O40K006L354M476N733O497
$$ 133101 133483 132281 130013 127517 126296 127329 129634 131260 131723 132363 134369 137723 142199 147932 154429
54747A54429N708L717K170K079L034M148M933N313N563O202P471R136J1051J3331
$$ 154429 160137 163854 166024 168103 171137 175285 180218 185531 191094 197296 204767 213903 224954 238285
54733B38285J5536J6534J5969J5190J5725J7346J8683J9206J9422J9288J7737
$$ 238285 253821 270355 286324 301514 317239 334585 353268 372474 391896 411184 428921
54722D28921J4027Q731L131j691n119p128q439r956j1807j3286j3758j3223j1960
$$ 428921 442948 451679 454810 453119 448000 440872 432433 422477 410670 397384 383626 370403 358443
54709C58443j0300q885q396q527p838n397k260m56m74p11L46K260L746M780O402
$$ 358443 348143 339258 330862 322335 314497 309100 306840 306384 305910 305199 305545 307805 311551 316331 322733
54694C22733Q736J0669J1734J2950J5260J8133K0474K2020K3143K4167K5577K7833
$$ 322733 331469 342138 353872 366822 382082 400215 420689 442709 465852 490019 515596 543429
54682E43429L0129L0391K7661K3296J8604J2657M320m738j1569j6017k0531k5852
$$ 543429 573558 603949 631610 654906 673510 686167 690487 685749 674180 658163 637632 611780
54670F11780k9607l0008k8549k7739k7875k7487k5780k3318k1045j9521j8602
$$ 611780 582173 552165 523616 495877 468002 440515 414735 391417 370372 350851 332249
54659C32249j7329j4887j1936r969r205q262o341m371l517l744m391m963m849
$$ 332249 314920 300033 288097 278128 268923 260661 254320 249949 246432 242688 238297 233334 228485
54646B28485l641k240k296l847m911m083k155m42Q81J858J792M99p09o06L97J285
$$ 228485 224844 222604 220308 216461 211550 207467 205312 204870 205751 207609 209401 209900 209191 208585 208982 210267
54630B10267J900K368K269J479P59N38K80l2O09K231L068K289J662K772M145L496
$$ 210267 212167 214535 216804 218283 219042 219580 219860 219828 220437 222668 225736 228025 229687 232459 236604 240100
54614B40100J429L45O45P51N00J614M532P205P840P009O327O336O465O015M760
$$ 240100 241529 241874 242519 243270 243770 245384 249916 257121 264961 271970 278297 284633 291098 297113 301873
54599C01873L265K772M015O220P826Q003O890M928K835J668J944L148M793P079
$$ 301873 305138 307910 311925 318145 325971 333974 340864 345792 348627 350295 352239 355387 360180 367259
54585C67259R629J0807R883Q817J0058J3272J6148J7857J9712K2607K5770K8176
$$ 367259 376888 387695 397578 406395 416453 429725 445873 463730 483442 506049 531819 559995
54573E59995K9560L0005K9861K9723K9230K6501K0516J3227P164J680n751j4933
$$ 559995 589555 619560 649421 679144 708374 734875 755391 768618 775782 777462 771711 756778
54561G56778k2634k7130k9943l2311l2976l1016k8273k6956k6600k5259k2394
$$ 756778 734144 707014 677071 644760 611784 580768 552495 525539 498939 473680 451286
54550D51286j9014j6089j4198j3555j3222j1421p898m822m119n062n728n646n547
$$ 451286 432272 416183 401985 388430 375208 363787 355889 351067 346948 341886 336158 330512 324965
54537C24965n607n564n835o848p841p814p222p240p765p611o508n453n124n217
$$ 324965 319358 313794 307959 301111 293270 285456 278234 270994 263229 255618 249110 243657 238533 233316
54523B33316n389n644n676m893l450k347k224k748l344l834m137m002l404k715
$$ 233316 227927 222283 216607 211714 208264 205917 203693 200945 197601 193767 189630 185628 182224 179509
54509A79509k194j657r50m37o62j559k334k189j208k38J82M53J137J836J569L19
$$ 179509 177315 175658 174708 174271 173609 172050 169716 167527 166319 166081 166263 166716 167853 169689 171258 171577
54493A71577n93p6J440K676K967K525J760J057Q61J317J932K205K457L388M782
$$ 171577 170984 170908 172348 175024 177991 180516 182276 183333 184194 185511 187443 189648 192105 195493 200275
54478B00275N464M966M541N770Q317J0040R573Q120P919R382J0782J0758J0023
$$ 200275 205739 210705 215246 221016 229333 239373 248946 257066 264985 274367 285149 295907 305930
54465C05930J0086J1182J2349J2925J3045J2920J2520J1748J0182O947J768l928
$$ 305930 316016 327198 339547 352472 365517 378437 390957 402705 412887 419834 421602 417674
54453D17674p984r728j0379j1301j2685j4150j5611j6936j7383j6149j3348j0205
$$ 417674 409690 399962 389583 378282 365597 351447 335836 318900 301517 285368 272020 261815
54441B61815q262q183r028q916o977m392l030l335m235m742m613l714k015l26
$$ 261815 253553 245370 236342 227426 220449 216057 213027 209692 205457 200715 196102 192388 190373 190047
54427A90047J59n32j020m85K40M7q10j186n61N99J701K705L949N452O382N609
$$ 190047 190206 189674 188654 188169 188409 188456 187646 186460 185899 186498 188199 190904 194853 200305 206687 212296
54411B12296L262J184J031K231K897K415J815J663J255K49m74l64k50r58j966
$$ 212296 215558 216742 217773 220004 222901 225316 227131 228794 230049 230298 229824 229460 229210 228252 226286
54396B26286k353k200k041j797j218q17j346k649l709l589k062J29J397N70j519
$$ 226286 223933 221733 219692 217895 216677 215860 214514 211865 208156 204567 202505 202634 204031 204601 203082
54381B03082k715k249j674k394l556l551k378j190l13O74J431J037m06j743k294
$$ 203082 200367 198118 196444 194050 190494 186943 184565 183375 183062 183736 185167 186204 185798 184055 181761
54366A81761k322k003j172j75J01n62j320j256j58J674L686M974M731L097J132
$$ 181761 179439 177436 176264 176089 176190 175628 174308 173052 172894 174568 178254 183228 187959 191056 192188
54351A92188n1O4J392L159M049L255J542O39J442L277M934N776N797N232M504
$$ 192188 192137 192201 193593 196752 200801 204056 205598 206237 207679 210956 215890 221666 227463 232695 237199
54336B37199M130M387N085N740N866N268M205L141K154R38m53j375j537j618k379
$$ 237199 241329 245716 250801 256541 262407 267675 271880 275021 277175 278113 277660 276285 274748 273130 270751
54321B70751l579m461m872n112n075m544m049m324m923m499k806j312j403k738
$$ 270751 267172 262711 257839 252727 247652 243108 239059 234735 229812 225313 222507 221195 219792 217054
54307B17054l987m418m238l871l595l489l250k354q54L62N56J14j4M98J246J928
$$ 217054 213067 208649 204411 200540 196945 193456 190206 187852 186998 187360 187916 188030 188016 188514 189760 191688
54291A91688K591L172L410L386L500L789L769L192K465K024J743J417J409K205
$$ 191688 194279 197451 200861 204247 207747 211536 215305 218497 220962 222986 224729 226146 227555 229760
54277B29760L502M366M290L636K968K465K005J373K44j509l305m176l886l332
$$ 229760 233262 237628 241918 245554 248522 250987 252992 254365 254609 253100 249795 245619 241733 238401
54263B38401l492m341n161n418n010m051k958k428k789l539l905l654l073k565
$$ 238401 234909 230568 225407 219989 214979 210928 207970 205542 202753 199214 195309 191655 188582 186017
54249A86017k585l527m996n670m650k773j877k740m239m574l005n14R58L08j469
$$ 186017 183432 179905 174909 169239 164589 161816 159939 157199 152960 148386 145381 144867 145825 146133 144664
54234A44664k241j257K3r0j558l301m547m588k493J279M046L587J128k96N4L54
$$ 144664 142423 141166 141189 141099 139541 136240 131693 127105 124612 125891 129937 133524 134652 134356 134410 134764
54218A34764k13k70R09J854J285J18r4P08J588J958J445j30j737j467J014L549
$$ 134764 134551 134281 135190 137044 138329 138447 138353 139061 140649 142607 144052 143922 142185 140718 141732 145281
54202A45281M097L036J929J278Q50R26J708K276J642K94n10n13m24n98q22r09
$$ 145281 149378 152414 154343 155621 156471 157397 159105 161381 163023 163317 162807 162294 161870 161272 160450 159541
54186A59541p35j55M91N07j2j28K19k61k073l724l802k912k147j081Q91K524K265
$$ 159541 158806 158651 159142 159649 159637 159509 159728 159467 157394 153670 149868 146956 144809 143728 144619 147143 149408
54169A49408R76R02K324L483L554L397L284K195K2j501j035N44J434J092L41J33
$$ 149408 150384 151286 153610 157093 160647 164044 167328 169523 169545 168044 167009 167553 168987 170079 170420 170553
54153A70553P01J409J214k22j856k290j400k23M69O01J29r40j897j841r30k01
$$ 170553 171254 172663 173877 173655 171799 169509 168109 167886 168355 168956 169085 168145 166248 164407 163477 163276
54137A63276j66n24j183k361l510l435j880j53L65l36j167j138j35R66R75l88
$$ 163276 163110 162586 161403 159042 155532 152097 150217 150064 150429 150093 148926 147788 147653 148619 149594 149206
54121A49206k008k605k144j386n62N69J633J792R51j50j010j652j846j024Q01
$$ 149206 147198 144593 142449 141063 140501 141070 142703 144495 145446 145296 144286 142634 140788 139764 140565
54106A40565K688L565L040J622N22N93J119M62j464k569j586l75j432m023n075
$$ 140565 143253 146818 149858 151480 152002 152595 153714 154176 152712 150143 148557 148182 146750 142727 137652
54091A37652l548j604j221j904k284k141j926j742j637j868k257k136j316k20
$$ 137652 134104 132500 131279 129375 127091 124950 123024 121282 119645 117777 115520 113384 112068 111848
54077A11848R42K072K437J340m55j437j460j575j827j105N50J539J158N80O83
$$ 111848 112790 114862 117299 118639 118184 116747 115287 113712 111885 110780 111330 112869 114027 114607 115290
54062A15290P93L19j78m42j116j920j252J086K732J964K07l88k10q32j873j713
$$ 115290 116083 116402 116224 115782 114666 112746 111494 112580 115312 117276 117483 117095 116885 116053 114180 112467
54046A12467m39L43L40P78J848K178J229L03N76J515K022J985J992K283K607K618
$$ 112467 112028 112371 112711 113489 115337 117515 118744 119047 119623 121138 123160 125145 127137 129420 132027 134645
54030A34645K011O66j002k138k079r20M39P81m15k167k658j208P79J383K71j219
$$ 134645 136656 137322 136320 134182 132103 131183 131622 132403 131988 129821 127163 125955 126734 128117 128388 127169
54014A27169j731r55O08K219L214L225K293Q18l43q5J948M429N371M309K655J599
$$ 127169 125438 124483 125091 127310 130524 133749 136042 136860 136517 136432 138380 142809 148180 152489 155144 156743
53998A56743Q58K9k12N79J263M91j149j728m27J843L837M802M260K378N74M58
$$ 156743 157601 157630 157418 157997 159260 159751 158602 156874 156447 158290 162127 166929 171189 173567 174141 174599
53982A74599J962L570M381M893N599O060N887N610N895O594P145P382P437P280
$$ 174599 176561 180131 184512 189405 195004 201064 206951 212561 218456 225050 232195 239577 247014 254294
53968B54294O903O651O870P454Q035Q412Q511Q150P245O104N241M876M857M954
$$ 254294 261197 267848 274718 282172 290207 298619 307130 315280 322525 328629 333870 338746 343603 348557
53954C48557M952M604L811K940K569K667K449J316k61j374j929k604l574m167
$$ 348557 353509 358113 361924 364864 367433 370100 372549 373865 373604 372230 370301 367697 364123 359956
53940C59956m068l983m577n518o217o747p209o978n706m479m623n714o125n378
$$ 359956 355888 351905 347328 341810 335593 328846 321637 314659 308953 304474 299851 294137 288012 282634
53926B82634m521m172l683k522j177l06j01p21k111l264k961j585p15p71n98J62
$$ 282634 278113 273941 270258 267736 266559 266253 266152 265431 263320 260056 257095 255510 254795 254024 253426 253588
53910B53588K62p45j239N3K003K975L269L887M126K539l20k172j945q30k98l76
$$ 253588 253850 253105 251866 251919 253922 256897 260166 264053 268179 270718 270398 268226 266281 265451 265153 264777
53894B64777j38R25K296K823J982Q44R20J840J582k50j215N13L084L552K242J958
$$ 264777 264639 265564 267860 270683 272665 273509 274429 276269 277851 277601 276386 276899 279983 283535 285777 287735
53878B87735L522M943N122N483P097Q657Q753Q251Q691R586R178P228N299M341
$$ 287735 291257 296200 301322 306805 313902 322559 331312 339563 348254 357840 367018 374246 379545 383886
53864C83886L403J337j242k492j554N00K083K830L433M196M694M869N396O537
$$ 383886 387289 388626 387384 384892 383338 383838 385921 388751 392184 396380 401074 405943 411339 417876
53850D17876P542P746P518P489P546P405P462Q143Q875Q675P416N815M417L282
$$ 417876 425418 433164 440682 448171 455717 463122 470584 478727 487602 496277 503693 509508 513925 517207
53836E17207K277J133m21k121l370m304n671p215p464o027m674m961o065o449
$$ 517207 519484 520617 520196 518075 514705 510401 504730 497515 490051 484024 479350 474389 468324 461875
53822D61875o331o776p517p777q210r734j1217j0849r311q953j0010j0370r205
$$ 461875 455544 448768 441251 433474 425264 415530 404313 393464 384153 375200 365190 354820 345615
53809C45615q017p591o799n266m589n543o461n923m921m851n158m785m259m521
$$ 345615 337598 330007 323208 317942 313353 307810 301349 295426 290505 285654 280496 275711 271452 266931
53795B66931m973m603l996m370n358n410m023k107p09m85j778l917n080m092j965
$$ 266931 261958 257355 253359 248989 243631 238221 234198 232091 231382 230897 229119 225202 220122 216030 214065
53780B14065n17j41j61n78j846l350l766k955k114j896j689q93J98J099J783K320
$$ 214065 213548 213407 213246 212668 210822 207472 203706 200751 198637 196741 195052 194159 194357 195456 197239 199559
53764A99559K566K416J876R41p3l07O88K034K394J796J599K581L938M433L731
$$ 199559 202125 204541 206417 207358 207285 206978 207666 209700 212094 213890 215489 218070 222008 226441 230172
53749B30172K343J024N39J229K357K598J685R81J692L135L716L397L946O436R522
$$ 230172 232515 233539 234078 235307 237664 240262 241947 242928 244620 247755 251471 254868 258814 265250 274772
53734B74772J0939J0106Q241O422M724L343L092M112N245N601N737O128N523K623
$$ 274772 285711 295817 304058 310480 315204 318547 321639 325751 330996 336597 342334 348462 353985 356608
53720C56608j147k677j257M30P2j338j523l50L88l52j906l239l919m029m059m586
$$ 356608 355461 352784 351527 351957 352029 350691 349168 348818 349206 348854 346948 343709 339790 335761 331702 327116
53704C27116n285m882l090j824k951n354o003m040j955k108l710m243k739l57
$$ 327116 321831 316949 313859 312035 309084 303730 297727 293687 291732 289624 285914 281671 278932 278575
53690B78575J509K435K486J817R42N46O46L58j012k915l942l354k008j481k317
$$ 278575 280084 282519 285005 286822 287764 288310 288956 289314 288302 285387 281445 278091 276083 274602 272285
53675B72285l466l699l196l047l367k904j030Q21P20j142k597k282j174q89j574
$$ 272285 268819 265120 261924 258877 255510 252606 251576 252397 253117 251975 249378 247096 245922 245033 243459
53660B43459k236k307j843p37J016K469K468J334O63J231K139K417K230J996J496
$$ 243459 241223 238916 237073 236336 237352 239821 242289 243623 244286 245517 247656 250073 252303 254299 255795
53645B55795O12MJ30N34Q61J602K790L210K285J634K960N196N903M982M642N736
$$ 255795 256407 256411 256541 257075 257936 259538 262328 265538 267823 269457 272417 277613 283516 288498 293140 298876
53629B98876O580N989N104N113N230M360L105K623K700K549K415K857L184K384
$$ 298876 305456 311445 316549 321662 326892 331252 334357 336980 339680 342229 344644 347501 350685 353069
53615C53069J062P68J538J666J15k177l724m161l934l229k001p34m05j419k855
$$ 353069 354131 354899 356437 358103 358218 356041 352317 348156 344222 340993 338992 338258 337853 336434 333579
53600C33579l206k018m23K38n6l40j51K38P53J556K137J548j30j591j997j700
$$ 333579 330373 328355 327932 328170 328114 327774 327623 327861 328614 330170 332307 333855 333725 332134 330137 328437
53584C28437j007L71K003K402J035n28p33j15N3K5P99J945K217J842K252L511
$$ 328437 327430 327801 329804 332206 333241 332713 331980 331865 331918 331943 332742 334687 336904 338746 340998 344509
53568C44509L969K829J468J548K981M411M742L755K017P06O99J521J848J439J648
$$ 344509 348478 351307 352775 354323 357304 361715 366457 370212 372229 372935 373634 375155 377003 378442 380090
53553C80090L464N790O515N082L259L212N222P587Q600Q196P356O458N233M211
$$ 380090 383554 389344 395859 400941 404200 407412 412634 420221 428821 437017 444373 450831 456064 460275
53539D60275M745O825Q156O806L944K495L487N218N839N247M313L689L675M206
$$ 460275 465020 471845 480001 486807 490751 493246 496733 501951 507790 513037 517350 521039 524714 528920
53525E28920M635M480M371N113N919N108K773J068J281K277K665K800L411L765
$$ 528920 533555 538035 542406 547519 553438 558546 561319 562387 563668 565945 568610 571410 574821 578586
53511E78586K863J333L27o22k629m855n068k936o95KN1P95J717J715J456K569
$$ 578586 581449 582782 583109 582487 579858 575003 569935 566999 566304 566306 566357 567152 568869 570584 572040 574609
53495E74609M923O489O035M561L605L433L584M145N416O783P015N796M197L567
$$ 574609 579532 586021 592056 596617 600222 603655 607239 611384 616800 623583 630598 636394 640591 644158
53481F44158M304N641O258N363L698L156M683O899P658O829O219O830P690P863
$$ 644158 648462 654103 660361 665724 669422 672578 677261 684160 691818 698647 704866 711696 719386 727249
53467G27249Q043R072J0307J0869J1469J3198J5305J6083J5707J6142J7992J9505
$$ 727249 735292 744364 754671 765540 777009 790207 805512 821595 837302 853444 871436 890941
53455H90941J9404J8830J9302K0295K0437K0128K1060K3450K5553K6240K6586
$$ 890941 910345 929175 948477 968772 989209 1009337 1030397 1053847 1079400 1105640 1132226
53444A132226K8162L0678L2417L2580L2233L2794L4349L5896L6764L7208L7741
$$ 1132226 1160388 1191066 1223483 1256063 1288296 1321090 1355439 1391335 1428099 1465307 1503048
53433A503048L8568L9645M0698M0969L9750L7586L6264L6880L8382L8895L8053
$$ 1503048 1541616 1581261 1621959 1662928 1702678 1740264 1776528 1813408 1851790 1890685 1928738
53422A928738L7108L6926L7156L7418L8039L8985L9196L7835L5573L3775L2899
$$ 1928738 1965846 2002772 2039928 2077346 2115385 2154370 2193566 2231401 2266974 2300749 2333648
53411B333648L2441L2071L1844L1438L0149K7919K5625K3971K2551K0437J7389
$$ 2333648 2366089 2398160 2430004 2461442 2491591 2519510 2545135 2569106 2591657 2612094 2629483
53400B629483J3989J0792P784M825K105j95k441n246q653j1979j4616j6639j8478
$$ 2629483 2643472 2654264 2662048 2666873 2668978 2668783 2666342 2661096 2652443 2640464 2625848 2609209 2590731
53387B590731k0248k1722k2783k3614k4571k5942k7669k9209l0018l0239l0572
$$ 2590731 2570483 2548761 2525978 2502364 2477793 2451851 2424182 2394973 2364955 2334716 2304144
53376B304144l1305l2058l2737l3877l5402l5832l3781k9875k6045k3148k0424
$$ 2304144 2272839 2240781 2208044 2174167 2138765 2102933 2069152 2039277 2013232 1990084 1969660
53365A969660j7278j4335j2309j0953r645q251o860n407l981k782j391J121M648
$$ 1969660 1952382 1938047 1925738 1914785 1905140 1896889 1890029 1884622 1880641 1877859 1876468 1877589 1882237
53352A882237P511Q376Q135Q889J1385J4584J7529K0402K3537K6405K8433L0105
$$ 1882237 1889748 1898124 1906259 1915148 1926533 1941117 1958646 1979048 2002585 2028990 2057423 2087528
53340B087528L2477L5684L8614M0270M0969M1968M4084M7016M9969N2590N5185
$$ 2087528 2120005 2155689 2194303 2234573 2275542 2317510 2361594 2408610 2458579 2511169 2566354
53329B566354N8191O1578O4678O6647O7487O8517P1182P4969P7337P6482P3775
$$ 2566354 2624545 2686123 2750801 2817448 2884935 2953452 3024634 3099603 3176940 3253422 3327197
53318C327197P2404P3688P5820P6345P4751P2175O9570O7029O4401O1606N8458
$$ 3327197 3399601 3473289 3549109 3625454 3700205 3772380 3841950 3908979 3973380 4034986 4093444
53307D093444N4652N0005M4547L8546L2471K6572K0415J3425O042m14n537j0689
$$ 4093444 4148096 4198101 4242648 4281194 4313665 4340237 4360652 4374077 4380119 4379705 4374168 4363479
53295D363479j7426k5557l3467m0058m5473n0147n3962n6570n7998n8829n9948
$$ 4363479 4346053 4320496 4287029 4246971 4201498 4151351 4097389 4040819 3982821 3923992 3864044
53284C864044o2006o4793o7286o8628o8839o8332o7175o5438o3782o2856o2319
$$ 3864044 3802038 3737245 3669959 3601331 3532492 3464160 3396985 3331547 3267765 3204909 3142590
53273C142590o1234n9402n7522n6010n4498n2667n0720m8768m6481m3818m1411
$$ 3142590 3081356 3021954 2964432 2908422 2853924 2801257 2750537 2701769 2655288 2611470 2570059
53262B570059l9703l8181l6023l3134l0006k6842k3451k0025j7502j6895j8300
$$ 2570059 2530356 2492175 2456152 2423018 2393012 2366170 2342719 2322694 2305192 2288297 2269997
53251B269997k0605k2268k2584k2110k1558k0507j7913j3959j0517r201r572r800
$$ 2269997 2249392 2227124 2204540 2182430 2160872 2140365 2122452 2108493 2097976 2088775 2079203 2069403
53239B069403q556n622j424K952N737N880M593M384O244Q800J0560J1851J3831
$$ 2069403 2060847 2055225 2053801 2056753 2062490 2068370 2072963 2077347 2083591 2092391 2102951 2114802 2128633
53226B128633J6636J9552K2313K5132K7731K9510L0636L1994L3895L5495L5803
$$ 2128633 2145269 2164821 2187134 2212266 2239997 2269507 2300143 2332137 2366032 2401527 2437330
53215B437330L4705L2940L1374L0332K9225K6927K3060J8824J5807J4005J1825
$$ 2437330 2472035 2504975 2536349 2566681 2595906 2622833 2645893 2664717 2680524 2694529 2706354
53204B706354Q222M001N13k170n017q366j1365j3176j4229j5843j8713k2145k4983
$$ 2706354 2714576 2718577 2719090 2716920 2711903 2703537 2692172 2678996 2664767 2648924 2630211 2608066 2583083
53191B583083k7098k9313l1865l3814l4556l5016l6328l7940l8440l7894l7719
$$ 2583083 2555985 2526672 2494807 2460993 2426437 2391421 2355093 2317153 2278713 2240819 2203100
53180B203100l8236l8112l6746l5392l4990l4462l2590l0253k9165k9261k9055
$$ 2203100 2164864 2126752 2090006 2054614 2019624 1985162 1952572 1922319 1893154 1863893 1834838
53169A834838k8050k7112k6644k5914k4339k2140j9663j7174j5376j4917j5196
$$ 1834838 1806788 1779676 1753032 1727118 1702779 1680639 1660976 1643802 1628426 1613509 1598313
53158A598313j4745j3152j1577j1134j1553j1844j1468j0541r570r211r727j0491
$$ 1598313 1583568 1570416 1558839 1547705 1536152 1524308 1512840 1502299 1492729 1483518 1473791 1463300
53146A463300j0669j0393j0607j1673j2960j3905j4625j5302j5784j6041j6191
$$ 1463300 1452631 1442238 1431631 1419958 1406998 1393093 1378468 1363166 1347382 1331341 1315150
53135A315150j5925j4804j3493j3630j5869j8683j9869j8871j7188j6783j8324
$$ 1315150 1299225 1284421 1270928 1257298 1241429 1222746 1202877 1184006 1166818 1150035 1131711
53124A131711k0645k1823k1093j9588j8730j8272j6994j5059j4230j5462j7571
$$ 1131711 1111066 1089243 1068150 1048562 1029832 1011560 994566 979507 965277 949815 932244
53113I32244j8866j8941j8152j6592j4531j3055j3048j4110j5265j6133j6620
$$ 932244 913378 894437 876285 859693 845162 832107 819059 804949 789684 773551 756931
53102G56931j6159j4347j2007j0616j0838j2150j3541j4020j3048j1226j0010
$$ 756931 740772 726425 714418 703802 692964 680814 667273 653253 640205 628979 618969
53091F18969r956r823q399o542o177p558q969r115q435p790p115o014m773m085
$$ 618969 609013 599190 590791 584249 578072 570514 561545 552430 543995 536205 529090 523076 518303 514218
53077E14218m240n072o261p215p196o084m772m223m304m096l294k713l096l891
$$ 514218 509978 504906 498645 491430 484234 478150 473378 469155 464851 460755 457461 454748 451652 447761
53063D47761l832k670j668k102l738n267n765n200l893k412j761k609m101m464
$$ 447761 443929 441259 439591 437489 433751 428484 422719 417519 413626 411214 409453 406844 402743 398279
53049C98279l168j629j318k011k473k098j192k60K60J09l68l08N75J614K321L052
$$ 398279 395111 393482 392164 390153 387680 385582 384390 384130 384390 384499 384131 383823 384398 386012 388333 391385
53033C91385L879L854K510J210J594L058L391J713n73j883k134k026j871j718
$$ 391385 395264 399118 401628 402838 404432 407490 410881 412594 412021 410138 408004 405978 404107 402389
53019D02389j756k074k502l009l728m425m652m522m721n484o323o856p240p478
$$ 402389 400633 398559 396057 393048 389320 384895 380243 375721 371000 365516 359193 352337 345097 337619
53005C37619p058n772m298l496l535m029m619n066n135m750l942k641r75K35P9
$$ 337619 330561 324789 320491 316995 313460 309431 304812 299746 294611 289861 285919 283278 282303 282538 282617
52990B82617j071j681j112o97j876l868m412k762o97k46j241j881j148J47O30
$$ 282617 281546 279865 278753 278056 276180 272312 267900 265138 264441 264195 262954 261073 259925 260072 260702
52975B60702l2j162k068k627k942l109l391m101n014n246m241k634j640j569j510
$$ 260702 260670 259508 257440 254813 251871 248762 245371 241270 236256 231010 226769 224135 222495 220926 219416
52960B19416o77N09J094R98J095J864K568K239J142O47J534K927L296K195M97
$$ 219416 218739 219248 220342 221340 222435 224299 226867 229106 230248 230895 232429 235356 238652 240847 241344
52945B41344q39j664k230k565k449j810q36M6L69O2l75m90n86j206k032k077j138
$$ 241344 240505 238841 236611 234046 231597 229787 228951 228997 229366 229428 229053 228563 227977 226771 224739 222662 221524
52928B21524j71J57M26J297K208K032O82p60j282p03N45J720K121J656R61N35
$$ 221524 221353 221510 221936 223233 225441 227473 228155 227395 226113 225410 225955 227675 229796 231452 232413 232948
52912B32948J62l40l86N46J818K240J665J054J073J429J673J840K033K069J867
$$ 232948 233110 232770 232384 232930 234748 236988 238653 239707 240780 242209 243882 245722 247755 249824 251691
52897B51691J806K394L687N116N851N532M759M565N186N824N761N274N020N169
$$ 251691 253497 255891 259578 264694 270545 276077 280836 285401 290587 296411 302172 307446 312466 317635
52883C17635N544N958N915M809L110K481L745N468N654M117K012j48k446m125
$$ 317635 323179 329137 335052 339861 342971 345452 349197 354665 360319 364436 366448 366300 363854 359729
52869C59729m128k955k272k552k701k198j925k470l141l199k762k104j311r62
$$ 359729 355601 352646 350374 347822 345121 342923 340998 338528 335387 332188 329426 327322 326011 325049
52855C25049j696k736k447q93j16j073k140j698n51k85p24p23l29l15m25J18Q62
$$ 325049 323353 320617 318170 317277 317161 316088 313948 312250 311699 311414 310690 309967 309638 309323 308898 309016 309878
52838C09878O26n90j640j905j537l71J751L721L894K301P76N96J246J719J675
$$ 309878 310504 309914 308274 306369 304832 304461 306212 309933 313827 316128 316904 317500 318746 320465 322140
52823C22140R51p19k764l675k720r49L07J176K528M061M270K444j75j596j031
$$ 322140 323091 322372 319608 315933 313213 312264 312571 313747 316275 320336 324606 327050 326875 325279 324248
52808C24248N48J625J559Q69L80L35L66J07l71o46l86K84P79O68K21P5L84P23
$$ 324248 324796 326421 327980 328849 329229 329564 329930 330037 329666 329020 328634 328918 329697 330365 330586 330661 331045 331768
52790C31768R11J329K080K471J992J357J766L216M334M057K876K147K512L275
$$ 331768 332679 334008 336088 338559 340551 341908 343674 346890 351224 355281 358157 360304 362816 366091
52776C66091L243K031N66J12Q12J520J299N72L89R84J707K097K254K258K067K032
$$ 366091 369334 371365 371931 372043 372855 374375 375674 376246 376635 377619 379326 381423 383677 385935 388002 390034
52760C90034K718L812M046K679N59q89j310j425j653j725j643k161l716n388n759
$$ 390034 392752 396564 400610 403289 403848 402959 401649 400224 398571 396846 395203 393042 389326 383938 378179
52745C78179m683l533l573m675n865o512o563o151n653n683o402o940o295m642
$$ 378179 373496 369963 366390 361715 355850 349338 342775 336624 330971 325288 318886 311946 305651 301009
52731C01009l078k235j922j984k480k915k350q15L33r2j879l947n298n179l452
$$ 301009 297931 295696 293774 291790 289310 286395 284045 283230 283563 283471 281592 277645 272347 267168 263716
52716B63716j344p82k207m004m703m557m107k787m33J177L97j488j792m15R1j495
$$ 263716 262372 261590 259383 255379 250676 246119 242012 239225 238792 239969 240366 238878 237086 236671 236762 235267
52700B35267l391l724k940k347k166k186k774l812m083l079k231k810l675k941
$$ 235267 231876 228152 225212 222865 220699 218513 215739 211927 207844 204765 202534 199724 196049 193108
52686A93108j042j17p09j179m88L32N1j090k306l513m650m868l590j768r40j301
$$ 193108 192066 191949 191240 190061 189573 189905 189956 188866 186560 183047 178397 173529 169939 168171 167231 165930
52670A65930j722j481j057r65p28M07K072K738J284j627l943m074k353n64r2o60
$$ 165930 164208 162727 161670 160705 159977 160384 162456 165194 166478 164851 160908 156834 154481 153917 153825 153165
52654A53165r54k31Q29R16l95k123k859k142o59P11J529J585P51m34p72K53J429
$$ 153165 152211 151980 152809 153725 153330 151207 148348 146206 145547 146258 147787 149372 150123 149689 148917 149170 150599
52637A50599J110o13j935j614k52R00J374J309R40Q95K112M491O401O552N571
$$ 150599 151709 151096 149161 147547 147295 148195 149569 150878 151818 152713 154825 159316 165717 172269 177840
52622A77840M730L907K361Q52J184L443N603O208N886N610N082L786K351J645
$$ 177840 182570 186477 188838 189690 190874 194317 199920 206128 212014 217624 222706 226492 228843 230488
52608B30488J426R32L9r97k162l174l252k421k082l114m336m152k939k229k260
$$ 230488 231914 232846 232885 231888 229726 226552 223300 220879 218797 215683 211347 207195 204256 202027 199767
52593A99767k165j986k591l685m006l540l557m156l846k264j266k185l654l489
$$ 199767 197602 195616 193025 189340 185334 181794 178237 174081 170235 167971 166705 164520 160866 157377
52579A57377j533O40J772J532J17j510j731L8K388L593L643L501L197J974l6j771
$$ 157377 155844 156484 158256 159788 159905 158395 156664 156702 159090 162683 166326 169827 173024 174998 174962 173191
52563A73191k676l127l462l546l289k735j758l38R64J549J519J288Q12po27m73
$$ 173191 170515 167388 163926 160380 157091 154356 152598 152260 153224 154773 156292 157580 158392 158385 157758 157285
52547A57285N1P9m47r16j108j109n36Q90K176J914M06l87N41J997K465K068J844
$$ 157285 157336 157415 156968 156052 154944 153835 153299 154189 156365 158279 158685 158298 158839 160836 163301 165369 167213
52530A67213J927J538M81l54l0J354K826L602L796L919L917L229J911Q88N70J02
$$ 167213 169140 170678 171159 170805 170775 172129 174955 178557 182353 186272 190189 193418 195329 196217 196787 196889
52514A96889j140k119j513M4P42M89J120L341N273N022L236J925J660J337K23
$$ 196889 195749 193630 192117 192161 192903 193392 194512 197853 203126 208148 211384 213309 214969 216306 216529
52499B16529j039j381m47J227K662L161K893K535K183J229k89j029J61K504L898
$$ 216529 215490 214109 213662 214889 217551 220712 223605 226140 228323 229552 229263 228234 228395 230899 234797
52484B34797L203J304N0N18K251L641L374J739L90N12J672K709L096K883J986
$$ 234797 238000 239304 239354 239872 242123 245764 249138 250877 251267 251779 253451 256160 259256 262139 264125
52469B64125N46m90k12Q78J402J053R85J974L167L177J864K72o37p13l00K32O89
$$ 264125 264671 264181 263969 264847 266249 267302 268287 270261 273428 276605 278469 278741 278104 277391 277091 277323 278012
52452B78012J121J623J982J755R59M17R28K057K265O07j943l268k331l03P84K76
$$ 278012 279133 280756 282738 284493 285452 285869 286797 288854 291119 291726 289783 286515 284184 283881 284665 284941
52436B84941p00r50o18n28q49j094j138j332j677j676j229r05j014j020l57P19
$$ 284941 284241 283291 282673 282145 281296 280202 279064 277732 276055 274379 273150 272245 271231 270211 269854 270573
52420B70573J546J924K026J970K042K845M416N497M723K492P03M72J095J472J472
$$ 270573 272119 274043 276069 278039 280081 282926 287342 292839 297562 300054 300757 301229 302324 303796 305268
52405C05268J363R95M67O70K076L520L449K076J039J027J079L75n43q55o16j99
$$ 305268 306631 307626 308093 308763 310839 314359 317808 319884 320923 321950 323029 323404 322861 322006 321390 321191
52389C21191M56J323J760J328O09L98N88N72L06J84K94N30J062J824J988J035
$$ 321191 321647 322970 324730 326058 326667 327065 327653 328225 328531 328715 329009 329539 330601 332425 334413 335448
52373C35448Q8P75K716L518J789j027k628k610k227k108j620l50J009J577J187
$$ 335448 335536 336311 339027 342545 344334 343307 340679 338069 335842 333734 332114 331764 332773 334350 335537
52358C35537K1j778l519l804k000M76J462P80M81J962L901M054K344P92O19Q92
$$ 335537 335558 333780 330261 326457 324457 324933 326395 327175 327656 329618 333519 337573 339917 340709 341328 342220
52342C42220L43p10j105o33j30j28k54J9P04J406J858K226K826L385K884P90j621
$$ 342220 342563 341853 340748 340115 339985 339857 339603 339622 340326 341732 343590 345816 348642 352027 354911 355701 354080
52325C54080k147l24J720J731p2j616j549l81N90N87j68n96L44K276L440K749
$$ 354080 351933 351609 353329 355060 354988 353372 351823 351442 352032 352619 352451 351855 352199 354475 357915 360664
52309C60664J253O93J180J543J486J852K803L233K494J497J449K251K764K209
$$ 360664 361917 362610 363790 365333 366819 368671 371474 374707 377201 378698 380147 382398 385162 387371
52295C87371R47J28O58K154L221L156K877L361L886L232K189K924N642P774P259
$$ 387371 388318 388446 389104 391258 394479 397635 400512 403873 407759 410991 413180 416104 421746 429520 436779
52280D36779N098L627L686M592N747O789O919N649L954L516M804O667P681P198
$$ 436779 441877 445504 449190 453782 459529 466318 473237 478886 482840 486356 491160 497827 505508 512706
52266E12706N496L649K988L903N372O306O909P907Q946Q984Q097P643Q401R682
$$ 512706 518202 521851 524839 528742 534114 540420 547329 555236 564182 573166 581263 588906 597307 606989
52252F06989J0678J1718J3451J5460J6542J6182J5053J4240J4451J5973J8628
$$ 606989 617667 629385 642836 658296 674838 691020 706073 720313 734764 750737 769365
52241G69365K1465K3042K2724K1521K1127K2113K3657K5014K6334K7716K8485
$$ 769365 790830 813872 836596 858117 879244 901357 925014 950028 976362 1004078 1032563
52230A032563K8288K8111K8970L0152L0102K8813K7830K7824K7819K7220K6929
$$ 1032563 1060851 1088962 1117932 1148084 1178186 1206999 1234829 1262653 1290472 1317692 1344621
52219A344621K7573K7995K6766K4176K1523J9247J7027J5033J3681J2593J1071
$$ 1344621 1372194 1400189 1426955 1451131 1472654 1491901 1508928 1523961 1537642 1550235 1561306
52208A561306R345Q039O769M709K448J576K124K020j28l039m551m433m120m271
$$ 1561306 1570651 1578690 1585459 1590168 1592616 1594192 1596316 1598336 1598208 1595169 1590618 1586185 1582065 1577794
52194A577794m000k588o73O72J302J804K494L293M326N951Q050R894J1035J1901
$$ 1577794 1573794 1571206 1570533 1571205 1572507 1574311 1576805 1580098 1584424 1590375 1598425 1608319 1619354 1631255
52180A631255J3184J4958J6764J8286J9413J9986J9978J9838J9991K0145J9685
$$ 1631255 1644439 1659397 1676161 1694447 1713860 1733846 1753824 1773662 1793653 1813798 1833483
52169A833483J8659J7622J6553J4808J2245R531P051M485J858j3q48j836m345
$$ 1833483 1852142 1869764 1886317 1901125 1913370 1922901 1929952 1934437 1936295 1936282 1935434 1933598 1929253
52156A929253q161j1832j4349j5760j6497j6874j7165j7566j8111j8903k0119
$$ 1929253 1921092 1909260 1894911 1879151 1862654 1845780 1828615 1811049 1792938 1774035 1753916
52145A753916k1472k2153k1743k0769j9931j9332j8886j8803j8983j8584j7109
$$ 1753916 1732444 1710291 1688548 1667779 1647848 1628516 1609630 1590827 1571844 1553260 1536151
52134A536151j5298j4121j3363j2203j0634r159p572n457l722m033o354q418q322
$$ 1536151 1520853 1506732 1493369 1481166 1470532 1461373 1453801 1448344 1444622 1440589 1434235 1425817 1417495
52121A417495o614n166m801m893m754m562m815n429n587m666l300l027m420n989
$$ 1417495 1410881 1405715 1400914 1396021 1391267 1386705 1381890 1376461 1370874 1366208 1362908 1359881 1355461 1349472
52107A349472n805m046k880l670n415o394o398o382o648o523n766n194n467n876
$$ 1349472 1343667 1339621 1336741 1333071 1327656 1321262 1314864 1308482 1301834 1295311 1289545 1284351 1278884 1273008
52093A273008n063k880r13q49k681m934o424p090p164o433m796k910j606j104
$$ 1273008 1267945 1265065 1264152 1263303 1260622 1255688 1249264 1242174 1235010 1228577 1223781 1220871 1219265 1218161
52079A218161j289k189l506m211l571k281j674j964k321k514l203m369m686l198
$$ 1218161 1216872 1214683 1211177 1206966 1203395 1201114 1199440 1197476 1195155 1192641 1189438 1185069 1180383 1177185
52065A177185p71Q88J149P48N24N28L83M7lP23K053L183L589L703M412O019Q133
$$ 1177185 1176414 1177302 1178451 1179199 1179723 1180251 1180634 1180681 1180678 1181401 1183454 1186637 1190226 1193929 1198341 1204360 1212493
52048A212493J0378J2612J4511J5599J5901J6161J7203J9397K2567K6019K8764
$$ 1212493 1222871 1235483 1249994 1265593 1281494 1297655 1314858 1334255 1356822 1382841 1411605
52037A411605L0268L1017L1786L2585L3008L3400L4637L6565L7664L6886L5034
$$ 1411605 1441873 1472890 1504676 1537261 1570269 1603669 1638306 1674871 1712535 1749421 1784455
52026A784455L3718L3460L3342L2215K9762K6651K3974K2232K0792J8648J5702
$$ 1784455 1818173 1851633 1884975 1917190 1946952 1973603 1997577 2019809 2040601 2059249 2074951
52015B074951J2693R839O540K708n54k342l325m811p030r218j0992j2664j4297
$$ 2074951 2087644 2097483 2104023 2106731 2106177 2103835 2100510 2095699 2088669 2079451 2068459 2055795 2041498
52002B041498j5437j5990j6517j7385j8096j7852j6459j4445j2464j0789r216
$$ 2041498 2026061 2010071 1993554 1976169 1958073 1940221 1923762 1909317 1896853 1886064 1876848
51991A876848p391n226l029j189J22R91J623K268L112M140N312O799Q663J0217
$$ 1876848 1869457 1864231 1861202 1860013 1860135 1861126 1862749 1865017 1868129 1872269 1877581 1884380 1893043 1903260
51977A903260J0470R536Q988J0002J1610J1786J0112Q264P656P714P108N628L851
$$ 1903260 1913730 1923266 1932254 1942256 1953866 1965652 1975764 1984028 1991684 1999398 2006506 2012134 2015985
51964B015985J708j245m280n819n705n904q120j1633j4539j6394j8297k0737k2795
$$ 2015985 2017693 2016448 2012168 2006349 2000644 1994740 1986620 1974987 1960448 1944054 1925757 1905020 1882225
51951A882225k3728k4039k4565k5475k6672k8275l0045l1205l1567l2098l3589
$$ 1882225 1858497 1834458 1809893 1784418 1757746 1729471 1699426 1668221 1636654 1604556 1570967
51940A570967l5383l6373l6604l6935l7567l8045l8379l8930l9334l8740l7192
$$ 1570967 1535584 1499211 1462607 1425672 1388105 1350060 1311681 1272751 1233417 1194677 1157485
51929A157485l5722l4895l4274l3512l2874l2374l1400k9695k7821k6285k5021
$$ 1157485 1121763 1086868 1052594 1019082 986208 953834 922434 892739 864918 838633 813612
51918H13612k4141k4188k4868k4567k2153j8643j6029j4855j4159j3519j3724
$$ 813612 789471 765283 740415 715848 693695 675052 659023 644168 630009 616490 602766
51907F02766j5070j6235j5686j3574j1392j0033r075p957o956o602o754o884o972
$$ 602766 587696 571461 555775 542201 530809 520776 511701 503744 496788 490186 483432 476548 469576
51894D69576p351p860p904p410o916o486n526m125l562m593o039o189n130m377
$$ 469576 462225 454365 446461 439051 432135 425649 420123 415998 412436 407843 401804 395615 390485 386108
51880C86108m522m641m125l621l671l628k831j946k054k839k736j017J078J758
$$ 386108 381586 376945 372820 369199 365528 361900 359069 357123 355069 352230 349494 348477 349555 351313
51866C51313Q04k90l97k59j342l519n017m750l502k303r00J035K374J757k47j837
$$ 351313 352117 351827 351430 351171 349829 346310 341293 336543 333041 330738 329838 330873 333247 335004 334757 332920
51850C32920k524l294m400m791l975k822k142j929k371l968o025o628n029k809
$$ 332920 330396 327102 322702 317911 313936 311114 308972 307043 304672 300704 294679 288051 283022 280213
51836B80213j777j903k100j848j153r3O08k50k469l940l140j086L74R83J350J067
$$ 280213 278436 276533 274433 272585 271432 271339 271947 271697 269228 265288 262148 261062 261436 262419 263769 264836
51820B64836m79k222k416j209m04p47j300j349j163o83N93J980J740l38k065j652
$$ 264836 264357 262135 259719 258510 258106 257359 256059 254710 253547 252864 253457 255437 257177 256839 254774 253122
51804B53122n5P15N43Q95K179L072K701J997K242L115L173K010R48J242K340K653
$$ 253122 253067 253782 254325 255220 257399 260471 263172 265169 267411 270526 273699 275709 276657 277899 280239 282892
51788B82892J823J282K323M316N358M291J734o02j254r0J542K019J131J40qK13
$$ 282892 284715 285997 288320 292636 297994 302285 304019 303417 302163 302073 303615 305634 306765 306905 306897 307110
51772C07110P1m9N22J113L08j878l632l522k127j025p99p39j23P64J071N33j11
$$ 307110 307181 307132 307654 308767 309075 307197 303565 300043 297916 296891 296092 295353 295230 295994 297065 297598 297487
51755B97487J3P39J058N09k02k86K6P2p8J87Q71J336J302J168J178R68K29o94
$$ 297487 297500 298239 299297 299806 299604 299318 299344 299416 299338 299525 300396 301732 303034 304202 305380 306348 306577 305883
51737C05883j184j102q47q92j398k163k736k589j411N59K428L198K684J757J373
$$ 305883 304699 303597 302750 301858 300460 298297 295561 292972 291561 292120 294548 297746 300430 302187 303560
51722C03560J638K124K645K978K415O61j039j122jL69m67p03P59K436K610J950
$$ 303560 305198 307322 309967 312945 315360 316021 314982 313860 313859 314228 313761 313058 313817 316253 318863 320813
51706C20813K046K664K373J101J13o4J39P03J903K998K951K304K575L857M853
$$ 320813 322859 325523 327896 328997 329110 329046 329185 329888 331791 334789 337740 340044 342619 346476 351329
51691C51329N322O326P841Q278P123O081O519P583Q101Q687J0373J2376J3064
$$ 351329 356651 362977 370818 379096 386219 392300 398819 406402 414503 423190 433563 445939 459003
51678D59003J2390J1824J2233J3214J4366J5857J7609J8799J8388J5741J0959
$$ 459003 471393 483217 495450 508664 523030 538887 556496 575295 593683 609424 620383
51667F20383N215M54k045k808l304m062m308l432k142j766k752m138m550l636
$$ 620383 625598 626052 624007 621199 617895 613833 609525 606093 603951 602185 599433 595295 590745 587109
51653E87109k431k124k625k807k200j845k906m810n495l706n66J549J518L98k47
$$ 587109 584678 582554 579929 577122 574922 573077 570171 565361 559866 556160 555594 557143 558661 559059 558812
51638E58812k22l07n06M2J351K086J622J300K472M229M697L958L969N593P528
$$ 558812 558590 558283 557777 557819 559170 561256 562878 564178 566650 570879 575576 579534 583503 589096 596624
51623E96624Q564R175J0211J1224J1070R271O184K603k86j540j562j684k194j997
$$ 596624 605188 614363 624574 635798 646868 656139 662323 664926 664640 663100 661538 659854 657660 655663
51609F55663p94j44j082j967m38L142N973O394N501N011N064M855M260L808L480
$$ 655663 654869 654725 653643 651676 651238 654380 660353 666747 672248 677259 682323 687178 691438 695246 698726
51594F98726K407m5l312o007p402q310j0149j2997j5103j4764j2317r726q427
$$ 698726 701133 701088 697776 691769 684367 676057 665908 652911 637808 623044 610727 601001 592574
51581E92574q208q169q032q177q863r789j0335r965q558o568m830l954l763l470
$$ 592574 584366 576197 568165 559988 551125 541336 531001 521036 512478 505910 501080 497126 493363 489893
51567D89893k643j826j872k776l687m133m595n456o093n700m513l500l144l266
$$ 489893 487250 485424 483552 480776 477089 472956 468361 462905 456812 451112 446599 443099 439955 436689
51553D36689l634l940l584k458j702k390l668l572j737J03N29q7r18j825k443
$$ 436689 433055 429115 425531 423073 421371 418981 415313 411741 410004 410107 410636 410549 409631 407806 405363
51538D05363j791QR88j88k075k289p12P74J352K146L990N987O831O442N706N346
$$ 405363 403572 403580 404568 404380 402305 400016 399304 400078 401430 403576 407566 413553 420384 426826 432532 437878
51522D37878N583O280O961P049O426N554M917M573M280L764K819J427j48j591
$$ 437878 443461 449741 456702 463751 470177 475731 480648 485221 489501 493265 496084 497511 497363 495772
51508D95772k781l690m115l842l036k227j875j996k277k510k789l159l126k009
$$ 495772 492991 489301 485186 481344 478308 476081 474206 472210 469933 467423 464634 461475 458349 456340
51494D56340j15J134Q20j61k10R65K480L931N467O491O095N007N171O774P637
$$ 456340 456225 457359 458179 458018 457808 458773 461253 465184 470651 477142 483237 488244 493415 500189 507826
51479E07826O564N293N596O250N066K590J272J593J532j07k072k722j995q60k52
$$ 507826 514390 519683 525279 531529 536595 539185 540457 542050 543582 543475 541403 538681 536686 535826 535574
51464E35574q52k593m042l596j611k0L61P18J991L366L782L598L733M081L812
$$ 535574 534722 532129 528087 524491 522880 522860 523221 523939 525930 529296 533078 536676 540409 544490 548302
51449E48302K574O07j705l675m392l828l262l852n182n927n633n066n075n692
$$ 548302 550876 551483 549778 546103 541711 537883 534621 530769 525587 519660 514027 508961 503886 498194
51435D98194o279o135n158m070l704l907l677k683j924k362l492m012l562k934
$$ 498194 491915 485780 480622 476552 472848 468941 465264 462581 460657 458295 454803 450791 447229 444295
51421D44295k674k228p65J618L799M697M368L895M169M956N553O000O960Q425
$$ 444295 441621 439393 438628 440246 444045 448742 453110 457005 461174 466130 471683 477683 484643 493068
51407D93068R453R496R141R020Q785P919O923O737P353P964Q351R086J0225J0705
$$ 493068 502521 512017 521158 530178 538963 546882 553805 560542 567895 575859 584210 593296 603521 614226
51393F14226R534P114M955M229M785N398M925L349J800J320J775K159J817Q78
$$ 614226 623760 630874 635829 640058 644843 650241 655166 658515 660315 661635 663410 665569 667386 668264
51379F68264k96j398j855r43J244L476M574M683M837N447N792N039L284J511O98
$$ 668264 667968 666570 664715 663772 665016 668492 673066 677749 682586 688033 693825 698864 702148 703659 704357
51364G04357J033J660J304m33k461l387l287l635n191o862p168o238n519n860
$$ 704357 705390 707050 708354 707921 705460 702073 698786 695151 689960 683098 675930 669692 664173 658313
51350F58313o720p127o619n267l558k300k005k238k156j649j282j164p48J69J102
$$ 658313 651593 644466 637847 632580 629022 626722 624717 622479 620323 618674 617392 616228 615480 615649 616751
51335F16751J810K577L352L560L158K862K840K366J399J121J880J852o49m459
$$ 616751 618561 621138 624490 628050 631208 634070 636910 639276 640675 641796 643676 645528 644879 640420
51321F40420o852p021o510o537o898p538r150j1491j2852j2168j0515r552r604
$$ 640420 633568 626547 620037 613500 606602 599064 589914 578423 565571 553403 542888 533336 523732
51308E23732j0170j1248j2923j4289j4178j2726j1198j0313r603q482p039n716
$$ 523732 513562 502314 489391 475102 460924 448198 437000 426687 417084 408602 401563 395847
51296C95847m743m207m210m702n346n714n506m670l555k860l028l627l578k299
$$ 395847 391104 386897 382687 377985 372639 366925 361419 356749 353194 350334 347306 343679 340101 337802
51282C37802m54O72N01m19j292j879k169j753l24J281J475k71k669m016l838k639
$$ 337802 337348 338020 338521 338102 336810 334931 332762 331009 330685 331966 333441 333170 330501 326485 322647 320008
51266C20008q12J265K686K673J747J324K031L204L879L616K473J117R04K686N298
$$ 320008 319196 320461 323147 325820 327567 328891 330922 334126 338005 341621 344094 345211 346115 348801 354099
51251C54099O376N154L439L309M729O175O638O054M506K288N35M72J750K402R40
$$ 354099 360475 365629 369068 372377 377106 383281 389919 395973 400479 402767 403302 403774 405524 407926 408866
51236D08866k013m557n669o001o603p476p766p196o550o581o942o807o060n251
$$ 408866 406853 402296 396627 390626 384023 376547 368781 361585 355035 348454 341512 334705 328645 323394
51222C23394m591l873l266l284l782l840l039k029j565j701k334l626n261o090
$$ 323394 318803 314930 311664 308380 304598 300758 297719 295690 294125 292424 290090 286464 281203 275113
51208B75113n425m108l299k719j257Q37J740M60j623k373j431k66j5k38K7P64
$$ 275113 269688 265580 262281 259562 258305 259142 260882 261342 259719 257346 255915 255649 255634 255396 255423 256187
51192B56187J109O65L9J2O22J216J073K5j297j806j038J12M13J29Q14K859M385
$$ 256187 257296 257961 258000 258012 258634 259850 260923 260948 259651 257845 256807 256919 257332 257461 258275 261134 265519
51175B65519L636J422j51p41j754l449m056k344M66K180J959N20r57j434m84J044
$$ 265519 269155 270577 270426 269685 267931 264482 260426 258082 258548 260728 262687 263207 262250 260816 260332 261376
51159B61376J561O63k31K22J638K799L204K868J518q04k915l505k644j362k17
$$ 261376 262937 263600 263369 263591 265229 268028 271232 274100 275618 274814 271899 268394 265750 264388 264171
51144B64171P75J298J067O75R63J678J812J178M34j90r72j483p40J059K200J517
$$ 264171 264946 266244 267311 267986 268949 270627 272439 273617 274051 273861 272889 271406 270666 271725 273925 275442
51128B75442k33j668k519l229l609k956j351N6L05l41q00m90k6m42j682k273j069
$$ 275442 275209 273541 271022 267793 264184 261228 259877 259933 260238 259897 259097 258607 258581 258139 256457 254184 253115
51111B53115J064K015J040l54m79L81O36l11j388j486q52n34r44j448j176O2J571
$$ 253115 254179 256194 257234 256880 256401 256782 257418 257107 255719 254233 253381 252847 251903 250455 249279 249341 250912
51094B50912K265J474m07k077k529k160k331l566m714m303k418o10l6m14q41r24
$$ 250912 253177 254651 254244 252167 249638 247478 245147 241581 236867 232564 230146 229536 229500 229086 228245 227321
51078B27321p79m96j30J13L1l51q72j283j230n86K04O09Q75J679K866L478L294
$$ 227321 226542 226046 225916 226029 226060 225709 224837 223554 222324 221738 221942 222551 223426 225105 227971 231449 234743
51061B34743L312M096M705M174L098K656K812K746K477K558K513J208j077k558
$$ 234743 238055 242151 246856 251030 254128 256784 259596 262342 264819 267377 269890 271098 270021 267463
51047B67463k289j322r35r42o04k38p84k197l256k908j331M25J453J673J733K136
$$ 267463 265174 263852 262917 261975 261371 261133 260349 258152 254896 251988 250657 251082 252535 254208 255941 258077
51031B58077K662K809K610K425K092J115j67n27N15J703J463j17j449j413n04
$$ 258077 260739 263548 266158 268583 270675 271790 271623 271096 271611 273314 274777 274660 273211 271798 271294
51016B71294J2m02j107j107k10P79J055R21J397K717L834L673K445J229O85O84
$$ 271294 271306 270904 269797 268690 268480 269259 270314 271235 272632 275349 279183 282856 285301 286530 287215 287899
51000B87899Q90J046Q31J70l86j92L89K84o35r67M14K522L271K143P26M25Q34
$$ 287899 288789 289835 290666 290836 290450 290258 290647 290931 290296 289329 289743 292265 295536 297679 298405 298830 299664
50983B99664J070J632L532O187P647P064N601M571L927L216K796L062L347K743
$$ 299664 300734 302366 305898 312085 319732 326796 332397 336968 340895 344111 346907 349969 353316 356059
50969C56059J585J017J293J558J186M71n9k16l0K76J84n87j491j645q24N47K030
$$ 356059 357644 358661 359954 361512 362698 363169 363110 362894 362864 363140 363324 362737 361246 359601 358777 359324 361354
50952C61354L157L196J982P71J090K781M376N328O413P724P937O414M616M337
$$ 361354 364511 367707 369689 370460 371550 374331 378707 384035 390448 398172 406109 412523 417139 421476
50938D21476N519O989Q427J0246J2057J2751J2081J1094J0893J1689J3080J4524
$$ 421476 426995 433984 442411 452657 464714 477465 489546 500640 511533 523222 536302 550826
50926E50826J5665J6769J8764K2120K5717K7694K7543K6755K7214K9555L3144
$$ 550826 566491 583260 602024 624144 649861 677555 705098 731853 759067 788622 821766
50915H21766L6938M0123M2524M4927M8535N3707N9447O4471O8560P2449P6675
$$ 821766 858704 898827 941351 986278 1034813 1088520 1147967 1212438 1280998 1353447 1430122
50904A430122Q1119Q5678R0672R6042J00557J02627J02128J00724R9879R8923
$$ 1430122 1511241 1596919 1687591 1783633 1884190 1986817 2088945 2189669 2289548 2388471
50894B388471R5829Q9671Q1472P2622O3379N3466M3194L3107K2992J2218J028
$$ 2388471 2484300 2573971 2655443 2728065 2791444 2844910 2888104 2921211 2944203 2956421 2957449
50883B957449r355j7995k4886l0191l3581l4920l5034l5120l5488l5434l4509
$$ 2957449 2948094 2930099 2905213 2875022 2841441 2806521 2771487 2736367 2700879 2665445 2630936
50872B630936l3445l3578l5541l8838m2582m6298m9932n3402n6545n9493o2781
$$ 2630936 2597491 2563913 2528372 2489534 2446952 2400654 2350722 2297320 2240775 2181282 2118501
50861B118501o6837p1315p5082p6938p6471p4224p0999o7334o3675o0726n8772
$$ 2118501 2051664 1980349 1905267 1828329 1751858 1677634 1606635 1539301 1475626 1414900 1356128
50850A356128n6775n3052m7418m1874l8377l6443l3945k9915k5377k1512j8272
$$ 1356128 1299353 1246301 1198883 1157009 1118632 1082189 1048244 1018329 992952 971440 953168
50839I53168j5191j2442j0402q854p296n506l423r83J423K935L288L373M127N328
$$ 953168 937977 925535 915133 906279 898983 893477 890054 889071 890494 893429 896717 900090 904217 909545
50825I09545O162O604P401Q803J0084J0563J0564J1159J3041J5733J7989J9074
$$ 909545 915707 922311 929712 938515 948599 959162 969726 980885 993926 1009659 1027648 1046722
50813A046722J9644K0959K3369K6129K8618L0953L3291L5504L7920M1305M5542
$$ 1046722 1066366 1087325 1110694 1136823 1165441 1196394 1229685 1265189 1303109 1344414 1389956
50802A389956M9419N2542N6310O1915O8438P4477Q0646Q8610R8237J07799J16851
$$ 1389956 1439375 1491917 1548227 1610142 1678580 1753057 1833703 1922313 2020550 2128349 2245200
50791B245200J26772J38091J49528J60441J72105J85217J97908K07871K15307
$$ 2245200 2371972 2510063 2659591 2820032 2992137 3177354 3375262 3583133 3798440
50782C798440K21881K27546K30272K28666K23147K14333K01745J84572J62854
$$ 3798440 4020321 4247867 4478139 4706805 4929952 5144285 5346030 5530602 5693456
50773E693456J37454J09582Q0603N1748K3822k457k5954m5663o1701p4945q5447
$$ 5693456 5830910 5940492 6021095 6072843 6096665 6094208 6068254 6022591 5960890 5885945 5800498
50762E800498r2070r3924r1549q6406q0032p3988o9765o7937o8004o9818p4536
$$ 5800498 5708428 5614504 5522955 5436549 5356517 5282529 5212764 5144827 5076823 5007005 4932469
50751D932469q3202r4793j06942j18479j30013j41714j52025j59458j64542j68626
$$ 4932469 4849267 4754474 4647532 4529053 4399040 4257326 4105301 3945843 3781301 3612675
50741C612675j71397j71143j67416j61913j56203j49879j41728j31786j21208
$$ 3612675 3441278 3270135 3102719 2940806 2784603 2634724 2492996 2361210 2240002
50732B240002j10726j00370r0378q1332p3319o5840n8649n1967m5802l9805l4037
$$ 2240002 2129276 2028906 1938528 1857196 1783877 1718037 1659388 1607421 1561619 1521814 1487777
50721A487777k9146k5469k2539j9738j7063j4848j3267j2197j1238r747p517n568
$$ 1487777 1458631 1433162 1410623 1390885 1373822 1358974 1345707 1333510 1322272 1312525 1305008 1299440
50709A299440n395o956q181p207m500k049r96q93q67n24K42J392K615L736N328
$$ 1299440 1294045 1287089 1278908 1271701 1267201 1265152 1264156 1263263 1262396 1261872 1262114 1263506 1266121 1269857 1275185
50694A275185Q205J2249J6331J9540K1945K4174K6774K9980L3518L6704L9419
$$ 1275185 1283390 1295639 1311970 1331510 1353455 1377629 1404403 1434383 1467901 1504605 1544024
50683A544024M2861M8333N5247O1571O6552P1708P8436Q5858R2237R7618J03535
$$ 1544024 1586885 1635218 1690465 1752036 1818588 1890296 1968732 2054590 2146827 2244445 2347980
50672B347980J10593J17911J24886J31978J39168J44895J47404J46515J43313
$$ 2347980 2458573 2576484 2701370 2833348 2972516 3117411 3264815 3411330 3554643
50663C554643J38425J31325J21323J08738R4873Q0767O5972M8842K8423N867j6457
$$ 3554643 3693068 3824393 3945716 4054454 4149327 4230094 4296066 4344908 4373331 4379198 4362741
50652D362741l6964n5227p0475q1107q6316q7467q6822q5430q2897p8837p3474
$$ 4362741 4325777 4270550 4200075 4118968 4032652 3945185 3858363 3772933 3690036 3611199 3537725
50641C537725o7114o0109n3530m8922m7000m7319m9556n4270o1780p0907p9669
$$ 3537725 3470611 3410502 3356972 3308050 3261050 3213731 3164175 3109905 3048125 2977218 2897549
50630B897549q7011r3082r8059j01437j02647j01712r9016r5004r0234q5216p9845
$$ 2897549 2810538 2717456 2619397 2517960 2415313 2313601 2214585 2119581 2029347 1944131 1864286
50619A864286p3529o6336n9451n3813m8680m2562l5517k9404k5432k2405j8261
$$ 1864286 1790757 1724421 1664970 1611157 1562477 1519915 1484398 1454994 1429562 1407157 1388896
50608A388896j2712p299l111L69L981P543J0460J2909J5549J8386K0782K2512
$$ 1388896 1376184 1368885 1365774 1366143 1370124 1377667 1388127 1401036 1416585 1434971 1455753 1478265
50596A478265K4037K5643K7158K8813L1549L5664L9737M2002M2816M4612M9025
$$ 1478265 1502302 1527945 1555103 1583916 1615465 1651129 1690866 1732868 1775684 1820296 1869321
50585A869321N4982O0333O4447O8194P2063P5835P9989Q5526R1842R6362R7509
$$ 1869321 1924303 1984636 2049083 2117277 2189340 2265175 2345164 2430690 2522532 2618894 2716403
50574B716403R6863R7002R8121R8366R6812R4087R0230Q4127P5639O6430N7681
$$ 2716403 2813266 2910268 3008389 3106755 3203567 3297654 3387884 3472011 3547650 3614080 3671761
50563C671761M8636L8482K8384K0005J3057N979j392p384j0578j0991r255n941
$$ 3671761 3720397 3758879 3787263 3807268 3820325 3826304 3824912 3817528 3806950 3795959 3786704 3780763
50551C780763j924J670M292N967O404M977J755k249o224j0265j4870k0425k7377
$$ 3780763 3778839 3780509 3784801 3790768 3797172 3802149 3803904 3801655 3795431 3785166 3770296 3749871 3722494
50538C722494l6110m6293n6913o7173p6835q5649r3227r9532j04654j07988j08675
$$ 3722494 3686384 3640091 3583178 3516005 3439170 3353521 3260294 3160762 3056108 2948120 2839445
50527B839445j07204j05277j03567j00663r5214q8149q1612p6337p1327o5688
$$ 2839445 2732241 2626964 2523397 2422734 2327520 2239371 2157759 2081422 2010095 1944407
50517A944407n9610n3676m8252m3486l9083l4188k8351k2520j8053j4740j0992
$$ 1944407 1884797 1831121 1782869 1739383 1700300 1666112 1637761 1615241 1597188 1582448 1571456
50506A571456o158j435K057M952Q479J2463J5689J7918K0356K3909K7938L1163
$$ 1571456 1565298 1563863 1565920 1570872 1579351 1591814 1607503 1625421 1645777 1669686 1697624 1728787
50494A728787L3230L4792L6371L7786L8752L9551M0751M2521M4526M6472M8384
$$ 1728787 1762017 1796809 1833180 1870966 1909718 1949269 1990020 2032541 2077067 2123539 2171923
50483B171923N0284N1948N3178N4185N5436N7251N9633O2431O5436O8473P1584
$$ 2171923 2222207 2274155 2327333 2381518 2436954 2494205 2553838 2616269 2681705 2750178 2821762
50472B821762P5208Q0039Q6635R5064J04625J14040J22337J29876J37984J47123
$$ 2821762 2896970 2977009 3063644 3158708 3263333 3377373 3499710 3629586 3767570 3914693
50462C914693J55789J61928J65348J67836J70669J72724J71570J65819J55853
$$ 3914693 4070482 4232410 4397758 4565594 4736263 4908987 5080557 5246376 5402229
50453E402229J42676J26888J08700Q8141O5005L9354J2402j3639l7183n8480p8557
$$ 5402229 5544905 5671793 5780493 5868634 5933639 5972993 5985395 5971756 5934573 5876093 5797536
50442E797536r7185j12517j22900j28339j29973j28554j23878j15383j02996q7573
$$ 5797536 5700351 5587834 5464934 5336595 5206622 5078068 4954190 4838807 4735811 4648238
50432D648238p0818n4487l9270k4625j0075L563J4615K1815K4643K2688J5537
$$ 4648238 4577420 4522933 4483663 4459038 4448963 4452526 4467141 4488956 4513599 4536287 4551824
50421D551824L431j2656l1835n3607p7094j00442j21299j37701j48512j53708
$$ 4551824 4555255 4542599 4510764 4457157 4380063 4279621 4158322 4020621 3872109 3718401
50411C718401j54645j53531j51984j50035j46618j40863j32821j23267j13111
$$ 3718401 3563756 3410225 3258241 3108206 2961588 2820725 2687904 2564637 2451526
50402B451526j02828r2434q2168p2807o4798n7332m9297m1104l4454k9892k5785
$$ 2451526 2348698 2256264 2174096 2101289 2036491 1979159 1929862 1888758 1854304 1824412 1798627
50391A798627k0363j3767p217j306L825P664J0207J3035J7710K3390K7675K9862
$$ 1798627 1778264 1764497 1757280 1755974 1759799 1767463 1777670 1790705 1808415 1831805 1859480 1889342
50379A889342L1578L4000L6292L7533L8424L9925M1582M2556M3331M4752M6038
$$ 1889342 1920920 1954920 1991212 2028745 2067169 2107094 2148676 2191232 2234563 2279315 2325353
50368B325353M5419M2689L9726L8213L7862L7172L5179L2192K9436K8084K8077
$$ 2325353 2370772 2413461 2453187 2491400 2529262 2566434 2601613 2633805 2663241 2691325 2719402
50357B719402K7896K6261K4032K3536K5762K9202L1994L4230L7349M1896M6973
$$ 2719402 2747298 2773559 2797591 2821127 2846889 2876091 2908085 2942315 2979664 3021560 3068533
50346C068533N1519N5191N7898N9366N9341N7684N4285M9493M4439M0047L5454
$$ 3068533 3120052 3175243 3233141 3292507 3351848 3409532 3463817 3513310 3557749 3597796 3633250
50335C633250K8522J8356O442n459j7676l1685m7318o2251p4437q3924r1893r8684
$$ 3633250 3661772 3680128 3686570 3681111 3663435 3631750 3584432 3522181 3447744 3363820 3271927 3173243
50323C173243j03387j04878j02775r7645r0554q2230p2645o1703n0203l9490l0072
$$ 3173243 3069856 2964978 2862203 2764558 2674004 2591774 2519129 2457426 2407223 2367733 2337661
50312B337661k1325j2676m336L454J0788J6947J9775J7390J0299R21q725j7984
$$ 2337661 2316336 2303660 2299324 2302778 2313566 2330513 2350288 2367678 2377977 2378898 2370173 2352189
50300B352189k6564l3863l9817m5351n1226n6722o0132o0576n9028n7240n5738
$$ 2352189 2325625 2291762 2251945 2206594 2155368 2098646 2038514 1977938 1918910 1861670 1805932
50289A805932n3315m8819m3163l8721l6648l5738l4228l1752k8770k5290k1413
$$ 1805932 1752617 1703798 1660635 1621914 1585266 1549528 1515300 1483548 1454778 1429488 1408075
50278A408075j8325j7093j6724j5097j1820q580o412m377j462J820M675P487J0779
$$ 1408075 1389750 1372657 1355933 1340836 1329016 1320436 1314024 1309647 1308185 1310005 1314680 1322167 1332946
50265A332946J3851J5744J6845J8191J9852K1209K2301K3567K4689K5007K4820
$$ 1332946 1346797 1362541 1379386 1397577 1417429 1438638 1460939 1484506 1509195 1534202 1559022
50254A559022K4893K5016K4600K4530K6431K9678L1165K9095K5476K3344K2789
$$ 1559022 1583915 1608931 1633531 1658061 1684492 1714170 1745335 1774430 1799906 1823250 1846039
50243A846039K1526J8635J5662J3985J2878J0891P817M472J297j853m976p756
$$ 1846039 1867565 1886200 1901862 1915847 1928725 1939616 1947433 1951905 1953202 1951349 1946373 1938617
50231A938617j0018j1852j3399j4830j6402j8263k0327k2519k4918k7349k9245
$$ 1938617 1928599 1916747 1903348 1888518 1872116 1853853 1833526 1811007 1786089 1758740 1729495
50220A729495l0298l0966l1765l2288l1550k9406k6990k5595k5480k5893k5816
$$ 1729495 1699197 1668231 1636466 1604178 1572628 1543222 1516232 1490637 1465157 1439264 1413448
50209A413448k4556k2170j9605j8050j7805j8081j8047j7632j6912j5295j2165
$$ 1413448 1388892 1366722 1347117 1329067 1311262 1293181 1275134 1257502 1240590 1225295 1213130
50198A213130q126m881l645m104n018n437n099m073k557r50J88N10J41n90j614
$$ 1213130 1205004 1200123 1196478 1192374 1187356 1181919 1176820 1172747 1170190 1169240 1169428 1169938 1170079 1169489 1167875
50183A167875l072m714n708n451m422l742l947m683n512o320o698n941m161k729
$$ 1167875 1164803 1160089 1154381 1148930 1144508 1140766 1136819 1132136 1126624 1120304 1113606 1107665 1103504 1100775
50169A100775k879m266n643o408o726o562n684m484l789l726l549k646r84J261
$$ 1100775 1097896 1093630 1087987 1081579 1074853 1068291 1062607 1058123 1054334 1050608 1047059 1044413 1043429 1044690
50155A044690L667N142M806L445L021M199N453N184L656K031M93j452l426m279
$$ 1044690 1048357 1053499 1058305 1061750 1064771 1068970 1074423 1079607 1083263 1085294 1085787 1084335 1080909 1076630
50141A076630l699k636k109k352l142m263n550p021q937j1102j2340j1548r335
$$ 1076630 1072931 1070295 1068186 1065834 1062692 1058429 1052879 1045858 1036921 1025819 1013479 1001931 992596
50128I92596p701p777q621q721p820o719n885n234m882n110n546n344m517m285
$$ 992596 984895 977118 968497 959776 951956 945237 939352 934118 929236 924126 918580 913236 908719 904434
50114I04434n485p190p649o441m818l929l501k664j365k55L37M99M7j320l211
$$ 904434 898949 891759 884110 877669 872851 868922 865421 862757 861392 861137 861474 861973 862020 860700 857489
50099H57489m764n930p597r922j1477j0906q863p228o721o471n824n282n240n020
$$ 857489 852725 846795 839198 829276 817799 806893 798030 790802 784081 777610 771786 766504 761264 756244
50085G56244m055l016k770k730j625L18J316N02p36n68J005K509L023K894K717
$$ 756244 752189 749173 746403 743673 742048 742366 743682 744184 743448 742880 743885 746394 749417 752311 755028
50070G55028K638K753L339M398N536O547P651Q905R852J0112J0061J0504J1733
$$ 755028 757666 760419 763758 768156 773692 780239 787890 796795 806647 816759 826820 837324 849057
50057H49057J3238J4284J4690J4869J5172J5374J5180J4965J5277J5444J3902
$$ 849057 862295 876579 891269 906138 921310 936684 951864 966829 982106 997550 1011452
50046A011452J0664Q293Q807J0545J0130P289N204N749O955O459M946M180L660
$$ 1011452 1022116 1030409 1039216 1049761 1059891 1067180 1072384 1078133 1085088 1091547 1096493 1100673 1104333
50033A104333J868l44n53J459L240L154K051J261J024J384K641M302N236N452
$$ 1104333 1106201 1105857 1105304 1106763 1110003 1113157 1115208 1116469 1117493 1118877 1121518 1125820 1131056 1136508
50019A136508O127P413Q028P670P915R689J1676J2425J2477J3007J3962J5034
$$ 1136508 1142635 1150048 1158076 1165746 1173661 1183350 1195026 1207451 1219928 1232935 1246897 1261931
50007A261931J7046K0433K3413K3781K1874J9999J9312J9082J8682J8442J8454
$$ 1261931 1278977 1299410 1322823 1346604 1368478 1388477 1407789 1426871 1445553 1463995 1482449
49996A482449J8165J7464J6906J6590J5907J4517J2588J0201P531N481M843M703
$$ 1482449 1500614 1518078 1534984 1551574 1567481 1581998 1594586 1604787 1612318 1617799 1622642 1627345
49984A627345L096n83m892q322j0707j2397j3436j4101j5165j6736j7741j7362
$$ 1627345 1630441 1629858 1624966 1616644 1605937 1593540 1580104 1566003 1550838 1534102 1516361 1498999
49972A498999j6316j5925j6488j7217j7279j6309j4325j1808r594q219p498p002
$$ 1498999 1482683 1466758 1450270 1433053 1415774 1399465 1385140 1373332 1363738 1355519 1348021 1341019
49960A341019o594o247n805n252m745m126k886r63R68K357L328L950L693K428
$$ 1341019 1334425 1328178 1322373 1317121 1312376 1308250 1305364 1304401 1305369 1307726 1311054 1315004 1318697 1321125
49946A321125J398K098M261N952N853M768M582O122Q355R516Q891P537O995P280
$$ 1321125 1322523 1324621 1328882 1334834 1340687 1345455 1350037 1356159 1364514 1374030 1382921 1390458 1397453 1404733
49932A404733O721M274J309k0J65m97l233o275p235o202n070m739m606m563n525
$$ 1404733 1411454 1415728 1417037 1417017 1417182 1416685 1413452 1407177 1399942 1393740 1388670 1383931 1379325 1374762 1369237
49917A369237p506q882q612p987q986j1766j5067j8390k2158k5927k8096k7912
$$ 1369237 1361731 1352849 1344237 1336250 1327264 1315498 1300431 1282041 1259883 1233956 1205860 1177948
49905A177948k6603k5943k6368k6918k6505k4857k2763k1443k1287k1151j9676
$$ 1177948 1151345 1125402 1099034 1072116 1045611 1020754 997991 976548 955261 934110 914434
$$ [...]
##END NTUPLES=NMR SPECTRUM
##END=
