
##TITLE=AC1179_popayan-inza-3-cauca-CINAH1206_5891194_hQcdX3Hi6k
##JCAMPDX= 6.0         $$ Bruker NMR JCAMP-DX V2.0
##DATA TYPE= NMR SPECTRUM
##DATA CLASS= NTUPLES
##ORIGIN= BRUKER
##OWNER= Administrator
$$ 1.72 TOPSPIN		Version 2.1
$$ 2012-04-02 22:08:50.265 -0500  Administrator@TOPSPIN
$$ Compression mode = diff/dup
##.OBSERVE FREQUENCY= 400.13188235
##.OBSERVE NUCLEUS= ^1H
##.ACQUISITION MODE= SIMULTANEOUS (DQD)
##.ACQUISITION SCHEME= undefined
##.AVERAGES= 8
##.DIGITISER RES= 22
##SPECTROMETER/DATA SYSTEM= spect
##.PULSE SEQUENCE= zg30
##.SOLVENT NAME= COFFEE_meoh
##.SHIFT REFERENCE= INTERNAL, COFFEE_meoh, 1, 14.98061
##AUDIT TRAIL= $$ (NUMBER, WHEN, WHO, WHERE, PROCESS, VERSION, WHAT)
$$ ##TITLE= Audit trail, TOPSPIN		Version 2.1
$$ ##JCAMPDX= 5.01
$$ ##ORIGIN= Bruker BioSpin GmbH
$$ ##OWNER= Administrator
$$ $$ C:\Bruker\TOPSPIN/data/COFFEE/nmr/AC1179_popayan-inza-3-cauca-CINAH1206_5891194_hQcdX3Hi6k/10/pdata/1/auditp.txt
$$ ##AUDIT TRAIL=  $$ (NUMBER, WHEN, WHO, WHERE, PROCESS, VERSION, WHAT)
(   1,<2012-04-02 22:08:42.187 -0500>,<Administrator>,<TOPSPIN>,<go>,<TOPSPIN 2.1>,
      <created by zg
	started at 2012-04-02 22:07:35.234 -0500,
	POWCHK enabled, PULCHK disabled,
       configuration hash MD5:
       1A 1E CE 29 27 FD 77 03 67 4E F0 E3 C4 B2 CB 90
       data hash MD5: 64K
       C4 CF BA EE DA 2A 4F 06 5E E4 40 2B 38 A6 81 DB>)
(   2,<2012-04-02 22:08:45.187 -0500>,<Administrator>,<TOPSPIN>,<proc1d>,<TOPSPIN 2.1>,
      <Start of raw data processing
       efp LB = 0 FT_mod = 6 PKNL = 1 PHC0 = 0 PHC1 = 0 SI = 32K 
       data hash MD5: 32K
       4D CF 81 53 EB 72 A2 B2 51 F9 F3 36 93 6D 6D 05>)
(   3,<2012-04-02 22:08:45.593 -0500>,<Administrator>,<TOPSPIN>,<proc1d>,<TOPSPIN 2.1>,
      <pk PHC0 = 209.7729 PHC1 = 0 
       data hash MD5: 32K
       1B 8B C0 B5 63 AF 35 25 47 05 A2 A1 57 85 2E C7>)
(   4,<2012-04-02 22:08:45.656 -0500>,<Administrator>,<TOPSPIN>,<proc1d>,<TOPSPIN 2.1>,
      <abs ABSG = 1 
       data hash MD5: 32K
       64 19 FE 02 23 1B 71 62 1D 43 93 39 CB 24 08 70>)
(   5,<2012-04-02 22:08:45.703 -0500>,<Administrator>,<TOPSPIN>,<proc1d>,<TOPSPIN 2.1>,
      <abs ABSG = 2 
       data hash MD5: 32K
       DF BB 1E 75 18 1F 94 3B 4B DC 9E E3 CD 16 2F 3E>)
(   6,<2012-04-02 22:08:45.734 -0500>,<Administrator>,<TOPSPIN>,<proc1d>,<TOPSPIN 2.1>,
      <abs ABSG = 3 
       data hash MD5: 32K
       0E 4D AA B8 B9 17 00 F6 32 A0 A8 9D 1E F6 2E 45>)
(   7,<2012-04-02 22:08:45.781 -0500>,<Administrator>,<TOPSPIN>,<proc1d>,<TOPSPIN 2.1>,
      <abs ABSG = 4 
       data hash MD5: 32K
       31 08 15 A4 7F 42 52 09 73 E6 47 19 88 5E 22 E0>)
(   8,<2012-04-02 22:08:45.828 -0500>,<Administrator>,<TOPSPIN>,<proc1d>,<TOPSPIN 2.1>,
      <abs ABSG = 5 
       data hash MD5: 32K
       74 8F D7 48 B3 31 C7 E1 AF 10 5A 05 40 45 3C C6>)
$$ ##END=
$$ 
$$ $$ hash MD5
$$ $$ 09 77 07 BC A1 5C E6 F2 A7 5B 34 42 DF 88 00 19
##$RELAX= 
##$RELAX= 
##$RELAX= 
##$RELAX= 
##$RELAX= 
##$RELAX= 
##$RELAX= 
$$ Bruker specific parameters
$$ [...]
##$TP= (0..7)
150 150 150 150 150 150 150 150
##$TP07= 0
##$TPNAME0= <>
##$TPNAME1= <>
##$TPNAME2= <>
##$TPNAME3= <>
##$TPNAME4= <>
##$TPNAME5= <>
##$TPNAME6= <>
##$TPNAME7= <>
##$TPOAL= (0..7)
0.5 0.5 0.5 0.5 0.5 0.5 0.5 0.5
##$TPOFFS= (0..7)
0 0 0 0 0 0 0 0
##$TUNHIN= 0
##$TUNHOUT= 0
##$TUNXOUT= 0
##$USERA1= <user>
##$USERA2= <user>
##$USERA3= <user>
##$USERA4= <user>
##$USERA5= <user>
##$V9= 5
##$VALIST= <valist>
##$VCLIST= <CCCCCCCCCCCCCCC>
##$VD= 0
##$VDLIST= <DDDDDDDDDDDDDDD>
##$VPLIST= <PPPPPPPPPPPPPPP>
##$VTLIST= <TTTTTTTTTTTTTTT>
##$WBST= 2048
##$WBSW= 25
##$XGAIN= (0..3)
0 0 0 0
##$XL= 0
##$YL= 0
##$YMAX_a= 534437
##$YMIN_a= -663959
##$ZGOPTNS= <>
##$ZL1= 120
##$ZL2= 120
##$ZL3= 120
##$ZL4= 120
##$ABSF1= 14.98061
##$ABSF2= -5.57192
##$ABSG= 5
##$ABSL= 3
##$ALPHA= 0
##$AQORDER= 0
##$ASSFAC= 0
##$ASSFACI= 0
##$ASSFACX= 0
##$ASSWID= 0
##$AUNMP= <proc_prof1d_extract_pilot.lims>
##$AXLEFT= 0
##$AXNAME= <>
##$AXNUC= <1H>
##$AXRIGHT= 0
##$AXTYPE= 0
##$AXUNIT= <>
##$AZFE= 0.1
##$AZFW= 0.1
##$BCFW= 0
##$BC_mod= 0
##$BYTORDP= 0
##$COROFFS= 0
##$CY= 15
##$DATMOD= 1
##$DC= 0
##$DFILT= <>
##$DTYPP= 0
##$F1P= 0
##$F2P= 0
##$FCOR= 0.5
##$FTSIZE= 32768
##$FT_mod= 6
##$GAMMA= 0
##$GB= 0
##$INTBC= 1
##$INTSCL= 1
##$ISEN= 128
##$LB= 0
##$LEV0= 0
##$LPBIN= 0
##$MAXI= 10000
##$MC2= 0
##$MEAN= 0
##$ME_mod= 0
##$MI= 0
##$NCOEF= 0
##$NC_proc= -8
##$NLEV= 6
##$NOISF1= 0
##$NOISF2= 0
##$NSP= 0
##$NTH_PI= 0
##$NZP= 0
##$OFFSET= 14.98061
##$PC= 1
##$PHC0= 209.7729
##$PHC1= 0
##$PH_mod= 1
##$PKNL= yes
##$PPARMOD= 0
##$PPDIAG= 0
##$PPIPTYP= 0
##$PPMPNUM= 2147483647
##$PPRESOL= 1
##$PSCAL= 4
##$PSIGN= 0
##$PYNMP= <proc.py>
##$REVERSE= no
##$SF= 400.13
##$SI= 32768
##$SIGF1= 0
##$SIGF2= 0
##$SINO= 400
##$SIOLD= 32768
##$SPECTYP= <>
##$SREGLST= <1H.CDCl3>
##$SSB= 0
##$STSI= 32768
##$STSR= 0
##$SW_p= 8223.68421052632
##$SYMM= 0
##$S_DEV= 0
##$TDeff= 65536
##$TDoff= 0
##$TI= <>
##$TILT= no
##$TM1= 0
##$TM2= 0
##$TOPLEV= 0
##$USERP1= <user>
##$USERP2= <user>
##$USERP3= <user>
##$USERP4= <user>
##$USERP5= <user>
##$WDW= 1
##$XDIM= 32768
##$YMAX_p= 468851345
##$YMIN_p= -816988
##$CURPLOT= <Network HP LaserJet P1505>
##$CURPRIN= <$Network HP LaserJet P1505>
##$DFORMAT= <normdp>
##$LAYOUT= <+/1D_H.xwp>
##$LFORMAT= <normlp>
##$PFORMAT= <normpl>
##$SURQMSG= 1
$$ End of Bruker specific parameters
$$ ---------------------------------
##NTUPLES= NMR SPECTRUM
##VAR_NAME=  FREQUENCY,     SPECTRUM/REAL,   SPECTRUM/IMAG
##SYMBOL=    X,             R,               I
##VAR_TYPE=  INDEPENDENT,   DEPENDENT,       DEPENDENT
##VAR_FORM=  AFFN,          ASDF,            ASDF
##VAR_DIM=   32768,         32768,           32768
##UNITS=     HZ,            ARBITRARY UNITS, ARBITRARY UNITS
##FACTOR=    0.250966925370066, 1,           1
##FIRST=     8223.43324360095, 136829,       99862
##LAST=      0,             115004,          60620
##MIN=       0,             -816988,         0
##MAX=       8223.43324360095, 468851345,    0
$$ Real data points
##PAGE= N=1
##DATA TABLE= (X++(R..R)), XYDATA
$$ [...]
$$ plain form
19438 -100920 -84328 141791 -185359 1223 -173469 -13665 118632 237512 -23726 217260
19427 -24231 -63164 -422427 -129380 268745 -434849 -194004 4053 38101 -250992 -34026 177312
19415 -481259 -201802 -108719 117301 -327038 -36830 -74231 -392252 -37753 448 -437281 -268004
19404 -268004 -35170 366363 -251096 -213045 297213 -119847 -247438 -178350 -133962 -357968
19394 -357968 -62619 -16124 -185916 -15603 -212009 -272784 -16113 -58686 -167098 -231890 -91560
19382 -77493 -374951 -99739 -10485 -125766 260482 202066 -62938 -74524 -3036 -71450 -24039
19370 -330334 -211322 -148092 -199731 31865 -239873 176389 -189593 -57207 -98688 215431
19359 -63367 -191273 -250207 -107808 -178258 73318 -249238 207480 70724 -65335 420829 76581
$$ packed form
19438a00920J6592A41791a85359A223a73469a3665A18632J18880b3726B17260
19427b4231l8933l59263a29380B68745d34849a94004D053L4048b50992c4026A77312
19415d81259b01802R3083A17301c27038c6830l7401l18021c7753D48d37281J69277
19404b68004c5170C66363b51096L8051B97213a19847j27591O9088M4388k24006
19394c57968f2619a6124j69792a5603j96406o0775a6113m2573j08412o4792i1560
19382g7493k97458i9739a0485j15281B60482n8416f2938j1586c036o8414b4039
19370c30334J19012O3230n1639C1865b39873A76389a89593e7207m1481B15431
19359f3367j27906n8934a07808p0450G3318b49238B07480G0724f5335D20829G6581
$$ plain form
19347 -48674 -222567 147015 -53645 -319883 78257 -120651 106866 -135287 -269429 -221535
19337 -221535 41200 -336919 -284390 -279300 -116798 247897 -28074 76664 -5841 -160009 -127966
19326 -127966 -12947 85353 -234318 -86497 119614 -283542 -79569 -221238 306137 -342067
19315 -138854 -242733 -44784 -161474 -12838 157110 128240 -134084 -96188 -192411 -211396 217994
19303 -62118 -1846 91136 68460 -115799 219155 -74136 -180016 -195279 -198396 -223315 -173059
19292 -173059 -161443 188787 -297386 -108133 85844 -17507 72681 -16097 -120251 -8571 82829
19280 -240650 -306864 -57880 -321352 -117473 172695 67393 -43712 -276562 -189909 -142014 96702
19268 -90485 159024 -103402 119029 125670 -1811 -117567 74835 81799 173591 -143341 -105644
$$ packed form
19347d8674j73893A47015e3645k66238G8257a20651A06866a35287j34142M7894
19337b21535D1200c36919N2529N090a16798B47897b8074G6664e841j54168L2043
19326a27966a2947H5353b34318h6497A19614b83542g9569j41669C06137c42067
19315a38854j03879d4784j16690a2838A57110k8870a34084L7896r6223j8985B17994
19303f2118a846I1136k2676a15799B19155g4136j05880j5263l117k4919N0256
19292a73059J1616A88787b97386a08133H5844a7507G2681a6097j04154h571H2829
19280b40650o6214e7880k63472a17473A72695F7393d3712k32850Q6653M7895I6702
19268i0485A59024a03402A19029O641a811j15756G4835O964R1792a43341L7697
$$ plain form
19257 -105644 55173 -339733 -161507 -54536 30181 -228450 -176875 102725 290836 -258701
19246 -19459 -304730 271238 -155223 22825 -189042 -16314 15867 192315 68817 84640 -152032
19234 -40380 -162096 -159711 293651 192754 -26234 -129078 -223985 -528286 -54728 -23517 -346366
19223 -346366 -139431 -137984 168970 25196 -35466 82462 -188648 70565 -111871 239942 245683
19212 245683 -135943 66048 48422 169805 149470 -118233 140915 170021 -164415 -116997
19202 -116997 -307755 -210227 -142379 113464 -73784 -241363 -171910 172769 -307605 180087
19191 140243 -101908 343183 76574 -89029 221049 101592 151792 -117796 101049 -186411
19180 53947 -322947 -190031 -152182 -108440 88235 -266576 -71284 241307 -490929 -358539
$$ packed form
19257a05644E5173c39733a61507e4536C0181b28450N1575A02725J88111b58701
19246a9459k85271B71238a55223B2825a89042a6314A5867J76448F8817J5823a52032
19234d0380j21716K385B93651j00897b6234j02844r4907l04301e4728b3517l22849
19223c46366a39431J447A68970B5196c5466H2462a88648G0565a11871B39942N741
19212B45683a35943F6048j7626J21383k0335a18233A40915K9106a64415M7418
19202a16997j90758R7528O7848A13464g3784j67579O9453A72769c07605A80087
19191A40243a01908C43183G6574h9029B21049A01592N0200a17796A01049a86411
19180E3947c22947J32916L7849M3742H8235b66576g1284B41307d90929J32390
$$ plain form
19170 -358539 -16913 -264331 -72402 91736 206565 -109850 127545 -85151 81231 205163
19160 205163 -39364 -129830 -366146 334053 99805 -181913 -149919 -311828 211131 -214257
19149 -82009 153873 -328175 -368442 105025 -193971 -371520 -177333 -82630 136259 56348
19138 -100931 -11479 -115846 -262140 -252716 -280692 214276 302503 -233877 -144786 -2591 66007
19126 -269758 -159617 -31655 -66108 -224089 12961 153528 -228481 -65548 -610762 -87378
19115 61542 44364 140344 -55324 -273244 3113 -18620 -188462 -79958 -39286 19634 104569
19104 104569 49510 128239 -76749 43977 -195057 361585 -258200 115891 -184720 86426
19093 202960 4626 -163826 21787 136296 -6025 228924 -107974 -129963 -240090 -53621 106989
$$ packed form
19170c58539a6913k47418g2402I1736J14829a09850A27545h5151H1231J23932
19160B05163c9364r0466k36316C34053I9805a81913L1994j61909B11131b14257
19149h2009A53873c28175m0267A05025a93971j77549a77333h2630A36259E6348
19138a00931a1479j04367j46294R424k7976B14276Q8227b33877Q9091b591F6007
19126b69758J10141c1655l4453j57981A2961J40567b28481f5548n45214h7378
19115F1542j7178R5980e5324k17920C113a8620j69842g9958c9286A9634Q4935
19104A04569D9510P8729g6749D3977a95057C61585b58200A15891a84720H6426
19093B02960D626a63826B1787J14509f025B28924a07974k1989j10127e3621A06989
$$ plain form
19081 -159057 61878 248938 188170 -66815 -137803 200304 128590 116665 132721 -385432 -157589
19069 -157444 -15648 -197550 26025 -219735 -231834 -104624 -413167 -76407 48943 -18395 32488
19057 87294 151851 89703 48399 -100599 222595 -131597 -19794 -4396 -473530 395298 -40789
19045 47755 -85524 95742 1445 -118898 -199101 -183354 -155132 -78965 73860 16210 241744
19034 241744 -131720 541851 -55044 -234807 133095 -316939 191870 -41000 -133760 -20587
19023 -392483 -66279 -4128 -209503 -126613 -271867 -273269 242747 11624 -159038 26354 297542
19012 297542 229597 11950 60290 -373712 66651 -111678 -28516 45428 238388 44373 -135141
19000 -148666 -18761 67841 -229967 -172906 -140410 -9837 -126992 -93113 -223190 -193222 -90889
$$ packed form
19081a59057F1878J87060o0768f6815p0988B00304p1714j1925J6056c85432a57589
19069a57444a5648j81902B6025b19735j2099a04624l08543g6407D8943a8395C2488
19057H7294O4557o2148m1304a00599B22595a31597a9794d396m69134C95298d0789
19045D7755h5524I5742A445a18898q0203J5747K8222P6167G3860A6210K25534
19034B41744a31720E41851e5044j79763A33095c16939A91870d1000r2760b0587
19023c92483f6279d128k05375Q2890j45254j402B42747A1624a59038B6354K71188
19012B97542o7945A1950M8340c73712F6651a11678b8516D5428J92960D4373a35141
19000a48666a8761F7841b29967N7061L2496i837j17155L3879j30077K9968i0889
$$ plain form
18988 3535 -234981 -140159 -152592 127787 176030 89894 -187650 157772 64755 153880 113019
18977 113019 -32477 -293991 -449114 -59537 12924 59403 68511 -34740 81359 -159139 234539
18965 -27519 -52828 144210 503955 -290305 -2883 124653 189156 429703 214190 515294
18955 515294 491616 386809 -45752 68267 -87507 15441 -275302 -251896 -278346 187098 107730
18944 107730 102099 -29725 61759 137672 -25509 175878 -166993 -141011 67726 118458 -48512
18932 -307873 96077 125992 -310315 -157930 -267005 143704 -348920 -83241 162933 -8534
18921 74173 49107 476029 -77764 -293068 252588 -247985 -152393 -263822 -31939 -116495 -38347
18909 -142007 -166275 357432 -33107 -319843 -174404 -113552 73973 47028 101561 -108345 -112759
$$ packed form
18988C535b34981R4822j2433A27787M8243q6136a87650A57772F4755Q9125m0861
18977A13019c2477k61514j55123e9537A2924M6479R108c4740H1359a59139B34539
18965b7519k5309A44210L59745b90305b883A24653O4503K40547B14190L01104
18955E15294k3678j04807d5752F8267h7507A5441b75302K3406k6450A87098p9368
18944A07730n631b9725F1759P5913b5509A75878a66993K5982F7726N0732d8512
18932c07873I6077K9915c10315J52385j09075A43704c48920h3241A62933h534
18921G4173k5066M26922g7764k15304B52588b47985R5592j11429c1939q4556c8347
18909a42007k4268C57432c3107k86736J45439O0852G3973k6945N4533a08345m414
$$ plain form
18898 -112759 -235275 265277 1956 244138 357514 211065 245775 111672 -356 -51552 159042
18886 145562 -45762 34232 83481 98784 -61481 -318883 -206219 23763 76112 -149181 -180497
18875 -180497 -153863 -332206 52380 115747 87599 53711 14061 -275368 -284106 -233194 -65698
18863 -187569 -27455 50294 27547 178187 25954 -303029 157672 124891 95280 -150012 -51408
18851 -226547 -382074 -356093 -55886 -373862 -85367 29096 256282 -300753 -39768 -233534
18841 -233534 -45482 139219 -364288 -287173 -59991 -132299 310864 3170 49551 -212681 -248100
18830 -248100 160800 -14022 -65820 67252 3444 211758 -49384 -128160 41589 -279935 -67718
18818 34727 -232002 -105743 64896 261346 178469 197906 -227815 134804 76835 242674
$$ packed form
18898a12759j22516B65277A956K42182J13376j46449L4710A11672c56n1196A59042
18886A45562d5762C4232M9249J5303f1481k57402J12664B3763N2349a49181l1316
18875a80497K6634j78343E2380O3367k8148l3888A4061b75368q738N0912f5698
18863a87569b7455E0294k2747J50640B5954c03029A57672l2781k9611a50012e1408
18851b26547j55527K5981e5886l17976h5367B9096K27186c00753c9768j93766
18841b33534d5482A39219c64288P7115e9991p2308C10864C170M6381b12681l5419
18830b48100A60800a4022n1798F7252C444K08314d9384p8776D1589b79935f7718
18818C4727b32002a05743F4896J96450q2877J9437b27815A34804n7969J65839
$$ plain form
18808 242674 -103215 -309469 -103295 -58456 285581 -42645 33876 -61238 32816 305811
18798 305811 -57942 -26652 -164346 355247 46978 202525 96867 -97374 -253321 132596
18787 258349 36360 230961 58266 69871 89588 47499 116242 76077 -358995 -85503 -310533
18776 -310533 409973 -16714 -83925 -153183 -77715 187750 -169832 -137215 -121152 211062 -54086
18764 -138463 21233 -158500 -313245 -177449 35151 -55559 -107740 -150676 12382 14195 71921
18753 71921 231046 8083 126720 -267186 -59764 331114 -229229 -97979 27566 -236244 -138515
18742 -138515 74457 6854 -103935 -253784 98808 4194 -137733 10128 -222557 -33223 266448
18730 -292727 -21730 -41530 -32860 -137916 -132280 33236 -245164 -115030 272283 -151586 -169283
$$ packed form
18808B42674a03215k06254a03295M4839B85581d2645C3876f1238C2816K72995
18798C05811e7942b6652j37694C55247D6978J55547I6867i7374j55947A32596
18787B58349C6360J94601E8266J1605J9717m2089O8743m0165c58995h5503k25030
18776c10533D09973a6714o7211o9258P5468A87750a69832L2617J6063B11062e4086
18764a38463B1233a58500j54745J35796C5151e5559n2181m2936A2382J813N7726
18753G1921J59125H083J18637b67186e9764C31114b29229i7979B7566b36244R7729
18742a38515G4457F854a03935j49849I8808D194a37733A0128b22557c3223B66448
18730b92727b1730j9800Q670j05056N636C3236b45164a15030B72283a51586j7697
$$ plain form
18719 -169283 77514 382234 -117130 -132156 -186849 -258229 -20331 98190 -143155 16827 88744
18708 88744 -204002 -222837 237251 -66040 -188662 -371107 -121230 73522 -50066 -356162
18698 -356162 17104 72329 43564 150467 -46450 -198536 21377 87054 -264211 170266 -7193
18686 150724 -20721 -374596 -179222 27945 54757 99160 57574 -49385 -116104 -242918 -302659
18675 -302659 -120567 115691 -336908 -346543 -434567 -357737 -105791 -18727 127476 -64371 206486
18663 113966 -74409 146220 18206 -138679 62781 -374227 -332887 -180911 -116073 -210142 -159076
18652 -159076 -164115 -316767 125625 -98180 32091 -366833 -213133 -333467 -133984 -22761
18641 -29795 -13607 43348 -185511 44973 250039 -301689 57149 281443 33194 -126960 -90645
$$ packed form
18719a69283G7514L04720a17130j5026n4693p1380b0331I8190a43155A6827P1917
18708H8744b04002j8835B37251f6040j22622j82445a21230G3522e0066l06096
18698c56162A7104N5225k8765J06903d6450j52086B1377O5677b64211A70266g193
18686A50724b0721l53875a79222B7945K6812M4403m1586d9385o6719j26814n9741
18675c02659a20567A15691c36908r635q8024P6830a05791a8727A27476f4371B06486
18663A13966g4409A46220A8206a38679F2781c74227M1340J51976O4838r4069N1066
18652a59076n039j52652A25625i8180C2091c66833J53700j20334a33984b2761
18641b9795a3607D3348a85511D4973K05066c01689E7149K24294C3194a26960L6315
$$ plain form
18630 -90645 108260 -85577 -149675 49048 67021 378368 5995 -241852 111223 -122950 133588
18618 11055 57822 -355606 -1238 14212 -29347 -227600 -94357 -53551 14418 -293378 -273402
18607 -273402 363991 -356372 -21870 279806 -140369 -92841 -105273 119637 -66399 103319
18596 171858 -195546 -337563 158216 342261 -193144 -990 176795 -247714 -68991 -17210
18585 -222835 -207785 -194396 -145412 -2908 -354402 -136619 -213239 -269652 536383 51132 104586
18574 104586 -273494 -194403 -260216 -89578 -99918 -54196 -199453 -12648 80769 82815 13380
18562 155633 202330 -73719 -63313 66185 -8950 -473325 -38584 101668 145856 -44584 9636
18550 84395 -144403 -369419 -63631 -6328 244749 -140734 -214932 -210182 322763 13485 289091
$$ packed form
18630i0645A08260h5577o4098D9048J7973L11347E995b41852A11223a22950A33588
18618A1055M6767c55606a238A4212b9347j98253i4357M0806A4418b93378J9976
18607b73402C63991c56372b1870B79806a40369M7528j2432A19637f6399A03319
18596A71858a95546j42017A58216J84045a93144i90A76795b47714f8991a7210
18585b22835J5050J3389M8984b908l51494a36619p6620n6413E36383E1132N3454
18574A04586b73494P9091o5813h9578j0340M5722j45257a2648H0769K046A3380
18562A55633M6697g3719J0406F6185h950m64375c8584A01668M4188d4584I636
18550H4395a44403k25016f3631f328B44749a40734p4198M750C22763A3485K75606
$$ plain form
18539 289091 74090 62662 47477 -159865 22703 203789 -74684 57992 72718 57075 -199189
18527 -402791 -131020 -126392 -92495 -157049 -33226 -227180 -19929 -29597 314255 -180870 -263801
18516 -263801 -201289 213504 29140 -291668 -10642 49336 140579 -218659 -356560 161984
18505 226990 212905 450720 53616 -269278 58057 62532 -113618 322748 80558 -355573 -273935
18494 -273935 303090 -307462 -55347 -156191 181442 -226649 165872 -3108 88636 -18414
18483 173440 8247 -167133 240222 190005 -72250 187439 196842 -67162 -149363 75154 192298
18472 192298 -30321 -124668 260626 -317815 7174 -3312 -128412 -41519 -102432 -57261 -170148
18461 -170148 -315122 -300790 -248184 -151367 -45629 118953 32707 -278553 299268 -169867
$$ packed form
18539B89091G4090j1428j5185a59865B2703J81086g4684E7992J4726j5643a99189
18527d02791a31020M628L3897o4554c3226j93954a9929r668C14255a80870q2931
18516b63801O2512B13504B9140b91668a0642D9336R1243b18659j37901A61984
18505B26990j4085K37815E3616b69278E8057M475a13618C22748H0558c55573Q1638
18494b73935C03090c07462e5347j00844A81442b26649A65872c108H8636a8414
18483A73440H247a67133B40222n0217g2250A87439R403f7162q2201G5154J17144
18472A92298c0321r4347B60626c17815G174c312j25100d1519o0913M5171j12887
18461a70148j44974J4332N2606R6817d5629A18953C2707b78553B99268a69867
$$ plain form
18450 -29528 33330 -166247 354389 47578 -94252 -27949 -146176 -228127 -24561 -124396 -157738
18439 -157738 -124187 116139 -43430 -155423 -105599 79339 -169352 -15560 -211227 61585 103944
18428 103944 118741 -248780 -53568 99195 -214454 -500391 26984 -50794 435439 10270 -147571
18416 94870 -509357 -279928 -94986 -236322 -325405 63907 -285201 -6275 -183323 139819 -179226
18404 -63729 -27065 -51961 -233231 116385 -185100 -63024 -26066 -93754 -245823 31942 79969
18393 79969 -221175 19432 138043 -142958 130226 185577 55784 -32241 72403 48695 252058
18382 252058 -53926 117645 -80092 -115426 268599 -206030 -49704 -10117 -287617 90259 34146
18370 -49505 69668 -40535 -17003 353278 -261120 24207 86244 107443 -24615 -79105 -110981
$$ packed form
18450b9528C3330a66247C54389D7578i4252b7949j18227q1951b4561r9835l3342
18439a57738L3551A16139d3430j11993M9824G9339a69352a5560j95667F1585M2359
18428A03944J4797b48780e3568I9195b14454k85937B6984e0794D35439A0270a47571
18416I4870e09357K29429i4986j41336q9083F3907b85201f275j77048A39819a79226
18404f3729b7065k4896j81270A16385a85100f3024b6066o7688j52069C1942M8027
18393G9969b21175A9432J18611a42958A30226N5351E5784c2241G2403k3708K03363
18382B52058e3926A17645h0092l5334B68599b06030d9704a0117k77500I0259C4146
18370d9505F9668d0535a7003C53278b61120B4207O2037K1199b4615n4490l1876
$$ plain form
18359 -110981 186630 166117 -175631 -21537 -103818 49348 239204 199997 98605 267118 180681
18348 180681 -126429 -31507 -161504 123505 30262 -34311 -60962 -77090 -18183 -93669 -18345
18336 -76451 79489 54714 -284562 126896 -32109 -68423 -234241 142095 -318603 -34958 6280
18324 -141878 97770 139799 -309179 -187628 158382 326430 181240 -62189 -90511 266507
18313 25442 -49488 -41203 4530 -67780 -238927 -96554 131977 -111000 -221638 79231 292535
18302 292535 205865 -36487 82678 -43456 111820 -45716 -235187 -131646 -60175 213136 303229
18291 303229 61548 187041 -33708 -117208 -316181 -37503 61080 190196 181708 58972 165020
18280 165020 228990 36430 -195487 162709 191928 12041 0 -260909 1078 151903 -196893
$$ packed form
18359a10981A86630k0513a75631b1537q2281D9348J89856l9207I8605J68513q6437
18348A80681a26429c1507j29997A23505C0262c4311k6651j6128a8183p5486a8345
18336g6451G9489k4775b84562A26896c2109l6314j65818A42095c18603c4958F280
18324a41878I7770M2029c09179J21551A58382J68048j45190f2189k8322B66507
18313B5442d9488Q285D530f7780j71147i6554A31977a11000j10638G9231K13304
18302B92535q6670c6487H2678d3456A11820d5716j89471J03541f0175B13136R0093
18291C03229F1548J25493c3708q3500j98973c7503F1080J29116q488E8972J06048
18280A65020O3970C6430a95487A62709K9219A2041@b60909A078J50825a96893
$$ plain form
18268 37562 199107 -274633 -37274 82835 120940 -51206 -22438 -287460 94591 -98933 -69485
18257 -69485 -67892 164590 10129 -78765 -141029 -292950 7828 -61982 -47341 -55816 -45614 183230
18244 98535 -5103 238984 -402870 13617 -194905 -130965 -63988 -198819 -141536 -16387 128471
18232 30897 -13186 209883 -151773 417460 -179615 252835 -16165 264645 66590 -246493
18221 -75040 13577 155063 185305 -229659 -81341 -84083 -208732 -47477 81563 5806 117859
18210 117859 76922 -69200 -95649 -203331 -186011 -20599 -88914 -110986 -65248 -24878 214866
18198 -85763 128703 -86784 15718 -380226 182967 289660 -378 59429 -247011 113260 -208033
18186 7428 16070 -189376 -433900 253031 -66475 120883 104354 -142354 -72484 -215200 212665
$$ packed form
18268C7562J61545b74633c7274H2835L8105e1206b2438k65022I4591i8933K9448
18257f9485J593A64590A0129g8765o2264j51921G828f1982J4641q475J0202A83230
18244I8535e103B38984d02870A3617a94905O3940f3988j34831N7283a6387A28471
18232C0897a3186B09883a51773D17460a79615B52835a6165B64645F6590b46493
18221g5040A3577J41486L0242b29659h1341k742j24649d7477H1563E806J12053
18210A17859m0937f9200k6449j07682J7320b0599o8315k2072M5738b4878B14866
18198h5763A28703h6784A5718c80226A82967J06693c78E9429b47011A13260b08033
18186G428Q642a89376k44524B53031f6475A20883j6529a42354O9870j42716B12665
$$ plain form
18174 122077 330786 -27052 73813 9568 215324 -56575 37916 -127187 263993 -492096 8953
18162 60831 62351 -287191 383976 93100 -146404 -210540 49283 -14484 64611 77024 -149930
18150 -433784 79610 -513008 134171 -255168 304033 24782 157368 -58323 -383316 -127137
18139 94172 -14205 -66518 137682 153992 126577 -302788 227037 -263798 -219694 -6122 -4698
18128 -4698 -157270 -164379 -8555 237654 -281871 -152076 273341 -188495 -8600 -297348 177591
18116 156284 -184709 -18801 -95909 -156020 -116227 98569 -167922 -131732 -151836 40295 -32394
18104 141340 65122 -330800 -135257 49803 -34376 -250880 -148416 17647 -77643 53700 -196619
18092 195863 -169428 16903 73242 189204 388264 -24146 -55810 308905 18423 70465 -177623
$$ packed form
18174A22077K08709b7052G3813I568K05756e6575C7916a27187B63993d92096H953
18162F0831J520b87191C83976I3100a46404o4136D9283a4484F4611J2413a49930
18150d33784G9610e13008A34171b55168C04033B4782J32586e8323l24993a27137
18139I4172a4205n2313A37682J6310k7415c02788B27037b63798M4104f122J424
18128d698j52572p109h555B37654b81871J29795B73341a88495h600k88748A77591
18116A56284a84709a8801p7108o0111L9793I8569a67922L6190k0104D0295c2394
18104A41340F5122c30800a35257D9803c4376k16504J02464A7647g7643E3700a96619
18092A95863a69428A6903N6339J15962J99060b4146l1664C08905A8423N2042a77623
$$ plain form
18080 -207596 -116997 -185750 -76341 62174 -140342 -23981 136535 289932 223596 -214461 291011
18068 -84305 125135 59771 -198417 -54658 -83394 105447 -172481 -161318 93128 25410 -181494
18056 -34949 61567 85032 -119413 -83190 237710 -208054 32027 -89874 -137212 222179 32213
18044 290590 240016 -378378 32431 165624 99321 422931 -73739 164699 -151175 -208499
18034 -208499 -87293 148657 -70109 89175 5651 96021 -81824 44758 -114401 68573 294668
18023 294668 108496 -44412 -28551 136765 -74247 163187 77843 127740 -154003 155554
18012 -42034 248381 866 125977 37817 90366 52763 280855 -66987 70821 -85585 -75932 124433
17999 -36760 -193352 -62017 192341 -225060 59160 -54151 -41260 -174865 24114 14335 148560
$$ packed form
18080b07596R0599o8753g6341F2174a40342b3981A36535J53397o6336b14461B91011
18068h4305A25135E9771a98417e4658k8736A05447a72481J1163I3128B5410a81494
18056c4949F1567K3465a19413L6223B37710b08054C2027h9874m7338B22179C2213
18044B90590n0574c78378C2431J33193o6303L23610g3739A64699a51175n7324
18034b08499h7293A48657g0109H9175E651R0370h1824D4758a14401F8573K26095
18023B94668A08496d4412J5861A36765g4247A63187G7843M9897a54003A55554
18012d2034B48381H66J25111C7817N2549l7603K28092f6987G0821h5585R653A24433
17999c6760j56592f2017A92341b25060E9160e4151J2891j33605B4114r779J34225
$$ plain form
17988 148560 -128750 -52606 -32942 273832 -14316 173012 -144367 110215 266336 -34222
17977 -80275 191463 220432 -76727 -328305 352864 190625 350799 -177103 -226015 126347
17966 184872 243406 -31934 -119625 -336294 -15418 300045 -59593 57628 107008 167137 64376
17954 -107720 -129327 -65473 254429 -50372 52036 125701 18876 -10960 64921 -177044 25327
17942 -441 -77175 -151944 90805 5920 111548 90765 18379 161808 78333 190047 -29215 9615
17929 243188 -271792 242852 -348475 -59809 155226 237664 85565 -169979 -202745 146865
17918 219577 -476358 -17414 -313499 11916 311844 6341 -114410 72545 238048 76372 -139318
17906 34758 -90305 -98907 -347181 -70399 13783 25348 -124896 201940 13802 93341 220616
$$ packed form
17988A48560a28750e2606J9664B73832a4316A73012a44367A10215J56121c4222
17977h0275A91463K8969g6727k51578C52864j62239J60174a77103m8912A26347
17966A84872N8534c1934q7691k16669a5418C00045e9593E7628M9380O0129F4376
17954a07720k1607O3854B54429e0372E2036P3665A8876a0960F4921a77044B5327
17942d41p6734p4769I0805E920J05628k0783A8379J43429G8333J11714b9215I615
17929B43188b71792B42852c48475e9809A55226Q2438H5565a69979l2766A46865
17918B19577d76358a7414k96085A1916K99928F341a14410G2545J65503G6372a39318
17906C4758i0305q602k48274g0399A3783J1565a24896B01940A3802P9539J27275
$$ plain form
17895 220616 8999 19528 66187 -12347 119012 184630 170930 -7231 35355 350893 10944
17883 -48607 78602 -189810 -7357 -21310 93658 22430 108509 235883 -174284 -220354 152417
17871 -3302 -103636 97344 8441 225657 163024 205172 -216367 -32578 33443 106759 163438
17860 163438 14438 21236 92765 -1843 -24781 -61093 143804 209632 51732 212019 135221
17849 135221 194191 269989 -34111 227183 163711 272538 5259 22529 340780 -189840 181727
17837 232350 -101739 73918 -133741 28446 65706 211790 -39204 182621 -138435 -46909
17826 23874 178506 -102523 -165117 221831 94212 -141813 -39244 169279 -86360 -7307 -147135
17815 -147135 21649 -311715 55958 238870 181955 289861 153704 218853 343057 -29506
$$ packed form
17895B20616H999J0529M6659a2347A19012O5618j3700g231C5355L15538A0944
17883d8607G8602a89810g357j3953I3658B2430Q6079J27374a74284m6070A52417
17871c302j00334I7344H441K17216o2633M2148b16367c2578C3443P3316N6679
17860A63438A4438O798P1529a843k2938l6312A43804O5828E1732J60287p6798
17849A35221N8970P5798c4111B27183o3472J08827E259J7270L18251a89840A81727
17837B32350a01739G3918a33741B8446L7260J46084c9204A82621a38435d6909
17826B3874J54632a02523o2594B21831I4212a41813c9244A69279h6360g307j39828
17815a47135B1649c11715E5958J82912n6915J07906j36157O5149J24204b9506
$$ plain form
17804 538843 230821 -107932 71205 -155233 117522 -128991 -25450 145067 -115612 -162119
17794 -162119 -193689 248212 213509 173298 -195007 -131117 240693 -143516 139151 26816
17783 -209238 -186609 -65856 -49183 9203 -13960 123855 348596 158985 408451 87576 291013
17772 291013 204738 231546 -140478 -81130 213439 -474764 242515 -163400 269508 136042
17762 136042 207953 354871 -79335 347593 43939 -41951 498600 -102804 204649 -64917
17751 22140 182914 -3602 166141 -16111 113754 347036 -185210 98763 125616 -203520 156670
17739 104412 69929 279461 159149 317098 242211 -166083 -151695 239765 -194392 -5677
17728 -24958 47554 -165733 262196 167676 268704 53585 -135882 58523 -78013 -31600 219337
$$ packed form
17804E38843B30821a07932G1205a55233A17522a28991b5450A45067a15612m6507
17794a62119l1570B48212l4703m0211a95007O3890B40693a43516A39151B6816
17783b09238K2629f5856J6673I203a3960A23855K24741A58985K49466H7576K03437
17772B91013q6275K6808a40478N9348B13439d74764B42515a63400B69508j33466
17762A36042P1911J46918g9335C47593D3939d1951D98600a02804B04649f4917
17751B2140J60774c602A66141a6111A13754K33282a85210I8763K6853b03520A56670
17739A04412l4483K09532j20312J57949p4887a66083J4388B39765a94392e677
17728b4958D7554a65733B62196r4520J01028E3585a35882E8523g8013c1600B19337
$$ plain form
17716 -264302 77233 -141967 216535 390306 102568 203357 -77679 184951 -284446 313411
17705 80079 -64948 -29684 96640 307321 240791 334391 77254 170145 -244726 -147208 -144878
17694 -144878 165181 184837 -13718 224064 172584 160601 187553 249107 193748 253379 -88726
17682 -229292 390653 72951 291985 226229 59070 -54872 116163 394804 85248 55218 -11528
17670 -26147 27813 -335347 -61474 -209661 427971 339776 228464 29479 -95942 -18392 -128651
17659 -128651 7623 81516 32867 -88956 -66405 135645 70908 -70737 -36287 129543 2431
17647 324750 33781 223931 -154266 64104 185987 103570 60105 3225 270387 -37547 78298
17635 574584 -11374 54270 172867 62236 239764 67940 276757 236429 450346 3938 249345
$$ packed form
17716b64302G7233a41967B16535J73771A02568J00789g7679A84951b84446C13411
17705H0079f4948b9684I6640K10681o6530R3600G7254R2891b44726R7518K330
17694a44878A65181J9656a3718B24064n1480j1983K6952O1554n5359N9631h8726
17682b29292C90653G2951K19034o5756E9070e4872A16163K78641H5248l0030a1528
17670b6147B7813c35347f1474j48187D27971q8195j11312B9479i5942a8392j10259
17659a28651G623P3893C2867h8956K2551A35645o4737g0737L4450A29543B431
17647C24750C3781J90150a54266F4104J21883q2417m3465C225K67162c7547G8298
17635E74584a1374E4270J18597F2236J77528F7940K08817m0328K13917C938K45407
$$ plain form
17624 249345 39601 335988 293498 -48422 -24774 -145699 86388 101540 -315174 154255 606516
17613 606516 380856 235448 -126329 -83845 308456 366303 239180 162323 151219 -81687
17602 130086 -98079 130099 526143 189074 36985 119306 406012 -128501 29420 165822
17592 165822 334754 213738 258391 211231 282445 8600 280773 -77118 137697 420148 -26422
17580 -23415 50863 259605 327695 120296 250929 -29925 -19167 134519 45345 86209 381234
17569 381234 20951 51680 309843 -93090 411148 16512 73793 57068 85731 147799 173589
17558 173589 175183 40784 83026 25105 134321 144712 -46660 -250791 55873 210986 194608
17547 194608 456213 135541 386117 114309 221622 324479 -17814 88642 359998 124044
$$ packed form
17624B49345C9601K96387m2490d8422K3648j20925H6388J5152c15174A54255M52261
17613F06516k25660j45408a26329M2484C08456N7847j27123p6857j1104h1687
17602A30086i8079A30099L96044A89074C6985Q2321K86706a28501B9420J36402
17592A65822J68932j21016M4653m7160P1214H600K72173g7118A37697K82451b6422
17580b3415E0863K08742O8090A20296J30633b9925J0758A34519D5345M0864K95025
17569C81234B0951L0729K58163i3090D11148A6512N7281j6725K8663O2068K5790
17558A73589J594D0784M2242B5105J09216J0391d6660k04131E5873J55113j6378
17547A94608K61605A35541K50576A14309J07313J02857a7814H8642K71356A24044
$$ plain form
17536 -188473 192627 316552 -104972 166340 240316 47698 302372 252938 603682 125208
17525 387965 186694 289653 402694 262943 -15871 181465 695536 423059 712999 287270
17514 37322 305703 334353 624929 755178 321396 915736 1004774 716890 867452 650811
17504 650811 600977 258983 387901 284142 -9554 263686 230622 561938 496528 835830
17494 835830 912808 772055 1079355 830560 867048 629736 539698 357804 698374 4584
17483 500937 306317 204785 602789 283375 229534 -108013 279900 131638 370588 339065
17473 339065 199459 374996 462467 216552 364879 52556 152483 479741 34323 593085
17463 593085 32500 151016 137463 368835 233079 198349 487306 334858 225875 361476
$$ packed form
17536a88473A92627J23925a04972A66340P3976D7698K54674m9434L50744A25208
17525C87965A86694J02959J13041j39751a5871A81465N14071k72477K89940B87270
17514C7322K68381K8650K90576J30249C21396N94340Q9038k87884J50562k16641
17504F50811m9834B58983J28918j03759i554B63686l3064L31316o5410L39302
17494H35830P6978j40753L07300k48795L6488k37312r0038j81894L40570D584
17483E00937j94620j01532L98004B83375n3841a08013B79900A31638K38950l1523
17473C39065j39606J75537Q7471B16552J48327E2556R9927L27258C4323N58762
17463E93085C2500J18516j3553K31372j35756l4730K88957j52448j08983J35601
$$ plain form
17453 361476 504300 18815 251195 182906 235991 299990 199867 174873 114729 338067 697412
17442 697412 297028 212709 242455 104790 106148 115790 86046 54343 311841 232646 510193
17431 510193 348734 436799 414062 212337 300446 495263 169570 55285 444435 86883
17420 203938 568564 250755 511037 -89694 600822 379720 442737 293237 181203 313494
17410 313494 567232 243573 207176 192709 93760 214246 254763 138590 -20726 -7637 325043
17398 271031 368814 365710 275539 338502 243682 263080 558650 434497 -71136 271373 231601
17387 231601 5501 93248 472914 -40006 510933 102883 614443 330487 534271 61025
17376 270107 124161 156018 278191 240085 209194 329764 133247 -94676 346957 224526
$$ packed form
17453C61476J42824A8815K32380o8289N3085O3999j00123k4994o0144K23338L59345
17442F97412B97028q4319K9746A04790J358R642k9744l1703K57498p9195K77547
17431E10193j61459Q8065k2737k01725Q8109J94817A69570E5285L89150H6883
17420B03938L64626B50755K60282h9694F00822k21102O3017j49500j12034J32291
17410C13494K53738B43573l6397j4467I3760J20486M0517j16173b0726g637C25043
17398B71031R7783l104r0171O2963r4820J9398K95570j24153g1136B71373l9772
17387B31601E501Q7747L79666d0006E10933A02883N11560k83956K03784F1025
17376B70107A24161L1857J22173l8106l0891J20570A33247i4676C46957j22431
$$ plain form
17366 224526 113286 125916 272845 461913 30890 261582 403942 111896 139762 205925
17356 205925 313779 181786 348702 59389 308193 93321 242819 241888 471432 486230 384225
17345 384225 174762 170577 195766 349548 436338 138492 681270 356301 228956 186758
17335 186758 -78810 92029 566668 229022 335049 99753 73697 86869 512612 73173 508341
17324 508341 313159 428282 181453 77543 159634 331418 67787 479649 77792 187976
17314 187976 344172 365080 659795 387947 189593 274805 275684 447490 354789 86997 484781
17303 484781 332283 573080 27078 -2497 566205 148711 137611 90321 344181 515645
17293 515645 292361 64790 560986 438996 80339 205394 250745 344505 417937 -2606 363236
$$ packed form
17366B24526j11240J2630J46929J89068C0890K30692J42360A11896K7866O6163
17356B05925J07854j31993J66916E9389K48804I3321J49498r31K29544J4798j02005
17345C84225A74762m185K5189J53782Q6790A38492N42778l24969j27345m2198
17335A86758g8810I2029M74639B29022J06027I9753k6056J3172M25743G3173M35168
17324E08341j95182J15123A81453G7543Q2091J71784F7787M11862G7792J10184
17314A87976J56196K0908K94715k71848A89593Q5212Q79J71806r2701H6997L97784
17303D84781j52498K40797B7078b497E66205A48711j1100m7290K53860J71464
17293E15645k23284F4790M96196j21990H0339J25055M5351R3760P3432b606C63236
$$ plain form
17281 44715 508858 40292 177413 122195 253869 118489 146643 388084 -16069 421189
17270 440269 198383 -12639 447540 220368 294080 509956 -96333 180226 459234 260315
17260 260315 298990 339963 29382 259324 -62124 174675 313601 382299 348586 198289 309265
17249 309265 32636 -51201 174808 239565 -60640 250933 334358 142276 334836 583839
17239 583839 178490 379421 667183 187478 382034 348413 383193 496803 222490 132193
17229 132193 594109 487273 332594 477640 506107 293526 449728 594066 -37888 455374
17218 292547 475227 169310 429463 367583 215751 219157 331568 264833 349063 492499
17208 492499 603211 112980 562478 701237 383918 695964 323160 291150 492383 267452
$$ packed form
17281D4715M64143D0292J37121n5218J31674A18489K8154K41441a6069D21189
17270D40269A98383a2639D47540B20368P3712K15876i6333A80226K79008j98919
17260B60315L8675M0973B9382K29942f2124A74675J38926O8698l3713j50297J10976
17249C09265C2636e1201A74808O4757f0640B50933Q3425A42276J92560K49003
17239E83839A78490K00931K87762A87478J94556l3621L4780J13610B22490r0297
17229A32193M61916j06836j54679J45046K8467k12581J56202J44338c7888D55374
17218B92547J82680A69310K60153o1880j51832L406J12411o6735Q4230J43436
17208D92499J10712A12980M49498J38759l17319L12046C23160l2010K01233k24931
$$ plain form
17198 267452 347030 383558 562397 365303 533739 361680 340524 251357 474860 527963
17188 527963 577851 163546 686286 81212 274385 534867 411785 314861 353809 218337
17178 218337 764912 70384 842045 307684 466079 306968 445117 566061 752448 225019
17167 162891 174124 288650 505600 375517 544093 97234 733129 319342 428182 744439
17157 744439 407109 213137 552540 540634 677727 515991 252773 641550 86223 257148
17147 257148 651794 473350 464154 691693 566631 660338 502728 391417 591172 516598
17137 516598 771900 302408 272163 642527 322528 130859 565517 367471 411257 439094
17127 439094 708082 428614 8301 576681 375145 731468 532375 823770 727965 527353
$$ packed form
17198B67452P9578L6528J78839j97094J68436j72059k1156q9167K23503N3103
17188E27963M9888A63546N22740H1212J93173K60482j23082r6924L8948j35472
17178B18337N46575G0384P71661C07684J58395j59111J38149J20944J86387B25019
17167A62891J1233J14526K16950j30083J68576I7234O35895C19342J08840L16257
17157G44439l37330j93972L39403j1906J37093j61736B52773L88777H6223J70925
17147B57148L94646j78444r196K27539j25062R3707j57610j11311J99755p4574
17137E16598K55302C02408l0245L70364l19999A30859M34658j98046M3786K7837
17127D39094K68988k79468H301N68380k01536L56323j99093K91395r5805k00612
$$ plain form
17117 527353 339863 466693 589669 541018 822777 524755 374344 492089 775358 642512
17107 642512 724728 368396 381078 300403 522542 294999 937552 553657 481929 490728 724218
17096 724218 480752 764323 454472 587740 778695 517744 733749 677191 627820 729892
17086 729892 916367 815897 617973 616697 496933 289770 543730 548331 694153 593126
17076 593126 801462 771901 609191 690541 541290 482875 573108 551453 741316 553075
17066 553075 693553 468206 882878 729821 694582 1097547 623391 580835 944391 1033941
17056 1033941 611956 658610 595038 525149 354201 570883 630662 666600 490747 701304
17046 701304 873184 834693 664908 435990 737485 538374 821340 833456 963958 1104274
$$ packed form
17117E27353j87490J26830J22976m8651K81759k98022j50411J17745K83269j32846
17107F42512Q2216l56332J2682q0675K22139k27543O42553l83895p1728Q799K33490
17096G24218k43466K83571l09851J33268J90955k60951K16005n6558m9371J02072
17086G29892J86475j00470j97924j276j19764k07163K53960M601J45822j01027
17076E93126K08336k9561j62710Q1350j49251n8415R0233k1655J89863j88241
17066E53075J40478k25347M14672j53057l5239M02965m74156m2556L63556Q9550
17056A033941m21985M6654o3572o9889j70948K16682N9779L5938j75853K10557
17046G01304J71880l8491j69785k28918L01495j99111K82966J2116J30502J40316
$$ plain form
17036 1104274 1024012 1046782 784344 736340 769658 892395 801829 711670 1158735 858693
17026 858693 771311 700940 820869 1245198 821809 894272 801788 910079 919760 1262919 914446
17015 914446 719284 1249878 732967 913319 1188304 907087 764158 1071523 1135868 983046
17005 983046 941330 1104154 1001161 881710 1189601 1052608 1214092 944399 1021355 1148018
16995 1148018 1067053 1065562 1177296 988402 1058566 897079 1259394 888090 1051504 957339
16985 957339 1169077 1418679 1081880 1015500 990514 1295632 1484453 1043383 1232417 1410389
16975 1410389 1174793 1227599 1385830 1338955 1291821 1212723 1700624 1238955 1289792 1625112
16965 1625112 1398512 1155364 1352289 1050259 1191171 1161251 1472823 1590249 1369608 1317276
$$ packed form
17036A104274q0262K2770k62438m8004L3318J22737r0566r0159M47065l00042
17026H58693q7382p0371J19929M24329m23389P2463r2484J08291R681L43159l48473
17015I14446j95162N30594n16911J80352K74985k81217j42929L07365O4345j52822
17005I83046m1716J62824j02993j19451L07891j36993J61484k69693P6956J26663
16995A148018q0965j491J11734j88894P0164j61487L62315l71304J63414r4165
16985I57339K11738K49602l36799o6380k4986L05118J88821m41070J89034J77972
16975A410389k35596N2806J58231m6875m7134p9098M87901m61669N0837L35320
16965A625112k26600k43148J96925l02030J40912k9920L11572J17426k20641n2332
$$ plain form
16955 1317276 1421650 1668698 1537010 1505530 1623917 1733235 1463621 1484571 1381576 1436307
16945 1436307 1219950 1379819 1367146 1848236 1508353 1338448 1834142 1858195 1679434 1452946
16935 1452946 1563593 1849473 1516941 1705813 1625505 1856395 1464921 1950904 1829669 1852016
16925 1852016 1995140 1818891 1755046 1993122 2040028 1987407 1875859 2066844 1664850 1946514
16915 1946514 1999088 1820726 2248548 2016625 1973620 2231804 1912257 2253650 1829357 2236563
16905 2236563 2081999 2054262 2361811 2296693 2374477 2360552 2465916 2482020 2586232 2543923
16895 2543923 2278813 2340357 2442489 2658927 2465661 2402299 3035949 2355161 2506173 2890149
16885 2890149 2816173 2695905 3080177 2869921 2758176 2823601 3017803 2693435 2786601 2826931
$$ packed form
16955A317276J04374K47048j31688l1480J18387J09318k69614K0950j02995N4731
16945A436307k16357J59869j2673M81090l39883j69905M95694K4053j78761k26488
16935A452946J10647K85880l32532J88872q0308K30890l91474M85983j21235K2347
16925A852016J43124j76249o3845K38076M6906n2621j11548J90985m01994K81664
16915A946514N2574j78362M27822k31923m3005K58184l19547L41393m24293M07206
16905B236563j54564k7737L07549o5118P7784j3925J05364J6104J04212m2309
16895B543923k65110O1544J02132K16438j93266o3362O33650o80788J51012L83976
16885B890149p3976j20268L84272k10256j11745O5425J94202l24368R3166M0330
$$ plain form
16875 2826931 3107574 2878478 2942741 2915842 3406452 3202052 3373876 3333408 3058733 3561384
16865 3561384 3381166 3415674 3509731 3619980 3374791 3362600 3470620 3816660 3656053 3871362
16855 3871362 3691924 3960562 4135358 3837461 4116531 4164483 4366157 4388907 4329626 4434955
16845 4434955 4125572 4666625 4175635 4511071 4818184 4753342 4810719 4896883 5077271 5130607
16835 5130607 5305003 5216113 5331581 5165604 5401259 5378215 5736089 5657125 5921302 5920127
16825 5920127 6056691 6252470 6237766 6297616 6570938 6476755 6409713 6984143 6967484 6951844
16815 6951844 7234934 7135589 7422328 7402281 7577165 7786181 7643708 7953215 8028505 8477769
16805 8477769 8354464 8722326 8553735 9246206 9186707 9192106 9638997 9900204 10117256 9917959
$$ packed form
16875B826931K80643k29096O4263k6899M90610k04400J71824m0468k74675N02651
16865C561384j80218L4508R4057J10249k45189j2191J08020L46040j60607K15309
16855C871362j79438K68638J74796k97897K79070M7952K01674K2750n9281J05329
16845D434955l09383N41053m90990L35436L07113o4842N7377Q6164J80388N3336
16835E130607J74396q8890J15468j65977K35655k3044L57874p8964K64177j175
16825E920127J36564J95779j4704N9850K73322r4183o7042N74430j6659j5640
16815F951844K83090r9345K86739k0047J74884K09016j42473L09507P5290M49264
16805H477769j23305L67862j68591O92471n9499N399M46891K61207K17052j99297
$$ plain form
16795 9917959 10334952 10699434 10774047 11293605 11362731 11737018 11774224 11723746 12101235 12762012
16785 12762012 12937990 13293976 14006687 13915785 14200932 14448691 14791617 15369865 15898283
16776 15898283 16292285 16672526 17191766 17235331 17651159 18490663 18922932 19184840 20050859
16767 20050859 20745448 21416213 21998908 22359261 23353135 24168938 24455265 25280656 26374437
16758 26374437 26931177 28232498 28806355 29929974 31171361 32129529 32815331 34531936 35387266
16749 35387266 36858211 38331230 39645842 41132654 42235814 44287353 45749577 47740696
16741 47740696 49685876 51520318 53821926 56016823 58422003 60746718 62949799 65785328
16733 65785328 68320545 70822709 74087361 77235569 79792541 83397335 86857320 90008525
$$ packed form
16795I917959M16993L64482P4613N19558O9126L74287L7206n0478L77489O60777
16785A2762012J75978L55986P12711r0902K85147K47759L42926N78248N28418
16776A5898283L94002L80241N19240M3565M15828Q39504M32269K61908Q66019
16767B0050859O94589O70765N82695L60353R93874Q15803K86327Q25391J093781
16758B6374437N56740J301321N73857J123619J241387R58168O85802J716605Q55330
16749C5387266J470945J473019J314612J486812J103160K051539J462224J991119
16741D7740696J945180J834442K301608K194897K405180K324715K203081K835529
16733F5785328K535217K502164L264652L148208K556972L604794L459985L151205
$$ plain form
16725 90008525 93540617 97249595 100315533 104484276 108366725 111523267 115182414 118406630
16717 118406630 121728783 124967669 127420470 129890724 132768985 134758309 136210907 137777826
16709 137777826 138406073 139029470 138891339 138627383 137936261 136398444 134760311 133142705 130756297
16700 130756297 127926109 125154587 121976043 118835129 115422439 111903956 108240809 104676445
16692 104676445 100965989 97393602 93831980 90371347 86598770 83639352 80107088 76954267
16684 76954267 73861079 71065237 68264214 65463437 62809459 60163708 58074381 55439199
16676 55439199 53222492 51107281 49287145 47438645 45069317 44021864 42369610 40462347
16668 40462347 38883580 37428808 36158476 34927973 33867752 32414658 31312750 30328178
$$ packed form
16725I0008525L532092L708978L065938M168743L882449L156542L659147L224216
16717A18406630L322153L238886K452801K470254K878261J989324J452598J566919
16709A37777826O28247O23397j38131k63956o91122j537817j638133j617606k386408
16700A30756297k830188k771522l178544l140914l412690l518483l663147l564364
16692A04676445l710456l572387l561622l460633l772577k959418l532264l152821
16684G6954267l093188k795842k801023k800777k653978k645751k089327k635182
16676E5439199k216707k115211j820136j848500k369328j047453j652254j907263
16668D0462347j578767j454772j270332j230503j060221j453094j101908r84572
$$ plain form
16660 30328178 29250988 28508844 27502708 26474694 25431531 24858349 24017668 23338362 22564407
16651 22564407 21978775 21211721 20641530 19910759 19859150 18795591 17990970 17882088 17524342
16642 17524342 17110939 16305178 15887039 15500097 15086445 14639796 14523670 13890945 13582127
16633 13582127 13414530 13128447 12534541 12448185 12097056 11471437 11677642 11342130 11085687
16624 11085687 10611873 10623107 10565399 10099504 9937000 9651582 9687709 9364817 8932910 8847059
16614 8847059 8708448 8674148 8360198 8054062 8016053 7631838 7916563 7637817 7337892 7412348
16604 7412348 7389806 7093325 7082058 6835705 6571862 6765296 6100800 6161502 6082595 6126636
16594 6126636 6022506 5772472 5448641 5791176 5222295 5489797 5609268 5465603 5340486
$$ packed form
16660C0328178j077190p42144j006136j028014j043163n73182q40681o79306p73955
16651B2564407n85632p67054n70191p30771n1609j063559q04621j08882l57746
16642A7524342m13403q05761m18139l86942m13652m46649j16126o32725l08818
16633A3582127j67597k86083n93906q6356l51129o25619K06205l35512k56443
16624A1085687m73814J1234n7708m65895j62504k85418L6127l22892m31907q5851
16614H847059j38611l4300l13950l06136l8009l84215K84725k78746k99925P4456
16604G412348k2542k96481j1267k46353k63843J93434o64496O0702p8907M4041
16594F126636j04130k50034l23831L42535n68881K67502J19471j43665j25117
$$ plain form
16585 5340486 5056727 5243628 5259323 4761888 4932918 4924926 4628714 5013941 4504399 4555365
16575 4555365 4523236 4575313 4291827 4479798 4299440 4164226 4301115 4187318 4223012 4038161
16565 4038161 3955234 3808219 3731913 3488952 3671592 3738191 3471340 3592638 3364316 3243652
16555 3243652 3419712 3213525 3046862 2843393 3428864 3135076 2907878 3293464 3046831
16546 3046831 2912218 2975122 2893630 2789544 3017795 2880388 2651219 2857579 2696960 2538840
16536 2538840 2606229 2793596 2578689 2697968 2389193 2342912 2828567 2711430 2731084 2614075
16526 2614075 2413782 2414142 2177439 2603427 2050913 2374733 2084032 2385167 2415440 2186839
16516 2186839 2298472 1826156 2010012 2125984 2036292 1909247 1881703 2277114 2159425 2128286
$$ packed form
16585E340486k83759J86901J5695m97435J71030p992k96212L85227n09542N0966
16575D555365l2129N2077k83486J87971j80358j35214J36889j13797L5694j84851
16565D038161q2927j47015p6306k42961J82640O6599k66851J21298k28322j20664
16555C243652J76060k06187j66663k03469N85471k93788k27198L85586k46633
16546C046831j34613O2904q1492j04086K28251j37407k29169K06360j60619j58120
16536B538840O7389J87367k14907J19279l08775m6281M85655j17137J9654j17009
16526B614075k00293L60k36703M25988n52514L23820k90701L01135L0273k28601
16516B186839J11633m72316J83856J15972q9692j27045k7544L95411j17689l1139
$$ plain form
16506 2128286 2337604 2081103 1946900 1885025 1903229 1762819 1892391 1581946 1936161 1780595
16496 1780595 2160261 2145213 1837665 1777837 1413821 1548335 1580582 1363451 1788371 1591456
16486 1591456 1272895 1148689 1824871 1694316 1671223 1553093 1506917 1422143 1765496 1738796
16476 1738796 1380227 1589022 1567079 1537581 1765863 1577416 1379084 1437265 1491312 1138205
16466 1138205 1296138 1650083 1559604 1505332 1386051 1130723 1668972 1091975 1233922 1307867
16456 1307867 1104318 1193417 1263039 1545509 1098851 1077786 1247483 1286177 1084808 1057697
16446 1057697 1320714 1018780 1114321 1204629 1071039 930841 1361945 1268567 1049527 1459109
16436 1459109 1311356 1043368 1238779 1222679 1051404 1094665 1268879 926349 718594 1023651
$$ packed form
16506B128286K09318k56501j34203o1875J8204j40410J29572l10445L54215j55566
16496A780595L79666j5048l07548n9828l64016J34514L2247k17131M24920j96915
16486A591456l18561j24206O76182j30555k3093j18130m6176q4774L43353k6700
16476A738796l58569K08795k1943k9498K28282j88447j98332N8181N4047l53107
16466A138205J57933L53945r0479n4272j19281k55328N38249n76997J41947P3945
16456A307867k03549Q9099O9622K82470m46658k1065J69697L8694k01369k7111
16446A057697K63017l01934R5541R0308j33590j40198M31104r3378k19040M09582
16436A459109j47753k67988J95411j6100j71275M3261J74214l42530k07755L05057
$$ plain form
16426 1023651 903052 1081183 946122 1234576 1108102 1005663 995415 808175 1082403 794585
16416 794585 1340744 834805 1126897 985546 829822 860859 979743 940669 876979 897684
16406 897684 496383 772210 731876 853824 788987 954539 1118157 683597 565065 749998
16396 749998 483338 812659 1047428 527289 757356 587455 1026963 1062168 747309 1131677
16386 1131677 609438 909579 657816 783548 693256 622482 552315 759125 845442 658768
16376 658768 1015007 792007 808979 649061 648251 774730 419429 861783 557810 796298
16366 796298 932959 802623 789146 750801 418321 568100 586886 409101 556061 885638
16356 885638 634430 473461 684566 783385 587379 457998 594533 644294 687182 802939
$$ packed form
16426A023651j20599J78131j35061K88454j26474j02439j0248j87240K74228k87818
16416G94585N46159n05939K92092j41351j55724L1037J18884l9074o3690K0705
16406H97684m01301K75827m0334J21948o4837J65552J63618m34560j18532J84933
16396G49998k66660L29321K34769n20139K30067j69901M39508L5205l14859L84368
16386A131677n22239L00141k51763J25732r0292p0774p0167K06810Q6317j86674
16376F58768L56239k23000J6972j59918q10J26479l55301M42354l03973K38488
16366G96298J36661j30336j3477l8345l32480J49779J8786j77785J46960L29577
16356H85638k51208j60969K11105R8819j96006j29381J36535M9761M2888J15757
$$ plain form
16346 802939 960848 535961 604526 390229 480877 539802 818130 654569 901935 730961
16336 730961 534110 352230 634103 512012 468711 560095 130468 546051 976942 841385
16326 841385 575107 559924 454599 597735 882843 471173 812496 427095 658268 307892
16315 455877 615370 667751 817450 791371 525230 581402 456838 557266 901431 705340
16305 705340 687727 509257 789577 575633 708433 643992 85692 271677 748014 469456
16295 469456 616021 518005 321578 325814 534890 418329 253378 395768 624266 484062
16285 484062 612103 480480 529278 444035 550983 435164 463198 307023 429385 266455
16275 266455 397764 644669 220091 649569 271096 297715 282014 623637 388369 634240
$$ packed form
16346H02939J57909m24887O8565k14297R0648N8925K78328j63561K47366j70974
16336G30961j96851j81880K81873j22091m3301R1384A30468M15583M30891j35557
16326H41385k66278j5183j05325J43136K85108m11670L41323l85401K31173C07892
16315D55877J59493N2381J49699k6079k66141N6172j24564J00428L44165j96091
16305G05340j7613j78470K80320k13944J32800o4441H5692J85985M76337k78558
16295D69456J46565r8016j96427M236K09076j16561j64951J42390K28498j40204
16285D84062J28041j31623M8798q5243J06948j15819K8034j56175J22362j62930
16275B66455J31309K46905B20091M29478B71096K6619j5701L41623k35268K45871
$$ plain form
16265 634240 494466 544268 756163 524795 450482 405028 583284 567229 466596 451283
16255 451283 731544 534854 211505 500369 -52699 346642 540027 351260 850406 565829
16245 565829 306747 451878 663107 420048 414037 105786 384246 518862 467926 104965
16234 609409 482179 533594 355050 453467 329753 481601 432701 305119 671118 57813
16223 501858 258610 361241 365499 123463 632414 199010 608360 279756 612711 424167
16213 424167 180593 76235 226511 207823 393740 371189 522491 258766 148991 424523
16203 424523 211877 342616 390857 20962 249437 190324 369212 206345 254057 450131
16193 450131 324421 265837 284608 58474 91844 469190 148968 774143 351891 373247
$$ packed form
16265F34240j39774M9802K11895k31368p4313m5454J78256j6055j00633j5313
16255D51283K80261j96690B11505K88864e2699C46642J93385j88767M99146k84577
16245E65829k59082J45131K11229k43059o011A05786K78460J34616n0936A04965
16234F09409j27230N1415j78544R8417j23714J51848m8900j27582L65999E7813
16223E01858k43248J02631M258A23463N08951A99010M09350B79756L32955j88544
16213D24167A80593G6235J50276j8688J85917k2551J51302B58766j09775K75532
16203D24523B11877J30739M8241B0962K28475n9113J78888j62867M7712J96074
16193D50131j25710n8584J8771E8474L3370L77346A48968O25175C51891K1356
$$ plain form
16183 373247 202460 378017 192069 171856 193281 689878 150183 45565 531159 502933
16173 502933 540587 253313 464838 380271 -56711 232039 400576 292051 -112324 373729
16162 213247 222785 179402 531456 175357 157210 106739 184154 89193 434423 395170 333094
16151 333094 361716 172872 6639 -302913 648653 592473 309763 288177 49984 -91952 469954
16139 172905 117589 -16372 207986 237654 438439 145500 81131 47097 -225795 260295
16128 152704 80028 481052 483143 107762 137211 57542 417570 -63333 327498 115054 -30732
16116 181199 -55764 375926 325164 280462 150761 212252 175624 -81793 119342 429061 543032
16105 543032 311177 178806 235218 -85040 370091 503025 223656 -265716 311027 25294
$$ packed form
16183C73247j70787J75557j85948k0213K1425M96597A50183D5565M85594k8226
16173E02933L7654B53313K11525q4567e6711B32039J68537j08525a12324C73729
16162B13247R538m3383L52054A75357j8147n0471P7415H9193L45230l9253o2076
16151C33094K8622A72872F639c02913F48653n6180k82710k1586D9984i1952D69954
16139A72905n5316a6372B07986K9668K00785A45500o4369l4034b25795B60295
16128A52704p2676M01024K091A07762K9449E7542L60028f3333C27498A15054c0732
16116A81199e5764C75926n0762m4702j29701O1491l6628h1793A19342L09719J13971
16105E43032k31855j32371N6412h5040C70091J32934B23656b65716C11027B5294
$$ plain form
16094 -181913 -243990 110803 -13898 185262 317410 46408 500930 178731 88542 -41164
16083 49103 97528 10509 122165 -482982 473305 204221 321136 26141 8468 -66958 269159
16071 200706 120289 140111 -16152 -34640 33764 363920 303164 248132 89846 248342 313641
16060 313641 75222 83761 211853 257734 -110443 222164 99031 205040 -341291 124826
16049 -120123 93942 -208013 -46477 450028 -308809 168204 67944 11021 -69485 32005 23141
16038 23141 77671 305311 147176 65109 203711 263263 236707 231506 58869 108989 -70330
16026 216535 349383 -323801 147436 186374 275703 93208 -851 310151 -178614 -49104 -24162
16014 148444 88086 85882 243885 95938 134343 -181453 122826 -25403 92668 120013 17499
$$ packed form
16094a81913o2077A10803a3898A85262J32148D6408M54522A78731H8542d1164
16083D9103M8425A0509J11656d82982D73305B04221J16915B6141H468f6958B69159
16071B00706q0417J9822a6152j8488C3764L30156o0756n5032H9846J58496O5299
16060C13641G5222Q539J28092M5881a10443B22164I9031J06009c41291A24826
16049a20123I3942b08013d6477D50028c08809A68204F7944A1021f9485C2005q864
16038B3141N4530K27640A47176F5109J38602N9552k6556n201E8869N0120g0330
16026B16535J32848c23801A47436L8938Q9329I3208h51C10151a78614d9104b4162
16014A48444o0358k204J58003I5938L8405a81453A22826b5403I2668K7345A7499
$$ plain form
16002 -159670 -55285 -36170 154102 137278 118341 69678 -130267 -264762 13804 184903 -36891
15990 93985 353133 82419 161103 25784 -73383 256824 -202669 -55766 -190091 97441 64006
15979 64006 -40172 154322 39229 -37967 204496 467977 726545 761800 910451 1122170
15969 1122170 615495 719675 875153 569581 282914 -12853 205791 134249 124991 114449
15959 114449 196547 142906 -39236 247969 -209930 -172808 -88079 78682 -80367 61398 -14602
15947 -182135 -364041 145384 64965 -366017 77323 332228 -146318 -148035 210150 -278020
15936 -373564 -28423 -216230 -55066 95226 -40878 -7744 283755 -32557 -234344 -162549 7114
15924 -198332 364068 115997 20653 -101883 -217725 -24904 128590 82548 -73774 50651
$$ packed form
16002a59670e5285J9115A54102j6824j8937m8663a30267j34495A3804J71099c6891
15990I3985K59148H2419P8684B5784g3383B56824b02669e5766j34325I7441l3435
15979F4006d0172A54322C9229c7967B04496K63481K58568L5255J48651K11719
15969A122170n06675J04180J55478l05572B82914a2853B05791p1542r258j0542
15959A14449Q2098n3641c9236B47969b09930L7122Q4729G8682h0367F1398a4602
15947a82135j81906A45384F4965c66017G7323K54905a46318j717B10150b78020
15936c73564b8423j87807e5066I5226d0878g744B83755c2557k01787P1795G114
15924a98332C64068A15997B0653a01883j15842b4904A28590m6042g3774E0651
$$ plain form
15913 247804 110087 -333124 67571 -124609 46000 -114506 -369997 -322447 97956 -481347
15902 -272683 72724 61398 -3773 -75278 37236 200022 -61864 -68573 277706 4658 -60514 66092
15889 97686 231449 -19013 -137325 -79209 33480 149737 14431 -280959 -37202 -297836 -110705
15877 -6510 -110972 -149156 -51177 -25485 21835 193597 16462 -290928 195044 80637 287368
15866 287368 123950 121519 -54363 56447 -181989 -200731 -46481 225692 -42216 5637 -352751
15854 -21323 -17235 68671 130396 -120003 190733 12370 226368 148005 247987 110137 43231
15842 67442 354898 270217 -283502 11926 -36885 77315 142431 -147719 142443 179 22760
15831 22760 55148 -182898 -189010 3143 -32313 36252 44527 300683 -59687 -144029 191468 7167
$$ packed form
15913B47804A10087c33124F7571a24609D6000a14506k55491M7550I7956d81347
15902b72683G2724j1326c773p1505C7236J62786f1864o709B77706D658f0514F6092
15889I7686J33763a9013j18312N8116C3480J16257A4431b80959c7202k60634a10705
15877f510j04462l8184e1177b5485B1835J71762A6462b90928A95044H0637K06731
15866B87368A23950k431e4363E6447a81989j8742d6481B25692d2216E637c52751
15854b1323M088F8671O1725a20003A90733A2370K13998p8363R9982A10137D3231
15842F7442K87456q4681b83502A1926c6885G7315O5116a47719A42443A79K2581
15831B2760L2388a82898o112C143c2313C6252Q275K56156e9687q4342A91468G167
$$ plain form
15818 -34744 229588 -63619 55098 -84280 7859 -78841 126492 -172105 -95878 -99818 137238
15806 -305178 63229 111617 22346 -57434 -164180 88505 286351 -197447 -375731 -495566
15796 -495566 80835 89847 -88327 -306245 -412560 -33136 -184657 -254902 392476 131899 76091
15785 76091 -10678 130069 -317106 15134 -107786 185354 58823 84418 -73425 85233 5882
15773 18100 73245 359172 241962 -2832 -149874 -55105 100096 12750 -210 93169 -112538
15761 88590 -130628 -29256 -88972 -157488 -62941 -73917 239207 -217970 -96291 121331 -231032
15749 -48956 -13456 12154 132451 -99148 256489 102733 48013 196509 252416 13707 273349
15738 273349 238340 154406 -181825 -103825 77906 -273666 7542 55766 -52267 -73953 458595
$$ packed form
15818c4744B29588f3619E5098h4280G859g8841A26492a72105P6227l940A37238
15806c05178F3229M8388B2346e7434j06746H8505J97846a97447j78284j19835
15796d95566H0835R012h8327k17918j06315c3136j51521p0245C92476A31899n5808
15785G6091a0678A30069c17106A5134a07786A85354E8823K5595g3425H5233E882
15773A8100N5145K85927j17210b832j47042e5105A00096A2750b10I3169a12538
15761H8590a30628b9256n9716o8516f2941j0976B39207b17970i6291A21331b31032
15749d8956a3456A2154J20297i9148B56489A02733D8013J48496N5907A3707K59642
15738B73349l5009q3934a81825P8000G7906b73666G542M8224e2267k1686D58595
$$ plain form
15726 241356 -205856 -2055 36946 -286956 -220798 -358452 -225538 -269515 132092 -81903 -324119
15715 -324119 -242420 -3977 -142915 116264 -172999 421987 -117100 247728 -74729 -556 -121672
15704 -121672 115485 88523 170961 -126283 -89607 -96 -80428 93487 -309012 82165 -253636
15692 -511548 105223 -177808 -43124 70032 -214232 39847 132172 -44597 25669 87399 -99195
15680 -292996 189888 -142609 -1235 27104 20567 427513 -37924 -51856 -21763 209820 132268
15669 132268 334753 -132646 -214589 278291 -262972 68019 -59038 -296331 -25710 -238945
15659 -238945 131051 27729 157304 -273395 228656 -124162 -109880 -236872 -84823 185115
15648 -85343 -232700 -16543 -159945 87553 -219598 152220 25764 -55546 215329 111738
$$ packed form
15726B41356b05856b055C6946b86956O6158j37654J32914m3977A32092h1903k42216
15715c24119Q1699c977j38938A16264a72999D21987a17100B47728g4729e56j21116
15704a21672A15485k6962Q2438a26283L6676i6q0332I3487c09012H2165b53636
15692e11548A05223a77808d3124G0032b14232C9847R2325d4597B5669O1730i9195
15680b92996A89888a42609a235B7104o537M06946c7924j3932b1763B09820p7552
15669A32268K02485a32646q1943B78291b62972F8019e9038k37293b5710k13235
15659b38945A31051B7729J29575b73395B28656a24162J4282j26992h4823A85115
15648h5343j47357a6543j43402H7553b19598A52220B5764e5546B15329j03591
$$ plain form
15638 111738 45487 183473 -62916 372952 153479 -170026 -155541 90336 -16356 -132367
15628 -132367 102137 -39486 -244130 314950 122816 -301830 -229316 213101 -37922 -34198
15618 -34198 148464 -112595 179443 103299 -117758 -32365 25282 -299929 37519 214286
15608 214286 -265785 -174106 -37129 -240283 -82110 -35585 92130 94001 102210 124170 125066 207647
15596 207647 8740 -164800 177437 255262 -92364 -406485 -274917 161184 -45818 -85789 123524
15584 -137732 -35433 186480 -16347 37757 -153629 -94384 127006 -82871 451572 44911 17813
15572 199370 -187058 -68385 237090 66286 -112246 -48448 78268 18912 -31301 271215 357896
15561 357896 -60373 9460 -33439 -354790 -80621 9834 102132 -45679 96117 -102710 -61823
$$ packed form
15638A11738D5487J37986f2916C72952A53479a70026J4485I0336a6356j16011
15628a32367A02137c9486k04644C14950A22816c01830P2514B13101c7922L724
15618c4198A48464a12595A79443p6144a17758c2365B5282b99929C7519J76767
15608B14286b65785R1679c7129k03154h2110c5585I2130J871Q209K1960Q96Q2581
15596B07647H740a64800A77437P7825i2364l14121J31568A61184d5818l9971A23524
15584a37732c5433A86480a6347C7757a53629N9245A27006h2871D51572D4911A7813
15572A99370a87058f8385B37090F6286a12246d8448G8268A8912c1301B71215Q6681
15561C57896f0373I460c3439l21351h0621I834R2298d5679I6117a02710M0887
$$ plain form
15550 -61823 -277184 -299006 19104 -29040 126672 -302808 -5663 -97574 -110285 29679 154614
15539 154614 111898 -294778 169662 136400 -23174 219973 114476 -148439 18989 202720
15529 202720 63535 130455 66646 15191 -126175 248411 -160208 220427 9338 74915 140947
15518 140947 88948 -98598 116072 -349297 81227 -242985 -151027 -144017 -8613 281252 109221
15506 62190 275625 -125679 175144 77800 313778 -37301 420370 168331 138969 39787
15495 236375 -141895 57260 173833 187859 43216 -57498 168250 166756 143190 181921 56830
15483 521 -32842 575962 217950 204201 4569 -69373 -34649 -127069 -90158 33713 207360 125419
15471 125419 156920 -5587 -72275 -32452 20502 243970 73059 174024 129659 254071 293673
$$ packed form
15550f1823k15361k1822A9104b9040A26672c02808e663r1911j2711B9679J24935
15539A54614m2716b94778A69662l3262b3174B19973j05497a48439A8989J83731
15529B02720F3535O6920o3809A5191a26175B48411a60208B20427I338O5577O6032
15518A40947n1999i8598A16072c49297H1227b42985R1958P010h613B81252A09221
15506F2190K13435a25679A75144G7800K35978c7301D20370A68331k9362C9787
15495B36375a41895E7260J16573J4026D3216e7498A68250j494k3566L8731E6830
15483E21c2842E75962B17950j3749D569f9373c4649r2420L6911C3713J73647q1941
15471A25419L1501e587o6688c2452B0502K23468G3059J00965m4365J24412L9602
$$ plain form
15460 293673 116763 629596 44384 521311 332628 494067 308204 35555 -39173 92846
15449 219465 -26053 -6560 100154 104530 -58011 -204120 -299239 272216 -266825 27781 -30329
15437 -6709 -137206 119829 34118 531349 23990 145056 534473 21833 146259 403647
15427 403647 896701 693884 1169953 1351890 563530 471294 344273 179946 -24148 -169243
15417 -169243 -14159 -73996 175194 -27964 -183245 26907 97664 242281 481179 193367
15406 176512 -56063 -155955 90946 -64894 -4087 -12414 -77722 -161626 142292 127659 -178302
15394 -227753 123565 65540 -27421 120330 -36094 29096 11051 171089 210539 -79998 -198305
15383 -198305 -79183 59380 185739 175562 51002 202424 -113762 -6798 402800 166380 304973
$$ packed form
15460B93673A16763N12833D4384M76927j88683J61439j85863C5555c9173I2846
15449B19465b6053f560A00154M376e8011j46109r5119B72216b66825B7781c0329
15437f709j30497A19829C4118M97231B3990J21066L89417B1833J24426K57388
15427D03647M93054k02817M76069J81937E63530r2236j27021j64327b4148j45095
15417a69243a4159n9837A75194b7964j55281B6907P0757J44617K38898A93367
15406A76512e6063r9892I0946f4894d087q327o5308q3904A42292j4633a78302
15394b27753A23565n8025b7421A20330c6094B9096A1051J60038L9450g9998j18307
15383a98305g9183E9380J26359j0177E1002J51422a13762f798D02800A66380J38593
$$ plain form
15372 304973 281611 -178392 -84825 -185297 77209 15763 381067 -227066 -106391 347338
15361 91776 312322 56961 65633 448196 196435 187028 88408 -109605 138108 -35009 223886
15349 302556 471373 310218 134569 100543 517553 -28447 318798 -17436 154497 229283
15339 229283 104686 195182 201560 329642 267352 5315 266208 60031 77394 155491 318623
15328 318623 371117 365740 226623 171242 361066 208129 332839 289637 -123815 -344080
15318 -344080 42187 329887 154996 36068 261980 326770 284652 101374 348496 317593
15308 317593 156638 269004 345156 225589 181358 399377 75975 -75232 425237 74030
15297 -1585 68038 279284 44401 433588 244262 -22123 39441 -95652 -131995 202060 -9364
$$ packed form
15372C04973k3362a78392h4825j00472G7209A5763L65304b27066a06391C47338
15361I1776K20546E6961Q672L82563A96435r407H8408a09605A38108c5009B23886
15349C02556J68817j61155A34569l4026M17010b8447C18798a7436A54497P4786
15339B29283A04686R0496O378J28082o2290E315K60893F0031J7363P8097J63132
15328C18623N2494n377j39117n5381J89824j52937J24710m3202a23815k20265
15318c44080D2187K87700A54996C6068K25912O4790m2118A01374K47122l0903
15308C17593A56638J12366P6152j19567m4231K18019G5975g5232D25237G4030
15297a585F8038K11246D4401L89187j89326b2123C9441i5652l6343B02060i364
$$ plain form
15285 211784 190057 -250780 82206 -95182 -1673 10478 233056 261854 -65246 -25923 114318
15273 148704 88743 85454 -39874 387216 97055 39389 85629 195823 41757 -122150 211232
15261 -58420 30498 101443 -14227 -103455 -95940 -282644 282829 -9063 433882 -53758 190610
15249 34731 -145667 268532 -246504 71248 67365 79579 -105739 114497 -51660 114681 78161
15238 78161 350002 128654 272646 277965 -1866 448285 194384 529437 529707 1089779 1631612
15227 1631612 1210492 1260914 1432403 735016 353492 396691 -23952 238509 -97151 9955
15216 280890 324207 116432 40035 55021 202741 -23478 146144 78568 101905 -117409 44553
15204 -120909 210739 -111233 -175091 151182 130772 82474 194395 61488 258339 -224603
$$ packed form
15285B11784k1727b50780H2206i5182a673A0478K22578K8798f5246b5923A14318
15273A48704n9961l289c9874C87216I7055C9389M6240J10194D1757a22150B11232
15261e8420C0498P0945a4227q9228P515j86704B82829i063D33882e3758A90610
15249C4731a45667B68532b46504G1248l883J2214a05739A14497e1660A14681l6520
15238G8161K71841A28654J43992N319a866D48285A94384L35053K70N60072N41833
15227A631612m21120N0422J71489o97387C53492M3199b3952B38509i7151I955
15216B80890M3317A16432D0035J4986J47720b3478A46144o7576K3337a17409D4553
15204a20909B10739a11233o3858A51182k0410m8298J11921F1488J96851b24603
$$ plain form
15193 273921 -141465 -274246 393311 86807 -53725 272321 159176 165884 155799 -51847 -52102
15182 -52102 240873 -67022 100885 30880 197752 267883 106057 55620 55656 137271 287856
15171 287856 129056 72130 -201111 199109 2335 98449 173794 -208876 6958 158595 122365
15160 122365 2904 -27389 72394 -13673 52985 100247 5773 201150 -62844 214889 322945
15149 322945 1025 -33355 347577 65224 -224264 322447 108123 238755 159539 -143174
15138 23441 260481 -18830 274681 95045 -262616 176605 292912 215440 276908 163941
15128 163941 -122576 268597 -29687 14630 570916 227110 164314 417538 -98879 177787
15117 151478 94868 -86304 147593 202799 -48261 69007 289880 -385575 -46546 109996 281818
$$ packed form
15193B73921a41465j32781C93311H6807e3725B72321j13145O708j0085e1847k55
15182e2102B40873f7022A00885C0880J66872P0131A06057n0437L6Q1615J50585
15171B87856A29056n6926b01111A99109B335R6114P5345b08876F958J51637l6230
15160A22365B904b7389G2394a3673E2985M7262E773J95377f2844B14889J08056
15149C22945A025c3355C47577F5224b24264C22447A08123J30632p9216a43174
15138B3441K37040a8830B74681I5045b62616A76605J16307p7472O1468j12967
15128A63941a22576B68597b9687A4630N56286B27110o2796K53224i8879A77787
15117A51478n6610h6304A47593N5206d8261F9007K20873c85575d6546A09996J71822
$$ plain form
15106 281818 161755 450969 285514 550292 180058 380264 543851 70408 299502 262895
15096 262895 407781 -168983 228453 239857 136466 -67616 217968 295070 142614 406510
15086 406510 198530 84602 -122018 163669 164156 404813 241356 502610 448863 -30344 309677
15074 -168581 80437 303616 73479 52128 168033 -26339 167762 -83440 110356 208795 -191042
15062 -28210 207936 -305812 256016 27937 -20894 376177 3914 284674 356977 -163992 448777
15050 406946 368941 243980 90975 180021 53908 225658 440059 104251 379300 408262
15040 408262 296066 270617 484628 473247 52735 314751 161551 587093 537304 73476
15029 355443 232036 440642 632298 389188 307488 375352 101339 440033 636464 240456
$$ packed form
15106B81818j20063K89214j65455K64778A80058K00206J63587G0408K29094l6607
15096B62895J44886a68983B28453J1404j03391f7616B17968P7102A42614K63896
15086D06510A98530H4602a22018A63669M87K40657j63457K61254n3747c0344C09677
15074a68581H0437K23179G3479k1351J15905b6339A67762h3440A10356R8439a91042
15062b8210B07936c05812B56016B7937b0894C76177C914K80760P2303a63992D48777
15050D06946l8005j24961I0975Q9046E3908J71750K14401A04251K75049K8962
15040D08262j12196k5449K14011j1381E2735K62016j53200M25542m9789G3476
15029C55443j23407K08606J91656k43110q1700O7864A01339L38694J96431B40456
$$ plain form
15018 524562 575082 400686 421820 475088 945237 603735 401394 603475 514807 588746
15008 588746 567318 540227 466558 501500 576526 742175 473676 215391 444179 205161
14997 731038 316358 409743 413068 539 662912 617675 742826 455024 529581 663112 365674
14986 365674 605769 442024 486437 976350 430588 547937 395042 468473 498999 488458
14976 488458 198221 522029 456392 303943 364869 520686 811248 718758 575908 751229
14966 751229 856303 854030 363205 855647 748011 867706 604554 818533 313750 666500
14956 666500 835808 510141 476969 560492 886005 735104 581270 144735 555308 454582
14946 454582 331138 472445 628825 679834 719601 430163 468477 564851 432189 235250
$$ packed form
15018E24562N0520j74396K1134N3268M70149l41502k02341K02081q8668P3939
15008E88746k1428k7091p3669L4942P5026J65649k68499B15391K28788B05161
14997G31038C16358R3385L325E39O62373m5237J25151k87802P4557J33531k97438
14986C65674K40095j63745M4413M89913D30588J17349j52895P3431L0526j0541
14976D88458A98221L23808o5637j52449O0926J55817K90562r2490j42850J75321
14966G51229J05074k273C63205M92442j07636J19695k63152K13979C13750L52750
14956F66500J69308l25667l3172Q3523L25513j50901j53834A44735M10573j00726
14946D54582j23444J41307J56380N1009L9767k89438L8314R6374j32662j96939
$$ plain form
14936 235250 421645 401263 172249 270836 449336 463312 159442 303462 828612 608298
14926 608298 748180 563037 582963 518413 529101 304219 497402 622606 743067 599747
14916 599747 778844 625087 1049807 983631 1423625 1184953 1665184 1688664 1837188 1454034
14906 1454034 1588127 1582392 1621433 1796727 2048711 1828597 2079745 1892648 1836563 1572311
14896 1572311 1298660 1054558 863677 967748 452349 438525 628448 533208 75844 604792
14886 604792 369996 607205 710818 520380 396438 420442 329656 297536 539376 565161
14876 565161 432778 535379 204981 511767 704422 604788 770154 921776 889428 775274
14866 775274 1164259 673244 764476 873762 799084 653324 615362 480571 488992 565800 891767
$$ packed form
14936B35250J86395k0382A72249R8587J78500J3976A59442J44020N25150k20314
14926F08298J39882j85143J9926o4550J0688k24882J93183J25204J20461j43320
14916E99747J79097j53757M24720o6176M39994k38672M80231K3480J48524l83154
14906A454034J34093n735L9041J75294K51984k20114K51148j87097n6085k64252
14896A572311k73651k44102j90881J04071D52349j3824J89923r5240G5844N28948
14886F04792k34796K37209J03613j90438j23942K4004r0786l2120K41840K5785
14876E65161j32383J02601B04981L06786J92655r9634J65366J51622l2348j14154
14866G75274L88985m91015R1232J09286p4678j45760l7962j34791Q421P6808L25967
$$ plain form
14855 891767 832985 488395 775215 699623 853338 231998 1052607 729363 306022 837203
14845 837203 800699 687232 531742 243588 717252 313699 535725 617283 624381 559209
14835 559209 545497 207347 385615 509180 776400 234699 629890 700769 1126605 990379
14825 990379 889084 959416 1181097 1353530 934793 1021661 874031 825628 588860 725088
14815 725088 1017715 607081 878130 632554 321746 570277 975209 676022 555453 693226
14805 693226 578986 887254 746945 906760 475913 721187 837565 615577 501471 795366
14795 795366 535690 721246 671157 750029 551514 1015155 846181 1042897 649211 958388
14785 958388 875407 697855 766729 448809 348286 529791 517064 342526 453029 336278
$$ packed form
14855H91767n8782l44590K86820p5592J53715B31998Q20609l23244C06022N31181
14845H37203l6504j13467j55490B43588M73664C13699K22026Q1558P098o5172
14835E59209j3712B07347J78268J23565K67220B34699L95191P0879M25836j36226
14825I90379j01295P0332K21681J72433m18737Q6868j47630m8403k36768J36228
14815G25088K92627m10634K71049k45576l10808K48531M04932k99187j20569J37773
14805F93226j14240L08268j40309J59815m30847K45274J16378k21988j14106K93895
14795G95366k59676J85556n0089P8872j98515M63641j68974J96716l93686L09177
14785I58388q2981j77552O8874l17920j00523J81505j2727j74538J10503j16751
$$ plain form
14775 336278 373685 780625 737492 860005 867603 641183 634838 287034 339600 614285 799175
14764 799175 575799 818297 923979 497340 703027 757499 959738 766814 762898 947319
14754 947319 661814 655812 862967 654828 726531 628706 385688 695179 943835 726401
14744 726401 307764 589935 636735 592932 598858 665397 564860 867937 850630 868431 822480
14733 822480 432713 731509 779009 1049093 861130 683094 991539 635902 871687 615205
14723 615205 929438 715251 626910 918071 705437 944286 907433 1477370 1156161 1057615
14713 1057615 981583 1400792 1708826 1726244 1368517 1591172 2018985 1431937 1807763 1595866
14703 1595866 1405623 1096818 1128105 1085984 984342 712610 928312 978568 1065253 900908
$$ packed form
14775C36278L7407M06940m3133J22513P598k26420o345B87034N2566K74685J84890
14764G99175k23376K42498J05682m26639K05687N4472K02239j92924l916J84421
14754I47319k85505o002K07155k08139P1703r7825k43018L09491K48656k17434
14744G26401C07764K82171M6800m3803N926O6539j00537L03077j7307J7801m5951
14733H22480l89767K98796M7500K70084j87963j78036L08445l55637K35785k56482
14723F15205L14233k14187q8341K91161k12634K38849l6853N69937l21209r8546
14713A057615p6032M19209L08034J7418l57727K22655M27813n87048L75826k11897
14703A595866j90243l08805L1287m2121j01642k71732K15702N0256Q6685j64345
$$ plain form
14693 900908 1378343 1052026 900033 945545 1427147 1466308 1148507 1473525 1582075 1812745
14683 1812745 1906363 1635021 1711257 1623937 1499794 1131827 1393854 1208304 856455 1187758
14673 1187758 1526239 849450 967630 1169081 1058602 1054850 1084836 1082924 1233499 1159372
14663 1159372 1010907 1210434 1299351 948557 1174094 843736 1117998 1043544 1145361 959562
14653 959562 1086236 1032310 828273 1417207 1244937 1473193 801841 1028765 1246826 1297530
14643 1297530 1081341 1008018 1191236 1283172 1267746 1361622 1289616 1261010 1633894 1262115
14633 1262115 1137853 1616502 1188277 1509293 1448607 1464576 1158297 1213158 1298055 1176492
14623 1176492 1199597 1375959 1398166 1099977 1133108 1460751 1178920 1406360 1022755 1277928
$$ packed form
14693I00908M77435l26317j51993M5512M81602L9161l17801L25018J08550K30670
14683A812745R3618k71342P6236q7320j24143l67967K62027j85550l51849L31303
14673A187758L38481o76789J18180K01451j10479l752K9986j912J50575p4127
14663A159372j48465J99527Q8917l50794K25537l30358K74262p4454J01817j85799
14653I59562J26674n3926k04037N88934j72270K28256o71352K26924K18061N0704
14643A297530k16189p3323J83218R1936j5426R3876p2006k8606L72884l71779
14633A262115j24262M78649m28225L21016o0686J5969l06279N4861Q4897j21563
14623A176492K3105J76362K2207k98189L3131L27643k81831K27440l83605K55173
$$ plain form
14613 1277928 1425242 1465318 1521975 1387145 1411319 1516023 1234226 1308541 1384087 1682381
14603 1682381 1200405 1309006 1679990 1593164 1329117 1329801 1446878 1706408 1629840 1687139
14593 1687139 1359860 1896627 1728062 1860110 1740581 1659645 1399962 1722904 1586491 1854604
14583 1854604 1881160 1865388 1758928 2033674 1647598 1834695 1679086 1557446 1681293 1733574
14573 1733574 1777504 1960471 1914341 2044796 1977002 2267836 2232372 2097747 2031776 1835523
14563 1835523 1875740 2198049 2177282 2241311 1955761 2032205 2390941 2187818 2019153 2457132
14553 2457132 2560377 2624242 2490227 2340057 2611661 2758673 2909185 3051972 3064560 3285865
14543 3285865 3255884 3596582 3859639 4442064 4814141 5038458 5783707 6479666 8432814
$$ packed form
14613A277928J47314M0076N6657j34830K4174J04704k81797P4315P5546K98294
14603A682381m81976J08601L70984q6826k64047O84J17077K59530p6568N7299
14593A687139l27279N36767j68565J32048j19529q0936k59683L22942j36413K68113
14583A854604K6556j5772j06460K74746l86076J87097j55609j21640J23847N2281
14573A733574M3930J82967m6130J30455o7794K90834l5464j34625o5971j96253
14563A835523M0217L22309k0767O4029k85550P6444L58736k03123j68665M37979
14553B457132J03245O3865j34015j50170K71604J47012J50512J42787J2588K21305
14543C285865k9981L40698K63057N82425L72077K24317P45249O95959J953148
$$ plain form
14534 8432814 10364674 14874055 21209820 31411673 30692177 19044596 11270793 6765644
14526 6765644 4617587 4746625 4746795 5116943 3801559 3174813 2910018 2547301 2441080 2600861
14516 2600861 2509900 2419190 2746264 2577547 2170117 2454755 2564400 2736241 2854598 2659889
14506 2659889 2358072 2498720 2633060 2642019 2689842 2502468 2694548 3143655 3207515 2765608
14496 2765608 3076306 3006707 2786567 2779398 2962611 3068923 2846964 3468838 3187125 3099724
14486 3099724 3345579 3050308 3289344 3314722 3559422 3678040 3565956 3476418 3668270 3586835
14476 3586835 3720339 3463318 3734938 3691200 3996777 4125218 3868639 3833356 3840225 3796282
14466 3796282 3998431 4379092 4183122 4176464 4185321 4337371 4414428 4217683 4328990 4397519
$$ packed form
14534H432814J931860M509381O335765J0201853p19496j1647581p773803m505149
14526F765644k148057J29038J70L70148j315384o26746k64795l62717j06221J59781
14516B600861r0961r0710L27074j68717m07430K84638J09645J71841J18357j94709
14506B659889l01817J40648J34340Q959M7823j87374J92080M49107O3860m41907
14496B765608L10698o9599k20140p169J83213J06312k21959O21874k81713q7401
14486C099724K45855k95271K39036K5378K44700J18618j12084q9538J91852q1435
14476C586835J33504k57021K71620m3738L05577J28441k56579l5283O869m3943
14466C796282K02149L80661j95970o658Q857J52050P7057j96745J11307O8529
$$ plain form
14456 4397519 4725654 4582691 4408507 4651487 4932693 4834413 4530691 4641257 5078860 4965372
14446 4965372 4800704 4817754 5098351 5263503 5245884 5228116 4857270 5323940 5625220 5585948
14436 5585948 5772947 5537463 5575350 6102392 6196343 5791051 5736123 6132800 6176252 6308519
14426 6308519 6383175 6639125 6871297 6862166 6626907 6765300 6952540 7000190 6869538 7418343
14416 7418343 7044646 7451976 7502575 7614255 7726142 7847704 7868877 8151912 7824969 8354324
14406 8354324 8463150 8673821 8651938 8932602 9065875 9260916 9125223 9356202 9599440 9805920
14396 9805920 9175058 10079349 9896721 9844339 10173476 10737906 10726728 11092198 10902224 11091870
14386 11091870 11454633 11419478 11226727 11614243 12002005 11593272 11817392 12497643 12674745
$$ packed form
14456D397519L28135j42963j74184K42980K81206r8280l03722J10566M37603j13488
14446D965372j64668J7050K80597J65152j7619j7768l70846M66670L01280l9272
14436E585948J86999k35484L7887N27042R3951m05292n4928L96677M3452J32267
14426F308519P4656K55950K32172r131k35259J38393J87240M7650j30652N48805
14416G418343l73697M07330N0599J11680J11887J21562K1173K83035l26943N29355
14406H354324J08826K10671k1883K80664J33273J95041j35693K30979K43238K06480
14396I805920o30862R04291j82628n2382L29137N64430j1178L65470j89974J89646
14386A1091870L62763l5155j92751L87516L87762m08733K24120O80251J77102
$$ plain form
14377 12674745 12399626 12743458 13349376 13606119 13450582 13754357 13874750 14423002 15184209
14368 15184209 14868097 15284171 15610167 15710369 16339375 16553299 17005720 16881461 17169670
14359 17169670 17805987 18135953 18353676 18816552 19213471 19661926 19868643 20309844 20862741
14350 20862741 21426081 21773343 22218270 22755288 22949158 23715768 23812177 24119602 25053088
14341 25053088 25679168 26116476 26441758 27418092 28092433 28990151 29390449 30092530 31240825
14332 31240825 31662140 32832079 33564051 34433933 35651015 36414146 37241381 38256241 39534381
14323 39534381 40671223 41960517 42947702 44315200 45738936 47603398 48754438 50295987
14315 50295987 51951315 53528050 55154226 57102244 59236917 60949626 62952775 65587307
$$ packed form
14377A2674745k75119L43832O05918K56743j55537L03775J20393N48252P61207
14368A5184209l16112M16074L25996J00202O29006K13924M52421j24259K88209
14359A7169670O36317L29966K17723M62876L96919M48455K06717M41201N52897
14350B0862741N63340L47262M44927N37018J93870P66610R6409L07425R33486
14341B5053088O26080M37308L25282R76334O74341Q97718M00298P02081J148295
14332C1240825M21315J169939P31972Q69882J217082P63131Q27235J014860J278140
14323C9534381J136842J289294R87185J367498J423736J864462J151040J541549
14315E0295987J655328J576735J626176J948018K134673J712709K003149K634532
$$ plain form
14307 65587307 67844754 69962623 72680306 75706713 78411216 81097971 83984627 87586501
14299 87586501 91042054 94729239 98440739 102463440 106916071 111788855 116842500 121729368
14291 121729368 127242607 133463509 139735477 146443155 153315376 160860309 168601209 177295729
14283 177295729 185859862 195521138 205492487 215939888 227170343 238930212 251283915
14276 251283915 264261905 277801261 291828926 306798334 321725782 336528525 351274839
14269 351274839 365691861 379275515 391981111 403358950 414740425 425148355 434392212
14262 434392212 442074030 449713239 457215773 463303669 467365920 468705512 468253770 468851345
14254 468851345 463424635 457374941 452222720 443287699 430664815 417192601 403099614
$$ packed form
14307F5587307K257447K117869K717683L026407K704503K686755K886656L601874
14299H7586501L455553L687185L711500M022701M452631M872784N053645M886868
14291A21729368N513239O220902O271968O707678O872221P544933P740900Q694520
14283A77295729Q564133R661276R971349J0447401J1230455J1759869J2353703
14276B51283915J2977990J3539356J4027665J4969408J4927448J4802743J4746314
14269C51274839J4417022J3583654J2705596J1377839J1381475J0407930R243857
14262D34392212P681818P639209P502534O087896M062251J339592m51742N97575
14254D68851345n426710o049694n152221q935021j2622884j3472214j4092987
$$ plain form
14247 403099614 388584106 374337391 359836637 344930613 330881791 317439071 303473720
14240 303473720 289916394 276893333 264028015 251816887 240356490 228775502 218577829
14233 218577829 208518586 198907018 189793083 180011537 171227946 163266460 155174178 147753703
14225 147753703 140995292 134594482 127970572 122651762 117288986 112391632 107244356 102694244
14217 102694244 98788298 94891525 91063913 87463813 84310082 80558635 77613135 74799409
14209 74799409 72212880 69627960 67091254 64900568 62574879 60668907 58717574 56519221
14201 56519221 54578384 53302271 51511898 49792234 48570610 47223112 45370124 44522074
14193 44522074 43364394 41992372 41072840 39581605 38537891 37319519 36477338 35722705
$$ packed form
14247D03099614j4515508j4246715j4500754j4906024j4048822j3442720j3965351
14240C03473720j3557326j3023061j2865318j2211128j1460397j1580988j0197673
14233B18577829j0059243r611568r113935r781546q783591p961486q092282p420475
14225A47753703o758411o400810o623910n318810n362776m897354n147276m550112
14217A02694244l905946l896773l827612l600100l153731l751447k945500k813726
14209G4799409k586529k584920k536706k190686k325689j905972j951333k198353
14201E6519221j940837j276113j790373j719664j221624j347498j852988q48050
14193D4522074j157680j372022r19532j491235j043714j218372q42181p54633
$$ plain form
14185 35722705 34703865 33776983 32789700 31992298 31425217 30592829 29860291 28985605 28460554
14176 28460554 27444319 27017599 26149433 25613506 25083691 24625366 24069832 23578708 23263684
14167 23263684 22680379 22087653 21815324 21045493 20525695 20026491 19704883 19396074 19089954
14158 19089954 18566886 18271760 18120926 17598866 17169383 17076986 16894329 16464130 15975024
14149 15975024 15842674 15420226 15091762 14849667 14554746 14390866 14046183 13957363 13536090
14140 13536090 13838563 13091625 13081634 12821368 12190064 12326214 12381474 12016668 11680364 11237539
14130 11237539 11057246 11394384 11169838 10922889 10387080 10457923 10560885 10390945 10063319
14121 10063319 9883339 9936235 9887511 9501478 9358291 9134352 9268355 9004092 8802198 8830800
$$ packed form
14185C5722705j018840r26882r87283p97402n67081q32388p32538q74686n25051
14176B8460554j016235m26720q68166n35927n29815m58325n55534m91124l15024
14167B3263684n83305n92726k72329p69831n19798m99204l21608l08809l06120
14158A9089954n23068k95126j50834n22060m29483r2397j82657m30199m89106
14149A5975024j32350m22448l28464k42095k94921j63880l44683q8820m21273
14140A3536090L02473p46938r991k60266o31304J36150N5260l64806l36304m42825
14130A1237539j80293L37138k24546k46949n35809P0843J02962j69940l27626
14121A0063319j79980N2896m8724l86033j43187k23939J34003k64263k01894K8602
$$ plain form
14111 8830800 8708989 8494626 8436821 8226236 8376577 8362561 7808192 7657179 7625002 7800619
14101 7800619 7633104 7356592 7466160 7502717 7380686 7208496 7040938 7177912 6898571 6775511
14091 6775511 7046941 6892857 6321559 6359411 6573741 6268694 6122092 6152213 6286912 6027137
14081 6027137 5870537 5886953 6068361 5729902 5700207 5662699 5576597 5270076 5462598 5278009
14071 5278009 5185452 4968835 5233403 5302489 5035562 5115470 4808232 4998981 4807882 4881638
14061 4881638 4615790 4967748 4359790 4639841 4376200 4566210 4519870 4438470 4273989 4590581
14051 4590581 4170096 4044884 4629142 4212660 4228801 3961635 4045693 4255426 4293753 4141760
14041 4141760 4153766 4235654 3773900 3874985 3842823 3548052 3556823 3550649 3996608 3649726 3404836
$$ packed form
14111H830800j21811k14363n7805k10585J50341j4016n54369j51013l2177J75617
14101G800619j67515k76512J09568L6557j22031j72190j67558J36974k79341j23060
14091F775511K71430j54084n71298L7852K14330l05047j46602L0121J34699k59775
14081F027137j56600J6416J81408l38459k9695l7508q6102l06521J92522j84589
14071E278009r2557k16617K64568O9086k66927P9908l07238J90749j91099P3756
14061D881638k65848L51958o07958K80051k63641J90010m6340q1400j64481L16592
14051D590581m20485j25212N84258m16482J6141k67166Q4058K09733L8327j51993
14041D141760J2006Q1888m61754J01085l2162k94771Q771o174M45959l46882k44890
$$ plain form
14030 3404836 3357721 3288806 3271992 3312502 3196619 3292195 3360240 3323890 3235905 3291958 3230160
14019 3230160 3387908 3235857 3284361 3050866 3173858 3394820 3078553 3181170 2852463 3214871
14009 3214871 3027567 2831169 2633667 2596811 3041422 2856031 2695448 2437561 2632846 2498956
13999 2498956 2602816 2768205 2378772 2627072 2739130 2317243 2448873 2355907 2417957 2472263
13989 2472263 2169789 2243342 2261244 2272148 2396196 2305917 2076413 2461419 2747949 2760182
13979 2760182 3162723 3544291 3485416 4065533 5288966 6802487 10116982 15940803 26761316
13970 26761316 31866178 23128965 14971634 9520784 7119577 5770909 5234836 4452039
13962 4452039 3924892 3667142 3387310 3590306 2772921 2756220 2752367 2927547 2922794 2782714
$$ packed form
14030C404836m7115o8915j6814M0510j15883R5576O8045l6350q7985N6053o1798
14019C230160J57748j52051M8504k33495J22992K20962l16267J02617l28707L62408
14009C214871j87304j96398j97502l6856M44611j85391j60583k57887J95285j33890
13999B498956J03860J65389l89433K48300J12058m21887J31630r2966O2050N4306
13989B472263l02474P3553J7902J0904J24048r0279k29504L85006K86530J2233
13979B760182M02541L81568n8875N80117J223433J513521L314495N823821J0820513
13970B6761316N104862q737213q157331n450850k401207j348668n36073p82797
13962D452039n27147k57750k79832K02996q17385j6701l853J75180m753j40080
$$ plain form
13952 2782714 2303755 2447456 2650223 2527478 2082349 2427539 2075406 2142264 1708212 1930419
13942 1930419 2068546 1982636 1951539 2022011 2023341 2139608 2116315 2024325 1918175 2060691 2102245
13931 2102245 1955439 1848269 1944199 2194445 1660890 1639997 1647212 1777135 1800096 1815475
13921 1815475 1903920 1861531 1759099 1561584 1825196 1544270 1722565 1654030 1691413 1484962
13911 1484962 1786080 2065039 1703463 1508315 1834996 1648023 1653944 1424218 1928190 1473098
13901 1473098 1836545 1626199 1502760 1574610 1323390 1434497 1461745 1463791 1315295 1509784
13891 1509784 1158649 1349381 1298151 1599001 1453844 1259821 1484618 1280284 1291762 1514331
13881 1514331 1436076 1425985 1457782 1258116 1166426 1371217 1362751 1261679 1253083 1531861 1618809
$$ packed form
13952B782714m78959J43701K02767j22745m45129L45190l52133O6858m34052K22207
13942A930419J38127q5910l1097P0472J330J16267k3293r1990j06150J42516M1554
13931B102245j46806j07170R5930K50246n33555k0893P215J29923K2961J5379
13921A815475Q8445m2389j02432j97515K63612k80926J78295o8535L7383k06451
13911A484962L01118K78959l61576j95148L26681j86973N921k29726N03972m55092
13901A473098L63447k10346j23439P1850k51220J11107K7248K046j48496J94489
13891A509784l51135J90732n1230L00850j45157j94023K24797k04334J1478K22569
13881A514331p8255j0091L1797j99666r1690K04791q466j01072q596K78778Q6948
$$ plain form
13870 1618809 1070622 1420856 1184580 1131480 1404420 1363443 1155934 1220183 1461495 1214345
13860 1214345 1394770 1046903 1167148 1091649 857833 1117173 1083390 1071219 1241220 836338
13850 836338 1220938 958412 1294460 1203641 1111145 939970 1066876 983202 927970 1172346
13840 1172346 968142 850684 1069193 1027067 756959 985738 787313 545890 1181806 870569
13830 870569 863927 1258873 793450 953878 1250911 749523 978154 1065574 960144 1429732
13820 1429732 931445 1153736 904419 632150 1017677 635738 813080 849903 683122 929124
13810 929124 859472 977971 777769 826485 983058 867527 712365 656159 938337 1102963
13800 1102963 569344 774921 931945 547463 770415 1200609 794225 941661 764308
$$ packed form
13870A618809n48187L50234k36276n3100K72940m0977k07509O4249K41312k47150
13860A214345J80425l47867J20245p5499k33816K59340l3783j2171J70001m04882
13850H36338L84600k62526L36048r0819r2496j71175J26906q3674n5232K44376
13840A172346k04204j17458K18509m2126k70108K28779j98425k41423O35916l11237
13830H70569o642L94946m65423J60428K97033n01388K28631Q7420j05430M69588
13820A429732m98287K22291k49317k72269L85527l81939J77342L6823j66781K46002
13810I29124o9652J18499k00202M8716J56573j15531j55162n6206K82178J64626
13800A102963n33619K05577J57024l84482K22952M30194m06384J47436j77353
$$ plain form
13791 764308 563092 713451 1183305 969122 818098 767806 687817 786093 587805 781099
13781 781099 730925 674160 664391 638830 1183411 672745 603366 669610 546011 787879 875285
13770 875285 791098 635572 507365 675191 507463 1132396 666612 796506 580338 794699
13760 794699 686155 769535 320425 382017 774983 495900 464426 660799 797519 546706
13750 546706 529844 868863 404218 818501 774612 917272 630954 537021 773736 532239
13740 532239 475915 497498 505276 578148 740435 636129 533765 862114 593020 1030024
13730 1030024 756185 634917 813689 600952 508828 547936 449886 606979 475860 361159
13720 361159 775553 735616 839058 654931 677081 450605 483543 567896 777746 687112
$$ packed form
13791G64308k01216J50359M69854k14183j51024n0292p9989R8276j98288J93294
13781G81099n0174n6765r769k5561N44581n10666o9379O6244j23599K41868Q7406
13770H75285q4187j55526j28207J67826j67728O24933m65784J29894k16168K14361
13760G94699j08544Q3380C20425O1592L92966k79083l1474J96373J36720k50813
13750E46706j6862L39019D04218M14283m3889J42660k86318r3933K36715k41497
13740E32239n6324K1583P778P2872J62287j04306j02364L28349k69094M37004
13730A030024k73839j21268J78772k12737r2124L9108r8050J57093j31119j14701
13720C61159M14394l9937J03442j84127K2150k26476L2938Q4353K09850r0634
$$ plain form
13710 687112 427937 699099 718358 749537 500473 592158 406550 480318 529558 549716 347041
13699 347041 616043 619886 551571 853056 842275 439172 411393 410285 616824 606154 319880
13688 319880 345041 675303 400035 846943 669759 341427 139355 632928 721118 652539
13678 652539 488352 491440 567396 380606 654849 519877 384836 593448 369426 635384
13668 635384 496584 419225 737868 613002 542773 488074 580097 678944 574012 665302 379202
13657 379202 590427 396264 768730 80852 745743 309059 570421 551901 336060 735733
13647 735733 447836 616730 405658 323877 447107 366759 755021 341099 805520 399904
13636 778293 290771 361483 457908 732042 526064 280834 98489 406043 522508 443960
$$ packed form
13710F87112k59175K71162J9259L1179k49064R1685j85608P3768M9240K0158k02675
13699C47041K69002L843o8315L01485j0781m03103k7779j108K06539j0670k86274
13688C19880K5161L30262k75268M46908j77184l28332A39355M93573Q8190o8579
13678F52539j64187L088P5956j86790K74243j34972j35041K08612k24022K65958
13668F35384j38800p7359L18643j24866p0229n4699R2023R8847j04932R1290k86100
13657C79202K11225j94163L72466H0852O64891C09059K61362j8520k15841L99673
13647G35733k87897J68894k11072q1781J23230q0348L88262C41099M64421C99904
13636G78293B90771P0712R6425K74134k05978k45230I8489L07554J16465p8548
$$ plain form
13626 443960 261951 563510 233634 470381 326326 381919 725021 342651 345375 191882
13616 191882 540244 550921 426710 207318 585482 236153 93866 223571 555284 385411
13606 385411 305010 620745 403992 503312 752142 707984 615973 481283 701378 368704
13596 368704 316805 476237 429796 271357 113312 442196 110938 465845 514373 571731
13586 571731 314115 595187 250237 466488 506799 302700 209125 334989 325299 422324
13576 422324 232468 -3458 225448 281238 256176 559277 267502 181230 538453 415936
13566 415936 432103 494076 324314 412368 63520 -4660 11274 392196 260114 196405 437814
13555 437814 485606 523498 240058 282530 280021 305145 367386 409879 236268 96751 128235
$$ packed form
13626D43960j82009L01559B33634K36747j44055N5593L43102C42651K724j53493
13616A91882L48362J0677j24211B07318L78164B36153I3866J29705L31713j69873
13606C85411q0401L15735k16753R9320K48830m4158r2011j34690K20095l32674
13596C68704n1899J59432m6441j58439A13312L28884A10938L54907M8528N7358
13586E71731k57616K81072B50237K16251M0311k04099r3575J25864r690R7025
13576D22324j89856c458B25448N5790k5062L03101B67502q6272L57223j22517
13566D15936J6167O1973j69762Q8054F3520d660A1274L80922j32082o3709K41409
13555D37814M7792L7892B40058M2472k509K5124O2241M2493j73611I6751L1484
$$ plain form
13544 128235 494200 428634 335854 196554 359289 119859 107136 157218 467192 237678
13534 237678 7042 189376 68410 50560 433012 140034 374844 183746 427700 526491
13524 526491 340977 27050 337701 448070 415707 370170 417192 123414 473005 235915
13513 109606 362505 415094 376107 388433 298430 55861 113295 116422 255037 337077 282108
13502 282108 337428 319086 525372 267509 -12585 523488 267617 107754 371539 310389
13492 310389 334196 -119526 152895 258148 71502 85239 282523 237845 52591 197211
13482 197211 177035 88784 363387 357590 259093 577885 760679 21793 283207 11286 248244
13471 248244 103168 355476 228934 408003 227318 77360 395517 137297 87261 200310
$$ packed form
13544A28235L65965o5566r2780j39300J62735A19859j2723N0082L09974k29514
13534B37678G042J82334F8410j7850L82452A40034K34810A83746K43954R8791
13524E26491j85514B7050L10651J10369l2363m5537M7022A23414L49591B35915
13513A09606K52899N2589l8987J2326r0003E5861N7434L127J38615Q2040n4969
13502B82108N5320j8342K06286k57863a2585E23488k55871A07754K63785o1150
13492C10389K3807a19526A52895J05253G1502J3737J97284m4678E2591J44620
13482A97211k0176q8251K74603n797r8497L18792J82794B1793K61414A1286K36958
13471B48244A03168K52308j26542J79069j80685G7360L18157A37297n0036J13049
$$ plain form
13461 200310 324925 481690 291341 238523 18020 55485 393605 128990 394874 438041
13451 438041 362190 388831 545063 305538 28036 369551 62950 199823 46138 459147
13441 459147 271924 636622 134081 232464 195812 423707 222685 -46391 399632 297638
13431 297638 -120989 52950 552327 79522 149467 -29830 229232 351793 185638 266223
13421 266223 257598 330438 209800 254584 279753 77796 431334 214583 116423 -52760 178402
13409 195542 256112 -170438 -44580 59566 225100 75096 444350 78019 362487 101429
13398 234916 324957 45703 184789 443698 35977 185065 327390 160646 315220 305849
13388 305849 252531 348948 -37338 536799 201128 -74340 322547 -82618 60531 97763 462124
$$ packed form
13461B00310J24615J56765j90349n2818A8020L7465L38120A28990K65884M3167
13451D38041p5851K6641J56232k39525B8036L41515F2950J36873D6138M13009
13441D59147j87223L64698A34081R8383l6652K27895k01022d6391C99632j01994
13431B97638a20989E2950M99377G9522O9945b9830B29232J22561j66155Q0585
13421B66223q625P2840j20638M4784K5169G7796L53538B14583r8160e2760A78402
13409A95542O0570a70438d4580E9566J65534G5096L69254G8019K84468A01429
13398B34916R0041D5703J39086K58909C5977J49088J42325A60646J54574r371
13388C05849n3318R6417c7338E36799B01128g4340C22547h2618F0531L7232L64361
$$ plain form
13377 462124 377845 198668 289641 76146 342396 287860 -17069 -107217 311167 337931 432915
13366 432915 752275 344016 2427 97356 239252 165103 225012 80335 175871 19287 8118
13354 128673 342927 497241 236726 196408 -329832 -154574 145344 150972 292994 226282
13344 226282 144290 168984 185431 488795 91087 135716 25279 -65912 48040 293614 246220
13333 246220 142668 -34608 257650 -268184 105836 5091 439814 187863 183847 -59183 405575
13321 92676 -139699 -108455 620700 -79095 6059 -25479 317208 253653 -174439 30624 161537
13310 161537 162970 168611 516972 214052 -115224 64895 70223 338761 539035 174782 476123
13299 476123 501161 44610 111129 180872 161718 18520 107305 -143149 18963 27433 440475
$$ packed form
13377D62124q4279j79177R0973G6146K66250n4536a7069r0148C11167K6764R4984
13366D32915L19360C44016B427R4929J41896p4149N9909H0335R5536A9287H118
13354A28673K14254J54314B36726m0318c29832a54574A45344N628J42022o6712
13344B26282q1992K4694J6447L03364I1087M4629B5279f5912D8040K45574m7394
13333B46220j03552c4608B57650b68184A05836E091M34723A87863m016e9183D05575
13321I2676a39699L1244F20700g9095F059b5479C17208o3555a74439C0624J30913
13310A61537J433N641L48361B14052a15224F4895N328K68538K00274A74782L01341
13299D76123K5038D4610O6519O9743j9154A8520Q8785a43149A8963Q470M13042
$$ plain form
13288 440475 244724 29022 19312 280165 159806 18676 91132 366405 405398 24010 61875
13277 61875 277557 185551 317937 132176 -184710 168407 346518 -242548 55907 48809
13267 48809 227002 -63739 70770 -199936 -81071 187360 -74437 33811 -145544 436911 -83924
13255 -117797 244487 226171 87733 317310 30436 100433 35229 66461 160519 41601 52372
13244 52372 -68252 18051 -60009 185567 181550 -125691 89516 65690 108572 24848 382094
13233 382094 32435 136805 -50781 213681 -28212 30289 379887 -650220 64416 170682
13223 170682 -261262 622531 224584 235516 170065 -121669 47715 195559 304716 84276
13212 170689 -37042 -74780 171052 -25472 124365 -258112 -69664 -174729 -21876 -266725
$$ packed form
13288D40475j95751B9022r710K60853j20359A8676P2456K75273L8993B4010L7865
13277F1875K15682r2006J32386A32176a84710A68407J78111b42548E5907p098
13267D8809J78193f3739G0770a99936h1071A87360g4437C3811a45544D36911h3924
13255a17797B44487j8316H7733K29577C0436O9997C5229L1232R4058D1601J0771
13244E2372f8252A8051f0009A85567m017a25691H9516k3826M2882B4848L57246
13233C82094C2435J04370e0781B13681b8212C0289L49598f50220F4416J06266
13223A70682b61262F22531B24584J0932o5451a21669D7715J47844J09157H4276
13212A70689c7042l7738A71052b5472A24365b58112f9664j05065b1876k44849
$$ plain form
13202 -266725 163211 187465 -24933 -164715 -24085 249582 215486 479924 73125 217006
13192 217006 96596 -206981 24001 279388 244022 40083 161965 -25472 -137424 299062
13181 170506 301083 106555 239875 123279 118774 290280 366107 233656 507192 425 3659
13170 3659 82058 -297604 6111 157565 37426 83418 -93953 -149431 83973 137502 167117 185162
13158 185162 362099 -121154 141069 149859 -152694 6297 374521 -123015 -212155 -169276 -69669
13146 38042 259405 307086 -276168 163283 -134296 -25959 -61875 98689 508229 362566
13136 362566 -117313 375797 323837 309862 -15141 -160805 -148016 -195794 -73241 302082 228449
13125 228449 53056 29369 3820 -34665 -82252 -107672 -19037 88981 201003 -34709 231835
$$ packed form
13202b66725A63211K4254b4933j39782b4085B49582l4096K64438G3125J43881
13192B17006I6596b06981B4001K55387l5366D0083J21882b5472j11952B99062
13181A70506J30577A06555J33320j16596m505J71506P5827j32451K73536D25L234
13170C659P8399b97604F111J51454C7426M5992i3953n5478H3973N3529K9615J8045
13158A85162J76937a21154A41069Q790a52694F297L68224a23015q9140M2879f9669
13146C8042K21363M7681b76168A63283a34296b5959l5916I8689M09540j45663
13136C62566a17313C75797n1960j3975a5141j45664J2789m7778g3241C02082p3633
13125B28449E3056k3687C820c4665m7587k5420a9037H8981J12022c4709B31835
$$ plain form
13113 -50084 109969 293004 316170 204960 167011 336573 -35900 -13390 -297944 -205020 14322
13101 244747 218125 168785 124333 153023 444819 6063 33706 46674 20154 203158 -129417
13089 185585 51578 138253 -151811 -56050 -313547 -20873 -69663 -200156 -141418 -192321 -32295
13077 -184689 -161870 58342 -152157 20119 217301 218872 145140 141322 185354 -87745 226018
13065 160413 14789 142269 46858 238040 289451 12837 -453971 313424 157852 57376
13054 -225091 97121 153144 102237 -28713 79102 292929 160697 -102974 152479 -53999 -208676
13043 -208676 201181 370936 111454 -190394 -372877 -104140 -131320 118277 409013 -193895
13032 206711 -76935 148418 -6982 108882 -172296 27443 46401 280263 360882 308862 -118287
$$ packed form
13113e0084A09969J83035K3166j11210l7949J69562c5900a3390k84554R2924A4322
13101B44747k6622m9340m4452K8690K91796F063K7643J2968B0154J83004a29417
13089A85585E1578Q6675a51811e6050k57497b0873m8790j30493N8738n0903c2295
13077a84689K2819E8342a52157B0119J97182J571p3732l818M4032h7745B26018
13065A60413A4789J27480D6858J91182N1411A2837d53971C13424j55572E7376
13054b25091I7121N6023n0907b8713G9102K13827j32232a02974A52479e3999j54677
13043b08676B01181J69755A11454a90394j82483a04140k7180A18277K90736a93895
13032B06711g6935A48418f982A08882a72296B7443J8958K33862Q0619n2020a18287
$$ plain form
13020 -338161 -17649 -103657 10048 110266 327659 -86511 -91522 379972 -99329 63054 153066
13009 153066 -175802 7112 387099 -72427 188538 -172618 -36945 -13515 145561 -197995
12998 70551 -82722 34588 338533 56803 394301 227399 271776 266534 266364 -364596 -169455
12986 -20587 -384142 55217 -82923 216417 97430 -70798 -349393 -176861 -2214 -140838 -44049
12974 210496 231809 77641 35935 45901 338485 394877 -83183 -37071 -146091 49819 28877
12963 28877 -125323 -75357 164226 116045 -210828 260112 132046 96390 68773 -144897
12952 -72985 118966 -4290 -134094 26857 -289252 -193519 82097 -234180 181793 157659 3195
12940 149616 -59308 73756 -187151 161405 -1479 176275 231978 -13245 169523 -325725 344189
$$ packed form
13020c38161a7649q6008A0048J00218K17393h6511n011C79972i9329F3054R0012
13009A53066a75802G112L79987g2427A88538a72618c6945a3515A45561a97995
12998G0551h2722C4588L03945E6803L37498j66902M4377n242j70c64596a69455
12986b0587l63555E5217h2923B16417I7430g0798k78595J72532b214j38624d4049
12974B10496K1313G7641C5935R966K92584N6392h3183c7071j09020D9819k0942
12963B8877a25323M9966A64226m8181b10828B60112j28066l5656k7617a44897
12952g2985A18966d290j29804B6857b89252R5733H2097b34180A81793k4134C195
12940A49616e9308G3756a87151A61405a479A76275N5703a3245A69523c25725C44189
$$ plain form
12928 117569 -303054 -100717 251178 261724 32008 -94289 243422 37965 58485 45205 89340
12917 89340 60334 158901 11004 -90355 167680 515873 37742 150800 -44319 9486 -216289
12905 196209 154923 -336649 -295384 225375 18802 -143017 -115306 -73016 141223 23529 191710
12894 191710 -87693 104467 124143 87552 -174872 124046 320515 15077 243559 -317911
12883 120899 23517 383434 -238382 36902 129055 66661 -95229 -163114 -15817 12601 7879
12872 7879 -123273 119149 477615 89792 149966 14675 39951 -73206 -43023 114389 308388
12861 308388 44863 -335577 -221433 -145338 -201492 -70804 237959 146492 74935 -188579 185322
12849 -239850 -25511 -115838 107178 132734 215576 -156699 -78042 50524 20608 -132585 11808
$$ packed form
12928A17569c03054a00717B51178J0546C2008i4289B43422C7965K0520j3280M4135
12917H9340k9006R8567A1004i0355A67680L48193C7742J13058d4319I486b16289
12905A96209m1286c36649M1265B25375A8802a43017K7711M2290A41223B3529J68181
12894A91710h7693A04467J9676l6591a74872A24046J96469A5077K28482c17911
12883A20899B3517L59917b38382C6902R2153o2394i5229o7885a5817A2601m722
12872G879a23273A19149L58466H9792O0174A4675K5276g3206L0183A14389J93999
12861C08388D4863c35577J14144P6095n6154g0804B37959r1467p1557a88579A85322
12849b39850b5511r0327A07178K5556Q2842a56699g8042E0524B0608a32585A1808
$$ plain form
12837 -101054 -39889 -245019 336304 -20065 295943 -107699 -247294 47112 86407 115557
12827 115557 46644 -276397 154352 78169 321774 -36116 -51286 -163639 202941 -21699
12816 4922 63285 -123051 -109317 -10362 18730 -69013 -318909 45484 31414 -317166 -54177
12804 -16202 -167408 44517 18621 113523 -20499 121089 39510 -59053 131969 96722 127310
12793 127310 -72312 -255393 -43593 -63940 -3560 15452 -15016 -190814 167767 -165999 -108308
12782 -108308 -271556 -4414 92232 -50315 -239500 46070 -18534 60100 142671 -193004 -50746
12770 31731 35145 95221 34869 10969 -258238 216931 17331 104774 258558 210231 99248
12758 80698 -66726 158660 -61976 -19665 -268089 -239412 78456 -38209 101997 107137 216202
$$ packed form
12837a01054c9889k05130C36304b0065B95943a07699j39595D7112L9295K9150
12827A15557D6644b76397A54352p6183K43605c6116j5170j12353B02941b1699
12816D922N8363a23051J3734a0362A8730f9013k49896D5484j4070c17166e4177
12804a6202j51206D4517A8621R4902b0499A21089C9510e9053A31969l5247L0588
12793A27310g2312j83081d3593k0347c560A5452a5016j75798A67767a65999N7691
12782a08308j63248d414I2232e0315j89185D6070a8534F0100Q2571a93004e0746
12770C1731L414O0076C4869A0969b58238B16931A7331Q7443J53784m8327I9248
12758H0698f6726A58660f1976a9665k48424K8677G8456c8209A01997N140J09065
$$ plain form
12747 216202 -129892 109821 -220058 146186 -102955 -22447 13649 36630 -48137 -157703
12737 -157703 349613 -54895 185233 12796 -296588 304737 141970 -20719 -192537 2682
12726 -103965 -9940 -302180 29380 -80459 -182652 296568 106758 43051 58098 -259107 370699
12714 -189799 -118530 -88577 173578 53291 222248 -175387 23839 59018 -121720 75240 -112138
12702 99953 36123 -11857 155725 -108332 140746 -41964 99313 -75238 58612 26893 339274
12691 339274 447158 392915 -18914 147230 69222 -65281 -275538 -180319 -195493 106750 -61901
12679 -13698 -74230 -98974 89307 128190 -134244 -232439 -75110 17241 322276 -167210 -307783
12668 -307783 33805 135292 25895 -105247 96568 143664 110660 56701 -80959 141786 -107492
$$ packed form
12747B16202a29892A09821b20058A46186a02955b2447A3649K2981d8137j09566
12737a57703C49613e4895A85233A2796b96588C04737A41970b0719j71818B682
12726a03965i940k92240B9380h0459j02193B96568A06758D3051J5047b59107C70699
12714a89799P1269K9953A73578E3291J68957a75387B3839L5179a21720G5240a12138
12702I9953C6123a1857A55725a08332A40746d1964I9313g5238E8612B6893L12381
12691C39274J07884n4243a8914A47230F9222f5281k10257R5219j5174A06750f1901
12679a3698o0532k4744H9307L8883a34244r8195g5110A7241L05035a67210j40573
12668c07783C3805J01487B5895a05247I6568M7096l3004n3959h0959A41786a07492
$$ plain form
12656 -259093 171324 83500 256441 -116967 -40174 116853 -5766 116403 263109 339057
12646 339057 -268922 20905 123986 204671 122737 465210 -12182 58719 89515 89972 -3229
12634 -35099 17781 117801 -136555 170865 360070 24174 -4590 -209827 233431 -149151
12623 278299 -2184 -105233 36380 60713 -246572 -161687 -272178 -81149 114653 175663 -174891
12611 112870 257403 12453 195727 -72230 11467 50789 106984 -2077 69665 -16818 68854
12599 -36117 101601 -22802 196925 26537 424067 160728 206112 170900 -82450 168075 109011
12588 109011 249111 -2376 175564 -230517 78361 46051 140626 -15692 232915 -326798 213455
12576 41609 -139393 229467 -5916 90294 -17537 99298 -26546 61656 -85049 -291203 -54453
$$ packed form
12656b59093A71324H3500J72941a16967d0174A16853e766A16403J46706P5948
12646C39057b68922B0905J03081Q0685q1934L42473a2182E8719L0796M57c229
12634c5099A7781J00020a36555A70865J89205B4174d590k05237B33431a49151
12623B78299b184j03049C6380K4333b46572Q4885j10491h1149A14653O1010a74891
12611A12870J44533A2453J83274g2230A1467L9322N6195b077F9665a6818F8854
12599c6117A01601b2802A96925B6537L97530A60728M5384l5212h2450A68075n9064
12588A09011J40100b376A75564b30517G8361l2310R4575a5692B32915c26798B13455
12576D1609a39393B29467e916I0294a7537I9298b6546F1656h5049k06154e4453
$$ plain form
12564 287727 280447 196098 -49834 -264669 32674 21697 224806 109691 98716 68734 159802
12553 159802 -214522 6454 2070 -140531 15603 -151023 -370459 48352 129975 -259715 -89706
12541 14902 151718 -267344 163798 34648 -414756 109873 102812 3140 -52150 -188212 -95179
12530 -95179 188228 23795 38234 -290359 -75537 229113 -67128 84118 37490 -175414 70817
12518 39808 119426 -199993 102796 237892 -171155 205279 -144713 368771 -44372 21166
12507 103584 34316 2999 -169571 236257 245508 210441 214344 -74091 1550 131798 302737
12496 302737 172755 200944 -202448 -94489 -92803 -219642 218061 -189640 159894 7126 155953
12485 155953 25993 22055 9509 -222112 -81025 -160469 68534 -171775 108708 121214 -291969
$$ packed form
12564B87727p280q4349d9834k14835C2674j0977K03109A09691j0975k9982R1068
12553A59802b14522F454B070a40531A5603a51023k19436D8352Q1623b59715h9706
12541A4902J36816b67344A63798C4648d14756A09873p061C140e2150j36062R3033
12530i5179A88228B3795J4439b90359g5537B29113f7128H4118C7490a75414G0817
12518C9808P9618a99993A02796J35096a71155B05279a44713C68771d4372B1166
12507A03584C4316B999a69571B36257R251l5067L903g4091A550J30248J70939
12496C02737j29982K8189b02448i4489J686j26839B18061a89640A59894G126J48827
12485A55953B5993l938I509b22112h1025p9444F8534a71775A08708J2506b91969
$$ plain form
12473 160784 -222131 -149442 -40849 -253529 -533886 -142048 -12767 -145315 173462 95827
12463 95827 2751 79422 130170 -110332 -125868 49932 -13143 140882 -260201 46411 194261
12452 194261 184049 -22176 2951 -1983 133982 135875 131497 94657 123369 77677 -213603 253420
12439 -61062 -324624 -172106 31059 21551 -311639 239867 -207726 -119673 113198 72341 -63318
12427 142180 -424824 9855 -170255 53156 140914 -105837 45383 329032 278014 -151384 -12857
12415 -192360 -142876 25829 91577 44523 275051 -129374 275472 129672 -11797 -146777
12405 -146777 -418640 151368 -110783 32577 147445 -153039 -136093 -216255 294955 187356
12395 187356 45367 34390 -142879 -325933 -96699 -53136 -116636 -57648 121323 -151379 -138550
$$ packed form
12473A60784b22131P2689d0849k12680k80357a42048a2767j32548A73462p7635
12463I5827B751P6671N0748a10332j5536D9932a3143A40882b60201D6411J47850
12452A94261j0212b2176B951a983A33982J893m378l6840K8712m5692b13603B53420
12439f1062k63562J52518C1059r508c11639B39867b07726Q8053A13198m0857f3318
12427A42180d24824I855a70255E3156Q7758a05837D5383K83649n1018a51384a2857
12415a92360M9484B5829O5748D4523K30528a29374B75472A29672a1797j34980
12405a46777k71863A51368a10783C2577J14868a53039J6946q0162B94955j07599
12395A87356D5367j0977a42879j83054i6699M3563o3500e7648A21323a51379J2829
$$ plain form
12384 -138550 108110 -258797 54523 199412 94391 260381 46618 104617 191775 -341002
12373 -209830 169060 -262994 -368613 288914 -389506 165048 -43202 -38651 277705 89131
12362 35001 406782 166689 131852 211348 46322 -66858 102599 -86456 180870 232666 16092
12350 -105208 -183715 23500 23049 219823 -131727 151480 25991 144190 -100033 73711 -35762
12338 -53775 -130154 254068 137233 169330 -314923 48317 -165863 419016 -24338 42906 78009
12327 78009 215907 3765 -22601 154653 26062 273601 45923 -75915 229756 178629 83897
12315 88338 -26345 45114 115383 73458 193117 334793 88913 427828 -240828 109366 443889
12304 443889 184644 274372 -216742 121734 -29423 188909 -37856 35077 258365 218463
$$ packed form
12384a38550A08110b58797E4523J44889I4391J65990D6618N7999Q7158c41002
12373b09830A69060b62994j05619B88914c89506A65048d3202M551B77705H9131
12362C5001L71781A66689l4837P9496D6322f6858A02599h6456A80870N1796A6092
12350a05208p8507B3500m51J96774a31727A51480B5991J18199a00033G3711c5762
12338e3775p6379B54068j16835L2097c14923D8317a65863D19016b4338D2906L5103
12327G8009J37898C765b2601A54653B6062K47539D5923g5915B29756n1127H3897
12315H8338b6345D5114P0269m1925J19659J41676H8913L38915b40828A09366L34523
12304D43889A84644Q9728b16742A21734b9423A88909c7856C5077K23288l9902
$$ plain form
12294 218463 71113 -228446 151147 125890 -2268 176161 -114237 33841 -118995 117416
12283 53390 34698 114581 -48549 -58463 -24818 91958 79791 9652 194430 216946 -221252 238224
12270 59736 78481 -30376 285420 45333 138000 -251275 -46249 148053 64880 255736 100102
12258 366397 264165 209356 33078 43916 -92399 249703 -76250 138378 297852 -190024
12247 50591 355139 87578 213981 -89499 38078 161443 440141 -196584 175335 62170
12236 -160305 200253 261761 53080 41072 325314 -51322 -255932 -270474 -78735 -62555 -317152
12225 -317152 -361685 -242515 -63623 244632 405033 25052 176698 59595 21896 237691
12215 237691 261543 35686 323634 7117 -30452 91972 330277 270147 255306 22098 -48601
$$ packed form
12294B18463G1113b28446A51147k5257b268A76161a14237C3841a18995A17416
12283E3390j8692P9883d8549r914b4818I1958j2167I652J84778K2516b21252B38224
12270E9736J8745c0376B85420D5333R2667b51275d6249A48053F4880J90856A00102
12258C66397j02232n4809C3078J0838i2399B49703g6250A38378J59474a90024
12247E0591L04548H7578J26403h9499C8078J23365K78698a96584A75335F2170
12236a60305B00253O1508E3080j2008K84242e1322k04610j4542g8735J6180k54597
12225c17152m4533J19170f3623B44632J60401B5052J51646E9595B1896K15795
12215B37691K3852C5686K87948G117c0452I1972K38305o0130j4841B2098d8601
$$ plain form
12203 212786 72445 168554 220021 433111 90050 190682 -43501 128661 39204 196481 -100
12191 -80041 424705 29981 490411 266803 224853 -168895 -106990 83948 -47062 -12221 71445
12179 -6361 -98119 -43904 213055 154934 302916 -58444 -144494 301009 145411 -2614 88987
12167 332045 43730 236525 583113 121643 -24011 240766 216665 237376 -21014 -142927
12157 -142927 55396 286537 239690 79044 45962 149956 -20135 234096 365478 163192
12146 192141 -2393 78559 402610 185678 3491 -52717 209424 32007 109602 -32201 -53211
12135 -53211 442443 324513 136855 -77055 146076 -83879 -159977 10102 144905 277357
12125 277357 162833 -180030 -274010 619697 -491 133456 194889 -178802 124862 -220214
$$ packed form
12203B12786G2445R6109N1467K13090I0050J00632d3501A28661C9204J57277a00
12191h0041D24705B9981M60430k23608m1950a68895O1905H3948d7062a2221G1445
12179f361r1758d3904B13055n8121J47982e8444q6050C01009A45411b614H8987
12167C32045D3730J92795L46588A21643b4011B40766k4101K0711b1014j21913
12157a42927E5396K31141m6847G9044l3082J03994b0135B34096J31382A63192
12146A92141b393G8559L24051A85678C491e2717B09424C2007P7595c2201k1010
12135e3211D42443j17930A36855g7055A46076h3879p6098A0102J34803J32452
12125B77357j14524a80030r3980F19697d91A33456O1433a78802A24862b20214
$$ plain form
12114 192636 -2710 185402 134702 -124596 -177633 -128954 -58151 -17559 29342 110532 125260
12103 125260 504243 160122 169461 432875 73261 272763 188475 -139712 -203825 5190 360949
12092 360949 -130753 74820 8578 92930 24131 211879 407775 245225 386041 259721
12082 259721 -155509 -259635 251634 399708 149713 122607 -292107 257927 70416 17743
12071 123741 132438 19809 300060 252255 190454 68092 103954 109735 28887 274756 -64768
12059 275331 -177661 284734 109439 222674 -61418 -105435 8162 -31641 215 80406 213834
12048 213834 78466 70576 251032 -109086 -51717 212026 -263942 260611 112649 283414
12038 283414 -394175 177359 2975 75171 3885 370098 -40490 -147029 -38228 -106509 6193
$$ packed form
12114A92636b710A85402n0700a24596n3037M8679e8151a7559B9342Q1190J4728
12103A25260L78983A60122R339K63414G3261J99502q4288a39712o4113E190L55759
12092C60949a30753G4820H578Q4352B4131J87748J95896j62550J40816j26320
12082B59721a55509j04126B51634J48074A49713k7106b92107B57927G0416A7743
12071A23741Q697A9809K80251m7805o1801F8092L5862N781B8887K45869f4768
12059B75331a77661B84734A09439J13235f1418m4017H162c1641B15Q0191J33428
12048B13834G8466p890J80456a09086e1717B12026b63942B60611A12649J70765
12038B83414c94175A77359B975P2196C885L66213d0490j06539c8228o8281F193
$$ plain form
12026 336514 222645 171642 -40438 -305062 -384444 68833 -273653 107604 319481 127183
12015 109265 -72003 -87488 332863 55465 -329603 -48493 145643 -69676 -132451 170064 133767
12004 133767 103565 234759 119131 -98770 -120992 104511 462752 -31767 -78661 -23286 38173
11992 -318749 -422904 79892 -233696 100019 20088 -180957 370829 -33464 -95503 81190
11981 -117048 -28177 -164804 -180568 37847 247780 -213738 -227402 380212 -59700 75663 -48195
11969 23566 -324413 -152005 90331 -161913 228724 218822 -68003 83947 -67044 202598 446233
11958 446233 -156174 -24024 42620 163213 -312332 43038 48956 6317 101613 57192 -375477
11946 -134861 153757 -15999 231198 -235026 -1656 -109769 -377652 170184 344608 -7328
$$ packed form
12026C36514j13869n1003d0438k64624p9382F8833b73653A07604K11877A27183
12015A09265g2003j5485C32863E5465c29603d8493A45643f9676o2775A70064l6297
12004A33767l0202J31194j15628i8770k2222A04511L58241c1767m6894b3286C8173
11992c18749j04155G9892b33696A00019B0088a80957C70829c3464o2039H1190
11981a17048b8177j36627j5764C7847K09933b13738j3664C80212e9700G5663d8195
11969B3566c24413a52005I0331a61913B28724r902f8003H3947f7044B02598K43635
11958D46233a56174b4024D2620J20593c12332D3038N918F317R5296m4421c75477
11946a34861A53757a5999B31198b35026a656j08113k67883A70184J74424g328
$$ plain form
11935 -45963 249347 -406995 -69328 125440 -26047 30924 -222040 -55716 10873 -157120 83094
11923 -52740 361590 95010 -3582 41884 -298858 -5001 72183 265675 -189635 195627 -159935
11911 128570 -103330 5258 -53778 98741 199473 -50931 75883 -231237 237374 -2643 194575
11899 38552 -46502 -11337 221769 49078 46290 328944 -69443 98703 184027 -114884 60903
11887 122866 11064 -203889 -137949 -161947 132332 -97006 -103222 108430 -23063 62162 117047
11876 117047 23761 -37108 129083 -138826 -65500 -123251 612 -82263 -356490 -93641 28620
11864 34051 -424463 -22406 -55355 224624 48471 -155244 225905 -294693 13345 -260454
11853 29552 106487 -272229 -11113 36189 67550 -436139 41742 44817 121232 -83629 22490
$$ packed form
11935d5963B49347d06995f9328A25440b6047C0924b22040e5716A0873a57120H3094
11923e2740C61590I5010c582D1884b98858e001G2183J93492a89635A95627a59935
11911A28570a03330E258e3778I8741J00732e0931G5883b31237B37374b643A94575
11899C8552d6502a1337B21769D9078k788K82654f9443I8703Q5324a14884F0903
11887A22866A1064b03889O5940k3998A32332i7006o216A08430b3063F2162N4885
11876A17047B3761c7108A29083a38826f5500n7751F12h2263k74227i3641B8620
11864C4051d24463b2406l2949B24624D8471a55244B25905b94693A3345b60454
11853B9552P6935b72229a1113C6189L1361d36139D1742L075P6415h3629B2490
$$ plain form
11841 -200535 181379 -92741 11235 -51392 -41294 -161272 -22454 242450 -159962 -11623 7444
11829 -150045 -266772 175927 -310927 -34498 -50811 98291 -316082 -217842 93763 -200800
11818 34384 88803 184900 -60717 120783 -270300 -46439 -57798 -103705 -105965 -95525 193308
11806 -51260 -264827 -266003 54912 46749 -266927 120515 -113501 -21975 70258 213425 -186003
11794 8480 181982 -244316 45269 79765 149399 85326 -214248 -272922 -174884 -214403 -151973
11783 -151973 140202 265097 94932 -202411 -67438 -43836 13725 -159455 -48668 66187 265164
11772 265164 -4948 125770 137956 83119 -50471 -123316 78863 -203068 -63891 103784 200338
11761 200338 -8161 63527 47828 186201 -97054 -17156 -30272 -104063 -19092 190017 211921
$$ packed form
11841b00535A81379i2741A1235e1392J0098j19978b2454B42450a59962a1623G444
11829a50045j16727A75927c10927c4498j6313I8291c16082R8240I3763b00800
11818C4384N4419R6097f0717A20783b70300d6439j1359m5907k260J0440A93308
11806e1260k13567j176E4912q163b66927A20515a13501b1975G0258J43167a86003
11794H480J73502b44316D5269L4496O9634o4073b14248n8674R8038l9519O2430
11783a51973A40202J24895I4932b02411f7438K3602A3725a59455d8668F6187J98977
11772B65164d948A25770J2186n4837e0471p2845G8863b03068f3891A03784R6554
11761B00338h161F3527j5699J38373i7054a7156j3116p3791a9092A90017K1904
$$ plain form
11750 211921 -286768 1715 -528894 -245299 -112324 94068 85544 61629 -76547 58761 -101475
11738 66218 -240529 -8971 -130060 -180106 -144342 -158210 62174 66210 -134005 -256476 -458 -32280
11726 -32280 -18991 159439 -32106 87566 89650 14182 49025 75229 20380 -23381 148237
11714 723 28491 271158 90438 -160274 -134787 89364 70182 -233817 31694 247510 -212681
11702 -108905 -17118 531438 -140860 114585 116903 182307 -84630 -177038 149582 231017 -145522
11690 168646 324826 137007 189973 135194 -186516 -96671 -88669 105671 -72808 173221 80217
11678 -201890 285913 -83090 97398 -14994 14284 85541 -165696 199282 -349973 327968
11667 -67807 -220498 -3322 -124103 -135436 -139464 134223 57984 343304 -53052 37439 36655 -160848
$$ packed form
11750B11921b86768A715e28894b45299a12324I4068q524k3915g6547E8761a01475
11738F6218b40529h971j21089n0046L5764j3868F2174M036a34005j22471d58l1822
11726c2280J3289A59439c2106H7566K084A4182L4843K6204B0380b3381A48237
11714G23K7768K42667I0438a60274K5487H9364j9182b33817C1694K15816b12681
11702a08905a7118E31438a40860A14585K318O5404h4630r2408A49582Q1435a45522
11690A68646J56180A37007N2966n4779a86516Q9845Q002A05671g2808A73221H0217
11678b01890B85913h3090I7398a4994A4284P1257a65696A99282c49973C27968
11667f7807j52691c322j20781j1333m028A34223E7984K85320e3052C7439p84a60848
$$ plain form
11654 78492 171879 -320253 -9742 16120 268234 112019 270900 289133 24129 80769 111039
11643 111039 -151602 -186021 -81526 154977 31784 32829 -102067 390802 322823 135678 -21932
11631 -94174 32143 -271578 -208600 1682 -139398 -357048 12447 -184928 -59985 -39620 -213650
11620 -213650 74794 -214457 399424 279139 17465 -188888 -111774 -171454 -113207 -286785
11610 -286785 -46333 -232162 -165583 -12063 241447 -208271 -243408 109878 223559 189205
11600 189205 282739 -17358 71 -102954 166960 -162150 148840 103525 150379 27662 322593
11589 322593 153903 164227 -168533 184353 -9578 -4337 104313 121283 424533 232463 383348
11578 383348 -82130 240843 -110114 183238 33157 86023 86388 33315 140654 224177 -140661
$$ packed form
11654G8492R3387c20253i742A6120K52114A12019J58881J8233B4129N6640L0270
11643A11039a51602l4419h1526A54977C1784J045a02067C90802o7979A35678b1932
11631i4174C2143b71578O2978A682a39398k17650A2447a84928e9985K0365j74030
11620b13650G4794b14457C99424j20285A7465a88888P7114n9680N8247j73578
11610b86785d6333j85829O6579a2063B41447b08271l5137A09878J13681l4354
11600A89205R3534a7358G1a02954A66960a62150A48840m5315M6854B7662K94931
11589C22593A53903J0324a68533A84353i578d337A04313J6970L03250j92070J50885
11578C83348h2130B40843a10114A83238C3157N2866L65C3315J07339Q3523a40661
$$ plain form
11566 101199 -31371 215082 148191 -173283 198294 -24993 -8225 300449 5120 431205 -49145
11554 110927 -100251 197473 -37413 -13217 -40438 144711 -118638 139322 -209399 189398
11543 -2226 57679 154111 206169 6201 -4875 288043 -289523 -62726 -18195 146334 -4675 30010
11530 -17332 -95333 20467 365439 113951 60636 98025 -192410 163092 -31456 54452 -126428
11518 -231494 -90085 112539 146908 -153664 20705 241070 179330 251413 -8604 -238664 -19480
11506 -116338 190318 157541 -128837 -119839 40526 -360039 -47419 147363 140492 103419 -102058
11494 56710 -53452 233169 110248 205853 -176948 208716 421704 63587 395534 31248
11483 -190338 -84851 198793 178303 -46662 126983 201074 254482 368115 973 -126170 231139
$$ packed form
11566A01199c1371B15082o6891a73283A98294b4993h225C00449E120M26085d9145
11554A10927a00251A97473c7413a3217k7221A44711a18638A39322b09399A89398
11543b226E7679R6432N2058F201d875B88043b89523f2726a8195A46334d675C0010
11530a7332p8001B0467L44972A13951n3315L7389a92410A63092c1456E4452a26428
11518b31494i0085A12539L4369a53664B0705K20365o1740P2083h604k30060a9480
11506a16338A90318l2777a28837Q998D0526c60039d7419A47363o871l7073a02058
11494E6710e3452B33169A10248R5605a76948B08716K12988F3587L31947C1248
11483a90338h4851A98793k0490d6662A26983P4091N3408J13633I73a26170B31139
$$ plain form
11471 -224713 19221 220914 1793 176644 89321 163762 51095 160547 200370 -104081 -25570
11459 60630 146244 207833 111185 250297 24266 252171 189896 201791 -207818 14462 401683
11448 401683 121820 -52982 196709 287046 294792 -262782 -134786 46756 145008 231802 89345
11436 -268370 -136806 -269993 243453 -76364 -27779 -295891 -451133 321534 -271443 111898
11425 -220397 142199 -242549 -235594 70703 76384 -45204 -83473 204074 114070 -54093 -156208
11414 -156208 -89691 172071 -97252 61593 -441266 267722 -128066 44062 -60631 246309
11403 19307 124661 208800 -35438 139603 238641 214230 -242668 -312222 -136410 224916 119668
11392 119668 65510 -318640 263081 162330 1754 129807 214910 27692 -105308 -148623 19808
$$ packed form
11471b24713A9221K01693A793J74851q7323P4441E1095J09452L9823a04081b5570
11459F0630Q5614O1589r6648J39112B4266K27905o2275J1895b07818A4462L87221
11448D01683A21820e2982A96709R0337P746b62782J27996D6756R8252Q6794H9345
11436b68370J31564j33187B43453g6364b7779k68112j55242C21534b71443A11898
11425b20397A42199b42549O955G0703N681d5204l8269B04074r0004e4093j02115
11414a56208O6517A72071i7252F1593d41266B67722a28066D4062f0631B46309
11403A9307J05354Q4139c5438A39603R9038k4411b42668o9554a36410B24916j05248
11392A19668n4158c18640B63081j00751A754J28053Q5103B7692a05308m3315A9808
$$ plain form
11380 316179 4868 66779 44537 -65885 216108 -27234 138049 49925 -213524 151601 84352
11369 84352 -180766 -274818 -165249 207708 268093 -19484 -252208 12573 -32143 176309 -242736
11357 -195264 -137061 97928 107904 -86835 91270 102230 199360 -31192 -419056 -58804 -16563
11345 43163 53425 54792 -257125 286262 80676 -117245 273126 -6091 16372 -260935 -188036
11334 -188036 -178667 229608 27288 5172 -147802 229822 52875 -122585 -71202 -238707 -92382
11322 83384 -74799 246183 108698 12598 -78999 125046 30957 114908 144337 68827 -176787
11310 137672 128688 74921 -193356 -104128 -238166 -15576 376189 -94285 -608242 -234299 18041
11298 -160759 238841 -103492 -6004 64786 -92935 61528 -110347 -214476 123086 -155567
$$ packed form
11380C16179D868O1911k2242f5885B16108b7234A38049D9925b13524A51601o7249
11369H4352a80766r4052J09569B07708O0385a9484k32724A2573c2143A76309b42736
11357a95264N8203I7928R976h6835I1270J0960R7130c1192l87864e8804a6563
11345D3163J0262J367b57125B86262H0676a17245B73126f091A6372b60935P2899
11334a88036R369B29608B7288E172a47802B29822E2875a22585N1383j67505i2382
11322H3384g4799B46183A08698A2598g8999A25046C0957Q3951K9429F8827a76787
11310A37672q984n3767a93356Q9228j34038a5576C76189i4285n13957b34299A8041
11298a60759B38841a03492f004F4786i2935F1528a10347j04129A23086a55567
$$ plain form
11287 56967 75857 -176470 -56644 -161812 -108647 64451 55687 -19641 -151596 34710 63583
11276 63583 77820 -308477 76352 -306978 90375 -174985 -183806 -166591 -375567 -207360 -38659
11264 -161321 33625 141488 53596 -388136 131754 -108069 -234952 -4344 200699 154574
11254 154574 50187 208511 -106167 -336536 60754 110707 -124148 87317 -51752 -276102
11244 -276102 145639 -371955 -331790 6383 6541 -238963 191903 -12792 189514 59126 -78618
11232 -239059 -249530 -194049 116893 277332 -546466 -447455 -222466 -182065 -236312 -218122 -232460
11221 -232460 -248205 20329 -15258 35542 110682 -41198 -122357 -295632 -2554 -288478 -84320
11209 -223252 -3301 -10885 -280499 -48966 228140 -91464 84646 -407579 -76801 27326 -80794
$$ packed form
11287E6967J8890a76470e6644j05168N3165F4451q764a9641j31955C4710K8873
11276F3583J4237c08477G6352c06978I0375a74985q821J7215k08976J68207c8659
11264a61321C3625J07863E3596c88136A31754a08069j26883d344B00699m6125
11254A54574E0187J58324a06167k30369F0754M9953a24148H7317e1752k24350
11244b76102A45639c71955M0165F383J58b38963A91903a2792A89514E9126g8618
11232b39059j0471N5481A16893J60439e46466R9011b22466M0401n4247J8190j4338
11221b32460j5745B0329a5258C5542P5140d1198q1159j73275b554k85924h4320
11209b23252c301p584k69614d8966B28140i1464H4646d07579g6801B7326h0794
$$ plain form
11197 -307092 203823 -94120 105030 -253289 -17451 254280 21931 -8573 91067 18370 -21528
11185 173118 -16784 -107887 159704 -164157 68693 119614 110376 19888 -71418 19530 -120589
11173 40475 -315926 -6575 179290 -223173 -308201 -152491 816 51170 39317 -9688 -223006
11162 -223006 -256443 -97215 155405 -116300 -141774 -33991 15283 118166 -402777 -111328
11151 152801 102013 56 -254278 -237575 -129642 -146333 -207727 -268531 -238 158927 203885 -227269
11138 -80501 -277565 -94439 -220186 -71143 77319 -203930 -84436 -52133 -177627 265493 -30392
11126 -126266 168639 102456 149692 51574 -403394 -14454 -119596 53552 -93073 55227 -124986
11114 43707 16098 200917 109125 184394 212110 68764 -275079 276536 107322 213191 -176007
$$ packed form
11197c07092B03823i4120A05030b53289a7451B54280B1931h573I1067A8370b1528
11185A73118a6784r1103A59704a64157F8693N0921r238A9888g1418A9530a20589
11173D0475c15926f575A79290b23173q5028a52491H16N0354j1853i688k13318
11162b23006l3437i7215A55405a16300k5474c3991A5283J02883d02777a11328
11151A52801n0788E6b54278J6703J07933j6691o1394o0804b38A58927M4958b27269
11138h0501j97064i4439j25747g1143G7319b03930h4436L2303j25494B65493c0392
11126a26266A68639o6183M7236E1574d03394a4454j05142E3552i3073E5227a24986
11114D3707A6098J84819r1792P5269K7716F8764b75079B76536A07322J05869a76007
$$ plain form
11102 226694 182897 27756 -75283 141468 15515 -99857 -192809 162277 52599 -148253 20623
11090 149161 51643 -114681 318671 103645 252212 -15387 102188 -51317 -209736 330444
11079 60393 278351 -16879 165108 126780 285298 196915 581057 158118 110335 125529 131404
11068 131404 238270 -85221 450649 224551 173992 204994 214837 58020 142054 -33656 -21087
11057 -21087 -68412 116947 251951 284384 187093 212967 281566 354283 358953 373484 211398
11046 211398 -46011 365072 139777 306123 319724 364532 231017 522697 197826 474078
11036 474078 353039 795598 462322 442823 690812 320763 262349 858040 386200 768749
11026 768749 -1017 525842 529966 821543 660381 435584 318832 472009 461116 385262 893873
$$ packed form
11102B26694m3797B7756g5283A41468A5515i9857r2952A62277E2599a48253B0623
11090A49161E1643a14681C18671A03645J48567a5387A02188e1317j58419C30444
11079F0393K17958a6879A65108l8328J58518q8383L84142A58118m7783J5194N875
11068A31404J06866h5221D50649B24551n0559L1002R843E8020Q4034c3656J2569
11057b1087m7325A16947J35004L2433r7291K5874O8599P2717M670J4531j62086
11046B11398d6011C65072A39777J66346J3601M4808j33515K91680A97826K76252
11036D74078j21039M42559l33276j9499K47989C20763n8414N95691C86200L82549
11026G68749a017E25842M124K91577j61162k24797j16752J53177j0893p5854N08611
$$ plain form
11015 893873 622344 427640 452536 669057 311920 584190 440139 463850 522303 535049
11005 535049 395032 459528 297535 491840 592623 448529 195496 336318 497636 130463
10994 136092 321704 553410 645924 313930 561180 258136 393523 306448 398599 291819
10984 291819 548495 431303 532675 435759 525468 283184 507836 526120 613842 700924
10974 700924 800283 649990 618902 716129 420112 830188 423910 731669 522054 1100389
10964 1100389 537319 581681 1096661 1277454 1070032 1545115 1287448 1286297 1754640 1973571
10954 1973571 1834036 2118429 1855285 1773052 1607872 1944526 1675869 1568552 1408780 1669625
10944 1669625 1299705 1317415 1149803 1315807 1230621 1540306 1597860 1221767 1163493 1329953
$$ packed form
11015H93873k71529j94704K4896K16521C11920K72270j44051K3711N8453J2746
11005E35049j40017O4496j61993J94305J00783j44094A95496J40822J61318A30463
10994A36092J85612K31706R2514C13930K47250B58136J35387q7075R2151j06780
10984B91819K56676j17192J01372r6916Q9709k42284K24652J8284Q7722Q7082
10974G00924R9359j50293l1088R7227k96017M10076m06278L07759k09615N78335
10964A100389E37319M4362N14980J80793k07422M75083k57667j151M68343K18931
10954A973571j39535K84393k63144q2233j65180L36654k68657j07317j59772K60845
10944A669625l69920J7710j67612J66004q5186L09685N7554l76093n8274J66460
$$ plain form
10934 1329953 1292494 816070 968491 726068 545898 1010407 719151 379459 609555 174662
10923 97207 179641 28074 279100 69546 -216500 152223 148039 -45820 243083 -28675 54339
10911 -129207 -40803 -98889 -486635 272087 -80243 48832 64135 377008 19388 -311803 -248651
10900 -248651 80456 -223862 221484 -144119 -100175 16191 -46358 -97350 -43154 360452 -116946
10888 121576 -116447 -45573 -217753 194202 109364 -49297 -77696 139178 -104122 126777
10877 -51317 -225362 -145002 -23981 -35912 313705 -28212 84959 -223179 247841 67909 165850
10866 165850 -344641 -379299 -79215 294579 14477 14461 -135952 102325 -318822 -196159 -15956
10854 -29352 114030 -210724 -123542 40512 -164256 287886 73585 308862 -98423 197074
$$ packed form
10934A329953l7459m76424J52421k42423j80170M64509k91256l39692K30096A74662
10923I7207Q2434B8074K51026F9546b16500A52223m184d5820B43083b8675E4339
10911a29207d0803n8086l87746B72087h0243D8832J5303L12873A9388c11803O3152
10900b48651H0456b23862B21484a44119M3944A6191d6358n0992d3154C60452a16946
10888A21576a16447d5573j72180A94202q4838d9297k8399A39178a04122A26777
10877e1317j74045Q0360b3981j1931C13705b8212H4959b23179B47841F7909R7941
10866A65850c44641l4658g9215B94579A4477j6a35952A02325c18822J22663a5956
10854b9352A14030b10724Q7182D0512a64256B87886G3585K35277i8423A97074
$$ plain form
10843 77397 -213515 84571 -93522 178696 -169086 56242 161914 -86628 135732 -258273
10832 84656 -318131 -356603 289253 19333 58047 -104076 176835 -21157 110090 -416433
10821 -35203 47152 421143 296580 -236126 -236300 91608 -40377 -122464 -240907 -166121 12651
10809 122116 32836 25996 -404725 30750 -84646 -131286 41000 -71347 142187 -91430 46810
10797 -211845 -192776 -247113 -9529 -295870 -293657 -73224 284186 -37439 -41225 -194442 52763
10785 36890 218982 529703 119589 -128053 50466 116166 -56746 170877 -59082 184563
10774 -270872 -133721 -51622 -99265 49845 -57464 222251 74145 -55273 -4861 -102783 -241158
10763 -241158 517960 -275696 60382 -253194 -157019 -38883 -148866 -36999 -77061 101872
$$ packed form
10843G7397b13515H4571i3522A78696a69086E6242J05672h6628A35732b58273
10832H4656c18131l8472B89253A9333L8714a04076A76835b1157A10090d16433
10821c5203D7152L73991j24563b36126j74I1608d0377q2087j18443P4786A2651
10809A22116C2836o840d04725C0750h4646m6640D1000g1347A42187i1430D6810
10797b11845J9069n4337i529k86341K213g3224B84186c7439l786j53217E2763
10785C6890J82092L10721A19589a28053E0466O5700e6746A70877e9082A84563
10774b70872a33721e1622m7643D9845e7464B22251G4145e5273d861r7922j38375
10763b41158E17960b75696F0382b53194R6175c8883j09983c6999m0062A01872
$$ plain form
10752 -139189 -176908 -526365 74895 90295 -31739 -170002 -365034 -488299 -117406 81251
10741 230799 223016 -57736 -184997 -18993 -3512 -136670 -150810 -89187 -222228 112941 -77303
10729 -159647 -133259 -103161 -133081 91526 52948 -46565 -53078 149368 -303043 41299 -332496
10717 -229027 19617 -7128 -306199 58017 79797 83590 324015 -245351 135877 46693 -290885
10705 -67641 142094 87008 -241897 -169494 71522 -356724 -232821 -54192 -208136 -249063 23658
10693 -188170 -235229 126943 -234791 -122414 -147648 30747 -63346 -138071 137786 128030 -522104
10681 -49288 -52798 123560 -83073 168144 82781 -336199 36121 -242219 -161466 229137 -159987
10669 -73934 -87786 232140 -198529 47699 -101895 -152349 -215413 -203330 -29752 -144281 -33414
$$ packed form
10752a39189l7719l49457G4895J5400c1739j38263j95032j23265a17406H1251
10741B30799p783e7736j27261a8993c512j33158j4140O1623j33041A12941g7303
10729a59647K6388L0098k9920I1526l8578d6565o513A49368c03043D1299c32496
10717b29027A9617g128k99071E8017K1780L793K40425b45351A35877D6693b90885
10705f7641A42094n5086b41897P2403G1522c56724J23903e4192j53944m0927B3658
10693a88170m7059A26943b34791J12377k5234C0747f3346p4725A37786r756e22104
10681d9288l510A23560h3073A68144H2781c36199C6121b42219Q0753B29137a59987
10669g3934j3852B32140a98529D7699a01895n0454o3064J2083b9752j14529c3414
$$ plain form
10657 -54468 161488 100276 -102359 -191088 28425 -64476 -237680 -157052 -71889 -153595 29618
10645 194328 179778 -22653 -197752 -221766 -278718 -215780 183195 7448 -342537 31114 -18904
10633 272 29491 -34280 246734 -228033 92100 62789 392615 -111822 78373 -485345 -171130
10621 -435833 88771 68069 -208240 -181993 -56455 228130 94189 -175329 -243271 -123194 -387189
10610 -387189 94312 -271971 -126796 70942 -78766 214554 62627 -379603 -15016 -205053
10600 -205053 182696 95370 -403052 -146379 -200745 -69804 1314 -216628 -238646 326558 8335
10588 -301028 4700 -43699 252480 -403085 -322194 35595 -41886 -243615 -88618 164821 -219932
10576 245074 84701 -519957 -320808 214550 53324 36991 103692 -205988 -186206 -272891 -7176
$$ packed form
10657e4468A61488o1212a02359q8729B8425f4476j73204Q0628g1889q1706B9618
10645A94328j4550b2653j75099k4014n6952O2938A83195G448c42537C1114a8904
10633B72K9219c4280B46734b28033I2100k9311L29826a11822G8373d85345a71130
10621d35833H8771k0702b08240K6247e6455B28130I4189a75329o7942J20077k63995
10610c87189I4312b71971a26796G0942g8766B14554F2627c79603a5016j90037
10600b05053A82696q7326d03052a46379n4366f9804A314b16628k2018C26558H335
10588c01028D700d3699B52480d03085Q0891C5595d1886k01729h8618A64821b19932
10576B45074H4701e19957J99149B14550E3324j6333O6701b05988J9782q6685g176
$$ plain form
10564 127647 -234668 98144 -31847 6949 -117022 124640 -114618 -312227 -5907 23633 64678
10553 64678 147911 -52437 123895 -113856 92004 133776 219572 -58444 223979 -337555 -29257
10541 -13978 39665 84209 -275859 124609 -167176 -20507 5474 -137749 -99051 -91924 6055
10529 185525 -97976 -191832 -131268 185918 -306267 88849 -54040 283092 -239790 49437 -24290
10517 229961 -123047 100202 -40517 -269228 -138410 -11195 7293 234527 102601 202095
10507 202095 -253614 -108856 -336403 -161232 -238433 21869 69751 117029 -190895 -163375
10497 -163375 8624 85799 310086 -283844 -300025 76332 -131216 -228939 46168 260146 -190988
10485 -362402 91890 -95370 119538 -205063 -66879 50176 -171296 -192477 -116701 115482 -255037
$$ packed form
10564A27647b34668I8144c1847F949a17022A24640a14618j97609e907B3633M1045
10553F4678Q3233e2437A23895a13856I2004M1772Q5796e8444B23979c37555b9257
10541a3978C9665M4544b75859A24609a67176b0507E474a37749L8698P127F055
10529A85525i7976r3856O0564A85918c06267H8849e4040B83092b39790D9437b4290
10517B29961a23047A00202d0517k28711J30818a1195G293K27234A02601R9494
10507B02095b53614a08856k27547a61232p7201B1869M7882M7278a90895K7520
10497a63375H624P7175K24287b83844j6181G6332a31216r7723D6168K13978a90988
10485c62402I1890i5370A19538b05063f6879E0176a71296k1181P5776A15482b55037
$$ plain form
10473 -345498 -9042 -168805 46822 140829 -131103 31965 -142460 -58427 219036 294205 4215
10461 295254 290399 144391 193207 300463 157616 209128 130128 1519 77134 148109 -115833
10449 -342787 25326 20982 -131483 15844 123084 -37852 -321779 203025 76468 -139743 2709
10437 146110 128486 -396028 45958 10703 338737 -192130 99588 -95575 -157842 -249511 -158164
10426 -158164 223398 -7829 6361 77332 -431322 -216808 81727 137207 -123390 48361 -75575
10414 -155462 81295 -65761 -179764 303570 42982 42537 -152045 -67581 153927 193904 -75431
10402 93923 -25930 -66028 -238594 -213934 114156 39216 -138167 -134951 -201175 33597 -157811
10390 219865 -16578 -39048 -295715 -274808 88387 -14761 -591 94684 -70533 -24196 9980 110368
$$ packed form
10473c45498i042j59763D6822R4007a31103C1965a42460e8427B19036P5169D215
10461B95254m855A44391M8816J07256j42847N1512p9000A519P5615P0975a15833
10449c42787B5326m344a31483A5844J07240c7852k83927B03025G6468a39743B709
10437A46110j7624c96028D5958A0703L28034a92130I9588i5575o2267r1669R1347
10426a58164B23398g829F361P0971d31322K14514H1727N5480a23390D8361g5575
10414a55462H1295f5761j14003C03570D2982m45a52045f7581A53927L9977g5431
10402I3923b5930m0098j72566K4660A14156C9216a38167L216o6224C3597a57811
10390B19865a6578k2470k56667K0907H8387a4761e91I4684g0533b4196I980J00388
$$ plain form
10378 110368 -5633 -28213 -230015 118590 -99432 153432 -55621 -47391 11748 -163397 -140460
10367 -140460 -261114 -193593 -64167 209010 -43258 -74200 120082 130197 -141875 184283
10356 -24269 214649 345060 174189 -109827 -130165 113022 323290 198298 334013 31651
10345 556010 251279 -110387 177592 -10045 233465 -69029 69918 313265 86342 307480
10335 307480 95901 254425 343676 317532 745736 236776 525281 37407 304221 471923
10325 471923 161898 554213 305056 281051 23372 206708 -166905 229599 295053 137426
10314 210619 72460 141592 -190116 195586 -206856 118051 56971 53075 -104337 -25613 29055
10302 168977 44701 -36009 121077 -20252 163377 -112 185670 184759 -291677 264807 -18018
$$ packed form
10378A10368e633k2580k01802A18590i9432A53432e5621Q230A1748a63397K2937
10367a40460j20654O7521f4167B09010d3258l0942A20082J0115a41875A84283
10356b4269B14649J30411j70871a09827k0338A13022K10268j24992J35715C1651
10345E56010B51279a10387A77592a0045B33465f9029F9918K43347H6342K21138
10335C07480I5901J58524Q9251k6144M28204B36776K88505C7407K66814J67702
10325D71923A61898L92315k49157k4005B3372J83336a66905B29599O5454A37426
10314B10619G2460O9132a90116A95586b06856A18051E6971l896a04337b5613B9055
10302A68977D4701c6009A21077b0252A63377a12A85670r11b91677B64807a8018
$$ plain form
10290 116395 1824 46497 224575 255579 -225057 -144153 66495 269506 -416684 -132050 -62276
10278 63228 -342291 -220614 44218 -343055 -163270 -18212 52094 83027 146874 -11484 -30331
10267 -30331 243423 171871 -107971 66606 27962 -90091 39053 -90674 -34099 346469 45842
10255 -279792 -302862 -184164 38334 -350193 -96020 -333609 -126858 146499 -23862 47212
10244 -181912 -115156 15774 -11669 25862 120733 212420 316831 117774 62442 517196 -41193
10232 30490 59994 72675 281491 145450 -95203 -204472 -101995 -32344 239872 287114 -210999
10220 -317384 -41164 -316477 -186311 -114841 126899 -104171 -46190 -59804 26162 -20523 -25039
10209 -25039 -15950 160657 -104167 -3675 -142348 98322 -243574 -81598 -127726 -15963 30774
$$ packed form
10290A16395A824M4673J78078L1004b25057Q0904F6495K03011d16684a32050f2276
10278F3228c42291J21677D4218c43055a63270a8212E2094L0933O3847a1484j8847
10267c0331B43423p1552a07971F6606B7962i0091C9053i0674c4099C46469D5842
10255b79792k3070J18698C8334c50193i6020k37589a26858A46499b3862D7212
10244a81912O6756A5774a1669B5862R4871R1687J04411A17774n5332M54754d1193
10232C0490K9504J2681K08816j36041i5203j09269a01995c2344B39872M7242b10999
10220c17384d1164k75313J30166P1470A26899a04171d6190j3614B6162b0523m516
10209b5039R089A60657a04167c675j38673I8322b43574h1598m6128a5963C0774
$$ plain form
10197 111319 -152965 -122577 -289597 -84758 -81066 104170 -185309 -25568 72861 3745 122947
10186 122947 -28666 -77238 -210035 -70991 33229 -121488 38270 -120463 -25564 -11449 -140667
10175 -140667 144047 -13203 -44009 -379375 180095 -109501 -275041 -238523 178012 -103651
10164 -187557 -274542 -89652 105114 -96644 -126565 -230325 -57402 -203152 -263093 -83301 -40110
10152 -66512 -219378 -141120 132274 -125910 78089 -281380 -35654 -118597 113327 -120098
10141 -244973 -117166 -313394 -47254 81857 -111925 -182530 -75930 -162809 24423 -150445 -155198
10130 -155198 -210050 81853 -133525 -198268 -46952 -210637 -151612 -76604 8447 223994 -184071
10118 202240 24584 259353 34991 109954 -241034 -266755 46720 -100985 217410 -24467 -379587
$$ packed form
10197A11319a52965L0388j67020h4758L692A04170a85309b5568G2861C745J19202
10186A22947b8666m8572j32797g0991C3229a21488C8270a20463b5564a1449j29218
10175a40667A44047a3203l0806l35366A80095a09501j65540L6518A78012a03651
10164a87557q6985h9652A05114i6644k9921j03760e7402j45750n9941h3301d0110
10152f6512j52866P8258A32274a25910G8089b81380c5654q2943A13327a20098
10141b44973a17166j96228d7254H1857a11925p0605g5930q6879B4423a50445m753
10130a55198n4852H1853a33525o4743d6952j63685N9025P5008H447K15547a84071
10118B02240B4584K34769C4991P4963b41034k5721D6720a00985B17410b4467l55120
$$ plain form
10107 -379587 -268182 10343 -78207 -536168 -17277 24907 -122283 114757 40069 -86992 -54259
10096 -54259 -353668 70433 -67472 185099 205676 -282131 142211 -142769 78065 -59545 -285823
10085 -285823 -162542 25622 -10390 -215410 -375783 -449948 -142864 -218749 -269336 -206626 -217677
10074 -217677 -18801 -176315 -42147 -95612 -189653 -217669 -56503 -56450 57276 -199281 264127
10062 17812 -23599 -77732 55713 -16399 61763 -45138 -55812 93200 95379 -272149 102988
10050 211762 -211625 -142405 -7348 -46708 -408064 26638 -316007 -181883 -26121 101236 -92534
10038 173627 -35342 31705 -25395 -265770 -103359 -164625 -135033 -131967 -126222 90265 -266978
10026 94686 -37407 152358 137545 -427489 -135970 -316324 17795 -233510 -102463 -427666
$$ packed form
10107c79587J11405A0343g8207m57961a7277B4907a22283A14757D0069h6992L2733
10096e4259k99409G0433f7472A85099K0577b82131A42211a42769G8065e9545k26278
10085b85823J23281B5622a0390k05020j60373p4165a42864p5885n0587O2710j1051
10074b17677a8801j57514d2147n3465r4041k8016e6503N3E7276a99281B64127
10062A7812b3599n4133E5713a6399F1763d5138j0674I3200K179b72149A02988
10050B11762b11625O9220g348l9360l61356B6638c16007J34124b6121A01236i2534
10038A73627c5342C1705b5395k40375a03359o1266K9592L066N745I0265b66978
10026I4686c7407A52358j4813d27489a35970j80354A7795b33510a02463l25203
$$ plain form
10016 -427666 -87950 -303365 -50851 142178 -274780 -71361 -242613 -75122 346076 -142557
10005 -204183 -332198 -182419 166378 103085 31166 -287450 -123716 -93422 -370022 -93828
9994 -81769 34503 -151789 -69217 -166385 -201534 55177 99281 -170809 141589 -123070 -149433
9983 -149433 5028 -478590 -152823 -134696 16726 -113531 -270662 -128939 36920 121439 185276
9972 185276 -183391 -62628 -87835 197677 183014 -27648 51171 -347755 -71850 114024 -155072
9960 -17953 20325 -128423 -23171 109130 -43648 -163197 92397 -13419 174195 -219527 14292
9948 -149359 -112535 143557 -46405 -309503 5844 -374111 -183261 -369651 -173460 -312283
9938 -312283 15958 19674 -55849 -179704 157642 130028 358803 -229591 251435 204079 103090
$$ packed form
10016d27666h7950k15415e0851A42178b74780g1361j71252g5122C46076a42557
10005b04183j28015J49779A66378o3293C1166b87450a23716L0294k76600i3828
9994h1769C4503a51789f9217r7168l5149E5177M4104a70809A41589a23070k6363
9983a49433E028d78590a52823J8127A6726a13531j57131a28939C6920Q4519O3837
9972A85276a83391f2628k5207A97677j4663b7648E1171c47755g1850A14024a55072
9960a7953B0325a28423b3171A09130d3648j19549I2397a3419A74195b19527A4292
9948a49359L6824A43557d6405k63098E844c74111a83261j86390a73460j38823
9938c12283A5958L716e5849j23855A57642k7614K28775b29591B51435m7356j00989
$$ plain form
9927 103090 -257576 99747 -246493 -345865 -103225 -129985 9527 -208520 221508 104295 226731
9916 226731 -203951 -58773 -133380 -107861 94013 73817 169500 -88316 -1554 11378 187388
9905 187388 -187584 10363 126216 -86292 15693 -193482 274619 -143517 232142 -40512
9894 -277420 -259842 -176546 62380 -296113 -209389 -138273 -81844 -227465 37694 -112337 -13267
9882 -30815 75817 -137719 -94537 29559 36353 274927 -31680 62970 -64839 58730 -202921
9870 -60593 -12023 -58214 87952 -95013 460966 -94045 -99830 179855 96591 -170975 21214
9858 48126 -150806 -208855 -27901 -120324 -262748 163346 138915 -388971 12678 47778 -72364
9846 -30126 49370 -196961 128257 -51445 157968 -10879 -98619 11126 -149072 -135615 -255710
$$ packed form
9927A03090b57576I9747b46493r9372a03225k6760I527b08520B21508A04295J22436
9916B26731b03951e8773p4607K5519I4013k0196R5683h8316a554A1378J76010
9905A87388a87584A0363J15853h6292A5693a93482B74619a43517B32142d0512
9894b77420J7578Q3296F2380b96113Q6724P1116N6429j45621C7694a12337a3267
9882c0815G5817a37719M3182B9559O794K38574c1680F2970f4839E8730b02921
9870f0593a2023m6191H7952i5013D60966i4045n785A79855q3264a70975B1214
9858D8126a50806n8049b7901r2423j42424A63346k4431c88971A2678L5100g2364
9846c0126D9370a96961A28257e1445A57968a0879q7740A1126a49072J3457j20095
$$ plain form
9835 -255710 -167798 -221448 23006 -63521 59016 100081 -250744 -393862 116891 -184320 -255033
9824 -255033 -268486 -253736 30917 -25737 -82115 -56958 -189434 -217528 -174947 -138220 -306604
9813 -306604 62521 88927 -200820 -127845 -280765 -131485 -171592 -26184 50336 -155979 81864
9801 -67300 34093 -287370 -56376 -102245 -424827 22524 -473423 27478 45585 -218304 -11460
9789 -155746 -346057 -207999 -295682 -53344 22061 80443 42911 92159 -110883 -440490 107797
9777 -76492 60468 -97745 -84413 74514 -40099 168250 169120 -204184 -287737 -207798 426461 -144474
9764 101769 -389716 74269 215953 -82457 67264 -103561 -212621 43477 -66125 1394 -75373
9752 156740 28558 -274804 -139270 -328436 -304562 -289948 173117 -468105 160402 73130
$$ packed form
9835b55710Q7912n3650B3006f3521E9016M1065b50744j43118A16891a84320p0713
9824b55033j3453J4750C0917b5737n6378K5157j32476k8094M2581L6727j68384
9813c06604F2521K6406b00820P2975j52920a31485m0107b6184E0336a55979H1864
9801f7300C4093b87370e6376m5869l22582B2524d73423B7478J8107b18304a1460
9789a55746j90311J38058q7683e3344B2061N8382l7532M9248a10883l29607A07797
9777g6492F0468i7745J3332G4514d0099A68250Q70b04184q3553P9939D26461a44474
9764A01769c89716G4269J41684h2457F7264a03561j09060D3477f6125A394g5373
9752A56740B8558b74804J35534j89166K3874J4614A73117d68105A60402G3130
$$ plain form
9741 -187035 218795 8414 117365 -229688 -57688 -234820 60924 61558 31771 60246 -73403
9729 216356 24025 -32469 -4357 -150565 -16815 -193464 -78641 128850 -82720 -266805 195438
9717 125416 26277 -230382 -564688 -129179 -38885 -297365 -242897 -77126 81453 -296183 -53618
9705 -109149 91654 -423500 292076 -344048 -365545 -178505 119990 -118180 137377 -233958
9694 -274738 -259280 -257874 70716 -86289 -162149 -254545 213723 187541 181970 -144684 -79506 -165712
9682 -165712 13943 -172720 -287716 17579 193698 -50422 352383 -405961 -217284 235360
9671 -53789 -222065 -34681 -171242 -47908 -257838 22887 -145285 -130072 -295817 -501987 -140610
9659 -63556 -399476 -54815 -137078 26073 -115928 -74422 182306 35497 -29975 -355978 -58586
$$ packed form
9741a87035B18795H414J08951b29688e7688j77132F0924O34k9787K8475g3403
9729B16356B4025c2469d357j46208a6815j76649g8641A28850h2720j84085A95438
9717A25416B6277b30382l34306a29179c8885k58480N4468g7126H1453b96183e3618
9705a09149I1654d23500B92076c44048k1497a78505A19990a18180A37377b33958
9694b74738J5458J406G0716h6289p5860r2396B13723k6182n571a44684O5178q6206
9682a65712A3943a72720j14996A7579J76119e0422C52383d05961J88677B35360
9671e3789j68276c4681j36561d7908k09930B2887a45285J5213j65745k06170a40610
9659f3556l35920e4815q2263B6073a15928M1506A82306C5497b9975l26003e8586
$$ plain form
9647 325607 -55309 -128151 -149263 -275949 -65359 -278832 240305 -264316 24542 149486 -49436
9635 -93472 57109 149150 295941 -161204 -165629 42420 143620 19599 90189 -321804 164805
9623 142700 293712 -156387 -71473 889 -401972 91959 -19151 -30708 79043 -342453 16455
9611 -108588 -148791 -147644 41095 -54483 78939 -174376 -79816 94690 -48617 3400 -104772 -134004
9599 -134004 -124138 -213931 -71513 -177802 -110066 -50538 -293838 -105176 326588 -103844 325366
9587 -83859 224325 935 -184655 47823 229875 -196186 -262533 153689 21288 -130693 1825
9575 -225553 -408518 -174536 -222929 -305443 57304 -210188 -88010 -131672 -177314 155171 -21034
9563 -59522 -19247 -36305 -127480 -136631 -317166 95080 -161327 -237263 -185691 -404073 -224528
$$ packed form
9647C25607e5309p2842k1112j26686f5359k13473B40305b64316B4542J24944d9436
9635i3472E7109R2041J46791a61204m425D2420J01200A9599P0590c21804A64805
9623A42700J51012a56387g1473H89d01972I1959a9151j1557G9043c42453A6455
9611a08588m0203J147D1095e4483G8939a74376g9816I4690d8617C400a04772k9232
9599a34004R866q9793g1513j06289O7736e0538k43300a05176C26588a03844C25366
9587h3859B24325I35a84655D7823J82052a96186o6347A53689B1288a30693A825
9575b25553j82965a74536m8393q2514E7304b10188h8010m3662m5642A55171b1034
9563e9522a9247j7058r1175r151j80535I5080a61327p5936N1572k18382J79545
$$ plain form
9552 -224528 -199330 -30735 -286137 15541 224710 -85156 -70174 -151984 -175423 -81528 53201
9540 310427 -134146 -108604 -260963 39704 -19581 -48080 -119627 -35680 34249 61312 106973
9529 106973 -80540 180849 3948 -229401 -211717 97652 -178207 59720 -105673 -114868 -83549
9518 -83549 -15414 218970 -158718 -431827 -11347 62272 -183095 325918 -98477 -137051 334545
9506 156480 117446 -80572 -223786 122166 68274 -47695 6595 -110286 -177353 -361776 -144906
9494 -342983 -90536 71398 -332368 -199535 -111596 -384073 202537 -254887 2429 150831 25309
9482 61735 13643 -169432 51459 -17800 -107542 -231178 -357179 186245 9545 -89776 44431
9470 33983 241216 -142201 -115502 165053 -39405 14169 -74188 -7194 -238028 67006 -176605
$$ packed form
9552b24528K5198c0735k55402A5541K09169h5156J4982q1810k3439h1528E3201
9540C10427a34146K5542j52359C9704a9581k8499p1547c5680C4249K7063M5661
9529A06973h0540A80849C948b29401J7684I7652a78207E9720a05673r195L1319
9518h3549a5414B18970a58718k73109a1347F2272a83095C25918i8477l8574C34545
9506A56480l9034h0572j43214A22166n3892d7695F595a10286o7067j84423a44906
9494c42983i0536G1398c32368J32833Q7939k72477B02537b54887B429J48402B5309
9482F1735A3643a69432E1459a7800q9742j23636j26001A86245I545h9776D4431
9470C3983K07233a42201K6699A65053c9405A4169g4188g194k30834F7006a76605
$$ plain form
9458 -70671 -270472 -88094 22015 112813 -69231 -43447 -367020 -73444 138968 -578073 -185875
9446 -311849 -155370 15293 -244763 109859 -114556 175338 52396 -273928 -189821 -8543 -29472
9435 -29472 -16767 -28495 46518 22120 -81581 -57920 -266289 -197424 -257032 -69739 115653
9423 79809 -116663 -96434 39703 165848 -32972 -613 45814 -198358 182003 -97013 -43271
9411 -122240 19834 -237408 11898 -236162 -209714 75568 88543 275080 -207498 -55090 -191004
9400 -191004 82319 -449571 209570 -401824 -133979 -130602 -143583 -174919 25833 182303 -202117
9388 -237765 8306 161710 -171342 -205846 180744 -104957 -504949 -84187 183429 -80594 59977
9376 -182785 765 5950 -247559 -510190 248634 -376111 -331717 -36164 -215202 143328 -390754
$$ packed form
9458g0671j99801h8094B2015R0798f9231K5784l23573g3444A38968e78073a85875
9446c11849a55370A5293b44763A09859a14556A75338E2396b73928Q4107h543k0929
9435b9472J2705j1728D6518B2120h1581K3661k08369O8865n9608f9739A15653
9423G9809a16663K0229C9703J26145c2972f13D5814a98358A82003i7013d3271
9411a22240A9834b37408A1898b36162K6448G5568J2975J86537b07498e5090j35914
9400a91004H2319d49571B09570d01824a33979L377j2981l1336B5833J56470b02117
9388b37765H306J53404a71342l4504A80744a04957l99992h4187A83429h0594E9977
9376a82785G65N185b47559k62631B48634c76111M4394c6164j79038A43328c90754
$$ plain form
9364 -113976 -32819 -103626 -392002 -92820 246029 -121833 122651 -96396 252712 24734 94853
9353 94853 149455 -68774 -29877 -11942 -86544 -37004 -148364 -137326 -199589 41724 33092 -23494
9340 49645 142950 74413 163291 51484 -144092 16525 -116064 -138427 -173619 -283324 31644
9328 59814 28184 -412026 99627 21083 222919 -41172 -307842 -181698 -180469 56189 19387
9316 -310382 -5459 65106 -140617 133190 -39963 74996 -367564 -89264 -86702 -163447 -197696
9305 -197696 -149665 -28446 74654 2249 89323 -280428 -139774 -28751 -48086 -112677 205307
9293 -48102 -205542 848 19147 -95011 -104586 -165622 58610 -265485 -208518 62485 -69207 -468322
9281 -468322 -12050 -150487 -56947 -34975 -196832 -139782 -64110 -75600 -213751 -139396 56206
$$ packed form
9364a13976c2819p0807k88376i2820B46029a21833A22651i6396B52712B4734P0119
9353I4853N4602f8774b9877a1942p4602c7004j11360J1038o2263D1724q632b3494
9340D9645R3305o8537Q8878E1484a44092A6525a16064k2363l5192j09705C1644
9328E9814B8184d12026I9627B1083K01836d1172k66670J26144J229E6189A9387
9316c10382e459F5106a40617A33190c9963G4996c67564h9264K562p6745l4249
9305a97696M8031b8446G4654B249Q7074b80428a39774b8751j9335o4591B05307
9293d8102j57440H48J8299i5011r575o1036E8610b65485N6967F2485f9207l99115
9281d68322a2050j38437e6947K1972j61857N7050f4110j1490j38151P4355E6206
$$ plain form
9269 -75206 35587 439323 -101941 -18604 142617 -71218 37056 -125964 183495 19824 -189056
9257 -162531 -337019 113300 -321939 -216721 18692 84843 69457 -111770 -294841 -152861
9247 -152861 189264 14664 -41231 -269712 37630 -194948 -230826 119629 99840 234712 -321540
9235 -33285 -55664 -32009 -260549 123130 -115161 -268288 85226 59404 -354502 -158363 255450
9223 123317 -444639 78885 -258182 -10971 -77116 -91583 -105609 406559 -98287 -414578 -46763
9211 -138095 -141520 -80617 26311 -112623 -87122 -231441 -106028 87186 -37276 -39523 93834
9199 -60409 -41888 -43878 -87615 -267571 -171466 -412964 -47208 45957 -138632 199167 -45192
9187 55198 47114 -232128 -140944 32582 -18897 -214185 141819 -65528 -357555 -220446 77085
$$ packed form
9269g5206C5587M03736a01941a8604A42617g1218C7056a25964A83495A9824a89056
9257a62531j74488A13300c21939J05218A8692O6151j5386a11770j83071J41980
9247a52861A89264A4664d1231k28481C7630a94948l5878A19629j9789J34872c21540
9235c3285k2379K3655k28540A23130a15161j53127H5226k5822c54502a58363B55450
9223A23317d44639G8885b58182a0971o6145j4467j4026D06559i8287l16291d6763
9211a38095l425O0903B6311a12623K5501j44319a06028H7186c7276k247I3834
9199f0409J8521j990m3737j79956R6105k41498d7208D5957a38632A99167d5192
9187E5198q084b32128R1184C2582a8897j95288A41819f5528k92027J37109G7085
$$ plain form
9175 -204700 46086 -108926 -209640 72987 -50157 -133544 -87617 -8386 169819 86529 3899
9163 -135857 -326635 210122 -94464 -243488 -125590 -24454 61039 -198494 -44519 -253790
9153 -253790 69666 -242350 -82523 -93969 -29546 20796 106193 162902 -170276 -233924 -241578
9142 -241578 158530 24288 -143234 159248 -34615 -124665 -96076 -44206 -258805 -131612 -228615
9131 -228615 -68712 -50970 271987 -59691 -259571 4046 -14473 18483 -16467 204539 -121157
9119 -184780 -56258 -96781 -26055 -108125 -230626 112404 -152429 -381287 -50174 -265252 -28363
9107 -258702 -121870 -298487 -240801 6206 -80854 155610 100986 329599 -375923 275187 -230850
9095 110454 -77373 45517 -4729 -57140 122025 44533 14760 -101060 -190621 -408420 -89393
$$ packed form
9175b04700D6086a08926j00714G2987e0157q3387M5927h386A69819q3290C899
9163a35857j90778B10122i4464j49024J17898b4454F1039a98494d4519k09271
9153b53790F9666b42350h2523j1446b9546B0796Q5397N6709a70276o3648p654
9142b41578A58530B4288a43234A59248c4615r0050K8589d4206k14599J27193r7003
9131b28615f8712J7742B71987e9691j99880D046a4473A8483a6467B04539a21157
9119a84780e6258m0523b6055q2070j22501A12404a52429k28858e0174k15078b8363
9107b58702a21870j76617N7686F206h0854A55610n4624K28613c75923B75187b30850
9095A10454g7373D5517d729n2411A22025D4533A4760a01060q9561k17799h9393
$$ plain form
9083 -56183 -33229 171301 -210057 20340 67932 -292853 70889 -65804 -229143 224360 -130988
9071 -182569 58919 -142468 129857 317118 -132165 -23845 -405481 -156657 -24750 24583
9060 -24506 -127286 41693 85316 47384 -282458 81600 414462 135690 15492 -151333 -198196
9049 -198196 -152736 -29740 -64079 -91602 -135959 -33580 -177086 187200 -210414 160179 -275955
9037 -298872 110406 -40207 -76858 -126700 9757 -163557 -242250 -27577 -133614 92200 -30635
9025 64157 269099 9921 -71472 -14184 -62201 106572 -113540 -299142 -30517 -38021 -219056
9014 -219056 17397 289237 88489 196396 6441 307681 -12795 -160348 43008 -72606 -119673
9003 -119673 113777 -214243 -229544 117959 -439357 -18418 64546 -54163 149322 -462527
$$ packed form
9083e6183K2954A71301b10057B0340M7592b92853G0889f5804j63339B24360a30988
9071a82569E8919a42468A29857J87261a32165b3845l81636a56657b4750B4583
9060b4506j02780D1693M3623l7932b82458H1600L32862A35690A5492a51333m6863
9049a98196M5460b9740l4339k7523m4357c3580j43506A87200b10414A60179b75955
9037b98872A10406d0207l6651m9842I757a63557p8693b7577j06037I2200c0635
9025F4157K04942I921g1472a4184m8017A06572a13540j85602c0517p504j81035
9014b19056A7397K71840H8489J07907F441L01240a2795j47553D3008g2606m7067
9003a19673A13777b14243j5301A17959d39357a8418F4546e4163A49322d62527
$$ plain form
8992 -343168 -298965 139867 -72492 87982 -99595 -316 140582 328739 -104074 -189801 82764
8980 12119 140387 -46429 32657 220011 -323630 -101660 49647 72252 -4091 -189533 -127743
8969 -127743 -211137 264604 -118001 128705 -235133 -66134 -26200 370691 -20463 146412
8958 -231231 -141915 -542879 160845 4120 127697 75294 493003 -176410 -91477 -22831 -25364
8947 -25364 -816988 35486 -12427 58420 -32601 -237558 -166016 43458 -404053 -245519 367215
8935 243 -209073 282161 20762 -96669 -135808 -182469 51231 32068 -229262 45559 -152110
8923 -70720 -158859 -139424 -125444 95021 -212052 184029 111788 394355 316961 -14782 217982
8911 32808 103300 472150 562725 604229 1068968 1072842 2314177 4303097 7970840 4428849
$$ packed form
8992c43168M4203A39867g2492H7982i9595c16A40582J88157a04074q5727H2764
8980A2119J28268d6429C2657J87354c23630a01660D9647K2605d091j85442O1790
8969a27743q3394B64604a18001A28705b35133f6134b6200C70691b0463A46412
8958b31231Q9316m00964A60845D120J23577n2403M17709a76410Q4933b2831k533
8947b5364p91624C5486a2427E8420c2601k04957P1542D3458d04053J58534C67215
8935B43b09073B82161B0762i6669l9139m6661E1231j9163b29262D5559a52110
8923g0720q8139J9435J3980I5021b12052A84029p2241K82567p7394a4782B17982
8911C2808P0492L68850R0575M1504M64739L874J241335J988920L667743l541991
$$ plain form
8901 4428849 2065680 1073149 582852 640269 358018 98328 357735 100920 14792 -105
8890 406222 89359 76758 473867 -22054 36376 -296816 -51070 -137709 -101743 41964 99499
8879 99499 240162 117667 59233 -249264 -101744 -85475 140475 129235 71458 -220021 207612
8867 23369 -220721 203703 94866 -26068 -506506 308584 -131591 -211278 -7484 -66242 -232959
8856 -232959 -249036 1852 -50067 -215804 36827 24286 -421541 -223991 186754 113769 -11691
8844 -93284 62892 -198243 48937 8487 -237980 131622 -287589 -198294 11424 -42082 -131801
8833 -131801 -88979 90547 51355 -12956 -2459 168526 -251691 -95872 92760 -114888 6421
8821 -358992 -369657 238824 -7071 -148492 -483734 -181961 -42382 -310230 -105229 -160103 -138109
$$ packed form
8901D428849B065680r92531m90297N7417k82251I8328K59407A00920A4792a05
8890D06222H9359j2601L97109b2054C6376b96816e1070q6639L5966D1964N7535
8879I9499J40663A17667n8434b49264a01744J6269A40475j1240n7777b20021B07612
8867B3369b20721B03703I4866b6068m80438C08584a31591p9687g484n8758j66717
8856b32959j6077A852e0067j65737C6827j2541d21541J97550A86754p2985a1691
8844i3284F2892a98243D8937H487b37980A31622b87589Q9295A1424d2082q9719
8833a31801M2822I0547l9192a2956b459A68526b51691i5872I2760a14888F421
8821c58992j0665B38824g071j41421l35242a81961d2382k67848a05229n4874K1994
$$ [...]
##END NTUPLES=NMR SPECTRUM
##END=
