
##TITLE=AC1179_popayan-inza-3-cauca-CINAH1206_5891194_hQcdX3Hi6k
##JCAMPDX= 6.0         $$ Bruker NMR JCAMP-DX V2.0
##DATA TYPE= NMR SPECTRUM
##DATA CLASS= NTUPLES
##ORIGIN= BRUKER
##OWNER= Administrator
$$ 1.72 TOPSPIN		Version 2.1
$$ 2012-04-02 22:22:29.609 -0500  Administrator@TOPSPIN
$$ Compression mode = diff/dup
##.OBSERVE FREQUENCY= 400.13188235
##.OBSERVE NUCLEUS= ^1H
##.ACQUISITION MODE= SIMULTANEOUS (DQD)
##.ACQUISITION SCHEME= undefined
##.AVERAGES= 64
##.DIGITISER RES= 22
##SPECTROMETER/DATA SYSTEM= spect
##.PULSE SEQUENCE= noesygpps1d.comp
##.SOLVENT NAME= COFFEE_meoh
##.SHIFT REFERENCE= INTERNAL, COFFEE_meoh, 1, 14.96842
##AUDIT TRAIL= $$ (NUMBER, WHEN, WHO, WHERE, PROCESS, VERSION, WHAT)
$$ ##TITLE= Audit trail, TOPSPIN		Version 2.1
$$ ##JCAMPDX= 5.01
$$ ##ORIGIN= Bruker BioSpin GmbH
$$ ##OWNER= Administrator
$$ $$ C:\Bruker\TOPSPIN/data/COFFEE/nmr/AC1179_popayan-inza-3-cauca-CINAH1206_5891194_hQcdX3Hi6k/12/pdata/1/auditp.txt
$$ ##AUDIT TRAIL=  $$ (NUMBER, WHEN, WHO, WHERE, PROCESS, VERSION, WHAT)
(   1,<2012-04-02 22:22:23.968 -0500>,<Administrator>,<TOPSPIN>,<go>,<TOPSPIN 2.1>,
      <created by zg
	started at 2012-04-02 22:10:51.750 -0500,
	POWCHK enabled, PULCHK disabled,
       configuration hash MD5:
       1A 1E CE 29 27 FD 77 03 67 4E F0 E3 C4 B2 CB 90
       data hash MD5: 64K
       B3 9F 48 BB 83 85 90 66 AC AB 1B 52 B7 C8 41 E6>)
(   2,<2012-04-02 22:22:27.140 -0500>,<Administrator>,<TOPSPIN>,<proc1d>,<TOPSPIN 2.1>,
      <Start of raw data processing
       efp LB = 0.3 FT_mod = 6 PKNL = 1 PHC0 = 0 PHC1 = 0 SI = 128K 
       data hash MD5: 128K
       A5 9E 0D 73 4B F7 78 85 C2 41 15 FE 55 E3 14 5B>)
(   3,<2012-04-02 22:22:28.656 -0500>,<Administrator>,<TOPSPIN>,<proc1d>,<TOPSPIN 2.1>,
      <pk PHC0 = 32.23938 PHC1 = 0 
       data hash MD5: 128K
       60 60 AE 8C 0E 84 ED 66 92 A2 BE 07 57 24 7C 36>)
(   4,<2012-04-02 22:22:28.968 -0500>,<Administrator>,<TOPSPIN>,<proc1d>,<TOPSPIN 2.1>,
      <abs ABSG = 1 
       data hash MD5: 128K
       FE EC 9E 69 C8 32 CD B8 1F BA 92 E7 71 AD C2 9C>)
(   5,<2012-04-02 22:22:29.109 -0500>,<Administrator>,<TOPSPIN>,<proc1d>,<TOPSPIN 2.1>,
      <abs ABSG = 2 
       data hash MD5: 128K
       E6 4E 47 B8 22 56 8B 08 D4 BC 75 C9 08 69 4D D7>)
(   6,<2012-04-02 22:22:29.359 -0500>,<Administrator>,<TOPSPIN>,<proc1d>,<TOPSPIN 2.1>,
      <abs ABSG = 3 
       data hash MD5: 128K
       CF 82 A4 66 54 A1 FD B1 FB 13 54 40 A8 BE 14 29>)
(   7,<2012-04-02 22:22:29.437 -0500>,<Administrator>,<TOPSPIN>,<proc1d>,<TOPSPIN 2.1>,
      <abs ABSG = 4 
       data hash MD5: 128K
       E5 B3 3D BC 37 38 78 98 E9 EA 54 DC 0E CB 0E E4>)
(   8,<2012-04-02 22:22:29.500 -0500>,<Administrator>,<TOPSPIN>,<proc1d>,<TOPSPIN 2.1>,
      <abs ABSG = 5 
       data hash MD5: 128K
       B8 67 25 95 19 34 21 51 2D E7 FE C8 7F 29 2B 14>)
$$ ##END=
$$ 
$$ $$ hash MD5
$$ $$ 13 16 15 3F 20 06 10 10 06 38 74 C8 92 ED 79 11
##$RELAX= 
##$RELAX= 
##$RELAX= 
##$RELAX= 
##$RELAX= 
##$RELAX= 
##$RELAX= 
$$ [...]
##$TP07= 0
##$TPNAME0= <>
##$TPNAME1= <>
##$TPNAME2= <>
##$TPNAME3= <>
##$TPNAME4= <>
##$TPNAME5= <>
##$TPNAME6= <>
##$TPNAME7= <>
##$TPOAL= (0..7)
0.5 0.5 0.5 0.5 0.5 0.5 0.5 0.5
##$TPOFFS= (0..7)
0 0 0 0 0 0 0 0
##$TUNHIN= 0
##$TUNHOUT= 0
##$TUNXOUT= 0
##$USERA1= <user>
##$USERA2= <user>
##$USERA3= <user>
##$USERA4= <user>
##$USERA5= <user>
##$V9= 5
##$VALIST= <valist>
##$VCLIST= <CCCCCCCCCCCCCCC>
##$VD= 0
##$VDLIST= <DDDDDDDDDDDDDDD>
##$VPLIST= <PPPPPPPPPPPPPPP>
##$VTLIST= <TTTTTTTTTTTTTTT>
##$WBST= 2048
##$WBSW= 25
##$XGAIN= (0..3)
0 0 0 0
##$XL= 0
##$YL= 0
##$YMAX_a= 13456715
##$YMIN_a= -5765567
##$ZGOPTNS= <>
##$ZL1= 120
##$ZL2= 120
##$ZL3= 120
##$ZL4= 120
##$ABSF1= 14.96842
##$ABSF2= -5.58411
##$ABSG= 5
##$ABSL= 3
##$ALPHA= 0
##$AQORDER= 0
##$ASSFAC= 0
##$ASSFACI= 0
##$ASSFACX= 0
##$ASSWID= 0
##$AUNMP= <proc_prof1d_extract.lims>
##$AXLEFT= 0
##$AXNAME= <>
##$AXNUC= <1H>
##$AXRIGHT= 0
##$AXTYPE= 0
##$AXUNIT= <>
##$AZFE= 0.1
##$AZFW= 0.1
##$BCFW= 0
##$BC_mod= 0
##$BYTORDP= 0
##$COROFFS= 0
##$CY= 15
##$DATMOD= 1
##$DC= 0
##$DFILT= <>
##$DTYPP= 0
##$F1P= 0
##$F2P= 0
##$FCOR= 0.5
##$FTSIZE= 131072
##$FT_mod= 6
##$GAMMA= 0
##$GB= 0
##$INTBC= 1
##$INTSCL= 1
##$ISEN= 128
##$LB= 0.3
##$LEV0= 0
##$LPBIN= 0
##$MAXI= 10000
##$MC2= 0
##$MEAN= 0
##$ME_mod= 0
##$MI= 0
##$NCOEF= 0
##$NC_proc= -3
##$NLEV= 6
##$NOISF1= 0
##$NOISF2= 0
##$NSP= 0
##$NTH_PI= 0
##$NZP= 0
##$OFFSET= 14.96842
##$PC= 1
##$PHC0= 32.23938
##$PHC1= 0
##$PH_mod= 1
##$PKNL= yes
##$PPARMOD= 0
##$PPDIAG= 0
##$PPIPTYP= 0
##$PPMPNUM= 2147483647
##$PPRESOL= 1
##$PSCAL= 4
##$PSIGN= 0
##$PYNMP= <proc.py>
##$REVERSE= no
##$SF= 400.130004876329
##$SI= 131072
##$SIGF1= 0
##$SIGF2= 0
##$SINO= 400
##$SIOLD= 131072
##$SPECTYP= <>
##$SREGLST= <1H.CDCl3>
##$SSB= 0
##$STSI= 131072
##$STSR= 0
##$SW_p= 8223.68421052632
##$SYMM= 0
##$S_DEV= 0
##$TDeff= 65536
##$TDoff= 0
##$TI= <>
##$TILT= no
##$TM1= 0
##$TM2= 0
##$TOPLEV= 0
##$USERP1= <user>
##$USERP2= <user>
##$USERP3= <user>
##$USERP4= <user>
##$USERP5= <user>
##$WDW= 1
##$XDIM= 131072
##$YMAX_p= 474447829
##$YMIN_p= -307746301
##$CURPLOT= <Network HP LaserJet P1505>
##$CURPRIN= <$Network HP LaserJet P1505>
##$DFORMAT= <normdp>
##$LAYOUT= <+/1D_H.xwp>
##$LFORMAT= <normlp>
##$PFORMAT= <normpl>
##$SURQMSG= 1
$$ End of Bruker specific parameters
$$ ---------------------------------
##NTUPLES= NMR SPECTRUM
##VAR_NAME=  FREQUENCY,     SPECTRUM/REAL,   SPECTRUM/IMAG
##SYMBOL=    X,             R,               I
##VAR_TYPE=  INDEPENDENT,   DEPENDENT,       DEPENDENT
##VAR_FORM=  AFFN,          ASDF,            ASDF
##VAR_DIM=   131072,        131072,          131072
##UNITS=     HZ,            ARBITRARY UNITS, ARBITRARY UNITS
##FACTOR=    0.0627417313425165, 1,          1
##FIRST=     8223.62146879498, -572,         -95257
##LAST=      0,             2780,            -94494
##MIN=       0,             -307746301,      0
##MAX=       8223.62146879498, 474447829,    0
$$ Real data points
##PAGE= N=1
##DATA TABLE= (X++(R..R)), XYDATA
$$ [...]
63919 2810925 2943893 3084366 3232452 3388962 3555703 3734621 3926721 4132066 4350833
63910 4350833 4584217 4834294 5103364 5393744 5708240 6050482 6424816 6836154 7289948
63901 7289948 7791824 8346959 8960095 9636435 10382142 11203327 12104242 13086185 14147318
63892 14147318 15282768 16484840 17743572 19047106 20381395 21729728 23072668 24387819
63884 24387819 25648981 26826358 27889633 28812550 29575176 30162608 30562958 30767315 30770826
63875 30770826 30572586 30174546 29581686 28804233 27859828 26773020 25571808 24283752 22934321
63866 22934321 21547675 20147385 18755379 17390442 16068463 14803797 13609167 12493725
63858 12493725 11461910 10514625 9650945 8868356 8162383 7527317 6957632 6448450 5994897
63849 5994897 5591466 5231856 4909229 4617166 4351182 4109252 3890315 3692214 3511391
63840 3511391 3344251 3188195 3041505 2903119 2772816 2650974 2537548 2431345 2330481
63831 2330481 2233514 2140127 2050829 1965990 1885114 1807192 1731784 1659389 1590510 1524837 1461874
63820 1461874 1401943 1345751 1293090 1242874 1194611 1149034 1106925 1068000 1031426 996974 965116
63809 965116 936267 910277 886450 863789 841517 819685 799025 780048 762675 746930 733337
63798 733337 721999 711824 701552 691474 683287 678051 674978 672470 669770 667164 664988 663007 660651
63785 660651 657374 652793 646929 640447 634342 629003 623604 616606 606884 594345 579668 563801 547755
63772 547755 532420 518099 504302 490278 475733 460847 445822 430939 417079 405532 396771 389599
63760 389599 381962 372732 362562 353050 345192 338642 332365 325841 319487 313887 308952 304191 299569 295443
63746 295443 291667 287531 282983 279205 277162 275839 272807 266796 259274 253211 250473 250447 250970 250415 248961
63731 248961 247914 247929 248174 247350 245177 242414 239679 236902 234071 231906 231229 231728 231793 229880 226030 221920
63715 221920 219341 218688 218999 219211 218973 218358 217405 216238 215118 214002 212452 210467 208976 208866 209797 210620
63699 210620 210830 210866 211092 211343 211566 212061 212784 213226 213468 214632 217544 221293 223850 224038 222482 220768 220076
63682 220076 220599 221901 223687 226197 229671 233517 236612 238780 241383 245793 251582 256971 260985 264430
63668 264430 268597 273719 278971 283389 286399 287888 288416 289199 291347 294981 299259 303142 305840 306752 305648
63653 305648 303204 300840 299578 299233 299072 298953 299270 300011 300619 300940 301526 302587 303281 302626 300717 298332 295602
63636 295602 291816 286552 280430 274653 270153 267089 264735 262046 258896 256615 256600 258475 260365 260950 260442
63621 260442 259591 258945 259381 262102 267175 272926 277730 281833 286601 292593 299348 306516 313885 320377 324293
63606 324293 324979 323597 321920 320833 320083 318938 316889 314083 311217 308823 306713 304405 301793 298985 295881
63591 295881 292583 289945 288824 288886 288998 288872 289307 290652 292144 293399 295638 300419 307515 314883 320773
63576 320773 325341 330189 336798 345542 355868 367071 378787 390888 403266 415908 429019 442845
63564 442845 457690 474357 494046 517098 542098 567110 591832 617705 645876 676004 707281
63553 707281 739454 772158 804203 834514 863147 890326 914774 934122 947081 954475 958098 959261
63541 959261 958572 956241 952078 945581 936578 925659 913703 901053 887382 872265 855683 838024 819791
63528 819791 801353 782736 763572 743482 722824 703012 685736 671688 660181 649971 640188 630562
63516 630562 621388 613535 607768 603564 599272 594279 590438 590204 593548 597916 601317 604294 608714 615899
63502 615899 626455 640631 657811 676437 695479 715593 738164 763638 791369 820551 850558
63491 850558 880841 911200 941717 971748 999455 1023055 1042004 1056283 1065296 1068720 1068002 1065622
63479 1065622 1062783 1058912 1053417 1046807 1039800 1032262 1023332 1011845 996528 976682 953023 927059 899321
63466 899321 868939 835283 799319 762953 727684 694288 663115 634051 606539 580110 554843
63455 554843 531283 510323 493034 479795 469390 459726 449789 440185 431537 423374 415153 407302 400309
63442 400309 393632 386757 380815 377714 377710 378979 379738 379715 379419 379243 379885 382560 387771 394248 400015 404372
63426 404372 408244 412813 418534 425398 433294 441783 450055 457486 463917 469144 472632 474219 474738 475225 475595
63411 475595 474719 471906 467721 463206 458906 455037 452025 450347 450115 451366 454419 459314 464988 469717 472660
63396 472660 474627 477206 481310 486603 492046 496885 501266 505976 511552 517834 524446 531417 539047 547475
63382 547475 556812 567436 579697 593521 608883 626465 647133 670639 695481 720331 745242 771384
63370 771384 800004 831705 866281 903038 941529 981923 1024315 1067914 1111579 1155080 1198897
63359 1198897 1242501 1283637 1319834 1350028 1374154 1391728 1401708 1403763 1399197 1390413 1379535 1367349
63347 1367349 1353414 1337219 1319086 1299660 1278734 1255294 1228912 1200415 1170796 1139921 1106847
63336 1106847 1071209 1034043 997338 962846 930980 900818 871601 844201 820508 801245 785185
63325 785185 770854 758339 748887 743226 740790 740194 740186 740671 743224 749937 761206 775198 789994 805689
63311 805689 823800 845257 869769 896597 925128 955124 987207 1022649 1061654 1102242 1141801
63300 1141801 1179564 1216551 1253257 1288349 1319462 1344272 1361035 1369525 1371704 1370270 1366134 1358358
63288 1358358 1346825 1333616 1320907 1308610 1295153 1279853 1263219 1245155 1224189 1198929 1169660
63277 1169660 1138045 1105489 1072200 1037938 1003413 970430 940336 912566 885248 857198 828887
63266 828887 801435 775329 750397 726636 704729 685863 670987 659826 650724 641994 633517 626386
63254 626386 620977 616256 611294 606498 602637 599456 596306 593662 592817 594035 596000 597337 597884 598033 597523
63239 597523 595579 592127 588226 585141 583119 581277 578710 575542 572639 570248 567357 562818 556964 551659
63225 551659 548725 548683 550945 554519 558271 561112 562739 563959 565670 567606 568775 569065 569555 570967 572795
63210 572795 574622 577452 582541 589299 595563 600077 603671 607856 613337 620193 628312 636951 644893 651948
63196 651948 659566 669020 679718 690318 700762 711796 722996 733032 742132 752760 767157 785122
63184 785122 804676 824100 842992 862198 883197 906847 932341 958170 984355 1012665 1044034
63173 1044034 1076974 1109566 1142084 1176256 1212491 1249388 1285937 1322757 1360681 1399198 1436949
63162 1436949 1473120 1507779 1541298 1573996 1606072 1637395 1667494 1696018 1723024 1748403 1771187
63151 1771187 1789846 1803319 1811361 1813817 1810036 1799351 1781842 1758197 1728976 1694605 1656110 1615212
63139 1615212 1573379 1531243 1489368 1449088 1412010 1378975 1350094 1325576 1305829 1290836 1280165
63128 1280165 1273562 1270939 1271806 1275585 1282649 1294214 1310772 1331231 1353928 1377865 1402628 1427823
63116 1427823 1453272 1479243 1505772 1532018 1556859 1579938 1601655 1622372 1642078 1660549 1677235
63105 1677235 1691098 1701029 1706433 1707094 1702671 1692793 1677643 1658071 1635023 1608997 1579953 1547690
63093 1547690 1512496 1475550 1438432 1402063 1366424 1331399 1297471 1265333 1235320 1207625 1182622
63082 1182622 1160472 1140712 1122826 1106955 1093585 1082705 1073676 1065732 1058309 1051258 1045221 1041424
63070 1041424 1040400 1041108 1041913 1042300 1043080 1045073 1048216 1051860 1055331 1058163 1060306 1062186 1064289 1066778 1069797
63055 1069797 1073735 1078557 1083094 1085744 1085975 1084793 1083865 1084590 1087579 1092313 1097472 1102280 1107268 1113038 1118743
63040 1118743 1122932 1125710 1128875 1133878 1140799 1149317 1159174 1169298 1177994 1184846 1191252 1198272 1205220 1211508
63026 1211508 1218578 1228298 1240092 1251479 1261363 1271254 1283062 1297047 1312343 1328248 1344367 1360432
63014 1360432 1376815 1394711 1415140 1438033 1462651 1488566 1515834 1544605 1575023 1607268 1641318
63003 1641318 1676819 1713477 1751389 1790836 1832154 1876050 1923497 1974683 2028460 2083658 2140804
62992 2140804 2201628 2266735 2334675 2403691 2473539 2544842 2617411 2690336 2763512 2837813 2913368
62981 2913368 2988519 3061120 3130478 3197579 3263780 3329813 3395768 3461433 3526371 3589888 3651019
62970 3651019 3708605 3761541 3808836 3849034 3879552 3897261 3900125 3887957 3861334 3820474 3765808
62959 3765808 3699195 3623654 3542057 3456677 3369655 3282881 3197367 3113715 3033465 2959128 2892519
62948 2892519 2833806 2782626 2739406 2704944 2679278 2661800 2652188 2650421 2655887 2667106 2682617 2701811
62936 2701811 2724763 2751412 2781009 2812295 2844201 2876366 2908786 2940858 2971015 2997620 3020284
62925 3020284 3040100 3058326 3074645 3086689 3091502 3087519 3074912 3054012 3024098 2984262 2934860 2877133
62913 2877133 2811657 2738327 2658071 2573387 2486614 2398596 2309726 2221515 2136188 2055165 1978692
62902 1978692 1906547 1838322 1773428 1711818 1654510 1602577 1555739 1512787 1473179 1437157 1404314
62891 1404314 1373394 1343973 1317225 1294150 1273755 1253867 1233373 1212907 1193659 1176313 1160989
62880 1160989 1147252 1133960 1119838 1104693 1089693 1076007 1063397 1050559 1036715 1022466 1009045
62869 1009045 997166 986731 977289 968332 959306 949899 940537 932283 925940 921274 917234 912860 908007
62856 908007 903396 900078 898612 898499 898529 897826 896377 894416 891672 887683 882659 877470 872748 868605 865470
62841 865470 864555 866725 870981 874764 876186 875684 875130 875531 876163 876003 875261 874879 874976 874691 873597 872325 871393
62824 871393 870181 867787 864357 860678 856749 851744 845558 839475 834952 832234 830503 828817 826479 823032
62810 823032 818640 814346 811278 809335 807024 802821 796664 790038 784692 781306 779232 777272 774557 770838
62796 770838 766328 761509 756904 752744 748900 745340 742485 740847 740459 740903 741599 741609 739632 735159 729614
62781 729614 725324 722993 721161 718548 715870 714538 714609 715312 716829 719966 724243 728009 730684 733484 737468
62766 737468 742172 746799 751408 755973 759482 761379 763111 766670 771930 776940 780828 784931 790737 798034
62752 798034 805795 813831 822695 832554 843038 853879 865054 876540 888533 901731 916791 933539
62740 933539 951242 969670 989474 1011321 1035053 1059958 1085807 1113391 1143965 1178284 1216348
62729 1216348 1257946 1302985 1351026 1401016 1452209 1505280 1561979 1623741 1691190 1764817 1845132
62718 1845132 1931794 2023548 2119664 2220777 2327616 2439525 2554973 2672919 2792593 2912081
62708 2912081 3028173 3137836 3239131 3330480 3409581 3473368 3518901 3544459 3550050 3536708 3504990
62697 3504990 3454532 3385576 3300456 3202771 3095339 2979791 2857972 2732608 2606438 2481590
62687 2481590 2359995 2243416 2132618 2027305 1927321 1833248 1745532 1663876 1588012 1518265
62677 1518265 1454750 1396782 1343859 1296470 1254972 1218169 1184097 1152039 1122769 1096865 1073768
62666 1073768 1052778 1034176 1018899 1007450 999349 993388 988356 983893 980741 979966 981943 986327 992755
62653 992755 1001051 1010830 1021675 1033978 1048988 1067611 1089629 1114514 1142528 1174223 1209179 1246267
62641 1246267 1285447 1328457 1377032 1430982 1488799 1549884 1615226 1685800 1761251 1840461 1922557
62630 1922557 2006711 2091514 2175286 2256601 2333918 2405126 2468273 2522397 2566764 2599545 2618292
62619 2618292 2621764 2610477 2585453 2547430 2497394 2436817 2366909 2288462 2202890 2112747 2020806
62608 2020806 1929170 1839391 1752605 1669229 1589323 1513659 1443544 1379188 1319182 1262159 1208172
62597 1208172 1157930 1111682 1069515 1031736 998008 966874 937027 908377 881260 855650 832011
62586 832011 811627 794683 779090 762770 746187 730855 716267 700636 684346 670178 659711
62575 659711 651617 644072 636884 630399 624160 617919 612625 609116 606863 605091 604265 605215 607406 609210 609590
62560 609590 608767 607670 607520 609568 614382 621368 629372 637545 645490 653160 661043 669921 680061 691195
62546 691195 703588 718334 736020 755813 776516 797888 820300 843972 869561 898869 933576
62535 933576 973287 1015879 1059931 1106052 1155742 1209733 1267681 1328708 1391639 1454926 1516836
62524 1516836 1575946 1631459 1682938 1729623 1770089 1802729 1826346 1839980 1842546 1833526 1813966 1785924
62512 1785924 1750784 1709011 1661758 1611364 1559496 1505883 1449932 1392783 1336605 1282520 1230530
62501 1230530 1181104 1135467 1094290 1057176 1023525 992940 964791 938407 913871 891731 871777
62490 871777 852992 834848 817657 801366 785104 768479 752434 738062 725243 713223 701943
62479 701943 691974 683513 676480 671454 669462 670458 672812 674827 676337 678289 681252 685248 690874 699394
62465 699394 711043 724059 736339 747680 759505 772807 787732 805090 826491 852132 879816
62454 879816 907380 935280 965583 999261 1035865 1075186 1117474 1162017 1207204 1252247 1297422
62443 1297422 1342186 1384470 1422532 1456262 1485748 1509590 1525739 1533407 1533120 1525352 1510160 1488011
62431 1488011 1460040 1427414 1391035 1351879 1311049 1269456 1227919 1187637 1150112 1116320 1086059
62420 1086059 1058133 1031218 1004792 979457 956273 935744 917625 901655 887863 875948 865087
62409 865087 855033 846971 842457 841552 842702 844429 846434 848773 850696 851000 849488 847644 847672 850844 856746
62394 856746 863991 871517 879043 886489 893534 900099 906898 914927 924496 935167 946390 957507 967145
62381 967145 973482 975644 974351 970769 965185 957217 946727 933708 917718 898557 877601 857333 839069
62368 839069 821897 804456 787069 771409 758560 748173 739180 730582 721825 713336 706565 702619 700869
62355 700869 699778 699010 699582 701792 704424 706660 709597 714918 722892 732716 743976 756552 769606 782077
62341 782077 794081 806572 819664 832441 844571 856954 870294 883821 895841 905023 910994 914355
62329 914355 916419 918337 920238 921569 922152 922262 921871 920837 919874 920256 922285 925132 928574 933782 941830
62314 941830 952535 965532 981431 1000824 1023019 1047072 1073716 1105167 1143121 1187770 1238388
62303 1238388 1293897 1352968 1414627 1479079 1547375 1620046 1696180 1773606 1849711 1922472 1991044
62292 1991044 2054865 2111943 2159002 2194035 2217866 2232137 2236668 2230196 2212952 2186672 2152256 2109347
62280 2109347 2058431 2001671 1941252 1878498 1815127 1753553 1694869 1637905 1581478 1526535 1475005
62269 1475005 1427587 1383925 1343951 1307564 1273630 1240871 1209461 1180415 1153671 1128255 1104293
62258 1104293 1083324 1066199 1051928 1039162 1027854 1018760 1012007 1006875 1002666 999294 997122 996443 996977
62245 996977 997813 997995 997070 994936 991613 987736 984804 983926 984264 983609 980677 976133 971471 967891 966441 967859
62229 967859 971401 974752 976230 976748 978813 983886 991428 1000146 1009317 1018941 1029375 1041028 1054069 1068444
62215 1068444 1084363 1102446 1122915 1144956 1167553 1190831 1215872 1243088 1271407 1299508 1327754
62204 1327754 1358648 1395182 1438459 1486950 1538487 1592997 1652545 1718345 1788504 1859388 1928451
62193 1928451 1994666 2056752 2112527 2160148 2198777 2227660 2245682 2252410 2248808 2236300 2215638 2187022
62181 2187022 2150708 2107117 2057056 2002282 1945273 1887861 1830562 1773606 1717970 1664830 1614660
62170 1614660 1567649 1524540 1486325 1453427 1425826 1403574 1386383 1373000 1361868 1352366 1344747 1339083
62158 1339083 1335021 1332472 1331774 1333075 1336105 1340455 1345444 1349932 1353071 1355303 1357833 1361093 1364425 1367232
62144 1367232 1369577 1371578 1373240 1375222 1378823 1384692 1392204 1400506 1409487 1419446 1430710 1444033 1460351
62131 1460351 1479390 1499460 1519565 1540853 1564810 1590777 1616739 1642254 1668975 1698116 1728817
62120 1728817 1759472 1789466 1819018 1848379 1878063 1909129 1942355 1977580 2014602 2054265 2097784
62109 2097784 2145170 2195156 2246742 2300102 2355696 2412958 2470133 2525099 2576043 2621506 2660302
62098 2660302 2691878 2716895 2737074 2753839 2766863 2774299 2774694 2768507 2757670 2744125 2729070 2713050
62086 2713050 2696155 2678341 2660305 2643973 2631361 2622701 2616262 2610377 2605357 2603144 2605323 2611665 2620413
62073 2620413 2629812 2639476 2650366 2663407 2678415 2694691 2712303 2731991 2753809 2776778 2800212 2824578
62061 2824578 2850531 2877949 2906757 2938041 2973131 3011631 3051332 3090264 3128206 3166152 3205066
62050 3205066 3245379 3287061 3329762 3373295 3418207 3465523 3515790 3568715 3623871 3681265 3740961
62039 3740961 3802491 3864966 3927706 3990703 4054516 4119415 4184254 4246543 4304421 4358618 4411936
62028 4411936 4466887 4524406 4584409 4646172 4707849 4766982 4822463 4875395 4927549 4979827 5032700
62017 5032700 5086894 5142547 5198660 5254671 5311897 5371987 5434413 5497155 5559764 5624174 5692106
62006 5692106 5763020 5835143 5907271 5978673 6048009 6113326 6173010 6226314 6273169 6313684 6347585
61995 6347585 6374004 6392158 6402208 6405013 6401123 6390667 6374295 6353500 6329675 6303350 6274506 6243099
61983 6243099 6209184 6173227 6136534 6100757 6066599 6033545 6001089 5969591 5939680 5911570 5885364
61972 5885364 5861387 5839726 5819950 5801671 5784797 5768941 5753327 5737751 5722887 5709093 5695654
61961 5695654 5681785 5667496 5652693 5636458 5618440 5600179 5583568 5568421 5552942 5536227 5518614
61950 5518614 5499702 5478143 5454123 5430331 5409140 5389854 5369882 5347788 5323999 5299202 5273542
61939 5273542 5247289 5220863 5193839 5164847 5132885 5098126 5061204 5022494 4982453 4941848 4900836
61928 4900836 4858254 4812733 4764484 4715257 4666488 4618125 4569445 4520355 4471514 4423787 4378039
61917 4378039 4334896 4293963 4253701 4212960 4172536 4134380 4099304 4066405 4034864 4005118 3977627
61906 3977627 3951505 3925376 3899043 3873354 3848868 3825712 3804415 3785573 3768532 3751676 3734527
61895 3734527 3718532 3705044 3693270 3681200 3668138 3655442 3644988 3637789 3634085 3633798 3636509 3641617
61883 3641617 3649036 3659320 3672756 3688825 3707151 3728721 3755324 3787633 3824453 3864196 3906769
61872 3906769 3953748 4006947 4067091 4133707 4206050 4284220 4369434 4463035 4565321 4675892 4795242
61861 4795242 4925250 5067560 5222302 5389354 5570378 5768356 5985178 6221077 6476828
61852 6476828 6755401 7060936 7397186 7767742 8176648 8627421 9121894 9661285 10248215
61843 10248215 10886247 11576972 12318185 13104751 13929665 14782850 15648734 16505041 17323325
61834 17323325 18070222 18709442 19205376 19528211 19658667 19590410 19329732 18893521 18306624
61825 18306624 17598877 16801840 15945800 15057896 14161503 13276144 12417461 11597392 10824532
61816 10824532 10104072 9437607 8823830 8260381 7745183 7276021 6849539 6461563 6108513
61807 6108513 5787861 5497003 5232318 4989937 4767293 4563551 4378474 4211141 4059725
61798 4059725 3922143 3796614 3681781 3576752 3481120 3394630 3316632 3246132 3182477 3125450
61788 3125450 3074298 3027379 2983636 2944073 2910619 2883521 2860884 2840942 2823572 2809153 2797195
61777 2797195 2787134 2779560 2775554 2775244 2777982 2783468 2791674 2801988 2813519 2826293 2841266 2859152 2879977
61764 2879977 2903755 2930856 2961544 2995731 3033164 3073438 3116137 3161611 3211332 3266587 3326940
61753 3326940 3390822 3457480 3527545 3601841 3680799 3765166 3856209 3954925 4061857 4177790 4303599
61742 4303599 4439126 4583289 4735806 4897904 5070934 5255380 5451877 5662015 5887057
61733 5887057 6126662 6380168 6648815 6935555 7242678 7570674 7919796 8292197 8692223
61724 8692223 9124835 9593965 10102453 10653609 11252551 11905577 12618412 13395832 14243028
61715 14243028 15166257 16171381 17262242 18440750 19707273 21059294 22489174 23983080
61707 23983080 25520649 27073420 28602418 30057419 31379291 32504648 33372087 33929799
61699 33929799 34143084 33999295 33508697 32701777 31624203 30330679 28878956 27324919 25718833
61690 25718833 24102901 22510782 20968747 19496690 18108098 16810514 15607636 14501155
61682 14501155 13490110 12569346 11730503 10965305 10267479 9631766 9052693 8525089 8044765
61673 8044765 7607553 7208228 6841386 6503287 6192037 5906073 5643199 5401042 5177569
61664 5177569 4970760 4778414 4598906 4431919 4277890 4136560 4006277 3884815 3770687
61655 3770687 3663536 3563312 3469342 3380466 3296045 3216558 3142941 3075258 3012199 2951958 2893609
61644 2893609 2837590 2784903 2735936 2690027 2646059 2603296 2561594 2520944 2481123 2441950 2403666
61633 2403666 2366657 2330715 2294937 2258657 2222337 2187263 2154496 2124295 2096261 2069463 2042534
61622 2042534 2014421 1985438 1957228 1931422 1908556 1888252 1869740 1851904 1833584 1814567 1795877
61611 1795877 1778547 1762466 1746925 1731705 1716877 1702149 1687418 1673535 1661273 1649845 1637774
61600 1637774 1625164 1613671 1603980 1594952 1585871 1577958 1572536 1568871 1565046 1560160 1554454 1548095 1541299
61587 1541299 1535262 1531457 1529899 1529235 1528578 1528160 1528002 1527084 1524421 1520391 1516490 1513996 1513027 1512589 1511475 1509346
61571 1509346 1506821 1504262 1500890 1495781 1489501 1483927 1480315 1478093 1475626 1471629 1465872 1459199 1453054 1448414
61557 1448414 1444973 1441753 1438461 1435605 1433223 1430267 1425732 1419991 1414649 1411200 1409744 1408664 1405739 1400245
61543 1400245 1393939 1389183 1386035 1382229 1376432 1370497 1367612 1368923 1372952 1377947 1383575 1390242 1397760 1405302
61529 1405302 1412302 1418973 1426034 1434171 1443817 1455330 1469172 1485584 1504147 1524080 1545140 1567819
61517 1567819 1592384 1618252 1644820 1672571 1702698 1735771 1771453 1809448 1850059 1893585 1939778
61506 1939778 1988128 2038176 2089205 2140103 2190045 2239030 2287353 2334817 2380972 2425945 2470386
61495 2470386 2514466 2557393 2598008 2635366 2668625 2697084 2720909 2741458 2760108 2776754 2790019
61484 2790019 2799079 2804719 2808335 2810333 2809971 2806566 2800423 2792689 2784696 2777454 2771357 2766158 2761550 2758073
61470 2758073 2757411 2761497 2771275 2786389 2806009 2829791 2858096 2891620 2931076 2977105 3030150 3090315
61458 3090315 3157540 3232073 3314833 3407401 3511686 3629236 3760378 3904163 4059842 4228715
61448 4228715 4413952 4618189 4841733 5083569 5343446 5621980 5918838 6231787 6557532
61439 6557532 6892452 7231854 7568989 7895182 8200664 8475274 8709238 8894250 9024319
61430 9024319 9096197 9109794 9068278 8976993 8841967 8669850 8468905 8248463 8016473 7778438
61420 7778438 7539403 7305748 7083594 6876136 6684020 6507987 6349583 6209500 6087202
61411 6087202 5982814 5897797 5832764 5785840 5754391 5737572 5735871 5748746 5774279 5811252 5860045
61400 5860045 5920785 5991552 6069218 6151499 6237319 6325544 6414449 6502654 6589720 6675391 6758876
61389 6758876 6839495 6917645 6994435 7070432 7145330 7218784 7290948 7362089 7432030 7499935 7564240
61378 7564240 7623029 7675298 7721858 7764188 7802281 7834504 7859837 7879091 7893200 7901363 7901928 7894548
61366 7894548 7880321 7860173 7834245 7802922 7767483 7729520 7690371 7651283 7613454 7577603 7543783
61355 7543783 7511866 7482129 7455435 7432883 7415000 7401063 7389500 7379049 7369090 7358815 7347008
61344 7347008 7333089 7317565 7300884 7282842 7263881 7245830 7230189 7216746 7205535 7199548 7203648 7221120
61332 7221120 7252891 7299762 7363365 7444858 7544920 7665562 7810052 7980195 8175363 8394871
61322 8394871 8639495 8909503 9202807 9516285 9847432 10193146 10547944 10904671 11255766
61313 11255766 11592237 11902542 12174628 12399103 12569528 12680855 12729800 12716626 12644772 12518537
61303 12518537 12342380 12122094 11864545 11575606 11259610 10921234 10566665 10202353 9833793
61294 9833793 9466097 9104566 8753789 8416660 8094764 7789136 7500354 7228859 6975849
61285 6975849 6743283 6532417 6342909 6173815 6024800 5895718 5785692 5693634 5619297 5562793
61275 5562793 5522974 5497267 5483521 5481504 5492089 5515245 5549299 5592087 5642232 5698993 5761298
61264 5761298 5827626 5896752 5967808 6039242 6108548 6173811 6235109 6293505 6348882 6399666 6444521
61253 6444521 6483267 6516092 6543085 6564913 6582711 6596342 6603547 6601790 6590522 6570966 6544259 6510740
61241 6510740 6470484 6423475 6369525 6309156 6244350 6177249 6108094 6035721 5960177 5883430 5807080
61230 5807080 5730889 5654517 5579469 5508031 5441105 5378359 5319880 5266271 5217476 5172973 5132921
61219 5132921 5097664 5066122 5036148 5006675 4978098 4950277 4921934 4892670 4863942 4836921 4810902
61208 4810902 4785196 4761226 4740896 4723792 4708208 4694709 4686700 4687129 4696128 4712334 4735191 4765550
61196 4765550 4805230 4856565 4921308 4999351 5089249 5190320 5303308 5428640 5565093 5710608
61186 5710608 5863058 6019117 6173134 6318186 6447812 6556043 6636577 6683397 6692395 6661860
61176 6661860 6591696 6483209 6339906 6167864 5974729 5768024 5553935 5337205 5121945 4912247
61166 4912247 4711596 4521813 4343246 4176110 4020959 3877854 3746186 3625856 3517612
61157 3517612 3421386 3335189 3256780 3185839 3123337 3069073 3021195 2978279 2940798 2910090 2886587
61146 2886587 2869431 2857494 2850403 2848759 2853286 2863594 2877984 2894632 2912610 2931305 2949349 2964886
61134 2964886 2976713 2984488 2988047 2987459 2983696 2978154 2970960 2960433 2944844 2924379 2900881 2875837 2849075
61121 2849075 2819419 2786213 2749991 2711802 2672331 2632003 2591702 2552760 2515923 2480648 2445568
61110 2445568 2409352 2370997 2329932 2286428 2241581 2196416 2151271 2106486 2063221 2022694 1984774
61099 1984774 1948211 1912470 1878567 1847722 1819751 1793325 1767450 1741920 1716299 1689268 1659724
61088 1659724 1628341 1597165 1567295 1537654 1506706 1474826 1443992 1415455 1388927 1364135 1341791
61077 1341791 1322452 1305570 1290527 1277786 1268137 1261445 1257028 1254761 1254952 1257515 1262027 1268213 1275651
61064 1275651 1283436 1291039 1299083 1308477 1319127 1330395 1342449 1356107 1371405 1387257 1402651 1417487
61052 1417487 1432157 1446797 1460976 1473885 1485097 1495222 1505022 1513516 1518149 1517874 1514978 1512440 1510277
61039 1510277 1506158 1498981 1489868 1479864 1468873 1457306 1446721 1437853 1429442 1420073 1410164 1401243 1394034
61026 1394034 1388093 1382707 1377472 1372423 1367941 1364012 1359526 1353211 1345482 1338268 1332475 1326659 1319077 1310222
61012 1310222 1302358 1296910 1293135 1289256 1284378 1279258 1275410 1273459 1272623 1272130 1272715 1275836 1281577 1288312 1294464
60997 1294464 1299633 1303933 1307543 1311326 1316724 1324281 1333018 1341855 1351013 1361647 1374845 1391315 1411095
60984 1411095 1432922 1454730 1475478 1495992 1517617 1540735 1565042 1590456 1617224 1645766 1676882
60973 1676882 1711356 1748977 1788773 1830672 1875975 1925708 1979473 2036636 2097676 2163543 2234479
60962 2234479 2310197 2390403 2474354 2560805 2649442 2741797 2839958 2944988 3057159 3176774 3303869
60951 3303869 3438104 3580135 3732257 3896337 4071571 4255491 4446785 4646080 4854576
60942 4854576 5073606 5305786 5555448 5827352 6125166 6451147 6806928 7194602 7616863
60933 7616863 8075994 8574023 9116177 9714545 10386391 11148317 12014156 12998878 14121233
60924 14121233 15401119 16858264 18516088 20402695 22544892 24967275 27700431 30768781
60916 30768781 34128409 37589958 40818790 43457680 45294403 46340980 46778532 46848508
60908 46848508 46785866 46792545 46985940 47315674 47534135 47292444 46315314 44526719 42047877
60899 42047877 39103795 35927546 32710939 29591787 26655024 23941824 21466318 19231423
60891 19231423 17235673 15473172 13932752 12597881 11446774 10454299 9596021 8851009
60883 8851009 8201377 7631105 7126623 6677518 6275540 5913390 5584957 5285625 5011554
60874 5011554 4759434 4527439 4315044 4120712 3940596 3770500 3608322 3453640 3305891
60865 3305891 3164376 3029389 2901800 2781671 2668378 2561838 2462235 2368586 2278926 2192334
60855 2192334 2109835 2032922 1962004 1896694 1836742 1781901 1731264 1683613 1638511 1596638 1558824
60844 1558824 1524999 1494292 1465928 1439673 1415416 1392844 1371870 1352845 1335763 1319650 1303611
60833 1303611 1288361 1275649 1265919 1257520 1248798 1240113 1233084 1228559 1226223 1225705 1226816 1228609 1229231 1227294
60819 1227294 1223092 1218145 1213654 1209603 1205232 1200074 1194200 1187399 1178682 1167295 1154147 1141476 1130841
60806 1130841 1121997 1113946 1106363 1099550 1093696 1088907 1085569 1083985 1083905 1084982 1087383 1091322 1096408 1102313
60792 1102313 1109879 1120569 1134645 1150692 1167188 1183909 1201505 1220377 1240410 1261297 1282486
60781 1282486 1303009 1321805 1338195 1352006 1363631 1374234 1385385 1397737 1410111 1420438 1427725
60770 1427725 1432657 1436328 1438964 1440149 1439728 1437984 1435347 1432486 1430420 1429816 1430150 1430149 1429139 1427477 1425638
60755 1425638 1423509 1420760 1417181 1412277 1405238 1395937 1385484 1375121 1364883 1354001 1342323 1330637
60743 1330637 1319743 1309912 1301205 1293580 1286592 1279627 1272674 1266473 1261802 1258933 1257655 1257384 1257355 1257285 1257858
60728 1257858 1260085 1264186 1269642 1276228 1284351 1294395 1306463 1320776 1337478 1355869 1374644 1393328
60716 1393328 1412762 1433747 1455853 1478082 1500191 1522731 1546062 1569872 1593524 1616486 1638447
60705 1638447 1659185 1678348 1695464 1710409 1723588 1735170 1744383 1750312 1753252 1754314 1753692 1750448 1744399
60692 1744399 1737123 1730430 1724705 1719408 1714279 1709204 1703704 1697722 1692335 1688460 1685042 1679718 1671404 1661241
60678 1661241 1650763 1639938 1627546 1613069 1597777 1583881 1572603 1563025 1553019 1541453 1529290
60667 1529290 1518466 1510164 1504374 1500456 1497588 1495205 1493740 1494625 1498759 1505140 1511685 1517346 1522743 1528907
60653 1528907 1536187 1544447 1553390 1562107 1568856 1572060 1571620 1568974 1565740 1562393 1558280 1552748 1545882 1538051
60639 1538051 1529262 1519579 1509826 1500877 1492141 1481743 1468704 1454146 1439807 1426173 1412798 1399633
60627 1399633 1386956 1374437 1361386 1347747 1333940 1319891 1305099 1289589 1273876 1258071 1241946
60616 1241946 1225870 1210769 1197037 1184482 1173524 1165427 1160803 1158632 1157369 1156449 1156232 1156977 1158534
60603 1158534 1160818 1164000 1168137 1172855 1177447 1181402 1185028 1189545 1196145 1204835 1214415 1223680 1232419 1241212
60589 1241212 1250514 1260028 1268868 1276376 1282910 1289599 1297156 1305220 1313099 1320671 1328030 1334786 1340553 1345905
60575 1345905 1351946 1359070 1367086 1376417 1387996 1401665 1415771 1428890 1441209 1453807 1467442 1482523
60563 1482523 1499257 1516984 1534183 1550158 1566152 1583742 1602426 1619981 1635192 1649255 1664223
60552 1664223 1680924 1698590 1715722 1730851 1743076 1752512 1759971 1765816 1769272 1769168 1764976 1756701 1744095
60539 1744095 1726839 1705658 1682573 1659574 1637311 1615367 1593459 1571929 1551436 1532843 1517274
60528 1517274 1505512 1497141 1490861 1485839 1482221 1480237 1479593 1480056 1481797 1484398 1486246 1485889 1483737 1481587
60514 1481587 1480630 1480639 1480927 1481303 1482173 1484413 1489021 1496140 1504503 1512683 1520794 1530018 1540452 1550620 1559480
60499 1559480 1567820 1577061 1587467 1598283 1608937 1619322 1629265 1638558 1647404 1656378 1665942 1676214 1687025
60486 1687025 1698067 1709323 1721487 1735618 1752338 1771907 1795156 1823554 1857875 1897348 1940564
60475 1940564 1986763 2035782 2087122 2139324 2189639 2233968 2267952 2289026 2297284 2294084 2280531 2257942
60463 2257942 2229011 2197421 2166412 2138304 2114864 2097102 2084892 2077732 2075912 2080224 2090633 2105978
60451 2105978 2124890 2146250 2168937 2192313 2217216 2245623 2278891 2317006 2359927 2408837 2465382
60440 2465382 2530003 2601673 2679343 2763451 2856156 2960207 3077385 3207790 3350585 3505298
60430 3505298 3672320 3852518 4046889 4256635 4483313 4729123 4997506 5293025 5619638
60421 5619638 5978713 6368870 6786790 7225937 7673056 8106457 8498885 8822713 9053707
60412 9053707 9173104 9170019 9043984 8805211 8471854 8066237 7611794 7130616 6641396 6158510
60402 6158510 5692579 5251449 4840557 4462997 4119987 3811584 3536903 3293785 3078688
60393 3078688 2887343 2715931 2562054 2424856 2304168 2199180 2107564 2025793 1950580 1880428
60383 1880428 1815923 1758445 1708341 1664231 1623936 1585938 1549920 1516188 1484904 1455947 1429172
60372 1429172 1404440 1381408 1359671 1339318 1321055 1305323 1291334 1277437 1262584 1246988 1231248
60361 1231248 1215503 1200085 1186493 1176560 1170477 1166497 1162961 1159840 1157745 1156229 1154193 1151752 1150576
60348 1150576 1152043 1155801 1160476 1165080 1169163 1172230 1173945 1174905 1176456 1179552 1184187 1189927 1196425 1203290
60334 1203290 1210101 1216952 1224481 1232837 1241026 1247927 1253639 1259117 1264628 1269439 1273176 1276561 1280306 1283840
60320 1283840 1285628 1284436 1280082 1273582 1266982 1262273 1259652 1257306 1253767 1249923 1247624 1246698 1244934 1241278
60306 1241278 1237500 1235807 1236007 1236169 1235343 1234331 1234124 1234929 1236854 1240479 1246252 1253921 1262787 1271989 1280466
60291 1280466 1287318 1292669 1297773 1303964 1311816 1321399 1332712 1345353 1358239 1370261 1381156 1391293
60279 1391293 1400789 1409215 1416121 1421457 1425484 1428568 1431007 1432834 1433886 1434399 1435461 1438430 1443719 1450374
60265 1450374 1456910 1462421 1466807 1470151 1472061 1471755 1468925 1464448 1459783 1455311 1449723 1441689 1431911 1422701
60251 1422701 1415441 1409334 1403040 1396676 1391458 1387941 1385626 1384190 1384120 1385828 1388802 1392054 1395020 1397721
60237 1397721 1400392 1403360 1406993 1411249 1415388 1418657 1421477 1425493 1431959 1440228 1448311 1455129 1461747 1470002
60223 1470002 1480318 1491532 1502825 1514928 1528914 1544493 1560291 1575577 1590847 1606626 1622505
60212 1622505 1637838 1652890 1668706 1685997 1704580 1723988 1744382 1766668 1791661 1819087 1847537
60201 1847537 1875700 1903783 1933543 1966911 2004759 2046927 2092857 2141820 2193035 2246466 2303635
60190 2303635 2367023 2438262 2517102 2602373 2693648 2791625 2897214 3010890 3133016 3264237
60180 3264237 3405117 3555619 3715263 3883556 4059842 4242846 4430872 4622483 4816349
60171 4816349 5010081 5199697 5380809 5550197 5705889 5846096 5968823 6072535 6156533 6220481
60161 6220481 6264257 6288749 6296231 6289183 6268992 6236665 6194896 6148482 6102007 6057598 6015720 5977896
60149 5977896 5947638 5928494 5922297 5930139 5954218 5997306 6060323 6141747 6239860 6354577 6486310
60138 6486310 6633799 6793995 6963542 7139325 7317852 7495312 7668294 7833419 7986081
60129 7986081 8120653 8232670 8320190 8382598 8418923 8428174 8410788 8368663 8303802 8217915 8113671
60118 8113671 7995787 7870405 7743381 7619165 7500855 7390969 7292184 7207645 7140704 7094221
60108 7094221 7069787 7067388 7085967 7124583 7182979 7260794 7356285 7465993 7585481 7710036 7835010
60097 7835010 7956451 8071689 8178620 8274083 8353836 8415039 8458469 8487545 8505447 8514018 8515297
60086 8515297 8512883 8511128 8513559 8522847 8542189 8575981 8628638 8702839 8799293 8918506 9062537 9234631
60074 9234631 9437289 9671422 9937585 10237145 10571520 10940839 11344294 11781377 12251523
60065 12251523 12752291 13278868 13825696 14387655 14959095 15532525 16099076 16649758 17175536
60056 17175536 17666660 18113128 18506148 18838641 19104408 19297635 19413702 19450182 19406822 19284994
60046 19284994 19087499 18818746 18484892 18094066 17656760 17185731 16694791 16197089 15704072
60037 15704072 15225546 14770183 14345721 13958695 13614009 13314857 13063210 12860443 12707230
60028 12707230 12602686 12543922 12526797 12546939 12599577 12678519 12776006 12883954 12994995 13102240
60018 13102240 13198710 13277847 13334596 13365670 13369038 13343656 13289529 13207244 13097152 12959452 12795333
60007 12795333 12607586 12399645 12174184 11933116 11678890 11415392 11147330 10878888 10613253
59998 10613253 10353465 10103435 9867753 9650580 9455108 9284089 9140141 9024896 8938246
59989 8938246 8879212 8847619 8844467 8870704 8926185 9009606 9118505 9249021 9396458 9556743 9726937
59978 9726937 9903848 10082488 10256302 10418581 10563331 10685299 10780009 10843993 10874862 10871332
59968 10871332 10833421 10762280 10659515 10526963 10367519 10185856 9987791 9778985 9564565 9349603
59958 9349603 9139299 8938581 8751819 8582743 8434219 8308149 8205899 8128699 8077366 8052108
59948 8052108 8053269 8082002 8139458 8225398 8338391 8477494 8642847 8834218 9049571 9285415
59938 9285415 9537788 9802058 10072015 10340067 10598739 10841699 11063299 11257666 11418993
59929 11418993 11543005 11627849 11673208 11678702 11643650 11568493 11455953 11310569 11137635 10943107
59919 10943107 10734074 10518417 10303655 10096252 9901818 9725447 9571715 9444502 9346565
59910 9346565 9278872 9240504 9229884 9246381 9290563 9362907 9462401 9586121 9729769 9888834 10059876
59899 10059876 10240780 10429441 10622219 10814064 11000105 11176896 11342447 11495731 11636129
59890 11636129 11762862 11875044 11972813 12058362 12135327 12207274 12277266 12348631 12425478 12512708 12616296
59879 12616296 12743236 12899938 13090579 13317871 13585200 13896414 14253225 14654267 15097196
59870 15097196 15580018 16099178 16647530 17215197 17791138 18362249 18911741 19420234 19868732
59861 19868732 20240141 20519355 20694358 20757999 20708200 20547001 20280850 19921560 19485093 18988421
59851 18988421 18447884 17879995 17301721 16728654 16173269 15645164 15152108 14700394 14294878
59842 14294878 13939203 13635525 13383993 13183458 13033113 12932760 12881200 12875336 12911462 12986595
59832 12986595 13097805 13240831 13409894 13598102 13797164 13997142 14187254 14356686 14494436
59823 14494436 14589525 14632709 14617888 14541355 14400575 14195134 13928634 13608266 13242361 12839346
59813 12839346 12408896 11962158 11509599 11059039 10616231 10186557 9775400 9387340 9025646
59804 9025646 8692177 8387277 8110138 7859997 7636913 7441028 7271157 7124424 6997057
59795 6997057 6885311 6786075 6697131 6616719 6542642 6472328 6404263 6338964 6277815 6221159 6168107
59784 6168107 6117915 6070666 6026702 5986142 5948755 5913199 5876314 5834461 5786198 5732809 5675816
59773 5675816 5615186 5550842 5484674 5419472 5356431 5295413 5237484 5185309 5140425 5101605 5067000
59762 5067000 5036895 5013193 4996916 4987718 4985802 4992868 5010412 5037766 5072607 5113214 5159668 5212918
59750 5212918 5273404 5340952 5415558 5497417 5585985 5679511 5775906 5873694 5971595 6067491 6158629
59739 6158629 6242969 6319714 6388421 6448479 6500140 6545563 6588010 6630017 6672880 6717976 6768110
59728 6768110 6827315 6899459 6987061 7091356 7213526 7355821 7521268 7712277 7930109 8176076
59718 8176076 8452798 8763655 9111197 9496576 9920082 10381073 10876884 11401970 11947398
59709 11947398 12499289 13036531 13530858 13951224 14270266 14469191 14540135 14486955 14324348 14074427
59699 14074427 13761869 13410385 13041313 12672787 12318722 11988941 11690858 11430577 11212025
59690 11212025 11035958 10901266 10807323 10754221 10740873 10764343 10821874 10912782 11037440 11194971
59680 11194971 11383251 11601306 11850707 12134077 12452855 12807121 13197052 13623639 14088019
59671 14088019 14591151 15134855 15722716 16359154 17047394 17788682 18583435 19432494 20336932
59662 20336932 21297032 22311739 23378356 24491687 25643324 26822393 28017140 29215394
59654 29215394 30403861 31568607 32697679 33783745 34824560 35822096 36781982 37712775
59646 37712775 38623837 39522776 40414568 41302151 42186280 43063961 43927180 44763269 45556308
59637 45556308 46288638 46942501 47501835 47953859 48290355 48508785 48612707 48611050 48517066 48348066
59627 48348066 48125057 47870837 47607435 47355411 47135015 46966401 46867802 46853995 46936862 47126478
59617 47126478 47430780 47854743 48400786 49069648 49859878 50766114 51777887 52879355 54049031
59608 54049031 55259057 56474510 57653232 58746672 59702366 60467861 60994643 61241570 61178814
59599 61178814 60792402 60086815 59083715 57818223 56335402 54687014 52927115 51106995
59591 51106995 49271775 47459257 45699608 44014805 42418164 40913941 39496616 38150521
59583 38150521 36851430 35570744 34281401 32963814 31609839 30223106 28816085 27406429
59575 27406429 26014132 24658607 23355268 22113998 20941051 19841607 18819422 17874854
59567 17874854 17005191 16207250 15478449 14815324 14212640 13664760 13167106 12715877 12307302
59558 12307302 11937652 11603216 11300009 11024396 10774265 10548542 10345066 10159874 9988792
59549 9988792 9828481 9675489 9525873 9376861 9227678 9077592 8924279 8765614 8602176
59540 8602176 8436421 8269951 8103263 7937837 7776611 7622102 7475309 7336618 7206670
59531 7206670 7086247 6976418 6878935 6795291 6725118 6666692 6619344 6584164 6561792 6550699 6548568
59520 6548568 6554588 6569461 6593741 6626972 6668086 6715802 6768852 6826614 6889543 6958495 7033514
59509 7033514 7113674 7198191 7287435 7382754 7485456 7596237 7715735 7845409 7987254 8142491
59499 8142491 8311262 8494205 8693577 8911799 9149331 9405345 9680394 9976891 10296586
59490 10296586 10638946 11002540 11386415 11788949 12206650 12635645 13073535 13518105 13964547
59481 13964547 14405535 14834162 15245618 15636191 16002094 16339564 16644682 16912561 17138180
59472 17138180 17319321 17458310 17560183 17629521 17669564 17683735 17677129 17656634 17630198 17605753 17590157
59461 17590157 17589010 17607554 17651246 17724661 17829740 17965356 18128219 18313195 18512198 18713187
59451 18713187 18901001 19059742 19174844 19233643 19225041 19139794 18971949 18720249 18387985 17981588
59441 17981588 17509727 16983614 16417088 15825055 15221287 14617783 14025859 13456627 12919281
59432 12919281 12418849 11956409 11532046 11147396 10804979 10505571 10247283 10027539 9845144
59423 9845144 9699666 9589450 9511524 9463605 9445227 9456465 9496386 9563599 9657908 9780565 9932725
59412 9932725 10113987 10322291 10554774 10808724 11081956 11372191 11675726 11986789 12298330
59403 12298330 12603039 12892965 13158424 13388402 13572743 13703884 13776526 13786443 13730400 13607245
59393 13607245 13418797 13169833 12867552 12520783 12138904 11730878 11305056 10869642 10432903
59384 10432903 10002494 9584391 9182396 8798600 8434388 8091165 7770454 7473461 7200532
59375 7200532 6950818 6722481 6513546 6322975 6151000 5998232 5864281 5747260 5644651
59366 5644651 5554616 5476558 5410708 5357372 5316424 5287147 5268298 5258445 5256536 5262328 5276153 5298135
59354 5298135 5327776 5364542 5408787 5461453 5522375 5588888 5656516 5721277 5781555 5838359 5894537
59343 5894537 5953869 6020181 6096518 6184927 6287094 6404735 6538682 6687304 6846464 7011823
59333 7011823 7181642 7357481 7542715 7741051 7956433 8193254 8455493 8745623 9065007
59324 9065007 9415423 9799685 10220698 10680565 11180951 11723822 12311382 12945522 13627496
59315 13627496 14357502 15133878 15952757 16808510 17693821 18598611 19509490 20411442 21290461
59306 21290461 22134455 22932551 23675314 24356405 24973300 25525761 26014111 26439274 26803511
59297 26803511 27109629 27358920 27550043 27679758 27744169 27739008 27659227 27499355 27255364 26926761
59287 26926761 26516720 26029914 25470579 24843434 24156268 23420514 22648496 21850298 21033454
59278 21033454 20204944 19372699 18545400 17731556 16938916 16174246 15443219 14750222 14098084
59269 14098084 13487998 12920110 12394541 11911692 11471442 11072329 10711828 10387277 10096336
59260 10096336 9836849 9606717 9403906 9226314 9071759 8938433 8825336 8731949 8657394 8600011
59250 8600011 8557649 8528195 8509919 8501562 8501982 8509538 8521962 8537228 8554450 8573424 8593158 8611377
59238 8611377 8625992 8636860 8645512 8653010 8658709 8661635 8662761 8665099 8671511 8683217 8700826 8725973 8761080
59225 8761080 8807951 8867570 8941110 9030166 9135848 9258470 9398234 9555283 9728754 9916558
59215 9916558 10116248 10324936 10537671 10746923 10944941 11126428 11288348 11427748 11540910
59206 11540910 11624478 11676488 11696256 11684061 11641255 11570259 11474357 11357681 11225077 11081327
59196 11081327 10930344 10775279 10619080 10464440 10313378 10167371 10027684 9895083 9769396
59187 9769396 9650006 9536773 9430119 9330399 9237679 9152031 9073646 9002926 8940970 8889741 8851235
59176 8851235 8826703 8817115 8823951 8848896 8893300 8958785 9048003 9163857 9308292 9482893 9690255
59165 9690255 9933339 10213523 10530740 10885597 11279648 11712678 12180721 12677079 13193904
59156 13193904 13721917 14249672 14764036 15250509 15692510 16071869 16371910 16579970 16686601
59147 16686601 16684005 16567562 16338943 16006373 15581895 15079528 14515562 13908143 13274842 12630689
59137 12630689 11988429 11359350 10752855 10175748 9632661 9126893 8660334 8232930 7842917
59128 7842917 7487740 7164776 6871741 6607009 6369505 6157873 5969753 5802152 5652537
59119 5652537 5519276 5400982 5295883 5202327 5119853 5049198 4990796 4943374 4904393 4871870 4845430
59108 4845430 4825682 4813174 4808160 4810709 4820424 4836330 4857657 4884581 4917663 4956729 5001026 5050558
59096 5050558 5106429 5169303 5237913 5309627 5382413 5455901 5530662 5606849 5683634 5759460 5832498
59085 5832498 5901008 5963711 6020034 6069840 6112844 6148468 6176444 6197152 6210968 6217511 6216335 6208604
59073 6208604 6197303 6185162 6172739 6159321 6145597 6134744 6130699 6135851 6150587 6174466 6207355 6249698
59061 6249698 6302265 6365788 6440735 6527469 6626631 6739028 6864883 7003429 7153655 7315333
59051 7315333 7488975 7675061 7873932 8086304 8312859 8552911 8804369 9065760 9337557
59042 9337557 9620318 9911797 10207013 10500818 10788566 11063686 11316237 11535251 11711875
59033 11711875 11839433 11911748 11923302 11870982 11754471 11575424 11337960 11049954 10721860 10363352
59023 10363352 9981997 9585252 9181795 8779614 8383927 7998089 7625416 7268706 6928908
59014 6928908 6606087 6301437 6016802 5752232 5505537 5274570 5058765 4858089 4671699
59005 4671699 4498325 4337089 4187235 4047671 3917367 3795766 3682455 3576996 3479430 3390142
58995 3390142 3308498 3232379 3160133 3092544 3031638 2977397 2926784 2876524 2825990 2776732 2729857
58984 2729857 2684927 2641215 2598889 2558415 2519486 2481337 2443963 2408298 2375069 2344029 2314566
58973 2314566 2286639 2260810 2237735 2218096 2202524 2190819 2181404 2172508 2164158 2158186 2155780 2155753 2155974
58960 2155974 2155951 2157005 2160092 2164539 2169175 2173689 2178331 2183062 2187854 2193375 2200443 2208863 2217523 2225745
58946 2225745 2233915 2242675 2252126 2262086 2272539 2283384 2294084 2304132 2313771 2323849 2334899 2346660
58934 2346660 2358693 2371290 2385425 2401535 2418498 2434457 2448980 2463882 2481187 2500622 2520094
58923 2520094 2538644 2557843 2579859 2605108 2632355 2660258 2688026 2715383 2743080 2773010 2806620
58912 2806620 2843304 2881480 2921187 2964359 3012201 3063406 3115708 3168368 3222236 3277888 3334884
58901 3334884 3393017 3453328 3517077 3583963 3652269 3721248 3792771 3869638 3952309 4038344 4125583
58890 4125583 4214932 4309101 4409257 4514140 4622355 4734431 4852466 4978623 5114335 5260183
58880 5260183 5415865 5580431 5752908 5933021 6121721 6321254 6534156 6761678 7003485
58871 7003485 7259313 7530263 7817821 8122523 8444977 8787732 9154424 9546989 9965222
58862 9965222 10409328 10881396 11383933 11918642 12487666 13094704 13743321 14434680 15168038
58853 15168038 15943189 16761465 17624411 18531976 19481672 20468557 21485558 22523504 23570536
58844 23570536 24611651 25629520 26605631 27519674 28347819 29063279 29640191 30057672 30301250
58835 30301250 30362833 30241109 29941753 29476371 28861192 28116394 27264974 26330634 25336422
58826 25336422 24304840 23257244 22211462 21180555 20174840 19204305 18277630 17399437
58818 17399437 16570198 15789104 15056041 14370911 13732467 13138473 12586298 12072814 11594196
58809 11594196 11146543 10727043 10334518 9968698 9628718 9312479 9017850 8744178 8491826
58800 8491826 8260268 8047625 7852207 7673550 7511627 7366103 7236675 7122916 7023291 6935680
58790 6935680 6859651 6796909 6748588 6713462 6689935 6678244 6679176 6691988 6715615 6750935 6799624 6861342
58778 6861342 6934308 7018484 7115898 7227514 7351912 7487820 7636334 7799657 7978751 8173161
58768 8173161 8382454 8607137 8848529 9108090 9386694 9684683 10002910 10343307 10708001
58759 10708001 11098608 11517132 11966634 12449752 12967369 13520255 14111383 14744918 15423291
58750 15423291 16147100 16917326 17735184 18599338 19505231 20447549 21421051 22417715 23424473
58741 23424473 24424500 25399121 26327411 27185626 27948907 28593489 29097317 29440723 29608962
58732 29608962 29594670 29397884 29024888 28487874 27804597 26996542 26086864 25099650 24059393
58723 24059393 22989181 21908779 20834364 19779202 18753740 17765431 16819309 15918853
58715 15918853 15066282 14262695 13508310 12802221 12141813 11523360 10943945 10402384 9897907
58706 9897907 9428500 8990954 8581999 8198873 7839375 7502010 7185878 6890095 6613599
58697 6613599 6355607 6115662 5892932 5685923 5493115 5313396 5145796 4989477 4844140
58688 4844140 4709701 4585285 4469295 4360754 4259772 4166310 4079277 3997295 3919645 3845916
58678 3845916 3775497 3708045 3643888 3583343 3526002 3471116 3418241 3367172 3317746 3270076 3224436
58667 3224436 3180471 3136891 3092275 3045889 2997705 2948214 2898270 2848442 2798349 2747323 2695720
58656 2695720 2644611 2593954 2542160 2488071 2432615 2378043 2326235 2278009 2233057 2189928 2146926
58645 2146926 2103804 2062095 2023344 1987706 1954619 1923883 1895265 1867797 1840370 1812707 1785199
58634 1785199 1758130 1731535 1705419 1679752 1654705 1631113 1610106 1591901 1575552 1560146 1545765
58623 1545765 1533093 1522821 1515538 1511345 1509391 1508670 1509473 1512980 1519137 1526118 1532328 1537657 1542211 1545158
58609 1545158 1545870 1545200 1544559 1544299 1543738 1542062 1538637 1533365 1527469 1522976 1520585 1518856 1516208 1512861 1510064
58594 1510064 1508511 1508578 1511111 1516646 1524308 1532606 1541052 1550349 1561536 1575608 1593300 1614477 1638327
58581 1638327 1664668 1694303 1727525 1763263 1800469 1839405 1880752 1924656 1971640 2023282 2080570
58570 2080570 2142374 2206833 2273718 2344367 2420118 2501956 2590931 2687520 2791127 2901398 3019560
58559 3019560 3147454 3285941 3435446 3597229 3772726 3962227 4165580 4383646 4617516
58550 4617516 4866680 5129446 5404851 5692483 5990098 6292341 6591678 6879614 7147187
58541 7147187 7385434 7585864 7740574 7842850 7888622 7876849 7808174 7684578 7511459 7298553
58531 7298553 7056727 6794225 6517201 6232545 5947743 5668283 5397401 5138383 4895021
58522 4895021 4669421 4461140 4269017 4092487 3930874 3783067 3648634 3528057 3421102
58513 3421102 3325670 3238606 3156951 3078420 3001833 2927618 2857115 2791009 2728765 2669539 2612932
58502 2612932 2558773 2506853 2456998 2408984 2362415 2316952 2272421 2228428 2184325 2139846 2095184
58491 2095184 2050322 2005345 1961795 1922155 1886884 1853344 1818934 1784178 1751314 1721218 1693608
58480 1693608 1669100 1648651 1631363 1614919 1598174 1581651 1565826 1550592 1536097 1522382 1508493
58469 1508493 1493687 1479172 1466828 1456551 1446719 1436778 1427177 1417021 1404361 1389065 1373101 1357572
58457 1357572 1341687 1325117 1309057 1294044 1278817 1262433 1245918 1230840 1217623 1206085 1196186
58446 1196186 1187374 1178523 1169366 1160870 1153549 1146548 1139054 1131397 1124106 1117074 1110455 1105445 1103319 1104148
58432 1104148 1106634 1108578 1107740 1103476 1097630 1092645 1088823 1084715 1080015 1076216 1074079 1072330 1069673 1066619
58418 1066619 1064461 1063555 1063391 1063344 1062772 1061230 1059119 1057398 1056454 1055941 1055540 1054928 1053367 1050714 1048528 1048531 1050058
58401 1050058 1050762 1049837 1048745 1048747 1049718 1051572 1054598 1057715 1058571 1056403 1053071 1050434 1048288 1045673 1042476 1038779
58385 1038779 1034164 1028652 1023020 1017434 1011157 1004239 997871 992329 986291 979188 972568 967916 964526 960707
58371 960707 955957 950864 946009 942034 939808 939579 940663 942473 944935 947666 950060 952509 956078 960604
58357 960604 964786 968509 973139 978887 984025 987848 992405 999870 1009754 1020129 1030130 1039922 1049587 1059483
58343 1059483 1070524 1082702 1094300 1103751 1111351 1118195 1124585 1130541 1136719 1143586 1150485 1156489 1161387
58330 1161387 1165271 1168239 1171071 1174906 1179480 1183014 1184626 1185517 1187009 1188950 1190900 1193362 1196723 1200354
58316 1200354 1203855 1207912 1212833 1217450 1220608 1222755 1225209 1228895 1234451 1242347 1252152 1262769 1273815
58303 1273815 1285525 1297222 1307765 1317895 1329927 1344390 1359030 1371947 1383514 1394310 1403732
58292 1403732 1412059 1421346 1432305 1442285 1448475 1451667 1454955 1460021 1466394 1473154 1479642 1485340 1490470 1496120
58278 1496120 1503185 1512069 1523515 1537899 1553328 1566711 1577569 1588651 1602002 1616895 1632673 1650858
58266 1650858 1672748 1697217 1722538 1748290 1773956 1797945 1819665 1840495 1861272 1881082 1899971
58255 1899971 1920196 1942956 1966354 1988545 2010423 2033172 2055710 2076928 2098197 2121279 2145791
58244 2145791 2170846 2197074 2224791 2252438 2279101 2306543 2336537 2368331 2400924 2435523 2473312
58233 2473312 2513030 2553225 2594902 2639483 2686124 2733347 2781461 2831160 2881729 2932670 2985147
58222 2985147 3040057 3096832 3155620 3217947 3283691 3350592 3418561 3491003 3569767 3652419 3736829
58211 3736829 3824624 3917605 4014825 4116079 4224025 4339495 4459015 4580679 4708380 4846244
58201 4846244 4992994 5146045 5307229 5479949 5664469 5860533 6071024 6298431 6541113
58192 6541113 6797259 7068640 7356332 7657329 7970310 8300267 8652300 9025530 9418488
58183 9418488 9835451 10281095 10753729 11250530 11775086 12332788 12922935 13542388 14192850
58174 14192850 14877464 15594485 16341710 17123134 17944054 18804111 19702695 20646545 21644454
58165 21644454 22699897 23817333 25010091 26292548 27669615 29143189 30722866 32419480
58157 32419480 34233191 36158517 38195824 40347851 42612524 44992561 47507415 50185308
58149 50185308 53051818 56139201 59497420 63180518 67231051 71694441 76639613 82149805
58141 82149805 88307187 95209213 102989246 111800209 121795232 133153719 146110141 160919211
58133 160919211 177792364 196874339 218238419 241887179 267863932 296445042 327986629
58126 327986629 362046947 396268297 426241744 446983936 455117023 450122465 433970639
58119 433970639 409831501 380930454 349957954 318867282 288886106 260693287 234652993
58112 234652993 210962290 189700118 170858763 154374927 140128609 127937846 117598832
58105 117598832 108939963 101826523 96131943 91732389 88514197 86346340 85035752 84323085
58097 84323085 83912660 83484712 82696470 81229219 78880158 75624312 71599884 67045873
58089 67045873 62234737 57412219 52754079 48359867 44279677 40540347 37152647 34112304
58081 34112304 31405334 29010113 26894663 25020371 23352477 21863819 20529822 19326931
58073 19326931 18236837 17246206 16341056 15505938 14728595 14000904 13316018 12669369 12061482
58064 12061482 11494611 10967153 10475355 10018359 9596189 9204592 8837681 8494321 8175900
58055 8175900 7878700 7594368 7317506 7047473 6783542 6524147 6270917 6027950 5796607
58046 5796607 5575305 5364039 5164363 4975180 4793310 4618304 4452317 4295355 4144855
58037 4144855 3999764 3860832 3727170 3596690 3469731 3348117 3231060 3116158 3004135
58028 3004135 2898280 2799405 2705588 2616599 2534036 2457025 2382457 2310169 2243601 2184283 2129417
58017 2129417 2075910 2023598 1973601 1926571 1883196 1843651 1805987 1767565 1728382 1690633 1655311
58006 1655311 1621852 1590579 1562411 1536470 1511061 1486714 1465188 1445830 1426276 1406389 1387981
57995 1387981 1370810 1352562 1332990 1314387 1297498 1280563 1263097 1247138 1233594 1220391 1205510
57984 1205510 1189398 1173532 1158982 1147094 1139063 1133942 1129128 1123457 1117966 1113443 1109464 1106087 1104150
57971 1104150 1103426 1102552 1100943 1098825 1095485 1089993 1083664 1079183 1076871 1074234 1069659 1064285 1059711 1055921
57957 1055921 1051966 1046932 1040112 1031938 1024571 1019659 1015827 1010500 1003589 996811 989874 980434 967920 954492
57943 954492 941842 929838 918691 909697 903097 897685 893130 890289 888729 886401 882435 878045 874135
57930 874135 870203 866020 862238 858967 855962 854354 855727 859245 862270 864139 866631 870389 873856 876371
57916 876371 879281 882978 885764 886855 887766 889384 890326 889678 888851 889016 888849 886616 882604 877985 873022 867799
57900 867799 863020 858641 853400 847002 841187 837346 834586 831377 827615 823897 820335 817146 814874 812972
57886 812972 809862 805531 802328 801931 803286 804957 807752 813200 820683 827801 832662 834473 833024 829142
57872 829142 824864 821578 818336 812938 804221 792665 779526 766111 753264 740953 728935 717876
57860 717876 708752 701131 693496 685621 679030 674666 671777 669775 669431 671251 674268 677630 682047 688515
57846 688515 696689 705565 714731 724042 732964 741115 748671 755714 762063 767992 773908 779026 781800 782060
57832 782060 781233 780052 777744 773947 769515 764598 757809 748333 737291 726084 715081 704877 696990
57819 696990 691881 687820 683049 677749 672801 668151 663751 660728 660131 661647 664657 669312 675394 681560
57805 681560 687092 693143 700947 710003 719245 728588 737871 745616 750510 753170 754952 755954 755476 753391
57791 753391 749689 743770 735684 727068 719325 711755 702944 693065 683340 674092 664908 655992 647840 640180
57777 640180 632622 625671 619798 614243 608171 602321 597980 594904 591648 587517 582799 577485 571097 563623
57763 563623 555537 547083 538278 529226 519797 509648 499098 489073 479600 469581 458922 449533 443139
57750 443139 439380 437199 436497 436886 436434 433924 431352 431964 436340 442322 448228 454095 460122 465993 471897
57735 471897 478539 485840 492788 498562 502926 505886 507980 510358 513476 516299 517979 519513 522398 526420
57721 526420 530299 533725 536974 539193 539025 536610 533074 528327 521366 512709 504530 498091 492679 487366
57707 487366 482265 477656 473293 469058 465307 462311 460180 459250 459580 460350 460874 461810 464099 467146 469680
57692 469680 472166 476461 482980 489975 496110 502103 509178 517229 525228 532448 538624 543745 548318 553364
57678 553364 559779 567905 577335 586591 593728 598490 603423 611443 622450 633754 643622 652801 662538 673028
57664 673028 684417 697617 713021 729438 745355 760668 776486 793676 812134 831250 850973
57653 850973 872621 898242 928415 960918 992464 1021765 1050224 1080020 1112586 1148635 1188194
57642 1188194 1230339 1273970 1319199 1367207 1418703 1473408 1531005 1591646 1655570 1723243 1795788
57631 1795788 1874222 1958409 2048007 2144391 2250244 2367141 2494908 2633541 2784214 2947942
57621 2947942 3124802 3315302 3521256 3744289 3984196 4239338 4507674 4786449 5071365
57612 5071365 5356858 5637072 5906437 6159713 6391300 6593327 6753818 6857726 6891500 6848296
57602 6848296 6730532 6548788 6317951 6052835 5766114 5469290 5173613 4888152 4617320
57593 4617320 4361914 4122716 3901794 3700630 3519080 3356861 3214411 3091361 2985414
57584 2985414 2893776 2814891 2748082 2692508 2647326 2612133 2586398 2568964 2558743 2555420 2559075 2569671
57572 2569671 2587321 2612462 2645284 2685485 2732969 2788357 2852668 2926854 3011552 3106638 3211180
57561 3211180 3324706 3448385 3583936 3731473 3889578 4057225 4233740 4416383 4599677
57552 4599677 4778038 4947571 5104165 5241080 5350043 5424343 5460132 5455679 5410836 5327145
57542 5327145 5207592 5056332 4879051 4683020 4475798 4263630 4051070 3841435 3637103
57533 3637103 3439814 3251223 3072977 2906104 2750785 2606878 2474146 2351861 2238871
57524 2238871 2134296 2037615 1948141 1865382 1790002 1723198 1664560 1611522 1561510 1513765 1468669
57513 1468669 1426530 1387873 1353850 1325067 1300408 1277939 1256733 1237198 1220138 1206131 1195358
57502 1195358 1187238 1180505 1174227 1168641 1164655 1162887 1163493 1166555 1172193 1180429 1191007 1203086 1215539
57489 1215539 1228314 1243170 1261903 1283919 1307004 1330697 1357237 1388545 1423780 1460913 1499384
57478 1499384 1540042 1583582 1630421 1681352 1736984 1796956 1860806 1929282 2003944 2085784 2174859
57467 2174859 2270862 2373483 2482920 2600433 2727370 2862842 3003476 3146466 3291548 3438368
57457 3438368 3582765 3717554 3836642 3936686 4014866 4067169 4089821 4081433 4043024 3976553 3884200
57446 3884200 3769158 3636816 3494468 3348757 3202923 3057282 2912817 2773208 2642424
57437 2642424 2521343 2408246 2302122 2204029 2115397 2036518 1967089 1907078 1856459 1814564 1779995
57426 1779995 1751004 1726186 1705354 1689636 1680344 1677921 1682109 1692436 1708124 1728332 1753287 1784340
57414 1784340 1821947 1864462 1910218 1960169 2016967 2081809 2153804 2232285 2317894 2410953 2510415
57403 2510415 2615280 2725994 2843516 2967548 3096137 3226301 3354371 3476261 3588059
57394 3588059 3686129 3766191 3822632 3849473 3842687 3801984 3730585 3633131 3513600 3375202 3221836
57383 3221836 3058654 2890698 2721536 2553736 2389878 2232269 2082149 1940226 1807794
57374 1807794 1686428 1576517 1476725 1384842 1298807 1217435 1140980 1070751 1007446 950098 897280
57363 897280 848837 805463 766953 731926 699175 668356 639455 612425 587128 562842 538276
57352 538276 513234 489851 470654 455430 441364 426376 410878 396021 381883 368094 354829
57341 354829 342110 329119 315370 302044 291193 283736 278745 274564 270265 266242 263466 261974 260397
57328 260397 257614 254611 253516 254632 255587 253997 250097 246068 243559 242576 242232 241677 240458 238580 236308
57313 236308 233801 231160 228835 227528 227535 228564 230198 231959 232999 232597 231323 231002 233002 237021 241817
57298 241817 246609 251510 257180 264398 273450 283582 293467 302426 310728 318767 326862 336025 347764 362280
57284 362280 377566 391093 401977 410898 418521 424811 429611 433126 435988 439310 444398 451809 460813
57271 460813 470194 479443 488965 499453 511338 524358 537301 548771 558844 569538 582834 598414
57259 598414 614051 628096 640898 653807 667467 681342 694492 706495 717690 728723 740053
57248 740053 752084 765511 780893 797770 814960 832222 851005 872836 897356 922686 947476
57237 947476 971757 995986 1020354 1045392 1072365 1102301 1135022 1169727 1206209 1244709 1284612
57226 1284612 1324279 1362772 1401184 1441382 1483569 1525955 1566887 1606199 1643885 1678513 1708149
57215 1708149 1732323 1751827 1766845 1776686 1781440 1782296 1779525 1771392 1756054 1733848 1706918 1677417
57203 1677417 1646950 1616968 1588226 1560091 1531676 1503888 1479352 1460010 1445553 1434464 1425730
57192 1425730 1419001 1413753 1409311 1405711 1403882 1404577 1407315 1410704 1413819 1417093 1421721 1428503 1437566 1449029
57178 1449029 1463265 1480220 1498924 1518165 1537590 1557757 1579150 1601513 1624359 1647812 1672530
57167 1672530 1698602 1724954 1750367 1774995 1800103 1825976 1850858 1872745 1891789 1910025 1929090
57156 1929090 1949351 1971231 1995969 2024467 2056309 2090593 2127117 2166157 2207652 2251083 2295561
57145 2295561 2339547 2381224 2419955 2457054 2494545 2533602 2574583 2617886 2663927 2712708 2764156
57134 2764156 2818500 2875636 2934599 2994498 3055537 3118153 3181507 3243773 3303646 3360440 3412982
57123 3412982 3459852 3501066 3538365 3573305 3605912 3635680 3663103 3689543 3716059 3742851 3769487
57112 3769487 3795313 3819940 3843514 3866098 3886773 3904146 3918092 3930200 3941836 3952395 3960238
57101 3960238 3964908 3967330 3967907 3965524 3959083 3949529 3939745 3932602 3929617 3931480 3939087 3953165 3972729 3994508
57087 3994508 4014492 4030003 4040145 4044663 4043076 4034870 4019755 3997266 3966408 3925914 3874611 3811254
57075 3811254 3734258 3641812 3531956 3402136 3248642 3066594 2850436 2594657 2294616 1947198
57065 1947198 1550599 1103307 603319 48130 -565274 -1241135 -1985416 -2805193 -3707513 -4699229
57055 -4699229 -5787565 -6979952 -8282870 -9701668 -11242801 -12916981 -14740035 -16730390
57047 -16730390 -18905972 -21284362 -23886553 -26740438 -29880847 -33347974 -37188096 -41456279
57039 -41456279 -46216550 -51538240 -57493278 -64158221 -71617843 -79965253 -89298589 -99715901
57031 -99715901 -111304446 -124119883 -138157869 -153322244 -169389962 -185988510 -202637195
57024 -202637195 -218895204 -234554433 -249694296 -264453227 -278612596 -291319733 -301225737
57017 -301225737 -306982190 -307746301 -303375648 -294290513 -281223042 -265050966 -246731140 -227237517
57009 -227237517 -207454133 -188068251 -169528750 -152079884 -135829809 -120811888 -107023106
57002 -107023106 -94442441 -83036465 -72759591 -63555393 -55360421 -48106910 -41722260
56995 -41722260 -36128148 -31242683 -26984588 -23276290 -20045473 -17226523 -14761750 -12601175
56987 -12601175 -10701608 -9026473 -7545592 -6233151 -5065089 -4018837 -3075093 -2218517
56979 -2218517 -1436668 -719836 -62255 538414 1084345 1579692 2028955 2434530 2797516 3120598
56969 3120598 3408932 3668510 3904866 4123155 4327836 4521216 4702538 4868924 5017571
56960 5017571 5147952 5262885 5367488 5466214 5560438 5648756 5729151 5800476 5862447 5915193 5959020
56949 5959020 5994424 6022769 6047282 6072402 6101268 6134997 6176106 6230967 6304001 6386387 6452442
56938 6452442 6471372 6425144 6316149 6159807 5972189 5763720 5539797 5302957 5054166 4794734
56928 4794734 4528763 4263323 4005457 3759351 3526746 3309154 3108167 2923369 2751047
56919 2751047 2585927 2424174 2264744 2108723 1958247 1815761 1683263 1561581 1450477
56910 1450477 1349498 1258480 1177286 1105495 1042603 988282 942195 903658 871737 845658 824998
56899 824998 809516 798851 792174 787706 782450 772865 756446 732894 703655 670527 635193 599882
56887 599882 567235 538627 513096 488885 465787 445078 427409 412016 398323 387072 379176 374299
56875 374299 371440 370385 371785 376155 383494 393466 405070 416082 423468 424580 417987 403698 383164
56862 383164 358813 332913 306643 280191 253329 225757 197680 170587 146737 127161 110705
56851 110705 95804 82505 71724 63207 55763 49346 45219 43751 43483 43034 42719 43448 44978 46258
56837 46258 46956 47759 49427 52327 56736 63039 71609 82763 96654 113127 132065 154028 179786
56824 179786 208654 237884 264469 287327 307129 324452 339016 350479 358887 364229 366657 367606
56812 367606 369719 374821 382486 391400 401622 414473 430504 448969 469606 493722 522721 556500
56800 556500 594133 635006 677522 717044 747250 764442 769572 765542 753967 735642 712870 689353
56788 689353 667862 649403 634620 624587 619805 619719 624056 633891 650626 674414 704284 739457 779880
56775 779880 825674 876649 931908 988811 1041923 1083966 1108961 1114896 1103461 1077765 1041001 996826
56763 996826 949476 902394 857174 814562 776054 743574 717935 698813 686325 681365 684026 692899
56751 692899 706703 725657 750344 779945 812394 845404 876195 900848 915467 918191 909287 889580
56739 889580 860008 822752 781457 739596 699020 660341 624176 591657 564045 542092 525656
56728 525656 514011 506765 504348 507409 516012 529561 546945 566339 585466 602598 616674 626028
56716 626028 628115 621764 608907 592662 574176 552820 528976 504680 481390 458909 436979 416375
56704 416375 397804 380995 365533 351573 339175 327967 317934 309475 302347 295683 289448 284577
56692 284577 281085 277472 272762 267808 263688 260099 256395 252933 250131 247346 244141 241724 241524 242930
56678 242930 244001 243975 243579 243180 242198 240439 238661 237573 237185 237144 236861 235485 232870 230462 230033 231369 232354
56661 232354 231554 229739 228563 228797 230303 232762 235742 238657 241354 244273 247556 250419 251937 252128 251707
56646 251707 251027 249902 248459 247554 248015 249758 251977 254154 256437 258907 260972 262020 262446 263220 264318
56631 264318 264369 262348 259031 256172 254642 254072 253920 253955 253635 252011 248836 245382 243642 244663 247826 251546
56615 251546 254402 255642 255096 253121 250796 249742 251199 255012 259579 262867 263674 262351 260567 259993 260853
56600 260853 261982 262615 263556 265929 269323 272252 274276 276436 279431 282504 284555 285349 285112 283836 281666
56585 281666 279243 277033 274782 272113 269112 265989 262860 260206 258710 258029 256565 253271 249166 246320
56571 246320 245771 246906 248316 248659 247284 244681 241999 239798 237865 236469 236673 238719 241110 242261 242206
56556 242206 241753 240893 239287 237636 237114 237781 238780 239856 241539 244001 246810 249800 253176 256730 259719
56541 259719 261581 262326 262425 262785 264301 266767 268758 269213 268645 268151 268053 268304 269246 270811 271874 271811 271988 274139
56523 274139 277836 281119 283155 284679 286225 287746 289754 292972 296837 300125 303050 306891 311404 314760
56509 314760 316560 318818 322981 327748 331119 333163 335425 338599 342101 345288 348114 351086 355308 361901
56495 361901 370604 379504 386897 392914 398671 404352 408883 411291 411787 411507 411377 411132 409619 406396 402654
56480 402654 399767 397260 393302 387333 381107 376812 375098 375191 375966 376444 376045 374856 373206 370947 367871
56465 367871 364654 362210 360065 356700 351876 347261 344198 342062 339511 336303 333152 330743 329651 330267
56451 330267 331955 333062 332560 331044 329473 327670 324851 321013 317004 313692 311576 310803 311062 311897 313302
56436 313302 315353 317143 317172 315282 313284 313055 314836 317838 321500 325395 328830 331415 333464 335263 336612
56421 336612 337536 338599 340011 341342 342696 345164 349340 354281 358644 361989 364414 366093 368021 371963
56407 371963 378474 385918 392516 398377 404390 410302 415499 420771 427462 435285 442608 448721 454285 459718
56393 459718 464599 468723 472383 475458 477353 477923 477342 475064 470210 463430 457291 454194 454356 456047 457182
56378 457182 456445 453624 449354 444395 439020 433202 427169 421432 416363 412127 408805 406186 403623 400606
56364 400606 397404 394807 393445 393616 395364 398101 400387 400814 399344 397571 397502 399910 403468 405492 404062
56349 404062 399785 395283 392863 392898 394157 394947 394019 391348 388233 385924 384131 381929 379927 379941 382129 384221
56333 384221 384466 383836 384161 385564 387212 389375 392888 397228 400827 402997 404219 404818 404701 404245 404221 404806
56317 404806 405574 406332 407255 408433 409988 412339 415686 419606 423772 428463 433726 438742 442831 446480 450561
56302 450561 455153 459818 464202 467716 469694 470843 473340 478304 484255 489358 493940 499149 504426 508498
56288 508498 512002 516701 522404 527018 529784 532289 535874 539867 542929 544634 545182 544918 544795 546226 549839
56273 549839 554952 560460 565747 570934 576923 584810 594397 603820 611639 618684 626675 635848 645528 656338
56259 656338 669781 685719 702167 717656 732199 745934 758693 771184 784786 799627 814353
56248 814353 828397 843039 859581 877508 895022 910525 923287 933539 942203 949926 956509 962003
56236 962003 967856 975826 986030 997208 1008511 1019812 1030908 1042054 1054830 1070692 1088949 1107987
56224 1107987 1128126 1151210 1177557 1205660 1235084 1267382 1303667 1343388 1386050 1432108 1481471
56213 1481471 1533160 1587252 1645326 1708235 1775353 1847017 1925854 2014407 2112853 2220148 2335992
56202 2335992 2460509 2593270 2733966 2883333 3042566 3212446 3393462 3585833 3788880
56193 3788880 4001117 4221013 4446654 4674697 4901013 5122307 5335612 5536376 5719106
56184 5719106 5880165 6017902 6129742 6211577 6261097 6279793 6270727 6236190 6178576 6101598 6009079
56173 6009079 5903613 5787211 5661895 5529022 5389632 5246071 5101371 4956150 4808081
56164 4808081 4655580 4500190 4344260 4188243 4031752 3875464 3720326 3566298 3413492
56155 3413492 3263344 3117302 2975517 2837972 2705729 2580015 2461438 2351048 2250450
56146 2250450 2159540 2075628 1996220 1921414 1852473 1789540 1731975 1679412 1631191 1586174 1544328
56135 1544328 1506928 1474099 1444006 1415792 1391323 1372272 1357255 1343650 1330674 1318911 1308524
56124 1308524 1299841 1294137 1291844 1291400 1291686 1294058 1299971 1308231 1316788 1325744 1336297 1348201 1360794 1375305
56110 1375305 1393405 1414396 1436338 1459254 1484766 1513128 1542933 1573226 1603760 1633807 1662886
56099 1662886 1692050 1722232 1751975 1779120 1804283 1830245 1858150 1886621 1914525 1942455 1971421
56088 1971421 2002144 2035983 2074923 2120376 2173127 2234173 2304367 2383681 2472235 2571549 2683393
56077 2683393 2807981 2944708 3093903 3256126 3430096 3612612 3799774 3986764 4167375
56068 4167375 4335806 4489063 4626917 4750549 4862098 4963566 5053895 5127981 5180349 5208908
56058 5208908 5213972 5195880 5156145 5099302 5030291 4950411 4857969 4751815 4631689 4496396 4345000
56047 4345000 4179767 4005582 3826979 3648103 3474426 3311139 3159877 3019814 2891804
56038 2891804 2778723 2681881 2599874 2531027 2474372 2428087 2389556 2357246 2330448 2307431 2286319
56027 2286319 2267572 2252883 2241498 2230232 2217377 2204102 2191731 2180070 2168880 2158705 2149744
56016 2149744 2141812 2135725 2132896 2133384 2136130 2141064 2149066 2159985 2172552 2186231 2201371 2217849 2235370
56003 2235370 2254645 2276443 2299986 2324143 2349561 2377709 2408724 2442067 2478042 2516366 2554772
55992 2554772 2591875 2630111 2672741 2719106 2766185 2813615 2863390 2915459 2967725 3020238 3075434
55981 3075434 3133974 3193832 3253873 3315252 3379142 3445967 3516645 3591702 3669644 3749327 3833192
55970 3833192 3924644 4022869 4124010 4227054 4334711 4448870 4569258 4696453 4832227 4976746
55960 4976746 5129087 5290501 5463664 5649196 5846617 6058026 6286556 6531656 6790056
55951 6790056 7060828 7345276 7642790 7951775 8274331 8615107 8975755 9355014 9753598
55942 9753598 10174317 10618412 11086939 11584509 12115912 12680168 13273755 13898188 14557701
55933 14557701 15251035 15973379 16725863 17515313 18344982 19213702 20124235 21084282 22099280
55924 22099280 23172925 24315180 25540742 26858579 28271296 29784694 31408279 33145627
55916 33145627 34993867 36953087 39026680 41213596 43513234 45940079 48523092 51291511
55908 51291511 54274635 57515408 61068819 64985529 69312727 74113132 79468319 85464954
55900 85464954 92198742 99794322 108401592 118173817 129276960 141925066 156380454 172917126
55892 172917126 191811645 213360759 237858542 265548213 296601809 330972098 367845091
55885 367845091 404866672 437954385 462347593 474447829 473151068 459817733 437229197
55878 437229197 408478562 376332700 342989473 310022352 278455272 248926424 221827014
55871 221827014 197357478 175554803 156335668 139532312 124910696 112203628 101159953
55864 101159953 91565054 83223499 75948316 69575974 63974772 59030883 54639599 50715007
55856 50715007 47193593 44020856 41143907 38520080 36120623 33920744 31895456 30027974
55848 30027974 28311107 26735438 25284222 23942181 22699611 21544621 20460950 19437769
55840 19437769 18473630 17567063 16710879 15899038 15131365 14407508 13722897 13074126 12462101
55831 12462101 11886634 11343748 10831049 10349849 9899392 9474786 9073248 8696788 8346266
55822 8346266 8018390 7710832 7424416 7157554 6904192 6660330 6427589 6207623 5998011
55813 5998011 5796454 5604101 5421723 5247128 5079137 4919757 4769584 4625275 4484375
55804 4484375 4348755 4220717 4099644 3985046 3878886 3781789 3690083 3599000 3505695 3407543
55794 3407543 3301637 3188697 3073854 2960896 2848965 2737139 2628505 2526707 2431805 2342501
55784 2342501 2259536 2183894 2114324 2049595 1990972 1939850 1895040 1854688 1818745 1787304 1758763
55773 1758763 1731793 1707082 1685101 1664295 1643317 1622712 1602446 1580232 1554501 1526786 1498900
55762 1498900 1470019 1438861 1406574 1374892 1343229 1310122 1276028 1242329 1208993 1175521 1143031
55751 1143031 1113208 1086102 1060849 1037688 1017555 1000429 985427 971800 958949 946591 935733
55740 935733 928116 923863 921127 918783 917671 918320 919452 919824 919643 918979 916748 912440 906891 900195 891089
55725 891089 879840 869399 861837 855560 847937 838919 830253 822801 816500 811318 806418 799721 789922 777553
55711 777553 762854 744733 723583 702967 686179 672743 660373 648605 638124 628220 617665 606886
55699 606886 596643 585676 572471 558478 546638 537077 527040 515032 502431 490658 479136 466772
55687 466772 453745 441047 429321 418605 408462 398404 388886 381478 377063 374341 371281 367642 364861
55674 364861 363784 363775 363900 363802 363338 362262 360347 357373 353347 349161 346214 344544 342105 336997 329900 323294
55658 323294 318786 316154 314399 312477 309308 304383 298548 293440 290092 288516 288318 289146 290744 293009 295802
55643 295802 298610 300935 303137 305932 308765 309851 308464 306171 305037 305570 307135 309291 311737 313865
55629 313865 315569 317779 321227 325388 329627 334591 341244 349063 356425 362502 367808 373026 378105 382312
55615 382312 384496 383492 378935 371688 363321 355397 349099 344745 341526 338448 335543 333341 331446 329105
55601 329105 327177 327655 330732 334222 336746 339572 344147 349605 354330 358409 362642 366300 367963 368022 368443
55586 368443 370125 371744 371174 367245 360511 353052 346901 341996 336364 328945 321061 314266 308109 301336
55572 301336 294068 287105 280013 271666 262167 252543 242905 232578 222001 212947 206523 201930 197554 192685
55558 192685 188089 185120 184061 183313 180851 176547 172097 168517 165081 161153 157443 154541 151850 149147
55544 149147 147740 148565 150285 150785 149585 147493 145041 142688 141436 141481 141202 139152 136256 134401 133677 132735
55528 132735 131093 129341 127649 125856 124514 124100 123583 121402 117552 113323 109508 106280 104123 103289 102909
55513 102909 102290 102380 104345 107401 109935 112044 114890 118145 120356 121488 122795 124357 125115 125371 126807
55498 126807 129578 131677 131803 130833 129676 127615 123851 119174 115053 112097 110097 108607 106982 104849 102891
55483 102891 102129 102224 101691 100194 99365 100757 103984 107419 109923 111451 112694 114492 117199 120545 124423
55468 124423 129185 134430 138311 139469 139189 140057 142678 145334 146860 148103 150173 152712 154469 154455 152242
55453 152242 148149 143449 139436 136124 132676 128971 125693 123037 120474 117635 114225 109317 102186 93799
55439 93799 86137 80097 75403 72228 71056 70888 69587 66538 63429 61890 61741 61926 61769 60840 58972 56920
55423 56920 55875 55960 56315 56742 57892 59648 60773 60446 58866 56275 52939 50167 49463 50249 50195 48368 46364
55406 46364 45720 45953 45919 45491 44981 44369 43953 44401 45346 45287 43640 41568 40085 38719 36861 35030 33968
55389 33968 33749 34486 36569 39475 41741 42758 43129 42783 40692 37347 35392 36377 38611 39697 39484 38965
55373 38965 38077 36615 35829 36858 38487 38608 37220 35994 35519 35028 34520 35095 37072 39395 41025 41635
55357 41635 41014 39178 37152 36348 36921 37708 37844 37569 37409 37454 37555 37558 37379 37344 38205 40155 42142 42920 42503
55338 42503 41855 41425 40761 39500 38008 37055 37381 39406 42826 46558 49423 50757 50279 47968 44483 41168
55322 41168 39060 38258 38517 39785 41688 43162 43343 42411 41047 39524 37839 36182 34737 33393 32072
55307 32072 30887 29749 28539 27893 28842 31191 33190 33481 32444 31043 29420 27558 26301 26445 27408 27863
55291 27863 27283 26010 24394 22818 22097 22802 24385 25673 26072 25787 25306 25091 25258 25160 23940 21811 19875
55274 19875 18397 16522 14278 13389 14984 17732 19516 19924 19876 19915 20283 21682 24287 26807 28140 29216
55258 29216 31474 34160 35082 33682 31428 29329 27047 24675 23389 23674 24330 24073 23088 22418 22597 23437
55242 23437 24533 25602 26614 27663 28474 28482 27891 27988 29514 31328 31803 31049 30394 30041 28822 26428 24446
55225 24446 24636 27122 30563 33379 34612 34468 34283 35373 37764 40402 42296 42879 41807 39486 37447
55210 37447 37096 38125 39151 39629 39971 40103 39410 38260 38080 39398 40934 41159 39854 37721 35414 33571
55194 33571 33087 34583 37680 41019 42980 42720 41000 39676 39827 40770 41525 42539 44884 48229 51070 52836
55178 52836 54302 55699 55853 53727 49906 46038 43514 42875 43697 44753 44927 44152 42915 41179 38753 36563
55162 36563 36259 38254 41142 43263 43949 43163 41085 38515 36791 36884 39074 43333 48988 54093 56539 56146
55146 56146 54543 52752 50248 46797 43710 42253 41952 41618 41304 42173 44823 48595 52284 54960 56371
55131 56371 57048 57839 59065 60400 61534 62451 63035 63078 62778 62505 62008 60710 58903 57698 57542 57762 57820 57900
55113 57900 57776 56385 53364 50093 48199 47643 47137 45987 44647 43775 43409 42959 41645 39246 36656 35251
55097 35251 35475 36633 38190 40343 42891 44630 44748 44160 44464 45935 47367 47636 46696 45231 43961 43197
55081 43197 42597 41476 39703 38112 37686 38644 40607 43256 46294 48978 50338 50040 48885 48284 49033 50419
55065 50419 50808 49518 47861 47789 49723 52440 54848 56928 58957 60958 63251 66630 71510 77459 83636
55050 83636 88884 91567 90726 87809 85972 86993 89818 92513 94286 94931 93877 91076 87822 85457 84131
55035 84131 83757 84938 87553 89616 89490 88504 89344 92146 94223 93823 92163 91285 91625 92521 93697 95154
55019 95154 96501 97401 98097 98760 98860 97932 96596 96119 97139 99268 101716 103777 104838 104463 102697 100170
55003 100170 97799 96326 95882 95921 95724 95106 94555 94641 95339 95909 95336 93046 89497 86211 84952 86568 90434
54986 90434 94897 98294 99793 99582 98437 97053 95727 94493 93450 92891 93139 94168 95331 95693 94877 93517
54970 93517 92689 93053 94724 97566 101054 104026 105331 104839 103319 101324 98947 96764 96104 97751 100867
54955 100867 103789 105588 106484 107086 107713 108295 108567 108423 108214 108432 109043 109460 109323 108906 108659 108824 109635 111224
54937 111224 113023 113894 113333 112027 110811 109652 108222 106896 106385 106670 107014 106907 106401 105659 104759 103913 103301
54920 103301 102687 101583 99861 97948 96462 95888 96465 98057 100143 102176 103935 105517 107155 109158 111668
54905 111668 114345 116602 118375 120352 123178 126699 130211 133281 136196 139820 144984 151649 158703 165076
54891 165076 170995 177579 185271 193601 202481 212541 223697 234627 244594 254910 267522 282658 298773
54878 298773 314248 328143 339633 347855 352308 352750 348911 340970 330026 317337 303348 288158 272501
54865 272501 257323 242725 228380 214816 203203 193882 186216 179962 175637 173269 171976 171254 171649
54852 171649 173443 175623 177040 177951 179435 181759 184455 187847 193149 200577 208510 215513 222666 232608
54838 232608 246202 261260 275079 287234 298930 310317 319756 325639 327610 325758 319756 309481
54826 309481 295740 279802 262760 245724 229836 215518 202265 189707 178260 168251 159237 150917
54814 150917 143892 138600 134100 129068 123667 119422 117382 117249 118084 118910 118747 117065 114488 112409 111734
54799 111734 112299 113365 114185 114314 113836 113203 112523 111385 109774 108507 108137 107928 106734 104408 101604 98728
54783 98728 96021 94094 93176 92234 90097 87244 85266 84731 84843 85077 85678 86429 86382 85282 84036 83348 82997
54766 82997 82846 83423 84880 86435 87545 88877 91391 95113 99245 102900 105364 106412 106901 108354 111386
54751 111386 115039 117894 119287 119233 118217 117505 118742 122526 128036 134480 141999 150457 158445 164631 169477
54736 169477 174540 180549 187239 194720 203744 214591 226750 239931 254581 271059 288816 306663
54724 306663 323482 338591 351783 363161 372621 379439 382618 381806 377696 371497 364084 355644 346025
54711 346025 335479 325028 315892 308456 302066 295987 290218 285105 280640 276748 274102 273857 276312 280287
54697 280287 284305 288098 292522 298061 304139 310286 317548 327956 342475 359990 378527 397024 415744
54684 415744 435596 457476 481722 507512 532971 556374 576912 593801 605249 609262 605285 594209
54672 594209 577083 554950 529803 504228 479503 455035 430214 405937 383600 363344 344181
54661 344181 325530 307956 292565 280029 269956 260981 251911 243049 235842 230881 226864 222086 216423
54648 216423 211195 207440 204961 202799 200067 196552 193080 191120 191454 193263 194933 195613 195660 195809 196482 197724
54632 197724 199140 199841 199066 197215 195913 196680 199468 202614 204261 203959 202897 202583 203412 204795 206508 209237
54616 209237 213469 218368 222350 224679 226092 227902 230860 234815 239166 243573 248323 253926 260237 266242
54602 266242 271108 275313 280252 286614 293497 299433 304072 308440 313539 319100 324078 328135 332108 336877
54588 336877 342300 347608 352556 357821 364467 373334 384695 398087 412622 427826 444068 461937 481604
54575 481604 503203 527253 553848 581678 608769 634083 657439 677895 693365 702221 704384 700449
54563 700449 690652 675286 655353 632048 606064 578060 549395 521697 495837 471730 448978 427499
54551 427499 407802 390834 377098 365728 354998 344100 333813 325030 317278 309405 301172 293328
54539 293328 286308 279601 272454 264666 256668 249183 242797 237644 233527 230396 228341 226931 224946 221186
54525 221186 215371 208082 200153 192348 185206 178814 172970 167787 163767 161057 159065 157063 154698 151800
54511 151800 148383 145252 143763 144291 145534 146089 146160 146843 148233 149268 149297 148774 148335 147998 147441 146467 145153
54494 145153 144052 144210 146349 149894 153256 155112 155081 153514 151374 150201 151241 154163 157304 159528 161453
54479 161453 164494 169152 174630 179861 184547 189277 195033 202559 211968 222709 233964 245244 256733
54466 256733 268972 282029 295013 306675 316476 324834 332400 339542 346467 353015 357882 358763 354159
54453 354159 344965 333705 322244 310716 298558 285882 273493 261886 250686 239244 227723 217189
54441 217189 208265 199978 190674 180195 170408 163170 158460 155035 152326 150781 150575 150824 150237 148157 145010
54426 145010 141997 140095 139077 137797 135901 134808 136276 140171 144396 147117 148439 149736 151847 154233
54412 154233 155693 155638 154651 153807 153535 153341 152619 151454 150537 150602 151907 153845 155030 154464 152818 151920 152669
54395 152669 154176 155271 155926 156504 156538 155341 153350 151768 151044 150539 149493 147584 144795 141578 138999 137938
54379 137938 138121 138488 138317 137513 136249 135006 134568 135119 135647 135124 133980 133462 133856 134297 134210 133809 133191 132049
54361 132049 130486 129264 129033 129923 131851 134531 137339 139965 142952 146806 150918 154442 157855 162339 167825
54346 167825 173140 177996 183168 188533 192719 195325 197780 201163 204715 207577 210586 214935 220011 224006
54332 224006 226071 226694 226427 225451 224159 223125 222464 221840 220959 219612 217586 215000 212330 209643 206302 201907
54316 201907 196961 192083 187234 182371 178164 175155 172694 169665 166010 162773 160848 160385 161080 162357 163549
54301 163549 164538 165799 167188 167328 165234 162058 159960 159507 159499 159344 160085 162560 165793 168167 169441 170749
54285 170749 173048 176302 180041 184000 188062 191911 194968 196768 197536 198359 200467 204111 208175 210893 210984
54270 210984 208403 204387 200709 198401 197035 195385 192732 189225 185049 179935 173793 167438 162128 158462
54256 158462 156062 154247 152581 150709 148154 144690 140686 136665 132636 128391 124429 121867 120998 120539 119022
54241 119022 116576 114598 113830 113612 113014 111789 109960 107406 104363 101606 99573 97884 96258 95201 95035
54226 95035 94896 93747 92036 91205 91611 92095 91881 91822 93089 95457 97785 99842 102620 106642 110688 112821
54210 112821 112437 110815 109583 109110 108686 107834 106764 105666 104372 103063 102632 103634 105248 106057 105808 105706
54194 105706 106807 108728 110286 110933 111079 111167 110958 109837 107591 104752 102144 100100 98104 95444 92435
54179 92435 90823 92384 96836 101504 103570 102665 100909 100521 101985 104541 107600 110968 114135 116196 116670
54164 116670 116052 115594 116565 119278 122463 124142 123819 123382 124951 128131 130480 130596 129416 128224 126843 124622
54148 124622 122011 119941 118314 116391 114388 113477 114090 115187 115558 115213 115043 115479 115805 114854 112221 108812
54132 108812 106113 104935 105033 105800 106864 107882 108377 108146 107520 106833 106015 105036 104331 104275 104564 104647 104513 104526 104745
54113 104745 104928 104998 104839 103774 101025 96881 92931 90827 90944 92312 93694 94759 96294 99111 102682
54098 102682 105270 105673 104474 103167 102462 101922 100890 99118 96733 94239 92447 91764 91634 91169 90106 88650
54082 88650 86795 84707 83452 84070 85818 86620 85745 84831 85589 87528 89028 89782 90746 92011 92284 90885
54066 90885 89064 88623 89801 91161 91195 89485 86649 83832 82140 81914 82358 82304 81524 80943 81493 83167 85441
54049 85441 88063 90953 93649 95495 96264 96167 95364 93981 92399 90965 89551 88220 88191 91014 96301 101250
54033 101250 103220 102257 100453 99478 99603 100562 102089 103522 103889 102919 101509 100875 101486 102880 104191 104741
54017 104741 104378 103374 101942 100092 98175 97209 98140 100736 103675 105780 106894 107671 108869 110852 113409
54002 113409 115958 118131 120131 122334 124775 127333 130189 133666 137616 141358 144199 145845 146476 146768 147531
53987 147531 148862 149825 149549 148496 148143 149504 152590 157078 162648 168504 173510 177352 181106 186240 193379
53972 193379 202273 212427 223252 233937 243738 252400 260053 266884 273190 279571 286568 294000 300999
53959 300999 306926 312069 317084 321744 324796 325551 325351 326628 330210 334207 336037 335096 332871 330878 329314
53944 329314 327484 324618 320127 313859 306495 299176 292463 285983 279263 272474 266121 260290 254528 248381
53930 248381 242077 236720 233636 233104 233849 234141 233288 231644 229453 226489 222832 219113 215703 212319 208825
53915 208825 205841 204121 203701 204056 204714 205378 205874 206405 207534 209508 211781 213543 214481 214737 214459 213809 213238
53898 213238 213256 213966 215135 216669 218641 220766 222261 222526 221925 221577 222146 223141 223791 224422 226158 229072 231664
53881 231664 232983 234426 238203 244446 251368 258139 265788 274746 283295 289721 294662 299827 305236 309490
53867 309490 312384 315459 319793 324772 329482 333946 338248 341575 343170 343637 344350 345910 348038 350750 354695
53852 354695 360210 366820 373980 381892 391174 401979 413674 425250 435821 444899 452468 458754 463848
53839 463848 467604 469885 470727 470149 468076 464682 460559 456230 451721 446960 442374 438451 434737 429947 423318
53824 423318 415389 407230 399436 392113 385252 378598 371465 363191 353630 343098 332272 322309 314238 307699
53810 307699 300955 292960 284882 278654 274479 270745 266066 260285 253659 246401 239288 233581 229742 226870
53796 226870 223758 219889 215323 210394 205851 202517 200404 198677 196788 195035 193840 193107 192572 192102 191372
53781 191372 189832 187279 183952 180126 176387 174143 174546 176600 177674 176499 174405 172973 171941 170525
53767 170525 169299 169052 168729 166564 163014 160703 161218 163379 165107 165834 166467 167850 169922 171947 173223
53752 173223 173732 174152 175075 176403 177912 179974 183189 187575 192730 198409 204197 209062 212345 215064 219219
53737 219219 225678 233603 241855 249959 257652 264697 271492 278823 286490 293099 297709 300867 303447 305407
53723 305407 306568 307938 311145 316571 322728 327497 329636 329385 328059 326935 326065 324278 320622 315585 310483
53708 310483 305974 301703 297260 292770 288410 284017 279599 275787 273090 270797 267418 262536 257621 254345
53694 254345 252436 250145 246747 243501 241700 240906 239961 238888 238627 239355 240316 241039 241488 241113 239219 236486
53678 236486 234647 234132 233391 231359 229297 229019 230319 231559 232058 232241 231671 228733 222899 216125 211237 209437
53662 209437 209785 210591 210886 210942 211831 214299 217829 220967 222710 223283 223458 223526 223227 222448 221518 220874 220703 220956
53644 220956 221702 223379 226596 231409 236829 241470 244841 247706 250894 254156 256697 258634 261203 265347
53630 265347 270650 276093 281384 286901 292441 296798 298910 299066 298557 298325 298267 297771 296674 295578 295369 296361
53614 296361 297840 298635 298344 297797 298033 298984 299604 299210 298162 297083 295986 294573 293058 292137 292175 292786 293218
53597 293218 292890 291564 289330 286677 284483 283632 284361 285892 286849 286364 284910 283930 284565 286866 290163 293780
53581 293780 297120 299428 300046 299039 297246 295655 294928 295455 297402 300451 303811 306899 309908 313424 317485
53566 317485 321401 324597 327282 329948 332409 333914 334461 335505 338745 344176 349896 354091 356799 359392
53552 359392 362770 366872 371745 378036 385783 393487 399318 403146 406582 410926 415845 420400 424636 429439
53538 429439 435175 441248 447043 452587 458087 463327 467970 472124 476138 479953 483135 485621 488017 490877
53524 490877 494004 496878 499544 502535 505833 508624 510531 512501 515679 519618 522566 523635 523784 524271 525015
53509 525015 525243 524992 524866 524655 523384 520949 518768 518328 519612 521329 522375 522801 523555 525356 527669 528977
53493 528977 528498 527366 527538 529663 532781 535996 539429 543414 547870 552877 558753 564897 569610 572056 573772
53478 573772 577192 583093 590309 597525 604303 610754 617277 624603 633186 642499 651652 660698 670648 682238
53464 682238 695346 709472 724058 738485 752615 767332 783710 801648 820070 838345 856625
53453 856625 874928 893084 911533 930960 950986 970724 991056 1014703 1043095 1074532 1106594
53442 1106594 1139050 1172877 1207580 1241515 1274441 1307689 1341684 1375225 1407803 1441026 1476772
53431 1476772 1514924 1553741 1591553 1627309 1660406 1691233 1721524 1753054 1786059 1819579 1853062
53420 1853062 1886685 1920221 1952693 1983457 2012835 2041323 2068965 2095927 2122939 2150408 2177524
53409 2177524 2203043 2226690 2249025 2270111 2289221 2306031 2321203 2335412 2348400 2359422 2368047
53398 2368047 2373978 2376610 2375556 2371380 2365073 2356763 2345572 2330839 2312999 2293255 2272889 2252990
53386 2252990 2234118 2215795 2196666 2175539 2152119 2126638 2099319 2070721 2042183 2015091 1989538
53375 1989538 1964255 1938189 1911796 1886533 1863432 1842633 1824064 1807772 1793356 1779798 1766606
53364 1766606 1754940 1746809 1742953 1741936 1741456 1740193 1738339 1737006 1737626 1741431 1748760 1758782 1770171 1782089
53350 1782089 1794509 1807886 1822824 1839784 1858837 1879886 1903182 1929193 1957623 1987204 2017090
53339 2017090 2048174 2082496 2121548 2165464 2213169 2262647 2311808 2360277 2410032 2463229 2519722
53328 2519722 2577894 2637470 2699659 2764366 2829252 2892575 2955503 3020490 3088474 3158751 3230444
53317 3230444 3302548 3373226 3440807 3505403 3568262 3629506 3687628 3741311 3790668 3836499 3879262
53306 3879262 3919020 3955530 3987868 4014597 4034778 4048605 4056841 4059880 4057312 4048047 4030966 4006004
53294 4006004 3974647 3938885 3899706 3857075 3811110 3762424 3711255 3657259 3600495 3541770 3481532
53283 3481532 3419291 3354957 3290141 3227230 3167371 3110078 3054459 2999939 2945828 2891230 2835922
53272 2835922 2780897 2727670 2677273 2629926 2585212 2542243 2500127 2458694 2418613 2380549 2344511
53261 2344511 2310406 2278851 2250733 2225953 2203197 2181179 2159642 2138900 2118893 2099226 2079888
53250 2079888 2061307 2043647 2026492 2009459 1992845 1977417 1963666 1951453 1940388 1930418 1921929 1915234
53238 1915234 1910154 1906349 1904077 1904231 1907315 1912581 1918609 1924775 1931959 1941782 1955238 1971944 1990511
53225 1990511 2009701 2029438 2050706 2074456 2100800 2129221 2159034 2189347 2219088 2247679 2275362
53214 2275362 2302311 2327919 2351671 2374220 2396358 2417064 2433963 2446055 2454739 2461576 2466261 2467727
53202 2467727 2466229 2463119 2458960 2453006 2444345 2432674 2417981 2400208 2379235 2354785 2326672 2295723
53190 2295723 2264028 2233398 2203646 2173153 2140965 2107538 2073568 2039161 2004443 1970129 1937006
53179 1937006 1905309 1874786 1844959 1815204 1785186 1755471 1727228 1701027 1676360 1652400 1628758
53168 1628758 1605324 1582045 1559201 1537396 1516890 1497386 1478738 1461227 1444674 1427968 1410393
53157 1410393 1393080 1378106 1366034 1355134 1343313 1330089 1316264 1302373 1288289 1274001 1259712
53146 1259712 1244880 1228123 1208816 1188327 1168775 1150641 1132483 1113187 1093631 1075673 1060200
53135 1060200 1046844 1034904 1023512 1011196 996514 979504 961739 944551 927734 910309 892058
53124 892058 873786 856366 839965 824161 808570 793319 778892 765387 752055 737917 722915
53113 722915 708079 694532 682588 671859 661722 651527 640878 630095 620081 611437 603853 596555
53101 596555 589024 581103 572779 564204 555653 547197 538751 530713 524051 519202 515200 510590 505121 499913
53087 499913 495880 492527 488531 483127 476763 470667 465921 462611 459657 455703 450356 444463 439141 434841
53073 434841 431483 429027 427424 426166 424499 422295 420284 419097 418324 416917 414372 410992 407020 402238
53059 402238 396802 391785 388101 385198 381732 377510 373778 371351 369475 367217 365028 363869 363393 362332
53045 362332 360610 359656 360170 360736 359523 356627 353768 352009 350778 349125 347165 345938 346204 347664 349299
53030 349299 350487 351882 354907 360095 366200 371409 375155 378140 380754 382413 382545 381422 379525 376844
53016 376844 373367 369673 366302 362876 358499 352729 345641 337366 328453 320355 314444 310411 306653 302469
53002 302469 298822 296420 294071 289944 283917 277726 272947 269636 266937 264228 261473 258904 256603 254147
52988 254147 250755 246198 241541 238450 237596 238031 238295 237677 236187 233726 229934 224931 219818 216120 214647
52973 214647 214855 215339 215045 214146 213759 214664 216236 216777 215092 211665 208051 205134 202450 199414 196569 194960
52957 194960 194539 194162 193279 192764 193664 195820 198244 200168 201017 199912 196321 191320 187250 185682 186019 186311
52941 186311 185177 182883 180896 180510 181669 183105 183855 184514 186537 190337 194621 197791 199413 200034 200099 199667
52925 199667 198896 198000 196651 194146 190737 188369 189346 194025 200166 204767 206288 205135 202702 200549 199941
52910 199941 201107 202812 203429 202712 201988 202533 204525 207679 211771 215996 218889 219901 220356 221791 223932
52895 223932 225566 226919 229690 234638 240498 245727 250224 254865 260179 266053 272144 278150 284105 290505
52881 290505 297577 304430 309865 314133 318815 324510 329782 333074 334650 335709 336511 336640 336492 337070 338408
52866 338408 339375 339157 337937 335986 333097 329383 325901 323845 323324 323251 322292 319923 316856 314450 313314 312466
52850 312466 310232 306065 301137 297151 295042 294824 295948 297406 297987 297153 295630 294736 295124 296323 297348
52835 297348 297437 296303 294062 291076 287777 284636 282338 281659 282739 284499 285315 284604 283476 283560 285344 287945
52819 287945 290296 292121 293782 295689 298029 300726 303412 305611 307139 308159 308797 309011 309000 309256 309831 309938
52803 309938 308837 306980 305683 305698 306635 307883 309473 311624 313797 314764 313765 311466 309612 309630 311543 314269
52787 314269 316827 318956 320633 321730 322648 324712 329068 335201 341173 345397 347699 348773 349314 349827 350596
52772 350596 351488 352163 352635 353165 353590 353482 353214 354076 356638 359494 360472 359024 356878 356282 357992 361053 364152
52755 364152 366828 369301 371384 372128 370827 368010 364844 361744 358286 354398 350736 347583 344241 340031
52741 340031 335254 330543 325782 320369 314240 307988 302191 297216 293454 290954 288828 285742 281302 276603
52727 276603 273105 271129 269651 267478 264376 260953 257590 253972 249893 246105 243654 242477 241346 239342
52713 239342 236706 234044 231473 228992 226953 225424 223606 220721 217236 214417 212718 211312 209337 206997
52699 206997 205181 204322 203938 203156 201482 198951 195642 191365 186042 180227 174851 170531 167460 165734 165272
52684 165272 165576 166177 167167 168517 169140 167744 164589 161124 157819 153992 150271 149211 152071 156408 158596
52669 158596 157810 155951 154538 153522 152614 151704 150023 146738 142608 139527 138205 137734 137546 138127 139448 140345
52653 140345 140188 139734 139616 139268 138228 137263 137219 137742 138106 138445 139204 140218 141337 143172 146070 148912 150196
52636 150196 149955 149529 149654 149921 150013 150299 151004 151747 152303 153116 154697 156953 159430 161842 164036 165761 166896
52619 166896 167900 169824 173643 179407 185999 191868 196174 199218 201750 204047 205775 206684 207244 208535 211288
52604 211288 214883 217520 217767 215895 213382 211294 209606 207914 205948 203295 199595 195588 193144 193349 194780
52589 194780 194535 191094 185672 180698 177418 175278 173318 171523 170367 169340 166847 162205 157167 154494
52575 154494 155071 157266 159183 160601 162422 165215 168925 173177 177099 179379 179273 177322 174530 171186 166987
52560 166987 161991 156874 152591 150148 150162 151960 153623 153704 152636 151771 151422 150736 149219 147335 145645 144326
52544 144326 143671 144095 145315 146312 146548 146635 147441 149118 151350 153928 156530 158516 159730 161262 164524 169383
52528 169383 173839 175970 175920 175531 176135 177258 177653 177139 176816 177669 179573 181813 183999 186084 187937 189416
52512 189416 190651 191826 192779 193210 193211 193270 193809 194926 196498 198387 200679 203822 208206 213389 218115 221364
52496 221364 222925 222692 220288 216231 212864 212794 216254 220970 224807 227699 230680 233943 236466 237145 235806
52481 235806 233379 231391 231067 232681 235853 240244 245345 249721 251568 250653 249172 249900 253626 258775 263145
52466 263145 265546 265972 265136 264140 264132 265619 267848 269096 268023 265012 261979 260609 261057 262646 265216 268867
52450 268867 272628 274656 274257 272793 271972 271999 272059 271916 272004 272381 272538 272185 271416 270181 268390 266604 265889 266654
52432 266654 268066 268681 267435 264241 260310 257800 258331 261477 265216 268018 269956 271622 272794 272915 272480
52417 272480 273059 275639 279313 281969 282358 281385 281123 282591 284876 286550 287354 287904 288409 288721 289385 291247
52401 291247 293722 294761 293138 289823 286399 283300 280635 279655 281686 285886 289614 291170 291129 290922 291343
52386 291343 292664 294977 297854 300486 302562 304256 305166 304393 302155 300213 299869 300459 300732 300755 301285 301986
52370 301986 301669 300008 297694 295027 291688 288088 285590 284903 285214 285431 285472 285717 285986 285843 285541 285867 287210
52353 287210 289202 291229 292945 294397 295824 297200 297936 297458 296204 295527 296166 297282 297559 296961 296727 297647
52337 297647 299013 299489 298623 297223 296395 296459 296791 296631 295934 295286 295060 295012 294882 295034 296006 297565 298803 299406
52319 299406 300330 302745 306425 309759 311530 312238 313272 315061 316679 317288 317283 317600 318444 319294 319954 320951 322944
52302 322944 326215 330619 335430 339359 341532 342648 344412 347552 351166 354322 357370 360875 364130 365996
52288 365996 366966 369101 373596 379369 384487 388212 391105 393679 395770 397173 398397 400612 404919 411421
52274 411421 418844 425391 430314 434513 439239 444506 449395 453795 458935 465750 473441 480434 486431 492566
52260 492566 499505 506373 512074 517025 522908 531010 541375 553427 566772 581293 596883 613192 629491
52247 629491 644971 659571 674371 690746 709155 729069 749908 771423 793370 815540 838267
52236 838267 862161 887058 911886 936044 960379 986209 1013706 1041825 1069667 1097347 1125499
52225 1125499 1154315 1183297 1211769 1239364 1265931 1291157 1314685 1336697 1357868 1378351 1397311
52214 1397311 1414083 1429255 1443616 1456393 1465843 1471654 1475374 1478065 1479054 1477814 1475741 1474801 1475363 1476668
52200 1476668 1478554 1481089 1482951 1482093 1478346 1473984 1471285 1470603 1471220 1472904 1475868 1479994 1485002 1491112 1498936
52185 1498936 1508852 1520725 1534007 1547915 1561871 1576122 1591661 1609224 1628471 1648405 1668470
52174 1668470 1688932 1710106 1731342 1751042 1767941 1782280 1795276 1807449 1818063 1826507 1833462 1839907
52162 1839907 1845369 1848070 1846832 1842192 1835702 1828653 1821336 1812816 1801478 1786546 1769134 1751215 1733631
52149 1733631 1715958 1698219 1681535 1666506 1651857 1635544 1616947 1597425 1578901 1562256 1547065
52138 1547065 1532626 1519177 1507820 1499057 1491851 1484726 1477447 1470715 1464576 1458375 1452359 1447847 1445189
52125 1445189 1442758 1438907 1433974 1429307 1425099 1420398 1414861 1409281 1404415 1400203 1396231 1392194 1387857 1383200
52111 1383200 1378680 1374724 1370911 1366131 1359691 1351937 1343913 1336827 1331568 1327999 1324683 1320030 1313958 1307864
52097 1307864 1302718 1297826 1291943 1285183 1279095 1274874 1272041 1269077 1265000 1259980 1254622 1249195 1243788 1238756
52083 1238756 1234434 1230520 1226304 1221654 1217298 1213819 1210795 1207293 1203023 1198592 1194712 1191484 1188429 1185034
52069 1185034 1181281 1177698 1174847 1172828 1171474 1170889 1171279 1172259 1172990 1173261 1173757 1174830 1175755 1176001 1176702 1179813
52053 1179813 1185902 1193753 1202247 1211710 1222922 1235553 1248336 1260604 1273112 1287328 1304198 1323658
52041 1323658 1345063 1367914 1392221 1418346 1446654 1477192 1509397 1542194 1574800 1607610 1641799
52030 1641799 1677746 1714221 1749524 1783076 1815392 1846884 1877361 1906518 1934131 1959724 1982744
52019 1982744 2003213 2021549 2037523 2050063 2058465 2063285 2065592 2065760 2063436 2058406 2050978 2041772 2031579
52006 2031579 2021297 2011387 2001275 1989724 1976014 1960667 1945037 1930421 1917505 1906235 1895941
51995 1895941 1885786 1875467 1865564 1857111 1850794 1846626 1844326 1843718 1844672 1846883 1850042 1854333 1860483 1869064
51981 1869064 1879614 1890539 1900123 1907901 1915038 1923081 1932264 1941357 1949357 1956781 1964590 1972209 1977650
51968 1977650 1979828 1979769 1978910 1976936 1972290 1964472 1954836 1944974 1935030 1923826 1910139 1893676 1875243 1856228
51954 1856228 1837624 1819252 1799982 1778715 1755093 1729544 1703022 1676501 1650070 1622387 1591619
51943 1591619 1557202 1520377 1482931 1445937 1409780 1374644 1340353 1306248 1271946 1237943 1204797
51932 1204797 1171874 1137675 1101637 1065045 1029882 997181 966741 937941 910196 882729 854596
51921 854596 825463 796249 768553 743184 719450 696100 672910 650996 631512 614428 598825
51910 598825 583991 569744 555902 542145 528572 515803 504096 492773 481097 469552 459626 452173
51898 452173 446427 440902 434892 428742 422871 417042 410694 403724 396718 390496 385436 381168 376857 371890
51884 371890 366350 360957 356609 353785 352033 349948 346148 340662 335175 331468 329795 329126 328616 328051 326964
51869 326964 324440 320402 316359 314049 313511 313072 311089 307297 302687 298645 296086 294882 293995 292555 290754
51854 290754 289399 288729 288195 287295 285985 284222 281763 278644 275344 272100 268573 264553 260562 257328 254962
51839 254962 253131 251701 250581 249158 246717 243586 241111 240077 239657 238445 236161 233665 231491 229278
51825 229278 226842 224904 224076 223631 222187 219543 217042 216025 216586 218023 219745 221326 222344 222807 223316
51810 223316 224186 224859 224855 224874 226020 228049 229404 229185 228200 227708 227852 227774 226804 225090 223479 223111 224696 227771
51792 227771 231020 233740 236659 240850 246159 251230 254946 257366 259349 261638 264324 266822 268318 268320 266842
51777 266842 264228 261110 258509 257329 257475 257981 258294 258837 259837 260415 259762 258688 258847 260586 262733 264535
51761 264535 266568 269333 272041 273549 273830 273723 273748 273827 273859 273900 273873 273570 272776 271145 268369 264891 262067 261010
51743 261010 261449 262192 262529 262703 263274 264646 267050 270310 273557 275699 276228 275267 273096 270276 268050 267648
51727 267648 268928 270401 270938 270925 271442 272867 274623 275826 275933 275268 275176 277021 280574 283953 285630 285946
51711 285946 286120 286476 286552 286428 286791 287750 288654 289245 290095 291616 293334 294512 294980 295181 295975 298523 303528
51694 303528 310161 316445 321389 326178 332618 340823 349229 356561 362878 368772 374611 380952 388859 399026
51680 399026 410833 422845 434115 444515 453902 461624 467169 470904 473741 476202 478105 479080 479025 478175
51666 478175 477136 476868 477992 479866 480870 480133 478605 477829 478055 478298 478069 478033 478744 479639 479904 479629 479409
51649 479409 479172 478266 476699 475523 475719 477125 478803 480218 481654 483433 485131 486019 486328 487528 490845
51634 490845 495650 499925 502355 503523 504962 507672 511844 517392 524086 531379 538641 545516 551893 557823
51620 557823 563698 570050 576659 582280 585891 587961 589782 591790 593407 594466 595712 597546 599209 599868
51606 599868 599901 600418 601854 603715 605488 607088 608494 609618 610621 611812 612941 612961 610832 606412 600457
51591 600457 594001 587830 582193 576700 570689 563995 557208 550870 544674 537977 531026 525021 520738 517582
51577 517582 514358 510507 506140 501288 495772 489759 483841 478458 473647 469328 465382 461465 457413 453968
51563 453968 452385 452796 453436 452181 448801 445120 442876 441824 440195 436838 432569 429345 428287 428743 429172
51548 429172 428532 426630 423730 420408 417537 415622 414144 412241 410142 409181 410115 412137 413963 415300 416673
51533 416673 418364 420212 422201 424496 426967 429187 430998 432796 435302 439076 443984 448963 452761 455174
51519 455174 457039 458645 458891 456826 453611 451817 452715 455025 456516 456182 454601 452760 451024 449113 446806
51504 446806 444530 443110 442814 442911 442354 440733 438469 436377 435262 435366 435838 435343 433825 433085 434749 438068
51488 438068 440767 441978 443222 446381 451652 457759 463262 467242 469494 470669 471799 473209 474173 473937 472736
51473 472736 471604 471453 472600 474775 477307 479424 480625 480850 480516 480440 481280 482571 482794 481192 479205 479147
51457 479147 481461 484177 485164 484009 481639 479089 477047 475580 473764 470333 465236 459915 455679 452487
51443 452487 449608 446533 442700 437464 431349 426459 424473 424580 424440 422855 420501 418322 416423 414648 413269
51428 413269 412742 413288 414869 417098 419159 420393 421042 422025 423943 426690 429918 433379 436837 440233 443955
51413 443955 448498 453753 459117 464308 469525 474735 479463 483663 488305 494522 502317 510474 517757 523879
51399 523879 529243 534087 538272 541893 545557 549563 553076 554839 554865 554717 555765 557842 560211 563135 567389
51384 567389 572447 576419 578238 579045 580796 583959 587219 589181 589739 589777 590109 590956 592099 593148 593745 593841
51368 593841 593908 594527 595523 595758 594211 591163 587807 584686 581187 576810 572244 568668 566462 565292 565004 565561
51352 565561 566216 565783 564022 561967 560506 559233 557243 554580 552240 551028 551079 552421 555303 559650 564637
51337 564637 569116 572371 574374 575490 576056 575985 574663 571482 566686 561378 556473 552048 548027 544907 542910
51322 542910 540746 536464 529793 522589 516439 510743 503884 495402 486025 476346 466720 458082 451380 446101
51308 446101 440550 433842 426665 419969 413962 408663 404333 400808 397298 393445 389829 386984 384636 382339
51294 382339 380024 377356 373579 368821 364704 362562 361590 359796 356486 352918 350634 349994 350221 350187 349138
51279 349138 347255 345488 344537 344224 344024 343635 342588 340149 336403 332823 330769 329894 329074 328454 329253 331602
51263 331602 333893 334578 333637 332040 330711 330474 332129 335945 341301 347050 352013 355273 356700 357273 358194
51248 358194 359487 360053 359230 357660 356355 355476 354319 352025 348078 342640 336758 331832 328436 325796 322618
51233 322618 318241 312945 307387 301945 296585 291418 287241 284950 284166 283191 281018 278737 277861 277810 276495
51218 276495 273351 270176 268603 268173 267590 266496 265012 262654 259126 255560 253571 253220 253050 252093 250817
51203 250817 249989 249574 249086 248248 246899 244794 242030 239315 237393 236413 236155 236634 237877 239175 239203 237373
51187 237373 234803 233338 233544 234133 233549 231780 230222 230111 231511 233612 235422 236206 235763 234527 233134 231852
51171 231852 230608 229452 228591 228097 228010 228627 230056 231501 231761 230742 229795 230046 230998 231431 231213 231339 232204
51154 232204 232863 232406 231482 231721 233756 236436 238214 238874 239522 241144 243691 246562 249333 251724 253212 253196
51138 253196 251577 249041 246789 245915 246700 248324 249509 249574 248672 247107 245015 242869 241515 241278 241504 241455
51122 241455 241132 240833 240508 240154 240173 240594 240560 239472 238110 237618 237847 237807 237405 237458 238098 238496 238294 238126 238456
51103 238456 238847 238641 237509 235257 231990 228542 225746 223314 220486 217727 216328 216160 215403 213022 210031
51088 210031 207604 205428 202963 200976 200521 201253 202038 202558 203170 203759 203845 203479 203157 203126 203397 203857 203795 202228
51070 202228 199636 198550 201092 206390 211533 214649 215941 216211 215893 215529 215865 217080 218700 220356 221952
51055 221952 223214 223878 224164 224256 223592 221717 219684 219240 220357 220756 218469 214098 210084 208480 209871 213638
51039 213638 218366 222271 224061 223735 222528 222009 222988 224995 226819 227785 228367 229322 230524 231143 230838 230350
51023 230350 230910 233350 237524 242113 245329 246462 246618 247447 249352 251507 253290 254787 255994 256536 256354
51008 256354 255961 255765 255706 255734 256059 256914 258621 261753 266348 270953 273499 273488 272436 271827 271669 271574 272136 274123
50990 274123 276958 279187 280273 280998 282201 284010 286439 289867 294464 299540 303811 306270 306813 306246 305743
50975 305743 305977 306624 306792 305881 303988 301769 300222 300415 302738 306191 308852 309460 308450 307296 307136 308299
50959 308299 310674 313832 316847 318737 319449 319992 321390 323951 327762 333097 339633 345822 350154 353003 356301
50944 356301 361233 367099 372662 377704 382768 388130 393838 400323 408233 417726 428367 439631 451341
50931 451341 463796 477711 493639 511218 529435 547920 567497 588989 611877 634688 656539
50920 656539 678033 700902 726891 756487 788530 821633 856172 894061 936382 982428 1031646
50909 1031646 1085080 1143659 1206361 1271864 1341213 1416823 1499130 1586165 1676377 1769751 1865619
50898 1865619 1961532 2055498 2147956 2240283 2332206 2421539 2505541 2581626 2647745 2703361 2749623
50887 2749623 2787603 2816749 2835821 2844813 2845058 2837951 2824568 2806221 2784298 2759639 2732892 2705377
50875 2705377 2678606 2652859 2627062 2600194 2571999 2542062 2509040 2471521 2429251 2382954 2333101
50864 2333101 2279316 2221012 2158249 2091705 2021952 1949081 1873392 1796329 1720154 1646384 1574871
50853 1574871 1504876 1436740 1371881 1311315 1255057 1203202 1156687 1116197 1080712 1048062 1017003
50842 1017003 988166 962850 941505 923700 909017 897348 888527 882132 877571 874019 870504 866587
50830 866587 862984 861138 862146 866297 873270 882106 891211 899326 906721 914825 924626 936222 949879 966292
50816 966292 985237 1005219 1025397 1046905 1071171 1097684 1124733 1151904 1180497 1211724 1245823
50805 1245823 1282871 1323089 1366058 1411011 1458444 1510436 1568675 1632975 1702370 1777003 1858128
50794 1858128 1946752 2043141 2147551 2260723 2383498 2516425 2660072 2815461 2983559 3163985
50784 3163985 3354536 3552631 3757177 3968101 4183789 4400063 4612420 4818327 5016079
50775 5016079 5202075 5370869 5517918 5641066 5739359 5811889 5858296 5879366 5876695 5852655 5811007
50764 5811007 5756493 5693202 5623969 5551601 5479670 5411424 5348446 5290690 5237060 5185513 5133363
50753 5133363 5078008 5017011 4947531 4866837 4773870 4669309 4553423 4424671 4281124 4122785
50743 4122785 3952198 3773614 3591983 3411525 3234231 3060276 2890498 2727720 2574991
50734 2574991 2433365 2302359 2181714 2071667 1972064 1882369 1802153 1730663 1666339 1607795
50724 1607795 1554984 1508501 1467983 1432115 1399909 1371060 1345263 1322099 1301457 1283367 1267687
50713 1267687 1254684 1245302 1239768 1236297 1232488 1227812 1223462 1219858 1215965 1211424 1207744 1206399 1206829 1207447
50699 1207447 1208098 1210489 1216349 1225891 1238030 1251483 1265581 1280504 1297178 1316915 1340819 1369085
50687 1369085 1400695 1434116 1468734 1505574 1546405 1592269 1643079 1698394 1758186 1822906 1892976
50676 1892976 1968175 2047520 2130180 2216623 2308278 2405769 2508218 2614749 2725712 2841360
50666 2841360 2960047 3079209 3197909 3316840 3435525 3550869 3659099 3757959 3846131 3921419
50656 3921419 3980754 4021913 4044498 4049267 4037158 4009163 3966754 3912184 3848410 3778831 3707054
50645 3707054 3636572 3570070 3508745 3452585 3401590 3356329 3316820 3281290 3246712 3210467 3170886
50634 3170886 3126362 3074981 3015281 2946750 2869373 2783387 2689894 2591180 2489905 2388102 2287060
50623 2287060 2187821 2091505 1999401 1912819 1832620 1758918 1691630 1631219 1578299 1532477 1492390
50612 1492390 1457228 1427575 1404186 1386430 1372625 1361714 1354036 1350506 1351476 1356510 1364956 1376444
50600 1376444 1390710 1407099 1424673 1443247 1464049 1488685 1517356 1548646 1581233 1615284 1651890
50589 1651890 1691749 1734925 1781497 1831849 1886424 1945609 2009824 2079377 2154226 2233963 2317840
50578 2317840 2404810 2493992 2585419 2679848 2777148 2875107 2970479 3061218 3147065 3227892 3302328
50567 3302328 3368646 3426507 3476812 3519650 3553150 3575069 3585299 3586217 3580527 3569416 3553015 3531994
50555 3531994 3507997 3482895 3458398 3436358 3418544 3405723 3397388 3392663 3390960 3391485 3392789 3393472 3392985
50542 3392985 3390991 3386107 3376042 3359088 3334767 3302765 3261957 3211110 3150259 3080796 3004306 2921816
50530 2921816 2834208 2742842 2649528 2555997 2463466 2372512 2283418 2197060 2115419 2040588 1972854
50519 1972854 1910267 1850729 1794297 1742883 1697910 1659003 1625032 1595604 1571084 1551656 1536961
50508 1536961 1526595 1520600 1519290 1522553 1529278 1537712 1546723 1556610 1568365 1582418 1598732 1617975 1641604
50495 1641604 1670396 1703474 1739134 1776117 1813868 1852327 1892088 1934182 1979115 2026418 2075504
50484 2075504 2126288 2178415 2230679 2282281 2334269 2388653 2446229 2506314 2568683 2634649 2705760
50473 2705760 2782181 2862961 2947562 3036647 3131637 3233891 3344297 3463338 3591264 3727975
50463 3727975 3872689 4023980 4180339 4340466 4502826 4665200 4824969 4979655 5126899
50454 5126899 5264217 5389192 5499748 5593889 5669343 5723817 5755560 5763668 5748218 5710387 5652020
50443 5652020 5574824 5480431 5371512 5252140 5126510 4997847 4869046 4743566 4624860 4515580
50433 4515580 4418346 4336626 4273417 4229044 4201305 4187730 4186733 4196595 4214399 4236164 4257225 4272513
50421 4272513 4277419 4268632 4243610 4199634 4134582 4048742 3944882 3826488 3696824 3559374 3417560
50410 3417560 3273554 3128655 2985206 2846784 2715843 2592399 2475860 2367025 2267436 2177727
50400 2177727 2097631 2026757 1964374 1909073 1859764 1816526 1779694 1748684 1722672 1701891 1687173
50389 1687173 1678499 1675025 1676381 1682888 1694455 1710120 1728898 1750400 1774490 1800970 1829867 1861536
50377 1861536 1896088 1932841 1970528 2008135 2045796 2084893 2126909 2171729 2217195 2260679 2301160
50366 2301160 2339605 2377589 2415731 2453307 2488956 2521664 2551211 2577908 2602246 2625066 2647708
50355 2647708 2671432 2696724 2723664 2752930 2785757 2822792 2863676 2907910 2955468 3006328 3060191
50344 3060191 3117062 3177316 3240488 3304435 3366349 3424370 3477785 3526034 3568026 3602136 3626443
50333 3626443 3639204 3639534 3627392 3602612 3564317 3511707 3445217 3366680 3278731 3184282 3086011 2985871
50321 2985871 2885382 2786732 2693025 2606892 2529371 2460768 2402232 2355546 2321435 2298781 2285758
50310 2285758 2281163 2284338 2293934 2307097 2320056 2329668 2334292 2333167 2325333 2309669 2285681 2253519 2213290
50297 2213290 2165188 2110552 2052057 1992482 1933641 1876380 1820721 1765854 1710994 1656808 1605312
50286 1605312 1558023 1514947 1475625 1440128 1408516 1380314 1355266 1333705 1315490 1299546 1285386
50275 1285386 1274182 1267158 1263567 1261420 1259810 1259503 1261618 1266752 1275082 1286279 1299359 1313416 1328500
50262 1328500 1345238 1363865 1384094 1405537 1427826 1450923 1475693 1503186 1532608 1561156 1587050
50251 1587050 1611802 1638028 1665802 1692744 1717157 1739236 1759368 1777124 1792313 1805516 1817087
50240 1817087 1826666 1834032 1839506 1843328 1845330 1845149 1841999 1834727 1823370 1810302 1798228 1787021 1774130
50227 1774130 1758211 1740605 1722817 1704339 1683951 1661793 1638957 1615974 1592778 1569547 1546753
50216 1546753 1524752 1503744 1483701 1464170 1444850 1426425 1409774 1394142 1377390 1358682 1339746
50205 1339746 1322686 1307552 1292982 1278381 1264471 1252287 1242497 1235265 1230006 1225598 1221335 1217188
50193 1217188 1212959 1208158 1203265 1199964 1199107 1199280 1198483 1196537 1194722 1193633 1192712 1191447 1189598 1186369 1180958
50178 1180958 1174218 1168374 1164201 1159428 1150956 1138498 1125243 1114741 1107537 1101153 1093229 1084190 1076497
50165 1076497 1071713 1069140 1067430 1066515 1067201 1069432 1071921 1073478 1074077 1074583 1075886 1078360 1081836 1086027 1091061
50150 1091061 1097344 1104582 1111272 1115634 1117020 1116033 1113497 1109844 1105478 1101028 1096827 1092361 1086628 1079112
50136 1079112 1070333 1061482 1053565 1046784 1040581 1034138 1026946 1019110 1011256 1004019 997485 991243 984930 978425
50122 978425 971454 963542 954766 946154 938856 933224 929060 926239 924308 921932 917798 912025 905967 900811
50108 900811 897245 896098 897712 900443 901265 898642 893854 888884 884036 878334 871213 862859 853575 843898
50094 843898 834846 827103 820244 813352 805984 798002 789248 780242 772540 767307 763864 760654 757279 754611
50080 754611 753252 753119 754357 757357 761560 765421 768030 769966 772078 774227 775916 777722 781327 788025
50066 788025 797409 807539 816385 823280 829125 835326 842717 851463 861357 871763 881763 891048 900489
50053 900489 911030 922159 932318 941008 949642 959778 971115 981966 991389 1000057 1008910 1017707 1025475
50040 1025475 1032053 1038423 1045338 1052248 1058051 1062542 1066504 1070662 1075258 1080632 1087353 1095402 1103771 1111201
50026 1111201 1117017 1121219 1124444 1127983 1133076 1139778 1147133 1154789 1163587 1174113 1185620 1197241 1209357
50013 1209357 1222728 1236980 1251351 1266520 1284065 1303922 1323752 1341492 1357601 1374189 1392563
50002 1392563 1412241 1431935 1450906 1469484 1488588 1508620 1528733 1547389 1563645 1577618 1589596
49991 1589596 1599297 1606396 1611561 1616284 1621313 1625499 1626702 1624085 1619020 1613280 1606729 1597602 1584946 1569736
49977 1569736 1553362 1536124 1517906 1499395 1481668 1465072 1449412 1434839 1421711 1409951 1399378
49966 1399378 1390368 1383286 1377519 1371969 1366347 1361141 1356577 1352546 1349331 1347388 1346498 1346271 1347448 1351437
49952 1351437 1358218 1365849 1372535 1378358 1384528 1391738 1399808 1408245 1416507 1424081 1430661 1436056 1439873 1441679
49938 1441679 1441377 1438880 1433713 1425809 1416499 1407560 1399211 1390278 1380375 1370438 1360567 1349070 1334760 1318880
49924 1318880 1303255 1287479 1269510 1248582 1225921 1202678 1178632 1153278 1127110 1101352 1077086
49913 1077086 1054834 1034363 1014670 994764 974791 956048 939674 925666 913241 901731 890896
49902 890896 880659 870845 861118 851040 840290 828875 817190 805928 795763 786813 778362 769506
49890 769506 760156 751050 742709 734909 727382 720320 713726 706968 699696 692740 687229 683101 679313 675288
49876 675288 671206 666950 661899 656213 651501 649442 649958 651190 651257 650002 649148 650761 655307 661254 666696
49861 666696 671161 675499 680441 685990 691959 698108 703706 707993 711509 716026 722544 730013 736608 741635
49847 741635 745614 749267 753335 758776 765964 773898 781191 787696 794197 800791 806846 812675 819829 829197
49833 829197 840034 851610 864707 880404 898208 916695 935551 955754 977819 1000997 1024211
49822 1024211 1046665 1067451 1085729 1101869 1117454 1133445 1149016 1162929 1175521 1188334 1201885
49811 1201885 1214680 1224670 1231175 1234946 1236553 1235234 1229651 1219600 1206434 1191584 1175171 1156526
49799 1156526 1135666 1113468 1090677 1067644 1044959 1023289 1002366 981232 959879 939614 921121
49788 921121 903274 884787 866213 849155 834147 820565 808149 797192 787353 777681 768029 759246
49776 759246 751708 744724 737779 731319 725778 720802 715991 711480 707035 701357 693434 684207 675957 670000
49762 670000 665680 661610 657188 652810 649173 646747 645631 645541 646027 646844 648105 649945 652126 654231 656340
49747 656340 659245 663549 668632 672946 675456 676402 676563 676446 676603 678007 681264 685786 690479 694956 699233
49732 699233 702630 704240 704579 705488 707869 710464 711537 710911 709702 708803 708585 709563 712260 716340 720588 723991
49716 723991 726507 728833 731851 736284 742613 751135 762047 775253 790015 805112 819602 833258 846175
49703 846175 858369 870067 882009 894963 908971 923382 937565 951327 964586 976890 987503
49692 987503 996238 1004131 1012785 1022522 1031543 1037678 1040840 1042846 1044644 1044777 1041143 1033415 1023020 1011393
49678 1011393 999184 986718 974139 961114 947265 933104 920005 909007 899940 891761 883504 874978
49666 874978 866934 860512 856223 853378 850711 847444 843565 839307 834890 830845 828016 826814 826466 825357
49652 825357 822408 818154 814193 811423 809134 806197 802828 800534 800338 801757 803526 804642 804545 803135 801059
49637 801059 799388 798564 798197 798147 799001 800977 803188 804734 805907 807529 809657 811738 813551 815094 816012 816032
49621 816032 815616 815311 814858 813972 813538 814859 817948 821788 826081 831307 837103 842170 846170 850226 854842
49606 854842 858785 860967 862244 864054 866156 867175 866968 867032 868505 870892 873035 874482 875540 876613 877979
49591 877979 879923 882619 885866 889085 891666 893404 894618 895706 896614 897025 897206 898164 900547 903633 906034
49576 906034 907405 908864 911602 915558 919820 923841 927662 931155 933842 935692 937480 939891 942570 944593
49562 944593 945748 946858 949004 952953 959193 967661 977166 985885 993059 999829 1007927 1017872 1028883 1040125
49548 1040125 1051349 1062545 1073707 1085142 1097567 1111613 1127236 1143580 1159600 1175340 1192572
49537 1192572 1213312 1237245 1261418 1283210 1302927 1322643 1343207 1363708 1383530 1403433 1424394
49526 1424394 1446609 1470074 1495228 1522554 1552153 1583935 1617567 1652098 1686426 1720526 1755562
49515 1755562 1792638 1831964 1873261 1916084 1959588 2002947 2046408 2091101 2137411 2184372 2231047
49504 2231047 2277647 2324835 2372789 2421462 2470875 2520577 2569627 2617735 2665625 2713681 2761174
49493 2761174 2807527 2853272 2898791 2943114 2985146 3025165 3063801 3100315 3133488 3163651 3192093
49482 3192093 3218655 3241764 3261052 3278212 3294683 3309895 3322480 3332075 3339203 3344417 3348322 3351603
49470 3351603 3354251 3355449 3355093 3354800 3356561 3360662 3365807 3370974 3376397 3382752 3390177 3398423 3407556 3418174
49456 3418174 3430989 3446205 3463232 3480988 3498540 3515592 3532484 3549728 3567292 3584173 3598870
49445 3598870 3610506 3619231 3625298 3628259 3627674 3624235 3619252 3613033 3604611 3593228 3579121 3562390 3541973
49432 3541973 3516644 3486650 3453585 3418626 3381466 3341058 3297087 3250427 3202207 3152673 3101364
49421 3101364 3048509 2995702 2944568 2895037 2845697 2795745 2745704 2696163 2646897 2597731 2549400
49410 2549400 2502779 2457819 2413962 2371264 2330488 2292302 2256886 2224099 2193494 2164381 2136246
49399 2136246 2108959 2082472 2056823 2032683 2011097 1992079 1974173 1956222 1939021 1924240 1912209
49388 1912209 1901819 1892313 1883968 1877004 1870998 1865569 1860687 1856094 1851387 1846943 1843817 1842351 1841817 1841983
49374 1841983 1844002 1849025 1856625 1865468 1874955 1885323 1896553 1908269 1920648 1934535 1950562 1968862
49362 1968862 1989857 2014598 2043862 2077187 2113021 2149430 2184281 2215069 2239299 2255612 2264617
49351 2264617 2268620 2270512 2272688 2276443 2281801 2287923 2294293 2301850 2312649 2328115 2347875 2370397 2394213
49338 2394213 2418212 2441600 2464586 2488609 2514742 2541993 2568315 2593164 2617736 2642604 2666744
49327 2666744 2689516 2711962 2734984 2757522 2778030 2796955 2816141 2836213 2856079 2874893 2893035
49316 2893035 2910941 2928288 2944881 2961498 2979337 2999129 3020980 3044549 3069170 3094204 3119339
49305 3119339 3144324 3168857 3193380 3219536 3248690 3280166 3311993 3343377 3375249 3408401 3442661
49294 3442661 3478327 3516757 3558390 3601423 3643856 3686217 3730892 3779076 3829654 3881100 3933322
49283 3933322 3987302 4043658 4102053 4161661 4221915 4282999 4345794 4411308 4479959 4551259 4624035
49272 4624035 4697094 4770028 4843303 4917306 4991457 5064784 5137260 5209769 5282686 5355340 5427092
49261 5427092 5498022 5568029 5636242 5702065 5766041 5828743 5889279 5945858 5997553 6044701 6087840
49250 6087840 6127025 6161995 6192340 6217770 6238846 6257057 6273287 6286515 6295044 6298912 6300063 6300043
49238 6300043 6298568 6294676 6288394 6280678 6272239 6262991 6252518 6240869 6229003 6218422 6210166 6204206 6199924
49225 6199924 6196881 6194805 6193389 6192775 6193844 6197268 6202503 6208520 6215312 6223788 6234242 6245839 6257548
49212 6257548 6268555 6277654 6283320 6284782 6282323 6276365 6267232 6255896 6243601 6229892 6212011 6187255
49200 6187255 6155488 6118628 6078289 6034873 5988533 5939800 5888998 5835738 5779511 5720648 5660440
49189 5660440 5600140 5539877 5478783 5416383 5353503 5291369 5230293 5170116 5111665 5056509 5004982
49178 5004982 4955550 4906656 4858279 4811066 4764775 4718466 4671752 4625173 4579798 4536956 4497703
49167 4497703 4461730 4427189 4392384 4357463 4323996 4293323 4265896 4241705 4220539 4202037 4186052
49156 4186052 4172733 4161765 4152006 4142477 4133329 4125242 4118467 4113168 4110056 4109569 4110797 4112405 4114485 4118397
49142 4118397 4124701 4132328 4139984 4147517 4155739 4165763 4178615 4194493 4212017 4229104 4245198 4262009
49130 4262009 4281496 4303636 4326687 4349288 4371698 4395112 4420206 4446508 4473009 4499210 4525432
49119 4525432 4552131 4579407 4607386 4636535 4666929 4697591 4727357 4756356 4785900 4816937 4849375
49108 4849375 4882877 4917474 4953106 4989221 5025154 5060462 5094894 5128642 5162709 5198254 5235345
49097 5235345 5272955 5310388 5348045 5386641 5426390 5467186 5508759 5550376 5591391 5632549 5675790
49086 5675790 5721941 5769312 5815477 5859737 5902819 5944608 5983480 6018008 6048306 6075346 6099688
49075 6099688 6121460 6141246 6160407 6180222 6200709 6220541 6238419 6254499 6270100 6286029 6301720
49064 6301720 6316130 6328931 6340606 6351921 6363623 6375999 6388259 6398893 6407183 6414017 6420793 6428053
49052 6428053 6435648 6443482 6451197 6457692 6462004 6464483 6466266 6467900 6469408 6471398 6474842 6479634 6484465 6488424
49038 6488424 6491840 6495235 6498413 6501181 6504216 6508459 6513916 6519596 6524411 6527933 6530643 6533724 6538316 6544623
49024 6544623 6551870 6559152 6565994 6572093 6577167 6581321 6585146 6589108 6593147 6597098 6601040 6604998 6608688 6611802
49010 6611802 6614158 6615336 6614615 6611475 6605808 6597482 6586376 6573029 6558507 6543130 6526091 6506867 6486147
48997 6486147 6464521 6440971 6413844 6382966 6349633 6314823 6278777 6242246 6206495 6171386 6134740
48986 6134740 6094737 6052379 6010723 5972022 5936232 5901868 5867316 5831451 5794039 5756159 5719812
48975 5719812 5686466 5655822 5626201 5596375 5567013 5540135 5517099 5497363 5479390 5462345 5446412
48964 5446412 5431858 5418736 5407570 5399257 5393633 5388779 5382574 5374828 5367431 5362596 5361268 5362790 5365456
48951 5365456 5367570 5368751 5370314 5373931 5379772 5386289 5391710 5395284 5397161 5397843 5398037 5398481 5399304 5399662 5398316
48936 5398316 5394579 5388722 5381687 5374432 5367193 5359108 5348795 5335489 5319480 5301282 5280729 5257303
48924 5257303 5231202 5203536 5175222 5145987 5114854 5081578 5047190 5012859 4978443 4942625 4904601
48913 4904601 4865169 4825865 4787387 4749412 4711775 4675175 4640512 4607973 4577083 4547385 4518896
48902 4518896 4492165 4468068 4447304 4429823 4414924 4402090 4391556 4383871 4379155 4377111 4377592 4380793
48890 4380793 4386902 4395880 4407654 4422245 4439571 4459192 4480428 4502811 4526474 4551986 4579560 4608524
48878 4608524 4637927 4667861 4699697 4734547 4771797 4809758 4847703 4886592 4927642 4970842 5015345
48867 5015345 5060749 5107230 5154622 5202224 5249827 5298270 5348521 5400555 5453650 5507579 5562910
48856 5562910 5620185 5679380 5740348 5803274 5868379 5935457 6004071 6073920 6144778 6216394 6288870
48845 6288870 6362976 6439635 6519027 6600393 6682534 6764317 6844921 6924037 7001726 7077937 7152492
48834 7152492 7225733 7298538 7370889 7440958 7506636 7567732 7625473 7679904 7729342 7772876 7811795
48823 7811795 7847442 7878879 7904175 7923224 7937553 7947528 7951606 7948822 7940525 7928646 7913177 7892508
48811 7892508 7865859 7834223 7798778 7759231 7714379 7663977 7609510 7552956 7495097 7435302 7372794
48800 7372794 7307716 7240881 7172863 7103717 7033501 6962881 6893080 6825034 6758472 6692134 6625380
48789 6625380 6559407 6496164 6436026 6377436 6319133 6261866 6207277 6155996 6107770 6062729 6021290
48778 6021290 5983075 5947238 5913919 5884250 5858723 5836519 5816797 5799702 5785726 5774849 5766905
48767 5766905 5762156 5760975 5763386 5769243 5778351 5790062 5803434 5818362 5835974 5857260 5881663 5907655
48755 5907655 5934415 5962244 5991588 6022471 6054951 6089389 6125917 6164014 6202864 6242042 6281747
48744 6281747 6322569 6365032 6409063 6453723 6497610 6539855 6580852 6621927 6664158 6707478 6750942
48733 6750942 6793660 6835272 6875672 6914889 6953428 6992167 7031401 7070331 7107984 7144215 7179139
48722 7179139 7212013 7241838 7269069 7295583 7322540 7349146 7373949 7396468 7416949 7435334 7451290
48711 7451290 7464757 7475661 7483400 7487318 7487399 7483953 7476962 7466356 7452455 7435234 7413402 7385273 7350652
48698 7350652 7311061 7267912 7221229 7170436 7115738 7058307 6999539 6940451 6881442 6822261 6762343
48687 6762343 6701427 6639827 6578206 6517397 6458436 6402310 6349430 6299569 6252543 6208678 6168406
48676 6168406 6131712 6098311 6068419 6043056 6023450 6010154 6002789 6000524 6002671 6008753 6018313 6031072
48664 6031072 6047296 6067451 6091321 6117792 6145829 6175328 6206704 6240010 6274896 6311118 6348494
48653 6348494 6386516 6424683 6463205 6502760 6543417 6584221 6623969 6662000 6698218 6732911 6766783
48642 6766783 6800688 6834879 6868645 6900952 6931499 6961232 6991945 7025086 7060631 7097326 7134457
48631 7134457 7173113 7214964 7259944 7306101 7352042 7398597 7447509 7499284 7553057 7607965 7663633
48620 7663633 7719479 7774574 7828443 7881523 7934606 7988134 8041979 8095500 8147690 8197619 8244814
48609 8244814 8289077 8329990 8366874 8399013 8425520 8445124 8456628 8459690 8454801 8442566 8423465 8398077
48597 8398077 8366560 8327690 8279487 8221607 8156509 8087288 8014713 7937376 7854603 7768013 7679825
48586 7679825 7590666 7499860 7407229 7313632 7219936 7126292 7032629 6939247 6846703 6755467 6665869
48575 6665869 6578066 6491869 6406939 6323360 6241785 6162760 6086087 6011041 5937143 5864512 5793629
48564 5793629 5724969 5658745 5594837 5532942 5472790 5414087 5356314 5299036 5242590 5187995 5135766
48553 5135766 5085224 5035593 4987410 4941961 4899285 4857724 4815866 4774166 4733989 4695807 4659332
48542 4659332 4625108 4594594 4568227 4544286 4520449 4496055 4472173 4449716 4428413 4407831 4388653
48531 4388653 4372179 4358629 4346475 4333741 4319862 4306188 4294782 4286938 4282758 4281740 4283243 4286395
48519 4286395 4290088 4293611 4297287 4302133 4308872 4317466 4327534 4338780 4350930 4363706 4377156 4391644
48507 4391644 4407262 4423652 4440682 4458743 4477637 4495679 4510916 4523379 4535124 4547691 4560302
48496 4560302 4571019 4578964 4584713 4589199 4593213 4597627 4603056 4609133 4614927 4620245 4625866 4632298 4639070 4645695
48482 4645695 4652669 4660799 4669878 4678816 4687087 4695418 4704813 4715320 4726056 4736209 4745738 4755212 4765229
48469 4765229 4776110 4787945 4800801 4814795 4830053 4846699 4864860 4884476 4904965 4925362 4945323
48458 4945323 4966062 4989677 5017101 5047109 5077962 5109752 5144276 5182600 5223727 5266096 5309431
48447 5309431 5354241 5400241 5446479 5492864 5540303 5589199 5638853 5688695 5739040 5789994 5840519
48436 5840519 5889505 5937269 5985086 6033514 6081907 6129409 6175603 6220221 6262876 6303188 6340673
48425 6340673 6374518 6404111 6429866 6452912 6473688 6491406 6505255 6515590 6523377 6528645 6530087 6526421
48413 6526421 6517919 6506334 6493324 6479183 6463267 6445348 6425908 6404935 6381111 6353031 6321060
48402 6321060 6287157 6252673 6216941 6178392 6136591 6092612 6047722 6002296 5956104 5909149 5861893
48391 5861893 5814855 5768282 5722154 5676306 5630588 5585134 5540607 5497961 5457916 5420823 5386986
48380 5386986 5356601 5329076 5302996 5277496 5253383 5232056 5213408 5195784 5178277 5162148 5149473
48369 5149473 5141040 5135900 5132212 5128060 5122453 5116367 5112204 5111295 5112503 5113967 5115362 5117302 5119384 5120565
48355 5120565 5121198 5122923 5126377 5130632 5135177 5140691 5147174 5152980 5156937 5160266 5165058 5171684 5178977 5186273
48341 5186273 5193809 5201336 5207864 5213016 5217578 5222382 5227460 5232704 5238641 5245965 5254524 5263127 5270388 5275671
48327 5275671 5279410 5282583 5285742 5288440 5289605 5288506 5285411 5281397 5277463 5273630 5268945 5262542 5254632 5246290
48313 5246290 5238488 5231691 5226064 5221319 5216457 5210671 5204770 5200801 5199698 5200141 5200317 5200078 5200559 5202359 5205114
48298 5205114 5208357 5211624 5213941 5214511 5214174 5215170 5218978 5225019 5231717 5238123 5244157 5249994 5255768 5261457 5266539
48283 5266539 5270092 5271648 5271604 5270372 5267498 5262370 5255638 5249040 5243425 5237553 5229502 5218982 5207490 5196170
48269 5196170 5184385 5170942 5156128 5141550 5128025 5114544 5099747 5083739 5067886 5053102 5038899
48258 5038899 5023971 5007308 4988848 4969539 4950966 4934565 4920854 4909188 4898281 4887163 4875825
48247 4875825 4864850 4854385 4843879 4833195 4823467 4816062 4810890 4806686 4802922 4800297 4799171 4798784 4798567
48234 4798567 4798991 4800184 4800872 4799922 4798123 4797045 4796735 4796012 4794605 4793221 4791497 4787666 4780767 4771769 4761744
48219 4761744 4750133 4735696 4718286 4698630 4676967 4652909 4626467 4598357 4569132 4538463 4505476
48208 4505476 4469749 4432063 4394101 4357166 4321231 4285507 4249771 4214622 4180572 4147514 4115057
48197 4115057 4082668 4049512 4015090 3980329 3947136 3916340 3886787 3856913 3826560 3796626 3767592
48186 3767592 3739097 3710535 3681493 3652018 3623104 3596366 3572475 3550249 3528065 3505905 3485165
48175 3485165 3466629 3449545 3432838 3416383 3400742 3386172 3372316 3358568 3344481 3329989 3315517
48164 3315517 3301737 3288991 3276797 3263963 3249367 3232834 3215138 3196959 3178187 3158827 3140181
48153 3140181 3123902 3109595 3094520 3076508 3056264 3035940 3016314 2996673 2976761 2957112 2937475
48142 2937475 2916564 2893817 2870218 2846877 2823852 2800847 2778023 2755381 2732218 2708063 2683629
48131 2683629 2660222 2638807 2620104 2604637 2591773 2579457 2566045 2552065 2539411 2529350 2522198
48120 2522198 2518069 2516406 2515212 2512586 2509205 2507707 2509252 2512171 2514515 2516254 2518200 2520433 2523134 2527485
48106 2527485 2533982 2540805 2545709 2549005 2552833 2557898 2562959 2567452 2572436 2578394 2584086 2588539 2592468 2596576
48092 2596576 2599970 2601732 2602939 2605528 2609810 2614601 2619281 2624288 2629874 2635718 2641644 2647516 2652556 2656003
48078 2656003 2658468 2661530 2665937 2671141 2676415 2681179 2684382 2685188 2684608 2684953 2687030 2689242 2690186 2690864 2693282
48063 2693282 2697868 2703491 2709320 2715409 2721830 2728417 2735366 2743198 2751948 2760771 2768291 2773283 2775624 2776939
48049 2776939 2779563 2784212 2789320 2793344 2797032 2802283 2809338 2816424 2822130 2826907 2832026 2838084 2844903 2852147
48035 2852147 2859642 2867635 2876878 2887982 2900541 2913570 2926935 2941733 2959054 2978889 3000420 3022697
48023 3022697 3044784 3066086 3087144 3109582 3134529 3161335 3188335 3214654 3240706 3267206 3294432
48012 3294432 3322505 3351624 3381531 3411195 3439685 3467371 3495793 3526203 3558557 3592089 3626463
48001 3626463 3661935 3698642 3736301 3774620 3813586 3853354 3894443 3938242 3986614 4040340 4097785
47990 4097785 4154835 4205554 4243061 4261138 4256469 4229726 4184503 4125468 4057443 3984950 3911371
47979 3911371 3838537 3767639 3700157 3637276 3578918 3524280 3473047 3425178 3379761 3335178 3290525
47968 3290525 3245996 3201889 3158128 3114916 3072870 3032184 2992343 2952827 2913386 2873488 2832369
47957 2832369 2789902 2746635 2702765 2657987 2612618 2567846 2524254 2481036 2437429 2394148 2352581
47946 2352581 2313086 2274974 2237843 2202083 2168163 2135974 2104891 2074213 2043695 2013790 1985092
47935 1985092 1957477 1930433 1904415 1881119 1861859 1846227 1832695 1819911 1807046 1793777 1780761
47924 1780761 1769396 1760325 1752635 1745326 1738768 1733726 1729525 1724512 1718134 1711450 1705728 1701513 1698887 1697407
47910 1697407 1695773 1692735 1688638 1685078 1682692 1680245 1676226 1670476 1663752 1656571 1649132 1641838 1635171 1629193
47896 1629193 1623532 1617718 1611509 1605136 1599165 1593655 1587597 1579929 1571096 1562679 1555235 1547498 1538353 1528751
47882 1528751 1520769 1515165 1510678 1505602 1499342 1492341 1485097 1477723 1470549 1464879 1462601 1464468 1468993 1473704
47868 1473704 1477589 1481619 1486778 1492508 1497573 1501704 1505705 1510488 1516641 1524453 1533573 1542951 1551901 1561008
47854 1561008 1571207 1582031 1591639 1598710 1603591 1607350 1610438 1612774 1614637 1616602 1618516 1619109 1617105 1612570
47840 1612570 1606731 1600271 1592289 1581436 1567909 1553596 1540124 1527319 1513931 1499306 1483882 1468474
47828 1468474 1453729 1440063 1427549 1415892 1404982 1395360 1387614 1381344 1375386 1369305 1364165 1361409 1361221
47815 1361221 1362420 1363971 1366143 1369867 1375138 1380633 1385263 1389710 1395808 1404497 1415081 1426540 1438675
47802 1438675 1451513 1464401 1476585 1488183 1499668 1510573 1519710 1526731 1532641 1538502 1544366 1549708
47790 1549708 1554167 1557363 1558640 1557716 1555379 1552904 1550697 1547890 1543315 1536701 1528894 1521035 1513452 1505298
47776 1505298 1495436 1483801 1471667 1460384 1450167 1440428 1430991 1422227 1414039 1405567 1396541 1388356 1382878
47763 1382878 1380204 1378471 1376052 1373183 1371075 1370337 1371063 1373690 1378458 1384184 1388917 1392149 1395344 1399880
47749 1399880 1405503 1411381 1417651 1424953 1433070 1441143 1448885 1456683 1464592 1472035 1478422 1483462 1486987 1489165
47735 1489165 1490784 1492732 1495368 1498909 1503953 1510740 1518170 1524579 1529460 1533582 1537626 1541874 1547252 1555265
47721 1555265 1566325 1579094 1591983 1604419 1616322 1627464 1638074 1649244 1661911 1675931 1690589
47710 1690589 1705193 1718643 1729486 1737408 1743939 1750715 1757722 1764216 1770482 1777225 1783716 1788102 1789525
47697 1789525 1788557 1785595 1780320 1773060 1765257 1757905 1750614 1742755 1734456 1725724 1715654 1703624 1690693
47684 1690693 1678732 1668500 1659488 1651319 1644160 1637655 1630506 1621716 1611867 1602767 1596056 1592263 1590813
47671 1590813 1590535 1590349 1589960 1590204 1592514 1597666 1604891 1612433 1619341 1626581 1636012 1648298 1662375 1677131
47657 1677131 1692967 1711127 1731898 1754273 1777311 1801030 1825632 1850547 1874881 1898637 1922880
47646 1922880 1948545 1975352 2001974 2026948 2049283 2068534 2084834 2098927 2111683 2123075 2131723
47635 2131723 2135905 2135145 2130443 2122822 2112226 2098321 2081943 2064809 2047665 2029526 2009153 1986735
47623 1986735 1963590 1940715 1918367 1896803 1876612 1858226 1841729 1827286 1815225 1805537 1797859 1792218
47611 1792218 1789307 1789743 1793489 1800345 1810432 1823668 1839008 1854862 1870313 1885786 1902670 1922245
47599 1922245 1944520 1967845 1990139 2010785 2030821 2051037 2070674 2088577 2104698 2119396 2131940
47588 2131940 2141103 2147010 2151060 2153984 2155154 2153877 2150039 2143234 2132626 2118337 2101959 2085090 2068295
47575 2068295 2051831 2036113 2020560 2003158 1982403 1959152 1935710 1913704 1893631 1875515 1858745
47564 1858745 1841809 1823617 1804838 1786827 1769493 1751391 1731812 1711597 1691878 1673160 1655767
47553 1655767 1640007 1625398 1610557 1594459 1577360 1560270 1543998 1528873 1514903 1501876 1489548
47542 1489548 1477725 1466009 1453813 1441142 1429039 1418627 1409920 1402175 1395043 1388581 1382461 1376216
47530 1376216 1370166 1365098 1361054 1357290 1353279 1348711 1342720 1334524 1324996 1316148 1308622 1300877 1291350 1280209
47516 1280209 1268422 1256370 1244119 1231961 1219850 1207283 1194570 1183139 1173644 1164775 1155104 1145261
47504 1145261 1137040 1130946 1125874 1120694 1115081 1109179 1103573 1099170 1096044 1092767 1087950 1081982 1076142 1070630
47490 1070630 1064979 1059896 1056648 1054517 1050744 1043791 1035105 1026834 1019082 1010491 1000499 989800 979117
47477 979117 968651 958492 948737 939281 930024 921128 912598 903857 894247 883799 873160 863009 853953
47464 853953 846582 840912 835764 829378 820957 811478 802930 796838 793407 791723 790614 789428 788150 786964
47450 786964 785895 784856 783723 782285 780447 778675 777841 778194 778659 777727 775228 772851 772715 775608 780785
47435 780785 787046 793545 799676 804913 809221 813266 817750 822702 827939 834069 842218 852414 862856 871364
47421 871364 877336 881882 886306 890940 895296 898809 901272 902895 903988 904438 903654 901297 897873 894292 891034
47406 891034 888137 885788 884286 883474 882785 881997 881467 881527 882202 883645 886201 889659 892900 894800 895332 895504
47390 895504 896495 899110 903698 910018 917117 923766 929241 933677 937773 942286 947691 954047 961018 968030
47376 968030 974561 980454 986007 991616 997253 1002527 1007437 1012826 1019664 1027995 1037038 1046352 1056428 1068021
47362 1068021 1081255 1095502 1109860 1123652 1136781 1149659 1162584 1175253 1187281 1198906 1210469
47351 1210469 1221313 1230330 1237913 1246156 1256302 1266948 1275880 1282855 1289132 1294763 1298202 1298806 1297973 1296926
47337 1296926 1294754 1289862 1282464 1274330 1266528 1258707 1250384 1241738 1233000 1224176 1215615 1207818 1200257 1191421
47323 1191421 1180748 1169774 1160455 1152907 1145705 1138150 1131190 1126222 1123841 1123811 1125322 1127061 1128078 1129098
47309 1129098 1132185 1138319 1145871 1152253 1156661 1160348 1164542 1169192 1173872 1178804 1184352 1190177 1195685 1201020
47295 1201020 1206921 1213493 1219531 1223325 1224076 1222476 1219937 1217259 1213957 1208964 1201939 1193565 1184401 1173758
47281 1173758 1160339 1144020 1126450 1109524 1093626 1077803 1061292 1044149 1026582 1008659 991028
47270 991028 975008 961261 948925 936737 924467 912434 900242 887354 874829 864962 858726 854637
47258 854637 850650 846146 841477 836616 831334 825948 820922 816207 811892 808960 808322 809380 810591 811301 812135
47243 812135 813786 816303 819451 822808 825550 827112 827984 829004 829944 829879 828851 827910 827326 826136 823905 821663
47227 821663 820333 819389 818080 817107 817918 820746 824351 827461 829730 831546 833722 837240 842518 848777 854673
47212 854673 859707 864766 871179 879474 889058 898985 908997 919647 931276 943194 954343 964662 975126
47199 975126 986510 998837 1011993 1025880 1039600 1051576 1061183 1069612 1078450 1088015 1097578 1106540 1114686
47186 1114686 1122014 1129106 1137046 1145979 1154175 1159382 1160778 1158872 1154107 1146789 1138115 1129964 1123377 1118018
47172 1118018 1113147 1108453 1103886 1099419 1094973 1090067 1083860 1076346 1069275 1064778 1063009 1062096 1060531 1058648
47158 1058648 1057593 1057813 1059017 1060843 1063097 1065857 1069592 1074640 1080476 1086139 1091598 1098037 1106638 1117719
47144 1117719 1131099 1146374 1162582 1178528 1193868 1209121 1224263 1238208 1250187 1260775 1270877
47133 1270877 1280328 1288044 1292998 1294700 1293503 1290960 1288920 1287477 1284569 1278377 1269423 1259659 1250477 1242559
47119 1242559 1236568 1232495 1229013 1225041 1221543 1220332 1221558 1224004 1227387 1232333 1238223 1243532 1248895 1257465
47105 1257465 1270936 1287184 1303442 1320076 1339204 1360788 1382533 1403234 1423992 1446094 1469644
47094 1469644 1494586 1521179 1548789 1575714 1601014 1625150 1648026 1667900 1683549 1696424 1709066
47083 1709066 1721905 1733121 1741326 1746779 1749810 1749736 1746131 1740178 1733866 1728248 1722982 1717042 1709400 1699506
47069 1699506 1687839 1675814 1664712 1654903 1646343 1639206 1633334 1627595 1620766 1613035 1605700 1599398 1593663
47056 1593663 1588567 1585669 1586433 1590297 1595318 1600402 1605958 1612426 1619215 1625508 1631376 1637469 1643944 1650180
47042 1650180 1655333 1658882 1660891 1661969 1662558 1661822 1657659 1648591 1635660 1621757 1608891 1596656 1583373
47029 1583373 1567994 1550380 1530622 1509112 1487224 1466851 1448710 1431534 1413490 1394366 1375956
47018 1375956 1360137 1346770 1333872 1319903 1305508 1292554 1281743 1271984 1262356 1253813 1248088 1245336
47006 1245336 1243945 1242724 1242317 1243954 1247538 1251716 1255540 1259378 1264203 1270517 1278171 1286829 1296235 1306045
46992 1306045 1315655 1324400 1331952 1338522 1344701 1351260 1358996 1368350 1378876 1389236 1398136 1405233 1411016
46979 1411016 1416064 1420873 1426216 1433002 1441459 1450791 1459791 1467643 1474325 1480724 1488269 1497784 1508547 1519113
46965 1519113 1529243 1540284 1553250 1567270 1580609 1592632 1604004 1615344 1626656 1638040 1650121
46954 1650121 1663435 1677781 1692391 1706622 1720531 1734905 1750442 1766679 1782176 1796203 1809728
46943 1809728 1824008 1838583 1851686 1862579 1872373 1882152 1891358 1898825 1904771 1910721 1917446 1923837 1928111
46930 1928111 1929680 1929377 1928101 1925901 1922681 1919143 1916220 1913646 1910066 1905027 1900027 1896881 1895615 1895014
46916 1895014 1894847 1896228 1899656 1903979 1907978 1912102 1917754 1925375 1934170 1943564 1954021 1966125 1979420
46903 1979420 1992678 2005299 2018125 2032606 2049188 2066693 2083459 2098923 2113910 2129516 2146009
46892 2146009 2162821 2179306 2195425 2211665 2228257 2244486 2259200 2272125 2284101 2295585 2305600
46881 2305600 2313013 2318374 2323296 2328095 2331390 2332416 2332427 2332991 2333872 2333731 2332363 2331075 2330951 2331756 2332773 2333917
46865 2333917 2335577 2337818 2340236 2342579 2345243 2349044 2354537 2361673 2370160 2379891 2390742 2402143 2413307
46852 2413307 2423995 2434708 2446069 2458373 2471741 2486172 2501279 2516433 2531381 2546282 2561047
46841 2561047 2575272 2588990 2602717 2616188 2627705 2635455 2639136 2639656 2637681 2633194 2626206 2617067 2606135
46828 2606135 2593781 2580717 2567743 2555222 2543341 2532807 2524648 2519243 2516181 2515232 2516900 2521810 2530026
46815 2530026 2541231 2555239 2571973 2591081 2611847 2633553 2655966 2679455 2704390 2730130 2754905
46804 2754905 2777085 2796484 2814027 2830322 2845145 2858309 2870373 2882150 2893843 2904991 2915151
46793 2915151 2924484 2933775 2943882 2955045 2966847 2978990 2991861 3005957 3020985 3036097 3051017 3066353
46781 3066353 3082694 3099988 3117976 3136585 3155445 3173506 3189775 3204295 3217814 3230414 3240869
46770 3240869 3247668 3250570 3250940 3250512 3249858 3248170 3244412 3238465 3231117 3223383 3216098 3209858 3204706 3199922 3194675
46755 3194675 3189125 3184614 3182533 3183092 3185266 3187848 3190748 3195492 3204303 3218243 3236256 3256340 3277543
46742 3277543 3300348 3325255 3351713 3378649 3405456 3432078 3458551 3484705 3509882 3532686 3551544
46731 3551544 3566049 3577432 3587247 3595806 3602263 3605933 3606865 3605202 3600513 3592005 3579274 3562840 3544032
46718 3544032 3524258 3504261 3484222 3464459 3445469 3427013 3407863 3387167 3365818 3345741 3327964
46707 3327964 3312176 3298081 3286135 3276367 3267312 3257074 3245336 3233521 3222834 3212838 3202365 3191369
46695 3191369 3181145 3172705 3165717 3159448 3154200 3150977 3149936 3150140 3151169 3154062 3159930 3168153 3176912 3185412
46681 3185412 3194729 3206260 3220034 3234901 3249953 3265273 3281474 3298838 3316957 3335037 3352576
46670 3352576 3369686 3386640 3403174 3418473 3431938 3443744 3454622 3465207 3475587 3485241 3493339 3499403
46658 3499403 3503818 3507634 3511755 3516418 3521444 3526827 3533018 3540697 3550114 3560518 3570527 3579464 3588226
46645 3588226 3598321 3610136 3622670 3634902 3646684 3658059 3668449 3676935 3682754 3685124 3683260 3677249
46633 3677249 3668457 3658164 3645867 3629571 3607757 3580630 3549605 3516173 3481279 3445247 3408137
46622 3408137 3370295 3332297 3294050 3254350 3212019 3167437 3122489 3079135 3038456 3000536 2964408
46611 2964408 2928452 2892019 2856669 2824722 2796474 2769987 2743800 2718346 2694205 2670567 2646740
46600 2646740 2624078 2604786 2589265 2575973 2563627 2552264 2542255 2533607 2526553 2521879 2520268 2521801
46588 2521801 2526194 2533013 2541811 2552734 2566824 2584900 2606161 2628739 2651617 2675028 2698934 2722258
46576 2722258 2743983 2763999 2782345 2798475 2811860 2822538 2830456 2835071 2836402 2835899 2835303 2834984 2834150
46563 2834150 2832452 2830604 2829593 2830010 2832185 2836388 2842890 2852296 2865751 2884222 2907388 2933585 2960946
46550 2960946 2988447 3016019 3044082 3073104 3103222 3133850 3163459 3189781 3210673 3225329 3234702
46539 3234702 3240192 3241763 3237819 3227109 3210120 3188280 3162436 3132805 3099848 3064441 3027434 2989768
46527 2989768 2952714 2917146 2882636 2847926 2812338 2776237 2740356 2705413 2672281 2641655 2613473
46516 2613473 2587323 2563290 2541508 2520915 2499641 2477015 2454153 2432082 2410360 2388357 2366794
46505 2366794 2346784 2327981 2309103 2290038 2272107 2256085 2241345 2227417 2215166 2205457 2197473 2189555
46493 2189555 2181476 2174847 2171077 2169695 2169020 2167901 2166460 2165589 2166231 2168965 2173778 2180173 2187626 2195861 2204624
46478 2204624 2213550 2222637 2232576 2244103 2257136 2271027 2285452 2300400 2315455 2330050 2344664 2360837
46466 2360837 2379513 2400146 2421947 2445052 2469541 2494174 2517618 2540617 2565489 2593295 2622785
46455 2622785 2652492 2682567 2713851 2746263 2779192 2812866 2848236 2885741 2924947 2965053 3004940
46444 3004940 3043084 3078618 3112595 3147099 3182628 3217065 3247741 3273885 3296442 3316169 3332984
46433 3332984 3347056 3359292 3370046 3377939 3380813 3378017 3371324 3363574 3356674 3350872 3345380 3339302 3332191
46420 3332191 3324186 3315685 3306587 3295843 3282086 3264913 3245379 3225015 3204404 3182825 3159109 3132654
46408 3132654 3103716 3073045 3041267 3008296 2973140 2934576 2892397 2847871 2802573 2756859 2710029
46397 2710029 2662179 2615238 2571560 2531737 2494400 2458088 2422703 2389091 2357927 2329472 2304057
46386 2304057 2282182 2264075 2249403 2237627 2228669 2223137 2221648 2223894 2228768 2235712 2245460 2258882 2275510
$$ [...]
##END NTUPLES=NMR SPECTRUM
##END=
