
##TITLE=AC1180_Huila-tarqui-HTAAH12026_5890762_zGK5nnsJgV
##JCAMPDX= 6.0         $$ Bruker NMR JCAMP-DX V2.0
##DATA TYPE= NMR SPECTRUM
##DATA CLASS= NTUPLES
##ORIGIN= BRUKER
##OWNER= Administrator
$$ 1.72 TOPSPIN		Version 2.1
$$ 2012-04-02 16:16:07.750 -0500  Administrator@TOPSPIN
$$ Compression mode = diff/dup
##.OBSERVE FREQUENCY= 400.13188235
##.OBSERVE NUCLEUS= ^1H
##.ACQUISITION MODE= SIMULTANEOUS (DQD)
##.ACQUISITION SCHEME= undefined
##.AVERAGES= 8
##.DIGITISER RES= 22
##SPECTROMETER/DATA SYSTEM= spect
##.PULSE SEQUENCE= zg30
##.SOLVENT NAME= COFFEE_meoh
##.SHIFT REFERENCE= INTERNAL, COFFEE_meoh, 1, 14.98061
##AUDIT TRAIL= $$ (NUMBER, WHEN, WHO, WHERE, PROCESS, VERSION, WHAT)
$$ ##TITLE= Audit trail, TOPSPIN		Version 2.1
$$ ##JCAMPDX= 5.01
$$ ##ORIGIN= Bruker BioSpin GmbH
$$ ##OWNER= Administrator
$$ $$ C:\Bruker\TOPSPIN/data/COFFEE/nmr/AC1180_Huila-tarqui-HTAAH12026_5890762_zGK5nnsJgV/10/pdata/1/auditp.txt
$$ ##AUDIT TRAIL=  $$ (NUMBER, WHEN, WHO, WHERE, PROCESS, VERSION, WHAT)
(   1,<2012-04-02 16:15:57.578 -0500>,<Administrator>,<TOPSPIN>,<go>,<TOPSPIN 2.1>,
      <created by zg
	started at 2012-04-02 16:14:50.468 -0500,
	POWCHK enabled, PULCHK disabled,
       configuration hash MD5:
       1A 1E CE 29 27 FD 77 03 67 4E F0 E3 C4 B2 CB 90
       data hash MD5: 64K
       49 83 3B 49 E7 91 A1 0C 21 94 BD 3A 6A E4 BC 53>)
(   2,<2012-04-02 16:16:01.453 -0500>,<Administrator>,<TOPSPIN>,<proc1d>,<TOPSPIN 2.1>,
      <Start of raw data processing
       efp LB = 0 FT_mod = 6 PKNL = 1 PHC0 = 0 PHC1 = 0 SI = 32K 
       data hash MD5: 32K
       DC D0 DF 31 D6 F9 F3 2E 18 CA 09 A7 FA 9C AA 6A>)
(   3,<2012-04-02 16:16:01.937 -0500>,<Administrator>,<TOPSPIN>,<proc1d>,<TOPSPIN 2.1>,
      <pk PHC0 = 212.0966 PHC1 = 0 
       data hash MD5: 32K
       89 AE 7D C4 3A 5E 42 60 8D F3 D1 B0 97 FB 6B 3C>)
(   4,<2012-04-02 16:16:02.015 -0500>,<Administrator>,<TOPSPIN>,<proc1d>,<TOPSPIN 2.1>,
      <abs ABSG = 1 
       data hash MD5: 32K
       55 5A C8 0D EF 52 D4 48 DF 24 CB 5E 2B DC 71 36>)
(   5,<2012-04-02 16:16:02.062 -0500>,<Administrator>,<TOPSPIN>,<proc1d>,<TOPSPIN 2.1>,
      <abs ABSG = 2 
       data hash MD5: 32K
       5F 6C 33 6F 2D C2 CB E6 42 3E F6 23 4C C7 23 AE>)
(   6,<2012-04-02 16:16:02.109 -0500>,<Administrator>,<TOPSPIN>,<proc1d>,<TOPSPIN 2.1>,
      <abs ABSG = 3 
       data hash MD5: 32K
       E2 EA 9F 6E C5 67 79 24 CE 9F F5 D8 E7 F3 60 EF>)
(   7,<2012-04-02 16:16:02.156 -0500>,<Administrator>,<TOPSPIN>,<proc1d>,<TOPSPIN 2.1>,
      <abs ABSG = 4 
       data hash MD5: 32K
       02 E2 22 00 40 BD 9C BC 81 53 4F E3 33 5C 3E 22>)
(   8,<2012-04-02 16:16:02.203 -0500>,<Administrator>,<TOPSPIN>,<proc1d>,<TOPSPIN 2.1>,
      <abs ABSG = 5 
       data hash MD5: 32K
       67 48 61 AA 66 AC 89 B6 4C 56 C5 2D 9C 37 CF 50>)
$$ ##END=
$$ 
$$ $$ hash MD5
$$ $$ BC 79 ED 3F 0B 81 D8 6B 13 FE 49 0F 03 9A C4 D8
##$RELAX= 
##$RELAX= 
##$RELAX= 
##$RELAX= 
##$RELAX= 
##$RELAX= 
##$RELAX= 
$$ Bruker specific parameters
$$ [...]
##$TP= (0..7)
150 150 150 150 150 150 150 150
##$TP07= 0
##$TPNAME0= <>
##$TPNAME1= <>
##$TPNAME2= <>
##$TPNAME3= <>
##$TPNAME4= <>
##$TPNAME5= <>
##$TPNAME6= <>
##$TPNAME7= <>
##$TPOAL= (0..7)
0.5 0.5 0.5 0.5 0.5 0.5 0.5 0.5
##$TPOFFS= (0..7)
0 0 0 0 0 0 0 0
##$TUNHIN= 0
##$TUNHOUT= 0
##$TUNXOUT= 0
##$USERA1= <user>
##$USERA2= <user>
##$USERA3= <user>
##$USERA4= <user>
##$USERA5= <user>
##$V9= 5
##$VALIST= <valist>
##$VCLIST= <CCCCCCCCCCCCCCC>
##$VD= 0
##$VDLIST= <DDDDDDDDDDDDDDD>
##$VPLIST= <PPPPPPPPPPPPPPP>
##$VTLIST= <TTTTTTTTTTTTTTT>
##$WBST= 2048
##$WBSW= 25
##$XGAIN= (0..3)
0 0 0 0
##$XL= 0
##$YL= 0
##$YMAX_a= 533096
##$YMIN_a= -647951
##$ZGOPTNS= <>
##$ZL1= 120
##$ZL2= 120
##$ZL3= 120
##$ZL4= 120
##$ABSF1= 14.98061
##$ABSF2= -5.57192
##$ABSG= 5
##$ABSL= 3
##$ALPHA= 0
##$AQORDER= 0
##$ASSFAC= 0
##$ASSFACI= 0
##$ASSFACX= 0
##$ASSWID= 0
##$AUNMP= <proc_prof1d_extract_pilot.lims>
##$AXLEFT= 0
##$AXNAME= <>
##$AXNUC= <1H>
##$AXRIGHT= 0
##$AXTYPE= 0
##$AXUNIT= <>
##$AZFE= 0.1
##$AZFW= 0.1
##$BCFW= 0
##$BC_mod= 0
##$BYTORDP= 0
##$COROFFS= 0
##$CY= 15
##$DATMOD= 1
##$DC= 0
##$DFILT= <>
##$DTYPP= 0
##$F1P= 0
##$F2P= 0
##$FCOR= 0.5
##$FTSIZE= 32768
##$FT_mod= 6
##$GAMMA= 0
##$GB= 0
##$INTBC= 1
##$INTSCL= 1
##$ISEN= 128
##$LB= 0
##$LEV0= 0
##$LPBIN= 0
##$MAXI= 10000
##$MC2= 0
##$MEAN= 0
##$ME_mod= 0
##$MI= 0
##$NCOEF= 0
##$NC_proc= -8
##$NLEV= 6
##$NOISF1= 0
##$NOISF2= 0
##$NSP= 0
##$NTH_PI= 0
##$NZP= 0
##$OFFSET= 14.98061
##$PC= 1
##$PHC0= 212.0966
##$PHC1= 0
##$PH_mod= 1
##$PKNL= yes
##$PPARMOD= 0
##$PPDIAG= 0
##$PPIPTYP= 0
##$PPMPNUM= 2147483647
##$PPRESOL= 1
##$PSCAL= 4
##$PSIGN= 0
##$PYNMP= <proc.py>
##$REVERSE= no
##$SF= 400.13
##$SI= 32768
##$SIGF1= 0
##$SIGF2= 0
##$SINO= 400
##$SIOLD= 32768
##$SPECTYP= <>
##$SREGLST= <1H.CDCl3>
##$SSB= 0
##$STSI= 32768
##$STSR= 0
##$SW_p= 8223.68421052632
##$SYMM= 0
##$S_DEV= 0
##$TDeff= 65536
##$TDoff= 0
##$TI= <>
##$TILT= no
##$TM1= 0
##$TM2= 0
##$TOPLEV= 0
##$USERP1= <user>
##$USERP2= <user>
##$USERP3= <user>
##$USERP4= <user>
##$USERP5= <user>
##$WDW= 1
##$XDIM= 32768
##$YMAX_p= 461764659
##$YMIN_p= -719163
##$CURPLOT= <Network HP LaserJet P1505>
##$CURPRIN= <$Network HP LaserJet P1505>
##$DFORMAT= <normdp>
##$LAYOUT= <+/1D_H.xwp>
##$LFORMAT= <normlp>
##$PFORMAT= <normpl>
##$SURQMSG= 1
$$ End of Bruker specific parameters
$$ ---------------------------------
##NTUPLES= NMR SPECTRUM
##VAR_NAME=  FREQUENCY,     SPECTRUM/REAL,   SPECTRUM/IMAG
##SYMBOL=    X,             R,               I
##VAR_TYPE=  INDEPENDENT,   DEPENDENT,       DEPENDENT
##VAR_FORM=  AFFN,          ASDF,            ASDF
##VAR_DIM=   32768,         32768,           32768
##UNITS=     HZ,            ARBITRARY UNITS, ARBITRARY UNITS
##FACTOR=    0.250966925370066, 1,           1
##FIRST=     8223.43324360095, -73813,       -13539
##LAST=      0,             -112712,         27436
##MIN=       0,             -719163,         0
##MAX=       8223.43324360095, 461764659,    0
$$ Real data points
##PAGE= N=1
##DATA TABLE= (X++(R..R)), XYDATA
$$ [...]
23801 -33234 415137 -206636 -196886 71607 -38108 -179727 -328253 2580 126779 -16271 124008
23789 85108 -42197 -3857 46213 -220230 236637 6820 208438 -114878 -86467 -33940 -106507
23778 -106507 -62529 77979 273159 97460 -27997 61482 -28158 -59669 279137 -10380 303181
23766 -173149 11036 -360992 72062 -296835 163260 -212253 130638 -62427 74575 460994
23756 460994 -73519 22900 -90781 85538 337156 -41961 -14202 11219 84131 -66512 -81862
23745 -81862 45229 98531 189653 -101929 -94895 320992 217424 136497 -23162 -85272 -22416
23733 -332884 -140480 117548 247237 148277 60475 418453 126094 -153736 79462 32441
23722 -183650 26422 15992 -202030 -6885 -80943 195851 122694 137806 -56113 -298370 -129521
23710 -70808 106420 36457 -9288 52647 -110820 53473 -47054 -103120 80650 -12063 -4560 -20979
23698 -20979 -162565 63084 -64067 -183676 -100241 5952 -111232 -146179 249189 -84161 -362521
23687 -362521 -127991 145729 146231 -91630 -48189 40692 -3806 142450 37729 -66764 -449642
23676 -449642 122304 -403056 279445 -192583 -302074 -129889 89175 -85237 -57459 -235183
23666 -235183 -257250 33061 -331277 -144459 -245089 -134673 44242 -76935 -38613 115466
23655 71045 -176371 -223859 -185319 -118538 -92112 189493 -40799 41878 -88529 -75592 219832
23643 115527 -139911 -218369 151849 232304 -167342 -34540 -116615 -16660 -54170 -125325 -83329
23632 -83329 25683 99400 -34328 -3646 67596 -197917 71339 521881 97262 -93841 -195474
23621 -195474 -364383 -67714 -268162 -200085 97150 -147816 364342 44298 89911 -258272
23610 13814 113640 -43138 -72193 -516472 96634 62480 145399 -228587 -46358 334146 -47993
23598 -215213 -87458 95570 -113248 -100193 75836 142262 128195 51166 113744 -122197 277318
23586 236876 104040 158934 77064 -224208 -5370 -229549 -72465 64058 -125068 180391 105568
23575 105568 -40045 207595 285392 107252 150472 117169 -50882 65040 38897 -209239 -445458
23564 -445458 -138808 -140127 84971 98623 59805 -276704 5020 99401 100634 219001 -185532
23552 -173594 92270 -4547 -37145 125167 -284200 55087 149302 37276 -51346 -431642 -384376
23541 -384376 -236707 157007 -178194 180293 258331 -48361 -70397 -246600 -119430 -14480
23530 -353377 -65138 -110433 -272753 -44812 -131091 227476 303059 63996 59009 68928 27120
23518 143603 127544 84091 -84304 -122629 21243 -47797 48936 417201 -196693 -58415 -10564
23506 37757 -267735 -60272 159484 134404 184829 83393 208279 47504 -70743 -24675 -53808
23495 -53808 -137547 -124940 81673 35957 -98678 -7038 5022 -159203 26034 -320065 -7085 49768
23482 -323555 -222756 127458 94545 -206275 93916 -4105 68050 170966 -107214 -244593
23472 -244593 123288 212762 198063 -26444 -160952 -225351 -128743 -55001 -55712 90773 110059
23461 110059 200060 -161765 45921 -182800 72842 -133499 -266146 138120 12125 108092
23451 108092 74801 31595 -293278 41063 405237 110261 -26182 -123492 28118 140813 -54953
23439 244217 -143947 -27028 256474 114932 -46093 -345592 29034 -24731 -106067 -178649 -258304
23428 -258304 -137015 -8667 -71157 94550 76780 17562 -73177 123588 -201940 685 -197966
23416 -261865 -204103 -3924 -155234 -201497 -163597 -33919 253466 290164 -104969 -120858 -219617
23405 -219617 -49682 91972 -195438 -2065 1230 -79239 -107883 101042 22449 143263 -45609
23393 25023 -185713 -264627 -182357 267101 -172929 -175070 252244 185343 -49760 124734 -118147
23381 119312 -84473 -95386 -164008 -73982 -141655 250019 -445758 -16744 53552 -161147 -49108
23369 214392 120941 76865 30237 38068 -476398 30473 97557 -343195 144251 -79621 -110062
23358 -110062 -84902 -169902 -219669 109436 429434 -249952 115670 143325 -213953 35737
23347 -35083 -159220 23115 155557 61235 64096 43851 135742 126412 39071 58179 107626 -157407
23334 207617 -100845 276165 -217546 72427 26083 -121834 82904 -70152 -131798 -17912 187483
23322 -227159 -80203 -5206 -123975 -81406 -580182 -139837 -97863 68185 243939 32215 -187967
23310 -11801 -67124 51981 52361 -206923 -78853 -21378 -172220 204280 30919 -54756 193345
23298 8744 -422329 -203077 -61582 -255038 -106176 -209426 -154336 235629 39868 202255
23288 202255 -155908 126476 -229527 176755 140005 -432071 106827 398487 -9811 -59023
23278 -59023 -246027 -187801 175055 -347028 36023 22750 -55950 -176298 160966 -69313 236427
23266 69785 -87733 -117660 291015 -38535 -82320 -130691 -159264 -69794 -453120 -241901 353013
23254 -64741 -76761 -34394 -400433 21663 39687 208150 -102744 122814 65315 47224 -192672
23242 99954 -202625 -102397 -290639 -54860 -116036 79109 269574 -175847 -262113 -184146 227406
23230 58714 -87053 177795 71234 -172108 185980 346912 -262655 -9046 -159270 -206230 -46865
23218 -56388 -258253 138054 129497 44664 95665 40228 33097 65279 -63137 -313651 6694 -80633
23205 128332 46676 -279310 -214567 -420256 281027 -284114 -292492 -290130 -140637 -149247 -153591
23194 -153591 -82277 192653 94790 20986 152018 -165490 120124 6018 -218658 -30467 -237247
23183 -237247 52186 209986 -175972 -62517 57018 114841 170145 -265263 -178870 -171384 -25749
23171 -57141 -37359 139905 -196817 119629 60005 3575 68812 -63750 18669 313742 123545
23159 24954 -148200 -230947 249183 -345621 -57068 -252483 -55361 185893 -119900 -60345
23149 -60345 -197846 -550590 42516 29538 55568 168400 -268918 185366 -32321 -30145 -26141
23138 -26141 -79367 131739 -135680 -212019 -41393 32434 -31929 -92070 25199 104033 859 -144063
23125 -1962 -196052 125345 -15748 -25974 -132964 -73818 284884 -375895 207448 411927
23115 411927 -56151 86506 14904 150826 244395 244465 22886 170439 -180664 271243 -480302
23103 77260 -238904 255925 -60084 125402 34720 170058 -6908 137051 183354 -181652 68441
23091 -198105 -128417 132077 30244 45256 -196121 106295 195983 46508 29500 -94552 101846
23079 89361 -172661 206382 -81526 322788 -284227 17252 122721 248966 137167 -5890
23068 170996 -167629 -156674 -437226 -164466 258907 263220 35004 7709 149067 -163800 -133432
23057 -133432 -66269 284357 300457 310384 -378826 33091 106831 -303942 -123063 97430 175891
23046 175891 -49809 262541 130056 -30998 192211 -85640 37854 113246 84435 -81002 88637
23034 202641 -175968 90681 2352 148401 108883 -220286 119963 -87963 63352 128504 114048
23023 114048 7338 291896 129363 -194873 104643 31023 84342 -30075 66535 -72777 85662
23011 -234339 -38697 100319 20727 122227 40355 184381 -317236 -102016 -527896 -176013
23000 -262954 -22455 91253 -128925 256570 -98271 193267 48350 102930 -77122 32176 85304
22989 85304 -239420 86510 5896 97211 -44571 134297 -80901 -3136 81269 -183571 11046
22977 139944 -10433 -195775 90624 -265336 -254559 57810 45511 -318527 223549 54062 -166449
22965 5084 -141396 -352355 -253073 65811 -65180 -90193 -40716 9595 -33244 -381665 -291978
22954 -291978 -135085 -3973 96933 -37711 255990 -158523 66806 -216508 -193926 106851 -95710
22942 -43540 -264982 -433449 -246134 -181439 -247859 206043 -96641 -6375 68861 -216355 -298075
22931 -298075 -2293 -499312 -182193 42821 -151625 51276 93232 60172 84914 -32143 -208117
22920 -208117 8686 61442 -92075 -93034 -65345 -81524 -74961 -473367 49867 238743 -310915 157194
22907 -166503 131473 113735 -131324 -74876 -41213 -179817 -95866 298559 -206562 86333
22896 140539 -135570 -7128 -305214 49606 -43130 -40119 -152997 -242204 -169401 -27038 11231
22884 -104362 329745 -190618 223960 -177516 99229 -83520 135846 139535 8371 -270859 -306635
22873 -306635 15637 127603 114553 -166830 -12617 -24671 -97852 5845 188781 20164 -139809
22861 -48273 -113823 -9856 128270 88410 26074 92366 -206252 -435 7373 -129494 149954 -112307
22848 300082 -147168 16595 279775 -228314 -244533 -45068 103371 -25522 172854 -281744
22837 157846 188654 -62438 151958 -150754 71184 -71736 80388 -116833 38750 127768 -277289
22825 95736 118074 -212454 -138266 -149847 57110 -170815 -131351 37760 -361223 -211499 -141579
22814 -141579 -281287 192596 -30990 47490 247533 270414 122241 52513 37717 -473944
22803 28950 199010 7974 332686 -141336 106125 53416 127707 -43729 -71843 43996 154724
22792 154724 -126085 85502 -71178 -441 113884 -65015 -80983 -105535 169828 -242816 -123390
22781 -123390 207655 24431 31898 -144555 46827 -57691 -169048 284495 -53629 195134 -129005
22769 -198131 -191807 116909 246397 -80170 159465 -369135 258106 -146739 -145692 85364 -166399
22757 -100517 -27335 -120833 -95159 97406 400667 -78626 -143483 -185517 89977 -11726 17709
22745 35733 118366 -158459 -41195 168701 6286 170437 169352 -93764 -5114 -187823 144388
22733 47105 -241496 -223256 -242877 -145467 -280423 -22866 -167034 -140606 -458213 210140 141519
22722 141519 471747 -132215 -55570 -75936 -70662 -348652 -53044 -106007 -25777 -34656 -140716
22711 -140716 177162 124757 -95500 -67984 -282117 -53685 82306 -12655 -110268 -144279 7593
22699 -182482 168620 165248 -312774 -152594 -111173 195157 -345919 6172 -25234 -11258 -4358
22687 -35118 -346335 33458 28030 5566 -63867 -83832 -76492 -265734 -95745 -159502 124048 -347029
22674 -147469 -950 43346 -139324 95297 -252630 -259757 -63693 73331 414121 134227 -168547
22662 -91492 309 192352 -14158 -258919 -153648 -34859 228832 5348 -253704 -192895 88556
22650 -222249 25918 -100769 131687 -9219 -172118 272391 38832 -193150 94773 129902 -155386
22638 -72737 -121592 -11655 110174 -419513 -86364 -264168 90774 173125 -241539 -87388 -18155
22626 -65906 -161476 -31827 -313612 -293475 -251073 2566 70129 223612 180388 -9380 -46361 121911
22613 235837 368168 -34606 -313159 253482 -32582 270177 -72975 40416 -68065 -129439 396085
22601 -275130 139111 68222 -72928 3198 115828 -101809 117872 164677 -114854 -106233 -26419
22589 -177088 -49758 398851 106613 -8345 190969 19721 -170365 -207016 4991 -138442 79450
22577 -53746 -180292 85846 -153182 -63966 133446 -112271 56837 -93577 -51478 40274 -101206
22565 84992 -107532 -231984 159612 -17839 112165 -90913 20193 -32620 -18034 108161 118859
22554 118859 -86661 -388710 -68210 169352 157299 -362202 714 -194356 73953 -203812 -109853
22543 -109853 211754 269245 -21050 311625 380157 102847 -7197 -176428 -284777 139713
22532 163579 -76403 -330485 90626 21997 -28340 -106332 -261635 57898 -203598 -18601 92131
22520 61001 296997 -149473 -115829 -377327 -181376 51662 -424167 -317905 305593 -257401
22509 227542 -225600 -143433 -52770 -146680 -86582 23687 -176004 -126973 -95051 214757 -215054
22497 -95495 -146704 127459 65703 46885 -24655 116302 102094 41916 23199 -20134 62658
22485 -35086 -59932 -110382 -141156 -115893 113479 25435 42220 122194 -196307 -47738 -25123
22474 -25123 -38140 -270169 -188334 -138975 -134457 -14383 119872 -88900 -197558 -259759 -55779
22462 -59620 -1875 -210598 -51215 -169123 7422 19053 14079 -43513 -2762 -215342 -181635 61859
22449 -155173 -304151 -379886 -139534 73722 -100538 -43683 -68524 -31062 -157285 -261749
22439 -261749 -98716 52233 167647 -169035 -36542 -119316 -165323 -111380 -96144 76574 223009
22428 223009 57135 -150267 -102639 -300103 -41506 229049 41516 -180110 -62546 272419
22417 -84253 -97983 288224 42296 -131930 -38340 -13172 21516 -59551 85361 -117756 -151114
22406 -151114 480777 45810 -236552 194888 -151095 127192 -146790 6831 172738 262097
22396 262097 55318 129828 25633 -68427 -18248 -26141 -36744 59566 420733 192873 -287454
22384 -170213 -196747 -55536 -17838 151041 -241589 -238851 -290557 -5391 -138271 -155807 253487
22372 -282417 -33677 -299144 -119408 137498 -67310 -29304 -116170 111299 -120568 54008
22361 342093 330729 -55159 -187652 59985 -221610 213837 -212760 114553 34377 -59046
22350 -24204 -318794 -172624 -150794 -162957 212797 114428 48410 -236560 261913 -219889
22339 194620 -172621 -84399 -166634 -152254 214455 -121354 162244 -123755 -314464 121923
22328 -121712 -314350 69254 -419898 348690 -27411 -137043 -142753 230581 -325559 -37908
22317 11085 222350 112691 -345633 -423263 -8060 90676 -185970 -234114 -74246 30346 -67167
22305 130299 -351714 36823 -8893 124159 -193748 -68271 -70445 -354080 174080 -295286 124069
22293 -254031 -258722 -93985 -7823 30600 139235 -296269 15770 -115165 41746 -232576 -15338
22281 -167065 93955 160990 -48116 169119 272137 74015 -336566 -12732 -13427 -115651 46929
22269 86374 303955 142517 114743 24170 20775 238785 -230228 65725 -172634 221750 6724
22257 44406 -47674 -468150 73455 -288437 -52701 103514 63520 -265998 141260 -46322 -320206
22246 -320206 -359684 32304 -140506 2524 -425912 189724 14416 -132421 -183881 -306660 -107723
22234 -93324 -77508 152915 -537630 179178 -260522 236053 166740 -134534 -155752 -293828
22224 -293828 237935 -28216 20390 126741 -103598 -32727 -209089 165660 -385123 -100118
22213 -52278 -9553 -48542 -666 -254509 -199299 -152655 179193 -120667 88523 -191861 -60881
22201 -379690 -21548 -167569 -58406 201553 -55370 -135854 -63264 -10931 -130418 116336 64266
22190 64266 -280998 11095 -33453 -150420 92123 147383 70167 -153383 2722 -17881 -254871
22179 -254871 9264 -14494 48695 -280466 137559 252320 90430 391076 -115028 -44236 -32839
22168 -32839 172931 -164069 13773 -125184 25757 -151984 -246547 -227251 126681 -154454
22157 179147 12945 -1512 169820 -125884 29752 128829 -518168 145391 -194216 -34029 -45472
22146 -45472 -2762 -36745 -195756 -152981 -173578 54295 -48610 -334705 -259184 -62217 -43339
22135 -43339 -219297 -32705 93668 -268995 78793 116499 17626 -45675 -131344 -219856 -285495
22124 -285495 -79138 -192731 -280196 -114134 3306 -55581 337856 157972 -323031 -334945 -325709
22113 -325709 -215080 93412 48805 -269654 -292077 -139026 -127396 -288109 -36000 -194217
22103 -194217 -84814 287402 -41860 35012 -39366 146130 272716 -445572 302803 -263054
22092 72535 -123367 -27104 -407225 -21836 -26859 -159809 293213 157636 136861 16227 221885
22081 221885 -414129 -38720 -178773 153870 33561 -109894 128896 -132917 33869 -129123
22070 174844 -366932 29888 -308932 -28859 -148342 18072 111580 214824 106653 -262588
22059 -73905 -49391 65705 -97208 -50071 -22382 182901 -189676 41406 -249374 228949 328381
22048 328381 121619 -100291 10936 -59114 -336119 -69770 162861 -141362 189922 40981
22037 29072 -17041 -571196 -139277 520911 -150200 -208953 176896 -10210 -81574 -155299 -25961
22025 221566 209584 -274798 -126638 155707 -111506 50968 -29663 -47159 -32984 71263 -90259
22013 15115 -53098 13585 -291331 -30928 -18500 -25262 -241291 -17643 -78813 -85058 -82974 36420
22000 5091 -67411 -528401 -165019 103020 -228495 315035 -234888 18528 102847 -75670 9945
21988 283764 -7591 326152 -40106 -191055 -5104 -171595 -216630 -132396 -137209 -26482 -75596
21977 -75596 -32064 -39 87731 -13674 -231927 -888 -12988 106703 284916 -178589 -340374 -186439
21965 -186439 447859 125023 134283 95970 -163691 -163657 16218 -57199 -40625 -118438 -309614
21954 -309614 -89911 13994 -18307 -50259 -121784 29212 -321640 46509 194241 335183 124713
21942 -317194 370661 -224139 11792 86917 -299236 -317099 11206 88794 -190291 -480395
21932 -480395 -151171 22831 -83205 -177051 -216777 68615 -272524 -433866 -87057 -42866 -19375
21920 68492 -3265 4718 -121841 7810 -224291 337151 -161701 -275386 136749 28966 -159590
21908 -41623 -178952 59122 -331053 -91369 71967 -8812 -231661 -26453 -78511 -56326 -409137
21897 -409137 246537 201364 17901 62135 101160 -152092 -53902 -184584 -162413 -138940 26167
21885 44772 -50771 20947 -129724 -39268 -70762 -27073 -143226 234678 -34359 -330842 -103779
21873 234064 -324395 -98264 8976 264698 -34362 -220157 234774 9763 -30529 -103494 19227
21861 -318803 200931 258414 79397 -139521 -282242 270118 2102 64576 -222366 -367271
21851 -367271 394328 -4037 -166400 -186259 -224936 -341833 -159291 125049 155687 -297924
21840 -203238 -37893 -413685 -214997 41466 72854 -126407 24793 -196796 142653 222671
21830 222671 174041 -32700 244355 -46322 10292 -34394 4912 -90495 58872 -125253 183744
21818 45354 42734 -8011 -83093 -135747 95213 78760 -62203 -70806 175288 -123851 119421 138120
21806 138120 -135823 -104134 102682 -225756 22974 -29245 -99900 -134153 -188053 39037 -129311
21794 2350 78086 -163311 3561 -169347 -615692 -198916 -285053 219093 -67161 -51749 134709
21782 95049 -408454 177247 -238922 -294041 -62278 -105552 190816 -202938 -321835 -29464
21771 -10259 -38823 154404 -182385 -16278 -51619 219626 -23338 99080 -185891 -165849 37912
21759 -421754 120282 84249 -209621 195936 118332 93811 -72604 168754 13795 -119879
21748 -183493 257272 188906 220484 -110791 -84610 -17129 336944 -219378 184511 -56853
21737 35688 91512 150524 134118 231370 103855 -231507 -283027 116289 -122287 80721 -124278
21725 106861 195789 131691 25195 -278724 162806 56624 -89343 -24410 -101446 32086 109765
21714 109765 128631 -151661 -163456 -355657 -434124 -58019 -15607 -477438 -372242 -254112
21704 -254112 11974 -409285 40427 -121520 48262 -3970 -30647 198264 -144978 -34911 -46487
21693 -46487 45741 -173846 339458 -202743 -333828 -165601 -172539 431391 -215725 48265
21682 -250726 107270 -145787 -39987 -162089 32050 9462 -53066 -132494 178440 -145690 -270423
21671 -270423 -97043 -118615 -63559 -164805 102492 299194 99197 -57210 -303362 -14272 -178213
21660 -178213 -66810 147546 -317926 3105 -256119 61621 -178029 124147 -228412 -104881
21649 -149346 57195 -125910 -118630 68249 113868 -114468 -102674 -131762 21307 -98163 -3280
21637 -168463 25839 -49778 -14294 57552 98379 -214486 -150083 -233257 351665 9190 -159313
21625 -90167 -237032 -169788 -145237 -128566 -22603 12743 493397 -124446 -82458 -74032 -57518
21614 -57518 176283 -92965 220242 -101663 -79700 -122132 -91623 -129651 284677 78002 -23066
21602 64573 -514398 -148806 -5858 84693 -196205 -15224 152238 111341 151233 -127346 27701
21590 -171947 -128571 -10555 -165971 -135922 152121 65644 140940 91633 -319194 6398 -158789
21578 -229099 -302605 -168601 414032 -52809 130435 18332 71478 -106396 -79384 -22935 -75644
21567 -75644 -162005 128518 -52429 92289 -121366 -218829 -176713 -283065 -93761 149435 -6202
21555 83617 -90452 116859 117331 220836 -108961 -117954 -14755 -21154 69364 -279724 -126541
21543 -99402 165988 -4388 -245112 -195510 -134815 218614 -342390 120678 -28901 199965 -170027
21531 -73421 -203443 -117821 272320 121596 -42486 -95626 -228601 -103371 9117 -94629 -30228
21519 41060 -78246 -236046 -283575 257080 74528 -319665 9052 -46166 -227106 -170993 110443
21507 -286263 -92844 228179 135997 -116688 -48103 -202259 82591 -155655 -201528 -118305 -146749
21496 -146749 326507 196227 27972 100367 -8388 -301757 -32819 -211072 -131655 89531 198708
21485 198708 120270 -56386 13523 -156555 -1109 -58440 -492599 -49203 -190614 -165584 -67503
21473 -83411 -333032 122080 -249434 -57753 2021 -321189 106381 -122717 -24121 -61324 -235428
21462 -235428 -117605 -174264 -387627 217472 -23314 210042 279839 95732 -191490 -117529
21452 -117529 -45820 -377312 -207908 -76885 346783 -189785 -168675 -183620 -95667 332025
21441 8507 -142010 65293 76211 187208 20704 39300 59447 -70529 -52531 -291961 -1523
21429 -99708 -215054 132010 40027 270107 262039 197159 443752 12729 -25793 303466 -148215
21417 -386836 -17554 -30367 -183164 -190926 -95148 160123 -76882 113054 -220853 58241 -228527
21405 -54515 -170457 21657 -207391 -175560 -336786 -293296 -407938 -98461 284268 -95378 1338
21393 -167355 179877 -176588 -16902 -121495 133795 66452 243 120102 127281 396745 36197
21381 -179206 -241470 137656 -211518 -151913 -374687 -188075 79724 -6843 46214 292061 -38848
21369 54110 81257 -158376 -322958 10705 -92662 181119 -62403 -76480 -89084 -123686 24004
21357 -100271 -122525 -346704 -90492 -47555 9166 56738 -142082 -17311 -176858 -209728 359904
21345 -261237 43810 -3991 101757 -293321 187147 99540 -59418 -124523 -283464 -23754 -163446
21334 -163446 50753 -4101 82383 34253 -235516 -111357 182072 -271339 91535 -175029 -245980
21323 -245980 -68297 65460 -332664 -78009 19518 -296004 -251755 -70062 66970 179745 -117614
21311 -242552 514 -256971 -78342 -414242 -4569 -105722 53141 -75402 189700 -216941 -304772
21300 -304772 -22363 -18100 -51669 -23325 -94001 36254 -102842 -445157 -159047 49752 -222282
21288 -154870 -38213 -329593 95291 124395 -522003 -95100 -60769 -57102 108820 -240200 -226830
21277 -226830 -133516 -94499 -19369 -564665 70857 -203835 140723 -54607 -165681 -79638 82546
21265 -106909 46879 124391 68196 -137387 76215 -49756 -327574 250744 -108206 -133500 -293829
21254 -293829 -238850 -3156 249306 13715 -220541 115629 -202761 -9354 -208455 -112187 12555
21242 225293 40921 -85226 -116133 -121931 7756 -89365 146037 196802 -318301 -68853 -245207
21231 -245207 -173322 -32543 -19323 74138 178817 290400 33995 -46332 -26790 -227793 94659
21219 229448 89063 248368 198056 -42781 -2159 -112737 167517 -29663 380151 -247653 -167688
21208 -167688 -265531 141997 106 -118117 46686 483009 -141986 -138185 -119785 -296448 -36509
21196 -13466 215056 -42682 -174335 -170478 -66388 44685 62969 -30714 -264478 -20436 74143
21184 -228283 -104120 75243 -99533 -101904 206513 -61355 -293407 255746 13490 115793 -1942
21172 -154554 -50856 -168993 44844 -15766 44497 21536 -76708 71235 316513 -126618 15618
21160 7192 -43907 -22614 -391461 133047 -234501 -374993 -243569 20342 36568 -531485 -262189
21148 -220429 43905 58811 -181474 -101843 -254432 -51152 -610284 -271101 -315007 -234856 18021
21136 -2351 832 -37756 -348597 -140268 239117 -107791 -275729 32515 -71935 172667 160675
21125 160675 -452752 78819 -203970 -123266 -136177 -456127 92201 237247 -85247 -237919
21115 -237919 35957 -80567 59195 239157 -22895 -148597 -80624 -212462 140654 63567 -199334
21103 171603 128295 -130639 291587 84941 -325309 146570 25163 -409496 66786 281526
21093 281526 -390109 -70276 -199854 -355428 177391 -122484 -212489 43 -148012 111151 15649
21081 -157653 -243675 -16982 93174 -130133 -123584 199515 -482634 69582 138734 208680 -90874
21069 81105 92926 -169969 -56056 224893 346108 -126202 -19564 156041 -85241 -168214 -108756
21058 -108756 19366 188828 -96960 -180603 -20231 -224715 -3068 -79175 87904 159504 -54814
21046 36106 -31349 -332123 -39557 -121849 47447 -14889 95581 -44733 -158945 -164268 -21151
21034 38114 295145 -10360 -8305 163048 -217431 -215232 117833 325505 -335472 165644 164718
21023 164718 -80003 -165219 113919 -264994 -204869 1054 -48654 -97327 447325 -44367 -362053
21012 -362053 62205 -337999 91107 202593 -173732 -83787 -69843 101198 -442220 176476
21001 -33008 -19766 -543439 -8634 5214 74751 175538 358093 325428 204922 252717 367987
20990 367987 89263 69394 -235218 -29874 1444 -127801 75055 237895 47673 204854 -94513
20978 170551 -79198 184786 69817 -113306 -187902 -402312 -107835 -68045 -102749 -169392 -151056
20967 -151056 67148 210921 39213 85234 -4973 70744 -231495 -8440 -61339 74645 -91178
20955 93514 297302 -14116 208611 171801 1372 213888 -147154 239291 -78595 -146667 15266
20943 183835 329525 -191543 -277263 -13629 -72566 -163332 158895 -198192 38167 -39665 232210
20931 -109628 78068 261179 163251 132362 123230 -112166 -68743 287027 38708 -134047 23248
20919 41703 189145 75081 -68898 152852 -155913 -311329 159942 -130772 -195368 -24115
20908 -52026 -406194 123343 51626 139179 224097 -94625 -292992 -218634 -42285 -108756 -16124
20896 -353086 -260554 -256982 -357799 -9906 70507 73041 -258324 59109 -122261 137658 8778
20884 81041 -113389 -33646 -113544 143 151205 -39493 143763 -129493 1064 -382 35274 199808
20872 199808 -168022 -120167 -124364 -315331 66582 -207967 -38676 -31085 89669 100502 -211642
20860 -8770 -12485 -174532 -463310 -82822 -160671 -249038 -40858 38911 24356 -106009 21694
20848 -342687 -162905 -176983 59330 127334 -28355 108024 -176863 -34278 -164 -108283 -38794
20836 95282 16494 113458 -194118 -9489 -196875 -2124 134927 -17559 -445127 -8071 38348
20824 -16612 176956 175116 -254141 -269643 -415017 14629 -8807 -49218 -14667 -140131 -201290
20813 -201290 75342 -66631 -415566 -246374 -368334 54359 -344641 -22264 206736 -282169
20802 -323949 -215525 89613 80604 -206173 -80515 28070 -112277 -207661 70146 -276187 97679
20790 -216658 -43603 -355444 -474971 -118022 -142857 126685 -188597 36412 -145337 296116
20779 44245 155213 308843 -202942 22491 124914 314284 -175006 -112979 -215971 -68129
20768 77881 -468964 130853 84331 -103816 -124645 -18738 -229712 120941 27334 -181691
20757 -127127 -45605 -20958 -3101 -5186 -340219 96686 49576 -53464 -140832 -350833 192668
20745 -104428 -213577 -95139 -134017 288950 37566 -220645 111423 214517 39695 170733
20735 170733 137656 -114160 143799 -94779 -36323 135858 -366892 26770 -19869 -242219
20725 -242219 -28457 -92630 -6517 -413207 -104576 -647672 -69655 282706 -147931 -250547
20715 -250547 -98608 141692 -303026 102789 -25927 13102 137516 135547 -27251 -245325 -129084
20704 -129084 -230377 -179140 118645 -75208 -77406 6143 -160652 81616 179359 169340 -198032
20692 61374 -24769 91969 -47971 -178745 46841 36185 -76625 -107350 -9913 -269233 -201309
20681 -201309 -12039 11018 142519 82180 -57 -52811 -158291 -210995 -413307 118064 -396672
20669 98959 7863 151198 20447 -403995 -233161 86821 -169148 85982 -10723 -107308 97690
20657 79058 -319534 94847 -265279 -211500 317356 46161 -27467 -191992 -466258 -351172
20647 -351172 -205158 -215933 109078 -96121 73029 -65269 -2680 114425 -226688 -71461 204598
20635 107195 -138900 -291279 -67541 -18871 -116358 -61026 189609 -179648 -205474 121291
20624 70967 -77250 -255397 283777 -73061 10367 -24247 -216089 -64769 -136562 177516 255553
20613 255553 -26359 -128886 -182569 -217224 -139814 -107661 -124718 -299618 -154501 92332 -105145
20601 166549 -179166 183613 -108439 -276326 -106121 -118976 205024 201304 -35496 -8857 -159142
20590 -159142 39683 37346 -177146 20729 67413 -299135 -1114 -185415 80958 12020 154534
20579 154534 20490 -104434 -285775 -321928 -15549 -7389 92250 79240 105055 215033 -383261
20567 -24406 42000 -212371 -19891 -274989 421231 -28558 -207077 58143 -142011 -158874 237776
20555 -263717 38780 -60821 -14057 -263006 144272 214559 -180374 -351592 -45390 87798 37257
20543 -135503 -30915 6906 -103432 -192292 3710 -386732 -224145 -55228 52433 -67511 -337125
20532 -337125 204353 -270753 -3912 94313 -93007 176997 -201543 -14291 -255537 -333444 -466816
20521 -466816 18710 -177267 203018 88992 412025 -38566 -48442 -194926 8535 -41601 -74017
20510 -74017 177266 41513 -4352 -5423 67786 -137581 18485 -162612 -90052 -236615 147289
20498 -178688 -70202 -316350 -49510 304652 -436564 -174979 -146911 -207038 69743 57085 -151306
20486 -75941 -167918 222410 -166956 -284072 91065 56585 -190545 -388739 -123504 -74392
20476 -74392 -275221 114896 -214644 -163765 158772 -256088 -72836 -19060 -130294 -166065
20466 -166065 -93790 9082 -117350 148517 22999 -216423 -316555 -79938 -117422 -69211 -294169
20455 -294169 12331 89 80880 29311 -35790 31413 -96660 102328 -11824 12551 -59476 -184996
20443 -184996 213670 359002 57188 37976 72589 179506 -250515 10333 -29040 225458
20432 -162734 128708 -75418 -190816 1425 -27029 -54477 77925 -19700 -122349 136250 -148315
20420 -52588 205593 245905 225266 -254531 -291648 -178473 -17564 -91417 57624 -327048 -322258
20409 -322258 -38152 80259 -150622 262521 -116767 -28385 -101294 -78823 -249361 47113 274210
20398 274210 -80338 -31195 -335509 -5480 85485 -13723 -118521 -249629 -76697 -168781 32584
20386 -201514 -34678 12204 -96720 -53174 -35893 54695 32985 -273229 -82883 -172554 -124601
20375 -124601 -52945 151819 25271 63265 461962 -9939 -191802 206963 200956 -24128 -4750
20363 -210154 286510 -597761 -166638 -223897 129594 387523 -252590 -169641 162590 446763
20353 446763 -235109 -12455 -86627 209535 -191649 165211 31034 -201639 256420 284195
20343 284195 60318 -185096 -128012 250695 -180406 10004 215764 -310353 -69722 -324064
20333 -324064 -44813 -172651 -90849 434798 -187535 -293477 98787 -176863 50600 117115
20323 117115 -251279 40656 -2996 27907 -263177 -117898 -296705 -271878 46952 -447296 -188247
20311 -232546 4665 -146093 19311 -94656 132229 89305 -162281 240527 65831 24721 -190147
20299 -103545 22811 104356 104306 -137182 -188293 -95541 125044 -18527 -133662 -203735 9149 -65684
20286 -226450 -269524 -339727 -37225 17497 -32653 21399 -32419 -199699 65962 -268789 -167178
20275 -167178 -10658 -224322 -81818 -101442 -87747 -324780 -132651 -83053 -145750 -285805 77815
20263 -51063 -247781 -101016 230004 -336137 -169648 -23 -354585 -306413 -48922 -192087 95865
20251 -153767 75432 -146536 -59637 -236965 272013 -64506 -125056 -199745 68649 196805 252110
20240 252110 101261 -36719 -267576 -417845 -418072 -360679 -167774 -222704 -63045 97909 -120327
20228 -35472 -252800 27585 123521 281413 291795 -65159 -24080 -93247 -2603 100540 214861
20217 214861 -487 -1678 53880 25627 -15833 54599 -175280 12563 -122000 -188702 -96372 -84597
20205 -84597 63692 -111054 -29496 252797 -275008 -181504 -187680 -16782 19255 61436 14075
20193 -109821 38648 241810 43724 -180227 54140 -141563 -194658 -100440 -285137 15317 -145556
20181 -122399 167738 -68478 -256238 -267798 164585 -211876 -272717 -93905 153051 47844
20170 71723 -37897 -2469 -6418 -325814 -292870 255829 70634 62897 -111869 239693 219425
20159 219425 93462 57683 -224388 9414 77503 -75765 524242 119960 -58034 94728 61568
20148 61568 1735 -19451 18109 321531 -2952 13700 -411739 -229902 -131133 -139430 44673 -189605
20135 226711 277667 122689 149232 320605 169383 162835 344037 111135 -108166 85827
20124 3948 395726 276177 105672 158533 249559 -221728 -357993 178120 -146829 -145175 199331
20112 -211931 28735 -44152 45737 237703 -319972 -42633 182501 325657 39051 201433
20102 201433 181600 -177129 46526 -558027 177631 119948 135911 -301005 -194282 127813
20091 -199365 -204714 -160983 -62096 -201643 -73640 51924 -105682 -144527 26556 -15413 74377
20079 179653 -57472 -175617 64621 -32375 178634 -197760 -1063 -65677 5189 -152954 51905
20067 -30093 -308976 -45488 -131400 9339 37500 -165023 19528 -143350 -354600 -436406 -246321
20056 -246321 -150971 -87193 -56918 60487 3351 170373 -437344 -103135 -137279 -225937 -30371
20044 157830 -142013 255468 4992 -218784 96655 -116705 -110581 247495 -88117 -171522 83410
20032 -118254 -23245 -63802 -207376 200333 -147313 -78841 -63733 95700 -275551 25449 136380
20021 136380 470955 105339 -196799 -51187 316052 -52664 -264231 10011 -17995 -168533
20011 -168533 290211 -185891 -43401 21370 -36314 113966 -255375 -171381 -186817 26538 -126545
19999 1686 -258508 73330 96847 -13583 -113279 -63522 43216 -27370 -124114 -284231 382956
19987 304267 -371177 67838 7471 293413 56719 -3423 11492 48624 -126609 -7844 -35806
19976 -35806 288145 2851 6904 193070 -64881 -183780 190680 40602 139156 -29958 -127736
19965 -127736 -204424 100319 38499 -7511 -231352 -248197 43919 -93312 -373830 187886 28465
19953 -7044 -122218 -82742 153931 251722 33265 89607 194113 64472 -96486 310910 -46178
19941 -218362 121356 181670 -17193 247039 50594 -107581 134939 69433 99202 11697 136958
19930 136958 -169872 46588 -261344 267672 -151969 67697 -159724 -83954 -192250 -398428
19920 -398428 -221953 -48643 -198339 -186605 179062 -31772 142690 4141 -239397 73611 -283292
19908 -28556 -120025 -194789 121519 -286694 74308 13123 2983 -78438 161174 -244528 -48583
19896 -215419 -14262 67956 226546 76181 -36698 43588 -28079 8690 -87615 -263339 62933
19884 37354 80649 172506 263059 -167066 -165248 206504 -129302 140259 253946 78975 -105093
19872 309621 -131073 15630 -171977 45126 108881 12768 -271246 -199501 -5099 -23322 2025
19860 61935 65455 193976 -45179 145938 -55399 -150592 62782 44414 -43299 -30863 -216324
19849 -216324 39897 -18660 -99753 -344515 84396 217930 70288 -312984 -38424 33545 -93048
19837 136609 -319634 31867 -196129 -219652 59631 41622 -115654 250061 -39833 208120
19826 -97947 -93801 -21397 -166762 -275583 -143442 182106 -257733 -212204 -160119 -237070 130824
19814 -188436 -55646 -49523 -291146 -174069 125222 -150254 239529 -38430 71220 -69816 -248687
19803 -248687 -135213 -241405 -146816 -312903 63186 78179 111463 -382242 -141019 -166878
19793 -166878 -294125 -96231 -78672 12283 -48378 -45390 2186 -71889 -43865 17052 -26279 -89010
19781 -89010 -274736 -251688 31261 99562 118795 5651 202204 -212736 -124936 -84685 -151814
19770 -151814 102635 -93395 319845 116847 -4609 -72338 -190368 -169222 -48541 50243 -274293
19758 -373505 -283285 -58063 2591 -182976 -125558 -151526 -180602 -113163 -32470 -206142 -78093
19746 272325 312146 6153 152826 -130539 -305754 90418 166580 218607 225871 123257 166899
19735 166899 -16239 -105363 8346 136396 203446 338644 -59320 -120917 163544 34583 -82971
19723 24831 -373216 -165386 555175 27610 12671 63913 -197698 200267 76143 -55281 476259
19711 742851 169730 -42739 198937 103956 -86802 -284821 -118251 -318848 45816 67288
19701 67288 275976 131608 51280 26936 30260 -163048 -83356 -232390 253889 -56368 169299
19689 62008 -88573 -89299 273671 -171253 81166 -36853 -83882 92584 575771 80500 437904
19678 437904 289252 17489 -119976 -51565 90673 219038 36518 -263882 -45504 -195471
19668 -195471 -47429 -6317 -36882 -206376 -80272 12872 -227415 299783 117578 79952 -83089
19656 203907 -205271 9963 51560 -120613 -218114 -139781 -185407 -2650 -80813 -133413 -217333
19645 -217333 -61540 -258905 -99765 -1079 -177652 -57717 56134 -321119 -111387 -150781 -56085
19633 80924 -8240 -10872 -191548 -114490 21723 -33812 82531 -27948 -176682 -265392 20028 16724
19621 16724 17317 -113635 -22377 -23815 -758 175470 -63330 -316166 -117437 -73157 -52963 136845
19608 231810 -262852 79168 -123363 -14291 374966 -295206 -120756 -181796 -274448 -97325
19597 -189321 373366 -141954 -249998 -71427 -198708 176060 -380503 166836 266389 140031
19587 140031 -158600 1469 83514 -430415 -81170 -290 -47153 131835 -309029 114948 -366942
19575 -139678 9781 -248953 -94369 20132 4793 -257523 178855 -5135 163978 -154050 313168
19563 -66164 12992 97538 133216 -54361 -3608 -219474 -19380 -481761 -232066 49529 13897
19551 -336316 11113 -222249 -225587 -334084 -150002 -244745 -94210 128669 101659 147081 -98317
19539 71641 -63236 -352833 -122617 260433 -144337 -179894 99118 90651 38594 -321077 -76883
19527 -56319 -225602 -139691 -266034 85730 150696 45590 -202510 -224089 -63204 49128 70243
19516 70243 -57991 -208472 -315772 -136686 104223 -89012 -168303 149256 -300379 25782
19505 360076 -285546 11952 -55514 -6264 27284 -131177 -215837 203413 -312990 20405 57354
19494 57354 -232850 -233645 116250 -85985 79331 -175272 22228 -298218 -313562 -62408 -117972
19483 -117972 -203808 231890 -43761 -279067 -211697 -186574 13399 -166294 -366202 -149427
19472 -79221 -265139 -523413 -204325 -215027 168371 -151839 -178429 -14128 -4207 -180343 -147279
19461 -147279 -126550 -119874 54939 -178983 -71905 -63606 -103765 -52453 -388675 -152038 -172033
19450 -172033 94077 1719 187458 -143625 188334 -116198 -100700 -142613 -307348 -229834 -77264
19438 -223861 110840 43202 164818 -171585 466397 -35363 -167620 64409 185846 -130403
19427 -54845 -41371 -33520 -340376 212793 8486 27818 120570 64257 -331047 -200876 5399
19415 -106481 -183371 126118 -87087 -92177 -7514 -273917 101848 -232241 56360 -136372 -264987
19404 -264987 -36894 -38516 -52555 -50720 178521 -180780 36701 -158377 -161499 -86187 -22945
19392 -266184 48996 11573 -155915 -202070 91491 266286 -158985 -92102 -167324 146554 -22001
19380 225351 -42205 21704 -45740 -87714 -191785 85629 -186393 85524 -193240 164324 57064
19368 122011 -7011 -239791 3335 142022 140537 21307 -142575 106827 5888 -319215 -134296
19356 -136982 -3211 -65660 -10131 34689 115429 140883 38795 -223673 -150769 -65065 -48353
19345 -48353 -212166 25430 31331 168186 -93584 179229 100325 -217859 -258288 -11971 -253754
19334 -253754 -249325 27074 270933 173310 -216117 -64778 -239137 90697 164249 -273615 122907
19322 -213882 -119159 -1472 -41582 166599 -95412 37306 57768 -41487 148459 -198782 -141888
19311 -141888 -145951 -402704 -337463 -16690 -454449 -268369 -180630 -118251 -104895 -69123 -199599
19300 -199599 167151 -374087 -163434 20823 -358995 52881 -48336 -437444 -269682 161604
19289 -96999 181555 -75772 2784 106301 -247951 -231384 101062 -151574 49991 22416 -133256
19277 102606 -106313 -332031 174384 -175451 204562 -160327 136520 -120751 -289555 -45279
19266 100862 -22011 -171476 -190891 -139995 -202621 -37727 -132272 -4113 -303843 103242 -8513
19254 144205 -336864 -245995 -310023 25120 -206121 1950 -258080 289429 -248989 -20787 -33756
19243 -33756 -175825 -28988 -156715 -232772 -155338 63148 42977 -260245 34138 -51948 45705
19231 -112516 460480 -81920 13349 243089 -116476 -208512 -408013 -108574 -110200 -116138 -67117
19220 -67117 124529 -15472 -260418 -47891 -132764 -354510 88829 -28065 -159203 -207199 88477
19208 -113285 -160373 127574 -80962 -119940 -207680 72080 -242627 -136808 84310 -74830 262962
19196 -134144 -42501 -44885 40754 76530 -125393 108633 6225 -133515 -103635 -50093 -36640
19185 -36640 22890 -23719 151289 -168018 -512967 -128578 195981 252681 -88712 -62163 -524245
19174 -524245 -116124 -129058 -554129 11434 -209565 -318298 -62327 -415419 -109170 -311556
19164 -311556 -31253 -40303 43094 51594 124425 -16975 -131618 -147731 -35956 230497 -24958
19152 -131074 -455328 -18527 240515 -178110 -138177 73932 23021 137158 -204511 -24412
19141 163645 -185068 -302547 -169638 -202138 223084 -235456 80472 -131612 -394334 12031
19130 -5845 97469 -422957 -18960 -196056 50653 -51826 196260 46909 318565 -57538 25418
19118 2957 -183913 -170385 95178 254481 -51448 -436078 -2561 128745 346836 -9267 48262
19106 124332 -150664 -416253 -332875 -232121 5555 -115986 169510 -39771 -11281 60578 -160288
19094 -416551 -44649 -157096 59197 -65916 -40860 -108412 -307994 -142073 -98549 23711 -166472
19082 182610 -184521 -64816 108236 -10297 -17818 -228035 -157111 56359 -33384 7327 127344
19071 127344 -10875 170125 -192511 182704 -132455 -143100 -7113 314295 -194204 126267
19060 143006 -130294 -198100 -354568 -28974 -63842 17357 130294 -187490 199553 195040 110679
19049 110679 342519 299766 379434 -18681 -165588 -334899 -24147 192123 -29469 -200221
19039 -200221 -52256 -182686 106731 46165 -123713 95981 -134838 -36473 -175666 12891
19028 205272 99659 -104501 -127014 -61917 85499 -118301 -263622 189319 -311862 -54079
19017 -495837 68467 16417 -187222 22273 -260505 35118 -163253 -90236 17495 -316902 171458
19005 -34052 -236143 -16136 -114616 -140178 127585 330630 -60241 140781 -30228 -117761 91572
18993 -334800 160077 213933 3543 130026 -173548 -41976 110706 32839 -95427 57957 221133
18982 221133 87996 -294833 -219726 16182 -87857 -9954 172878 -136143 -108917 -197074 -257803
18971 -257803 -75534 -29271 -129910 -64794 -185936 140607 211313 2931 -178139 154181 -164881
18959 120281 431437 223351 138709 328067 353809 34012 89591 -293038 -187696 -272103
18949 -272103 -263956 218664 -51066 30173 -51879 -224967 -175882 -16120 3422 304920 165605
18938 165605 205282 75675 -78331 167954 -101705 113477 252847 -160515 -125807 131791
18927 44691 81089 77398 -422654 -335666 89470 94081 22222 2456 -244268 -172834 -28577 -32500
18915 -32500 1743 -57372 -306950 -142458 -170377 167677 -163943 150534 52903 -78395 -53758
18904 -53758 -214790 -99099 39939 -65341 -347716 47490 -107268 -53789 3343 112136 342845
18893 342845 31516 365381 414114 -249473 -66850 -143601 -41753 -1761 152752 -14981 -51658
18882 -51658 125903 -178477 -449620 -90578 -218306 210390 -228598 -60251 -87452 -21736
18871 -193807 -26043 -181706 95439 -12063 -113238 -166046 -139330 -194658 36551 -41416 -88752
18860 -88752 -257452 69061 -272739 42978 119807 81436 -202473 -102415 184104 -237388
18849 -123804 365779 186954 -68263 65853 156727 304965 -113758 -145942 -73300 -115789 313205
18837 -191469 -56529 315259 2188 -185427 47777 28920 -180238 93688 226689 -138323 -156732
18826 -156732 -179100 4069 -124672 -340637 158182 162342 -159152 -336120 -137211 -155089 -3105
18814 -40789 -67818 57615 -26837 -317123 -58272 143220 -71372 -67827 -620229 41959 69296
18803 69296 -16953 -316314 -19901 46097 -138229 -191743 41253 252760 -63660 -143002 294723
18791 -75542 255663 267743 71260 61680 -454176 148463 -215527 -122304 -355619 -76553 42886
18779 -188379 -177481 -466991 212815 -214190 -285365 107295 -215341 -69370 -231880 -412517
18769 -412517 -44286 216316 -51646 192081 -69263 1083 9296 -285976 -272113 -74769 -33774
18757 -251221 40522 -251362 -160181 7983 -13249 -157547 64673 127590 177658 17505 75880
18746 75880 -229958 -74253 -153200 -511916 -126393 -30770 -38786 -223418 -119919 150433 -166838
18734 181963 142163 25122 -92255 197719 212501 -323462 99435 77265 52198 527027 138206
18722 -275100 -321573 -220943 -56999 73736 -266079 -125069 -216625 -109262 112760 -148977
18711 -126037 237076 -489974 88361 -39816 -87918 114094 -212963 110046 81222 -141077
18700 37217 490593 -186067 59854 10891 -102386 150657 47172 -215112 -33311 91726 -29324
18688 -175540 16367 -68046 -624711 -87477 39193 -426652 6781 -124826 -23206 188292 -122769
18676 -128253 131266 122600 -66281 -233713 -146741 -177954 -66064 145494 -260196 223017 168735
18665 168735 -72531 -243172 -235412 -197261 -301960 -82047 -119828 -581196 -254057 745 51546
18654 51546 -88287 -297854 -42149 -163034 -126468 -196713 -178649 -259731 93904 -266397 -130096
18642 -293449 43909 26426 23653 -216336 138940 117436 168372 118636 -52449 101588 -14221
18630 26762 -39360 -315930 -197144 -4853 -101884 -107576 98367 70857 -313819 -29116 -553332
18619 -553332 65031 105408 393183 -29776 -122890 -248764 -74772 -165791 -31263 54131 -166263
18607 -53374 -7131 -72079 20743 -291049 -222444 -76876 -119301 91724 58387 158606 -371237
18595 -176347 -70390 -213610 -87348 166325 80595 -214318 -118480 -291335 26637 159765
18585 159765 161240 118856 -112768 80089 -246534 35819 68398 -4129 5704 23231 -289738
18573 -382659 -30220 -208734 -164762 35030 53092 90767 -29682 -89184 223237 -236024 59259
18561 -120180 -143491 -147945 -140630 -323433 -60310 247613 52430 -16010 -16084 -216968 -62170 -30227
18548 106265 182261 49587 -138898 -238013 204787 -186594 419682 -316836 -99329 -180092
18538 -180092 128679 -205375 -3786 148189 81655 -241961 60025 -82780 66724 60904 -89355
18526 256978 -445351 92991 2337 -60197 -253533 106534 13340 -215017 60315 119171 -24611
18514 -10751 -138225 95982 305760 -123026 247417 139085 69364 -59570 3439 242090 -502564
18502 134307 -155687 -80864 224864 14763 -162725 -20401 -167738 20307 142040 -321872
18491 -117749 149820 -138110 -164463 -87508 49377 -25445 -224369 -387385 -254468 -122205
18480 -70297 -132237 155666 -36817 243998 -264158 -291072 -365298 236631 -235064 -87691 126959
18468 -196281 -217685 -275142 -336187 -116563 35190 281735 -143460 264843 -80167 -237250
18458 -237250 -152020 296053 -109801 -147571 72372 146941 -23177 -81823 19551 -194458 -252178
18447 -252178 -118295 -423021 14844 -262867 -36884 -353770 -74954 -135858 -529118 127080
18436 167516 -16115 -11419 125747 82680 70100 -206334 -48311 152604 -185774 141305 -171642
18424 -158123 98675 347567 82619 15879 -55862 3094 -178064 -16283 -64921 132980 -339971
18412 -17994 6098 324951 144865 293129 8709 159531 149522 -32393 -187791 55016 64848
18401 64848 -220390 -171755 -172876 69732 -123114 -246595 292511 46505 -372390 22563 -115877
18389 272799 -193074 -66905 -256466 43292 -352881 -57599 -54735 4064 84115 143179 -134763
18377 132396 -95642 43364 257348 122882 -19620 -179352 45859 102665 190365 114650 -40702
18365 11798 9859 120422 -214485 97810 -31364 177310 -124554 90790 -85155 17844 10020
18354 10020 -340305 263075 223607 245885 -200501 19016 133731 -99093 -129562 159659 10214
18342 123689 -234194 -148331 -172877 -153039 -74541 -322165 -3272 -36876 -177544 51553 -76032
18330 -30389 -131443 602 -133094 -154334 464308 41435 -334849 175637 -39583 11654 50771
18319 50771 128498 -38925 -99486 -8373 -81460 -326032 42486 112994 4074 -29332 -19228 -228763
18307 -228763 40918 56680 -99597 -59564 158946 165962 -66767 -148890 -361075 -202262 -48300
18295 -12982 -21293 54462 63953 9082 89737 74839 -105164 -231731 -449705 -262195 -262067 -55388
18282 -29556 57896 -272512 -221000 77723 -61610 224923 179631 -9807 14566 299836 -90816
18270 93276 47186 -71307 28218 -189632 41892 -39206 79886 -169966 -144633 -1129 76949
18258 -271567 -98862 -417679 -152967 -79614 62699 50989 -20776 -152623 -195284 22521 -37910
18246 102918 -209146 276916 86318 46545 -237359 73941 80685 7974 189799 71374 -49647
18234 100479 315684 -75429 37152 -131841 -102005 5713 -162767 100719 -38163 198474 112263
18223 112263 185715 -131904 -114183 310837 64848 -11490 -62819 -393907 -105550 352637
18212 62637 -277770 -40563 187722 160317 16109 54723 -56962 50572 163023 37155 -230591
18200 97039 23797 -67198 -96009 -328709 305822 -152429 291559 -305276 -298083 -64806 208688
18188 -317204 -30757 209297 181193 -115658 -16539 12742 -182972 -218581 70343 -184232 68160
18176 16278 339288 117540 77219 -175337 -154632 -180149 -175272 123075 -351406 96721 128485
18165 128485 48483 -46596 -10670 51044 -130696 106229 322831 74184 -73595 -194488 241931
18153 -77246 11958 -51389 -224250 69237 62078 42350 -71681 -104276 137251 -121817 215207
18141 -156832 -272197 -112821 -168353 -129216 41919 -25785 -207893 312378 100566 -32086
18130 274392 301650 -75689 -199245 255359 430327 -96294 -208725 -26929 -75755 193109
18119 -55182 -156708 -23044 -126094 73093 -158590 369215 262842 2811 -54054 -12055 234891
18107 52536 41383 -43046 -32530 -33708 355683 20525 124715 -354073 -56603 -74025 9811
18095 -52664 -211634 266603 161760 69374 -15799 -13568 55604 84907 -141007 -18760 137304
18083 -49474 -70127 -191742 -316013 -192247 109675 142640 -146291 158652 59824 136490
18073 136490 134960 263152 -142001 175151 -246267 -93434 273099 209166 -158888 259686
18062 -52260 240597 -10158 -6880 -192247 -34569 -184008 90220 84943 487824 -96548 43395
18050 72407 -45443 155878 -151072 174791 -27917 16502 152883 119499 46836 41251 137121
18039 137121 -82459 116502 328296 166699 -306386 72246 25282 -142749 23534 -175686
18028 259396 86029 261405 -40639 -20614 -18364 -20282 -108661 80937 -65045 -2216 -13499 57902
18015 72998 -50891 114059 223192 -161098 124144 151700 47548 -155473 -215402 326061
18004 -150215 16818 -206451 213724 -104467 14958 335880 -189971 143659 57348 115668
17994 115668 68023 -431164 252785 133423 -27953 -88506 68919 -179786 212039 -64727
17983 295666 106326 409339 25793 -93671 333463 30629 177 -75862 -32216 45361 -16168
17971 -176508 53933 -236159 34617 143953 196580 209144 -97764 -172253 -41491 34520 78391
17960 78391 -131232 -63942 -368805 -143422 -99301 222135 121110 -125102 -225736 -65204
17949 91237 -311063 65167 9252 -144641 288880 -105324 109194 101898 -156327 304061 -15599
17937 225514 85412 -26652 -101069 -104429 65490 186362 -233218 -192769 262296 -246210 281259
17925 231583 67817 42321 97745 62429 -95417 -14426 -388030 -83108 36525 132711 2049
17913 -11241 400654 -88110 38934 -257537 61213 -69079 -66141 -93429 -67711 256698 78006
17901 -372250 240798 -223378 272296 29193 -53737 -57109 -7917 -30321 83718 117145 141033
17890 141033 -94293 352454 18908 142507 204965 -133454 21220 -68332 231709 122999
17880 122999 -202833 -14012 -204596 171632 218960 -2575 168523 79483 335625 -220902
17869 -159863 26740 260665 -391393 4367 78495 251652 142737 45931 -203507 -88202 85401
17857 151685 -1153 97085 -115428 -57394 -324569 38163 -164025 120559 139995 -6006 -2678
17845 173508 110793 -21731 -32231 -28895 -132772 -156507 -85597 257557 -105650 -261559 171262
17833 102926 139521 153465 26255 433309 -111161 -178202 -387960 -195738 -32795 189825
17822 161838 -124023 -51690 -195234 -124179 226768 39253 -203685 36827 -20920 215740
17811 51986 212963 161442 57543 -159972 -56958 95522 -149320 277076 -97767 -37040 -46770
17800 -46770 -121972 64326 5665 -13697 -17136 5073 -71611 192395 221493 9378 43831 170837
17788 170837 264955 -290379 260106 -255279 -229428 60936 -181170 14544 -188957 -244823
17778 -244823 82287 -85101 -47460 289533 181902 272891 20202 18711 114353 -15103 326315
17766 -218395 155465 399010 -75245 55504 -94310 -43818 168515 86075 -151081 -48606 -254548
17755 -254548 -271178 -23387 111696 361522 74818 91365 2711 81870 -16430 9100 -78927
17743 50086 69147 113132 209218 130769 -11225 517038 41670 -86031 47864 -75480 120142
17731 -38693 -112161 178481 150151 144610 295223 134224 -68994 -1553 163711 -59034 386083
17719 154564 243873 -260510 -81234 100478 68019 18335 -76481 -45866 25497 -304719 -33493
17707 -17299 -150367 32962 -17620 -99018 89629 60020 228766 98068 -24714 189918 -54036
17695 224531 313802 172625 117209 38058 218499 169398 93061 -237106 259164 103741
17684 -210599 232053 237103 236185 -23269 42883 -120654 214814 127622 -217757 67781 -52747
17672 -42495 -138037 -265493 266447 165519 -66020 69630 -167523 -23172 345215 137800
17661 70120 86526 188372 118705 433406 7358 532524 147332 66590 -88390 34284 195100
17650 195100 225577 261544 178375 441488 173196 -129927 184631 -12593 27376 -160136
17639 547315 303579 125994 138283 150443 173249 93965 135684 15317 317242 -78021 -39010
17627 107255 124246 -258987 30970 355333 617 263159 -182243 188624 398340 -51634 150169
17615 233573 80102 -18233 92922 13556 21024 220497 208657 -9507 230788 190895 292814
17604 292814 -101280 130128 4447 -49617 179857 69651 114400 61417 -41540 -249885 56136
17592 197992 -316604 -79404 -176133 -9139 74371 208018 -66817 191803 279014 232758 -67454
17580 157869 170945 34547 55530 270374 191147 -119805 87148 259559 104623 31885 156146
17569 156146 49055 90391 133846 -5798 -25812 35931 402178 206198 -9201 -206141 291643
17557 164171 337044 -63151 401569 513602 214362 72647 146544 43248 -14724 -7479 256805
17545 -486 -3425 277875 293128 6618 56300 314603 93943 148280 90528 1644 -123505 150811
17532 165315 143247 281578 166782 78816 340219 184244 166777 86647 214466 151806
17522 151806 341705 420553 28409 55325 262804 379227 225164 113871 660234 316871
17511 207412 522322 645872 964418 863175 545941 638911 375782 532599 160378 442585
17501 442585 255862 260128 419055 212809 399085 556796 708454 486225 313035 1210073
17491 1210073 410254 417806 673915 792888 481700 273976 444572 166102 167720 380320
17481 380320 34981 488340 368501 465018 342157 3146 239636 158152 244789 387645 68614
17469 436003 261034 250319 148002 408264 372527 279865 -15821 316112 340509 449022
17459 449022 428420 -81047 130222 197876 253119 596268 -88330 119103 51552 415851 105428
17447 76711 468877 -116304 -10688 305107 306999 231950 16218 224998 172741 396567 491104
17436 491104 292735 506376 329408 109267 308792 115742 258714 152969 334453 424095
17426 424095 89119 585 324063 442497 185251 115548 314855 280539 100148 515710 406134
17415 406134 34598 454567 402228 264538 587187 285851 312745 406289 406262 331473 74877
17403 -207861 374338 344356 162864 157810 361377 286702 168259 451170 27802 296145
17393 296145 405185 267039 113745 357732 29142 291313 278586 67420 237036 229712
17383 229712 240444 -1164 115332 306823 64311 326025 316313 -20040 388790 228037 46255
17371 213961 354940 142959 583813 -18318 -133170 315653 194820 361544 57989 191069
17361 191069 441101 336533 375495 149796 -161300 29238 350295 200010 528885 5970
17350 235917 475281 258985 122660 248430 297360 227858 233908 449424 138720 250732
17340 250732 98604 -22133 502852 144886 284914 274140 176660 383815 -61624 -1830 447062
17328 493652 138318 3768 373574 37501 -25684 216054 316696 355918 526504 270200
17318 270200 277627 454649 531094 44266 213664 207033 332433 187568 -93156 182679 553197
17307 553197 192234 420000 18584 391005 487490 301129 314869 213632 153252 162801 86093
17296 86093 -172082 382404 231608 258459 527578 514845 248602 134467 183148 362302
17286 362302 204639 315992 55568 435579 307112 354516 291089 385988 284703 449866
17276 449866 16540 -62298 407492 407604 527120 295532 134843 105425 96848 109816 109491 179883
17264 179883 104761 293845 104160 287006 -23460 363532 391999 365952 219851 361617
17254 361617 -26574 233281 442611 15439 383543 303639 259610 183113 361504 94059 344796
17243 344796 530121 422989 443180 385259 472695 -679 514143 355611 504194 200608 283586
17232 283586 168728 -5027 80344 174947 641189 227100 227363 11253 45386 450417 118024
17220 119989 377001 431129 416238 392237 275359 436978 437881 205398 556109 452559 445404
17209 445404 306167 93392 467798 317616 260028 217642 217481 99037 139189 375675 483742
17198 483742 601078 228873 609463 361556 165159 403354 -17959 213835 547737 497765
17188 497765 368399 253258 488440 462710 441321 369336 253036 262250 285023 273954 57221
17176 181062 316314 279932 579272 312091 574019 136449 344126 420731 156011 340189
17166 340189 478081 48981 575561 43645 413687 286647 390635 658205 456723 158449
17155 744069 441564 51093 331178 294688 440928 377743 712857 249088 315280 499184
17145 499184 449338 384637 225550 424172 247725 356062 322534 337138 102215 284401
17135 284401 407138 260463 156977 443488 352731 594871 440291 369322 369969 223682
17125 223682 523388 479761 75765 539060 561574 448059 224528 308764 556107 400456
17115 400456 465797 110491 723089 539850 433799 746164 624022 100641 185811 523948
17105 523948 613352 527456 768786 437907 638599 445172 543148 320957 498941 459901
17095 459901 487908 180880 754309 622451 239128 957625 417979 534119 617147 380370
17085 380370 428108 515813 275903 469360 477957 446170 504207 521270 560101 664762 781597
17074 781597 388452 429837 400871 914970 583546 471235 697583 401604 565314 738304
17064 738304 422939 828169 543378 681357 867133 409186 405101 601066 724293 551125
17054 551125 627619 336879 825025 824138 545336 478988 259478 527391 477912 360280 699534
17043 699534 481377 903708 855429 876540 704205 556890 374936 853809 518885 648665
17033 648665 909941 653687 915640 823132 865425 578257 637416 628920 403099 888492
17023 888492 702521 456253 694278 902042 860878 424229 567388 890021 803951 751584
17013 751584 981974 828103 566308 872899 971637 1130734 734006 856605 650535 603237
17003 603237 1107765 938920 960657 1038972 800130 850142 654215 732660 1003875 879588
16993 879588 986196 905797 768746 781030 757151 1133908 751560 903070 1032568 1149535
16983 1149535 1207993 903770 1019409 691066 991993 1393934 602585 944158 1183211 1126844
16973 1126844 959692 1020570 1158414 1262317 1088362 899434 819841 836605 1343076 1367131
16963 1367131 1273881 1040420 764237 1218417 1374519 1110348 1138267 1248620 1180798 1257530
16953 1257530 994583 1321963 1049483 1602966 1257855 1600200 1296568 1187480 1318565
16944 1318565 1764813 1249129 1502314 1275067 1447951 1664062 1262037 1463082 1294129
16935 1294129 1392738 1357748 1312970 1717426 1242704 1715791 1393417 1851059 1796746 1414432
16925 1414432 1537599 1485932 1538842 1899739 1807208 1519618 1639038 1663000 1413592 1946702
16915 1946702 1791799 1687477 1659095 1838300 1707637 1792891 1551688 1774655 1624770 1842958
16905 1842958 1950038 1993239 2021803 1798960 2066605 1617417 1955850 1881176 1763532 2135045
16895 2135045 1927713 2213635 2257295 2365335 2164340 2154205 2015057 2368461 2038631 1926946
16885 1926946 2215025 2083379 2406790 2473624 2105995 2320558 2171721 2484888 2394683 2141583
16875 2141583 2345017 2666755 2595468 2348802 2605065 2652705 2601527 2840776 3010660 2478475
16865 2478475 2822585 2580740 3095282 2774412 3029947 2801428 3228532 2974242 2914859 3266216
16855 3266216 3150512 3297818 3205792 3462090 3670978 3336336 3614337 3427022 3442487 3376637
16845 3376637 3461604 3567706 3605730 4152641 3708405 3864324 3763472 3976079 3984276 4082550
16835 4082550 4084803 4171197 4660837 4177462 4809257 4463140 4746176 4740015 4421617 4708168
16825 4708168 4756865 4870229 5327711 5351059 5332124 5276749 5666805 5644122 5465659 5507469
16815 5507469 5743586 5801379 6002425 5903188 6292213 6315225 6655577 6530767 6763753 6737408
16805 6737408 6957747 7116517 7283158 7246599 7352808 7625125 7728316 7972516 8342192 8244034
16795 8244034 8330259 8501993 8833381 8986491 9064309 9451441 9354616 9688356 10255519 10646604
16785 10646604 10583851 11092490 10960344 11707090 11174078 12054124 12176058 12715664 12627756 13019345
16775 13019345 13341702 13852898 14080843 14480635 14870060 15382183 15778973 16420050 16646330
16766 16646330 17354221 17719286 18638400 18912111 19713074 19748142 21030700 21284209 21863113
16757 21863113 22846882 23685333 24375546 25042143 25970113 27097136 28319869 29036396 30096959
16748 30096959 31514115 32548910 33805657 35117131 36523252 37890504 39433865 41480972
16740 41480972 43060571 44782523 46836290 48979910 51055876 53291075 55973015 58546156
16732 58546156 61373495 64360428 67148191 70233201 73846412 77445402 80821928 84575354
16724 84575354 88590537 92936319 97113069 101609021 106450814 110714578 115625052 120299527
16716 120299527 124947982 129650840 134532583 138612137 142643266 146158363 149737555 152778468
16708 152778468 155033589 156773443 158202894 158790430 158491136 157784122 156598937 154529830
16700 154529830 152062644 148760950 145326934 141398871 137295041 132859443 128282463 123459117
16692 123459117 118291820 113858853 109260908 104281004 99383437 94788790 90891981 86507450
16684 86507450 82520923 78751291 74970667 71363370 68111053 64744647 61982635 58979564
16676 58979564 56409243 53670935 51460758 49221721 46835435 44734061 43180845 40916448
16668 40916448 39302966 37567741 36209363 34424293 33031324 31906735 30546637 29419380
16660 29419380 28270301 27589885 26343477 25406709 24714086 23357966 22971602 21944557 21298650
16651 21298650 20537216 19867838 19443563 18542032 18134549 17587995 17037699 16492199 15616484
16642 15616484 15495176 15023129 14525115 14057373 13721452 13541743 12849127 12828454 12459721
16633 12459721 12002783 11902304 11333793 11165576 10662357 10482710 10012615 10144357 9846649
16624 9846649 9758276 9768572 8995449 9033841 8735453 8182400 8440667 8114504 8073433 7516883
16614 7516883 7462420 7253497 7501412 7217792 7103863 6720898 6760599 6582662 6976410 6111608
16604 6111608 6119656 5996719 6005216 5695185 5650276 5731722 5972723 5334008 5242224 5070725 5240306
16593 5240306 4785893 4713417 5003519 4891276 4826571 4597394 4554230 4582511 4452489 4525339
16583 4525339 4170624 4092274 4227378 3953877 4091856 3880815 3727363 3784915 3847636 3651993
16573 3651993 3367396 3473185 3668963 3459584 3164174 3197406 3484231 3245984 3158287 3665377
16563 3665377 2941164 3330676 2957031 3031749 3190303 2804483 2892339 2944007 2841148 2834182
16553 2834182 2892739 2820902 2981040 2628062 2580542 2689714 2639760 2492981 2560553 2662521
16543 2662521 2188048 2455547 2355587 2327510 2508803 2365748 2026427 2364118 2092549 1863600
16533 1863600 1990738 1745001 1982797 1979993 1859613 2125715 2084940 1996056 1560535 2185836
16523 2185836 1753789 1793100 1890701 1701287 1884876 2106709 2080880 1812959 1884843 1674043
16513 1674043 1705423 1536980 1407439 1671736 1703837 1450252 1341469 1551034 1675808 1540119
16503 1540119 1482187 1573042 1273772 1497520 1690183 1346523 1313901 1722692 1625287 1385790
16493 1385790 1330237 1257659 1167431 1212052 1321896 1392977 1317219 1467813 1820080 1150867
16483 1150867 1237071 1464992 1020508 1316441 1237277 1147436 1331602 1049349 1113378 1001240
16473 1001240 1342391 1110671 882118 1488684 978517 1046364 926665 1436572 1486254 880829
16463 880829 994228 843033 1310830 1096719 967222 1087235 959939 1057068 1040597 1145379
16453 1145379 1030078 825151 1127682 655798 919561 1103321 1047856 1140320 880821 1012808
16443 1012808 1072010 888022 924195 802129 764268 960017 1002637 713166 444259 714825
16433 714825 716996 1187511 730482 709779 889062 1084048 759636 930393 1125330 782938
16423 782938 854187 748242 765930 784114 1029962 1072753 830209 635689 975382 549334
16413 549334 839370 673152 851407 554642 590766 531922 1017358 990350 556577 407395
16403 407395 734178 667242 562283 647746 562666 823894 666004 602523 795844 543438
16393 543438 674181 514570 877123 579791 769929 625600 734418 795687 956201 783473
16383 783473 803043 510990 688577 378906 650614 539709 806432 832609 671615 822802
16373 822802 589630 683952 737625 560769 676115 841369 723910 653793 505455 561864
16363 561864 564882 556906 761360 368045 548459 755855 419835 862833 354444 637287
16353 637287 532955 646714 251864 513849 630553 480734 336419 610611 542597 530272
16343 530272 347264 407346 722607 600042 523876 453531 320935 388253 647908 830412
16333 830412 656944 303427 892672 729943 610317 804957 287352 466303 373746 423037
16323 423037 50569 546092 362496 372327 511773 474251 356908 247231 561799 644298
16313 644298 487484 262642 341156 337504 643796 421489 527411 574558 413462 241563
16303 241563 69999 602226 663469 136184 588709 630014 536763 587374 585676 407353 562365
16292 562365 236605 252386 548758 268755 419131 452198 298768 66509 240221 306212
16282 306212 369458 411637 628005 327350 40077 436865 44562 190390 612968 477952
16272 477952 601593 117321 327426 -24877 866221 146734 587917 446562 443140 118465
16261 460860 626343 -34976 369097 499945 113742 153991 484770 159202 197514 500602
16251 500602 213376 304851 296952 141628 181799 377733 159839 202655 324394 537074
16241 537074 24297 391211 498751 519302 275156 170989 131133 195717 468631 157217
16230 427525 239621 594452 168780 235267 232955 301672 190410 53599 227222 324381 99727
16218 -59383 421781 494503 37094 222452 88056 527736 234896 146406 325809 114719
16207 133374 62223 238281 229153 444064 250490 525920 151744 264596 188496 205901
16197 205901 386499 390301 332522 76715 360064 438261 214491 26958 232396 402108 73176
16185 219913 177120 169989 391042 299440 382431 266730 259341 345493 200889 64565 387118
16174 387118 125137 364255 41252 4556 201175 187027 449106 242787 210824 187059 157691
16163 157691 130333 394014 326242 234064 455777 272444 93949 142279 265836 64132 -98616
16151 381818 228703 104813 -4045 232059 19943 157845 49480 436189 -25270 254778
16140 -72463 398671 -13030 101751 -46798 88824 11682 233677 155250 125816 237675 60828
16128 326035 148104 185159 358674 67113 -115025 299454 82878 -262396 220495 216378
16118 216378 181808 226686 61564 236754 194989 187076 -55499 294328 103635 -10132 212887
16106 19877 362682 286125 231795 159678 293242 185273 509521 447513 173541 -259333
16095 255104 182231 179621 -152862 56315 289494 137909 -241917 -50423 -59036 -7386 -172 51156
16082 -88530 -2734 282119 -255544 75140 -103524 302874 183823 -58919 60615 335438 171881
16071 171881 117619 -46959 18028 259275 189203 614206 217973 -11792 67562 210075 -20860
16059 -135797 -91336 174666 205739 112117 45337 121924 30680 -27860 -7403 323382 9688
16047 42302 62609 308733 115048 -10574 -107647 68035 -129990 217484 -149354 -400700
16037 -400700 14428 -98735 -227239 4156 -36882 399021 -10142 33752 -99689 344362 -30544
16025 9287 175515 3657 -106031 290763 -41325 48851 118606 -174396 206369 422713 199620
16013 138973 -137812 -137362 -8727 -95558 141007 -67701 -17296 18904 -159019 102776 51014
16001 152541 56684 26392 153389 31238 92024 -111676 272324 171106 -168906 437681
15990 223098 65066 10093 -111020 43632 -323056 -48503 -75885 103392 24875 153103 -212294
15978 222239 -129790 -7141 190972 185311 -282225 349113 408835 378497 931237 832640 472429
15967 472429 471985 589534 295647 290896 86365 35639 90816 -13758 271913 -127987 163484
15955 140916 55613 235360 55607 246417 -286908 23653 -52842 -246038 -139181 115743
15944 -57435 -100204 -179462 27333 -216279 -49382 429347 40507 -40092 -96890 202132 6284
15932 -257370 7631 95201 113533 -77186 77718 188961 -149496 124843 -152621 -178980 -121159
15921 -121159 -30261 -162430 -1405 416701 -203872 70126 121584 -11879 138631 100146 -291971
15909 192145 -122997 -250870 -12825 77821 -149546 -1228 -491506 -63980 -203640 -147665 112651
15897 -187296 -279625 117660 -83373 -37279 -72675 -150890 -265280 -265637 122529 -175821 146097
15885 -138271 20493 -90394 216461 -162165 9964 134928 -239551 54954 155541 7755 -97520
15873 -74885 26637 99607 -84884 109713 28614 173005 -142959 159497 -53049 -4868 203181
15861 27281 -133972 -32239 -166610 -382 -207659 -56647 -70994 -197323 -128110 99879 -175514
15849 -429191 -38538 -27136 -28868 -82832 52467 -297195 220944 38778 23687 -63556 176597
15837 -211461 186807 -161275 -98382 -45019 -7731 -52076 -19451 20745 36821 128583 -316212
15825 112387 165794 -220406 -78624 218637 124840 -341063 -47909 12838 -85897 -109637 77108
15813 -6977 -556043 -377503 -317506 -116318 -117553 182417 -470026 119698 -190958 -244686 367889
15801 -224560 187533 141640 147920 16539 -437326 -71249 -46540 185510 6742 70339 116946
15790 116946 -221342 352446 112211 156377 -249803 94098 -65741 116689 -103221 94568
15779 -353774 153979 -2343 -9247 170717 -54688 -188339 -93591 -125581 5885 -153141 -254691
15768 -254691 43071 -2999 -2846 194119 -278128 93357 137416 -72546 -58716 359681 -52 -99093
15756 -99093 -540838 -252203 -187097 -134937 187296 139188 -46270 84058 -220640 343353 212810
15745 212810 -209849 -67978 -69213 55205 140404 -234318 -171963 369778 -93673 -216279 -183205
15734 -183205 211391 -42367 473565 182701 -466626 191985 -119983 -58829 -126076 -121420
15724 -121420 -15406 -104872 219215 -109473 63689 272401 151432 213990 144933 -33367 -236622
15713 -236622 -182861 -157648 -186691 -178751 18938 -483556 102338 -182453 -271491 -139105 46034
15701 -161834 -39391 23711 -171763 -89532 -127634 -13922 47027 -19827 89633 204787 -98867
15689 -97246 -364825 -97827 99284 -308508 -203027 -82425 -486265 -329146 -222495 314070
15678 167902 329222 -277471 222116 144060 -374881 -86581 -137274 109097 -74054 -185426
15668 -185426 23968 -122478 166244 -134567 -229281 188360 -101292 -139484 -11825 -178750
15658 -178750 -146866 -11993 33080 141373 -178036 -7515 -100282 -7713 -36666 12141 103173
15647 103173 -35798 -14429 50897 65249 -307273 2834 107714 125420 104829 196333 -558804
15635 211735 265523 -109700 -63681 -38259 -355640 -14983 -101472 -21932 -127234 -108991 -228984
15624 -228984 -36649 -38819 175061 -41937 87259 184138 -81651 -91606 -13176 206512 -71124
15612 -271357 -302074 91710 -94871 -145167 449 100469 139712 39937 2730 -9422 219558 216006
15600 216006 -190540 -100891 -128906 29007 -291917 194055 -100235 181203 -188163 -21812
15589 243928 -485959 -84037 -72433 -189568 140142 -187608 40984 -18591 -176878 217739
15578 -255649 198670 135396 54686 -135681 -135688 -31505 -31344 80416 -39935 -123573 -249541 -74119
15565 21343 71317 -13876 248687 -113165 -374861 183088 -127012 250208 -185646 -377787
15555 -377787 20152 -203691 103208 -73385 93716 -45115 95552 70200 -58377 363347 -114290
15543 -103984 -218973 59157 40071 165270 -57554 -52705 148781 -106243 -129265 -163054 -102260
15532 -102260 -9844 -78380 -112093 -88147 149559 -134921 294153 -83040 398351 -210650 32867
15520 -69105 -75356 -43296 127974 492805 63057 71325 166098 -37082 206564 180566 -73190
15508 34607 45745 136875 146493 103165 -37129 -134143 91693 91735 -3445 25171 257530 119072
15495 144620 96518 -27465 233648 92793 19541 -17679 252169 184260 95230 -244009 173474
15483 32302 289817 465528 353193 178788 311500 -4357 236290 -56073 97800 -356556
15472 220926 44010 475807 -39747 90304 31259 264469 -138827 -87267 48197 342915 450141
15461 450141 106704 163060 54478 -80750 435564 254513 201804 296048 485768 -95796 262034
15449 -165824 -104059 65471 177062 159253 -177483 -144622 91969 -17860 145336 27808 117238
15438 117238 -274340 -91451 49083 47053 -116269 -2080 122864 -97419 13583 60207 7360
15426 323896 366106 443472 540724 505543 441711 421392 270406 248084 -107088 200038 7680
15414 -67938 294264 256987 -217113 139650 -207447 -204299 -83410 444602 162209 -12649 183773
15402 192567 63938 315387 -46969 -85802 202331 -166494 -125665 -266751 84728 265312
15392 265312 225995 -107984 103584 -214270 -298479 -125555 -74127 -4699 -209201 -27433 -23254
15381 -23254 246040 -99746 -22499 -95572 19585 68991 -110176 -58153 158448 134782 153433
15370 153433 182889 229079 -38325 -259317 266285 89224 90117 -10250 -91858 60537 -167381
15358 160849 325722 74784 515649 44226 102590 90176 -39149 254735 110927 -12003 266657
15346 280500 359817 403254 133295 -24694 97203 188634 109229 249621 226806 119542 144145
15335 144145 -46226 213834 327039 114902 89257 121361 101755 187220 212049 165688 177365
15324 177365 188928 15868 250457 -258737 284092 69860 152704 108232 121082 651532 134425
15312 -68321 -74450 -70309 -49893 248251 191177 386679 18412 212698 127742 35946 245178
15301 245178 277902 216651 210729 273866 310333 199227 149795 178065 281685 60495 -20220
15289 -20997 99966 7727 -35000 4258 -310123 78388 258060 83806 285444 -401143 247592
15277 -90157 7868 89401 74273 221325 -142894 27765 -217042 28276 -49682 288419 20234
15265 65595 53903 -154806 252147 -131057 123397 44636 156027 139472 -141618 116380
15254 137815 223967 -77961 35607 185811 -254931 39203 170551 -222475 63799 21653 53388
15243 53388 38723 -94458 158559 -85997 237773 -39490 124794 503201 18471 16254 403104
15232 403104 352145 1038895 1105467 1294864 1064073 1429126 769187 593365 -244683 211975
15221 -97122 500885 -93293 417925 250600 -31123 189084 -57395 -147943 126462 180717 14211
15209 11346 -149403 47455 168161 82786 239152 140357 199507 75263 170548 -34638 340052
15197 142578 227318 210826 237087 -2087 300547 -174159 145858 59900 179991 80604 55935
15186 55935 64241 29844 95137 114530 -25638 69065 276351 -241911 73320 65747 155307 354507
15174 354507 368089 -338243 -149973 -68426 99913 211459 424773 296683 -155313 -4579
15163 119739 50587 107710 291246 -80515 100234 -193995 152504 238955 116167 129065
15153 129065 -148932 185655 160507 460826 231024 240075 3127 162380 -135751 447753
15142 124397 -165746 77141 94029 -56470 263284 156985 118584 441417 211337 225147
15132 225147 188247 226888 -129557 -89862 234135 220896 -55101 24367 -114279 -6783 125106
15120 -22801 128295 -90760 460281 95386 -23260 352471 195339 263153 545555 -84495 70787
15108 125991 287676 139849 234951 473916 425808 288275 298806 208403 -106255 247259
15097 95966 28219 -17250 214431 50225 -58087 327641 190879 167164 1936 54606 170193
15086 170193 231014 -117406 343801 -2956 44592 239895 162607 -43597 -280349 348573 353927
15075 353927 267460 40736 490108 268312 161791 306337 254343 102924 -5970 435474
15064 11195 283501 -225644 152438 27987 130926 193031 18822 319109 59689 307139
15054 307139 -101905 193826 385616 -84503 121609 314694 67390 16837 454 147505 487736
15043 487736 346782 48910 313596 340709 426028 46735 332827 195973 234012 148993 374394
15032 374394 159797 269399 78751 156551 556259 261555 420091 140386 60482 64286
15022 64286 282671 276443 340584 272191 541788 137251 360896 641585 -82600 268860 618229
15011 618229 383035 590593 823601 388928 482349 443071 211081 354817 702952 407038
15001 407038 498524 551057 473034 533646 319057 22949 360839 300405 366096 496201 226274
14989 565029 98584 37490 169068 475300 348515 669765 541464 730056 551411 432588
14979 432588 475432 101369 559180 182420 150968 314206 512026 638360 284431 571210
14969 571210 495754 549485 757426 612248 440030 875027 943182 422702 463353 313407
14959 313407 314362 720642 358648 559898 549696 605481 522017 303530 104971 535528 304145
14948 304145 271512 384804 383610 415457 556605 29954 600062 231374 411737 179264
14937 255731 280746 443885 203492 228746 157175 504070 644516 305917 392102 400134 296629
14926 296629 179598 461662 455698 460698 272526 240762 511388 708844 356943 468285
14916 468285 660318 819737 927274 716827 926773 1059805 1235847 1625896 1176216 1209796
14906 1209796 1105435 1393413 1226336 1147333 1273398 1440175 1488222 1444369 1502850 1458861
14896 1458861 876478 1122724 888011 1231574 610040 442005 379164 334780 413620 346223
14886 346223 736542 372671 382025 594409 662531 82372 494758 464240 571125 422469
14876 422469 455155 217978 427022 506269 542786 490645 923788 685195 969282 715016
14866 715016 602728 545982 609693 476292 636300 403676 698948 597932 863429 834449
14856 834449 871084 541951 591418 613091 730486 749973 916267 459412 638524 530483
14846 530483 704706 560516 437500 596557 577225 661365 605598 493221 863309 387547
14835 440820 731769 542125 536711 489660 717061 765676 365665 649592 680081 738271 684407
14824 684407 1023643 744910 1014665 926632 1068117 558179 943312 1186529 721296 722579
14814 722579 618391 393973 606397 719775 449649 602298 636086 443861 713843 533204
14804 533204 680972 1013115 845687 559528 868778 824447 601779 693646 389929 848091
14794 848091 622991 759666 533450 510515 782575 839205 571528 710753 918176 897728
14784 897728 1061926 1112261 1027368 323580 428064 593983 566117 533233 226551 549586
14774 549586 361400 449267 356485 672491 723283 526297 383519 364855 492204 731769
14764 731769 965615 607378 850077 758329 650059 810767 925471 707867 1270429 935359
14754 935359 881092 763838 606593 538769 785937 729157 939678 792723 564862 524645
14744 524645 665201 450909 625254 482477 722610 747423 538140 797882 644323 961057
14734 961057 679244 836206 738927 602932 787990 787207 316424 889851 896148 575572 600333
14723 600333 1029302 727121 854409 781734 719789 664909 822398 502458 719979 793757
14713 793757 866469 1313592 1072337 1415525 1341012 1282500 1285420 1388720 1073926 1076567 634858
14702 634858 1033960 980353 1004146 975867 630800 1044673 1186123 1023378 972792 964803 1260378
14691 1260378 977676 689597 1188297 1083503 1213210 1083804 1175755 1236699 1133344 1485944
14681 1485944 1618672 1451045 1557359 1386368 918473 1216611 659131 1091577 1091698 935649
14671 935649 1004771 925959 1060744 968722 1135551 1130035 925825 959418 1118134 1231119 1044179
14660 1044179 1305361 822543 850504 1303739 936431 1075878 1117308 1221360 616644 828279
14650 828279 1133472 1138827 882548 813596 1165855 847973 943339 1148162 1275481 1195813
14640 1195813 1055372 921131 1138232 1146533 1216604 1248524 1625851 1528687 1285943 1209725
14630 1209725 1544931 1406901 1173113 1304604 936701 1435232 1285678 1124432 1331051
14621 1331051 1506688 1031302 1425462 1221264 1405475 1303272 1257166 1555285 1570727 1379960
14611 1379960 1288423 1499048 1531051 1501324 1465367 1417584 1572191 1451392 1514615 1466977 1322830
14600 1322830 1280535 1463500 1105333 1668508 1188490 1739728 1557410 1670342 1561592 1679408
14590 1679408 1619036 1909760 1820414 1706990 1177958 1817883 1743923 1819221 1432159 1861280
14580 1861280 1421463 1523840 1621087 1671144 1823638 1781313 1751523 1762807 1782612 1777826 1940726
14569 1940726 2109400 2159375 1911755 2025463 1996437 1956633 1674737 2476343 1963017 1759898
14559 1759898 2295691 2544891 2400662 2146412 2367279 2613433 2533420 2422733 2385281 2823353
14549 2823353 2589127 2810012 2806498 3005031 2926329 3084895 3307430 3586983 4230833 4521060
14539 4521060 4740041 4968591 5632767 6838329 8074424 10093613 14552903 20645199 29387129
14530 29387129 29695439 18746946 11697821 7998869 6148594 5936844 4536990 3690788
14522 3690788 3048807 2859919 2943372 2428383 2548158 2461429 2438495 2763849 2434676 2538749
14512 2538749 2658553 2479052 2510286 2592846 2596951 2656122 2407524 2626261 2668006 2386247
14502 2386247 3005045 2783099 2606682 2791745 2659784 2641195 2705921 2633240 3027422 2840624
14492 2840624 2905845 3063464 2629843 3102334 3060280 3166972 3131524 3429291 3250835 3182713
14482 3182713 3430496 3386751 3495588 3668303 3775412 3246714 3673138 3828107 3545390 3956012
14472 3956012 3814921 3763014 3880639 4060130 4110668 3672246 3890594 4158757 4083549 3880223
14462 3880223 3902985 4304621 4195166 4332242 4428966 4419239 4171369 4465890 4397928 4649537
14452 4649537 4706595 4638546 4422130 4612625 4847719 4744258 4776832 4916658 5044605 5016000
14442 5016000 5207974 5250528 5238925 5050059 5532889 5380499 5597094 5726083 5793548 6021229
14432 6021229 5813829 5839931 6175859 5924846 5972514 6359845 6022512 6048765 6551436 6411204
14422 6411204 6463021 6458371 6889178 6812108 7191747 6721318 7392762 7283779 7160504 7375350
14412 7375350 7733569 7401043 7865764 7823809 7988152 8012319 8091281 8445361 8419059 8293442
14402 8293442 9023702 8973813 8927819 9464121 9060297 9324048 9278710 9778172 9926240 9923969
14392 9923969 10323847 9870750 10320518 10720605 10553466 10937201 11251816 11297702 11335796 11585359
14382 11585359 11755453 12148872 12195635 12072213 12302056 12508768 12725880 12694693 13211278 13496435
14372 13496435 13830733 13725209 14193079 14366043 14814266 14991310 15396492 15454480 15994920
14363 15994920 16429266 16684495 16745515 16852839 17514809 17702878 18185156 18360139 18989768
14354 18989768 19172861 19345844 20055171 20721955 20693525 21412043 21865835 22467262 23016289
14345 23016289 23349573 24057697 24328509 24972667 25340750 25945466 26705217 27288559 27973312
14336 27973312 28540111 29428350 29916245 30784233 31558270 32240179 33368199 34302065 35082653
14327 35082653 36279467 37113573 37577987 39190494 40238378 41288745 42555052 43711829
14319 43711829 45124594 46417326 47716863 49294917 51468499 52774238 54733679 56183771
14311 56183771 57878528 60039630 62094760 64107550 66517192 68878963 71544236 74257440
14303 74257440 77007872 79871976 83095318 86177263 89535491 93296412 96901375 101270687
14295 101270687 105403907 109954924 114800514 120004368 125225359 131102048 137293055 143440117
14287 143440117 150313761 157921032 165592810 173494837 182316680 191458883 200748921 210822061
14279 210822061 221405323 232637107 244448312 256831132 269864340 283734020 297831892
14272 297831892 312560140 326829385 341197313 356127493 369899539 382861284 394684448
14265 394684448 405157395 415325255 424230050 432442001 439824010 447750292 454046037 458261860
14257 458261860 460480396 460980986 461764659 458823266 452586236 446035820 437834896 428294276
14249 428294276 416845124 403685673 390057105 376341530 362200527 347806604 333807605
14242 333807605 319701964 306128736 292798928 279674560 266872171 254983135 243736235
14235 243736235 232571687 221970575 211500628 201332566 190824793 181432682 172616460
14228 172616460 164007326 155962044 148411970 141285582 134826349 128967459 123109787 117653492
14220 117653492 112609454 107903687 103499135 99138453 95308730 91289460 87981093 84340258
14212 84340258 81166730 78115565 75198596 72689921 70126129 67454468 64919002 62830706
14204 62830706 60638164 58796838 56769367 55221236 53154726 51589828 50362380 48501726
14196 48501726 47175591 45786319 44476896 43116659 42401792 41453443 40092895 38863029
14188 38863029 37464997 36908237 35775416 35017499 34259758 33327020 32502781 31227369 30487542
14179 30487542 30118240 29061631 28616138 27781023 26981568 26467273 25769394 25304996 24778008
14170 24778008 24125928 23524292 22914981 22583607 21871101 21754087 20748690 20990850 20434428
14161 20434428 20341649 19751761 19149587 18585302 18383584 18219795 17498675 17203222 16826317
14152 16826317 17024555 16525085 15956899 15921862 15718260 15286932 14735090 14427349 14599680
14143 14599680 14389900 13856783 13862030 13509983 13031451 12778894 12667172 12416950 12256697 12262933
14133 12262933 11938237 11606646 11370341 11486066 11593911 11077040 11042180 11136503 10473834 10477707
14123 10477707 10451578 10437854 10001151 9628572 9794781 9380981 9323235 9322392 9098391 8740373
14113 8740373 8989460 8786117 8744874 8536472 8294445 8549234 8241338 7767839 8197543 7711561
14103 7711561 7748390 7496371 7654788 7199299 7203323 7384055 7273126 7193119 6884067 6993521
14093 6993521 7142988 6834183 6781365 6550537 6669728 6110654 6105027 5902810 6077152 6425709
14083 6425709 6213375 6117389 5876980 5942797 5767357 5603810 5871121 5727014 5539403 5428305
14073 5428305 5442027 5420084 5493247 5238280 5391569 5534962 5322736 5019180 5106279 4859440
14063 4859440 4928969 4733879 4404521 4990832 4639584 4684276 4747081 4955037 4413957 4581034
14053 4581034 4291236 4487363 4423760 4518093 4087929 4328659 4200436 3937673 4082391 4156846
14043 4156846 4243771 4165847 3948652 4046722 3917619 3712533 3585879 3694399 3380696 3721462
14033 3721462 3633719 3542334 3711549 3721115 3493272 3473322 3441732 3565794 3366871 3207336
14023 3207336 3615825 3140598 3064641 3153484 3298679 3030780 2985299 3136872 3505798 3004352
14013 3004352 2886643 3157018 3129306 3222441 2974405 3017396 2939404 2809444 3026507 2381456
14003 2381456 2430095 2632107 2743303 2700049 2625987 2323437 2568203 2217064 2806642 2522423
13993 2522423 2175698 2318014 2438498 2511503 2304644 2606624 2349291 2311377 2676668 2535314
13983 2535314 2430084 2675557 2610478 2675450 3025269 3397611 3658029 4235644 5647708 6803134
13973 6803134 10030792 15992354 25895392 30426843 22035989 14615470 10327190 7651071
13965 7651071 5632067 4882834 4708601 4372875 3826146 3354425 3460265 3384685 2925368
13956 2925368 2742020 2818963 2659141 2726638 2511213 2400733 2594844 2540698 2359339 2264399
13946 2264399 2060849 2185760 2395349 2043258 2127307 2211741 2330543 1995948 1755214 2119502
13936 2119502 2180786 2175461 1996926 1802458 1953832 2106441 1882238 2012866 2181082 2084717
13926 2084717 1701428 1680935 2010157 1561328 1557630 1760785 1715203 1764938 1630684 1622288 1511992
13915 1511992 1638005 1869516 1587512 1796480 1587366 1810328 1777217 1917094 1668308 1681112
13905 1681112 1413375 1622597 1470025 1346867 1627539 1523675 1323649 1430791 1464306 1705873
13895 1705873 1459929 1364788 1466015 1457314 1570666 1223318 1388716 1490021 1592475 1310323
13885 1310323 1348673 1110166 1635611 1398366 1500563 1504550 1622051 1416379 1122902 1431494
13875 1431494 1542232 1183120 1120457 1514462 1084777 1451796 1343521 1072311 1149910 1230412
13865 1230412 1039171 1312437 920258 1370904 1031051 1364550 1237028 1374409 1154477
13856 1154477 1158658 886908 1117532 1151262 1121638 1158275 1102790 909527 1030193 1252693
13846 1252693 1352762 1251134 1030543 972096 988299 989240 909183 1102813 1214622 1050707
13836 1050707 1127583 933519 927574 1142961 922895 1379826 694931 750611 1070792 1069507
13826 1069507 1139151 1013807 840225 972188 910106 971112 892135 824745 988897 895637
13816 895637 1207928 1069516 1061151 990209 911721 960548 899640 1116393 592551 887249 1059585
13805 1059585 784795 756866 1324341 1189290 932951 1062367 1107132 812832 772788 987406
13795 987406 523633 813778 1063387 818218 977143 771745 605066 1057489 622963 809066
13785 809066 834157 803289 595276 568052 952482 895308 964089 972273 1000757 682097 734796
13774 734796 840625 694074 787336 858648 640927 794277 736617 521832 447862 659497
13764 659497 798064 734207 707655 567732 395333 910535 638852 631648 603909 790620
13754 790620 610464 735228 876516 424922 569472 495613 882979 751237 550066 658799
13744 658799 551426 345908 402738 790166 439044 1064278 685368 288412 673039 729208
13734 729208 438340 739810 763309 552413 577135 774585 748832 1155838 325531 675365
13724 675365 755023 661819 548321 656710 417220 603647 566548 522549 546567 549047 956827
13713 956827 514399 112441 598801 655066 266278 555562 267479 465849 345510 526359
13703 526359 316268 704755 481861 538155 523397 531204 344831 47759 409606 437503 365518
13692 365518 562895 492583 485363 740817 572905 354599 485695 516321 642443 906581
13682 906581 316097 539626 697099 565827 389971 486950 829684 656765 672003 341331
13672 341331 541328 532926 405190 520439 401862 843897 288348 340926 343500 568803
13662 568803 335256 549324 579235 308054 769598 505811 726924 471647 507151 517134
13652 517134 400239 442917 329798 -26656 336239 172377 463324 477494 820593 218086
13641 683549 536441 386048 232605 539276 472680 487081 671686 327320 341448 544225
13631 544225 737072 484981 288329 432436 572170 443562 580644 162723 335193 411557
13621 411557 503060 399699 455993 436235 249337 766796 552204 239268 505502 685785
13611 685785 576405 206442 555109 300896 423336 497472 454038 169845 418728 185273
13600 539738 542787 556184 397381 671380 394687 159744 194138 468984 442243 183194
13589 291695 478085 471488 464348 95195 318522 577424 556787 575134 582780 482349 557169
13578 557169 492189 322931 413840 266324 306892 184935 687507 351412 297066 399798
13568 399798 65181 502674 104785 -8898 152020 326781 219783 381503 487453 194177
13557 133551 195016 129233 252063 347017 535776 199813 64341 246388 597826 29727
13546 576950 174274 74994 319594 222667 9575 366514 756405 287471 132923 662334
13536 662334 154663 696945 229857 379096 415238 447224 119940 385218 237931 165549
13526 165549 272683 219265 356564 252446 174759 633470 12409 101850 448607 256232
13516 256232 464780 385249 186146 329656 30866 322248 228801 146873 245118 302624 443128
13505 443128 280391 378901 145447 232403 273274 105323 254706 243943 285894 88935 314582
13494 314582 426350 398326 -13969 473070 -53384 43455 -39988 166639 345049 697949
13484 697949 -63918 158047 102376 134316 306052 233788 213636 19657 286721 322686 -40236
13472 568479 104536 202162 41300 215671 72005 292165 154327 6270 340492 187352
13462 187352 377195 403356 36680 78370 79543 68439 341470 389607 -27962 -10167 162169
13450 188484 136544 330753 -66800 66543 302395 126622 314963 268230 228173 306507 118995
13438 379428 337661 406743 89479 -46900 156940 282867 540864 64531 166020 518472
13428 518472 139622 -76149 207685 571861 223394 223663 170496 173748 177561 250655 192799
13417 192799 253289 33244 164902 494630 52707 330100 72286 291073 326364 363349 -239558
13405 135409 382479 299098 118506 -124479 124425 365292 234240 469473 173135 -19863
13394 75882 249226 692277 309015 381742 176591 199030 282894 405015 298798 441220
13384 441220 195456 388710 277529 255076 459585 121921 357512 208973 484730 55750
13373 265746 287709 224664 102695 371316 296897 271911 191959 28307 279129 25036 97402
13362 97402 274406 317447 230113 77769 227386 36622 136109 251653 344408 409812 226760
13351 226760 212244 254378 237520 313067 408539 367907 -219690 190385 458934 -65648 507034
13339 70852 -31161 279642 220142 -7922 183802 253302 360765 63464 88701 336270 281010
13328 281010 479846 405291 383303 344697 -18105 167973 442849 266692 60998 535444
13318 535444 226763 -99010 -154959 72531 313762 -41326 192798 332475 475377 229107
13307 26995 23158 403376 288933 103755 -25892 202889 110098 266816 77592 -2887 9036
13295 226581 56486 25874 382319 109714 108820 235365 226454 192875 294400 55086 96974
13284 96974 218139 235300 23223 210228 83865 446513 -8055 464484 251699 574939 129863
13272 145931 154674 259251 -101267 327469 23184 513038 121822 138040 62170 216619
13262 216619 -34437 -71100 296122 267451 -372293 -4823 -62433 285116 -19203 -186067 21736
13250 -31170 365446 166918 218827 185565 223736 89219 345432 -5213 -59721 -256243 191077
13238 217208 -246840 275740 -91463 -169856 273684 406254 -147298 331851 74919 -49860
13227 314308 -247810 83387 395851 -161282 100345 153131 28204 -208417 79435 148914
13217 148914 310204 -42635 326747 128106 162626 -12311 272684 36927 -25245 -179843
13207 -179843 17330 303105 116086 54166 159729 -47812 161710 -45271 -112903 -80020 -146959
13196 -146959 311411 125880 -163706 112053 242275 143206 342547 311767 -27008 -337703
13186 -337703 111075 398297 170026 172243 411189 153770 336452 86132 -108254 176183
13175 -23573 338932 186488 145401 305727 42543 -81138 60160 -352415 380931 425258 130078
13163 282561 -233857 46993 -4514 27240 -21902 63934 69980 32432 -16596 18066 -27104 -22609
13151 -22609 -66594 253684 84075 -206458 369355 17923 253270 438519 331950 -81300
13140 -136148 126345 14406 135589 176887 -51991 354418 339475 456847 -34386 -41159 90114
13128 -136635 83102 187927 -108504 -93181 313872 302403 -120896 -137076 -98150 75270 -284900
13116 -31928 207780 -90356 176422 -128651 55743 -32116 58987 -211170 277104 -170225
13105 -52296 -86075 -45828 67777 23051 -57449 8796 276110 94830 174182 65694 -167963
13093 217582 173210 -87181 -6939 193983 6728 -15224 -142231 -188027 203923 65140 -30493
13081 169302 -95889 391695 135761 -21962 -135935 346072 164211 115392 -128643 201502
13070 2687 25125 137773 63399 145793 140334 162745 223713 -256934 87947 -161763 -57419
13058 174483 314166 188413 149168 127092 -157713 6821 210270 23877 174890 -227018
13047 249453 141917 121385 -169299 -54929 -17987 9785 136323 429953 145658 562653
13037 562653 192881 58760 134460 -21262 -102843 -95814 -82185 -95420 75181 96710 73012
13026 73012 -65721 -46449 49743 219262 30826 -10758 156403 -219111 455010 82539 -27413
13014 -61905 171864 59904 175606 -35340 303364 11830 137315 186876 33997 -242917 88112
13002 -109661 -142681 163734 187853 199926 252883 306588 509110 224921 146155 -51220 -985
12990 195913 188142 2704 406764 86650 -31156 89713 -65232 164034 -16682 80536 -83569
12978 -272193 -302488 -109040 -102376 138991 -86919 -143848 -38914 -54165 -6302 50537 -66820
12966 241673 -189203 10883 213536 95398 19890 82956 34019 -236882 -125724 2580 -51674
12954 12615 -181389 -115948 45781 114153 47043 -86702 -69920 -133428 255213 8240 54478
12943 54478 -218466 240396 29640 -262891 -179649 -107675 -76536 -205052 -102654 -185011 -78475
12931 39397 96495 -78004 -372744 -360087 91885 -9424 162675 -233735 -74138 19676 -56022
12919 90320 -9491 -43912 198992 -79167 -463688 90218 173913 90831 -174314 -33265 -131651
12908 -131651 -118896 -21782 315064 58705 157972 14109 -139271 1010 -377821 -4144 59196
12896 -125788 -89363 -197300 161522 -102219 111867 304537 648410 388874 106531 240068
12886 240068 177021 25588 256906 -112118 62820 148202 123603 38903 206495 -4304 174372
12874 -91758 337795 149704 -140032 94241 73877 -16253 -158845 159001 -364132 -10072
12863 -33903 154272 26595 -126897 -159726 210940 44169 -55435 222658 15658 -108031 873
12851 208939 -90878 -50815 95043 48219 -76710 -145366 40048 46121 -101632 -229889 71639
12839 -33183 97306 -206869 -34799 55601 -226154 137473 -23719 -161706 -142116 399886 -17501
12827 131324 79032 -187802 57547 -97067 -13624 -129443 -70260 74852 -126354 8517 79540
12816 79540 -261056 -76853 -75439 207492 -113334 19465 100006 134622 273567 -48426 314064
12804 -108596 135789 160664 -321164 141507 -225934 98139 17688 -60167 -295056 -293994 29571
12792 -207270 206489 -175771 188090 -62766 -185847 -302873 -133502 133413 -23564 -231306
12782 -231306 -37086 98521 -24100 -257758 51631 -265151 16200 169050 105878 -79175 238023
12770 27570 -8665 -8356 80712 -170190 95578 15563 -69083 106462 29277 80628 -110446 4407
12757 182290 82707 -54843 -209574 -99958 -224287 -138621 -134599 -84099 -57478 -16998 -307882
12746 -307882 -138111 -79427 48628 -90950 119110 180156 -116423 227581 -47452 252368
12735 35766 -97440 -208358 91624 189063 -146370 -112364 -69503 -70438 98506 -140880 40375
12723 36024 149102 -27070 189577 462049 112281 359416 -1292 146219 342574 251139
12713 251139 154808 155670 84381 -114834 207377 11881 -62490 -251612 -43352 -20950 -32096
12702 -32096 -219151 15083 101830 -151083 69109 204968 20408 -17200 292925 112136 18613
12690 -25194 340048 -70900 -85713 127367 -155405 -8625 -52756 99061 18526 -173452 170180
12678 -67859 -97147 135888 -141525 -34997 -96603 98490 -187810 359967 150058 92050 -62683
12666 -24986 100978 -234919 138934 -44519 149693 89054 -39381 -35576 -237509 100040 44667
12654 91428 82329 46192 266496 126934 -80755 -125353 74398 -30868 159565 303386 260416
12643 260416 88705 -123148 -128399 -42174 89593 -30334 137541 -298656 -41968 245572 247041
12632 247041 -25312 244325 -149499 87803 -74727 -222856 35813 -199171 129434 203457
12622 203457 113176 30412 15979 167297 -142311 281071 428594 180005 230515 -69279
12611 31332 25095 256315 159798 -148347 59254 140284 222397 134994 154746 -26433 19774
12599 303899 -171460 -34951 68199 174356 -197599 -90958 -398323 413542 117592 33374
12588 125085 26280 3186 226591 -174452 354785 -101810 -118220 -122389 210682 43056 77784
12577 77784 183086 244174 297504 -94362 90708 -388926 71159 43408 133681 28552 153329
12566 153329 42527 -48688 172751 -319477 9716 78821 95689 -292251 -95907 268039 -25215
12554 -407370 261597 258674 115694 254911 322961 124371 190653 112280 -66163 101992 -207598
12542 53875 -272330 13572 151862 70541 220613 -385469 -134529 -37729 47795 8955 -92306
12530 -343299 -250623 -138731 -70383 -18421 58725 133728 92242 -120749 67892 -150600 -178739
12519 -178739 -275546 -71923 -282292 229429 102978 -88426 -156689 -339788 -229552 62035
12508 73354 57599 41521 -226515 38348 115416 -9079 -93939 -36912 -178606 -58494 187801
12496 -192570 -127534 -187096 231450 55125 6252 24389 -120080 83294 -418791 -261202 77851
12484 -172982 -24884 -276248 -120170 212653 -120730 47825 137398 29395 199959 -210841
12473 -327414 11375 -40610 -30566 -291935 21065 249028 151197 -245063 -32943 -66890 -143458
12462 -143458 62805 24061 -7305 190330 -16804 -22214 -22834 18500 191620 16188 -48277 -309675
12450 -309675 254578 18166 88395 -223302 -176080 -135923 153612 -132911 -125219 6477 -109015
12438 106825 54990 84218 -35903 -234519 -94917 -18615 -63658 -11250 -344225 10907 134056
12427 134056 -3671 48821 -174548 -97990 165790 -99683 -68621 143329 87690 -529993 -313257
12416 -313257 -168883 263138 156494 86865 -102658 -154490 57070 -189046 -302828 -43571
12405 102197 -273419 188899 -53316 -193936 -83903 -38666 210042 -14756 -144438 -346862
12395 -346862 146795 329127 10421 29510 69245 213300 186051 -306868 -162828 116040
12384 183806 -74844 180327 -296237 -62077 -124380 -232572 -194749 -15394 -18813 114483 18799
12372 95208 -237875 220004 147985 136532 217907 24190 252824 8689 240087 46199 285728
12361 285728 -135686 28645 158156 119909 137042 -69820 117040 94021 -177788 182759
12350 5143 -128800 -153507 -234232 -43216 108374 289710 -102236 -111753 -309537 62796 -4078
12338 -86969 124251 -162447 26783 127992 -115149 -80235 10628 43176 -89430 -84043 -159054
12327 -159054 -72694 -154776 120549 -4074 -153634 -145661 -270243 152454 -64487 160637 -61733
12315 233351 421208 297375 235134 43235 206733 40089 92047 59106 195355 -2 -42011
12304 -42011 80504 154358 95738 116498 131951 -40433 139613 -56564 -11427 201966 -39587
12292 178883 19021 166896 64338 -69317 49289 123724 214365 -46115 160668 5042 81396
12281 81396 4614 -48504 401752 288686 104974 132739 51743 208609 -39731 -53195 249668
12269 202494 -241869 -310223 247152 312405 287174 243391 -78597 53500 209272 133759 346819
12258 346819 247289 284939 113703 341572 247807 171371 374935 157109 297599 170036
12248 170036 158063 -80969 180131 -111673 269332 -151211 109874 243026 272985 -165819
12237 -72596 39817 171960 -86040 -54208 -71902 131848 -137466 86239 441214 62109 187327
12226 187327 290155 35583 181848 -47415 -155995 74632 16137 197119 -122296 204217
12215 135267 -231090 182516 -153549 257945 16983 105025 109030 59662 187964 206958 106030
12204 106030 -57831 149033 -96786 172332 447318 -176545 42445 -154327 192186 29067
12193 -231556 -27861 -177880 -66070 -89850 -297263 207825 62453 175330 74254 -65916 151921
12181 -179171 72482 352476 -134800 -405 90293 326044 -182576 -57373 193724 40577 -106936
12169 233400 318360 -124428 95082 -44418 48134 90052 43065 79091 -126364 298735 351426
12158 351426 -73824 245149 225566 176085 112883 278490 377862 121416 63287 268533 133426
12146 265610 257783 -149528 140460 112933 155573 -2440 217565 13818 163256 -23812 -119239
12135 -119239 299890 54518 28513 9771 -236912 363047 -106025 -318379 -143911 123396
12124 96242 129502 -74670 276719 -113046 286627 172925 127344 -103068 21114 -93267 341129
12112 450686 -3008 231357 48002 206313 -15150 -49262 112723 -214379 65005 148158 119022
12101 119022 309209 -50424 -48194 168935 138064 214004 451384 273478 -111467 -333365
12091 -333365 -222914 382045 505422 114837 4966 -60972 -48464 486072 -93181 80531 219258
12080 219258 213727 212842 -50658 206300 1599 291257 -71060 71939 -90174 44950 262995 -24613
12067 -284576 -134517 168529 183681 176423 156310 52133 -60397 416523 186265 -184730 78268
12055 254419 -109242 47926 173967 -152979 185552 87215 25445 -193121 93584 252318
12045 252318 -196472 -87856 -228951 -462295 100321 -47939 49300 240959 161160 101593
12035 101593 64210 -175990 -420102 75610 -153714 164739 -16374 14097 96977 -167744
12024 60341 51516 -168824 141078 249241 29653 -574 -32376 296468 -184525 -3412 -105966
12013 -105966 159294 77775 112089 -164624 -326591 -245947 -235186 -78912 -7874 20128 5973
12001 -334 -143108 -85459 133615 -277898 -143535 -70913 117888 -113180 122250 281660
11991 281660 154379 71162 121824 -340674 -191815 -181275 -213934 -150559 -93095 70006 68125
11980 68125 -82076 -103523 193450 -264814 186832 -34216 -45016 -82829 38477 -18224 -16008
11969 -16008 -144415 6809 14605 114651 -50693 34937 -340441 -119638 -91747 -252258 196365
11957 107714 244867 -146781 196249 -134886 345346 -51658 124180 38495 1133 185417
11947 185417 -373059 32628 74417 38408 -59798 51110 108745 79419 13176 -217509 112872
11935 139768 -28366 84379 -173374 -253540 -93326 88956 192684 -58490 204192 -128554 -317324
11924 -317324 150746 -214672 49588 -87486 -121817 293928 -60648 98524 107471 35060 -99184
11912 131532 -38370 -72914 -9961 -172024 -244090 -246479 -48320 7037 -81875 107677 -89230 333384
11899 -24675 4792 -120335 -47670 105454 308225 -25155 -219008 -198550 -11546 -24852 126841
11887 -222446 -140358 -251283 70020 -266231 127046 -74518 104526 -34665 -134252 -46692 -241075
11876 -241075 -64884 -233239 -293595 -6382 -279065 -197482 38867 -284111 -254397 -124644 -4547
11864 -33194 44999 -113078 99390 -139745 -101054 -273633 221889 -312832 -147483 -76822
11854 -76822 -168820 -25247 -354167 9197 -21220 -194577 129895 -245702 51977 45959 33786
11843 33786 66405 73632 83494 -18393 25311 81771 -217875 -101934 -89837 -72334 136281
11831 -363742 -110860 -311408 303661 -174486 -69944 -173062 -69819 -7565 178663 155594
11821 155594 239987 204685 -15856 -149902 84814 -203442 -76911 -182432 -79145 44918 -77744
11809 -29437 149987 374672 303015 -61969 79312 66037 -133604 -193209 80236 -166352 36921
11797 120496 -232028 173999 -706 33387 -103555 57423 133166 89068 243485 -2488 259448
11785 -40412 -114598 53440 -49556 181278 -129561 -7032 -200430 -178044 331870 -224352 158199
11773 -228167 -225504 -162538 46175 473678 19798 -15252 274488 112832 -243298 -231023 238607
11761 5979 15255 -164744 -227651 237680 -199851 -36690 -128983 -245915 -70626 96277 8913
11749 128523 116834 -61590 -280897 230886 -127111 -194670 3866 95380 249699 126210 3144
11737 17919 144651 72914 194055 -300669 120808 -111019 113321 143154 39431 -91154
11726 -102261 -113829 -13372 230251 -62483 -202517 -116623 -67610 -27261 -162599 113371 -213013
11714 -126170 -168291 30933 -202696 67449 199947 -35894 -94606 60482 -190724 3881 58023
11703 58023 -101295 206783 -270125 73785 335438 -92980 48252 -180733 -59381 -140570 235505
11691 -127184 54913 132867 107793 24784 30894 256995 -238776 -86188 -191542 -17155 -291597
11680 -291597 -186495 130075 38743 35463 234372 160367 62368 90829 120562 230224 279410
11669 279410 -254130 223416 -69207 -130771 -124104 182342 34438 51231 -97398 83072 -124675
11657 -227598 206196 332869 -18243 -224916 -288642 181158 -33027 -187670 264947 173452
11647 173452 18117 243578 24109 237791 -393 149059 322902 77958 92075 -13951 -141141
11636 -141141 -15061 -29435 -50309 -129196 164201 186885 -239610 -71309 -32942 186051 -331933
11624 64388 309192 -75231 -176801 -115122 -212654 -69871 -107607 168607 -282992 -99127 9295
11612 -103986 -89576 -137151 -214891 141012 28009 -20351 -85928 -76762 -184905 6484 53396
11601 53396 -252641 114535 10016 -57880 -46015 63499 -166942 -240123 -197101 -288103 188767
11589 140127 112754 190245 -297611 181031 219005 156154 131626 286727 -73474 110789 -149432
11577 92749 82576 15679 97408 -42794 347645 -64588 -108218 212509 -52540 -94126 230328
11565 257551 -14005 80540 -267423 223925 289167 237799 -111559 -202456 -224011 -251269 -136831
11554 -136831 11719 -115296 29212 48671 -145204 -85886 -261612 82751 191740 2691 -30468
11542 -13104 -124059 221613 -5147 -102879 -204965 280169 16547 -94390 155625 -172408 114656
11530 112354 -25497 -45374 -46880 -41609 22271 10530 -44875 12323 95135 186968 112625 -147462
11517 110607 -241335 72447 163320 227726 27875 -60860 -44223 143697 -16309 -181535 -326896
11506 -326896 -187370 298871 63732 238578 -174040 -142972 287505 417915 -107226 -109149
11496 -109149 -65545 -113584 45340 224818 67512 -64923 -206513 85280 92639 357255 398532
11485 398532 511989 -180088 186650 6324 -85784 26452 171080 220096 -464986 168256
11474 94295 -382281 -238986 -26963 -153799 376268 1328 75032 -126269 82733 59553 -74654
11462 189959 258228 -62538 475770 221776 -34744 -38101 -235242 111982 -96375 183235 151823
11451 151823 140859 -9177 144632 137612 318979 424508 -183400 130462 240907 399653
11441 399653 -166803 -150043 4094 366925 74012 192479 84528 21420 240355 -181347 -298753
11430 -298753 -26945 -3340 -11054 49805 435273 -9444 -426096 365450 24366 -302762 81747
11418 38577 86369 -25241 268604 -4651 245072 225708 -4003 174461 160704 -44152 111543
11406 108514 -164037 173250 -14742 -54913 -170886 -1837 18682 -74720 77619 40575 -81829
11394 -68199 95563 226309 -332709 10307 42063 59583 399209 54548 213035 -69022 121855
11382 174847 4866 -121490 -1935 298026 34073 49179 -301028 -465564 -54307 106475 -144754
11370 -123304 -139084 140289 -62538 -74952 -326217 22277 288767 92999 -141539 -12247 44570
11358 61700 -103974 -175127 71852 -112102 296638 43761 190162 -395145 48641 -226157
11347 -180940 -58564 142766 197869 46843 -85822 127282 101373 -296774 -84236 139866 -169259
11335 -126970 -206492 -359281 -18959 74065 12650 -78149 -13992 -56478 -80143 158386 -143882
11323 -330187 270224 -310169 206075 -251363 115946 251380 -177106 79171 160486 -64013
11312 9554 372138 288622 -96220 123770 104155 -102482 -18316 -60821 257902 -110725 101890
11300 5823 -2545 258084 -287837 -345 205641 53765 -324758 -198043 -29411 242430 -45152
11288 -139873 35440 -231931 -16439 -181083 142505 70801 139307 -44978 -69766 54286 174857
11277 174857 -56729 48354 -182273 -45364 382689 -83262 106334 -42448 -248089 -69324 -43973
11266 -43973 -135814 -59079 -104116 -116583 21093 -318053 -135780 -445848 -329701 149 54596
11255 54596 -202244 -242951 -111210 375886 373576 -168222 -261640 -214441 47881 82669 -20057
11243 -155698 -221821 -10141 57973 175917 271343 67860 68269 8873 -344099 -342359 -719163 -137098
11230 32903 -88763 59563 -13918 -397785 -154184 -147661 174664 96212 20967 -3399 -231947
11219 -231947 -56375 72561 25181 -85809 -292729 223620 -191163 -227158 -269481 248198 -42444
11207 -135646 75677 147456 -262684 -275970 -120322 -243732 -46350 -175440 92398 -17113 -269790
11196 -269790 253775 -219890 3225 38455 189605 -123109 -105779 -7631 -301083 -404969 -193472
11184 291581 210968 -107566 105929 -74318 -134330 -30886 -322861 -296680 -61675 -154952 161718
11172 -167204 18488 305372 -111927 -196352 -11630 -16723 93963 -184172 -158164 5708 -280857
11160 -300791 106876 -4831 -212723 58010 234377 9852 109803 29197 174027 17480 103554
11149 103554 -163204 -150929 200786 94976 -71398 -116826 -89287 -116961 -148333 62931 -79048
11137 270696 45340 16062 -57783 205424 -9264 222919 -230848 57033 -175551 -42221 88795
11125 -81356 6532 -185596 -222028 422974 97186 6546 -224003 -85530 4003 -346448 -170969
11113 39396 55790 91935 26613 -105361 -98109 -22335 -44888 -75774 159452 263656 70577
11101 -48519 175603 -179616 -40358 214322 -101360 -381713 -201569 240381 152184 43044
11090 320832 137654 121529 137341 172436 210500 -219667 276178 -156415 174088 65813
11079 -201124 9206 66308 -120719 299135 -47569 -165667 569448 73675 309855 92184 130947
11068 130947 52695 237266 539144 123340 12685 287466 283708 64061 -155049 -34536 188159
11056 51706 253145 170094 -154752 -2833 244401 169371 -7480 215056 280124 -53402 193732
11044 614167 116525 269836 571671 296794 506197 679524 142655 513842 628364 535808
11034 535808 485911 608199 632260 619274 755181 348176 633286 591220 667233 598226 195698
11022 728595 663672 176589 696877 558185 706583 647126 501081 575962 460950 494937
11012 494937 602265 672149 374174 460557 373573 658808 387098 409146 497616 616384
11002 616384 434227 599242 557065 386473 362692 774757 558143 370781 718259 595985
10992 595985 624406 702814 516339 242567 697040 591300 437472 422692 540002 203241
10981 445226 520482 773320 533871 654720 684435 261821 471559 625033 584048 935266
10971 935266 357219 641418 884038 616044 744103 800089 534758 731005 965623 946659
10961 946659 855044 1359407 1192428 1667454 1804675 1884488 1423310 1916601 1775513 1878785
10951 1878785 1913429 1275025 1942124 1848276 1418307 1607862 1091825 1387852 1338374 1069016
10941 1069016 1312997 1401353 1442064 1579069 1095453 1167193 833829 780015 897322 728851
10931 728851 478224 230873 288908 564046 286575 78467 170875 80065 24788 314622
10921 314622 72713 294830 328489 142367 -78302 174678 251194 -48475 49932 -219461 217988
10909 -20828 -45467 38283 -18675 165172 -111550 263438 61574 -185389 199314 -284364
10898 275336 -239989 -7340 -6309 17234 -121810 395755 -108517 -70641 -139880 -73801 -2361
10886 -27137 54283 -99742 18785 56229 31410 -65965 -148905 146953 60396 -198444 210323
10874 105114 -349546 -143466 139222 82315 -20967 150925 -41831 -127957 222671 21076
10863 -52301 -157363 -130665 -157801 136090 219751 -183316 -84463 -129207 250676 80996 122255
10852 122255 -89624 -42000 286735 23567 -212967 134536 -74002 -29820 117854 171969 129753
10841 129753 -83227 -218300 -23705 -137399 -267320 -314961 61925 133389 217885 -80150 30376
10829 211444 41121 -104671 -92665 -16374 63601 356575 -77066 71026 7268 1548 -261983
10817 -113063 -84208 -90995 -466324 -327842 -34754 -138667 132672 -64572 -14015 -104742 207709
10805 -50720 -58460 -180340 11037 92934 -74136 106005 -33212 102723 -34935 -428258 -28025
10793 -25469 -73795 -24073 124808 -93448 55961 -2847 -281772 -275277 -18443 -120602 3551 -318509
10780 -6542 37020 -131220 -189520 -157226 126333 -42630 -69204 -65773 -181010 -261188 -20861
10768 201656 -118402 -293977 -156970 398424 -202072 -229468 -24587 -5133 -137301 -306231
10758 -306231 -52384 -537820 142337 30782 37042 -64347 -51027 220585 -76293 244583 -31997
10746 -347196 -153756 -32781 -110980 123634 62312 37903 -50162 -314470 -127784 179666
10735 75954 -306853 237805 -41997 -148360 -144269 347370 15007 19353 16004 -43840 -143476
10724 -143476 -26901 80755 -125131 176818 55804 3013 -119809 58152 143463 -315587 -64570
10712 56808 -139759 111938 93004 426425 237375 -266576 -326365 -222655 -182652 88431
10701 -64672 63895 -49325 27318 -204623 -9432 113902 147395 -135118 -52613 -48102 -14289
10689 -75506 70105 -138359 -116017 40465 -28588 160972 -424081 -124805 -40084 228935 -37317
10677 -191027 -71190 7494 62549 64580 201496 -101689 35572 -196101 -259862 444588 -100509
10665 154971 -111381 183737 -20485 43633 252286 -14524 -67506 -251233 -27963 177562
10654 -63217 -403280 -25829 59590 -109602 -83332 156587 -99090 205762 180239 -273880 -52593
10642 -630 -454194 -97092 -124159 -31810 -7167 -49223 263682 -153666 175341 143386 -78379
10630 -38086 48457 75206 23144 59995 -108345 -236134 -12232 -72636 -365224 -341536 -153049
10618 78231 466420 -8669 -13748 321200 16050 128028 -186510 -104677 28551 26321 97157
10607 97157 -160775 52628 -156995 -207658 -264964 -48903 117450 -83987 -177134 -104606 -59893
10596 -59893 -177185 -125725 -173306 75533 40356 -58412 -198823 -89279 -194574 23711 -353155
10584 -276958 -217287 119425 -148961 245034 356751 -140499 -4656 -273139 -361508 -194113
10574 -194113 218393 110110 -17219 -37732 -5923 127496 -245004 -35439 -83597 -36977 98496
10562 57717 192437 -1842 41964 -67433 44618 20657 -20156 25683 38002 44459 -188774 5751
10549 -159186 51532 -38954 -42369 -250895 25402 -316003 -111081 169953 203252 -321495 24279
10537 -124672 101285 89812 149074 -184653 117782 -254505 -207062 -287804 -47220 -345693
10527 -345693 -102356 -212854 9568 135567 -11352 -180342 -57724 39239 -237973 147049
10516 29531 -289913 6702 10099 -263543 -108637 56652 -268717 -67851 -66834 -127273 -491 117584
10503 -174392 -76980 -149587 257741 -131519 8987 -70661 184939 -7422 60239 -29795 232596
10491 -12927 -172526 -459278 163220 122292 -204705 186889 -71781 -317600 -246164 347742
10480 147929 -287933 173521 120952 -131815 -251990 -383883 -248957 186499 -37792 -159526
10470 -159526 52945 -149526 191660 -76061 265747 110978 237795 239176 130550 455898
10460 455898 331846 46754 -147307 164103 11736 16299 174746 80671 -206741 38159 253565
10449 253565 39730 93601 -313014 -180066 58146 -129003 -39169 -121569 -10652 110832 -197227
10437 -7437 52568 1584 -170363 242725 -87563 -113617 -20089 -52194 -243876 -45619 -129408
10426 -129408 -103774 -41975 -62331 -49340 44460 -237173 24990 -128867 -46979 -299987 -9529
10414 -219923 122673 -57520 -347797 -16134 -82609 26864 -401704 -142610 -76825 -162133 -204164
10403 -204164 -266023 -51947 225703 -123079 -420790 -114921 -201338 119279 -7239 -172387
10393 -172387 -129683 -388676 -274227 62295 79822 -145272 -121243 66171 155821 -5857 -228312
10382 -228312 -243771 101986 265034 -78370 -74534 85634 -256200 -19101 129954 -36163 25077
10370 -20775 214016 -59288 191351 -54847 82634 -155335 42547 29280 -56415 301875 -10049
10358 145980 -63321 -61007 -194818 292488 141018 52628 217115 93415 30963 280249 450197
10347 450197 4550 480233 31980 93946 336830 73687 121003 -29012 272815 301168 220126
10336 220126 197162 120733 333442 164214 186271 268290 -4032 216968 181384 445196 304311
10325 304311 278896 414449 270266 147910 372286 256203 30057 326358 89408 -135303
10314 -310422 239295 71592 65326 -172956 -158199 102582 38740 423541 27828 77027 14307
10302 175761 -204584 349433 -121859 326521 53323 33105 16666 275017 -282206 -58607
10291 81125 -43741 85816 279499 1718 146014 -9194 109296 -137205 -192773 -291487 191515
10279 155757 191304 -240245 235991 -121997 -246304 273191 67215 -60244 -47002 -60167
10269 -60167 16138 356854 158521 -387597 -74448 119332 -486695 -327704 117119 229886
10259 229886 318942 -16587 96062 65027 304820 -195328 -2870 148593 -1198 220095 90281
10247 138342 -156311 -42798 26560 -6688 68886 31287 203624 -120415 77451 -5579 95788
10235 105631 21679 -64152 72507 218831 118233 -181543 -364173 26032 -109665 -90976
10225 -90976 -365253 70168 -135227 -52224 -209000 -70683 139236 -15752 239812 -121566
10214 -88340 -87255 -33136 45762 9722 104596 -167481 122678 61979 -37034 284745 -11368
10202 -170409 -9026 -162331 138321 34917 -226212 180521 -18632 -40935 -261883 -309758 190773
10190 110591 -170689 -277560 67576 101868 -95799 -79376 -114144 -90072 -49263 -263513 -53727
10178 63519 -50868 -17282 279683 -20467 63221 -30289 -10713 -133782 -319198 -51996 -29786
10167 -29786 103050 -42841 300776 -23217 119375 -112426 -122581 -38343 356776 -264805
10156 -139528 189197 -201933 336389 -33208 -125288 -424486 -106517 -66731 -394590 -76353
10145 -34843 -351989 -107913 -95016 -125639 -4808 -52868 -11249 194590 -102863 -161513 -128927
10134 -128927 -80396 -217699 -184392 -218035 -202418 -204915 -91273 -472734 19909 -129576 -134946
10123 -134946 -151005 57186 -97885 119795 -186101 -197826 -106564 130271 -229401 112496
10112 -36367 101382 237990 -181772 36255 265040 -9502 -190169 -196765 -53553 242042 188863
10101 188863 100352 39670 594 -86042 -12172 151193 323639 79415 237334 -54179 -203788
10090 -203788 69062 -54413 -413180 26298 -343573 86534 -383396 -25390 -40035 27243 57996
10079 57996 -41186 -163897 66364 102239 44737 -164166 31470 4602 -202985 -42629 120094
10067 -15799 -383373 -141089 98671 -46984 -155960 5610 3356 -357808 168264 252330 -317858
10055 29891 -54816 -421598 -456907 -140346 -93347 154713 -233566 338809 -120659 -80925
10045 -80925 -33326 -11761 -142339 -278956 -6741 -13080 116363 162439 78048 -30864 268416
10033 -103134 -237722 -143881 -546089 15119 157797 105472 262572 -415555 28108 60830
10023 60830 -230943 -110644 -9960 -64794 216182 4893 -65832 -134026 -129377 -220099 -195726 144365
10010 90506 179696 -31956 -135042 -56664 -21955 -242358 65457 -29637 -51313 -4148 205631
9998 61831 -6917 91009 -156232 7193 215708 86779 -131854 196510 205584 -240838 -14343
9986 -147413 72675 -322621 -54389 -284196 -288713 -545121 255038 31122 106907 116538 141517
9975 141517 -14198 -319777 104693 -106764 137531 -241219 -182781 -209157 -144145 -157380 -87320
9964 -87320 -208631 -220317 -306533 -307185 -115602 -110460 -191087 -93111 -104796 -129035 -158295 -60248
9951 139784 -171734 -219016 78944 88629 -239981 51713 11042 79886 -130476 -23815 -32278
9940 -32278 9470 -66960 -393278 -193085 -145088 -521634 201177 -12320 -52810 5807 -5857 -183761
9928 -183761 49600 -551531 -99283 -161600 -127571 88178 -40545 -73021 39420 -116711 -249002
9917 -249002 -98174 -24748 164137 -4491 -168357 104835 21291 -39270 43191 38870 -51600
9905 -6562 302946 -121671 -588551 79423 -50194 -177985 -237505 -195397 48524 -150771 -152527
9894 -152527 197360 -136905 158208 -36657 -53133 109228 -123916 -48004 -2793 -3595 -96709
9883 -96709 99425 -10525 -68312 228753 -103572 -116556 -84251 -14149 -396655 -273628 -210594
9872 -210594 -236888 -383094 33634 467498 113828 -32171 45730 -21904 -91995 -331489 53419
9860 -8185 -161102 69371 -197593 -153360 -421150 72241 57606 -118247 -86718 -201760 145844
9848 255657 -268915 -106064 -336926 -13642 22857 -358812 -80503 -137326 -121954 -2403 -97387
9837 -97387 -649815 15923 -12472 -250059 33660 -28436 -75730 112110 57315 75081 -313528
9825 -136494 -390025 78108 34843 -84907 -108934 234518 -24287 29689 222981 -177421 -189965
9814 -189965 273905 -424025 10487 -317839 -125983 186488 -420602 -39683 -60460 -182898
9804 -182898 111138 -106601 57248 -134507 -185407 -110046 -191841 11898 -393734 5386 -312630
9792 59140 -217510 -42767 76303 50170 -79229 -26541 -159495 156678 -127374 -170929 -350988
9781 -350988 -379408 -95070 148248 -1054 74180 115312 148418 -109887 -274957 277663 -263550
9769 -264169 21700 -36844 -93582 -98304 245902 -164755 -172636 164189 -138657 -347245 -174218
9758 -174218 -315925 92932 -76840 -94774 125325 -125713 178240 -178487 -32822 237771
9747 167419 240788 -258177 -73285 64751 -121689 -41795 -217036 102915 -234071 265757
9736 63248 -158563 -30809 37765 65769 35482 11661 134653 -265993 -160118 45578 -18615
9724 349122 -194675 -116299 -45177 -218087 -171650 43104 -188337 -219233 -123976 56913 93964
9713 93964 -76640 182330 -233769 -74575 -50085 -152360 -80001 195195 -102464 -231383 -128063
9702 -128063 -363714 84359 83253 -434009 -123218 17054 80556 15758 -226598 -84434 -100626
9691 -100626 51704 -16051 102916 -132448 -44673 5672 36634 -5173 14162 -5244 27770 -174630
9678 -377758 -138235 -39099 -227861 142198 127309 -167871 89523 41191 178142 -196442
9667 -135803 258167 -164457 -108891 -14689 -317259 61390 -121767 67289 62463 84235 162254
9656 162254 -74270 -128697 -348198 192949 -237839 -231864 -209778 180776 -352673 147759 -16098
9644 -382040 -270215 28818 -218573 -88033 132511 16911 -294443 142304 -203812 18812
9633 127079 82403 -50125 -131477 42215 -35657 -211954 -96727 -440632 17958 -2051 -144722
9622 -144722 -172303 122952 -55059 -113660 -222336 47718 -116607 -309321 33191 -178633 -44711
9610 10877 -157658 151095 -15125 2486 -178207 -123319 158889 -85879 111198 -350858 38999
9598 10896 -138220 -43205 -94682 -78699 -248131 -254150 -388713 -135895 -263249 108510 109039
9587 109039 -17817 -55887 65994 -174021 -73182 -164906 132551 -53994 -100154 -69582 69339
9575 -100705 -361715 -61596 40268 50840 237698 -206711 53188 -266910 -35709 -142390 68670
9563 -254139 -12210 144326 -87849 -32599 -116551 44935 -148241 -278357 -108969 -154011 10553
9551 -157075 -130764 -156835 -206907 -95118 -365178 133999 -175321 15045 -112042 26076 -272592
9539 117577 -236805 -118422 185506 -161885 -21104 -173751 -264592 120315 18055 -195049
9528 -217121 -141312 51906 -18244 156970 -169486 -32209 64023 -138401 -101205 64826 -282355
9516 -160851 -136065 -121366 -391823 9845 150221 -189579 39718 -178717 -167002 56807 -54740
9504 -317692 -459348 -163025 -25200 -80355 89500 349082 -41366 -68665 104353 -155039 -131261
9493 -131261 -93752 -278699 -1592 -208092 -199477 -206196 -230479 -26738 -51301 30394 -17219 32211
9480 255231 181387 -314856 -121656 60241 -250143 -60798 119749 166249 140990 4343 -88230
9468 -251750 94579 -101102 -84680 84888 116140 252957 296237 216148 123445 69012 64024
9457 64024 357630 -93023 -301676 -308472 22238 -136512 -24720 67632 41932 -154985 203762
9445 31981 -231523 -127933 -352700 135067 -108411 -284305 -205467 -202138 -228384 -77356 41402
9433 375 -43082 -39748 -34262 -95111 -145386 39768 17345 175971 -114693 4402 49029 -472187
9420 -185101 163748 -91898 -60709 8715 -64994 65707 -180161 -265549 -38655 -101871 257057
9408 224889 144328 -113732 -87520 7814 -251746 -93048 -49943 80959 11504 -173353 13676
9396 -290328 -43959 189075 -275173 67714 82031 -207507 17021 -104828 -83810 22810 -349061
9384 -240064 17513 -168714 -427931 -88882 64231 -25053 73636 -191419 -124473 -29892 -167012
9373 -167012 10382 39576 -11392 34586 -87407 61465 247959 -39339 -411864 -29594 15413
9361 91277 57724 -43344 -199472 348013 -25407 97067 25045 -230064 483315 -109271 102947
9349 -67203 -286873 -165075 20869 -86810 -58933 8631 146968 -93263 5882 112490 -220579
9337 73700 -88686 467853 -325145 -155527 -22484 -34399 31121 40227 -454131 -214306 -21284
9325 -24490 -6577 -147345 -128735 -298139 135242 -38011 -35290 131814 -34263 211978 -108402
9313 9864 281918 -169650 -39985 20306 -66829 96722 12358 50926 -379963 -362767 44769
9301 -114692 92824 19639 -262333 130206 -108184 -137342 95718 -332614 -187372 98393 -215249
9289 113198 -25117 -251030 127094 -322295 -141000 -160544 29538 -29081 -117566 -143934 99237
9277 85194 85795 134849 -209122 -257263 406719 -493414 30074 46793 -41530 80468 -213015
9265 -38094 -20013 -51779 -19698 -327817 -129653 -226289 -42278 130434 10940 -63460 166497
9253 -171458 -151642 52129 -213104 -26796 -97333 -279284 8383 128085 -291851 168528 -78056
9241 34182 -164841 -185455 -18195 70139 65892 247910 148679 249398 -231887 -42544 -224193
9230 -224193 -185219 -89094 -46135 -347935 152095 -337925 216478 -90719 -65375 -254556 118452
9218 223334 -157379 124463 -317429 -8426 -113495 -82000 86570 -13040 -53981 -282916 -158025
9207 -158025 -53200 145730 -55867 59864 -291410 -136987 -358391 5035 35450 -114276 -41027
9195 188757 112835 63506 -132611 149271 -332437 26904 18014 50819 -47150 -112207 -63691
9184 -63691 -284142 -190769 188564 -94658 -124918 30616 -118557 -558697 62370 -339721 -166258
9172 25652 -71914 -22123 28271 -32821 -215048 -32694 -297794 245347 40452 40884 -135815
9160 115387 52330 -305144 -82649 -75354 -129101 -307175 -139785 290802 -126388 -51622 -176157
9149 -176157 69568 -125074 -37441 -184313 -242068 114477 -679 -83316 88103 -26279 -34492 -142058
9137 -142058 -66046 76259 -207017 193221 -108041 -357766 -112803 291127 -133949 -220199
9127 -220199 -182983 -273475 76473 111503 -60077 59400 -236557 -306112 140930 146458 177959
9116 177959 -153276 -56996 -118240 83599 146351 -344011 -96724 -224502 -66513 179995 -85474
9104 -211352 -180014 20340 -255918 -173047 139319 120554 196949 -619131 -160905 -1081 95447
9092 34239 -199009 52654 208403 -252162 37043 -12953 103906 35599 -48562 -229299 -45197
9080 182725 63084 -35890 24546 -11733 -7706 -44786 -128513 -25055 162044 -179780 8304 -141314
9067 -108453 46226 22085 91332 12157 67318 36548 -224495 -222654 -5807 50867 -470030 53339
9054 -274026 -177037 -102060 -275990 51425 266003 -166420 160012 -13234 105636 -172481
9043 -275546 244784 89082 198224 -3620 -65026 -122843 -171282 -334316 -141784 144376 -279287
9031 -467398 -124360 122359 -48449 -136631 20308 -163980 -186719 -52075 -89780 -390865 54021
9019 -290612 245022 2341 -174345 114941 -413987 140150 125542 -86138 117599 -205627
9008 -204452 -434087 -3429 -70363 -292592 182525 -124584 -176204 -64233 -322900 -180445 408893
8996 13052 -146168 -61499 114318 215999 -21948 -114559 38638 91297 -103666 15071 156691
8985 156691 -272422 -70721 145325 -17675 -240454 10309 -45328 -23879 -263448 433220 -468305
8973 -68705 10387 -85253 46785 160417 101341 148367 -158833 31560 18353 -53451 126050
8961 42315 -67078 -71539 -172332 -229212 -242405 -125466 7055 160835 67678 5004 -79399 25209
8948 -179173 208027 -78844 -30016 89218 -105420 184722 -71806 -219439 -47457 -495380 -90998
8936 -312593 -372317 -7594 66064 139778 235980 4431 42139 -14408 -27457 -94682 -5571 106859
8923 388035 -301376 -514189 13448 -190154 -25463 -372987 264451 206002 126475 363831
8913 363831 16377 10874 111652 208754 740026 851043 1087586 1730628 3653643 6928444
8903 6928444 5195702 2703367 1377454 1024849 353335 605581 475205 209277 578626
8894 578626 143679 61370 428627 491955 257644 -64709 18908 -247550 75374 167710 218237
8883 218237 -49257 -362136 163311 197269 -212693 -247822 -38799 -266999 -265055 190061 25413
8871 -209373 -11450 51102 -209514 -99424 -196652 107407 -238996 -107145 148458 -120375
8860 414735 87969 -143306 236486 82041 -220859 -3073 307711 -101322 9744 -120005 15928
8848 -282823 -55716 84335 26768 -290493 380475 -445494 -147336 -61357 35168 9768 -112041
8836 -172555 -341044 -271047 -244253 -103886 -7825 -434808 158957 -103306 -122988 237566 -126221
8824 -236159 -108061 -229495 19939 -117822 103293 -246436 111273 137097 8529 -348583
8813 -9897 -320942 -269589 91007 -203470 67562 -309590 -287626 85132 -3334 141745 -224677
8801 -104674 245982 -99762 19502 135537 -292969 -349456 71389 -122057 -246532 -307275 -139866
8789 285442 -49942 -34604 -203521 5306 183343 -44368 181619 -26356 5346 57574 141829
8778 141829 -11952 62856 -297868 305838 94411 -143945 146132 45022 -47307 -146196 -174803
8767 -174803 77933 -25227 -161546 20661 -193659 90563 12728 152516 -368520 -284796 -514374
8756 -514374 -144745 225486 -30418 43172 -111893 77075 -483081 101864 244042 -364300
8745 -209441 -223769 -43655 165150 -28027 -179956 -141550 150366 255753 99753 11899 -9079
8733 49784 42387 -215670 -55829 -134824 22907 -32878 4390 111230 107406 -36774 105768 -65662
8720 170429 -71843 -96987 185404 -149161 184447 39291 -200860 -217913 -75358 130226 213814
8709 213814 180185 -58474 108170 116065 96485 87800 -41709 -225024 -248251 -3501 -60958 146696
8696 -392473 -200967 -71482 264564 -155359 -152007 -89653 -63268 -230037 153429 -264108 165794
8684 177361 -347947 26367 62548 -338095 -208005 -98621 -21932 220607 -48921 -51257 -191816
8673 -191816 -160363 -13251 -118007 -345645 123483 -158919 95556 -66851 32270 -202899 -58633
8661 -224408 -173183 371302 -109355 -314632 58532 -9780 -70904 23588 129475 -119024 267666
8649 -131626 134909 -141905 142112 67704 -34157 -290796 289853 179975 -235030 -74476
8638 -98931 93703 -385419 -299693 16139 114913 -162808 -109141 -209856 -196597 -134690 -82938
8627 -82938 214465 -23055 -856 57344 -124273 -186907 -29550 354477 24764 -71252 14909 -286133
8614 296327 -172953 84472 101236 -142282 -135300 -163860 -218310 -286618 -314697 -41029 -145350
8603 -145350 -646058 -146908 9425 -80837 -179957 -163599 -117085 222097 -259830 254689 -197404
8591 -18645 -230959 -182267 83079 -177204 -134796 -143896 148767 -19072 145955 -6653 22227
8579 -181426 38439 -284786 -303675 -126208 -190238 63153 -415692 -375637 -286079 -60800 -10450
8567 226978 -44152 230008 13865 -98248 79896 -220293 -72053 273268 168853 -183763 -246959
8556 -246959 -95181 -293382 128656 273731 33691 -79744 126651 -236836 -64006 -209607
8546 -209607 67653 82731 28233 128040 357125 -287590 22980 210502 87967 -134810 -11759
8534 178 116006 -93193 -4883 -198408 96288 -287386 85397 3722 -186681 -175121 -136092 202124
8521 54580 74196 -243832 -139013 59059 -90869 -17774 96775 99242 154995 -90780 -289474
8510 -289474 -8212 267552 -118094 242228 -38220 -91134 -287841 -141935 61806 -26125 -27710
8499 -27710 261165 167020 -188617 162199 -264653 136462 -143378 -91969 -115874 -199322 20132
8487 -7461 101831 113515 -98052 -97389 -166181 259657 -330900 -103473 16182 -4771 -13 85851
8474 -148091 -76255 150701 -74974 -307232 -59609 114300 74371 27703 -73717 -77335 -22725
8462 -277152 11854 214612 -385498 29566 -84634 -462061 -154277 143591 35429 -271653
8451 117905 36926 150938 112725 -104163 -144919 -144170 181973 -283909 -442358 -108790 119904
8439 -154332 -73678 76676 -103193 -347722 138166 59819 65720 -59043 -443919 41578 122686
8428 122686 -133361 -84079 -86460 131680 82506 -145098 -94198 -77165 218605 -432535 -43879
8416 111682 -139967 48306 281704 -94037 -55233 -87083 -26201 140587 -3337 -61266 -108639
8405 -108639 -310666 88537 -53774 -36606 -67485 49439 -201254 147012 78236 3657 -235193
8393 -269879 19829 -81602 -10608 -188572 -295072 -190506 43059 -223747 179935 -208172
8382 -59264 -334841 47493 -143150 -107106 33875 110559 91216 76810 -14873 -132108 -59177
8370 81190 158931 -146533 -244972 -77996 80966 -437170 -20349 -94179 5006 -106573 -140815
8359 -140815 73226 -16735 -199075 49306 28428 -144919 19 -29965 -51889 -827 -123678 -32688
8346 -174314 66890 -139399 -146919 90977 -226784 77902 -160756 -90054 74844 -239173 90285
8334 -72507 -239942 -277327 152122 -145541 78872 275539 -310068 -27192 167799 -199517
8323 -78530 40835 -288315 11127 117516 -345489 87310 89662 135093 -30642 -42297 -266903
8312 -266903 -27614 -205871 -93241 -200581 -72065 -261719 -265621 31052 -169268 -51461 -1100
8300 5045 -128157 16967 50540 208701 10644 72519 57943 52162 172989 87208 -103595
8288 76487 221092 20428 -13738 -74936 -205734 -8077 -120127 228678 -193400 49872 -127812
8276 -144538 122202 -62457 97672 194945 -111230 -118990 -73314 -78724 -185162 367271 -97096
8264 -102158 -219061 938 149817 -60979 -557494 -12032 78556 110880 74056 64527 -68643 97683
8251 -235083 21705 -233159 -284143 149706 -180379 -36093 -180944 43586 -310303 69872 -117024
8239 -431842 -149641 -46458 154263 98704 81483 -243372 -46634 -220477 -46699 -35054 176585
8227 -267378 82952 -206923 -234435 -251974 177310 61584 114702 83241 43336 -72034 -92228
8216 -92228 -279436 -98222 96768 -113833 -55496 89699 69786 41914 -33977 -196971 120342
8204 -227163 107265 -1604 -86062 -92028 109671 69108 139937 -109952 -235338 -48282 -30353
8193 -30353 -150538 -197651 74339 -153154 -247013 -23960 -345314 -68214 -303672 -370088 -58418
8181 69560 -70956 -138622 31080 21396 -131534 105563 -76155 -84918 -12356 190298 -214515
8169 5595 223424 -45696 132548 -202847 -13347 136928 205532 -108942 -115508 165170 139739
8158 139739 -125605 36424 -131697 -35142 -74741 553678 -172343 -108864 132889 182974 -151634
8146 -222977 56186 -207718 -29703 28603 -37608 -160312 153609 10261 -265332 -536695 62804
8134 80041 -104255 -257121 -221376 79176 -97473 366335 -274178 -24671 -234673 207411 22073
8122 -28917 20088 186288 -122102 -116070 -345662 -22150 -104703 17279 -233591 -138148 -211115
8111 -211115 -433465 146395 -6454 -100407 264663 33266 -101268 119831 73561 -403516 -399222
8100 -399222 82530 -108365 -67119 93267 -211610 -212032 -80370 -357956 62803 -20958 -13138 127895
8087 273985 -4253 15523 375570 -236444 3610 48521 -50186 -106164 123236 -28262 -100808
8076 -100808 -329020 -135424 453782 -371846 48610 -201667 9276 -151870 73392 317028
8066 317028 109817 -34195 77671 193024 -303970 -15716 84260 -121754 83520 -514234 -256018
8054 -434519 58133 110879 -375566 65940 -54790 54280 131764 -148522 -45985 -14523 145529
8042 145946 18380 -332975 215284 -77725 -224676 -42509 182521 -202388 4749 -27727 68051
8030 191926 -58612 -2872 -62398 285976 -12335 217705 -113330 -333339 -301606 -413149 -34682
8018 121073 85238 90187 -195100 31315 -234782 -201840 -61481 34939 32209 40450 -312024 -173960
8006 -173960 59667 98716 -44994 278441 -80187 26703 -94857 51865 -67580 -185245 -343503
7995 -343503 414868 -58430 26767 -3837 15285 -40900 154590 27576 -289614 -271085 -320804
7984 -320804 9226 -20580 -97784 29684 -227903 -107594 125979 239517 -104080 -115816 -385431
7973 -385431 -296870 -239381 -118782 -159677 29686 88558 18554 179348 -217841 -157248 7404
7961 -83383 -136155 -7423 -156496 -26550 308470 -57879 -203548 -132382 159630 -69119 -96508
7950 -96508 164888 4439 15797 -63866 -359752 -101330 -87083 169783 -279749 -347478 59027
7938 -104149 32255 -75727 -225235 -355242 128712 -387469 -25936 -77743 -111532 270919 -17552
7926 -47081 112236 -9746 -144210 -6383 167536 -34013 -272178 80959 -116627 34392 -65434
7914 84877 82817 195757 62870 -79183 -162279 -480788 54473 -22328 141531 -207627 -23565
7902 118580 450942 61295 343138 -88016 -235727 -11786 -90296 174162 124711 -263882 -108121
7890 58555 -454218 4133 -87346 321751 135542 52930 121535 -239178 129141 212334 292334
7879 292334 -12137 28772 -23744 -276409 20052 -95146 -45938 162800 -51613 142146 92255
7868 92255 191487 -52637 21616 99022 -229903 14882 -174428 -318812 78245 263447 -67565
7856 -37320 123834 -3806 77567 -120148 -128655 -95030 -108958 23217 27385 -394364 -1698 173967
7843 175489 -154143 358466 131968 139528 85284 46080 -186768 -66618 -91664 -114680 -235437
7832 -235437 14735 -142585 89729 -193801 -68361 29118 -55765 147015 -171217 294305 -29685
7820 51995 105157 235138 -308175 240242 1915 -2252 169201 -166782 -31847 197136 -594136
7808 36886 -52155 -173828 64919 -144934 -437216 -73423 -181585 102436 126107 -238584 57444
7796 -157541 -156099 -28924 80312 -82177 -343035 -116849 -215948 -41266 -166914 -10540 -195409
7785 -195409 -135321 -44832 -257542 -36814 121074 -89997 -370077 159211 350983 -144833
7774 185966 20500 -239864 -14723 -124180 -175698 -66868 30480 31331 -488445 -99385 178552
7762 -126910 -253192 95572 -82749 -223937 133585 5789 163571 -36905 -237615 80103 -181575
7750 -212612 191785 76020 30739 -103960 -272369 -348088 -520 -108793 -107881 -46357 -327504
7739 -327504 16135 330772 -11389 -206164 169184 -52281 22815 -136783 104526 -183672
7728 -128280 -9780 62726 -75377 -64996 -67009 -209797 157884 -204144 -94450 33055 202310
7717 202310 -216561 70911 -248887 249779 -74965 22714 -9092 5586 -321226 -240295 -221827
7706 -221827 -182522 -195721 -49881 -183047 -91387 -54089 236263 -76478 9572 -46629 201868
7694 -399297 54398 -392109 -45961 -262442 -95096 257514 -175127 19960 -100928 67185 -233161
7682 -131253 136376 10123 -28102 71801 45059 -103329 -195734 -38946 67923 3291 30936
7671 30936 -94779 -90084 -136968 -149395 -51194 97033 -112288 49632 116588 169817 160251 145934
7659 145934 14459 29933 265932 -291910 40071 -171553 -167701 232741 334707 -86841 -251318
7648 -251318 117048 -254395 -255023 -66650 -42850 -13291 277054 190094 -240771 -157130 -57629
7636 -137290 -90091 109529 -40534 167739 97147 263472 -201585 218153 26517 -149581
7625 -351869 122522 -3541 43017 -322072 -95472 447310 -195169 70499 187835 -269572 41146
7613 -61226 -7123 -231914 42187 -4350 31540 96685 74893 514 -228460 59193 -454246 -191301
7600 -325767 -223376 -165926 -202093 -348490 -113896 -113574 -85296 -146146 -356940 15170 -326662
7588 -118719 75808 1660 103816 -132740 111098 -148711 -362150 -225005 131706 3224 151692
7577 151692 218060 45921 -662283 135109 32661 176547 -84045 95242 213381 -101954 21821
7565 -228094 97109 10529 -209816 178782 -10060 302169 157607 86038 211657 193064 -147457
7553 -82784 240547 -84373 -184396 40636 -134922 147076 222582 -302528 -25105 24276 268696
7542 268696 -26065 105959 156354 -93611 458625 120055 -222395 401033 18517 -151187
7531 255542 124508 -167960 17501 -223892 -361029 -74114 -82697 -213449 -1301 198936 -93936
7519 20432 -202089 -61831 -80750 -190888 -234330 64348 45530 -140696 59679 -64527 22713
7507 -202660 241045 -17612 215901 -61307 26402 246982 -378421 -185534 31095 -248612
7496 177910 -221760 118547 245352 112332 84913 136376 -164818 -75160 146481 182492
7486 182492 -49003 -117633 389361 -199510 173201 -31063 -24752 -138070 252046 -13666 -412626
7475 -412626 -206465 33148 -128694 -112891 -55018 45186 68901 -243036 -90951 -52846 2743
7463 -130007 254004 -155881 -66830 -140191 -351679 -96207 111573 -80102 -68328 -27540 136180
7451 -213667 -173400 -50485 -170389 164005 -154954 -579063 20765 -32507 148576 -14338 -222857
7440 -222857 215666 -89673 136785 80191 244686 -42592 -162456 72726 -199117 -176955 -326516
7429 -326516 -206140 -123552 -175258 -323324 -186883 339263 -76390 153928 -232626 198718
7418 160359 -165985 128520 117422 -18943 179817 320219 88713 150809 -201515 -105050 44419
7406 -190039 33245 380811 -248463 99252 -179117 19097 8599 163354 358002 -267315 -215881
7395 -215881 180273 -377949 -260017 -209369 122524 242314 -142211 -282095 -179000 -34184
7384 13620 417708 5764 -279128 -151322 -315442 -58583 -127165 -16189 71946 -382245 -274158
7373 -274158 -33182 14642 -209819 -204476 -142606 -80298 -148300 191257 -114306 -222561 292420
7361 -50225 -121338 60577 224804 -62996 -201857 -132344 42925 15854 18169 -106740 214178
7349 -189 -63204 207911 92419 75963 -58865 -367900 -145615 -44836 -125391 -471277 -19732
7337 -303581 -99972 72035 124192 285705 315212 -92135 -238796 8422 106783 -145166 -114074
7326 -114074 70207 245094 178828 118027 153836 -202482 262754 -192809 -234244 331582 -343386
7314 292798 88286 2531 48023 30975 -182251 -4948 256147 14911 343994 -36280 -92922
7303 -92922 -117566 155794 -6717 236794 -330443 30131 122119 -144272 -89669 113279 189349
7292 189349 147740 1692 -37914 -167333 -42829 59865 -214686 83663 208537 134570 18767
7280 128052 33964 -110193 288284 -42662 -80406 170606 -132145 170706 77556 -410560
7269 34442 97671 -156188 42854 145538 -87701 88947 -89716 -123436 76959 247425 129866
7258 129866 104776 -218872 186606 101088 86569 171967 37226 430998 7572 -312838 -117045
7246 -362626 -11309 -96957 31553 -39164 143125 -53631 12535 -97722 2689 188949 -10188
7234 -37591 -308030 -21303 32355 223680 -173885 -157837 -197838 57211 -100075 63176 -123041
7222 -7589 -133980 -101196 -383686 -146451 -176308 -61596 55855 86798 104257 -384157 -432468
7211 -432468 228752 -195479 42125 -110839 -103795 -285612 126039 -120156 -69413 -53891 -278358
7200 -278358 232484 -211773 30793 181807 -147027 130618 85398 -12751 -38304 -27777 -115595
7189 -115595 1002 245430 189375 -89353 -88678 117365 -46296 -315435 190615 -144394 -24262
7177 -58293 85147 131518 -151323 39959 -56759 -40993 96407 240877 -455197 191207 -17109
7165 -281321 -104426 347526 6521 -167902 165087 -175464 -113930 -146039 19923 244244 -378604
7153 290996 169523 -79000 -71997 -29485 -92736 151218 64123 346042 74912 91139 -288573
7141 -92350 -149644 -155574 365095 26065 316744 149245 -92255 44494 -152709 71500 -120298
7129 62459 -91282 -24690 71731 -123106 260495 155403 -178478 -348513 152408 -152193
7118 -34535 85822 136994 9678 128945 -249979 -213440 11082 433406 47383 25695 -419936
7106 -414786 -176600 -193601 -130708 -71792 -61333 37393 -84656 169202 -127267 174183 -60296
7094 212809 -168090 375667 155964 149223 -89079 -67481 -94333 105385 131755 -109523 152039
7082 20383 105192 -17017 136053 -81846 232801 -73543 -113292 -169787 -324626 12836 -211228
7070 -143360 -107990 164499 -277521 -236381 200896 -129665 -91601 -149529 -42440 -14769 127062
7058 -367033 -171359 -30828 -28285 324194 -116619 -186757 5747 307651 -181016 206945 3475
7046 -162276 46219 228266 76812 73763 -230587 -30425 -367400 -30601 -12854 -27786 105834
7034 -234711 -9025 -317673 38252 -30424 29968 -48781 -229324 -57772 -54101 5202 35132 -107379
7021 -22685 -212982 -186837 -69557 429242 445186 -118199 200356 -130547 -203082 198738 74044
7009 -51003 332353 -235566 -85262 217042 -68539 910 227000 49726 -192421 -157838 -337633
6998 -337633 -32567 -77101 226629 -47676 153241 -133522 -298759 222353 -98940 -43167 -178329
6987 -178329 -26357 -133827 -123730 161685 132906 -124028 176714 -269967 58939 273542
6977 273542 90697 76682 292218 -104401 -188004 5612 -200877 -296928 34717 -142637 -182821
6966 -182821 -222114 -281898 -252042 -115544 265375 30281 61577 116590 -240738 411255 130210
6954 154853 51532 48093 -159899 101803 180570 67492 71927 -107616 -94800 30315 -117963
6942 121203 -41018 228713 304665 67086 17381 66911 211623 14521 67083 230931 15719
6930 -41322 7411 -158747 -107967 -111811 -104474 169322 -66488 -136158 40399 -174047 3955 91222
6918 91222 221337 206586 -295122 3926 -113919 64485 64485 256379 142889 -256859 31976 -196657
6905 -244768 -180970 -371014 -84476 85519 -188464 -94639 -43110 -248834 19502 -228719 237892
6893 20924 -215877 110604 184792 -46637 -117327 -127026 -162886 30859 227170 140715 -259895
6881 74916 -15471 52091 163376 -506692 -56911 -174656 173125 -181231 -351380 -417337 105590
6869 21372 246435 -216266 -98266 154456 189826 -431106 -78493 157357 -96578 91020 -74536
6857 24321 -36804 23959 27676 -22465 -7821 75435 -170932 -117879 132259 180716 -8525 -95895
6845 -95895 -31676 144983 -261427 106740 -171780 115029 16952 1478 206236 -227435 -11596
6833 154969 -31395 -37426 33316 -140346 101383 -163053 124141 177245 93250 -123577 124178
6821 -405706 -46362 -88693 -155982 96206 122114 51665 -79063 44681 260025 56371 214021
6810 214021 89667 20703 122536 -98450 -41887 -96673 -178252 231549 80280 -90966 2024
6798 -12548 -194724 -77418 88216 68041 -420813 -222372 83794 -66971 -64614 165075 -158774
6786 -603329 143374 268563 -85475 -30856 -393335 119309 -8593 31575 306493 -90787 124420
6774 233772 -144029 165647 -124099 -52897 85804 -9072 287451 -202472 -179468 -22652 -244558
6763 -244558 204357 126669 18015 -231058 -293384 115568 -246295 -33226 -101932 30195 -66523
6751 -22201 -304230 -78799 -57174 24821 209825 -167553 -85632 234333 139807 282790 31104
6739 -53807 -381829 -57436 -102484 -46883 -20326 -168127 136909 -268065 -158392 1146 136133
6728 136133 -103892 -179455 -306288 -91457 -41257 -135283 -134427 -107278 -42068 68220 38905 136449
6716 136449 43960 -246882 181290 89383 189128 -237620 78170 -345914 290867 -167505
6705 -117068 195470 -68347 60436 -502120 38356 69576 -144623 -18053 -86606 198662 -249961
6693 -173753 71885 109320 86265 -146208 -81703 17234 136293 -114021 -95376 35457 203320
6682 203320 -105130 83944 -193275 -100279 62451 104860 -302109 9799 44829 -188977 -238078
6671 -238078 -35143 -40524 427110 -217221 -4513 201504 223992 -333105 137138 -307052 -122193
6659 -76405 272702 160491 45200 67096 -15638 66271 159215 -11978 76890 65897 -143657
6647 172829 -126912 -287606 110331 99328 -126497 79085 -262547 15177 -195396 -435104
6637 -435104 194148 16800 -42417 85398 -275958 -52754 106790 58597 219393 -108181 64048
6625 -107829 -56541 -81575 -97557 -23744 -178297 264955 -26249 301726 -68525 195187 184237
6614 184237 20931 -101035 -121559 -26681 -68522 80974 41196 301975 -279859 -54918 116422
6602 374935 90736 -334571 -3967 60987 -92993 55305 -701 72595 -74765 26986 -143263 286253
6589 -268872 22274 259375 65941 -337324 -20077 -158537 -28383 350887 318398 41903 -333256
6577 -59901 84984 -123991 -93130 188825 -221017 -79023 84361 -162881 17178 -286405 101039
6565 -4112 14815 -240212 -257584 -106818 -17281 177838 22858 204851 -213119 89826 -256069
6553 313125 -58199 -128873 59902 -144123 -187866 -129278 275762 81234 108960 -230571 154784
6541 -187994 -91170 707 21731 -22286 140127 121132 80177 -484159 43512 -163551 -121735
6530 -121735 33954 -209520 -155177 23664 141019 152545 -133068 -70059 -191143 60719 -29549
6518 326994 307372 -303506 29487 90872 -196598 204507 -226014 -99996 221911 128971 125794
6507 125794 291622 -10189 359967 -5865 32147 19387 -118993 136111 -162568 -15106 -159908
6496 -159908 -60910 26271 -118289 -61185 -328200 129244 -121583 247108 -48407 -112737 -252933
6485 -252933 290141 -36309 213413 -87881 89351 -191830 51789 -30415 -187042 138254 243546
6474 243546 -17504 195572 182657 -69659 -178673 87516 -341279 -58214 -38660 283782 72804
6462 -59937 217268 286552 96491 191564 -114697 -205228 103949 -129934 -204974 -6111 -15255
6451 -15255 -246326 -127814 -25108 -259200 -141843 -302861 -43925 213377 10718 -168165
6440 -125736 -18396 -19675 -263811 20507 -312132 -116930 -410007 8779 5246 -228809 115510
6428 141166 -82509 -112282 -247527 56304 -21364 395118 -369090 -74227 -242704 121340 23794
6416 -176485 -84831 -200106 -14971 214040 -109498 -76465 235166 -51331 -206216 -200909 378903
6404 -159966 -238783 -7076 -198795 243962 -45609 124919 -169989 187547 -70302 -287443 -294272
6393 -294272 75315 -133950 -317543 186329 44017 -173025 260019 -233720 -55711 -284638
6383 -284638 99023 146963 14578 -117229 177439 -120353 54373 -21751 -75559 -160491 -137382
6372 -137382 168577 -38401 78433 163424 -271896 147855 -50083 22159 -148811 -102726 -235860
6361 -235860 -207791 24750 213902 -147448 -127173 5030 -91821 15359 342635 212190 10420
6349 -207273 -38077 54566 -193977 71391 110396 -326374 -361626 -134586 -120420 49083 77486
6338 77486 50307 78498 -125747 -206436 -201596 -74008 46149 -155922 -30838 237497 -190919
6326 7648 118475 -198330 -287605 15598 -141708 -213691 109211 -116616 -46837 102511 -218444
6314 43840 322050 79971 -183118 121754 150343 -231761 283995 19942 3871 289708 13226
6302 -145585 17594 -106449 29039 206608 356229 89472 -131877 167888 -125365 106645
6291 112128 -41689 -448415 -321388 130213 108077 -148385 254157 66087 1553 -127790 17753
6279 195648 143522 -172007 -77260 -292811 -35738 248894 127510 -55612 -115733 -90691 93250
6267 55093 49631 265977 102288 289869 -91290 -153869 -551546 59520 -182302 -10300 -150705
6256 -150705 145428 513334 248985 34481 129329 -170225 -227545 -211150 -33399 175830 250362
6245 250362 46572 39370 18342 -215272 106746 -83097 87849 152377 45487 62362 72295 154963
6233 154963 -107310 -198248 -38052 -298474 4708 -112008 1938 -189034 -256511 46154 254129
6222 254129 -119478 154729 -181173 -366406 73810 35005 229273 -53489 -136154 9350 -287946
6210 -110428 -114814 -230787 -201777 12985 -391918 -42326 -48268 -74435 -103175 -350604 -27027
6198 -124692 -44130 128631 -267434 -115460 -60651 -173344 -150346 -124990 161150 -2804 -135332
6187 -135332 35508 -27947 73790 60751 -277663 154920 -84050 -113611 94689 -196071 -52553
6175 -281826 -217296 -219950 266845 122431 46300 50974 116494 -67948 86703 -253018 33780
6163 237390 -99705 -259569 -38397 117438 61114 116896 -59225 -88032 115064 6181 -56512
6151 172859 -246972 112477 300948 81588 -198630 -106757 -335014 250952 -133421 175208
6140 -79429 237733 177774 105852 47793 175185 -19611 -129598 -25151 -186610 -40378 7071
6128 -2 125505 71183 -16695 68799 -441033 156428 244535 189500 -198707 -138492 217829 252731
6116 252731 -91476 -70066 -80570 -161845 -212425 41343 -106890 25079 -206782 24517 431887
6105 431887 -105520 282106 -110227 260506 -24226 -151955 -386209 -22061 165717 181764
6095 181764 -293986 -98937 -113268 -83771 103923 72262 -335778 47236 52511 18374 -65043
6083 140745 88568 139604 -152493 43613 256531 77774 -41135 -190916 38075 -37442 -225321
6072 -225321 292662 106667 -62411 145219 27578 -109950 -27921 -27776 102488 29651 -472299
6060 -265271 104830 -25604 -147034 50339 -62652 161071 43131 21104 -50678 312007 103190
6048 40951 -20082 -96159 -116200 -28845 -114636 -97457 475431 -49888 64339 -109030 -147714
6037 -147714 -186220 -146748 -119701 106020 292917 -210502 47442 257312 -250985 230530
6026 -121995 -173003 -194208 245321 -53176 96885 251567 -111448 -367869 29027 116773 32148
6014 -376471 60993 -50931 24550 -291082 361862 -221081 -228687 -63458 190153 75841 -6161
6002 31201 -135854 -226830 188193 154912 -79387 -172418 196911 69123 135017 -140596 180904
5990 410694 -545566 73251 -308298 131930 -203085 223533 -223945 37515 -143286 256945
5979 -67264 -84862 -113405 186401 -8463 17179 296193 200498 206666 171274 -80007 -204715 -50757
5966 33393 -13452 -169485 182961 -318376 254179 -98443 -145321 155807 388166 176363
5955 143619 -37561 12730 5109 29752 -241589 137874 30695 -18851 78955 -91772 134602
5943 30640 -69505 -57623 -67046 81405 -145223 -182371 290100 -4798 -119734 -27961 -33110 -123263
5931 -123263 -22348 -50160 -214074 -369485 28313 -145490 -184563 193183 305068 358844 -409502
5919 36859 -95031 -167083 -86853 -213889 -192275 -141850 155997 77683 35706 -150880 -20320
5907 52744 32648 -58640 -29260 129950 -246056 -154774 71234 265462 -65858 -4943 91199
5895 7678 -149205 1496 143248 -20277 -70961 98589 118674 156763 166130 230622 238280 -122720
5882 46961 128345 -89294 -194811 267557 -19371 -54774 126620 61243 -226990 54779 59933
5871 59933 14513 47130 -32151 -181023 151539 -88719 256551 -386168 478884 70899 254098
5860 254098 -48574 170340 -125347 -14929 102980 100736 66105 152663 75790 51528 -308714
5848 -18896 -83904 -218632 -2755 -4688 -140506 199745 190634 284330 -30772 144886 -138505
5836 -312773 107984 -5762 -147693 -58494 103612 288032 -166930 -179908 -59342 216163 -327750
5824 -145643 139440 184947 -60501 -159680 -378191 51229 -56051 463901 -24960 -126820 -123441
5813 -123441 -3942 116761 217719 -155433 -25866 -95841 61854 95844 9891 -88073 -167622
5802 -167622 56714 49454 -1089 -187554 -102206 -38549 7930 136102 -122633 -125343 15164 -243667
5789 -56893 -29309 151556 178500 -135057 -54980 99308 186105 237534 136768 -223427 -12324
5777 359766 -121567 9316 125118 -75196 302357 -199249 240167 -269926 -121320 -168670
5767 -168670 -87632 -63879 -211431 111537 105012 1368 -56684 125699 -204909 -93648 228929
5755 64901 189857 116916 238395 -211156 166672 -110963 90164 -141334 -97614 18440 47892
5744 47892 -117068 120127 -6940 90840 63427 177794 242675 -6856 -16325 -153818 29126 -87414
5731 -16982 -100765 -222720 8572 -182775 -90269 -85444 -169580 314009 111437 -9155 174818
5719 519377 -36183 -135010 -30201 47759 208911 -145506 -110280 -77699 -56720 -69080 -327377
5708 -327377 -33919 -325063 101085 -134364 -221968 62 -42446 -136573 140814 379984 68965
5696 24131 97326 373452 173347 12531 -185029 -188310 40873 -86584 -201836 174979 -340866
5684 141857 -31193 -45489 -91114 238342 366303 -74496 -105985 47977 -75563 107009 -58465
5672 136712 -60343 -365016 142852 -155182 -346821 27767 -86459 -12498 9540 93992 224624
5661 224624 -224128 -247629 240102 -193631 -212509 165622 -33985 111532 125511 265009
5651 265009 -62489 67848 62154 171412 269596 -137813 317649 148933 -11112 89991 -48775
5639 86380 -12666 168006 -216767 -284667 -140982 -44606 -136346 156628 -246489 119859 43780
5627 -135418 89587 172868 -163940 -90608 13323 99151 -245552 -53539 132886 -77411 35917
5615 -32380 -142055 -101160 136117 -150269 -289241 146660 -301454 -120557 304502 135352
5604 -134118 -6931 -63108 -83228 21527 -81436 40008 174127 114800 116131 -76179 224946 -61346
5591 -15318 -240132 -3254 -95251 -28372 -197492 20134 -300467 -42702 -20660 80207 -58695
5579 -78097 95188 117696 250051 -250225 -143610 290201 -226307 20357 -33702 -19601 -174606
5568 -174606 -195098 181965 183289 141371 27776 -90426 211292 17776 -320458 -101177 240413
5556 116733 38143 5189 95655 -303817 -102830 -183897 -15142 8166 146066 -1849 -59848 136947
5543 120409 151028 85034 -37914 -93616 -3596 -83531 -185669 -75807 265547 -19886 -113131
5532 -113131 205768 -164145 -400082 211160 89633 -516897 -66050 -517296 -244383 -8094
5521 -45147 182432 318611 -77783 -297351 -200438 -91814 67827 36963 199567 -195992 -65094
5509 65167 196579 -9051 384443 -37498 21517 -76843 -253973 -55557 142730 -312799 91945
5497 84247 -185693 164276 -18063 90015 -182973 -65167 -121761 133010 245454 214258 -80462
5485 276435 185711 231516 -84517 6937 106848 -54569 2281 103040 83730 290000 43019 22398
5473 22398 24828 -65613 112634 207459 30691 34395 -14353 157584 -64887 263133 86141 14409
5460 -132822 1938 -98703 57296 -199627 -6567 -28223 238895 -155830 249781 36003 135492
5449 135492 96157 107315 -92817 -159958 -142221 75787 409993 13599 -34583 -189423 261744
5437 131886 42983 168089 57796 -165639 113298 90380 -8639 -204305 203964 201401 47346
5425 -57558 35338 175136 -87326 -132249 -19729 -329059 2224 -62395 23581 -137583 3891 254190
5413 254190 -75854 103446 -6721 434707 -93218 -28604 -116858 249983 58637 -156555 50286
5401 -51978 4132 80390 78212 121707 111317 130602 -28335 11119 179779 -10747 193076 -44997
5388 -168456 90174 -26926 -56580 -206430 -296122 -47700 68617 96520 -268662 308223 270720
5377 270720 70341 -12223 -247811 -50288 -8163 -51960 -508133 69921 -72802 272850 267569
5366 267569 -23494 140952 297309 246586 -189807 127920 264983 223715 266203 335419 -235899
5354 166894 -72642 -3250 68760 148730 194749 -96114 -68191 126560 -156473 42143 -179185
5342 204662 -23487 -70854 305005 -1030 133269 -82258 155785 396193 133490 -191471 -383668
5331 -383668 -173198 77317 56855 -167317 -54556 91431 -36680 133040 -60892 -27689 -166854
5320 -166854 43917 198325 109065 -243159 144550 309808 -48190 225056 -181609 98347
5309 73025 -139636 260872 27286 -342452 -26139 90386 243026 -12799 81122 48419 -199349
5297 36615 -65310 -159648 -56992 36801 258421 20055 -139207 -317140 -235892 139110 35733
5285 19791 -230566 144342 -274874 -140062 124309 188385 -259324 -41966 27741 -87395 -241548
5274 -241548 25423 -4422 -44482 167182 -12416 54223 8054 -97414 -16689 20039 131718 258283
5262 258283 42892 -18831 295524 -206446 -235112 322443 -86012 -64981 233755 32342 -136647
5250 -38395 50958 -23739 -59907 42745 -333876 -218381 -48352 -115851 -47629 -170104 142055
5238 65383 -100090 29594 -142441 -54954 68944 353970 140505 248552 129462 -1769 -150774
5227 -150774 -98364 79373 -19498 -101712 20219 -21863 11916 -378116 -213625 149002 21297
5215 93783 248050 7045 -123697 -196153 87983 -113165 -160465 323150 -59631 -60528 140441
5203 77178 265926 -33320 13881 28328 -242257 131384 171961 -252970 166124 362147 109580
5191 -132703 279315 73834 100471 33044 -25281 149764 113966 248486 171076 -287056 87642
5179 211053 -39857 88289 26084 -165654 -243050 97527 27193 204133 121716 171282 188165
5168 188165 32054 127956 -18570 118768 -186478 -245619 38292 199201 304676 -140030 -61503
5156 188160 -102497 -95805 -9079 -211799 125871 69766 67389 -201679 -116106 216541 -42191
5144 -201493 -80811 247802 173617 -99424 12992 19622 -273624 30168 -376339 -27035 101870
5132 -425085 216939 230657 -49992 -213773 -45421 -66473 256314 5687 -72067 -108529 -166171
5121 -166171 131913 222259 -260488 -168035 27366 -62416 -133297 19076 -297245 -135827 -235675
5110 -235675 17022 274990 -125573 -63587 90199 213920 61800 -199304 -194055 -71934 -152427
5099 -152427 351104 -82492 -154182 59333 -275163 49471 -101718 383260 -141390 -90636 -82171
5088 -82171 142949 118122 65808 146027 -242096 211849 -113070 -127844 -215428 150915 -264981
5076 -11673 327078 200603 -87994 101659 -2397 -47163 -42306 378875 -176263 142022 -78796
5064 49444 70002 87826 241081 -124035 -175943 -235789 130480 -105531 170891 -76609 2535
5052 99412 -5049 28192 -204300 241859 133781 -44154 -51329 25652 33422 -9925 100555 7266
5039 78878 244766 -69736 50187 148732 78150 -160811 2537 -24509 78585 -75894 181441
5027 126935 -129652 209351 329863 103591 202401 -202140 13285 -44947 171035 117947
5017 117947 29558 67518 447871 -162677 -197185 227126 45402 -40504 251435 -19779 -87610
5006 -87610 188038 -5795 -479555 -113260 -96072 78047 -128225 -146440 -84838 -48175 -100124
4995 -100124 195642 1019 -91111 7436 -34503 141894 -52806 -469852 -224605 141238 331293
4984 331293 71290 230 -291090 -293836 -272793 301971 -27083 -151437 -130277 -2466 -16742 -122279
4972 -122279 191459 -365510 195173 -188392 -201202 -92305 106001 -271378 -164420 -278885
4962 -278885 -84547 -165260 67122 -33725 -24416 104400 -176803 69757 145168 121729 -8935 -143768
4950 -143768 54118 -116417 -45312 335726 8290 56152 -213933 93888 -69311 -124999 47795
4938 306284 14206 20244 46082 73041 48064 -60011 -64805 -100894 193033 25163 -91287 -23561
4925 132744 -129330 128649 114443 91966 168353 -173249 -14024 14516 173666 -25766 322454
4913 -233090 8508 154641 -23612 94998 -80180 318356 72430 -82406 -198429 63245 156002
4902 156002 129057 -39553 -122887 183396 -69697 153444 196222 126579 26645 -238931 -196719
4891 -196719 -194134 224891 -123585 -42504 110596 -131021 164310 216886 185430 336637 -120652
4879 302305 -115973 155457 128493 152882 -29439 -53393 320693 -310358 86397 55787 -82156
4867 275234 156980 -2717 93086 -294884 -68023 -21269 -37367 41042 -62068 371799 -48759
4855 166759 7186 -230052 -86661 262090 238981 -365092 -234992 -103865 239878 -190986
4844 -222900 77957 364421 374811 49342 322100 151500 -224219 111323 -266652 235741
4833 123076 -83306 66056 -36864 28974 -122289 7292 -53793 240977 -49728 245508 338388
4822 338388 -9379 -168424 -57530 -14212 -25370 -164423 -170012 -252490 -188831 74312 -7577 374220
4809 -87129 18927 -155259 158222 -44073 17802 195007 -110031 -172389 -283462 26818 291971
4798 291971 70047 -77825 -149888 299371 196238 232837 49677 193950 234197 -376946 -32616
4786 -237413 -15248 49201 145314 147157 109329 -32689 -109718 -184889 52428 270785 19487 -185663
4773 40206 -57467 74541 -132448 -106271 239661 -82473 -88275 -148228 90725 139888 89070 -553973
4760 193740 -118899 432366 -223040 -152775 95834 -66428 153967 14818 -19534 211776 169555
4749 169555 -32786 -218565 -33897 147234 -145779 -229072 3072 37615 38965 307084 286891
4738 286891 -176046 17801 250593 -35540 -77795 34465 112042 42715 -157368 133344 -15133
4726 10064 -417924 -138902 -185046 222116 198182 -135325 -39730 254174 -136030 -92757 172702
4714 -3462 -57007 197482 -396244 82991 70652 115224 -74996 -143296 200023 -198014 -32144
4702 -476579 -43061 -106061 -25462 236150 -175372 -32037 -47774 264398 157317 53849 16989
4690 276783 -2370 182506 31391 -95340 129249 12532 -113673 -311503 297396 -30914 -71143
4679 -71143 -53073 -86889 -114677 34930 -181045 -118745 -21501 220751 -31668 123352 -189733
4667 -94998 282175 -360194 -96552 180159 74200 -320228 54923 -149960 -33386 -384919 -149180
4655 -17353 97589 -61359 78512 8675 81287 72405 -140840 -70410 -115222 203414 -215691 7611
4642 112674 -381618 -237214 175706 -171862 83062 -77501 -205727 376114 316897 86287
4631 46559 150205 -21858 -101647 -168218 -27187 5382 -113528 -231137 19783 1746 -118441
4619 56741 155681 -246979 -43220 73022 163138 -224940 -45797 -25953 -185599 -105869 56011
4607 -117785 -91003 70156 -173847 18028 225937 407950 -87660 116114 -26048 49193 -151894
4595 -132962 10088 6761 -107916 129980 48611 -149747 150251 231852 13569 -354 61393
4583 21236 218485 -109241 176260 -122842 37799 28842 -101202 -267459 151605 85347 -118825
4571 318753 -87911 245595 -396338 -27105 46018 -224245 95730 -324729 -196931 -122449 20780
4559 -144158 13235 20883 -248811 -156974 211906 171976 257003 133487 -215623 -17050 96112
4547 145609 -67593 344175 139846 33387 420946 -173224 65743 15719 74425 140753 289989
4536 289989 -2793 210288 54078 -41717 78834 159248 60400 150917 271939 141293 59649
4524 264539 -330544 -5705 7104 106352 -218602 54871 330095 26804 156419 283820 -71810
4512 -194583 -366447 -165213 165325 119631 -246375 -75337 26390 31673 -59823 79872 65380
4501 65380 -5513 359965 159594 -28265 -147269 2240 -112507 -552247 -203625 122359 320453
4490 320453 -145003 308740 -172392 -196720 -128908 18143 198287 265588 88021 346062 -158330
4478 2580 -334110 225755 -61582 94906 -186088 -40279 -182684 329970 -139955 165424 -227719
4466 -30908 -38517 -8169 -17985 -306811 114396 -199321 42548 269703 -221857 275506 112564
$$ [...]
##END NTUPLES=NMR SPECTRUM
##END=
