
##TITLE=AC1180_Huila-tarqui-HTAAH12026_5890762_zGK5nnsJgV
##JCAMPDX= 6.0         $$ Bruker NMR JCAMP-DX V2.0
##DATA TYPE= NMR SPECTRUM
##DATA CLASS= NTUPLES
##ORIGIN= BRUKER
##OWNER= Administrator
$$ 1.72 TOPSPIN		Version 2.1
$$ 2012-04-02 16:29:51.109 -0500  Administrator@TOPSPIN
$$ Compression mode = diff/dup
##.OBSERVE FREQUENCY= 400.13188235
##.OBSERVE NUCLEUS= ^1H
##.ACQUISITION MODE= SIMULTANEOUS (DQD)
##.ACQUISITION SCHEME= undefined
##.AVERAGES= 64
##.DIGITISER RES= 22
##SPECTROMETER/DATA SYSTEM= spect
##.PULSE SEQUENCE= noesygpps1d.comp
##.SOLVENT NAME= COFFEE_meoh
##.SHIFT REFERENCE= INTERNAL, COFFEE_meoh, 1, 14.96798
##AUDIT TRAIL= $$ (NUMBER, WHEN, WHO, WHERE, PROCESS, VERSION, WHAT)
$$ ##TITLE= Audit trail, TOPSPIN		Version 2.1
$$ ##JCAMPDX= 5.01
$$ ##ORIGIN= Bruker BioSpin GmbH
$$ ##OWNER= Administrator
$$ $$ C:\Bruker\TOPSPIN/data/COFFEE/nmr/AC1180_Huila-tarqui-HTAAH12026_5890762_zGK5nnsJgV/12/pdata/1/auditp.txt
$$ ##AUDIT TRAIL=  $$ (NUMBER, WHEN, WHO, WHERE, PROCESS, VERSION, WHAT)
(   1,<2012-04-02 16:29:43.718 -0500>,<Administrator>,<TOPSPIN>,<go>,<TOPSPIN 2.1>,
      <created by zg
	started at 2012-04-02 16:18:10.609 -0500,
	POWCHK enabled, PULCHK disabled,
       configuration hash MD5:
       1A 1E CE 29 27 FD 77 03 67 4E F0 E3 C4 B2 CB 90
       data hash MD5: 64K
       6B 73 20 9F 23 9D 96 EE 52 CF 65 CE 0E 34 CE 89>)
(   2,<2012-04-02 16:29:48.578 -0500>,<Administrator>,<TOPSPIN>,<proc1d>,<TOPSPIN 2.1>,
      <Start of raw data processing
       efp LB = 0.3 FT_mod = 6 PKNL = 1 PHC0 = 0 PHC1 = 0 SI = 128K 
       data hash MD5: 128K
       D7 86 5D 6A FC 46 AB 17 CF 22 DE A1 AF F2 D1 96>)
(   3,<2012-04-02 16:29:50.031 -0500>,<Administrator>,<TOPSPIN>,<proc1d>,<TOPSPIN 2.1>,
      <pk PHC0 = 34.39819 PHC1 = 0 
       data hash MD5: 128K
       1D 22 10 6D BA 49 B6 FD 7C B4 B0 B1 FE 70 5F C8>)
(   4,<2012-04-02 16:29:50.562 -0500>,<Administrator>,<TOPSPIN>,<proc1d>,<TOPSPIN 2.1>,
      <abs ABSG = 1 
       data hash MD5: 128K
       28 A6 11 77 BD 0B 9B 03 86 3F 47 C7 42 06 E0 B4>)
(   5,<2012-04-02 16:29:50.671 -0500>,<Administrator>,<TOPSPIN>,<proc1d>,<TOPSPIN 2.1>,
      <abs ABSG = 2 
       data hash MD5: 128K
       5C 5D A1 FE 9B 5A 28 4E 66 AB 56 13 0C 9A AA 53>)
(   6,<2012-04-02 16:29:50.750 -0500>,<Administrator>,<TOPSPIN>,<proc1d>,<TOPSPIN 2.1>,
      <abs ABSG = 3 
       data hash MD5: 128K
       63 0F B9 A0 3A EC 04 74 CE EC 99 AE CC EA 30 20>)
(   7,<2012-04-02 16:29:50.828 -0500>,<Administrator>,<TOPSPIN>,<proc1d>,<TOPSPIN 2.1>,
      <abs ABSG = 4 
       data hash MD5: 128K
       47 08 E9 83 63 AD 75 1C 86 CF A6 0F 1C 3F 80 4C>)
(   8,<2012-04-02 16:29:50.906 -0500>,<Administrator>,<TOPSPIN>,<proc1d>,<TOPSPIN 2.1>,
      <abs ABSG = 5 
       data hash MD5: 128K
       EA 86 78 AA 50 42 42 BD B0 41 35 20 A8 94 46 5C>)
$$ ##END=
$$ 
$$ $$ hash MD5
$$ $$ 0A C3 71 D1 53 3B 0F AA 82 36 4B 6A 93 92 03 C6
##$RELAX= 
##$RELAX= 
##$RELAX= 
##$RELAX= 
##$RELAX= 
##$RELAX= 
##$RELAX= 
##$RELAX= 
$$ [...]
##$TP07= 0
##$TPNAME0= <>
##$TPNAME1= <>
##$TPNAME2= <>
##$TPNAME3= <>
##$TPNAME4= <>
##$TPNAME5= <>
##$TPNAME6= <>
##$TPNAME7= <>
##$TPOAL= (0..7)
0.5 0.5 0.5 0.5 0.5 0.5 0.5 0.5
##$TPOFFS= (0..7)
0 0 0 0 0 0 0 0
##$TUNHIN= 0
##$TUNHOUT= 0
##$TUNXOUT= 0
##$USERA1= <user>
##$USERA2= <user>
##$USERA3= <user>
##$USERA4= <user>
##$USERA5= <user>
##$V9= 5
##$VALIST= <valist>
##$VCLIST= <CCCCCCCCCCCCCCC>
##$VD= 0
##$VDLIST= <DDDDDDDDDDDDDDD>
##$VPLIST= <PPPPPPPPPPPPPPP>
##$VTLIST= <TTTTTTTTTTTTTTT>
##$WBST= 2048
##$WBSW= 25
##$XGAIN= (0..3)
0 0 0 0
##$XL= 0
##$YL= 0
##$YMAX_a= 11738221
##$YMIN_a= -5850190
##$ZGOPTNS= <>
##$ZL1= 120
##$ZL2= 120
##$ZL3= 120
##$ZL4= 120
##$ABSF1= 14.96798
##$ABSF2= -5.58455
##$ABSG= 5
##$ABSL= 3
##$ALPHA= 0
##$AQORDER= 0
##$ASSFAC= 0
##$ASSFACI= 0
##$ASSFACX= 0
##$ASSWID= 0
##$AUNMP= <proc_prof1d_extract.lims>
##$AXLEFT= 0
##$AXNAME= <>
##$AXNUC= <1H>
##$AXRIGHT= 0
##$AXTYPE= 0
##$AXUNIT= <>
##$AZFE= 0.1
##$AZFW= 0.1
##$BCFW= 0
##$BC_mod= 0
##$BYTORDP= 0
##$COROFFS= 0
##$CY= 15
##$DATMOD= 1
##$DC= 0
##$DFILT= <>
##$DTYPP= 0
##$F1P= 0
##$F2P= 0
##$FCOR= 0.5
##$FTSIZE= 131072
##$FT_mod= 6
##$GAMMA= 0
##$GB= 0
##$INTBC= 1
##$INTSCL= 1
##$ISEN= 128
##$LB= 0.3
##$LEV0= 0
##$LPBIN= 0
##$MAXI= 10000
##$MC2= 0
##$MEAN= 0
##$ME_mod= 0
##$MI= 0
##$NCOEF= 0
##$NC_proc= -3
##$NLEV= 6
##$NOISF1= 0
##$NOISF2= 0
##$NSP= 0
##$NTH_PI= 0
##$NZP= 0
##$OFFSET= 14.96798
##$PC= 1
##$PHC0= 34.39819
##$PHC1= 0
##$PH_mod= 1
##$PKNL= yes
##$PPARMOD= 0
##$PPDIAG= 0
##$PPIPTYP= 0
##$PPMPNUM= 2147483647
##$PPRESOL= 1
##$PSCAL= 4
##$PSIGN= 0
##$PYNMP= <proc.py>
##$REVERSE= no
##$SF= 400.130005056222
##$SI= 131072
##$SIGF1= 0
##$SIGF2= 0
##$SINO= 400
##$SIOLD= 131072
##$SPECTYP= <>
##$SREGLST= <1H.CDCl3>
##$SSB= 0
##$STSI= 131072
##$STSR= 0
##$SW_p= 8223.68421052632
##$SYMM= 0
##$S_DEV= 0
##$TDeff= 65536
##$TDoff= 0
##$TI= <>
##$TILT= no
##$TM1= 0
##$TM2= 0
##$TOPLEV= 0
##$USERP1= <user>
##$USERP2= <user>
##$USERP3= <user>
##$USERP4= <user>
##$USERP5= <user>
##$WDW= 1
##$XDIM= 131072
##$YMAX_p= 453256787
##$YMIN_p= -440575359
##$CURPLOT= <Network HP LaserJet P1505>
##$CURPRIN= <$Network HP LaserJet P1505>
##$DFORMAT= <normdp>
##$LAYOUT= <+/1D_H.xwp>
##$LFORMAT= <normlp>
##$PFORMAT= <normpl>
##$SURQMSG= 1
$$ End of Bruker specific parameters
$$ ---------------------------------
##NTUPLES= NMR SPECTRUM
##VAR_NAME=  FREQUENCY,     SPECTRUM/REAL,   SPECTRUM/IMAG
##SYMBOL=    X,             R,               I
##VAR_TYPE=  INDEPENDENT,   DEPENDENT,       DEPENDENT
##VAR_FORM=  AFFN,          ASDF,            ASDF
##VAR_DIM=   131072,        131072,          131072
##UNITS=     HZ,            ARBITRARY UNITS, ARBITRARY UNITS
##FACTOR=    0.0627417313425165, 1,          1
##FIRST=     8223.62146879498, -1369,        -83267
##LAST=      0,             568,             -84065
##MIN=       0,             -440575359,      0
##MAX=       8223.62146879498, 453256787,    0
$$ Real data points
##PAGE= N=1
##DATA TABLE= (X++(R..R)), XYDATA
$$ [...]
66961 934814 943892 953116 963518 974322 984578 994809 1005994 1018070 1030658 1044257 1059277 1074594
66949 1074594 1088592 1101371 1114489 1128603 1142816 1156539 1170626 1186016 1202276 1218223 1233388
66938 1233388 1248185 1263044 1278007 1292877 1307287 1320956 1334443 1349354 1367043 1387080 1407651
66927 1407651 1427563 1447166 1467088 1487012 1506474 1526174 1547252 1569337 1590603 1610198 1629594
66916 1629594 1650800 1674004 1697768 1720937 1743460 1765814 1788723 1813175 1839663 1867377 1895066
66905 1895066 1922690 1951371 1981811 2013735 2046661 2079909 2111799 2140568 2166801 2193588 2223268
66894 2223268 2255136 2287347 2319885 2354241 2390947 2429093 2467926 2507468 2547567 2587771 2628322
66883 2628322 2670038 2712809 2755257 2796436 2837148 2878987 2922589 2967260 3011961 3056274 3100698
66872 3100698 3146241 3193439 3241592 3289257 3335730 3381815 3428982 3478011 3528666 3580391 3632923
66861 3632923 3686190 3739871 3793448 3846829 3900678 3955698 4011650 4067558 4122908 4177961 4232667
66850 4232667 4286170 4338037 4389292 4441296 4493974 4546068 4596738 4645831 4692896 4737417 4780345
66839 4780345 4824026 4869743 4916161 4960942 5003177 5043323 5081439 5116762 5149100 5179587 5209558
66828 5209558 5239170 5267570 5294117 5318973 5342448 5364124 5382896 5397905 5409269 5417772 5423895 5427254
66816 5427254 5427021 5422773 5414913 5404371 5391931 5377858 5362078 5344541 5325178 5303677 5279673 5253308
66804 5253308 5225284 5196102 5165449 5132575 5097108 5059403 5020197 4979966 4938342 4894189 4846751
66793 4846751 4796886 4746669 4697471 4648828 4599410 4548501 4496338 4443756 4391958 4341685 4291801
66782 4291801 4239533 4183268 4124600 4066462 4009766 3953199 3895896 3838579 3781894 3725310 3668439
66771 3668439 3612370 3558836 3508563 3460732 3413399 3364456 3313218 3261348 3211193 3162932 3114496
66760 3114496 3064612 3014596 2966451 2920546 2876172 2833110 2791260 2749516 2706562 2662531 2618810
66749 2618810 2576501 2535972 2497404 2460534 2424086 2386703 2348559 2311148 2275419 2240929 2206864
66738 2206864 2172970 2139281 2105661 2071898 2037875 2003674 1969916 1937776 1907944 1879631 1851216
66727 1851216 1821863 1792029 1762622 1734368 1707809 1683031 1659418 1636440 1614624 1594764 1576128
66716 1576128 1556549 1534658 1511204 1487824 1465436 1444234 1424246 1405025 1385489 1365022 1344421
66705 1344421 1325045 1307321 1290728 1274875 1259681 1244551 1228272 1210118 1190684 1171455 1153845
66694 1153845 1138602 1125556 1113653 1101549 1088540 1074844 1060945 1046966 1032811 1018542 1004256
66683 1004256 989905 975815 963170 953102 944953 936198 924924 912084 900553 891967 885221 878068
66671 878068 869379 859582 849667 840298 831364 821921 811102 799552 789278 781358 774368 766041 756136
66658 756136 746596 738994 732938 727157 721011 714468 707467 700056 692618 685305 677572 668930 660007 652329
66644 652329 646875 643075 639287 634205 627782 620775 613486 605328 595923 586242 578020 572018 567439 563060
66630 563060 558327 553185 547588 541691 536088 531290 527120 522993 518694 514600 511225 508661 506373 503479
66616 503479 499398 494332 488945 483614 478229 472684 467169 461954 457281 453475 450659 448301 445599 442451
66602 442451 439428 436605 433236 429042 424998 422026 419433 415754 411052 407386 406483 407402 406995 402706 394901
66587 394901 386479 380222 376601 374238 372070 370311 369272 368357 366956 365584 365105 365131 364236 361807 358716
66572 358716 355946 353369 350324 346738 343097 339739 336759 334369 332846 332097 331694 331364 331109 330762 329713
66557 329713 327386 323900 320056 316613 313721 311156 308918 307312 306506 306193 305700 304316 301728 298522 296094
66542 296094 295378 295554 294665 291896 288633 286637 285688 283844 279895 274781 270514 268346 268192 269215 270483
66527 270483 271277 271211 270247 268631 266795 265101 263485 261533 259140 256835 255120 253754 252155 250352 248861
66512 248861 247654 246009 243655 241442 240420 240636 241266 241620 241481 240596 238493 235114 231346 228486 227043
66497 227043 226243 225030 223503 222966 224297 226599 227908 227091 224583 221358 217914 214523 211880 210781 211130
66482 211130 211680 211004 208780 206087 204423 204420 205547 206913 207942 208236 207450 205803 204247 203369 202404 200211
66466 200211 197110 194666 193501 192379 190052 187097 185062 184408 184210 183601 182704 182209 182640 183933 185242 185384
66450 185384 184163 183080 183937 186618 188919 188839 186499 183578 181402 180030 178880 177621 176359 175302 174536
66435 174536 174159 174354 175065 175604 175042 173193 170899 169097 167967 167342 167441 168423 169431 168976 166547 163209 160393
66418 160393 158634 157709 157398 157671 158381 159176 159589 159123 157609 155663 154294 153838 153666 153251 152943 153231 153736
66401 153736 153637 152769 151552 150029 147867 145388 143799 144036 145854 148315 150701 152631 153775 153933 153300 152358
66385 152358 151629 151542 152199 153042 153189 152400 151412 151002 151081 151120 151066 151218 151487 151565 151703 152508 153865 154931 155489 156451
66365 156451 158340 159880 158949 154832 149079 144272 142272 143212 145520 147087 147016 146131 145401 144439 142435 140133
66349 140133 139427 140762 142288 142229 140900 139481 137886 135253 132037 130113 130642 132838 134964 135744 134785 132583
66333 132583 130390 129233 128783 127928 126684 126545 128405 130996 132244 131635 130434 129927 130287 130948 131254 130694
66317 130694 129197 127359 125929 124988 124073 123117 122740 123405 124677 125572 125456 124465 123211 122134 121111 119758
66301 119758 118206 117245 117371 118033 118384 118501 119071 119883 119630 117674 115239 114129 114694 115772 116338 116380 116201
66284 116201 115722 114770 113481 111989 110151 108100 106767 107151 108998 110781 111401 111513 112686 115407 118517
66269 118517 120673 121564 121298 119316 115058 109630 105691 105032 106772 108555 109137 109110 109324 109591 109265 108373 107532
66252 107532 107091 106939 107082 107700 108523 108817 108454 108493 109880 111732 111860 109340 105781 103484 102977 103193 103592
66235 103592 104807 107066 109203 110039 110086 111015 113673 117215 120036 121015 119991 117651 115039 112732 110434
66220 110434 107677 104848 103099 103134 104464 105917 106532 105926 104281 102264 100616 99538 98636 97665 97062 97454
66204 97454 98773 100129 100546 99731 98277 97192 97043 97344 96959 95300 92959 90949 89646 88869 88774 89896
66188 89896 92119 94188 94702 93408 91196 89058 87465 86588 86587 87514 89197 91366 93693 95666 96701 96541
66172 96541 95432 93823 92120 90760 90235 90797 92266 94185 95961 96906 96662 95805 95490 96059 96490 95801 94561
66155 94561 94192 95084 96376 97553 99167 101619 104235 106169 107548 109015 110508 111120 110022 107351 104482
66140 104482 103408 104994 107621 108525 107052 105560 106259 108243 108975 107848 106576 106436 107035 107954 109766 112672
66124 112672 115491 116849 116433 114494 111260 107667 105584 106124 108277 110129 110844 110605 109364 106983 104231
66109 104231 102254 100913 98769 94994 90554 87244 86232 87601 90462 93185 94236 93432 92029 91264 91176
66094 91176 91199 91456 92748 95199 97424 97459 94545 89905 85699 83286 82511 82408 82255 81929 81690 81879 82605
66077 82605 83512 84047 84038 83747 83344 82783 82356 82720 83954 85168 85619 85752 86476 87813 89011 89697 90097 90365
66059 90365 90613 91453 93500 96185 98032 98350 97795 97083 96121 94824 93765 93288 92790 91709 90611 90324 90379
66042 90379 89371 86823 83814 81690 80870 81050 81799 82546 82587 81769 80980 81373 82984 84570 85059 84882 85378
66025 85378 86949 88396 88395 87128 85900 85431 85266 84851 84363 84249 84548 85076 85773 86410 86367 85184 83172 81189
66007 81189 80006 80112 81656 84115 86334 87413 87511 87443 87757 88536 89760 91293 92637 93226 93025 92490 92061
65990 92061 92011 92430 92841 92104 89521 86097 83955 84259 86302 88806 91333 93956 96218 97345 97373 97344 98201
65973 98201 99887 101672 102974 103621 103624 103207 103079 104133 106388 108424 108522 106554 104269 103375 103803 104374 104749
65956 104749 105718 107482 108623 107495 104284 101031 99651 100269 101371 101232 99236 96232 93801 92939 93345
65941 93345 94094 94912 96344 98428 99767 98700 95458 92324 91151 91269 90621 88614 86780 86520 87384 88242
65925 88242 89152 90919 93288 94904 95157 94946 95218 95624 95231 93925 92450 91480 91318 92215 94216 96584 97993
65908 97993 97627 95953 94202 93132 92378 91089 89192 87834 88264 90324 92439 93245 92881 92464 92706 93427
65892 93427 94078 94249 93823 93065 92534 92463 92280 91205 89421 88132 88243 89308 90034 89533 87844 85572 83487
65875 83487 82342 82556 83872 85643 87641 90270 93693 97000 98878 99158 99087 99661 100248 99591 97886 96833
65859 96833 97381 98365 97995 96048 93834 92472 92193 93095 95357 98290 100083 99266 96241 92960 91261 91627
65843 91627 93147 94341 94379 93791 93713 94235 93973 91778 88423 85974 85687 87155 89320 91489 93275 94338
65827 94338 94624 94534 94519 94733 95164 95733 96129 95942 95220 94581 94546 95010 95487 95549 94863 93248 91030 88976 87528
65808 87528 86432 85479 85285 86759 89904 93600 96580 98280 98827 98557 97690 96420 95273 95127 96359 97942
65792 97942 98159 96628 94982 94915 96139 97016 96642 95330 93514 91415 89660 88959 88999 88792 88351 88865 90838
65775 90838 93203 94812 95748 96516 97038 97314 98102 99878 101762 102562 102440 102616 103783 105620 107502 108812
65759 108812 108940 107810 106181 104756 103382 101714 99946 98042 95149 91113 87752 86951 87915 88182 87236
65744 87236 87169 89513 93340 97080 100348 103078 104550 104535 104234 104880 106328 107932 109673 111382 112024 111089
65728 111089 109793 109498 109779 109526 109114 109651 110587 110063 107729 105432 104732 105286 106175 107336 108817 109719 108996
65711 108996 106766 104093 101797 100025 98641 97581 96925 96783 96978 96916 96241 95524 95710 96801 97738 97694 96912
65694 96912 96101 95620 95394 95060 94115 92653 92013 93694 97245 100103 100198 97996 95403 93478 92016 90668
65678 90668 89364 88005 86770 86517 87864 89914 90918 90321 89251 88769 88618 88134 87465 87085 86778 86089 85581
65661 85581 86575 89456 92930 95282 95840 94971 93285 91433 90153 89628 88930 86910 83733 80841 79251 78687
65645 78687 78605 79100 80132 80793 80339 79446 79369 80179 80923 81321 82037 83235 84119 84327 84671 85941 87846 89611
65627 89611 90737 90681 88932 86201 84544 85193 86994 88093 88439 89207 90267 90118 88498 87295 88056 89839
65611 89839 90656 90228 90076 91186 92756 93440 92875 91458 89305 86392 83688 83112 85643 89907 93476 95456
65595 95456 96916 98698 99994 99796 98822 98846 100484 102671 104177 104687 104421 103627 102654 101733 100528 98624 96648
65578 96648 96094 97689 100580 103427 105590 106877 106974 105812 103953 101882 99355 96127 92863 90482 88780
65563 88780 86683 84020 82241 82970 86242 90511 94095 96316 97513 98335 99037 99185 97997 95200 91672
65548 91672 88985 87931 87580 86280 83762 81662 81455 82364 82203 80214 78061 77700 79186 81206 83087 85249
65532 85249 87867 90008 90472 89030 86570 84262 82812 82425 83182 85051 87380 88821 88408 86757 85513
65517 85513 85483 86010 86413 87040 88109 88433 86648 83406 81012 80762 81809 82908 83998 85403 86532 86473 85414
65500 85414 84445 84103 83909 83391 82842 82888 83704 84888 85905 86649 87708 89849 92870 95189 95197 93155 91194
65483 91194 91154 92795 94445 95011 94816 94556 94065 92490 89515 86097 83873 83833 85529 87490 88379 87816 86285
65466 86285 84489 82907 81761 81105 80870 81011 81666 82986 84695 86130 87002 87875 89438 91353 92469 92308
65450 92308 91676 91367 90950 89685 88234 88275 90178 92150 92363 91124 90088 89922 89884 89571 89760 90998 92338
65433 92338 92336 90927 89557 89550 90949 92862 94345 94838 94341 93583 93814 95925 99623 103472 105865 106163 105133
65416 105133 104223 104287 105084 106087 107410 109442 111804 113439 113866 113676 113484 113053 111961 110452 108898 106937
65400 106937 104084 100896 98463 96780 94712 91826 89169 87722 87051 86283 85596 85716 86485 87020 87015 86758 85963
65383 85963 83864 80846 78789 78966 80313 80733 79795 79259 80917 84568 88269 90152 89866 88663 88284 89450
65367 89450 91209 91918 91002 89519 88842 89137 89546 89600 89699 90021 89710 87859 85026 82998 82962 84500 86526 88527
65349 88527 90533 92500 94421 96615 99139 101073 101208 99505 97266 95748 95274 95851 97768 100999 104582
65334 104582 107351 109023 110042 110603 110535 110014 109632 109576 109357 108679 108180 108874 111131 114578 118813 123683 128816
65317 128816 133387 136788 139397 142297 146169 150728 155270 159385 162918 165804 168494 172164 177617 183998
65303 183998 189610 194317 200109 208569 218715 228409 237186 246078 254875 261408 264296 264939 265650 266786
65289 266786 266915 265083 261367 255520 246829 235851 224923 216076 209121 202486 195269 187652 179913 172065
65275 172065 164355 157249 150849 144987 139957 136378 134059 131675 127993 123084 118024 113795 110841 109306
65261 109306 109107 109776 110608 111049 110855 110023 108768 107410 105993 104124 101462 98352 95687 94196 94005 94790
65245 94790 95941 96569 95795 93470 90556 88566 88400 89742 91602 93367 95138 96949 98093 97811 96523
65230 96523 95577 95428 94790 92343 88797 86393 86396 87890 89084 89037 87965 86612 85725 85597 85667 84963 83269 81460
65212 81460 80421 80089 79930 79783 79660 79117 77553 75122 72833 71772 72448 74644 77467 79817 81267 82312
65196 82312 83432 84346 84813 85628 87689 90214 91255 90370 89541 90602 92730 93646 92673 91220 90275 88926
65180 88926 85986 82058 78967 77548 76937 76063 75023 74683 75481 77079 78910 80601 81872 82295 81342 78746
65164 78746 75033 71702 70385 71389 73304 74535 74954 75444 76034 75608 73796 72148 72481 74575 76422 76616
65148 76616 75690 75091 75619 77089 78824 80094 80428 79994 79561 79792 80473 80548 79090 76470 74475 74765 77001
65131 77001 78998 79093 77827 76679 75796 74056 71121 68184 66463 66047 66621 68303 71107 74284 76842 78313
65115 78313 78666 78191 77913 79193 82016 84285 83776 80515 76506 73556 72242 72543 74278 76841 79442 81757
65099 81757 83704 84766 84390 82998 81647 80632 79401 77918 76997 76987 77291 77731 79224 82252 85524 87155
65083 87155 86627 84764 82391 80013 78303 77660 77439 76723 75890 76343 78545 81289 83269 84462 85526 86629
65067 86629 87536 88298 89098 89653 89369 88123 86594 85862 86696 88893 91119 91838 90833 89512 89389 90549 91997
65050 91997 93167 94453 96423 99149 102257 105057 106566 106131 104280 102485 101819 102300 103737 106527 110961
65035 110961 116179 120648 123799 126666 130774 136701 143824 151137 158117 164832 171289 176840 180605 182725
65021 182725 184693 187856 191746 194601 195509 195242 194839 194255 192989 191229 189478 187431 184192 179510 173965
65006 173965 167861 160877 153139 145912 140662 137808 136747 136548 136090 134088 129945 124627 119950 116808 114528
64991 114528 112079 109330 106796 104679 102679 100514 98150 95609 92988 90662 89059 88096 87132 85635 83747
64976 83747 82111 81249 81084 80834 79471 76675 73466 71492 71475 72731 74403 76579 79595 82720 84459 84254
64960 84254 83141 82589 83246 84883 86770 87796 87038 84767 82399 80962 80250 79952 80682 82826 85053 85453
64944 85453 84042 82736 82635 82778 82120 81374 81813 83174 84024 83823 83573 84521 87053 90672 94234 96201 95595
64927 95595 92984 90031 87871 86309 84614 82584 80734 79880 80591 82583 84547 85042 83721 81390 78956
64912 78956 76841 75360 74843 75055 75171 74790 74516 75100 76392 77555 77972 77605 76881 76591 77468 79293 80847
64895 80847 81289 81273 82079 83942 85945 87280 87793 87417 86032 84031 82198 80758 79322 78003 77638 78402
64879 78402 79040 78304 76641 75571 75750 76482 76985 77179 77154 76706 75795 74856 74267 73941 73793 74178 75438 77300
64861 77300 79184 80885 82415 83210 82162 78815 74346 70997 70458 72698 76132 78733 79184 77478 74724
64846 74724 72289 70807 69886 68914 68074 68208 69532 70924 71098 70322 70172 71344 72530 72216 71050 71268 73715
64829 73715 76553 77561 76941 76946 79034 82336 84956 85928 85603 84781 84098 83958 84456 85233 85620 85026 83269 80753
64811 80753 78386 77065 76969 77425 77568 77008 75904 74738 74094 74193 74365 73524 71571 69862 69666 70569 71193 71243
64793 71243 71773 73321 74782 74659 72772 70217 68189 67367 67971 69715 71866 73776 75211 75908 75345 73552
64777 73552 71766 71482 72887 74902 76724 78619 81068 83835 86277 88069 89134 89130 87577 84615 81330
64762 81330 79099 78465 78719 78717 78135 77744 78388 79939 81422 81889 80994 79038 76785 74985 73703 72355 70736
64745 70736 69560 69416 69663 69290 68687 69445 72258 75984 79120 81264 82634 83094 82500 81407 80615 80333 80450
64728 80450 81289 83278 85948 87943 88153 86611 84397 82938 83036 84130 84805 84498 84317 85631 88198 90412
64712 90412 91170 90747 89979 89419 89356 89854 90613 91349 92337 93914 95528 96105 95497 94654 94170 93594 92550 91473
64694 91473 90618 89311 87196 85429 85466 87007 88286 88267 87537 87109 87404 88567 90691 93182 94541 93411
64678 93411 89618 84165 78703 75066 74432 76349 79041 81103 82497 83625 84257 84138 83981 84735 86123 86962
64662 86962 87012 87416 89009 91111 92441 92416 91043 88411 85211 83111 83417 85403 86905 86701 85605 85245
64646 85245 86477 89077 92108 94168 94070 91861 88870 86392 84775 83982 84297 85881 88157 90345 92292
64631 92292 94224 96054 97567 98893 100062 100489 99775 98692 98338 98485 97892 96255 94602 93572 92624 91489
64615 91489 91099 92198 94054 95555 96637 97508 97321 95145 91859 89530 88956 89203 89636 90767 92559 93475
64599 93475 92362 90373 89712 90876 92171 91809 89620 86782 84661 84053 84860 86187 87023 86959 86066 84446
64583 84446 82518 81590 83158 87221 91901 95222 96793 97296 97048 96023 94985 95279 97116 98931 99075 97608
64567 97608 95861 94757 94382 94836 96452 98982 101300 102356 102061 101088 100239 100124 100959 102296 103262 103301 102445
64550 102445 100896 98870 96958 95857 95367 94392 92481 90738 90469 91487 92541 92911 92687 91989 91091 91047
64534 91047 92819 95715 97915 98703 98965 99252 98865 97498 96382 96757 98245 99766 101107 102395 102913 101974
64518 101974 100388 99484 98968 97389 94738 92816 92540 92517 91244 89582 89775 92588 96493 99525 101086 101867
64502 101867 102636 103408 103640 103028 101883 100682 99647 99156 100107 102883 106073 107308 105790 103183 101641 101744
64486 101744 102745 103840 104498 104449 104218 105003 107087 109006 109283 108368 107693 107354 106165 103839 101525 100035
64470 100035 99013 98256 98497 100150 102367 104133 105376 106194 105907 104017 101563 100332 100817 101820 102027 101263
64454 101263 100230 99616 99548 99482 98635 96903 95179 94449 94796 95690 96900 98511 100319 101962 103502 105088
64438 105088 106065 105362 102994 100385 98759 97854 96735 95307 94419 94737 96115 97837 98998 98824 97291 95490
64422 95490 94845 95710 97028 97613 97503 97782 99223 101491 103671 105205 106104 106566 106816 107245 108223 109541 110371
64405 110371 109963 108188 105251 101343 96941 93112 90866 90223 90461 91250 93022 95987 99308 101611 102144
64390 102144 101317 100272 99971 100403 100588 99686 98174 97534 98580 100507 101854 102047 101641 101386 101585 102200 103019
64373 103019 103642 103727 103497 103887 105912 109722 114153 117379 118361 117788 117263 117433 117347 115897 113441 111409 110604
64356 110604 110612 110966 112121 114832 118857 122738 124961 125231 124606 124394 124976 125811 126542 127648 129697 132222 133945
64339 133945 134124 133263 132390 132064 132138 131997 130801 128091 124625 122214 122052 123297 123917 122951 121354 120508 120468
64322 120468 120111 118556 115982 113348 111902 112710 115819 119683 122152 122508 122032 122108 122283 120965 117762 114189
64306 114189 112001 111675 112741 114698 116970 118659 119197 119022 118973 119183 119152 118708 118170 117676 117060 116481 116426 116845
64288 116845 116935 116181 115050 114284 114031 114172 115018 116961 119587 121909 123553 125148 127327 129825 131845 132954
64272 132954 133241 132828 131732 130288 129338 129711 131569 134402 137561 140631 143313 145209 145991 145796 145369 145640
64256 145640 146982 148763 149701 148932 146855 144820 143932 144293 145387 146867 148748 151143 154175 157927 162054
64241 162054 165607 167738 168637 169276 170178 170989 171456 172267 174368 177654 180833 182630 182985 183156 184773 188588
64225 188588 193890 199208 203670 207564 211602 215960 220107 223147 224204 223075 220868 219414 219487 220092 220095 219831
64209 219831 220085 220097 218151 214240 210577 208960 208907 209094 209255 209539 209160 207297 204644 202472 200527 197540
64193 197540 193782 191228 190767 190952 190412 190030 191484 194665 197974 200546 202838 205337 207972 210706 213565
64178 213565 216041 217449 218059 218997 220897 223450 226374 229952 234353 239232 244217 248988 252606 253788 252381
64163 252381 249867 247856 246754 246301 246441 246741 245773 242329 237133 232371 229577 228663 228867 229718 230959 232279
64147 232279 233460 234470 235340 236181 237201 238270 238673 237816 236051 234356 233317 232999 233539 235117 237360 239479
64131 239479 240993 241701 241169 239152 236610 235341 236311 239081 242909 247400 251808 254911 256309 256934 257619
64116 257619 258099 258239 259257 262480 267418 272291 276038 278635 279867 279336 277776 276939 277639 278974 279971 281013
64100 281013 282975 285825 289041 292906 298397 305804 314103 321912 328782 335524 343416 353047 363863 374947
64086 374947 386136 398059 411143 425173 439935 455556 471710 487136 500755 512923 524726
64075 524726 536029 545099 550430 552321 552245 551071 548371 543254 535495 525836 515455 505151 494920 484330
64061 484330 473334 462631 453182 445510 439536 434880 431098 427788 424846 422702 422055 423116 425175 427075
64047 427075 428178 428828 429816 431469 433408 435318 437718 441657 447539 454561 461558 468246 475370 483764 493596
64032 493596 504548 516367 529067 542773 557484 572816 587858 601403 612408 620219 624541 625655
64020 625655 624754 623440 622291 620064 614745 605480 593210 579599 565772 552170 539145 527269 517130
64007 517130 509019 502945 498945 497245 497769 499400 500196 498933 496400 494761 495527 498450 502284 506139 510050
63992 510050 514819 521606 531197 543198 556144 568761 581071 594028 608296 623720 639873 656744
63980 656744 674756 694205 714744 735397 755095 773164 789254 803058 814613 824880 835447
63969 835447 847099 858857 868783 875746 880268 883790 887410 891403 895867 901674 910400 923012 938820
63956 938820 956292 974810 994836 1016250 1037460 1056819 1074218 1090571 1106338 1121574 1136975
63945 1136975 1153662 1171767 1190211 1208053 1225329 1242539 1260351 1280110 1303491 1330839 1360550
63934 1360550 1391106 1423381 1460127 1503213 1552111 1605197 1661970 1723734 1792304 1868192 1949951
63923 1949951 2035323 2123123 2214079 2310075 2413006 2524295 2644661 2773668 2909927 3052548
63913 3052548 3202388 3361372 3530773 3710944 3902756 4108452 4330728 4571709 4833338
63904 4833338 5118195 5429260 5769267 6141170 6549281 6999367 7497499 8049096 8658826
63895 8658826 9330482 10066377 10867047 11731568 12657547 13640301 14672301 15743768 16843664
63886 16843664 17959746 19077695 20180165 21246279 22251910 23171626 23982186 24665451
63878 24665451 25208555 25602051 25838482 25912275 25819930 25560286 25135786 24554341 23829680 22979570
63868 22979570 22024002 20984834 19885392 18748431 17593752 16437969 15296088 14182380
63860 14182380 13109580 12087864 11124818 10225843 9394183 8630764 7934426 7302545 6731740
63851 6731740 6218327 5758240 5346675 4978144 4647210 4349157 4080012 3836373 3615525
63842 3615525 3415330 3233575 3067697 2915541 2776001 2648215 2530376 2420087 2315784
63833 2315784 2217081 2123673 2034692 1949330 1867349 1788652 1712939 1640168 1570780 1504986 1442276
63822 1442276 1382099 1324702 1270767 1220332 1172525 1126372 1081641 1038852 998595 960917 925494
63811 925494 892413 862325 835386 810396 785880 762012 740543 722484 706730 691477 676250
63800 676250 661745 648342 635830 624429 615021 608115 603156 599182 595791 593189 591439 589925 587697
63787 587697 584474 581199 579216 578801 578769 577626 574719 570303 565079 559796 554508 547897 538256 525661 512217
63772 512217 499379 486133 471026 454945 440035 426500 412725 398683 386757 378214 370846 361678
63760 361678 350614 339746 330049 320722 311371 302876 295768 289203 282137 274632 267572 261797 257775 255348
63746 255348 253462 250770 246940 242876 239370 236092 232333 228230 224668 222123 220024 217365 213828 210309
63732 210309 208203 207935 208363 207956 206355 204347 202645 201462 201025 201295 201084 198811 194724 191161 189728 189374
63716 189374 188335 186832 186270 186605 186501 185782 185667 186331 186229 184583 182729 181889 181112 178812 175370 172732
63700 172732 172075 173158 175341 177823 179271 178822 177558 177735 180218 183662 186397 188169 189669 191171 192081
63685 192081 191370 188356 183697 179638 178421 180162 182960 185253 187252 189797 192841 195824 198855 202575
63671 202575 207030 211391 214815 217296 219628 222640 226280 229540 231593 232965 235032 238387 242322 245933
63657 245933 248802 250356 249721 247030 244102 242834 243208 243599 242718 240653 238454 237417 238374 240793 242803
63642 242803 242875 241406 240041 239693 240031 240566 241213 241793 241977 241951 242289 242883 242769 241336 239132 237183 236034
63625 236034 235702 235939 236196 235792 234488 232602 230537 228758 228306 230376 234833 239853 243756 246748 250175
63610 250175 254475 258739 262138 264958 268026 271655 275377 278352 279847 279643 278225 276427 274762 273051
63596 273051 270747 267640 264390 262290 262092 262897 262656 260308 257194 255816 257299 260565 263873 266429 268460
63581 268460 270636 273867 278838 284986 290568 294721 299085 306232 316464 327370 336867 345461 354806 365200
63567 365200 375832 386799 399238 413413 428155 442797 458603 477492 499957 524900 551057
63556 551057 577962 605840 635093 665761 697192 728587 760068 792657 826708 860834 892892
63545 892892 921438 945628 964432 977075 984083 986876 986419 983197 978359 973604 969520 964988 958702
63532 958702 950429 940274 927568 911469 892258 871193 849052 825404 799548 771997 744955 721143
63520 721143 701787 685674 670476 655029 640043 626877 616358 608755 603773 600139 596232 591981
63508 591981 589366 590059 593107 596043 597948 600286 604853 612238 622457 635723 651778 669380 687433
63495 687433 706303 727267 750865 776423 803139 831080 860954 893105 926748 960071 991229
63484 991229 1019305 1044088 1064891 1080229 1089170 1092594 1092541 1090565 1087287 1083156 1078591 1073266 1066259 1057261
63470 1057261 1046789 1034718 1019425 999230 974120 945265 913383 878616 841749 804312 767349
63459 767349 731144 696355 664298 635511 608952 583375 558867 536191 515178 494774 474604
63448 474604 455690 439487 426709 417007 409198 401725 393452 384365 375382 367463 361056 356231 353002
63435 353002 351392 351235 351736 351299 348488 343762 339854 339622 343436 349038 353882 357150 359766 363168 368156
63420 368156 374323 380380 385395 389740 394445 399692 404429 407469 408501 407948 406310 403828 400450 396134
63406 396134 391408 387388 384752 382976 381242 379878 379996 381810 384344 387002 390335 394850 400051 405397
63392 405397 411424 419026 428016 437149 445376 452602 459453 466762 475064 484154 493278 502053 511012 521100
63378 521100 532900 546524 561854 578704 597157 617905 641766 668629 697382 727215 758468
63367 758468 791907 827821 866211 907280 951070 997049 1044515 1093047 1142166 1191002 1238624
63356 1238624 1284138 1326121 1362784 1393242 1417833 1436613 1448580 1453383 1452773 1448919 1441964 1430846
63344 1430846 1416209 1400633 1385646 1369890 1350762 1326831 1298256 1265955 1230952 1193837 1154401
63333 1154401 1112515 1069615 1028415 990678 956017 923317 892454 863974 837903 813866 792055
63322 792055 773293 758253 747031 739251 734131 730800 729089 729818 733877 741269 751440 764169 779595
63309 779595 797662 818242 841637 868179 897235 927372 957894 989728 1024357 1062124 1101941
63298 1101941 1142395 1182642 1222252 1260669 1297010 1330012 1357955 1379024 1392272 1398268 1398538 1394444
63286 1394444 1386869 1376701 1364868 1351702 1336817 1319908 1301175 1280642 1257570 1231066 1200997
63275 1200997 1167912 1132446 1095288 1057341 1019269 981110 942874 905383 869925 837298 807637
63264 807637 780844 756497 733675 711734 691102 672437 655226 638362 622112 608190 597422
63253 597422 588507 579765 571153 563696 557733 552812 548829 546171 544775 543981 543433 543447 544249 545301 545656 544767
63237 544767 542861 540640 538603 536562 533882 530339 526570 523448 521136 518975 516316 513319 510910 510025
63223 510025 510819 512561 514290 515548 516456 517292 518303 519815 522148 525235 528507 531307 533434 535434 538358
63208 538358 542927 548672 554312 559363 564878 571941 579906 587128 593228 599420 606460 613555 619894 626152
63194 626152 633625 642607 652622 663731 676549 691063 706321 721489 736691 752558 769246 786157
63182 786157 802876 820400 841045 866342 895126 924512 953038 981984 1013277 1047122 1082410
63171 1082410 1118495 1155477 1193301 1231614 1270226 1308796 1346418 1382578 1418247 1454874 1492280
63160 1492280 1528673 1562904 1595668 1628192 1660673 1692416 1722513 1749701 1772258 1788954 1799797
63149 1799797 1805193 1804595 1796708 1781034 1758620 1731025 1699016 1662647 1622517 1580462 1538781 1498941
63137 1498941 1461258 1425761 1392963 1363744 1338838 1318539 1302563 1290085 1280499 1274447 1273565 1278583
63125 1278583 1288048 1299593 1312226 1326710 1343911 1363718 1385670 1409680 1435536 1462139 1487918
63114 1487918 1511859 1533842 1554114 1572850 1590289 1606947 1623350 1639330 1653699 1664784 1671270
63103 1671270 1672420 1667785 1657304 1641755 1622318 1599252 1571587 1538757 1502122 1464173 1426455 1388937
63091 1388937 1351192 1313423 1276279 1240383 1206282 1174487 1145421 1119491 1096891 1076964 1058163
63080 1058163 1039390 1021238 1005251 992136 981452 972774 966064 960780 955746 950347 945048 940297 935715
63067 935715 930947 926654 924006 923524 924817 927064 929419 931323 932863 934546 936629 939114 942376 947015
63053 947015 952772 958416 963231 967865 973155 978814 983973 988370 992244 995623 998657 1002223 1007245 1013666
63039 1013666 1020926 1029065 1038283 1047698 1055872 1062764 1070056 1079154 1089774 1100934 1112320 1123981 1135411
63026 1135411 1145833 1155154 1164086 1173501 1184097 1196291 1209804 1223569 1236751 1249854 1264330 1281042
63014 1281042 1299604 1319263 1339782 1361223 1383441 1406454 1431050 1458337 1488591 1521006 1554722
63003 1554722 1589651 1626096 1664192 1704319 1747633 1795289 1847108 1901823 1958955 2019601 2084790
62992 2084790 2153708 2224455 2296211 2369640 2445120 2521641 2597935 2673985 2750703 2828432 2906362
62981 2906362 2983211 3058000 3130387 3200800 3270173 3338944 3406315 3471123 3533406 3594118 3652835
62970 3652835 3706612 3752016 3787735 3814194 3831010 3836139 3827608 3804812 3767841 3716982 3653851 3581854
62958 3581854 3504271 3422516 3337421 3251515 3168429 3090257 3017095 2949202 2887964 2834308 2787881
62947 2787881 2748640 2717798 2696036 2681940 2673704 2671515 2676706 2689030 2706502 2727912 2753842 2784756
62935 2784756 2819414 2855880 2893007 2930110 2965984 2999351 3030065 3058972 3086483 3111793 3133533
62924 3133533 3150672 3162463 3167776 3164917 3152329 3129416 3096591 3054523 3003557 2943797 2875470 2799070
62912 2799070 2715581 2626933 2535862 2444664 2354045 2263614 2173530 2085278 2000854 1921609 1847856
62901 1847856 1779132 1714707 1654322 1598575 1548241 1502978 1461100 1420898 1382046 1345627 1313022
62890 1313022 1284802 1260264 1237842 1216198 1195106 1175172 1156851 1140232 1125635 1113510 1103380
62879 1103380 1093601 1082817 1071230 1059908 1049376 1039567 1030638 1022819 1015588 1008003 999960 992172 984734
62866 984734 976666 967398 957772 948826 940252 931016 921141 911849 903984 897197 890821 884710 878987 873716
62852 873716 869262 866280 864714 863343 861010 857978 855369 853524 851736 849591 847720 846929 847172 847662 847576
62837 847576 846427 844294 841990 840637 840773 842138 844412 847567 851189 854129 855520 855672 855300 854216 851668
62822 851668 847872 844264 841925 840332 838029 834151 829083 823909 819399 815310 810552 804192 796356 788093
62808 788093 780487 774088 768875 764288 759542 754516 750228 747694 746226 743685 738795 732638 727454 724443
62794 724443 723173 722674 722391 722048 721152 719040 715615 711950 709704 709488 710061 709663 707975 706094 704886 704411
62778 704411 704980 707394 711488 715468 717687 718523 719747 722573 727025 732638 738858 745080 751043 756943 762647
62763 762647 767321 770573 773394 777103 781889 787244 793118 799518 805609 810680 815644 822031 829763 837609
62749 837609 845644 855287 866683 878210 889253 901306 915225 929421 942465 955819 971973 991045
62737 991045 1011389 1032778 1056688 1083617 1112393 1142519 1175408 1212576 1253955 1298603 1346115
62726 1346115 1396884 1451845 1512308 1579173 1651934 1729283 1810852 1897420 1989249 2085507 2185824
62715 2185824 2291125 2402080 2517669 2636126 2756300 2876910 2995137 3107211 3210149
62706 3210149 3301922 3380274 3442649 3487412 3514132 3522402 3511231 3479993 3429421 3361385 3278254
62695 3278254 3182804 3078118 2966751 2849984 2728411 2603523 2478486 2357064 2241689 2132643
62685 2132643 2029040 1930234 1836095 1746475 1661301 1581339 1508154 1442832 1385080 1333850 1288318
62674 1288318 1247709 1210654 1175614 1142000 1110375 1081485 1055596 1032860 1013731 998561 986981
62663 986981 977985 970605 964412 959507 956228 955012 956441 961166 969482 980983 994795 1010211 1026973
62650 1026973 1045031 1064429 1085535 1109066 1135696 1165821 1199672 1237328 1278610 1323502 1372793
62639 1372793 1427644 1488252 1553585 1622833 1696449 1775144 1858408 1944659 2032355 2120225 2206925
62628 2206925 2291324 2372682 2449541 2518798 2577104 2623123 2657248 2679022 2686188 2676786 2651075 2610733
62616 2610733 2557201 2491721 2416377 2333967 2246825 2156231 2062902 1967721 1872212 1778538 1688829
62605 1688829 1604227 1524701 1449792 1379211 1312796 1250507 1192579 1139151 1089670 1043390 1000612
62594 1000612 962553 929572 900319 873085 847224 822696 799132 776310 754948 736028 719623
62583 719623 705107 692010 679780 667289 653839 640544 629460 621124 613809 605498 595924 586559
62571 586559 579333 575442 574611 575227 575723 576002 577015 579087 581456 583485 585324 587091 588351 588986 589799 591732
62555 591732 595119 600187 607464 616882 627175 637273 647982 661244 677747 696165 714867 733565
62543 733565 753092 774383 798115 824768 854375 886477 920675 957041 995808 1037112 1081489
62532 1081489 1130124 1183762 1241399 1300861 1360804 1421280 1481978 1540820 1595145 1643682 1686342
62521 1686342 1722474 1750665 1770279 1781791 1785039 1778436 1760887 1733561 1698728 1657565 1610405 1558620
62509 1558620 1504673 1450193 1395246 1339803 1284829 1231562 1180716 1132860 1088611 1047849 1009513
62498 1009513 972887 938465 907020 878474 852344 828667 807711 789256 772897 758510 745590
62487 745590 732671 718598 704245 691928 683064 677183 672982 669201 664397 657337 648396 639754 633545
62474 633545 630341 629783 631677 635589 640124 643833 646692 649883 654286 660082 667687 678000 691439 707515
62460 707515 725724 746182 768979 793545 819275 846425 875842 907960 942491 979056 1017853
62449 1017853 1059675 1105129 1153401 1201818 1247431 1289545 1329939 1369832 1407199 1438102 1460294
62438 1460294 1474281 1480991 1480026 1470925 1454924 1434161 1409584 1380546 1346287 1307126 1264416 1220114
62426 1220114 1176311 1134417 1094555 1056090 1018861 983616 951317 922283 895937 871193 847384
62415 847384 825207 806410 791938 780499 769596 758039 746883 737880 731646 727484 724384 721734
62403 721734 719370 717344 715687 714332 713335 713056 713910 716168 720230 726753 735768 745811 754820 762267 769850
62388 769850 779680 792180 806028 819696 832573 844857 856860 868458 878994 887681 894047 897917
62376 897917 899136 897549 893137 885838 875399 861877 846210 829743 813237 796886 781159 766719
62364 766719 753300 739499 724206 707798 691812 678005 667792 661556 657953 654662 650374 645403
62352 645403 640136 634182 627937 623679 623497 626749 631116 635773 641742 649108 655896 660581 664318 669513
62338 669513 677002 685735 694753 704284 714935 726773 739566 753383 768366 783913 798360 809795
62326 809795 817488 822596 827306 833054 839553 845509 850139 853902 857909 862930 869198 876927 886443 897544
62312 897544 909217 920702 932659 946632 963477 983199 1006452 1035001 1070025 1110766 1155694
62301 1155694 1204341 1257093 1313814 1373895 1437404 1504919 1576105 1649363 1722982 1795673 1865776
62290 1865776 1930947 1989181 2039556 2081580 2114410 2137166 2149586 2151918 2144347 2126895 2099832 2064154
62278 2064154 2021685 1974423 1923422 1868588 1810074 1749604 1689698 1631707 1575313 1519930 1465827
62267 1465827 1413793 1364469 1318105 1274257 1231641 1189097 1146859 1106204 1067872 1031765 998241
62256 998241 968454 942949 920968 901710 885225 871473 859555 848696 839130 831128 824091 817635
62244 817635 812727 810474 810332 810781 811421 813087 816043 819370 822262 824817 827244 829242 830500 831095 831127 830563
62228 830563 829670 829016 828794 828713 828860 830181 833683 839403 846469 854157 862731 873224 886224 900921 915760
62213 915760 930279 945906 964478 986302 1010160 1034940 1060647 1088014 1117833 1150729 1187064
62202 1187064 1226955 1270628 1318615 1371217 1427983 1488104 1551103 1616708 1684298 1752934 1821570
62191 1821570 1888655 1951896 2009123 2059121 2100944 2132913 2153337 2162000 2159892 2147583 2124919 2092310
62179 2092310 2051062 2002241 1946392 1884822 1819962 1753825 1687034 1620103 1554806 1493306 1436342
62168 1436342 1383060 1332554 1285099 1242040 1204719 1173293 1146383 1122085 1099381 1078427 1059852
62157 1059852 1044402 1032845 1025161 1019866 1015230 1011188 1008915 1008504 1008690 1009247 1011911 1017949 1026276 1035073
62143 1035073 1043842 1052460 1059591 1063985 1066690 1070102 1075215 1081417 1088514 1096977 1106224 1114759 1122577 1131804
62129 1131804 1144116 1158746 1173841 1188755 1204113 1220394 1237397 1254877 1273034 1292469 1313812
62118 1313812 1337079 1361290 1385111 1408046 1430741 1454378 1480252 1509672 1543351 1580840 1621407
62107 1621407 1665540 1714597 1768692 1825822 1883614 1941217 1998921 2056390 2111739 2162051 2204648
62096 2204648 2238330 2263607 2281436 2291950 2295025 2291740 2283892 2271840 2254178 2230205 2201655 2171123
62084 2171123 2139747 2107409 2074504 2042427 2012614 1985942 1962719 1942497 1924204 1907146 1891608
62073 1891608 1877943 1865621 1853949 1843161 1833857 1825741 1818019 1810908 1805684 1803087 1802472 1802745 1803538 1805320
62059 1805320 1808979 1815474 1825405 1838554 1853952 1870444 1887309 1904756 1924004 1946349 1971745 1998843
62047 1998843 2026839 2056642 2089617 2125906 2164748 2205538 2247337 2288030 2325666 2360691 2395489
62036 2395489 2431592 2468508 2505278 2541819 2578417 2615115 2651932 2688545 2723666 2756182 2787341
62025 2787341 2820223 2856224 2893515 2930034 2966666 3006118 3049683 3096634 3146080 3197804 3251535
62014 3251535 3306923 3364323 3424508 3487502 3552524 3619041 3687054 3756435 3826824 3898211 3970927
62003 3970927 4045123 4120767 4197691 4274776 4349448 4419076 4482745 4540689 4592402 4636876 4674652
61992 4674652 4707761 4736864 4760017 4775414 4784272 4789686 4793345 4794758 4793420 4790317 4787134 4784925 4783945
61979 4783945 4784138 4785422 4787774 4791319 4796224 4802545 4810316 4819636 4830422 4842260 4854808 4868258 4883019
61966 4883019 4899012 4915424 4930970 4944176 4953985 4960855 4967012 4974641 4983594 4991578 4996853 4999916 5002151
61953 5002151 5003799 5004317 5004190 5004973 5007339 5010065 5011511 5011378 5010486 5009427 5008151 5006520 5004503 5001973 4999053
61938 4999053 4996743 4996448 4998572 5002007 5005276 5007748 5009479 5010362 5009971 5008049 5004641 4999664 4992696 4983341 4971753
61923 4971753 4958662 4944852 4930568 4915638 4900256 4885299 4871375 4857818 4843305 4827469 4811081
61912 4811081 4794550 4777221 4758668 4739644 4720825 4701357 4679885 4656722 4633806 4612498 4592312
61901 4592312 4571848 4550025 4526302 4500721 4474119 4447609 4421561 4395744 4370500 4346789 4324708
61890 4324708 4303051 4281058 4259797 4240895 4224373 4208694 4192746 4177108 4163392 4152877 4145687
61879 4145687 4140900 4137581 4135999 4137576 4143295 4152488 4163656 4176176 4190800 4208735 4230711 4256670
61867 4256670 4285813 4317180 4350744 4387819 4430003 4477885 4531181 4589751 4653921 4724197 4801392
61856 4801392 4886761 4981181 5084443 5196341 5318471 5453876 5604653 5770865 5952278 6150374
61846 6150374 6368077 6608240 6873152 7165084 7486524 7839876 8227199 8649980 9108671
61837 9108671 9602586 10130364 10689909 11276921 11883134 12495951 13099314 13674236 14198598
61828 14198598 14647563 14995867 15221670 15310433 15257253 15066815 14751420 14328528 13818746 13243991
61818 13243991 12625422 11981810 11329179 10681232 10049302 9441651 8863424 8317825 7807300
61809 7807300 7333286 6895222 6490826 6118016 5776210 5465184 5182948 4925594 4689431
61800 4689431 4472549 4274029 4092490 3926123 3773601 3634001 3506078 3388477 3280557
61791 3280557 3182122 3092295 3009572 2933231 2863848 2801999 2747052 2697600 2652441 2610782 2572120
61780 2572120 2536382 2503715 2473814 2446116 2420999 2399800 2382843 2368322 2354346 2341594 2332547
61769 2332547 2328195 2326879 2326640 2327403 2330112 2334842 2340884 2348255 2358005 2370963 2386927 2405229 2425411
61756 2425411 2447090 2469844 2493977 2521105 2553109 2590193 2630630 2672875 2717427 2766040 2819668
61745 2819668 2878149 2941609 3010825 3086003 3166561 3252779 3346427 3448590 3557803 3671745 3790418
61734 3790418 3916303 4051535 4196290 4350032 4513066 4686384 4870957 5067681 5277214
61725 5277214 5499577 5734752 5984216 6251128 6538520 6848089 7181455 7541838 7933548
61716 7933548 8360126 8823889 9327221 9873496 10466566 11109890 11806628 12560475 13375836
61707 13375836 14256285 15201879 16207698 17265037 18363251 19488809 20621571 21732232
61699 21732232 22783523 23733448 24538101 25154865 25547593 25692467 25581583 25223403 24640953
61690 24640953 23867991 22943525 21907008 20796194 19646171 18487096 17341692 16225743
61682 16225743 15151362 14129046 13166737 12268463 11434923 10664912 9955989 9304995 8709058
61673 8709058 8165679 7671114 7219421 6804386 6422395 6072528 5753913 5463958 5199209
61664 5199209 4956789 4734323 4529300 4339583 4164405 4004041 3858304 3725722 3604085
61655 3604085 3491224 3385208 3284594 3189087 3099594 3016974 2940756 2869418 2801736 2737310 2676009
61644 2676009 2617669 2562535 2511152 2463405 2418242 2374908 2333886 2295900 2260300 2225253 2189495
61633 2189495 2153211 2117168 2081751 2047168 2014009 1982976 1954074 1926342 1898511 1870050 1841681
61622 1841681 1814800 1790236 1767678 1746369 1726025 1706700 1688186 1670200 1653113 1637795 1624628
61611 1624628 1613132 1602625 1592685 1582757 1571975 1559820 1546637 1533152 1519733 1506427 1493430 1481129
61599 1481129 1469752 1459257 1449484 1440215 1431182 1422265 1413672 1405811 1398974 1393179 1388313 1384336 1381285
61586 1381285 1378945 1376664 1373866 1370875 1368724 1367829 1367320 1366228 1364883 1364413 1365214 1366840 1369216 1372826 1377409
61571 1377409 1381591 1384350 1386153 1388175 1391000 1394521 1398396 1402023 1404649 1406067 1406828 1407374 1407525 1407236 1407101
61556 1407101 1407364 1407003 1404596 1399761 1393153 1385568 1377746 1370506 1364082 1357645 1350399 1342859 1336152 1330285
61542 1330285 1324105 1316907 1309088 1301209 1293325 1285352 1277337 1269393 1262197 1257430 1256580 1259096 1262710 1265850
61528 1265850 1268768 1272130 1275837 1279840 1284941 1291728 1299526 1307484 1316169 1327037 1340612 1356140 1372914
61515 1372914 1391125 1411360 1433935 1458909 1486374 1516714 1550597 1588246 1628414 1668773 1708070
61504 1708070 1747345 1788067 1829540 1869496 1907174 1944307 1982473 2020788 2057087 2090442 2121430
61493 2121430 2150657 2178330 2204974 2231166 2256363 2279175 2299145 2317206 2333780 2347435 2356332
61482 2356332 2360373 2360964 2359156 2355066 2348855 2341027 2331680 2320677 2308986 2298799 2291641 2287073 2283915
61469 2283915 2281991 2281945 2284012 2288109 2294893 2305588 2320681 2339671 2362434 2390113 2424230 2465320 2512869
61456 2512869 2566380 2626186 2693175 2767989 2850811 2942041 3042813 3154239 3276175 3407677
61446 3407677 3549018 3702450 3870254 4052716 4248817 4458169 4680915 4915882 5160032
61437 5160032 5409777 5661586 5910814 6150709 6373065 6569562 6732869 6857661 6941212 6982767
61427 6982767 6982624 6942582 6866885 6761246 6630668 6479330 6312655 6137640 5960228 5783598
61417 5783598 5610036 5443196 5287125 5143844 5013260 4895048 4789529 4697228 4618797 4555087
61407 4555087 4506189 4470670 4446795 4434261 4433652 4444537 4465487 4495888 4536208 4585983 4642781 4703901
61395 4703901 4768280 4836123 4907235 4980451 5054358 5128059 5201466 5275082 5349175 5422796 5493853
61384 5493853 5560507 5622433 5680582 5735816 5787908 5835726 5878306 5915786 5949246 5979585 6006726
61373 6006726 6030045 6049266 6064616 6076425 6085060 6091146 6095379 6098089 6099238 6098552 6095319 6088385 6077087
61360 6077087 6062165 6045198 6027134 6007957 5987738 5967334 5947775 5929406 5911845 5894455 5876778
61349 5876778 5858813 5840950 5823278 5804936 5784457 5760819 5734046 5705060 5675397 5646750 5620128
61338 5620128 5595449 5572481 5552112 5536183 5526257 5523325 5528674 5544240 5571916 5613126 5669114 5740853
61326 5740853 5828408 5931166 6049082 6183263 6335156 6505661 6695037 6902907 7128043 7368612
61316 7368612 7622526 7886619 8155479 8422233 8680729 8925673 9150194 9345048 9501657
61307 9501657 9615213 9683858 9706174 9681460 9612006 9503121 9360417 9188039 8989443 8768372
61297 8768372 8528633 8274064 8009286 7739530 7469052 7200299 6934974 6675230 6423463
61288 6423463 6181788 5952367 5737463 5538227 5353849 5182865 5025296 4882826 4756886
61279 4756886 4647280 4552776 4472417 4405792 4352360 4311053 4280742 4260925 4251761 4253309 4264827
61268 4264827 4285033 4312949 4348031 4389365 4435302 4484509 4537103 4593942 4654602 4716554 4776670
61257 4776670 4833216 4886074 4935413 4980671 5020807 5055170 5084024 5108334 5128888 5145463 5157034
61246 5157034 5162969 5163651 5159442 5149474 5132397 5108364 5079283 5046625 5009829 4967596 4920177 4869457
61234 4869457 4817051 4763266 4707962 4651463 4594254 4536457 4478251 4420558 4364870 4312273 4262828
61223 4262828 4215950 4171374 4129604 4091142 4055284 4020162 3984380 3948338 3913535 3880803 3849653
61212 3849653 3819027 3788123 3756696 3725351 3695572 3668759 3645094 3623903 3605178 3590118 3580106
61201 3580106 3575764 3577073 3583687 3595167 3611836 3635627 3668948 3712112 3762763 3818680 3880531 3951203
61189 3951203 4033021 4126278 4229586 4340416 4455521 4571871 4687107 4798258 4900260 4986857
61179 4986857 5053208 5096831 5116017 5108450 5072147 5007391 4917322 4806817 4680870 4543484 4397552
61168 4397552 4245658 4090915 3936911 3786978 3643732 3508975 3383392 3266427 3157155
61159 3157155 3055544 2962453 2878368 2802709 2734569 2673480 2619037 2570353 2526513 2487301 2452884
61148 2452884 2422889 2396394 2372894 2352805 2336783 2324947 2316996 2312810 2312536 2316152 2323270 2333311
61136 2333311 2345495 2358468 2370362 2379697 2386266 2390809 2393772 2394576 2392121 2385783 2375831 2363050 2348070
61123 2348070 2330976 2311510 2289578 2265340 2238817 2210010 2179873 2150607 2123997 2099507 2074918
61112 2074918 2048913 2022068 1995133 1967719 1939426 1911164 1884136 1858204 1832468 1806963 1782416
61101 1782416 1758504 1733831 1707929 1682070 1657523 1633889 1609794 1584666 1559346 1535293 1513360
61090 1513360 1492769 1471069 1445877 1417132 1387065 1357574 1328414 1298577 1268589 1240244 1214415
61079 1214415 1190381 1167399 1145806 1126206 1108585 1093006 1080425 1071780 1066458 1062603 1059109 1056583
61067 1056583 1056151 1058022 1061626 1066477 1072231 1078403 1084860 1092374 1101785 1112669 1123705 1134437 1145643
61054 1145643 1157662 1169524 1180502 1191505 1203784 1216841 1228901 1239202 1248538 1257480 1265245 1270760
61042 1270760 1273876 1274999 1274261 1271758 1268206 1264775 1262327 1260924 1259757 1257474 1253196 1247542 1242174 1237950
61028 1237950 1234003 1228967 1222604 1215684 1208813 1202146 1196010 1190963 1187206 1184554 1183001 1182700 1183236 1183595 1183189
61013 1183189 1182447 1182091 1182278 1182882 1184179 1186681 1190413 1194894 1199788 1205116 1210821 1216552 1221948 1226793 1230875
60998 1230875 1234160 1237243 1241126 1246340 1252644 1259677 1267300 1275064 1282110 1288224 1294468 1302101 1311349 1322045
60984 1322045 1334989 1351591 1372219 1395816 1421108 1447483 1474885 1503985 1536351 1573282 1614353
60973 1614353 1658311 1705506 1757915 1816350 1879306 1945514 2016060 2092642 2175025 2262008 2354175
60962 2354175 2453784 2561970 2677607 2799286 2927409 3063996 3211031 3369120 3537252 3713793
60952 3713793 3897892 4089676 4289208 4496316 4712035 4939234 5181013 5439387 5716464
60943 5716464 6015783 6341155 6694926 7078736 7495453 7949510 8446754 8995915 9609607
60934 9609607 10302361 11088452 11982874 13002833 14166455 15491987 17000098 18713125 20648104
60925 20648104 22816050 25234278 27923691 30854645 33866605 36655697 38890434 40385648
60917 40385648 41187283 41503362 41568541 41568643 41641116 41864552 42192187 42404695 42180957 41267257
60907 41267257 39611118 37357162 34736354 31958386 29172047 26474581 23927443 21565790
60899 21565790 19407935 17462390 15727110 14187788 12824105 11618667 10558002 9627678
60891 9627678 8811478 8095125 7466923 6914819 6426560 5993354 5610138 5271312 4968867
60882 4968867 4695587 4447614 4222745 4018425 3832575 3664153 3511153 3369400 3234819
60873 3234819 3105917 2982900 2865477 2752898 2645384 2544124 2449938 2362624 2281332 2205053
60863 2205053 2133116 2065566 2002577 1943260 1885714 1828694 1772630 1718646 1667222 1618177 1571198
60852 1571198 1525736 1480994 1436802 1394319 1355276 1320467 1289068 1259252 1229412 1199073 1168798
60841 1168798 1139205 1110417 1082692 1056929 1033748 1012455 991978 972667 956011 942513 930916
60830 930916 919718 908375 896815 885009 873627 864171 857736 854207 852943 853340 854431 855102 855428 856866
60816 856866 860313 864835 869194 873780 879888 887590 895555 902765 909375 915852 922173 928019 933133 937309
60802 937309 940577 943522 946988 951286 955899 960060 963462 966479 969958 974745 981124 988490 995641 1001516
60788 1001516 1005907 1009551 1013330 1017255 1020552 1023047 1025975 1030706 1036908 1042873 1047638 1051855 1056288 1060435
60774 1060435 1063262 1064703 1065742 1067294 1069448 1071641 1073262 1074326 1075758 1078785 1083912 1090731 1098668 1107379
60760 1107379 1116448 1125432 1134482 1144288 1155027 1165911 1176154 1185906 1195823 1206038 1215908 1224511 1231187
60747 1231187 1235892 1239131 1241355 1242539 1242688 1242292 1241479 1239039 1233524 1225279 1216151 1207054 1197270 1186476
60733 1186476 1175821 1166156 1156648 1146265 1135456 1125183 1115429 1105990 1097704 1091321 1085907 1079978 1073782
60720 1073782 1068952 1066307 1065462 1066297 1069144 1073589 1078689 1084472 1091807 1100623 1109755 1118826 1128784 1140158
60706 1140158 1152307 1165055 1179649 1197012 1216097 1235126 1253730 1272737 1292321 1311460 1329108
60695 1329108 1345040 1359499 1372703 1384919 1396687 1408682 1421249 1433854 1445168 1454124 1461032 1467202
60683 1467202 1473448 1479467 1484750 1489203 1492407 1493168 1490739 1486227 1481786 1478425 1475244 1470887 1465063 1458348
60669 1458348 1451119 1443191 1434274 1424365 1413809 1403373 1394180 1387029 1381497 1376093 1369653 1362338 1354882
60656 1354882 1347214 1338609 1329222 1320505 1313653 1308322 1303608 1299756 1297965 1298580 1300329 1301593 1301852 1301690 1301833
60641 1301833 1302446 1303024 1302782 1301464 1300008 1300087 1302598 1306569 1309818 1310814 1309852 1308403 1307423 1306529 1304771 1301762
60625 1301762 1297689 1292628 1286667 1280702 1276171 1273429 1270908 1266421 1258974 1248993 1237385 1225012 1212661
60612 1212661 1200668 1188591 1175778 1162201 1148375 1134736 1121629 1109606 1099059 1089614 1080534 1071746
60600 1071746 1064006 1058004 1053660 1050238 1046882 1043260 1039988 1038177 1038250 1039563 1041483 1044278 1048454 1053840
60586 1053840 1059928 1066293 1071919 1075108 1075470 1075311 1077317 1081224 1084588 1086748 1089793 1094930 1100003 1102097
60572 1102097 1101409 1101084 1103824 1109803 1117452 1125202 1132591 1140352 1149396 1159519 1169480 1178556 1187395 1197080
60558 1197080 1208194 1221210 1236875 1255392 1275865 1297301 1319696 1343489 1368522 1394128 1419623
60547 1419623 1443969 1465609 1483574 1498411 1511153 1521716 1529054 1532523 1532250 1528510 1521694 1512694 1502352
60534 1502352 1490501 1476381 1460087 1442933 1426338 1410946 1396798 1383632 1370863 1357892 1344779
60523 1344779 1332365 1321637 1313085 1306417 1300574 1294342 1287484 1281137 1276682 1274342 1273186 1272103 1270330
60510 1270330 1267584 1264531 1262819 1263685 1266547 1269735 1272551 1275715 1279800 1284297 1288591 1293047 1298585 1305708
60496 1305708 1314458 1324975 1337648 1352817 1370456 1390043 1410848 1432755 1456798 1484476 1516412
60485 1516412 1551891 1589562 1628308 1667766 1708635 1752261 1799151 1847867 1895964 1941786 1984431
60474 1984431 2022096 2051846 2071522 2080884 2080444 2070434 2051908 2027842 2001700 1975219 1948721 1923353
60462 1923353 1901679 1885777 1875774 1870762 1870376 1874835 1883878 1896446 1911475 1928626 1948183 1970481
60450 1970481 1995560 2023156 2052969 2085267 2121607 2164833 2217653 2280798 2352950 2432958 2521778
60439 2521778 2621741 2734399 2860215 3000265 3156817 3331534 3524161 3733880 3961129 4207009
60429 4207009 4471674 4754949 5058386 5384798 5734579 6102593 6478073 6845600 7185331
60420 7185331 7474216 7690087 7816245 7843035 7767078 7591650 7328422 6996822 6619495 6217226
60410 6217226 5806982 5402316 5013277 4645662 4301552 3981455 3685982 3415920 3171642
60401 3171642 2952800 2758024 2584638 2429300 2289515 2164246 2052660 1952695 1861596 1777854
60391 1777854 1701950 1634926 1576508 1524814 1477576 1433353 1391744 1352806 1316460 1282384 1250408
60380 1250408 1220954 1194958 1173073 1154717 1138020 1121055 1103344 1086094 1070938 1058641 1048949
60369 1048949 1041112 1034046 1026466 1017659 1008111 998781 989858 981005 972672 965958 960654 954681 946612 938133
60355 938133 932718 931889 933793 935556 936090 936314 937458 939889 943296 947348 951884 956607 961005 964974 969439
60340 969439 975702 983877 992548 1000461 1007936 1015916 1024200 1031688 1038101 1044283 1050665 1056516 1061125 1064895
60326 1064895 1068813 1073484 1079037 1085304 1091577 1096701 1100038 1102078 1103790 1105546 1106880 1106944 1105150 1101865
60312 1101865 1098712 1097588 1098937 1101301 1102841 1103014 1102671 1103046 1104850 1107822 1110856 1112954 1114217 1115456 1116926
60297 1116926 1118318 1120213 1124441 1132292 1143068 1154921 1166415 1176793 1185749 1193892 1202750 1213225 1224476
60284 1224476 1235055 1244552 1253221 1260814 1267038 1272661 1278683 1284504 1288282 1289262 1288699 1288322 1288775 1289600 1289990
60269 1289990 1289590 1289296 1290890 1294852 1298942 1300310 1298852 1296916 1295748 1294006 1290073 1283934 1275965 1265745
60255 1265745 1253369 1240656 1229645 1220707 1213157 1206822 1201876 1198089 1195417 1194492 1195192 1195545 1193593 1189918
60241 1189918 1186967 1186209 1187305 1189549 1192466 1195138 1196656 1197502 1199044 1201322 1202689 1201999 1199822 1197016 1193461
60226 1193461 1189090 1185045 1182720 1182234 1182696 1183593 1185270 1188459 1193856 1201692 1211205 1221037 1230762 1241582
60212 1241582 1254933 1270769 1287816 1305082 1322366 1339535 1356236 1372529 1389183 1407041 1426291
60201 1426291 1446495 1467140 1488001 1509021 1530024 1550820 1571800 1594280 1619806 1649061 1681653
60190 1681653 1716949 1754758 1795324 1839168 1887000 1939282 1995922 2056978 2123552 2197021 2277314
60179 2277314 2363162 2454637 2554198 2664087 2783391 2908861 3038274 3171788 3310237 3453268
60169 3453268 3599324 3746360 3892071 4033892 4169125 4295034 4409224 4510658 4600016 4678152
60159 4678152 4744064 4795183 4829839 4848786 4854184 4847893 4831161 4805343 4772436 4735245 4697259 4661932
60147 4661932 4631683 4607789 4591306 4583676 4586379 4600545 4627140 4667031 4720642 4787995 4869270 4964688
60135 4964688 5073501 5193623 5322595 5458354 5598624 5740154 5879284 6012834 6137839
60126 6137839 6250819 6348338 6428456 6490963 6535938 6562506 6569273 6555691 6522710 6472297 6406592
60115 6406592 6327760 6238505 6142337 6043021 5943977 5848554 5760508 5683325 5618967 5568074 5531625
60104 5531625 5511468 5508690 5522418 5551156 5594515 5652328 5722502 5801142 5884922 5972108 6060941
60093 6060941 6148345 6230981 6306779 6374693 6433792 6483606 6524908 6559027 6586459 6607237 6622993
60082 6622993 6637764 6656096 6680755 6712812 6753568 6805574 6871726 6954105 7054101 7173132 7312541
60071 7312541 7472910 7654105 7856150 8079709 8325605 8594326 8886196 9201690 9541166
60062 9541166 9904444 10290631 10697805 11122255 11558115 11998128 12434784 12860759 13268872
60053 13268872 13652255 14004444 14318814 14588201 14805903 14967188 15069332 15110292 15088171 15002454
60043 15002454 14855288 14651280 14396581 14098522 13765638 13407277 13033056 12652690 12275744
60034 12275744 11910679 11563942 11240247 10943565 10677383 10444018 10244328 10078528 9946954
60025 9946954 9849561 9784793 9749526 9740343 9754382 9788420 9837400 9894722 9954353 10012171 10064830
60014 10064830 10108005 10136818 10148006 10140813 10115380 10070976 10006306 9921009 9816143 9693372 9554260
60003 9554260 9400210 9232509 9052373 8861567 8663249 8461821 8261672 8066122 7877525
59994 7877525 7697885 7529121 7373077 7231728 7107170 7000961 6913564 6844935 6795734 6767446
59984 6767446 6761061 6776034 6810894 6864566 6936595 7026187 7131549 7250178 7379289 7515776 7656092
59973 7656092 7796189 7931207 8055313 8162809 8250090 8316164 8360746 8382222 8378156 8347395 8290805
59962 8290805 8210036 8106655 7982979 7842936 7691334 7532465 7369828 7206898 7047550 6895632
59952 6895632 6754474 6626894 6515337 6421767 6347488 6293289 6259845 6247848 6257576 6288554 6340156
59941 6340156 6412725 6507559 6625319 6764785 6923697 7100341 7293339 7499849 7714860 7932432
59931 7932432 8146765 8351866 8541398 8709874 8853608 8969816 9055377 9107493 9125343 9110149
59921 9110149 9063643 8987377 8883752 8756854 8611773 8453544 8287262 8118879 7955103 7802022
59911 7802022 7663641 7541737 7437294 7352173 7289192 7250392 7235510 7242698 7270691 7319667 7389730
59900 7389730 7479060 7584079 7701311 7828664 7964969 8108816 8258117 8410485 8563379 8713782
59890 8713782 8858343 8994429 9121029 9238224 9345846 9443164 9530051 9608002 9679883 9749070
59880 9749070 9819026 9893119 9974482 10066398 10173185 10300157 10452063 10631671 10840140 11078167
59870 11078167 11346152 11643805 11970518 12325603 12706788 13108154 13520523 13933944 14338675
59861 14338675 14723343 15073677 15374501 15613010 15779885 15868461 15874595 15797805 15641931 15414473
59851 15414473 15125479 14786703 14410673 14009708 13595382 13178323 12767731 12370912 11993570
59842 11993570 11640674 11316711 11025058 10767600 10545338 10359260 10210350 10098778 10023488
59833 10023488 9982963 9976292 10002928 10060996 10146227 10253130 10376904 10513221 10656051 10796866
59823 10796866 10926720 11038306 11125206 11180096 11195289 11165218 11087478 10961667 10788616 10571305
59813 10571305 10315478 10028537 9718155 9391970 9057338 8720157 8384189 8052313 7728301
59804 7728301 7416715 7121252 6843792 6584950 6344888 6123584 5921086 5737953 5575101
59795 5575101 5432815 5309969 5204413 5114169 5038251 4976255 4927136 4888446 4857007 4830332 4807106
59784 4807106 4786363 4766949 4748170 4730338 4713855 4698007 4681399 4663471 4644733 4625463 4604945
59773 4604945 4582090 4555976 4525331 4488403 4444162 4393351 4337821 4279270 4219236 4159876 4103686
59762 4103686 4052233 4005643 3963315 3924507 3888281 3853822 3821512 3793374 3771875 3758328 3752639
59751 3752639 3754384 3763751 3781377 3807528 3841504 3881883 3927560 3978689 4036457 4101712 4173898 4251371
59739 4251371 4332417 4415537 4499019 4580930 4659868 4735354 4807199 4874685 4936661 4992377 5042058
59728 5042058 5086876 5128600 5169212 5210688 5255053 5304483 5360877 5425198 5497860 5580268 5675494
59717 5675494 5786635 5914747 6059439 6221510 6403942 6609876 6840679 7096694 7378904
59708 7378904 7688631 8025949 8389312 8776156 9182155 9599122 10013944 10409386 10765325
59699 10765325 11060188 11274278 11394775 11419071 11354161 11213628 11014832 10776617 10516869 10250646
59689 10250646 9989756 9743187 9517403 9316776 9144425 9002546 8891855 8811503 8760381 8738259
59679 8738259 8745255 8780813 8843990 8934308 9051413 9194176 9361177 9552189 9768482 10011723
59669 10011723 10283330 10584743 10917325 11281750 11678377 12108536 12574681 13078962 13622430
59660 13622430 14206113 14832101 15502748 16219058 16980424 17785709 18633854 19523019 20448937
59651 20448937 21403880 22377182 23357132 24332749 25294124 26232084 27138885 28009895 28844344
59642 28844344 29644295 30413121 31154595 31872172 32568037 33242464 33893524 34516366 35102542
59633 35102542 35641164 36121759 36535987 36876847 37137836 37314560 37407285 37421376 37365639 37250993
59623 37250993 37090166 36897206 36686645 36473314 36272462 36098783 35964783 35880591 35855404 35898242
59613 35898242 36016860 36216606 36500888 36872206 37331858 37878639 38508042 39212311 39980294
59604 39980294 40796873 41642741 42494567 43324623 44100040 44783586 45337148 45726137 45922077
59595 45922077 45903331 45656586 45179977 44485022 43594735 42539364 41353256 40073313 38736654
59586 38736654 37376911 36021757 34693271 33409242 32183119 31023068 29931740 28906514
59578 28906514 27939235 27015876 26117521 25223105 24313341 23375230 22405658 21411789 20407610
59569 20407610 19409107 18431074 17485803 16582356 15726393 14921261 14169465 13472794 12831130
59560 12831130 12241864 11700883 11204315 10749668 10335630 9960613 9621305 9313106 9032370
59551 9032370 8777756 8548821 8343699 8158797 7990367 7835602 7692535 7559734 7435964
59542 7435964 7319172 7205808 7092068 6976023 6858022 6739045 6619405 6498943 6377559
59533 6377559 6255430 6133591 6014379 5900295 5792065 5688711 5589926 5497447 5413537 5339001
59523 5339001 5273392 5216518 5168901 5131096 5103191 5084631 5074003 5069445 5069996 5076416 5090243 5112166
59511 5112166 5141533 5177001 5217303 5261830 5310979 5365522 5425205 5488454 5554078 5622779 5696311
59500 5696311 5775629 5860794 5952356 6051638 6159504 6275877 6400832 6535506 6681481 6839868
59490 6839868 7011395 7196796 7396537 7610569 7838975 8082604 8342335 8617583 8906081
59481 8906081 9205348 9513869 9830386 10152316 10475408 10794852 11106008 11403817 11682293
59472 11682293 11935579 12159712 12353118 12515584 12647239 12748446 12820014 12863281 12880339 12874258
59462 12874258 12848538 12806061 12748987 12680083 12603949 12526824 12455469 12396245 12354617 12334892 12340466
59451 12340466 12374401 12439341 12536537 12665253 12823249 13007139 13211562 13428181 13646141 13853489
59441 13853489 14037994 14187253 14289453 14335011 14317736 14234683 14085531 13872530 13600892 13278709
59431 13278709 12916036 12523609 12112065 11691803 11272772 10863631 10470946 10099452 9752929
59422 9752929 9434313 9145103 8885553 8655932 8457069 8289332 8151788 8042966 7962029 7908615
59412 7908615 7882071 7881667 7907209 7958528 8034541 8133659 8255021 8398277 8561848 8742236 8935464
59401 8935464 9138420 9348084 9559841 9767273 9963523 10142341 10297774 10423420 10512611 10559640
59391 10559640 10560935 10515192 10422618 10284507 10103658 9884889 9634461 9358732 9063412 8754012
59381 8754012 8436558 8117264 7801246 7491637 7190230 6899006 6620688 6357664 6110875
59372 6110875 5880317 5666309 5469430 5289320 5124463 4973448 4835655 4710551 4597378
59363 4597378 4496131 4407838 4332996 4270337 4217943 4174840 4140655 4114592 4096142 4086260 4086311 4095963
59351 4095963 4113489 4137944 4169123 4204739 4239259 4266873 4285373 4297065 4306876 4319884 4339241
59340 4339241 4365324 4397302 4435911 4483604 4541012 4604328 4667621 4727591 4785206 4843383 4904773
59329 4904773 4972005 5048397 5137010 5239143 5354386 5482199 5623075 5778161 5948266 6133887
59319 6133887 6336283 6557833 6800611 7064951 7350413 7658214 7991708 8354115 8746773
59310 8746773 9170290 9626417 10117637 10645342 11209312 11808463 12440813 13102676 13788729
59301 13788729 14492791 15207336 15922064 16624233 17301548 17945019 18549350 19111440 19628943
59292 19628943 20099749 20522356 20896662 21223967 21505426 21740190 21925260 22056683 22129767
59283 22129767 22138078 22073806 21930327 21704115 21393851 20999015 20521075 19966136 19345289 18671999
59273 18671999 17959540 17220450 16466900 15710462 14961551 14229083 13520157 12839863 12191905
59264 12191905 11579721 11006522 10474059 9981889 9528344 9111894 8731346 8385287 8071923
59255 8071923 7789245 7534997 7306982 7103917 6925447 6770527 6636164 6518738 6416410
59246 6416410 6329194 6256756 6197412 6149664 6113440 6089129 6076383 6074691 6084128 6104463 6134302 6172431
59234 6172431 6219499 6276959 6344634 6420843 6504943 6598034 6700662 6811435 6928855 7053225
59224 7053225 7185419 7324566 7468232 7614369 7761552 7907365 8047922 8179657 8301120
59215 8301120 8413090 8517741 8617837 8715678 8811974 8905854 8996188 9082468 9164017 9238688 9302874
59204 9302874 9352856 9386043 9401112 9397285 9373535 9328539 9261555 9173406 9066440 8943577 8807759
59193 8807759 8662349 8511369 8358684 8207234 8059754 7920108 7792823 7680581 7582640 7496555
59183 7496555 7421452 7358924 7310723 7276595 7255085 7245725 7249164 7265122 7291469 7325902 7367679 7416839
59171 7416839 7472289 7531729 7593391 7656946 7722668 7790723 7861645 7936667 8017030 8103525 8197281
59160 8197281 8300400 8415166 8543196 8686313 8847794 9031488 9239535 9472019 9729027
59151 9729027 10011636 10319754 10649778 10995489 11350711 11709467 12063222 12399343 12703405
59142 12703405 12962779 13167467 13308257 13375841 13362809 13266395 13088818 12835240 12512229 12128450
59132 12128450 11695853 11228668 10740461 10242180 9742743 9250348 8772333 8314159 7879404
59123 7879404 7470592 7089317 6735645 6408461 6106863 5830696 5579453 5351302 5143672
59114 5143672 4954341 4781563 4623719 4479670 4349243 4232603 4128935 4036167 3952236 3876404
59104 3876404 3809200 3751093 3701302 3658052 3619990 3587114 3560016 3538638 3522488 3511858 3507704
59093 3507704 3509996 3517328 3528869 3545718 3569256 3598945 3633056 3671160 3714432 3763505 3817428 3875168
59081 3875168 3936875 4003061 4073449 4147440 4225077 4306784 4392467 4481526 4573570 4668585 4766455
59070 4766455 4866579 4967900 5069193 5169518 5268438 5365538 5459667 5549134 5632855 5711070
59060 5711070 5784763 5854669 5920821 5982593 6039015 6089555 6134913 6176821 6216935 6256273 6295752
59049 6295752 6336671 6380415 6428118 6480844 6539642 6605280 6678420 6760308 6852703 6956867 7073169
59038 7073169 7201852 7343274 7496784 7660034 7830201 8005381 8184069 8363571 8539536
59029 8539536 8706503 8857974 8986395 9084534 9147647 9174195 9164723 9120696 9044425 8939198 8808922
59018 8808922 8657706 8489813 8309628 8121411 7928874 7734649 7539898 7344758 7149571
59009 7149571 6955492 6763605 6573951 6386100 6200337 6017476 5837548 5659531 5482673
59000 5482673 5307589 5135895 4969090 4807810 4651676 4499789 4351849 4208848 4072360
58991 4072360 3943221 3821318 3706419 3598324 3496174 3398650 3305426 3217682 3136536 3061398
58981 3061398 2990511 2922744 2858115 2796742 2738144 2681792 2627798 2576679 2528700 2483700 2441349
58970 2441349 2401243 2362759 2325229 2288454 2252975 2219609 2188774 2160451 2134733 2112031 2092509
58959 2092509 2075626 2060593 2047276 2036374 2028540 2023324 2018905 2013080 2005004 1996274 1989840 1987330 1987518
58946 1987518 1987850 1987217 1986703 1987748 1990396 1993612 1996655 1999550 2002572 2005814 2009287 2013030 2017108 2021728 2027403
58931 2027403 2034695 2043654 2053644 2063891 2074158 2084836 2096464 2109339 2123504 2138813 2154882 2171251
58919 2171251 2187901 2205427 2224328 2244188 2263970 2283216 2302659 2323520 2346398 2370853 2395819
58908 2395819 2420461 2444938 2470269 2497146 2525020 2552962 2581218 2611034 2642782 2675302 2707660
58897 2707660 2740615 2775534 2812451 2850156 2887882 2926132 2966189 3009618 3057948 3111932 3171102
58886 3171102 3234674 3302691 3375567 3452800 3533136 3616040 3702202 3792576 3887736 3988205 4094461
58875 4094461 4206284 4322948 4444461 4572018 4706875 4849358 4999379 5157489 5325041
58866 5325041 5503645 5694670 5898824 6115940 6345498 6587748 6844184 7116935 7407879
58857 7407879 7718190 8048189 8397668 8767061 9158547 9575510 10020653 10494934 10998348
58848 10998348 11531136 12094114 12688397 13315002 13974115 14664273 15382314 16123918 16883482
58839 16883482 17653393 18424055 19184649 19923017 20624592 21272427 21848953 22337441 22722070
58830 22722070 22988563 23126623 23132062 23006443 22755486 22388499 21918303 21359975 20729111 20041511
58820 20041511 19313697 18562117 17801209 17042545 16295592 15568245 14866268 14193073 13550815
58811 13550815 12941494 12366723 11826862 11320954 10847404 10404305 9989213 9599362 9232736
58802 9232736 8888829 8567867 8269102 7990259 7728913 7484102 7256218 7045540 6851276
58793 6851276 6671767 6505073 6349670 6205386 6073719 5956371 5853227 5762360 5682138 5612543
58783 5612543 5554118 5506571 5469139 5441701 5424662 5418113 5421868 5436107 5461229 5497034 5542553 5596795
58771 5596795 5659455 5731051 5812559 5904505 6006124 6115953 6233927 6362371 6504008 6659117
58761 6659117 6825670 7002453 7191076 7394503 7614476 7851294 8105488 8378463 8671308
58752 8671308 8984174 9317691 9674398 10057613 10468913 10907792 11374222 11870637 12400571
58743 12400571 12965991 13566693 14201452 14868105 15562328 16277542 17006417 17741393 18473053
58734 18473053 19188740 19873388 20511116 21085574 21579601 21975989 22259424 22418381 22446388
58725 22446388 22342477 22110581 21758362 21296761 20740206 20105905 19411699 18674093 17907793
58716 17907793 17126053 16340922 15563400 14803137 14067028 13358048 12676738 12024417 11403996
58707 11403996 10817320 10263244 9739520 9245471 8781616 8347660 7942412 7565010 7214494
58698 7214494 6888399 6583435 6297813 6031718 5785284 5557163 5345322 5148253 4964980
58689 4964980 4794610 4636221 4488848 4351560 4223832 4105449 3995438 3891726 3792836 3699592
58679 3699592 3613858 3535701 3463015 3394003 3328616 3267173 3208860 3152417 3097490 3044539 2993908
58668 2993908 2945577 2899427 2855323 2813119 2772713 2733840 2695934 2658757 2622943 2589012 2555806
58657 2555806 2520937 2483103 2443127 2402412 2361305 2319401 2276448 2232151 2185914 2137740 2089005
58646 2089005 2041579 1996429 1953589 1912944 1874215 1836546 1799131 1762294 1727148 1694036 1662039
58635 1662039 1630407 1599995 1572642 1549193 1528495 1508519 1488264 1468346 1449764 1432412 1415013
58624 1415013 1396391 1376636 1357078 1339239 1323677 1309661 1296128 1283025 1271504 1262659 1256441 1252044
58612 1252044 1248889 1246703 1245052 1243568 1242637 1243246 1246002 1250610 1256273 1262222 1267983 1273540 1279155 1284705
58598 1284705 1289511 1293270 1296684 1300485 1304177 1306705 1308194 1309987 1312830 1315930 1318050 1318840 1318906 1319427 1321805
58583 1321805 1326858 1333963 1341725 1349876 1359788 1372809 1388862 1407137 1427370 1449711 1473922 1499582
58571 1499582 1526997 1557249 1591188 1628554 1668150 1708918 1750957 1795419 1843310 1894778 1949799
58560 1949799 2008746 2071429 2136371 2202630 2272278 2349365 2435990 2530905 2632591 2742125 2861788
58549 2861788 2992142 3132038 3280879 3439466 3608846 3789503 3981407 4183657 4393912
58540 4393912 4608892 4825343 5039807 5247654 5443151 5620364 5773267 5895320 5980321 6024297
58530 6024297 6026218 5987052 5909116 5796569 5655417 5491981 5311388 5117778 4915477 4709362
58520 4709362 4504315 4304722 4114204 3935028 3767488 3610409 3462803 3325086 3198519
58511 3198519 3083741 2980239 2887083 2803443 2728107 2659180 2594917 2534656 2478353 2425501 2375164
58500 2375164 2327030 2281613 2239177 2199035 2160242 2122599 2086622 2052770 2020900 1990342 1960390
58489 1960390 1930808 1901820 1873510 1845561 1817889 1791117 1765850 1741755 1718053 1694694 1672217
58478 1672217 1650579 1629072 1607461 1586117 1564768 1542211 1517876 1492784 1468205 1444022 1419211
58467 1419211 1393546 1368101 1344194 1322398 1302488 1284036 1267046 1252001 1239014 1227018 1214424
58456 1214424 1200771 1187163 1174828 1163769 1153069 1142005 1130593 1119621 1110443 1104142 1100430 1097803
58444 1097803 1095061 1092272 1090104 1088976 1089301 1091773 1096602 1102757 1108618 1113298 1117009 1120366 1123687 1126818
58430 1126818 1129366 1131087 1132026 1132108 1130929 1128355 1124999 1121368 1116836 1110465 1102785 1095533 1089423 1083275 1075752
58415 1075752 1066879 1057376 1047619 1037996 1029340 1022022 1015235 1007940 1000158 992710 986176 980610 975882 971819
58401 971819 968289 965335 962793 959805 955486 950110 944787 939814 934386 928152 921994 916991 913722 912771
58387 912771 914524 918006 921313 923799 926453 929640 932237 933958 936720 942268 949888 957965 966432 976005
58373 976005 986212 996145 1006387 1018281 1031708 1045236 1058169 1070962 1083768 1095759 1105701 1112337
58361 1112337 1114854 1114006 1112043 1110320 1107752 1102897 1096643 1091194 1087112 1083216 1079014 1075380 1072827 1070819
58347 1070819 1069089 1068328 1069220 1071564 1074395 1076390 1076578 1075401 1074529 1074952 1076122 1077838 1081555 1088274 1096346
58332 1096346 1103446 1109958 1118202 1128713 1139512 1149008 1157476 1165452 1172735 1179611 1187455 1197489 1209995
58319 1209995 1224884 1241702 1259007 1275178 1290253 1305654 1321850 1337429 1350846 1361981 1371755
58308 1371755 1381262 1391518 1403063 1415370 1427222 1437740 1446575 1453558 1459009 1464065 1469762 1476018 1482256
58295 1482256 1488468 1494951 1501803 1509595 1519480 1531313 1542715 1551654 1559020 1566894 1575110 1581719 1586322
58282 1586322 1590803 1596906 1604928 1614568 1625125 1635003 1642947 1649844 1657750 1667368 1678063 1689791 1703103
58269 1703103 1717605 1732462 1748148 1765629 1784147 1801923 1818898 1836659 1855828 1875661 1896089
58258 1896089 1917938 1941250 1965511 1991304 2019364 2048292 2075814 2102307 2130396 2160871 2191592
58247 2191592 2220823 2249154 2277754 2307123 2337894 2370506 2403775 2436132 2468413 2502907 2539586
58236 2539586 2576064 2611567 2647990 2686553 2726370 2767074 2810060 2856220 2905013 2956525 3011952
58225 3011952 3071361 3133494 3198336 3267230 3339925 3414278 3489449 3566599 3645947 3726270 3807928
58214 3807928 3893140 3982277 4073041 4164424 4258550 4357523 4461316 4569760 4683655 4802926
58204 4802926 4926525 5055065 5190780 5334396 5485231 5644685 5815845 5998963 6191290
58195 6191290 6392446 6605943 6834168 7075773 7329488 7596660 7878718 8176098 8491091
58186 8491091 8827758 9187642 9569662 9975649 10411588 10881656 11385299 11921802 12493362
58177 12493362 13101934 13747734 14432958 15162717 15940384 16766036 17640709 18567606 19548001
58168 19548001 20580906 21667795 22812250 24014338 25271728 26587721 27971854 29431758
58160 29431758 30971766 32600644 34332583 36178521 38144351 40238862 42474245 44857115
58152 44857115 47389573 50082501 52958876 56043329 59361158 62950513 66862349 71144737
58144 71144737 75841086 81007983 86720635 93058607 100106263 107976122 116817347 126799207
58136 126799207 138107483 150958328 165581191 182165478 200830579 221638128 244612395
58129 244612395 269794366 297347212 327481262 359850906 392598232 421977148 443368268
58122 443368268 453256787 450712379 437345032 416099414 390006388 361555403 332581284
58115 332581284 304342555 277652469 253013298 230689665 210734859 193056625 177526049
58108 177526049 164044920 152550905 143005162 135333353 129265512 124194080 119281689 113826318
58100 113826318 107574860 100713790 93613838 86601451 79887074 73582172 67726046 62317664
58092 62317664 57349643 52816501 48699956 44965900 41579081 38509910 35728631 33206272
58084 33206272 30922699 28863839 27010565 25338390 23826677 22459572 21218823 20083819
58076 20083819 19038284 18070246 17166805 16315924 15512616 14757168 14047912 13380748 12754096
58067 12754096 12168464 11621999 11111161 10634354 10190245 9773813 9378493 9000914 8639758
58058 8639758 8292011 7954641 7628302 7315310 7015449 6727234 6451300 6188731 5938039
58049 5938039 5697445 5468126 5251502 5045352 4846336 4654387 4470889 4294683 4123854
58040 4123854 3959600 3804150 3656331 3513176 3374797 3243863 3121173 3005201 2895224
58031 2895224 2791782 2694728 2603490 2518407 2439589 2365601 2295322 2229483 2168392 2110243 2053866
58020 2053866 2000720 1951590 1903912 1855391 1807765 1763663 1722082 1680607 1640028 1602938 1569378
58009 1569378 1537552 1507329 1479344 1452012 1423204 1393976 1367284 1344003 1323262 1305344 1290754
57998 1290754 1277463 1262632 1246212 1229769 1212899 1194304 1175354 1158857 1144831 1130908 1116375
57987 1116375 1102506 1089449 1076316 1064053 1054811 1048413 1042496 1036112 1030321 1025393 1020305 1015009 1010499
57974 1010499 1006691 1002731 999087 996777 994905 991637 987243 983449 980188 975804 970168 964691 959438 953134
57960 953134 945885 939035 932302 923909 913624 902981 892492 881479 870643 861811 854742 846966 837281
57947 837281 826903 816904 807159 798104 790718 784171 776171 766389 757066 749512 742453 734626 726752 720069
57933 720069 715023 712178 712446 715532 719876 724687 730343 736537 742045 746669 751349 755940 759009 760298
57919 760298 761237 762408 762577 760872 757927 754339 750049 745788 743003 741626 739961 737395 735006 732829 728956
57904 728956 722492 715179 708797 702849 696157 688887 681689 674540 667758 662524 658937 655063 649420 643087
57890 643087 637890 633618 628661 622663 617147 613886 613533 615367 617748 619439 620947 623909 628900 634882
57876 634882 641008 647580 654574 660530 663881 664502 663151 660170 655477 649302 642415 635928 630788 626739
57862 626739 622070 615409 607585 600601 595141 590500 586613 584188 582922 581635 580432 580620 582164 583497
57848 583497 584490 587231 592684 598753 603152 606408 610400 615380 620028 623302 624801 624322 622429 620496 618925
57833 618925 616183 610870 604005 598054 594294 592023 589724 586151 580941 574987 569691 565349 561013 556282
57819 556282 552114 549230 546926 544258 541347 538708 536266 533965 532368 531871 532146 533096 535370 539240 544041
57804 544041 549443 556150 564425 573012 580502 586853 592636 597795 602082 605740 608733 610103 609059 605978
57790 605978 601581 595998 589418 582669 576227 569563 562293 555063 548513 542459 536864 532397 528965 524879
57776 524879 518717 511035 503206 495724 488893 483855 481189 479294 475783 469939 462457 453622 443413 432840
57762 432840 423332 414842 405988 396112 386019 376717 368571 361732 356510 353131 351541 351143 350399 347582
57748 347582 342753 338269 336404 337145 339201 342190 346430 351241 355100 357363 358625 359446 359787 359558 358768
57733 358768 357291 355401 354302 355226 358191 362334 367192 372808 379031 385543 392211 398630 403819 407229
57719 407229 409451 411000 411108 408921 405318 402116 399730 397029 393422 389740 386846 384397 381198 376137
57705 376137 368957 360937 354571 351577 351273 351708 352093 353073 354860 356439 356851 356219 355170 354096 353362 353637
57689 353637 355477 358663 362064 364253 364710 364601 365777 368774 372562 376549 381631 388398 395498 401264 406218
57674 406218 412362 420257 428263 434668 439416 443730 449056 456233 464630 472178 477296 480805 485094 491504
57660 491504 499469 507944 516526 525169 533998 543731 555377 569252 584635 600257 614682 626910 637635
57647 637635 649386 664131 681034 697872 714356 732398 753077 775104 796973 819211 843575
57636 843575 871003 901267 933935 968738 1005229 1042751 1080948 1120247 1161923 1207423 1257264
57625 1257264 1310808 1367485 1427888 1493136 1563704 1639770 1722453 1813774 1915476 2028686 2154554
57614 2154554 2294295 2448545 2617522 2801860 3002634 3220593 3455669 3706241 3967083
57605 3967083 4227657 4473613 4691001 4869761 5004855 5096034 5146591 5160709 5140928 5088175
57595 5088175 5003809 4890771 4753123 4595773 4424627 4245672 4063502 3881369 3702416 3529651
57585 3529651 3364771 3208264 3060778 2923228 2795639 2677449 2569212 2472482 2387482 2312297
57575 2312297 2245081 2185770 2134876 2091875 2055681 2025750 2001795 1983341 1970474 1964092 1964324 1969405
57563 1969405 1977283 1988000 2003564 2025748 2054873 2090388 2131656 2178117 2229597 2286918 2351909
57552 2351909 2426431 2511190 2605345 2707405 2816684 2933692 3058722 3190271 3325368 3461121
57542 3461121 3594971 3723343 3841129 3943010 4024610 4082019 4111156 4108785 4074309 4010256 3921041
57531 3921041 3811303 3685031 3545750 3397067 3242612 3085396 2927814 2772670 2623394
57522 2623394 2482273 2348871 2221399 2099591 1985174 1879534 1782213 1692085 1608911 1533095
57512 1533095 1464547 1402279 1344733 1290431 1238985 1191528 1149365 1112124 1078103 1046541 1018482
57501 1018482 995090 976157 960646 947537 935586 923439 911070 900358 893183 889302 886915 884969
57489 884969 884009 884879 887399 890604 893869 897452 901869 907013 912310 917858 924798 934114 945669 959169
57475 959169 975414 995413 1018609 1043353 1069157 1097187 1128378 1162390 1198777 1237911 1280313
57464 1280313 1326137 1375740 1429620 1487503 1548785 1614402 1686806 1767296 1854668 1947327 2045257
57453 2045257 2148684 2256195 2365846 2477257 2590769 2704734 2815078 2917385 3008162 3084139
57443 3084139 3141796 3178218 3191879 3182501 3150748 3098146 3026782 2939057 2838028 2727684 2612187
57432 2612187 2494790 2377800 2263428 2154147 2052104 1958357 1872571 1793412 1719743 1651820
57422 1651820 1591064 1538434 1493408 1454761 1421734 1393925 1370598 1350856 1334399 1321654 1313234
57411 1313234 1309475 1310185 1314506 1321336 1330296 1342119 1357957 1378521 1404032 1434467 1469513 1508667
57399 1508667 1551757 1599194 1651605 1709547 1773591 1844088 1920586 2002016 2087678 2177504 2271001
57388 2271001 2366336 2460668 2550910 2633955 2706677 2765956 2808405 2830207 2828173 2801477 2751984
57377 2751984 2682864 2597433 2499151 2391524 2277384 2158878 2038336 1918247 1800104 1684291
57367 1684291 1571689 1464521 1364886 1273136 1188309 1109554 1036548 969144 907265 850757 799017
57356 799017 751173 706861 666211 629002 594596 562860 534118 507902 482808 458095 434447
57345 434447 412692 392787 374564 358379 344301 331533 319233 306980 294114 279852 264639
57334 264639 250084 236885 224158 211586 200596 192245 185425 178480 171281 164239 156698 148123 139777
57321 139777 133205 127765 121549 114263 107464 102421 99441 98825 100509 102835 103521 102094 100028 98522 97501
57306 97501 96689 96072 95216 93590 91751 90852 90795 90238 88742 87529 87600 88260 88124 86703 84479 82228 80831
57289 80831 81142 83356 86636 89574 91008 90623 89085 87401 85917 84341 82824 82129 82229 81793 80044 78209
57273 78209 78002 79401 81211 83062 85276 87293 88065 87952 88562 90570 93174 95797 98810 102249 105310
57258 105310 107745 110569 114709 119830 125009 129757 134030 138103 142977 150080 159855 170986 181453 190226
57244 190226 197938 206324 216946 229868 243432 255725 266367 276671 288317 302230 318387 336139
57232 336139 354821 374377 395150 416902 438787 460677 483622 508300 533944 559692 586092
57221 586092 614123 643582 673741 704788 736945 768687 797618 823114 846565 869010 890028
57210 890028 909167 926987 944191 960655 975726 988756 999136 1006410 1010446 1011140 1008313 1002279 993882
57197 993882 983269 969487 952223 933063 913899 895026 876187 858563 843950 832597 823614 817074
57185 817074 813938 814346 817828 824909 836603 852521 871325 892825 917667 945026 972732 999873
57173 999873 1027298 1055241 1082323 1107355 1130434 1151919 1171953 1191412 1211819 1233969 1257926
57162 1257926 1284332 1314109 1346904 1381695 1419125 1461413 1509662 1562907 1619902 1679976 1741951
57151 1741951 1804271 1866665 1929906 1993618 2056115 2116682 2176092 2234545 2291049 2345233 2397812
57140 2397812 2448917 2497920 2545123 2591369 2635586 2675192 2709650 2741432 2772669 2803049 2831714
57129 2831714 2858909 2884868 2909306 2932927 2957145 2981357 3002896 3020858 3037692 3055679 3074079
57118 3074079 3091133 3106779 3121763 3135884 3148636 3160120 3170123 3177731 3182678 3185427 3185419 3181277 3173294
57105 3173294 3163413 3152086 3137736 3120098 3101245 3082308 3062302 3041532 3023016 3008654 2996829
57094 2996829 2985573 2975180 2965656 2954556 2939812 2922189 2902629 2879534 2850909 2816841 2777692
57083 2777692 2732174 2679251 2619553 2553115 2478450 2395481 2305886 2208235 2096453 1965802 1816589
57072 1816589 1648710 1456386 1232331 973842 680536 348964 -26271 -448948 -923174 -1456385
57062 -1456385 -2055868 -2724594 -3464975 -4284534 -5193546 -6199507 -7308805 -8531827 -9881778
57053 -9881778 -11370490 -13010190 -14817621 -16812098 -19011786 -21436457 -24111947 -27068302
57045 -27068302 -30337650 -33959595 -37985910 -42475208 -47487436 -53089668 -59362861 -66396043
57037 -66396043 -74278171 -83101961 -92968605 -103978161 -116218310 -129767793 -144699517
57030 -144699517 -161066427 -178888428 -198152597 -218791048 -240626488 -263375369 -286780511
57023 -286780511 -310743081 -335212109 -359817546 -383572918 -404967696 -422389316 -434532088
57016 -434532088 -440575359 -440199905 -433578688 -421341860 -404454239 -384031211 -361181953
57009 -361181953 -336916677 -312091253 -287371839 -263230328 -239971430 -217774569 -196740214
57002 -196740214 -176935670 -158424756 -141268970 -125512587 -111173199 -98240269 -86672495
56995 -86672495 -76396595 -67316159 -59325234 -52314609 -46172587 -40790264 -36069698 -31925492
56987 -31925492 -28280802 -25066756 -22225265 -19707928 -17471434 -15476647 -13691311 -12089790
56979 -12089790 -10649614 -9350530 -8176364 -7114546 -6153187 -5280363 -4485802 -3761030 -3098067
56970 -3098067 -2490078 -1932961 -1424399 -961631 -541711 -162732 177738 484955 765303
56961 765303 1022772 1259259 1477735 1682416 1876058 2059916 2236347 2408255 2575253 2733683
56951 2733683 2882503 3026945 3173631 3322133 3462138 3578200 3656939 3691690 3683118 3636664
56941 3636664 3559209 3457364 3337460 3205363 3065614 2921186 2773981 2624681 2472192 2314600
56931 2314600 2151416 1984363 1815802 1647322 1480126 1315607 1154757 997791 845226
56922 845226 698750 560229 430178 307781 191891 81339 -25160 -128183 -226499 -317711
56912 -317711 -400364 -474950 -542709 -604045 -658478 -705583 -745295 -777477 -801944 -819080 -829848
56901 -829848 -834741 -833054 -823769 -807211 -785481 -761244 -736415 -712064 -689124 -668768 -652102 -639611
56889 -639611 -630756 -624034 -617685 -610614 -602702 -594327 -585779 -577087 -567966 -557803 -546106 -533226 -520205
56876 -520205 -507436 -493718 -477204 -457110 -433977 -408402 -380405 -350499 -320898 -294949 -275378
56865 -275378 -263218 -258158 -259228 -264949 -273401 -282787 -292076 -300913 -309002 -315887 -321349 -325523 -328401 -329519
56851 -329519 -328559 -326096 -323239 -320431 -316971 -311870 -304978 -297111 -289310 -282139 -275517 -268871 -261447 -252709
56837 -252709 -242629 -231562 -219762 -206927 -192186 -174516 -153367 -129109 -102928 -76149 -49402
56826 -49402 -22425 5172 32864 58980 81638 99788 113408 123080 129727 134427 137876 139985 140450
56813 140450 139817 139492 140723 144127 150269 159798 172494 186964 202119 218520 237509 259521 284292
56800 284292 312329 344605 380246 415513 445799 468120 481358 485223 480292 468852 454456 440072
56788 440072 426971 415517 406388 400465 397843 397756 399909 405569 416817 434669 458403 486935 520281
56775 520281 559023 602532 648404 693598 735340 770567 795400 806238 801658 783062 753775 717900
56763 717900 679666 642625 608624 577594 548819 522486 499849 481972 468785 459632 454635 455210
56751 455210 463174 479362 502889 531429 562098 592372 620355 644169 661196 668500 664546 650531
56739 650531 629649 604902 577760 548726 518534 488361 459219 431867 407523 388080 374923
56728 374923 367483 363417 360585 358637 358579 361218 366611 374739 385697 398649 411024 419403 421411 416775
56714 416775 406859 393404 377490 359369 339302 318492 298801 281328 265739 251305 238100 226556
56702 226556 216270 206162 195757 185386 175145 164749 154983 148221 146290 148013 149847 149150 146271
56689 146271 143411 142150 142337 142810 142615 141781 141345 142535 145565 149198 151724 152282 151101 148823 146136 143918
56673 143918 142918 142917 142695 141321 139270 137931 138187 139728 141513 142573 142649 142454 143034 144425 145119 143531 139913
56656 139913 136231 134159 133751 134111 134499 134413 133297 130919 127888 125352 124102 124155 125047 126379 128095 130233
56640 130233 132463 134093 134880 135630 137510 140887 145257 150098 155002 159062 161183 161409 161158 161631 162520 162685
56624 162685 161457 158818 154987 150472 145993 141699 136876 131090 125134 120222 116654 113972 112058 111210
56610 111210 111379 112044 112641 112515 110812 107416 103830 102163 103081 105455 107963 110099 111579 111961 111484 111482 113081
56593 113081 115816 118151 119278 119835 120874 122574 124310 125752 127510 130438 134566 139118 143516 147864
56579 147864 152325 156601 160368 163694 166656 169065 171003 173127 175841 178696 181253 183943 187167 190019
56565 190019 191038 190058 188226 186335 184395 182945 183331 186099 190139 194068 197514 200348 201693 200853 198733
56550 198733 197113 196531 195834 194002 191731 190819 192280 195292 197854 198446 197206 195550 194709 194786 195246 195935
56534 195935 197179 198995 200593 200872 199288 196285 193014 190652 189707 189751 189866 189501 188900 188636 188915 189684 191273
56517 191273 194171 197767 200077 199709 197872 197308 199117 201715 203324 204349 206460 210154 214381 218239 221982
56502 221982 226383 231824 238096 244580 250662 256335 262220 268680 275284 281487 287284 292690 297285 301034
56488 301034 304875 309504 314184 317867 320898 324149 326926 327454 325461 322519 319553 315763 310660 305524
56474 305524 301827 299416 297220 294735 291854 288369 284737 282336 281667 281108 278952 276106 275111 276654 278623
56459 278623 278936 277833 276839 276518 276120 274850 272720 270424 268890 268712 269569 270315 270015 268840 267666 266780
56443 266780 265438 262949 259939 258071 258356 260022 261326 261315 260408 259444 258722 258081 257444 256820 256047 254992 253952
56426 253952 253437 253450 253312 252464 251287 250727 251020 251247 250507 249245 248830 249878 251644 253236 254713 256578 258812
56409 258812 261017 263136 265434 268069 271292 275704 281531 287822 293122 297036 300596 305038 310624 316581
56395 316581 321818 325742 328664 331231 333362 334379 334541 335462 338102 341154 342633 342467 342029 341542 339735
56380 339735 336199 332412 329840 328355 327049 325388 322975 319319 314624 309916 305799 301833 297567 293216
56366 293216 288899 284370 280092 277391 276591 276055 274174 271496 269858 270053 271354 272758 273622 273559 272817 272524
56350 272524 273730 276310 279498 283003 286854 290606 293760 296791 300743 305672 310179 312691 312877 311833
56336 311833 311101 311299 311542 310618 308784 307567 307429 306734 304037 300562 299008 300212 302306 303169 302523 301376
56320 301376 300502 300049 299891 299745 299172 297985 296674 296272 297578 300286 302888 303854 303230 302715 303885 306617
56304 306617 309537 311561 312632 313401 314765 317462 321601 326687 332389 338901 346174 353212 358709 362239
56290 362239 364468 366472 369207 373178 378085 383151 388234 394155 401309 408411 413529 416236 418061 420818
56276 420818 425093 430318 435685 440803 445863 451386 457756 464938 472531 479757 485549 489353 492082 495574
56262 495574 500684 506548 512174 517992 525096 533554 542367 550795 558923 567183 575937 585303 594833 603769
56248 603769 612244 621826 634103 648956 664944 680955 696730 712188 727399 743145 760495 779602
56236 779602 799575 819545 839159 858128 876238 894028 912640 932512 952705 971903 989790
56225 989790 1007214 1025283 1044537 1064943 1086558 1110109 1136606 1166298 1198299 1231478 1265539
56214 1265539 1301173 1339600 1382168 1429754 1482094 1538075 1597156 1660143 1728310 1802515 1883710
56203 1883710 1973496 2073080 2182006 2298948 2423694 2557572 2702032 2857582 3024034 3200939
56193 3200939 3387594 3583174 3787040 3998431 4215705 4436117 4656312 4872671 5081246
56184 5081246 5277755 5457860 5617510 5753208 5862067 5941613 5989893 6006420 5992975 5952742
56174 5952742 5888548 5802596 5697778 5578016 5446895 5307015 5160973 5011534 4860026 4705947
56164 4705947 4549364 4392550 4237896 4085143 3932239 3778304 3624307 3471473 3320681
56155 3320681 3173165 3030188 2891996 2758367 2630086 2508504 2393676 2284345 2179914
56146 2179914 2081096 1988419 1901439 1819947 1744809 1676808 1615359 1559048 1507128 1460070 1418793
56135 1418793 1383423 1352602 1324040 1296001 1268205 1241370 1216477 1194660 1176825 1162578 1150111
56124 1150111 1137902 1126009 1115106 1105157 1095946 1088054 1082025 1077217 1072822 1069628 1069348 1072487 1078121
56111 1078121 1085520 1094567 1104627 1114501 1123950 1134345 1147471 1164095 1183421 1203310 1221501 1237688
56099 1237688 1254270 1274251 1298621 1326322 1355985 1386699 1417910 1450036 1484667 1522847 1563599
56088 1563599 1605537 1649327 1696895 1748711 1803713 1861808 1924473 1992766 2066671 2146958 2236015
56077 2236015 2335943 2446717 2566508 2692492 2820932 2947538 3068583 3181284 3283346 3373222
56067 3373222 3451178 3519292 3580028 3634905 3683828 3724671 3753942 3769142 3770610 3760433 3740067
56056 3740067 3709942 3670686 3623020 3566388 3498801 3418199 3323564 3215522 3097069 2973242 2848941
56045 2848941 2727328 2610699 2501422 2400627 2307389 2221107 2143702 2077594 2022560 1976577
56035 1976577 1938667 1908586 1884657 1864677 1848462 1837018 1829726 1824969 1822961 1824994 1830173 1835981
56023 1835981 1842167 1850969 1863065 1876197 1888432 1900062 1911545 1922204 1931995 1942282 1953913 1966251
56011 1966251 1978675 1991240 2003772 2016322 2030507 2048056 2067939 2087367 2105734 2125032 2146281
56000 2146281 2168325 2190472 2213582 2238137 2263946 2292084 2324349 2360401 2398235 2437745 2480822
55989 2480822 2527638 2576223 2626154 2679202 2735613 2793307 2851726 2912902 2977498 3043398 3109666
55978 3109666 3178589 3252097 3329159 3408045 3488208 3568672 3647810 3726306 3807519 3893680 3984549
55967 3984549 4080537 4183535 4293465 4407689 4525299 4648654 4779474 4917161 5062309 5217898
55957 5217898 5385405 5563473 5751948 5953275 6168321 6394816 6631564 6880184 7141397
55948 7141397 7414247 7700687 8006156 8333797 8682983 9055263 9456052 9887894 10347689
55939 10347689 10833660 11349793 11900299 12485172 13104594 13762464 14462077 15203418 15987798
55930 15987798 16819614 17700354 18626864 19599001 20622799 21702548 22836482 24024296 25272019
55921 25272019 26585570 27967447 29424971 30973950 32628286 34392970 36272337 38276725
55913 38276725 40415171 42690929 45112142 47699839 50480025 53477780 56726066 60269778
55905 60269778 64153425 68416244 73108198 78299744 84069225 90497584 97688284 105778994
55897 105778994 114924564 125289057 137070108 150512131 165880766 183444548 203483863
55890 203483863 226260072 251923654 280452261 311603259 344638882 377746922 407674233
55883 407674233 430304522 442167456 441868209 430395473 410277947 384433081 355439721
55876 355439721 325310275 295496652 266969188 240334076 215935630 193902050 174179076
55869 174179076 156602038 140974216 127101030 114795263 103889453 94244606 85734606
55862 85734606 78228930 71600347 65739294 60549098 55935919 51815041 48120019 44795282
55854 44795282 41785887 39043423 36535499 34240114 32135248 30200558 28422484 26788760
55846 26788760 25282001 23885270 22589247 21387632 20270617 19229295 18261426 17365743
55838 17365743 16534424 15757319 15029622 14349276 13710569 13106507 12534398 11993476 11480018
55829 11480018 10990269 10525322 10087694 9675387 9284095 8912833 8562631 8231811 7916991
55820 7916991 7616803 7330733 7056336 6791416 6536956 6294648 6063794 5843677 5636072
55811 5636072 5441917 5258300 5082317 4915092 4758275 4609285 4463955 4321222 4181206
55802 4181206 4041269 3898512 3754401 3612610 3473755 3336131 3200280 3069002 2943843
55793 2943843 2824900 2712988 2608846 2511303 2419038 2332924 2254078 2181287 2112952 2049654 1991912
55782 1991912 1937557 1884575 1834642 1790438 1751227 1714467 1679935 1648510 1618561 1587651 1556725
55771 1556725 1528627 1503272 1478156 1453110 1430729 1412293 1396846 1384196 1375302 1369291 1363082 1354556
55759 1354556 1343893 1331902 1319279 1307186 1296055 1283998 1268611 1250032 1230085 1209189 1186683
55748 1186683 1163488 1141377 1119774 1096167 1069953 1043417 1018842 996971 978172 962586 948893
55737 948893 935294 921980 910551 901036 891753 882151 873339 865581 857760 849916 843955 840918 839459
55724 839459 837950 836496 836032 836775 838339 840258 841784 841977 840329 836561 829915 819585 805698 788933
55710 788933 769594 748243 726794 707464 690667 675148 659916 644886 630091 615801 603072
55699 603072 592502 582548 570607 555897 540119 525458 513086 503165 494739 485803 475024 463459
55687 463459 453409 445823 439988 435225 431184 426798 420801 413461 406309 400040 394160 388687 384590 382150
55673 382150 380180 377351 373350 368652 364031 360304 357612 354987 351350 346565 340809 333712 325416 317774
55659 317774 312826 310230 307615 303312 297572 291495 286154 282451 280413 278860 276992 275819 276688 279023
55645 279023 281167 282834 284840 286831 287400 286391 285073 283875 281896 278958 276344 274948 274152 272990 271205
55630 271205 268996 266887 265958 267005 269499 272463 275989 280554 285397 289412 293281 298751 305925 313183
55616 313183 319783 326540 333862 341175 348426 356058 363219 368124 370589 372153 373290 372659 369733 365919
55602 365919 362249 358116 353353 349523 347848 347484 347088 346642 346729 347438 348955 351742 355081 356909 356206 354232
55586 354232 352508 351032 349511 348731 349359 350656 351675 352595 353640 353765 351735 347726 342842 337913 333484
55571 333484 329817 326000 320302 312463 304468 298057 292758 287491 282564 278537 274340 268389 260810 252945
55557 252945 245212 236981 228142 219434 211511 204749 199530 195584 191580 186461 180764 175648 171202 166761
55543 166761 162341 158542 155407 152445 149549 147070 145302 144559 145113 146290 146438 144760 142453 140959 139887
55528 139887 137919 135090 132687 131255 130073 128424 126186 123464 120771 119353 120057 122058 123853 125330
55514 125330 127577 130748 133539 135043 135906 137137 138713 139867 140250 140431 141543 144392 148529 152246 153838
55499 153838 152706 149119 143663 137581 132722 129866 127468 123375 117707 112774 110061 108664 107157 105792
55485 105792 105980 108198 111299 113775 115091 115624 115550 114278 111312 107521 104892 104728 106624 109420 112487
55470 112487 115558 118055 119469 120082 120635 121581 123165 125725 129154 132531 135051 136925 138726 140413 141852
55455 141852 143631 146201 148747 150151 150690 151368 151893 150975 148695 146838 146367 146028 144193 140862 137081 133446
55439 133446 130100 127314 125019 122327 118526 114227 110750 108527 106759 104457 101243 97275 92949 88663
55425 88663 84458 79940 74906 70009 66347 64263 62789 60522 57061 53473 51275 50924 51407 51295 50018
55410 50018 48039 46150 44903 44433 44334 43756 42083 39609 37280 35743 34845 33995 32694 30839 28861 27488
55394 27488 26959 26547 25405 23902 23586 25527 28986 32024 33262 32891 32053 31472 30884 29865 28839 28676
55378 28676 29215 29029 27296 25324 25305 27744 31010 33438 34953 36371 37892 38866 38649 37276 35468 34178
55362 34178 33836 33963 33811 33422 33578 34603 35780 36265 36003 35257 33727 30878 27115 23856 22124 21441 20516
55345 20516 18959 17803 18163 19654 20642 20073 18582 17535 17451 17851 18227 18402 17976 16319 13478 10551 8742
55328 8742 8381 9188 10926 13231 15173 15796 15182 14419 14377 14955 15634 16197 16533 16298 15350 14347 14251 15282
55310 15282 16884 18641 20530 22174 22682 21764 20351 19514 19192 18635 17630 16490 15247 13836 12896 13238
55294 13238 14433 14934 13955 12353 11346 11259 11899 13207 14811 15720 15339 14346 13854 14036 14113 13376 11723 9591
55276 9591 7758 6783 6308 5550 4874 5921 9383 13515 16011 16711 17201 18201 18843 18544 18143 18657 19860
55259 19860 20682 20475 19497 18524 18089 17879 17031 15418 14214 14468 15458 15542 14519 14036 15419 18149 20759
55242 20759 22291 22357 20723 17649 14242 11775 10778 11060 12278 14131 16146 17548 17405 15249 11942 9618
55226 9618 9981 12625 15684 18012 19840 21301 21658 20651 19528 19613 20363 19986 17943 15921 15972 18168 20505
55209 20505 20985 19490 17507 16263 15631 14976 14440 14738 15988 17487 18557 18884 18175 16434 14724 14677 16647
55192 16647 18908 19240 17040 13645 11044 10529 12022 14229 15575 15335 13966 12640 12733 15132 19109 22178
55176 22178 22272 20062 17961 16870 15514 13350 12152 13472 16101 17677 17798 17784 18099 18037 17747 18649 21454
55159 21454 25186 28573 31174 32766 32925 31959 31223 31710 32996 34220 35371 36771 37839 37441 35436 33126
55143 33126 31881 31762 31767 31157 30177 29438 29021 28603 28267 28467 29006 28908 27883 27094 27409 27566 25573 21845 19258
55124 19258 19591 21444 22589 23004 24147 26122 27360 26937 25700 24781 24186 23365 22278 21347 20918 21143 21927
55107 21927 22714 22924 22824 23344 24668 25786 25942 25782 26341 27566 28732 29790 31144 32332 32212 30541
55091 30541 28288 26152 23885 21430 19574 18749 18136 16920 15704 15728 17221 19433 21748 23665 24188 22645
55075 22645 20194 19104 20122 21576 21604 20376 19475 19847 21135 22547 23675 24679 26174 28694 31853
55060 31853 34289 34913 34001 32707 31791 31267 30998 30966 30973 30651 29939 29274 29269 30444 33149 37267 41950 46145
55042 46145 49731 53696 58710 63713 66603 66647 65665 66226 68859 71774 73344 73960 75010 76872 78793 80224
55026 80224 81275 81976 82102 81762 81259 80352 78622 76744 76197 77207 78111 77573 76465 76451 77357 77280 75074 71569
55008 71569 68288 65984 64664 64146 64064 63844 63203 62561 62678 63861 65551 66679 66619 65842 65385 65611 65934 65950
54990 65950 66143 66997 68002 68297 67788 66826 65260 62849 60335 58832 58156 57010 55094 53734 53893 54728
54974 54728 54936 54559 54527 55142 56047 57153 58473 59366 59087 58054 57541 57976 58430 57996 56887 55891 55488 55963
54956 55963 57686 60635 63985 66726 68561 69845 70925 71979 73268 75043 77138 79017 80321 81225 82359
54941 82359 84397 87526 90980 93394 93977 93185 91923 90438 88545 86704 85950 86617 87857 88766 89307 89802
54925 89802 90163 90166 89930 89547 88706 87289 85925 85268 85081 84738 84267 84043 83767 82838 81676 81569 82957 84880
54907 84880 86344 87246 87542 86666 84588 82544 81728 81777 81529 80924 81151 83040 86179 89665 92981 95964 98513
54890 98513 100623 102442 104240 106479 109686 113900 118360 122238 125607 129319 133933 139239 144932 151389
54876 151389 159633 170507 183755 197745 210439 221025 230422 239944 249738 258834 266218 271160 272789
54863 272789 270293 263760 254279 243049 230781 217948 205089 192739 181439 171774 163879 156900 149468
54850 149468 140966 132053 124007 117942 114459 113308 113323 113399 113742 115521 119103 123398 127355 131429 136902
54835 136902 144241 152814 161933 171493 181563 191846 201723 210716 218853 226590 234167 241017 246065 248602
54821 248602 248495 245546 239366 230252 219665 209132 198878 188111 176634 165636 156603 149585 142820
54808 142820 134283 123801 113506 105886 101456 98649 95773 92421 89015 85922 83464 82017 81426 80870
54794 80870 80043 80012 82110 86039 89762 91290 90206 87693 85556 84903 85098 84143 80772 76054 72255 70177
54778 70177 68429 65381 61033 56685 53515 52016 52237 53893 56245 58332 59468 59624 59430 59679 60462 60877
54762 60877 59950 57815 55665 54622 55154 57358 60973 64934 67722 68692 68634 68733 69424 70546 71948 73473
54746 73473 74851 76140 77856 80087 81846 82034 80876 79873 80474 83178 87630 92844 97402 100233 101597
54731 101597 103165 106930 113858 123123 132402 139489 144273 148851 155215 163292 171963 181375 192875 206641
54717 206641 220839 233782 245875 258543 271783 283558 291364 293868 291396 285499 277977 269833 261000
54704 261000 251154 240542 230017 220706 213757 209751 207857 206086 203040 199244 196334 195161 195190 195519
54690 195519 195931 196991 199504 203755 209009 214068 218596 223556 229927 237546 245832 255106 266180 278915
54676 278915 292325 306243 321792 339763 359228 378202 395096 409138 419822 426383 427658 422548
54664 422548 411210 395785 379155 362654 345617 327406 308961 291795 276233 261436 246674
54653 246674 231795 217015 203161 191779 183841 178262 172668 165964 159416 154801 152089 149508 145598
54640 145598 140635 136016 132714 130626 129281 128679 129014 129701 129376 127177 123759 120696 119158 119357 120808
54625 120808 122555 123442 122828 121098 119131 117409 116031 115323 115727 117185 119311 122143 125958 130283 133903
54610 133903 136187 137689 139076 140216 140859 141478 142688 144299 145849 147739 150840 154996 158868 161445 162978
54595 162978 164274 165854 168122 171473 175625 179440 182114 184159 186528 189182 191292 192597 193694 195148
54581 195148 197314 200952 206808 214116 220638 225070 228670 233709 241023 250099 260953 274435 290575
54568 290575 307918 325040 341916 359289 377414 395890 414141 431276 445763 455905 460836 460892
54556 460892 457069 450267 440834 428728 414209 398285 382130 366073 349648 332796 316472 301714
54544 301714 288516 275988 263365 250581 238249 227451 219216 213592 209261 204413 198116 190801 183564
54531 183564 177163 171546 166252 161238 157034 153822 150721 146721 142151 138346 135773 133511 130814 128093
54517 128093 125832 123626 121080 118668 116719 114435 111049 107218 104052 101431 98701 96457 95926 96746 97137
54502 97137 96415 95681 95604 95219 93688 91806 90685 90077 89157 88162 88067 89095 90534 91664 91991 91029 88895
54485 88895 87020 87258 90023 93863 96967 98640 99341 99870 100832 102566 105240 108904 113368 118119 122529
54470 122529 126271 129402 132090 134493 136940 139877 143588 148321 154605 162882 172672 182721 192293 201738
54456 201738 211442 220822 228900 235395 240604 244537 246799 247147 245640 242430 237933 232922 227721 221450
54442 221450 212903 202374 191869 183138 175948 168713 160556 152232 145142 139849 135798 132209 128848 125791
54428 125791 122868 119839 116989 114937 113680 112433 110791 109522 109554 110457 110675 109268 106887 104892 104037
54413 104037 104129 104554 104886 105282 106463 108962 112252 114961 116297 116847 117522 118102 117638 116328 116045 118374 122656
54396 122656 126736 129419 131255 132924 133923 133539 132310 131465 131165 130271 128000 125031 122630 121285 120635 120298
54380 120298 120259 120569 121047 121277 120812 119523 117969 117141 117458 118070 117518 115272 112424 110576 110098 109777 108294
54363 108294 105723 103283 101928 101755 102582 104261 106203 107493 107985 108674 110405 112907 115610 118512 121364
54348 121364 122929 122440 121224 121270 122509 123339 123841 126332 131903 138119 141576 141732 140981 141638 144035 147119
54332 147119 149808 151790 153651 156192 159395 162388 164604 166250 167350 167224 165588 163428 162000 161431 160873
54317 160873 159476 156687 152374 147346 143062 140074 137424 134298 131357 129501 128197 126296 123906 122056
54303 122056 120852 119263 116641 113488 110852 109822 111213 114625 118189 120308 121377 122784 124776 126634
54289 126634 128425 130824 133384 134825 135242 136315 138897 141991 144590 146904 149022 149925 148970 147242 146334
54274 146334 146590 147364 148129 148360 147140 143997 139678 135280 131082 126920 123131 120221 118032 116046 114234
54259 114234 112846 111616 109889 107406 104444 101378 98506 96087 94096 92198 90253 88556 87277 86132
54245 86132 84981 84302 84614 85804 87339 88696 89306 88724 87429 86767 87444 88547 88773 88159 87737 87867 87810
54228 87810 86815 84840 82313 79887 78344 77998 78143 77732 76668 75837 75837 76292 76568 76627 76898 77694 78995 80571
54210 80571 82041 82916 82818 81808 80586 80240 81453 83933 86870 89927 93308 96763 99288 100276 100500 101395
54194 101395 103560 106277 108157 108001 105578 102086 99395 98299 97878 97032 96072 96067 97127 98251 98627 98315
54178 98315 97798 97587 98048 98917 99244 98558 97775 98071 99264 100375 101428 103344 106098 108490 109949 111128
54162 111128 112298 112670 112042 111734 112797 114409 115178 115112 115044 114961 114328 113570 113655 114344 114338 113275 112287 112220 112496 112291
54142 112291 111915 112291 113597 114980 115319 113993 111295 108352 106249 104941 103450 101266 98957 97164 95680
54127 95680 94165 93255 94162 97228 101369 104970 106939 107052 105824 104218 103128 102827 102780 102011 99849 96662
54111 96662 93803 92324 91612 89815 85914 80827 76190 72724 70336 69071 68920 69168 69077 69144 70509 73005
54095 73005 74849 74654 72828 70576 68420 66319 64450 63106 62259 61856 62179 63371 65002 66580 68094
54080 68094 69539 70344 69914 68510 67016 66007 65428 64892 63893 62064 59682 57600 56338 55678 55439 55995
54064 55995 57488 59252 60757 62324 64010 64547 62717 59363 56793 56387 57891 60646 64057 67026 68483
54049 68483 68675 68575 68073 66284 63782 62657 63753 65598 66883 68279 70658 73099 74175 73993 73402 72188
54033 72188 69838 67380 66580 67557 68807 69489 70142 71069 71660 71710 72139 73704 75983 78228 80473 83111 85855
54016 85855 87807 88372 87822 86991 86604 86821 87408 88306 89752 91713 93591 94806 95328 95392 95240 95495 97041
53999 97041 99791 102188 102926 102713 103331 105314 107673 109706 111719 113894 115832 117599 120088 123713 127579
53984 127579 130601 132849 135361 139116 144445 150758 156577 160715 163887 168368 175432 183844 191594 198460
53970 198460 205983 215319 226027 236801 246531 254598 260848 265591 269405 272805 276142 279477 282269 283508
53956 283508 282713 280762 279297 279285 280400 281731 282648 282926 282399 280830 278112 274502 270434 265986 260661 254075
53940 254075 246863 240417 235514 231627 227900 224373 221760 220333 219618 219082 218515 217761 216646 215344 214339
53925 214339 213738 212884 210902 207453 202933 198331 194995 194021 195230 196888 196962 194939 192119 190021 188765
53910 188765 187220 184559 181384 179274 179372 181410 183923 185274 184546 181825 178009 174543 172893 173558 175380
53895 175380 176323 175409 173628 172630 172839 173381 173568 173675 174237 175413 177373 180572 185059 189845 193520 195435
53879 195435 196183 197232 200219 205960 213643 221367 228019 234339 241608 249693 257134 263070 268241 273819
53865 273819 279816 285016 288250 289496 289833 290516 292148 294694 298070 302372 307567 313424 319840 326768 333661
53850 333661 339594 344347 348839 354101 360337 367403 375339 383634 390737 395485 398673 401994 405569 407749
53836 407749 407411 405181 402084 398100 392695 386043 379165 373298 369334 367182 365362 361907 356055 348645
53822 348645 340697 332318 323237 313640 303905 294148 284588 275927 268786 262967 257595 251761 244976 237523
53808 237523 230584 225441 222164 219471 216091 211767 206843 201598 196407 191860 188214 185168 182548 180604
53794 180604 179242 177584 174839 171171 167407 164399 162831 162712 162676 160854 157205 153987 152977 153203 152542
53779 152542 150607 148662 147411 146588 146332 147169 148570 149231 149031 149161 149863 149670 147648 144956 143101 141792
53763 141792 139848 137497 136350 137331 139770 142507 144991 147152 148974 150476 151732 152829 154050 155908
53749 155908 158536 161284 163597 166178 170411 176354 182144 186040 188535 191712 196756 202944 209030 214765
53735 214765 220668 227023 233716 240587 247194 252589 256230 259107 262973 268090 272593 274683 274798 274897 276082
53720 276082 277856 279370 280238 280003 277933 274113 270071 267569 266914 266967 266551 265243 262970 259618 255395 251106
53704 251106 247565 244806 242126 238888 235113 231421 228592 227013 226252 225224 223143 220423 218357 217882 218897
53689 218897 220717 222614 223763 223399 221583 219372 217502 215242 211339 206003 201105 198263 197402 197299 196784
53674 196784 195153 192261 188803 186045 184700 184219 183551 182300 180868 179816 179468 179837 180538 181030 181325 182250
53658 182250 184585 187996 191151 192946 193539 194238 196329 199765 203095 205031 206011 207724 211115 215547 219984
53643 219984 224155 228196 231997 235534 239308 243789 248774 253582 257412 259229 258219 255109 252368 252160
53629 252160 254490 257953 261521 264677 266559 266496 265308 264735 265432 266509 267211 267981 269543 271713 273492 273833
53613 273833 272246 269262 266383 264922 264827 265226 265948 267570 269950 271749 271919 270925 270080 270182 271090 272123
53597 272123 272587 272331 271938 271965 272053 271389 269926 268416 267245 266178 265364 265538 266857 268430 269516 270284 270891
53580 270891 270672 269029 266543 264518 263864 264911 267693 271715 275895 279388 282258 284946 287585 290242 293146
53565 293146 296099 298285 299466 300852 303924 308644 313605 317679 320873 323849 327377 332094 338107 344841
53551 344841 351657 358269 364168 368448 371189 374405 380138 387715 394265 398232 401043 404849 409882 414951
53537 414951 419530 424157 429101 433761 437485 440250 442413 444323 446378 449017 452255 455406 457642 458914
53523 458914 460052 461713 463368 463780 462553 460677 459280 458442 457783 457687 458975 461495 464113 466322 468935
53508 468935 472734 477221 481210 483973 485186 484581 482634 481048 481359 483104 484481 484852 485451 487303 489712
53493 489712 491607 493425 496451 500825 505418 509531 513451 517110 519455 519948 519900 521360 525017 529982 535366
53478 535366 541142 547443 553997 560741 568358 577531 587891 598247 607766 616553 625206 634390 644916
53465 644916 657655 672829 689562 706607 723564 741038 759513 778473 797006 815025 833413
53454 833413 852991 873803 895558 918352 942567 968278 995168 1023031 1052048 1082408 1113786
53443 1113786 1145445 1176956 1208749 1241696 1276051 1311051 1345870 1380633 1416011 1451994 1487781
53432 1487781 1522907 1557621 1591773 1624248 1654269 1682771 1711643 1741844 1772909 1803996 1834651
53421 1834651 1864828 1895019 1926253 1958990 1991931 2022775 2050458 2075960 2100808 2125600 2150198
53410 2150198 2174394 2197733 2219337 2238580 2255497 2269966 2280992 2287452 2289396 2287974 2284229 2278445
53398 2278445 2270625 2261098 2250456 2239084 2226865 2213394 2198506 2182477 2165503 2147204 2127137 2105647
53386 2105647 2083518 2060752 2036579 2011082 1985921 1962679 1941072 1919586 1897413 1874951 1852747
53375 1852747 1831084 1810555 1791971 1775297 1759580 1744497 1731392 1721989 1716312 1712636 1709542 1707371
53363 1707371 1707265 1709373 1712759 1716965 1722644 1730232 1738865 1747491 1756574 1767587 1781025 1796176 1813031
53350 1813031 1833032 1857111 1884036 1911793 1940040 1970100 2002886 2037914 2074349 2112113 2151763
53339 2151763 2193910 2238871 2286423 2335827 2386608 2439304 2494911 2553556 2614215 2675867 2738430
53328 2738430 2802461 2868375 2936084 3004943 3073838 3141786 3208755 3275677 3343313 3411129 3477366
53317 3477366 3540112 3598404 3652653 3704168 3754046 3802216 3847368 3887771 3922159 3950107 3971788
53306 3971788 3987425 3996940 4000177 3997383 3989128 3975567 3956156 3930478 3899144 3863483 3824310 3781262
53294 3781262 3733411 3680532 3623799 3565267 3506483 3447599 3388021 3327681 3267101 3206335 3144954
53283 3144954 3083493 3023986 2968146 2915485 2864064 2812643 2761235 2709978 2658677 2607588 2557690
53272 2557690 2509843 2464193 2420546 2378808 2339075 2301806 2267775 2237238 2209244 2182536 2157103
53261 2157103 2134052 2113871 2095612 2077939 2060150 2041908 2022782 2002551 1981527 1960354 1939986
53250 1939986 1921824 1906975 1895009 1884269 1873832 1864434 1857088 1851645 1847393 1844328 1843021 1843750 1846530
53237 1846530 1851519 1858612 1867096 1876623 1888121 1902673 1919560 1936572 1952577 1968986 1988284 2011692
53225 2011692 2038613 2067647 2097399 2126593 2154331 2180566 2205946 2230799 2254509 2276318 2296623
53214 2296623 2316790 2337189 2355956 2370351 2379208 2383352 2383862 2381018 2375232 2367776 2359612 2350076 2337678
53201 2337678 2321843 2303015 2281359 2256533 2228885 2199846 2170616 2141112 2110763 2079731 2048623
53190 2048623 2017225 1984418 1949606 1913743 1878469 1844443 1811078 1777914 1745633 1715170 1686256
53179 1686256 1657645 1628908 1601129 1575369 1550941 1526019 1499711 1472891 1447020 1422817 1400274
53168 1400274 1379325 1360038 1342313 1325804 1310099 1294830 1279723 1264764 1250334 1237012 1225117
53157 1225117 1214365 1203923 1192865 1180710 1167654 1154286 1140976 1127434 1112810 1096311 1077876
53146 1077876 1058280 1038625 1019831 1002593 987469 974426 962315 949362 934608 918707 903090
53135 903090 888528 874747 861205 847755 834476 821239 807744 793991 780535 768050 756521
53124 756521 744992 732465 719054 705925 693939 682715 671325 659618 648394 638391 629477 620849
53112 620849 611701 601741 591394 581610 573173 566086 559701 553345 546552 538857 529919 520171 510919 503341
53098 503341 497398 491989 486232 480353 475241 471262 467680 463282 457514 450984 444992 440675 438470 437984
53084 437984 438167 437891 436647 434547 431498 426759 419971 412404 406278 402454 399389 394978 389030 383333 379590
53069 379590 377973 377514 377046 375622 372858 369366 366351 364341 362656 360465 357834 355232 352495 349009 344654
53054 344654 339856 334904 329965 325582 322168 318951 314541 308917 303852 300691 298547 295609 291626 288031
53040 288031 285880 284676 283281 281145 278405 275428 272536 269775 266831 263503 260251 257868 256583 255858
53026 255858 255043 253761 251697 248658 245101 242106 240495 240137 240212 239924 239050 238164 238294 239779 241324 240885
53010 240885 237838 233891 231475 231569 233395 235764 238107 240445 243100 246572 251136 256139 259945 261149 260045
52995 260045 258590 258562 259945 261586 263159 265492 268682 270957 270421 267409 263980 261309 258718 255368 251623
52980 251623 248224 244974 241049 236274 231597 228449 227594 228202 228152 225941 222299 219168 217081 214664 210914
52965 210914 206682 203241 200640 198500 197332 197675 198498 197941 195485 192274 189371 186854 184586 182788 181598
52950 181598 181025 181510 183562 186477 188342 187845 185520 182744 180243 178084 176498 175797 175710 175579 175298 175470
52934 175470 176516 178010 179115 179414 179201 179178 179956 181519 182913 182835 180991 178653 177306 176909 176223 174812
52918 174812 173640 173247 172557 170585 168403 167962 169354 170818 171375 171802 172757 173624 173916 174392 175864 178025
52902 178025 180432 183542 187651 191717 194437 195900 197146 198706 200481 202295 203504 202923 200462 198245
52888 198245 198624 201564 205240 208673 212162 215624 218440 220996 224536 229062 232886 234755 235154 235191 235525
52873 235525 236751 239382 242707 244916 245117 244345 243945 243968 243808 243494 243579 244464 246388 249394 252870 255922 258604
52856 258604 261947 266359 271002 275180 279236 283462 287259 290199 292954 296320 300147 304014 307957 311720
52842 311720 314313 315315 315629 315928 315455 313693 312142 312663 314633 315463 313796 310769 308321 307576 308646 310500
52826 310500 311048 308829 304843 301511 299852 298938 298087 297962 299128 300990 302684 303729 303359 300648 296026
52811 296026 291406 287893 284651 281024 278527 279149 282403 285570 286555 285257 282488 279116 276343 275210 275151
52796 275151 274171 271366 268447 267794 269500 271468 272237 272501 273453 274736 275005 273925 272425 271066 269431 267528
52780 267528 266703 268185 271285 273995 275156 275269 275412 276113 277220 278121 278166 277526 277437 278672 280018 279417 276636
52763 276636 273475 271132 268916 266254 264347 264505 265932 266705 266233 265139 263270 259718 254890 250684 247998
52748 247998 245568 242163 238723 237098 237472 238281 238349 237934 237659 237376 236550 235230 234282 234737 236963 240345 243795
52731 243795 246697 249164 251191 252010 250851 248311 246275 246199 247702 249054 248791 246730 243749 240859 238408
52716 238408 235910 232623 228360 223662 219174 215078 211355 208349 206605 206011 205466 203702 200375 196168 191937
52701 191937 188163 185241 183654 183280 182824 180768 177093 173376 170726 168231 164205 158668 153663 150933 150051
52686 150051 149176 147046 143728 139874 135989 132447 129650 127892 127069 126589 125609 123641 121089 119103 118648
52671 118648 119696 121248 122033 121308 119386 117503 116812 117276 117809 117544 116539 115107 113165 110779 108826 108284
52655 108284 108937 109368 108269 105481 101968 99215 98332 99136 100245 100564 100449 100799 101371 101015 99509 98069
52639 98069 97727 98161 98594 98994 99755 100836 101990 103340 104973 106155 105767 103613 100833 98853 98202 98412
52623 98412 98922 99905 102068 105605 109626 112910 115028 116263 116651 115912 114384 113151 112854 113070 113365 114260
52607 114260 116500 119768 122864 124901 125848 126045 125747 124993 123577 121287 118488 116238 115491 116470 119013 122983
52591 122983 127815 132193 134929 136114 136770 137612 138683 140002 141853 144374 147393 150693 154116 157471 160660
52576 160660 163675 166195 167507 167321 166302 165287 164459 163937 164566 166890 169584 170304 168466 165957 164554
52561 164554 163619 161224 156869 152137 148843 147374 146927 146743 146720 146902 146776 145602 143633 142474 143524 146127
52545 146127 147997 147581 145413 143067 141605 141365 142391 144261 145911 146465 146106 145578 145026 143980 142515 141757
52529 141757 142899 145974 149843 153143 155184 156176 156874 157965 159558 161198 162465 163449 164490 165463 165741
52514 165741 165081 164284 164533 166187 168629 171187 173658 175854 177332 177856 177634 176850 175609 174667 175343 177918
52498 177918 180683 181487 179964 177509 175546 174650 174936 176094 177207 177695 178366 180401 183345 185476 186271 186971
52482 186971 188243 188952 188248 187457 188472 191144 193602 194632 194485 193893 193616 194677 197617 201439 204501 206612
52466 206612 209115 212704 216349 218878 220552 222284 224076 225261 225889 226933 229054 231855 234465 236385
52452 236385 237493 237644 236706 234907 232836 231030 229790 229451 230513 233014 235824 237041 235436 231511 227039
52437 227039 223704 222176 222118 222649 222877 222369 221454 221086 222202 224822 227616 228691 227256 224435 222072 220907
52421 220907 220496 220747 222453 225795 229251 231053 231374 232018 233909 235925 236650 236478 237196 239794 243493 246903
52405 246903 249344 250659 250575 249164 247712 247954 250069 252304 253172 253201 253666 254321 253849 252281 251356 252095 253440
52388 253440 254110 254687 256699 260260 263726 265452 265106 263412 261451 260218 260181 261082 262385 263876 265591 267499
52372 267499 269574 271874 274158 275756 276239 275910 275206 274089 272523 271071 270285 269824 269006 267963 267462 267663
52356 267663 267887 267613 266925 265897 264237 261849 259304 257588 257590 259622 262923 265751 266580 265360 263367 262074
52340 262074 262437 264683 267998 270820 272331 273383 275037 276646 276702 275360 274482 274947 275487 274848 273646 273190
52324 273190 273759 275067 277319 280422 282974 283513 282400 281183 280445 279564 278409 277773 277972 278488 279491 282463
52308 282463 288431 296363 304187 310855 316658 322038 327164 332488 338572 345018 350423 353986 356643 359957
52294 359957 364169 368025 370520 372113 374055 377045 380769 384351 387019 388773 390690 394051 398843 403631
52280 403631 407360 410643 414628 419251 423693 428155 433849 441154 448970 456226 462999 469803 476748 483957
52266 483957 491974 501117 511105 521842 533860 547368 561477 575110 588223 601565 615810 631448
52254 631448 648864 667692 686678 705091 723835 744385 767022 791057 816261 842813 869996
52243 869996 896336 921435 946675 973701 1002944 1033897 1066066 1099055 1132212 1164663 1195471
52232 1195471 1223767 1249200 1272499 1295058 1317657 1339847 1360778 1380199 1398435 1415693 1431631
52221 1431631 1445428 1456209 1463716 1468666 1472236 1475169 1477532 1479186 1480050 1480038 1479212 1477901 1476210 1473544
52207 1473544 1469255 1463651 1457691 1451819 1446060 1441375 1439684 1441822 1446351 1451226 1456191 1462688 1471774 1482978
52193 1482978 1495238 1508337 1523157 1540638 1560500 1581078 1600775 1619642 1638986 1659332 1679623
52182 1679623 1698805 1717245 1735724 1753643 1769342 1782022 1792448 1801879 1811001 1819823 1827715 1833501
52170 1833501 1836281 1836323 1834504 1830907 1824762 1815942 1805592 1794822 1783462 1770636 1755985 1739764 1722257
52157 1722257 1703745 1684763 1665751 1646648 1627475 1609075 1592517 1577661 1563072 1547709 1532195
52146 1532195 1517999 1505855 1495598 1487231 1481269 1477747 1475567 1473354 1470666 1467897 1465314 1462866 1460699
52133 1460699 1459034 1457382 1454723 1450920 1447219 1444674 1442660 1439810 1436070 1432760 1430583 1428513 1425054 1419972
52119 1419972 1414407 1409686 1406224 1403164 1398943 1392704 1385430 1379143 1374678 1370810 1366052 1360759 1356685 1354634
52105 1354634 1353324 1350706 1345955 1339934 1333967 1328475 1322845 1316572 1310239 1304994 1301109 1297512 1292947 1287135
52091 1287135 1280586 1273821 1267250 1261360 1256327 1251650 1246767 1241880 1237644 1234199 1231219 1228817 1227599 1227658
52077 1227658 1228194 1228467 1228526 1228652 1228587 1227763 1226083 1224080 1222460 1221687 1221798 1222484 1223577 1225551 1229179 1234604 1241211
52060 1241211 1248619 1257235 1267322 1278111 1288596 1298978 1310545 1324087 1339162 1355154 1372503 1392495
52048 1392495 1416069 1443099 1472541 1502980 1533337 1563609 1595014 1629022 1665900 1704131 1741421
52037 1741421 1776412 1809498 1841981 1874459 1905982 1934793 1959875 1981772 2001813 2020544 2037107
52026 2037107 2050379 2060545 2069049 2076742 2082641 2085086 2083881 2080477 2075892 2069325 2059369 2046104 2031244
52013 2031244 2016322 2001461 1986148 1970667 1956237 1943769 1932965 1922840 1912966 1903775 1895651 1888270
52001 1888270 1881322 1875554 1872367 1872341 1874795 1878886 1884523 1891924 1901020 1911806 1924663 1939600 1955415
51988 1955415 1970286 1983104 1993902 2003398 2012651 2022660 2033364 2043172 2050361 2054925 2058229 2060824 2061540
51975 2061540 2058970 2052960 2044200 2033135 2019923 2004951 1988796 1971924 1954696 1937210 1918737 1897871
51963 1897871 1873899 1847757 1821081 1794534 1767597 1739778 1711269 1682328 1652610 1621523 1589108
51952 1589108 1556344 1524507 1494181 1464802 1435260 1405032 1374669 1345190 1317117 1290088 1263173
51941 1263173 1235552 1207061 1178172 1149375 1120804 1092669 1065553 1039583 1013510 985607 955612
51930 955612 924985 895056 865865 837103 809042 781839 754949 728256 703014 680505 660239
51919 660239 640520 620424 600284 580731 562365 545933 531523 517797 503363 488795 475901
51908 475901 465022 454757 444606 436113 430481 426504 421949 415940 408948 401366 393315 385233 377559
51895 377559 370217 363231 357303 352868 349175 345372 341930 339728 338056 335012 330069 325001 321807 320599
51881 320599 319996 318966 317702 316994 317059 316974 315397 312175 308848 306933 305963 304114 300790 297602 296449 297438
51865 297438 299155 300260 300219 298960 296649 293767 290971 288788 287499 287017 286709 285686 283648 281174 278848
51850 278848 276276 272555 267661 262845 259249 256522 253381 249553 246453 245342 245275 243763 239566 233905 228554
51835 228554 223800 219138 215167 213357 213927 215130 215073 213523 211672 210688 210812 211376 211480 210975 210725 211451 212415
51818 212415 211927 209162 204822 200138 196196 194300 195601 199604 203864 206058 205951 204964 204474 205167 207264
51803 207264 210526 214278 218040 221821 225425 228064 229215 229356 229327 229556 230350 232057 234163 235187 234582 233964
51787 233964 235155 237567 239040 238936 238812 239951 241815 243256 243960 244151 243894 243295 242584 241616 240022 238114
51771 238114 236842 236582 236803 237171 238022 239407 240640 241292 241708 242137 242300 242338 243092 244681 245820 245482 244462
51754 244462 244212 244845 245391 245507 245696 246100 246273 246156 246272 246764 246972 246160 244227 241731 239703 239221 240518
51737 240518 242514 243761 243869 243601 243775 244557 245688 246869 247952 249084 250348 250990 249606 245945 242092
51722 242092 240775 242494 245216 246851 247099 246747 246264 245579 244593 243355 242126 241528 242249 244399 247511 251186
51706 251186 255111 258459 260149 260160 259937 260979 263439 266540 269851 273488 277340 280816 283548 285976 289032
51691 289032 293273 298359 303418 307961 312303 316951 321897 326914 332282 338558 345614 352632 359278 366286
51677 366286 374436 383397 391956 399208 405200 410542 415603 420041 423204 425113 426728 428720 430241 429680
51663 429680 426648 422331 417829 413239 408779 405614 404561 404696 404351 403105 401861 401236 400829 399949 398210
51648 398210 395446 391993 389186 388739 391222 395580 400202 403856 405662 405168 403052 401049 400438 400902 401449
51633 401449 402076 403703 406603 409743 412043 413718 415896 419191 423174 427202 431258 435789 441119 447285
51619 447285 454190 461482 468276 473436 476350 477477 478088 479412 481820 484634 486894 488400 489789 491379
51605 491379 492487 492385 491560 491249 491909 493054 494541 496752 499194 500169 498741 496020 493419 490376 485150
51590 485150 477572 469657 463316 458568 454234 449389 443913 438555 434741 433280 432673 429759 422976 414328
51576 414328 407147 402414 398426 393838 389558 387264 387112 387682 387616 386513 384616 382413 380561 379505 378970
51561 378970 378161 376591 374334 371488 368011 364422 362005 361551 362048 361450 358934 355859 354143 354119 354501 354241
51545 354241 353797 354294 355758 356754 355980 353956 352663 353525 356217 359616 363241 367176 371111 374376 376893
51530 376893 379284 381944 384738 387652 390950 394465 397618 400509 404030 408308 411854 413113 412272 410753
51516 410753 409481 408506 407778 407102 405543 402076 397017 391972 388223 385878 384595 384232 384566 385180 385975 387206
51500 387206 388753 390057 391014 392242 394098 396121 398003 400521 404744 410485 416110 419952 421708 422507 423757
51485 423757 425800 427622 428038 427084 425838 424876 423496 420737 416691 412419 408893 406359 404511 402923 401449
51470 401449 400480 400692 402265 404462 406137 406700 406536 406586 407502 409093 410704 412220 414378 417761 421897 426004
51454 426004 430271 435319 440442 443611 443726 441779 439130 435666 430769 425337 421388 419691 418963 417557 414899
51439 414899 411034 405860 399719 394131 390808 389663 388430 384722 378452 371894 367501 365946 366268 367272
51425 367272 368316 369173 369929 371096 373215 376304 380163 385028 391132 397629 402966 406610 409538 412668 415908
51410 415908 419347 424185 431388 440148 448741 456312 462793 467754 470751 472513 474455 477038 479677 481985
51396 481985 483946 485037 484636 483303 482296 481721 480633 479070 478304 478672 478913 478439 478504 480130 482482 484591
51380 484591 487122 490762 494228 495892 496416 497645 499489 500195 499511 499228 500258 501282 500926 499414 497263
51365 497263 494089 489798 485554 482418 480077 477858 475809 473783 470738 466298 462041 459688 458707 457170
51351 457170 454382 451179 448157 445220 442629 440802 439150 436695 433938 432531 432911 433919 435126 437700
51337 437700 442169 447022 450692 453535 456507 459052 459883 459135 458191 457675 457023 455755 453975 451742 449098
51322 449098 446614 444741 442686 439111 434041 428933 424634 420373 415090 408744 401768 394232 386337 379082
51308 379082 373543 369595 365872 360965 354573 347659 341598 336944 333019 328936 324771 321192 318149 314736
51294 314736 310399 305497 300584 295917 291877 289049 287498 286560 285559 284083 281483 277176 271856 267403
51280 267403 264972 264013 263661 264021 265312 266869 268114 269659 272132 274617 275657 275272 274480 273197 270397
51265 270397 266480 263804 264262 267472 271795 275954 279163 280990 282054 283976 287655 292185 296311 300317
51251 300317 305411 311554 317015 320230 321299 321387 321255 320742 319449 317485 315490 314044 313168 312439 311412 309789
51235 309789 307328 303944 299894 295540 290971 286198 281640 277864 274701 271205 266795 261968 257479 253237
51221 253237 248597 243495 238745 235174 232919 231643 231096 231188 231635 231682 230379 227393 223660 220957 220401 221297
51205 221297 221678 220079 216716 212978 210023 208102 207055 206904 207625 208674 209406 210000 211312 213431 215014
51190 215014 214718 212976 211550 211451 212125 212747 213483 214949 217001 218671 219147 218430 217139 215867 214643 212945
51174 212945 210386 207396 204943 203615 203328 203940 205554 207940 210212 211609 212302 213026 214043 214885 215097 214918
51158 214918 215099 216057 217197 217274 215696 213401 212023 212227 213304 214395 215430 216688 218095 219429 220806
51143 220806 222512 224619 226940 229049 230219 230060 229506 230356 233131 236018 236732 235068 232823 231480 230773
51128 230773 229430 226639 222772 219202 217281 217030 216978 215730 213493 211550 210683 210773 211597 213068 214804 216273
51112 216273 217410 218385 218891 218401 216987 215142 212972 210463 208351 207636 208206 209049 209831 210993 212043 211222
51096 211222 207574 202324 197473 193909 191468 189837 188602 187239 185860 185189 185208 184762 183267 181697 180856
51081 180856 179821 177522 174976 174291 175920 178402 180413 181507 181223 179356 177190 176667 177963 179457 180499
51066 180499 182440 186260 190809 194513 197456 200545 203672 206079 207793 209352 210582 210890 210414 209797 209108
51051 209108 208029 206864 206149 205390 203443 200330 197599 196474 196552 196823 197196 198369 200559 202981 204499 204570
51035 204570 203709 203088 203366 203842 203234 201481 200226 201067 203750 206640 208707 210321 212105 213796 214794 215400
51019 215400 216762 219427 222509 224570 225109 224810 224627 225066 226220 227893 229558 230793 232014 234283 238039
51004 238039 242417 246222 249140 251470 253111 253644 253335 253291 254389 256540 259078 261370 263037 264182 265680
50989 265680 268531 272469 275589 276028 273913 271284 270131 270829 272382 273692 274449 275108 276315 278277 280514
50974 280514 282366 283840 285753 288664 291741 293290 292667 291221 290861 292053 293792 295167 296055 296448 296214
50959 296214 295829 296184 297046 296783 294606 292284 292444 295564 299806 303519 306735 310323 314867 320502 326800
50944 326800 332701 337453 341752 346981 353463 360660 369014 379857 392979 406031 417334 427924 439619
50931 439619 452428 465293 478241 492012 506275 520176 534378 550706 569661 590008 611141
50920 611141 634190 660147 688283 717283 746931 777890 810728 846044 884787 927531 973918
50909 973918 1023566 1077039 1135124 1197664 1263979 1334158 1409011 1488852 1573162 1661286 1752650
50898 1752650 1846289 1941141 2036927 2133853 2231015 2325855 2415632 2498748 2574172 2640583 2697260
50887 2697260 2745288 2786414 2820515 2845338 2859191 2862893 2858501 2847184 2829453 2806949 2782613 2758871
50875 2758871 2736340 2714409 2692368 2669736 2646038 2620521 2591882 2558577 2520008 2477232 2431580
50864 2431580 2382651 2328746 2269449 2206468 2141196 2072658 1999106 1920987 1841167 1762545 1686583
50853 1686583 1613844 1544586 1478425 1414534 1352878 1294704 1241229 1192237 1146540 1103739 1064959
50842 1064959 1031598 1003640 979644 958433 940210 925561 913880 903728 894669 887620 882975 879416
50830 879416 875389 871108 868282 868243 870987 875689 881473 887994 895849 906061 918787 933041 948119 964462
50816 964462 982456 1001367 1020573 1040971 1063686 1087982 1112094 1135985 1161745 1191123 1223871
50805 1223871 1258592 1294187 1330654 1369749 1414620 1467214 1526032 1588010 1652652 1722560 1799851
50794 1799851 1884257 1975364 2074443 2182654 2299277 2423406 2556143 2699495 2854063 3019256
50784 3019256 3194827 3380476 3574523 3774525 3978912 4186761 4396389 4605353 4811285
50775 4811285 5011171 5199988 5371635 5521622 5648024 5750057 5827014 5878855 5906766 5912596
50765 5912596 5898349 5866480 5820226 5763483 5700597 5635971 5573137 5513966 5458869 5407341 5357959
50754 5357959 5308342 5255881 5198428 5134081 5060913 4977509 4883113 4776655 4656449 4521875 4374683
50743 4374683 4217473 4051483 3877273 3697205 3515588 3336218 3161050 2991394 2828890
50734 2828890 2674794 2529516 2393605 2268339 2154645 2052014 1958949 1874028 1796280 1725209
50724 1725209 1660912 1603706 1553313 1508735 1469049 1433873 1402934 1375725 1351751 1330747 1312610
50713 1312610 1297437 1285384 1275827 1266966 1257244 1247136 1238575 1232374 1227247 1221745 1216262 1212529 1211750
50700 1211750 1213734 1217276 1220906 1223775 1226346 1230044 1235990 1244280 1254492 1266373 1279910 1295304 1313081
50687 1313081 1333793 1357596 1384609 1415550 1451198 1491275 1534782 1581648 1633008 1689607 1750994
50676 1750994 1816724 1887209 1962703 2042623 2126920 2217250 2315488 2421458 2533201 2649186 2769141
50665 2769141 2892725 3018307 3143224 3264694 3380556 3489874 3592926 3689975 3779618 3858490
50655 3858490 3922660 3969296 3997286 4006808 3998542 3973297 3932612 3879647 3818924 3754715 3689759 3625685
50643 3625685 3564120 3506724 3454336 3406747 3363418 3324051 3288242 3254701 3220961 3184019 3141484
50632 3141484 3092125 3035146 2969270 2893198 2807082 2712877 2613024 2509432 2403988 2299128 2197053
50621 2197053 2098830 2004997 1916675 1835240 1761052 1693368 1631652 1576283 1527793 1485984 1450162
50610 1450162 1419884 1395036 1375161 1359035 1345367 1334134 1326994 1325749 1330231 1338085 1346935 1356505
50598 1356505 1368406 1384286 1404448 1427872 1453124 1479518 1507793 1539565 1575773 1615856 1658655
50587 1658655 1703835 1752106 1804441 1861581 1924061 1992122 2065401 2143020 2224037 2307758 2393771
50576 2393771 2481894 2571994 2663571 2755589 2846753 2935900 3022048 3104218 3181187 3251330 3312967
50565 3312967 3365242 3408442 3442997 3468464 3484470 3492475 3495419 3495201 3491499 3483572 3472236 3459368
50553 3459368 3446380 3434050 3423168 3414416 3408098 3404633 3404662 3407779 3411907 3414913 3416237 3415735 3411525 3400522
50539 3400522 3380861 3352322 3314369 3265360 3204345 3132560 3052499 2966245 2875179 2780658 2684399
50528 2684399 2588417 2494653 2404250 2317215 2233343 2153324 2078146 2007485 1939854 1874836 1814220
50517 1814220 1760192 1712972 1670952 1632826 1598735 1569327 1544349 1522759 1504260 1490236 1482626
50506 1482626 1481769 1485846 1492579 1500938 1511002 1523168 1538286 1557641 1581477 1607926 1634737 1661951
50494 1661951 1691515 1724198 1758303 1791949 1825433 1860633 1898913 1940232 1983544 2027371 2070424
50483 2070424 2112358 2153822 2195749 2238916 2284078 2331734 2381630 2433376 2487865 2547336 2613628
50472 2613628 2686985 2766874 2853371 2947436 3050438 3163558 3286975 3419516 3559905 3708356
50462 3708356 3865772 4031144 4201048 4372336 4544042 4715726 4884978 5047673 5199906
50453 5199906 5338674 5461440 5566184 5651612 5716495 5759204 5778614 5774881 5748649 5700267 5630783
50442 5630783 5543175 5441560 5329569 5210254 5087025 4963733 4844280 4732896 4633984 4550560
50432 4550560 4483320 4432064 4397022 4377529 4370626 4372898 4382931 4399585 4418135 4430675 4430900 4416486
50420 4416486 4386394 4338290 4269939 4181372 4074283 3950743 3813879 3668510 3519254 3368481
50410 3368481 3217306 3067858 2923269 2785906 2656880 2536945 2426665 2325770 2233305 2148377
50400 2148377 2070234 1998170 1932376 1874471 1826078 1786954 1755399 1730219 1711168 1697624 1688149
50389 1688149 1681842 1679205 1681217 1688131 1699395 1714119 1731465 1751180 1773925 1800348 1829649 1859854
50377 1859854 1889817 1920134 1951635 1983957 2016490 2049966 2085730 2123419 2160465 2194345 2224645
50366 2224645 2252569 2279123 2304416 2328320 2350839 2371667 2390092 2405861 2419836 2433490 2448072
50355 2448072 2464627 2484370 2508121 2535464 2565452 2598477 2636571 2681197 2731461 2785280 2841776
50344 2841776 2901419 2964105 3028334 3092519 3155985 3218080 3277136 3330997 3378025 3416830 3445454
50333 3445454 3461870 3465432 3456966 3437052 3404683 3358315 3298121 3226673 3147286 3062264 2973126 2882004
50321 2882004 2791836 2705039 2622824 2546250 2477225 2417793 2368880 2330395 2302101 2283574 2273676
50310 2273676 2270959 2274308 2282150 2291298 2297961 2300001 2296845 2287105 2268138 2238840 2201298 2158359 2110794
50297 2110794 2058245 2001769 1943529 1884558 1824838 1765381 1708249 1654303 1602770 1553556 1508217
50286 1508217 1467780 1431095 1396562 1364435 1336140 1311993 1290898 1272003 1255520 1241869 1230861
50275 1230861 1222046 1215433 1211613 1211088 1213327 1216713 1220025 1224029 1230863 1241622 1255271 1270236 1286093
50262 1286093 1303129 1321227 1340189 1360350 1381747 1403211 1423531 1443187 1463697 1485363 1506984
50251 1506984 1527847 1548625 1569834 1590506 1609128 1625111 1638623 1649546 1657389 1661995 1663863 1663893
50239 1663893 1663037 1661854 1660050 1656801 1651818 1645832 1639676 1633278 1625967 1617483 1608122 1597950 1586360 1572589
50225 1572589 1556411 1538279 1519022 1499549 1480696 1463121 1447136 1432571 1418860 1405430 1392153
50214 1392153 1379444 1367895 1357737 1348523 1339354 1329620 1319656 1310510 1302943 1296758 1291133 1285343 1279086
50201 1279086 1272463 1265946 1260001 1254388 1248102 1240440 1231860 1223379 1215398 1207649 1199990 1192478 1184779 1176347
50187 1176347 1167327 1158616 1150762 1143271 1135197 1125914 1115284 1103734 1092415 1082728 1075194 1069089 1063345
50174 1063345 1057521 1051802 1046539 1042011 1038232 1034895 1031944 1030212 1030809 1033665 1037356 1040710 1043906 1047632
50160 1047632 1051872 1056077 1059937 1063281 1065625 1066478 1065753 1063368 1058840 1051913 1043321 1034310 1025589 1017168
50146 1017168 1008874 1000386 991068 980472 968846 956633 943775 930189 916651 904346 893495 883108
50134 883108 872120 860268 848009 836320 826418 818769 812298 805458 798359 792982 790801 790920 791040 789731
50120 789731 787119 783808 779990 775711 771406 767751 764949 762267 758549 753352 747328 741232 734909 727826
50106 727826 720344 713639 708237 703432 698350 692910 687361 681512 674850 666882 657171 645861 634577 625728
50092 625728 620019 615379 609453 602500 596572 592385 588718 584861 581787 580257 579403 578301 577674 578555 580086
50077 580086 580331 579183 578912 581462 586270 591322 595609 599839 605117 611505 617976 623641 628977 635462 643695
50062 643695 652307 659538 665672 672865 682405 693243 703782 714060 725293 738013 751830 766566
50050 766566 782381 798810 814797 830027 845391 861707 878587 894918 909998 923885 937070
50039 937070 950167 963614 977280 990371 1001849 1010858 1016898 1020094 1021513 1022839 1025340 1029110 1033337
50026 1033337 1037181 1040443 1043584 1047153 1051174 1055342 1059932 1065982 1073922 1082426 1089620 1095571 1102736 1113629
50012 1113629 1128674 1146610 1166067 1186072 1205632 1223919 1241052 1258266 1277072 1298159 1320913
50001 1320913 1343885 1365958 1387044 1407363 1426224 1442255 1455086 1466104 1476990 1487823 1497003
49990 1497003 1502792 1504596 1503091 1499500 1494651 1488477 1480470 1470542 1459154 1446825 1433981 1421117 1408323
49977 1408323 1394871 1380329 1366106 1354461 1345454 1336373 1325219 1313561 1304542 1298872 1294470 1289663
49965 1289663 1285079 1282138 1281002 1280568 1279767 1278456 1277355 1277121 1277213 1275926 1272105 1266490 1260770 1255668 1250681
49950 1250681 1245298 1239472 1233049 1225688 1217386 1208263 1197960 1186097 1173289 1160801 1149213 1138302
49938 1138302 1128249 1119924 1113750 1109108 1105145 1101433 1097728 1093865 1090101 1086903 1084192 1081463 1078672 1076342
49924 1076342 1074812 1074116 1074487 1075999 1077758 1078547 1078397 1078300 1078163 1076277 1071270 1063417 1053487 1041384 1026627
49909 1026627 1009232 989533 968037 946077 925456 906542 887506 866258 842528 817583 792985
49898 792985 770342 750982 734586 719058 703005 687571 674514 663275 651580 638594 625872
49887 625872 615344 607731 602743 599219 594950 588054 579195 571276 566297 563441 560697 557302 553850 550972
49873 550972 548885 547710 547259 546706 545281 543319 542101 542537 544313 546354 547841 548729 549554 550965 553378
49858 553378 556714 560229 562814 563923 564296 565325 567495 569922 571575 572422 572925 573130 573082 573688 576118 580361
49842 580361 585263 590014 594756 599673 604497 609304 614838 621268 627248 631097 632719 633768 636042 640335
49828 640335 646693 654879 664283 674030 683783 694238 706334 720031 734425 749127 764904 782535
49816 782535 801585 820960 840296 859848 879078 896631 912250 927633 944373 961719 977593
49805 977593 991519 1005187 1019921 1034826 1048111 1059378 1069648 1079508 1088154 1094254 1097105 1096641 1092796
49792 1092796 1085354 1074380 1060442 1044180 1025880 1005731 984394 962835 941458 919790 897349
49781 897349 874500 852106 830609 809929 790114 771503 754187 737819 722151 707405 693873
49770 693873 681413 669593 658209 647509 637987 630052 623746 618516 613338 607298 600313 593264 587293
49757 587293 582810 579206 575574 571624 567905 565302 564386 564890 565587 565136 563582 562656 563786 566034 566951 565518
49741 565518 563230 561983 562012 562408 562529 562005 560382 557984 556473 557223 559431 561009 561134 560735 560597 560301 559327
49724 559327 558082 557316 557361 558328 560357 563256 566464 569645 572800 575573 577092 576853 575300 573251 571329
49709 571329 570237 571018 574459 580415 587903 595755 603247 610523 618419 627532 637550 647989 659357 672777
49695 672777 688521 705693 723414 741323 758766 774588 788342 800892 813249 825399 836783
49684 836783 847208 856821 865838 874830 884558 894952 904890 913531 921085 927642 932138 933521 932207 929306
49670 929306 924931 918481 910143 900743 890277 878009 864250 850760 838884 828224 817657 806883
49658 806883 796490 787186 779445 773382 768416 763540 758366 753536 749734 746757 743931 740923 737530 733186
49644 733186 727567 721674 717416 715807 716064 716809 717655 719067 720974 722322 722279 721331 720687 720871 721470 722214 723548
49627 723548 725830 728431 730194 730623 730364 730708 732907 737544 743932 750177 754507 756763 758263 760175 762491
49612 762491 764738 767082 770166 774010 777614 779782 780188 779607 779206 779655 780849 782374 784140 786380 789081
49597 789081 791646 793329 793908 793817 793667 793878 794662 795962 797178 797295 795742 793148 790858 789625 789128 788822
49581 788822 788761 789225 789945 790282 790003 789365 788555 787541 786459 785566 784789 783897 783147 783057 783354 782981 781708 781036
49563 781036 782697 786521 790555 793232 794800 796607 799560 803522 807907 812627 818475 826514 836945 848684
49549 848684 860152 870423 879600 888418 897689 907819 918581 929610 941269 954549 969836 986190
49537 986190 1002379 1018194 1034165 1050439 1066688 1082933 1099583 1116699 1134024 1151793 1170807
49526 1170807 1191503 1213626 1236916 1261448 1287068 1313205 1339639 1366972 1395931 1426627 1458735
49515 1458735 1491990 1526272 1561651 1598649 1637947 1679449 1722113 1765013 1808181 1852125 1897148
49504 1897148 1943589 1991957 2041952 2091725 2139166 2184126 2228770 2275591 2325395 2377045 2428531
49493 2428531 2478213 2525551 2570989 2615070 2657806 2699026 2738882 2777318 2813284 2845366 2873305
49482 2873305 2898130 2920459 2939469 2954132 2964921 2973444 2980573 2985646 2987597 2986270 2982435 2976981 2970562
49469 2970562 2963833 2957522 2952076 2947460 2943510 2940423 2938678 2938542 2939946 2942917 2947780 2954747 2963674 2974614
49455 2974614 2988250 3005105 3024425 3044604 3064861 3085747 3107722 3130050 3151649 3172213 3191544
49444 3191544 3208320 3220950 3229761 3237110 3244733 3251790 3256048 3256205 3252247 3244132 3231251 3213128 3189874
49431 3189874 3161855 3129632 3094309 3057114 3018261 2976678 2931291 2882295 2830921 2778352 2725098
49420 2725098 2671003 2615535 2558506 2500992 2445141 2392398 2342088 2292288 2241878 2191158 2140802
49409 2140802 2091244 2043262 1998013 1955858 1915763 1876542 1838268 1801915 1768067 1736626 1707290
49398 1707290 1679439 1651837 1623564 1595410 1569448 1546926 1527243 1509301 1493065 1479249 1467993
49387 1467993 1458350 1448777 1437804 1424852 1410886 1397803 1386550 1376276 1365930 1356189 1348940 1345192
49375 1345192 1344341 1345233 1346910 1348442 1349274 1350081 1352312 1356496 1361810 1367637 1374585 1383462 1394290 1407020
49361 1407020 1422228 1439990 1458990 1478325 1499840 1526810 1559588 1593586 1622314 1641972 1652868
49350 1652868 1657449 1658098 1656682 1654976 1654531 1655968 1658790 1662311 1666847 1673735 1683998 1697238 1712094 1727620
49336 1727620 1743973 1761852 1781525 1802313 1822855 1842060 1859916 1877215 1894455 1911486 1928372
49325 1928372 1945803 1964022 1981998 1998559 2014033 2029778 2046275 2062649 2078151 2093101 2108135
49314 2108135 2123377 2138803 2154868 2172333 2191712 2212945 2235254 2257504 2279328 2301816 2326358
49303 2326358 2352959 2380570 2408999 2439228 2471598 2505033 2538655 2573012 2608773 2645277 2681498
49292 2681498 2717803 2755654 2795983 2838817 2884153 2932117 2982343 3034010 3086569 3140000 3194591
49281 3194591 3250925 3309749 3371312 3435081 3500478 3567396 3635582 3704305 3773454 3844203 3917560
49270 3917560 3992783 4068360 4143976 4220240 4296959 4373323 4449654 4527142 4605420 4682039 4755179
49259 4755179 4825605 4895047 4963625 5029862 5092468 5151150 5206177 5258088 5307486 5354393 5397948
49248 5397948 5437209 5471874 5501601 5525223 5541560 5551036 5555809 5558236 5559540 5559672 5557737 5552577 5543756
49235 5543756 5532364 5520481 5509458 5498982 5488216 5477642 5469142 5463986 5461289 5459053 5456657 5455591
49223 5455591 5457629 5463045 5471138 5481730 5495148 5511024 5528157 5545682 5563673 5582430 5601781 5621044
49211 5621044 5638988 5653892 5664617 5671819 5677172 5680965 5681313 5676146 5665128 5649118 5628717 5604169
49199 5604169 5575977 5544413 5508715 5467599 5420514 5367983 5311160 5251613 5190987 5129948 5067725
49188 5067725 5003445 4937572 4871260 4804853 4738179 4672087 4608177 4546795 4486494 4426057 4366149
49177 4366149 4308428 4253833 4202322 4153545 4107113 4062639 4020089 3979759 3941500 3904494 3868332
49166 3868332 3833785 3801903 3772749 3745629 3720201 3696605 3674798 3654579 3636079 3619426 3604020
49155 3604020 3588960 3574233 3560627 3548376 3536813 3525588 3515214 3505861 3496597 3486689 3476974 3468900
49143 3468900 3462653 3457316 3452623 3449362 3447925 3447554 3447426 3447570 3448337 3449808 3452318 3456781 3463647 3472112 3481257
49128 3481257 3491550 3504164 3518841 3533593 3546963 3559776 3574026 3590482 3608176 3626194 3645177
49117 3645177 3666513 3690396 3715391 3740142 3764884 3790650 3817423 3844100 3870366 3897677 3927864
49106 3927864 3961467 3997958 4036833 4077710 4119920 4162917 4206831 4251758 4296865 4341228 4385337
49095 4385337 4430666 4477750 4525774 4574255 4623916 4675349 4727811 4780097 4831979 4884070 4936620
49084 4936620 4988940 5039646 5087217 5130915 5171583 5211025 5250148 5288231 5324455 5359433 5394453
49073 5394453 5429654 5463861 5496065 5526278 5554922 5582097 5607862 5632924 5658644 5686050 5714619
49062 5714619 5742341 5767560 5790763 5813836 5837468 5860229 5880703 5899535 5918438 5937910 5957011
49051 5957011 5975063 5992368 6009286 6025633 6041289 6056664 6072202 6087836 6103035 6117107 6129556
49040 6129556 6140513 6150658 6160358 6169179 6176852 6184337 6192987 6202682 6211625 6218091 6221818 6223717 6225120
49027 6225120 6227384 6231247 6236135 6240777 6244838 6249281 6254857 6261161 6267819 6275772 6286352 6299342 6312907
49014 6312907 6325510 6337309 6349615 6363444 6378593 6393630 6406661 6416618 6424147 6431032 6438390 6445362
49002 6445362 6449716 6449777 6445713 6439034 6431039 6421844 6410630 6396457 6378880 6358286 6335817 6312568 6288578
48989 6288578 6263033 6235752 6207959 6180980 6154634 6127716 6099887 6072215 6045821 6020760 5996335
48978 5996335 5971745 5946338 5920061 5894073 5870195 5849365 5831140 5814887 5800543 5787738 5775202
48967 5775202 5761983 5748696 5736639 5726166 5716923 5709358 5704728 5703447 5704274 5705392 5705650 5704772 5703184 5701926
48953 5701926 5701949 5703021 5703822 5703374 5701832 5699593 5696444 5692236 5687759 5683942 5680332 5675346 5668293 5660386 5653223
48938 5653223 5646633 5638643 5627669 5614271 5600471 5587435 5574262 5559142 5541255 5520962 5498441 5473165
48926 5473165 5445103 5415679 5386608 5358055 5328694 5297427 5264256 5229501 5193081 5154925 5115260
48915 5115260 5074009 5030643 4985335 4939810 4896227 4855340 4816231 4777535 4738379 4698534 4658648
48904 4658648 4620342 4585280 4553900 4525531 4499675 4476505 4456252 4439027 4425346 4415844 4410195 4407361
48892 4407361 4407430 4412076 4422301 4436534 4452065 4467929 4485262 4505179 4527489 4551553 4577277 4604795
48880 4604795 4633847 4664107 4695823 4729735 4766309 4805054 4844651 4883962 4923024 4962765 5003816
48869 5003816 5046216 5090465 5137780 5188503 5241023 5293429 5345809 5399813 5456337 5514956 5575486
48858 5575486 5638550 5704249 5771614 5839929 5909566 5981018 6054189 6129261 6207118 6287903 6369918
48847 6369918 6450987 6530506 6609388 6688481 6767813 6846915 6924944 7000664 7073106 7142218 7208436
48836 7208436 7271870 7332364 7389896 7444193 7494226 7538842 7577718 7611046 7638599 7659934 7675462
48825 7675462 7686465 7693983 7698194 7698835 7695490 7687529 7674548 7657009 7635848 7611366 7583135 7551012
48813 7551012 7515383 7476245 7432975 7385533 7335115 7282919 7228747 7171569 7111173 7048539 6984690
48802 6984690 6919851 6853828 6786625 6718331 6648687 6577204 6503938 6430089 6357651 6288220 6222062
48791 6222062 6158373 6096339 6035735 5976694 5919513 5864919 5814018 5767470 5724835 5685100 5647794
48780 5647794 5613330 5582417 5555605 5533364 5516161 5504106 5496594 5492384 5490051 5488690 5488612 5491361 5498525
48767 5498525 5510203 5524910 5541204 5559123 5579739 5603633 5630287 5658687 5687983 5717638 5747570
$$ [...]
##END NTUPLES=NMR SPECTRUM
##END=
