
##TITLE=AC1187_Casanare-tamara2_5898548_FrpgbTuwfZ
##JCAMPDX= 6.0         $$ Bruker NMR JCAMP-DX V2.0
##DATA TYPE= NMR SPECTRUM
##DATA CLASS= NTUPLES
##ORIGIN= BRUKER
##OWNER= Administrator
$$ 1.72 TOPSPIN		Version 2.1
$$ 2012-04-03 19:57:58.625 -0500  Administrator@TOPSPIN
$$ Compression mode = diff/dup
##.OBSERVE FREQUENCY= 400.13188235
##.OBSERVE NUCLEUS= ^1H
##.ACQUISITION MODE= SIMULTANEOUS (DQD)
##.ACQUISITION SCHEME= undefined
##.AVERAGES= 8
##.DIGITISER RES= 22
##SPECTROMETER/DATA SYSTEM= spect
##.PULSE SEQUENCE= zg30
##.SOLVENT NAME= COFFEE_meoh
##.SHIFT REFERENCE= INTERNAL, COFFEE_meoh, 1, 14.98061
##AUDIT TRAIL= $$ (NUMBER, WHEN, WHO, WHERE, PROCESS, VERSION, WHAT)
$$ ##TITLE= Audit trail, TOPSPIN		Version 2.1
$$ ##JCAMPDX= 5.01
$$ ##ORIGIN= Bruker BioSpin GmbH
$$ ##OWNER= Administrator
$$ $$ C:\Bruker\TOPSPIN/data/COFFEE/nmr/AC1187_Casanare-tamara2_5898548_FrpgbTuwfZ/10/pdata/1/auditp.txt
$$ ##AUDIT TRAIL=  $$ (NUMBER, WHEN, WHO, WHERE, PROCESS, VERSION, WHAT)
(   1,<2012-04-03 19:57:51.500 -0500>,<Administrator>,<TOPSPIN>,<go>,<TOPSPIN 2.1>,
      <created by zg
	started at 2012-04-03 19:56:44.906 -0500,
	POWCHK enabled, PULCHK disabled,
       configuration hash MD5:
       1A 1E CE 29 27 FD 77 03 67 4E F0 E3 C4 B2 CB 90
       data hash MD5: 64K
       12 F4 37 8B 6E F7 AE 21 74 F3 D4 F9 00 70 83 E2>)
(   2,<2012-04-03 19:57:54.250 -0500>,<Administrator>,<TOPSPIN>,<proc1d>,<TOPSPIN 2.1>,
      <Start of raw data processing
       efp LB = 0 FT_mod = 6 PKNL = 1 PHC0 = 0 PHC1 = 0 SI = 32K 
       data hash MD5: 32K
       4E FA CC 57 50 23 49 33 63 C2 02 BF CE E6 5F A8>)
(   3,<2012-04-03 19:57:54.625 -0500>,<Administrator>,<TOPSPIN>,<proc1d>,<TOPSPIN 2.1>,
      <pk PHC0 = 213.5248 PHC1 = 0 
       data hash MD5: 32K
       5C FE 30 C3 E5 EC 40 7F 7C B6 4E 3B 83 6B A3 45>)
(   4,<2012-04-03 19:57:54.703 -0500>,<Administrator>,<TOPSPIN>,<proc1d>,<TOPSPIN 2.1>,
      <abs ABSG = 1 
       data hash MD5: 32K
       E8 D4 1B 19 73 32 8F 6F DD 44 8E 3D 85 B1 67 69>)
(   5,<2012-04-03 19:57:54.750 -0500>,<Administrator>,<TOPSPIN>,<proc1d>,<TOPSPIN 2.1>,
      <abs ABSG = 2 
       data hash MD5: 32K
       59 E6 1B 54 8E 35 30 7A 85 9A 45 F7 F4 F7 32 3A>)
(   6,<2012-04-03 19:57:54.765 -0500>,<Administrator>,<TOPSPIN>,<proc1d>,<TOPSPIN 2.1>,
      <abs ABSG = 3 
       data hash MD5: 32K
       C0 57 EE 30 45 D4 D1 A6 35 68 84 8B 65 F1 77 89>)
(   7,<2012-04-03 19:57:54.796 -0500>,<Administrator>,<TOPSPIN>,<proc1d>,<TOPSPIN 2.1>,
      <abs ABSG = 4 
       data hash MD5: 32K
       00 57 AC 33 79 6C 2F F9 02 55 55 9B F4 C2 13 38>)
(   8,<2012-04-03 19:57:54.828 -0500>,<Administrator>,<TOPSPIN>,<proc1d>,<TOPSPIN 2.1>,
      <abs ABSG = 5 
       data hash MD5: 32K
       25 4D 02 B9 01 02 0B E6 32 D1 D7 DF 2B 6C 0D 16>)
$$ ##END=
$$ 
$$ $$ hash MD5
$$ $$ 5B A8 12 46 09 A1 5E 71 E6 FF 43 8E 43 DD E1 F2
##$RELAX= 
##$RELAX= 
##$RELAX= 
##$RELAX= 
##$RELAX= 
##$RELAX= 
##$RELAX= 
$$ Bruker specific parameters
$$ --------------------------
$$ [...]
##$TP= (0..7)
150 150 150 150 150 150 150 150
##$TP07= 0
##$TPNAME0= <>
##$TPNAME1= <>
##$TPNAME2= <>
##$TPNAME3= <>
##$TPNAME4= <>
##$TPNAME5= <>
##$TPNAME6= <>
##$TPNAME7= <>
##$TPOAL= (0..7)
0.5 0.5 0.5 0.5 0.5 0.5 0.5 0.5
##$TPOFFS= (0..7)
0 0 0 0 0 0 0 0
##$TUNHIN= 0
##$TUNHOUT= 0
##$TUNXOUT= 0
##$USERA1= <user>
##$USERA2= <user>
##$USERA3= <user>
##$USERA4= <user>
##$USERA5= <user>
##$V9= 5
##$VALIST= <valist>
##$VCLIST= <CCCCCCCCCCCCCCC>
##$VD= 0
##$VDLIST= <DDDDDDDDDDDDDDD>
##$VPLIST= <PPPPPPPPPPPPPPP>
##$VTLIST= <TTTTTTTTTTTTTTT>
##$WBST= 2048
##$WBSW= 25
##$XGAIN= (0..3)
0 0 0 0
##$XL= 0
##$YL= 0
##$YMAX_a= 532854
##$YMIN_a= -648937
##$ZGOPTNS= <>
##$ZL1= 120
##$ZL2= 120
##$ZL3= 120
##$ZL4= 120
##$ABSF1= 14.98061
##$ABSF2= -5.57192
##$ABSG= 5
##$ABSL= 3
##$ALPHA= 0
##$AQORDER= 0
##$ASSFAC= 0
##$ASSFACI= 0
##$ASSFACX= 0
##$ASSWID= 0
##$AUNMP= <proc_prof1d_extract_pilot.lims>
##$AXLEFT= 0
##$AXNAME= <>
##$AXNUC= <1H>
##$AXRIGHT= 0
##$AXTYPE= 0
##$AXUNIT= <>
##$AZFE= 0.1
##$AZFW= 0.1
##$BCFW= 0
##$BC_mod= 0
##$BYTORDP= 0
##$COROFFS= 0
##$CY= 15
##$DATMOD= 1
##$DC= 0
##$DFILT= <>
##$DTYPP= 0
##$F1P= 0
##$F2P= 0
##$FCOR= 0.5
##$FTSIZE= 32768
##$FT_mod= 6
##$GAMMA= 0
##$GB= 0
##$INTBC= 1
##$INTSCL= 1
##$ISEN= 128
##$LB= 0
##$LEV0= 0
##$LPBIN= 0
##$MAXI= 10000
##$MC2= 0
##$MEAN= 0
##$ME_mod= 0
##$MI= 0
##$NCOEF= 0
##$NC_proc= -8
##$NLEV= 6
##$NOISF1= 0
##$NOISF2= 0
##$NSP= 0
##$NTH_PI= 0
##$NZP= 0
##$OFFSET= 14.98061
##$PC= 1
##$PHC0= 213.5248
##$PHC1= 0
##$PH_mod= 1
##$PKNL= yes
##$PPARMOD= 0
##$PPDIAG= 0
##$PPIPTYP= 0
##$PPMPNUM= 2147483647
##$PPRESOL= 1
##$PSCAL= 4
##$PSIGN= 0
##$PYNMP= <proc.py>
##$REVERSE= no
##$SF= 400.13
##$SI= 32768
##$SIGF1= 0
##$SIGF2= 0
##$SINO= 400
##$SIOLD= 32768
##$SPECTYP= <>
##$SREGLST= <1H.CDCl3>
##$SSB= 0
##$STSI= 32768
##$STSR= 0
##$SW_p= 8223.68421052632
##$SYMM= 0
##$S_DEV= 0
##$TDeff= 65536
##$TDoff= 0
##$TI= <>
##$TILT= no
##$TM1= 0
##$TM2= 0
##$TOPLEV= 0
##$USERP1= <user>
##$USERP2= <user>
##$USERP3= <user>
##$USERP4= <user>
##$USERP5= <user>
##$WDW= 1
##$XDIM= 32768
##$YMAX_p= 471027412
##$YMIN_p= -656410
##$CURPLOT= <Network HP LaserJet P1505>
##$CURPRIN= <$Network HP LaserJet P1505>
##$DFORMAT= <normdp>
##$LAYOUT= <+/1D_H.xwp>
##$LFORMAT= <normlp>
##$PFORMAT= <normpl>
##$SURQMSG= 1
$$ End of Bruker specific parameters
$$ ---------------------------------
##NTUPLES= NMR SPECTRUM
##VAR_NAME=  FREQUENCY,     SPECTRUM/REAL,   SPECTRUM/IMAG
##SYMBOL=    X,             R,               I
##VAR_TYPE=  INDEPENDENT,   DEPENDENT,       DEPENDENT
##VAR_FORM=  AFFN,          ASDF,            ASDF
##VAR_DIM=   32768,         32768,           32768
##UNITS=     HZ,            ARBITRARY UNITS, ARBITRARY UNITS
##FACTOR=    0.250966925370066, 1,           1
##FIRST=     8223.43324360095, -158148,      -83726
##LAST=      0,             44621,           -23390
##MIN=       0,             -656410,         0
##MAX=       8223.43324360095, 471027412,    0
$$ Real data points
##PAGE= N=1
##DATA TABLE= (X++(R..R)), XYDATA
$$ [...]
19459c94471c7546B47551a14760d0083J6463A11290m1054a96513P8551j28865
19449b46827d7109C8821I311Q2062M5661b41337J5392a20A41184Q4613b61291
19437f6601j69881O0765C1013J04352c40359G9110J7300N7856a439o8396H0568
19425I0807l3868d0655j38880e4453B906a29353J7764d6889K91k77421Q3888Q8455
19413a51676I6694C868c05302i2058m0682N2191j15953h6997b5884k33451J21856
19402a37479A4259K40941p1211c0510A16945b00806h3224r4554j64676B148b46449
19390a00494j63586g0784B76875q2501g0634o1158I5605K4388g4103m5696A03814
19378a84318o0657F6154M4185a13642c2863k13242A94964l7416f514A3327a27244
$$ y = [-394471, -37546, 247551, -114760, -40083, -23620, 111290, 70236, -196513, -117962, -246827, -47109, 38821, 9311, 91373, 137034, -241337, -225945, -120, 141184, 225797, -261291, -66601, -236482, -175717, 31013, 135365, -340359, 79110, 96410, 154266, -1439, -69835, 80568, 90807, 56939, -40655, -179535, -54453, 2906, -129353, -111589, -46889, -46598, -324019, -240131, -151676, 96694, 3868, -305302, -92058, -132740, -80549, -196502, -86997, -25884, -259335, -137479, 14259, 255200, 183989, -30510, 116945, -200806, -83224, -177778, -342454, 2148, -246449, -100494, -264080, -70784, 276875, 194374, -70634, -131792, 95605, 119993, -74103, -119799, 103814, -184318, -244975, 66154, 110339, -113642, -32863, -246105, 194964, 157548, -6514, 13327, -127244]
19366b72581N8466A95678b6277r7833l5337A11202b93035J34151A1123c11379
19355b87438Q0432b0497m11499J63077d8606A1918b09828A58692L4455b79670
19344B54395N9633e9209q7383c5953j61529a3897k35366j8103J0883A13975E5914
19332a3873B47568a37316A88518a23442r7545D3964c11406a24333O0884A52313
19321d2839j07627e9893B70175b36577D2224g7j4786j80498H891b75642K1552
19310b54090q6798g0397B0536R0288a76442M521l2145g6656p8723P2255J4561
19299f8563K2762A58205a5641A60202a73844B53162d8707d107B72972f7210q0367
19288a47577f2578G3079d52640A17237b01858A64363A1748a95572O8708L2830
$$ y = [-272581, -214115, 195678, -26277, -124110, -159447, 111202, -293035, -158884, 11123, -311379, -287438, -207006, -20497, -431996, -268919, -48606, 11918, -209828, 158692, 193147, -279670, 254395, 314028, -59209, -146592, -35953, -197482, -13897, -249263, -267366, -256483, 113975, 55914, -13873, 247568, -137316, 188518, -123442, -220987, 43964, -311406, -124333, -63449, 152313, -42839, -150466, -59893, 270175, -236577, 42224, -77, -14863, -195361, 8891, -275642, -254090, -340888, -70397, 20536, 110824, -176442, -171921, -204066, -76656, -155379, -83124, -68563, -45801, 158205, -15641, 160202, -173844, 253162, -48707, -4107, 272972, -67210, -147577, -62578, 73079, -452640, 117237, -201858, 164363, 11748, -195572, -126864, -94034]
19278i4034c5350j08029C6435R2366b18400A04324c35494B06362h1058A76121
19267h2331j46292P7806b1948p7179j81286a1876k13600D0235b94643A77927d19182
19255B56484a84410O862B70021a75678A81763c0033j9542j2416j04799G1070a60006
19243a22588g322j62212i112j37516j96291K4775H7819b43788J04847N4705a2178
19231F5387g6622j21157f9301F7304D908a4637D23004c0391j34669K8092A79821
19219B10151a00943j02347p9614g2792j14264A63869a21297k00078O3574O2947
19209a94854F6131C0727A2095J95204n9401c94678d3169B28558n0643a8056C1559
19197B0599a4132j35690e1019j63264k4834R58d5950j5338E3582D51h6267r4207
$$ y = [-94034, -35350, -143379, 36435, 128801, -218400, 104324, -335494, 206362, -81058, 176121, -82331, -228623, -150817, -21948, -99127, -280413, -11876, -225476, 40235, -294643, 177927, -419182, 256484, -184410, -177548, 270021, -175678, 181763, -30033, -49575, -61991, -166790, 71070, -160006, -122588, -7322, -169534, -9112, -146628, -342919, -318144, 87819, -243788, -138941, -84236, -12178, 65387, -76622, -197779, -69301, 67304, 4908, -14637, 423004, -30391, -165060, -136968, 179821, 210151, -100943, -203290, -282904, -72792, -187056, 163869, -121297, -321375, -257801, -194854, 66131, 30727, 12095, 207299, 147898, -394678, -43169, 228558, 177915, -18056, 31559, 20599, -14132, -149822, -51019, -214283, -239117, -238159, -45950, -61288, 53582, 451, -86267, -180474]
19185a80474j13168f7569A04869b27827C052L3458b67361a1922B81486r7387b11179
19173c87537J5533J65251m2380D4335N6566d9909k21443h4495b187j49093f1426
19161A0716b94365A58215J59723a03626n9246O9677A2285a49375A8532K57616
19151B76148f4281F647L6721R8370h5648K0481E7495b11906D5412a56803q2605
19140b39408L1180c2889A00260N0453a21990C9185A327M3778i5515k2500N5549
19129f2466I6945b54325O9866G9841c03898J24419b3061A78801g4512H6225J09527
19118A95752f6977H7165a8171p2453p9681h3364K8104a4998r7973j28526A70607
19106b66989A3861J60137c50489R6296K4993f2168j23380O2249j1765B8066f5728
$$ y = [-180474, -293642, -67569, 104869, -227827, 3052, 36510, -267361, -11922, 281486, 184099, -211179, -387537, -372004, -206753, -249133, 44335, 100901, -49909, -271352, -84495, -2187, -151280, -61426, 10716, -294365, 158215, 317938, -103626, -162872, -93195, 12285, -149375, 18532, 276148, -64281, 6647, 43368, 141738, -85648, -65167, 57495, -211906, 45412, -156803, -239408, -208228, -32889, 100260, 150713, -121990, 39185, 1327, 45105, -95515, -118015, -62466, 96945, -254325, -184459, 79841, -303898, -179479, -23061, 178801, -74512, 86225, 195752, -66977, 87165, -18171, -90624, -170305, -83364, -55260, -14998, -112971, -241497, 170607, -266989, 13861, 173998, -350489, -254193, -229200, -62168, -185548, -123299, -135064, 28066, -65728]
19094C12734d4250A60202A8596B75b11089a7400j99423i1247A9764e3946A00649
19082a92215h6690k11351H8068N7399c4774j6990B44764B2777K6231b8281k10343
19071b38624J02462f4382k42123a7441k37210g569A19281a51434C1064L9034d65576
19059I9532a26413b4815I3094J21577n604b30996a9088k0238D2691a95241A34985
19047c1208c994G2229C0858c00631b2880n9461j48547H6464a79295C03146I2753
19035h5169p8766I8647a68035J294j16637j7813f4044j92001G4050L2238c41912
19023d24211H9470H358a53719B98814a74199P5693I1057C5670j5227K12944b37987
19011A65447B9842J37241a69944D2938e5609A76913K04489e2621C49715a5577
$$ y = [312734, -44250, 160202, 18596, 275, -211089, -17400, -216823, -91247, 19764, -53946, 100649, -192215, -86690, -298041, 88068, 145467, -34774, -51764, 244764, 22777, 49008, -28281, -238624, -136162, -64382, -306505, -17441, -254651, -7569, 119281, -151434, 31064, 70098, -465576, 99532, -126413, -24815, 93094, 214671, 209067, -230996, -19088, -39326, 42691, -195241, 134985, -31208, -3994, 72229, 30858, -300631, -22880, -82341, -230888, 86464, -179295, 303146, 92753, -85169, -163935, 98647, -168035, -166741, -283378, -301191, -64044, -256045, 74050, 106288, -341912, -424211, 89470, 8358, -153719, 298814, -174199, -98506, 91057, 35670, 20443, 233387, -237987, 165447, 29842, 167083, -169944, 42938, -55609, 176913, 381402, -52621, 349715, -15577]
19000B89717a19683A82689a22023H0853a53479m0516B36029b20006P0705b1301
18989b52091A41144F7914k7084J4929c50918I8856J20434i5852A2922N4761J7964
18978H5647a64689A13268P6142E6009L8618B5844a49336B77331b36682g9192j63220
18967b42412c1454I1243b45312D3615c48108B3785e8213B39962K9126j25179K17767
18956C61676A21892O1446F9827l0257J77095l1561F2582J25116H5429j846i1800
18944e960C3822d96998e4892A37687c2507E0091a7708A32199l3448C0130d6741
18932b53172Q6637A28143c9313B118M5817b02405M2432B06849F2733a35352C2342
18920H5052a34864l8174l11908D03541b25820E7971b67679i8388j88665B7231
$$ y = [289717, -119683, 182689, -122023, 80853, -153479, -193995, 236029, -220006, -149301, -21301, -252091, 141144, 67914, 40830, 55759, -350918, 98856, 219290, -95852, 12922, 67683, 85647, -164689, 113268, 189410, 56009, 94627, 25844, -149336, 277331, -236682, -79192, -242412, -31454, 91243, -245312, 43615, -348108, 23785, -58213, 239962, 269088, 143909, 361676, 121892, 183338, 69827, 39570, 216665, 185104, 62582, 187698, 85429, 83583, -91800, -5960, 33822, -496998, -54892, 137687, -32507, 50091, -17708, 132199, 98751, 30130, -46741, -253172, -166535, 128143, -39313, 2118, 47935, -202405, -159973, 206849, 62733, -135352, 32342, 85052, -134864, -173038, -484946, 403541, -225820, 57971, -267679, -98388, -287053, 27231]
18909A3253k885a75244A35859P925M244p1384b63561e6838A3266g6196C1088L01317
18897C32405H8744N49270j79453O0308B35205O9598j35797E1758a50584D15004
18886a39255o7646F9089K09173C9637f4804l8228B03132b31519h2827E1161c96266
18874g738A05684a47799K9128j51278l1887B71621a62129L8359E1546f7048E5631
18862d140p7541m1553d0147C9393Q4688a98758A26462a9137B77734B936J38898
18851A41834a28074A43704k2822e1521p981N004j4054k23054o0081A26641A1529
18839C61444i3177c2683A29224C5097O0730a95787A0722P0900C1293O7513B0810
18827c20946J07953I5429C7121a7194I987J99754e1548Q043A5924L322c34591
$$ y = [13253, 10368, -175244, 135859, 143784, 148028, 76644, -263561, -56838, 13266, -76196, 31088, 332405, 88744, 638014, 458561, 518869, 235205, 304803, 169006, 51758, -150584, 415004, -139255, -206901, 69089, 278262, 39637, -64804, -103032, 203132, -231519, -82827, 51161, -396266, -7738, 105684, -147799, -118671, -269949, -301836, 271621, -162129, -123770, 51546, -67048, 55631, -4140, -81681, -123234, -40147, 39393, 124081, -198758, 126462, -19137, 277734, 2936, 141834, -128074, 143704, 120882, -51521, -59502, -54498, -68552, -291606, -351687, 126641, 11529, 361444, -93177, -32683, 129224, 35097, 95827, -195787, 10722, 81622, 31293, 98806, 20810, -320946, -212993, 95429, 37121, -17194, 9987, 209741, -51548, -43505, 15924, 19246, -334591]
18815b52451g4147A7014b81838a36848A3586g100j00020A97056a66629e2994k01603
18804b54597q9329A61856a14290p344B34230b35906c1285j79239l8213a2226C33532
18792D57973e2039j27058b0862k29828F7529a18039F2140K71393G875f3007A40971
18780B05950I098O0239N5539O6331a8684A4503J12973a02248B23824a73391j04833
18769b78224P5749B64383b41076R3005F158L16782b23343J04482j64394B36986
18758C9599L03077A8938R3632a29046B64665I1599i9993D53838A30987E4271j3025
18747D1246A2085d71170H7112l3878K55285g581C13482c65074C10300a30071m3986
18736a74057e6460r9316K9636k5895A10969b37312J7364A42211a35722B4957g9974
$$ y = [-252451, -74147, 17014, -281838, -136848, 13586, -7100, -107120, 197056, -166629, -52994, -254597, -343926, 161856, -114290, -121634, 234230, -235906, -31285, -210524, -248737, -12226, 333532, 457973, -52039, -179097, -20862, -250690, 67529, -118039, 62140, 333533, 7875, -63007, 140971, 205950, 9098, 69337, 124876, 191207, -18684, 14503, 127476, -102248, 223824, -173391, -278224, -202475, 264383, -241076, -148071, 6158, 322940, -223343, -118861, -283255, 236986, 39599, 342676, 18938, 112570, -129046, 264665, 91599, -99993, 453838, 130987, 54271, 41246, 12085, -471170, 87112, 53234, 308519, -7581, 313482, -365074, 310300, -130071, -174057, -56460, -155776, -126140, -152035, 110969, -237312, -219948, 142211, -135722, 24957, -79974]
18724a20673I3536A329J70376a78084G6833J92545A08818b14397B2382d617C59420
18712A2147J35932a29830A01834m4004a00842B97712b61456e8165n7531B35755
18701a05n8000G0638a37908H0688j9809P6561a29867C68492H8400b06762A78053
18689A24395r583C3202K02997d1273l04531A10671i6293j15803j78815A32315
18678e5122C109d5408j4822B6353J37130b30008B03366g9383B21082b44287C7908
18666d05396A51176f9259a8600k2591o4607k8727o8321G4003a11633c2914n2687
18655h5601k4451H3104f7549b4308N978B30822a3110n1054k9289H5514J60165
18644B45679j4948a20703n8856n0092J10365L2947A72197a44915f5567A09879
$$ y = [-120673, 93536, 1329, 171705, -178084, 76833, 269378, 108818, -214397, 22382, -4617, 359420, 12147, 148079, -129830, 101834, 57830, -100842, 297712, -261456, -58165, -115696, 235755, -105, -58105, 70638, -137908, 80688, 60879, 137440, -129867, 368492, 88400, -206762, 178053, 124395, 114812, 33202, 236199, -41273, -345804, 110671, -96293, -212096, -390911, 132315, -55122, 3109, -45408, -60230, 26353, 163483, -230008, 203366, -79383, 221082, -244287, 37908, -405396, 151176, -69259, -18600, -41191, -105798, -134525, -202846, 74003, -111633, -32914, -85601, -110052, 83104, -67549, -24308, -18330, 230822, -13110, -64164, -93453, 85514, 245679, 230731, -120703, -179559, -229651, -119286, -86339, 172197, -144915, -65567, 109879]
18633I3685a61030i532l0050k2897A63579B1308N9007b13399e2200j77631P9607
18622a50224j09529F3119a18536r4297h5377k18714I0505a47117K1806r4157B20294
18610i904l88500a1703n7205j71709l7335J31878O2199c3752H442i9678C6157
18598b33978A07982b08876K5380I7613c10413B37308F1071O8076O1922i5526l041
18587i8567n3425D6585c535n36096a36553K6168j78420a12840N4663q0737B42189
18575d6069F2979a12123a4938q9839r6844L2540p1888j58077B43234a19693M4292
18564g5401J224A43499a49853j0248K4600C82988g5663A17665J65686a11586F909
18552B58934a71208F8139M3179f8717A67850e3626A92561d3796A85058a87721
$$ y = [93685, -161030, -9532, -39582, -62479, 163579, 21308, 80315, -213399, -52200, -229831, -150224, -259753, 63119, -118536, -212833, -85377, -304091, 90505, -147117, -125311, -219468, 220294, -9904, -398404, -11703, -68908, -240617, -277952, -146074, -83875, -33752, 8442, -99678, 36157, -233978, 107982, -208876, -183496, 97613, -310413, 237308, 61071, 129147, 191069, -95526, -98567, -151992, 46585, -3535, -539631, -136553, -110385, -288805, -112840, -58177, -138914, 242189, -46069, 62979, -112123, -14938, -104777, -201621, -169081, -240969, -399046, 243234, -119693, -75401, -74177, 143499, -149853, -160101, -135501, 382988, -75663, 117665, 283351, -111586, 6909, 258934, -171208, 68139, 111318, -68717, 167850, -53626, 192561, -43796, 185058, -187721]
18541d5119F2560J8804b4699A25906E9036a22094a7884j74242D3625A4243g5577
18529b8811G8683b97933J44249G2574N689c5000G5017L532a35524a3409l04072
18518c17481Q212h699k61146a6198E8065C543K55280a95544d8203I8830d14916
18506D2776b77571A06972p338a7622p8147A4018J74423A7412a34728F2952a78834
18494a01867G864M722a10263k72918a33224M3639q4583A55478C444a46575O1557
18483h5018j6405B18731d8427B71662G6850c2601A8825b9873j27754B70256R3708
18472C63964D6020J62470a62013L6648G2310J04980c01905B19239r8961a42109
18461C1389g166G9208b76305O9767f5656a6857P693h23m6342A32477m2276E355
$$ y = [-45119, 62560, 81364, -24699, 125906, 59036, -122094, -17884, -192126, 43625, 14243, -75577, -28811, 78683, -297933, -153684, 72574, 78263, -35000, 75017, 78549, -135524, -13409, -317481, -309269, -8699, -269845, -16198, 58065, 3543, 258823, -195544, -48203, 98830, -414916, 42776, -277571, 106972, 99634, -17622, -95769, 14018, 188441, 17412, -134728, 62952, -178834, -101867, 7864, 12586, -110263, -383181, -133224, -89585, -174168, 155478, 3444, -146575, -85018, -101423, 218731, -48427, 271662, 76850, -32601, 18825, -29873, -157627, 270256, 363964, 46020, 208490, -162013, -125365, 72310, 177290, -301905, 219239, 120278, -142109, 31389, -7166, 79208, -276305, -206538, -65656, -16857, -9164, -823, -47165, 132477, 90201, 5355]
18448a22558B25344b13418A94361i6741C05120j45448K0368c3250r3818j80356
18438c07424h449k13887d2913o495j12889j494h0020l9837A17893e3935B43297
18426f9357A49742b22302a027q3392I0732b30885e8418l7318c6989k87013a56734
18414a84731A69101i2228n1957A97219a39825B1913b2685B02088p1781b1995o1220
18403h3215k05450E3640O7501a22938d3936k60484A24000a19128A06446a56388
18392c0681A72292h6540a1008C46307d9269A67889Q9373a17313b3872B71730j29323
18381A42407f1454j35693e3328B24720P4733f1883o7770n8487c3043j22917c9946
18369b3175j77426m5651J07447C5436c64505g9099D6542K49285b09153h0221j21784
$$ y = [-122558, 225344, -213418, 194361, -96741, 305120, 159672, 180040, -33250, -127068, -307424, -8449, -222336, -42913, -49408, -162297, -163791, -80020, -119857, 117893, -53935, 243297, -69357, 149742, -222302, -1027, -84419, 90732, -230885, -58418, -95736, -36989, -324002, -156734, -184731, 169101, -92228, -144185, 197219, -139825, 21913, -22685, 202088, 130307, -21995, -83215, -288665, 53640, 121141, -122938, -43936, -304420, 124000, -119128, 106446, -156388, -30681, 172292, -86540, -11008, 346307, -49269, 167889, 257262, -117313, -23872, 271730, 142407, -61454, -197147, -53328, 224720, 299453, -61883, -129653, -188140, -33043, -155960, -39946, -23175, -200601, -246252, -138805, 35436, -364505, -79099, 46542, 295827, -209153, -80221, -202005]
18358b02005A61774O3771H7548A0730d00821E571K32025r7259h8895A86786A3266
18346c0086H6276K3441a73223B40577M5778n8222h8558A6545b76877g6632k28894
18335c05526a05179I9979D3704N218c70040J60584e7381h608j38611B71061c6874
18323A02693a60887e9168B27076I5687L46787E6375D934i2116j55246c9778o7409
18312a07187q9821A19386a16095k8998b5496l06170a46756a7974I893b7954D1739
18300b47543O3564L849C69128H5156a0289j1258H6781d34831E5359M4946E640
18288h3907B06477E0021d6526j70240A49195J32525A08128k5462c63351a06843
18277F9862N2868c6167j53485P8100A816f1337l0589j03398D7702c57026A20269
$$ y = [-202005, 161774, 225545, 87548, 10730, -400821, 5571, 237596, 140337, -88895, 186786, 13266, -30086, 86276, 109717, -173223, 240577, 286355, 228133, -88558, 16545, -276877, -76632, -305526, -105179, 99979, 43704, 48922, -370040, -209456, -57381, -8608, -147219, 271061, -36874, 102693, -160887, -59168, 227076, 95687, 442474, 56375, 4934, -92116, -247362, -39778, -107187, -197008, 119386, -116095, -145093, -25496, -331666, -146756, -17974, 9893, -27954, 41739, -247543, -183979, -180130, 369128, 85156, -10289, -21547, 86781, -434831, 55359, 100305, 5640, -83907, 206477, 50021, -46526, -216766, 149195, 281720, 108128, 82666, -363351, -106843, 69862, 122730, -36167, -189652, -111552, 1816, -61337, -91926, -195324, 47702, -357026, 120269]
18265A94307M1588c15872c3958j24208D1898a11139j64691P6226E0078N3121M23740
18254E26939G5705L6466b68462H1763C6808a57746J6585A31840B2041a76814P9700
18243i7114F738M4281a67663D83862B9529L0926M7034e8887C20910a14353B025
18231c4224C56496b00796G4496a20832A46295e2123J1520B55838b65918Q8042
18221a77876B05416K6418L569b31951a04701A24970a36303L674c8156j68996i5528
18209b15069k6316Q5144g3103A06648h1616J9255k1671k10108C1128N2150l5444
18198D7834a12750o7342R16q1527B21967e014C28878a76911M9216c1240D0111
18186D0638a9925k9995j35740h9240A7115e9396J5845j4186o8391k1133L3339
$$ y = [194307, 235895, -315872, -33958, -158166, 41898, -111139, -275830, -199604, 50078, 103199, 526939, 75705, 112171, -268462, 81763, 36808, -157746, -141161, 131840, 22041, -176814, -97114, 6738, 51019, -167663, 483862, 29529, 60455, 107489, -58887, 320910, -114353, 2025, -34224, 356496, -200796, 74496, -120832, 146295, -52123, -40603, 255838, -265918, -177876, 205416, 231834, 235403, -231951, -104701, 124970, -136303, -132629, -38156, -207152, -95528, -215069, -241385, -156241, -73103, 106648, -81616, -62361, -84032, -294140, 31128, 83278, 47834, -112750, -180092, -179176, -260703, 221967, -5014, 328878, -176911, -127695, -31240, 40111, 40638, -19925, -49920, -185660, -89240, 17115, -59396, -43551, -57737, -126128, -147261, -113922]
18175a13922d6655j00399f6779l6098n0537j3071M5544N5673n7691D0320K9312
18164F9632a07655B97314j21988b44712H020L63134a82488k3628C13856A20471
18153A87761G0777J01599a75822A15775b77066B72970j06122L35420a83432e1425
18142b82049B23067m7391b42843d8819F3770F254a77088L8779d2350B4492d867
18130a05891D2914a1503B18995J10779b52406j04313B86565d535p71k1543A51972
18118h6596A51663d9080h438H9685A6490b5222F6778a44837C2193R062a81219
18106B1755d18350H729a38451d4277j72089O5755H3691K63565g4813a0989A91632
18094B70088K1572a66876j24075C27627j32832J20847A25043b1623m999B49175
$$ y = [-113922, -46655, -147054, -66779, -102877, -153414, -166485, -120941, -65268, -122959, 40320, 69632, -107655, 297314, 175326, -244712, 8020, 371154, -182488, -206116, 313856, 120471, 187761, 70777, 172376, -175822, 115775, -277066, 272970, 166848, 502268, -183432, -51425, -282049, 223067, 175676, -242843, -48819, 63770, 6254, -177088, -138309, -42350, 24492, -4867, -105891, 42914, -11503, 218995, 329774, -252406, -356719, 286565, -4535, -5306, -26849, 151972, -86596, 151663, -49080, -8438, 89685, 16490, -25222, 66778, -144837, 32193, 41255, -181219, 21755, -418350, 8729, -138451, -44277, -216366, -150611, 83691, 347256, -74813, -10989, 191632, 270088, 291660, -166876, -290951, 327627, 194795, 315642, 125043, -21623, -26622, 249175]
18083c68686C7103a79831p8266K0485H069c5259p1629l3447C3135J65749b15164
18071i2178C02630a62931D00640a62028j74319J65090C2172a95969B1177J41884
18061A63061N8975p7329n5289c0500J2602m6384p4399j97705a1097B58024J2226
18050B70250b68781J32159r0286e7217A0328M6935K7358B3594K4973f1041o0072
18039a21113B10897a43538B22542H8133J24239E6657K13923a15008A95603Q7633
18029B83236a77265I5464Q5157f5850E9713f072o445B03714c8895C0057L8409
18018F8466b01852i7000n9312B3685K48360H8954j5463l3669G204J69989K1160
18007A98353f9975k92B8194a11364J4251b9667B90093f7978B15306b85826b6165
$$ y = [-368686, 37103, -179831, -258097, -237612, 8069, -35259, -106888, -140335, 33135, 198884, -215164, -92178, 302630, -162931, 400640, -162028, -336347, -171257, 32172, -195969, 21177, 163061, 222036, 144707, 89418, -30500, -17898, -64282, -138681, -336386, -11097, 258024, 270250, -268781, -136622, -226908, -57217, 10328, 57263, 84621, 23594, 48567, -61041, -121113, 210897, -143538, 222542, 88133, 212372, 56657, 270580, -115008, 195603, 283236, -177265, 95464, 180621, -65850, 59713, -6072, -12517, 203714, -38895, 30057, 68466, -201852, -97000, -156312, 23685, 272045, 88954, 73491, 39822, 7204, 177193, 198353, -69975, -70267, 28194, -111364, -97113, -29667, 290093, -67978, 215306, -285826, -26165]
17995h6516m7958f2377G6292J6625b36809i1127n3629L8991A17580a99847G4716
17983f3511i726G1924k3670J99243b42733l1870B32111a46827B6208Q4298N3265
17972A63771b1898F969J927K12602I5370J9522b03422b5888A6942R1456k1393
17961H7005K827a01427L7872a2450E5086Q1488b42103f1141j38982c8576j48106
17950a86682N1396F0415j4931J07447o3333b65512a10094E0599g6318k05117A49478
17938G155g8407j20150A78527b9790A91290C5335b31801A68315b09663D6362c0586
17926C17801m7972d8009m7429C12481r6875D7174a16187K4627l5106C5521b45584
17914B77845j07649C5645b5029B08544G0101J9609K18709a06949o6016A03481
$$ y = [-86516, -134474, -62377, 76292, 92917, -236809, -91127, -144756, -105765, 117580, -199847, 74716, -63511, -9726, 71924, 48254, 247497, -242733, -274603, 232111, -146827, 26208, 110506, 163771, -21898, 6969, 8896, 221498, 95370, 114892, -203422, -25888, 16942, 108398, 87005, 89832, -101427, -63555, -12450, 55086, 136574, -242103, -61141, -200123, -38576, -186682, -135286, 60415, 45484, 152931, 89598, -265512, -110094, 50599, -76318, -281435, 149478, 7155, -78407, -198557, 178527, -29790, 191290, 35335, -231801, 168315, -209663, 46362, -30586, 317801, 269829, -48009, -95438, 312481, 215606, 47174, -116187, -91560, -126666, 35521, -245584, 277845, 170196, 35645, -25029, 208544, 70101, 89710, 308419, -106949, -172965, 103481]
17903a51495D536e140A05973K0263J36042r3247F2413b06281i5464A70962a58951
17891c66175i178l12047C87884a08635E2910a03384A66803L91079f8231B82378
17880e4899A38509A8629L9452c4396B72886d3946J1464g688q1238B36625j04094
17869A32531K9751b46284H1238f3117D51947b01174A18423e7869K3969D8379a95672
17857c585D5135O2829Q9317d8564C59682b87519A23431B8643M1020a26290E6780
17845G8582g6851C32812d8848D29239b26315g9126o6500k4662f5005B79063a84391
17833B89793c0519B3607J68050J0074m7944J14300d454A21415A2611b7482D8703
17821E2700J04731b2951A39758K7627m9540a55856n6885F8572a66644D7001N3963
$$ y = [-151495, 4536, -5140, 105973, 126236, 262278, 169031, 62413, -206281, -95464, 170962, -158951, -366175, -9178, -321225, 387884, -108635, 52910, -103384, 166803, 557882, -68231, 282378, -54899, 138509, 18629, 58081, -34396, 272886, -43946, -32482, -7688, -88926, 236625, 132531, 162282, -246284, 81238, -63117, 451947, -201174, 118423, -57869, -33900, 48379, -195672, -3585, 45135, 107964, 197281, -48564, 359682, -287519, 123431, 28643, 69663, -126290, 56780, 78582, -76851, 332812, -48848, 429239, -226315, -79126, -145626, -170288, -65005, 279063, -184391, 289793, -30519, 23607, 191657, 201731, 153787, 268087, -4454, 121415, 12611, -27482, 48703, 52700, 157431, -22951, 139758, 167385, 117845, -155856, -212741, 68572, -166644, 47001, 100964]
17810A00964r129J85184k4186b05448C719a71185A09097K28574a1915A10827m9780
17799F1047M3775M69912F5443a6444B65582a04998l0142G0262J86575e9291K0059
17788c9232j31483F03437h0365C499a19235H6496J30533d1610I8807K06694G5599
17776A96461o7929c6676B9901L7514Q7306N7958B4700K2722L14681a5514B6192
17764a3968A3427b17408C5249J06067c2758H481e3355o3774M912A4857J56306
17753A71163p4339k0088J99233a5949j24041F6985f6182C336a42256B111L35480
17742C37591H8964i7961E22837G8686h1605B48451G7220a0116B99362j06947a09764
17730D11902i5192E0228L75114H7079N7424b09744A2043e5836A63490J92383A62628
$$ y = [100964, 91835, 277019, 252833, -205448, 3719, -171185, 109097, 337671, -11915, 110827, 61047, 104822, 574734, 65443, -16444, 265582, -104998, -135140, 70262, 256837, -59291, -39232, -170715, 603437, -80365, 3499, -119235, 86496, 217029, -41610, 98807, 305501, 75599, 196461, 128532, -36676, 29901, 67415, 154721, 212679, 24700, 47422, 362103, -15514, 26192, -13968, 13427, -217408, 35249, 141316, -32758, 8481, -53355, -117129, -112217, 14857, 171163, 96824, 76736, 275969, -15949, -139990, 66985, -66182, 3336, -142256, 2111, 337591, 88964, -97961, 522837, 78686, -81605, 248451, 77220, -10116, 299362, 192415, -109764, 411902, -95192, 50228, 425342, 87079, 144503, -209744, 12043, -55836, 163490, 355873, 162628]
17718h7424H8291i0145c785r3473A59648N2015a83570O1223L4119G523K9729N1968
17706H9220Q6791l4567m3277i5763A36282K7964M3047i3710C4772R5129k6657
17695A03244P9806h9362A28843C0927a88763B73685f5855D7634J81657B0300e574
17683a54111C567K30324m2314k9008F9179K21949a84541A74917j598j1435f4517
17671H4331L180d6434q02C30777A41246L9562l0252b28673a03935B05285P1592
17660B76877j29232k4388J840a01289F8578K3758a5055B3750c9415D18028A27718
17648B12550B4681J32987j5609J14671g0357j57173H6625L73658A88254K73466
17638D61720A31618J72747m4820l7735p0223A490L64330h5852C62634d4324n9736
$$ y = [-87424, 88291, -90145, -3785, -97258, 159648, 211663, -183570, -122347, -88228, 7523, 37252, 89220, 176011, 141444, 98167, -95763, 136282, 164246, 207293, -93710, 34772, 129901, 103244, 183050, -89362, 128843, 30927, -188763, 273685, -65855, 47634, 229291, 20300, -5574, -154111, 3567, 233891, 191577, 162569, 69179, 291128, -184541, 174917, 173319, 161884, -64517, 84331, 87511, -46434, -47236, 330777, 141246, 180808, 150556, -228673, -103935, 205285, 276877, 147645, 123257, 125097, -101289, 68578, 92336, -15055, 23750, -39415, 418028, 127718, 212550, 24681, 157668, 142059, 256730, -70357, -227530, 86625, 460283, 188254, 461720, 131618, 304365, 259545, 221810, 151587, 1490, 365820, -85852, 362634, -44324, -104060]
17627a04060C82604j43884h5948C06449d2781G2846K31643j40774q074g2116C52112
17615h1123A44120q078D6004b22677A14384D6769b08610A86437q8174J49831a49137
17603A89026O4419J2603C6007J95158E5898R2790J3172L4666B0134J08895J3850
17592A42879g583B92185E8302J31107L6180j7961R6110n5446g6620A6032N5719
17581G1751Q2154J49770l7641J1018p5943C4206J0806J62522J973I9960a14053
17569A36180N4879n0572K18370m1454F2668J84169q3149J4160n7797c9463A75090
17557B93630B8347B501M13975A48817J46163A29081F2495a62378B74677K73620
17547E48297A30228b16031B94c4697R032A46574I454K07078g4914C48941L8217
$$ y = [-104060, 382604, 238720, -85948, 306449, -42781, 72846, 304489, 163715, 155641, -72116, 352112, -81123, 144120, 136042, 46004, -222677, 114384, 46769, -208610, 186437, 98263, 248094, -149137, 189026, 253445, 266048, 36007, 231165, 55898, 148688, 161860, 196526, 20134, 129029, 142879, -7583, 292185, 58302, 189409, 225589, 207628, 303738, 248292, -76620, 16032, 71751, 153905, 303675, 266034, 277052, 201109, 34206, 45012, 207534, 209507, 99960, -114053, 136180, 191059, 140487, 358857, 317403, 62668, 246837, 163688, 177848, 120051, -39463, 175090, 293630, 28347, 2501, 416476, 148817, 294980, 129081, 62495, -162378, 274677, 548297, 130228, -216031, 294, -34697, -25665, 146574, 9454, 216532, -74914, 348941, 387158]
17536C87158m1627A32170L21479A4380K87687E3769M8461P4258K46967M8064j24339
17525C47180A48979b2372A34594J9470R704K13439q8142K07650D3716K32012l8610
17514B37118L89908j1958k2662M6787K92358P1202l24479M4765L25252l23710
17504G24581C21014J30522n2291P7677B25539L03005B51244P30028j68782L34278
17494A146768o0109j00248k74982j14269J37974j72335k07926L34798k85462j82775
17484B21434J65263J07721j14300O0159M4229j1332P5990k53530J72341l703D0534
17472A34847K10614O8465j65102J83857j56164O6895p7409J01485K3195J74478
17462E65161j29806B00751J23650j04090r5046J54806A05833K72539A09171h51
$$ y = [387158, 345531, 132170, 453649, 14380, 302067, 53769, 102230, 176488, 423455, 471519, 347180, 148979, -22372, 134594, 154064, 163768, 377207, 289065, 496715, 43716, 275728, 237118, 627026, 615068, 592406, 639193, 931551, 1002753, 678274, 723039, 1048291, 724581, 321014, 451536, 399245, 476922, 225539, 528544, 251244, 981272, 812490, 1146768, 1086659, 986411, 711429, 597160, 735134, 562799, 354873, 689671, 404209, 221434, 386697, 494418, 380118, 440277, 484506, 473174, 549164, 295634, 467975, 464272, 40534, 134847, 345461, 413926, 248824, 432681, 276517, 343412, 266003, 367488, 390683, 565161, 435355, 200751, 324401, 220311, 125265, 280071, 105833, 378372, 109171, -851]
17451c25D12912j66348J04367A21828F815K75896J21065p6624j38093J94691j23724
17440B60026J16609j60413D0404J43620R2633B4165N75308A36960K62385j379
17430C97966j83056K61235Q2421j7222j85953A21627K96713H8006J11868J51352
17420C51226r4043L36023A06504K00416J06889n4619E9838m862J43014n8731L14823
17409D54082J01009A56028L69459j59582L7779G8180J71556K31439A68517L52614
17399E21131B0040O0453L85335A86481L387R236b7561C88276F1171J42411K7010
17388B30592M4066q9621K559a0367D48665k15743a07386F39707j73752B13816
17377A09543J29124o4469O3065K65417A46972J14248K1346J12385G0579L05052
$$ y = [-325, 412912, 246564, 350931, 121828, 6815, 282711, 403776, 327152, 189059, 383750, 260026, 376635, 216222, 40404, 184024, 276657, 24165, 599473, 136960, 399345, 397966, 214910, 476145, 558566, 541344, 355391, 121627, 418340, 88006, 199874, 351226, 257183, 593206, 106504, 306920, 413809, 359190, 59838, 54976, 197990, 139259, 454082, 555091, 156028, 525487, 365905, 403684, 78180, 249736, 481175, 168517, 521131, 20040, 80493, 465828, 186481, 189868, 199104, -27561, 388276, 61171, 203582, 230592, 274658, 185037, 187596, -10367, 448665, 232922, -107386, 639707, 465955, 213816, 109543, 238667, 174198, 237263, 502680, 146972, 261220, 282566, 394951, 70579, 375631]
17367C75631Q8124n8703A15493K44746r2189a10366E55339A79974K62886A9579
17356C74641j1689K9884j31267K20164j53651a14789D69835A93843m923J91170
17346C80090D4611L41776L0888L9176A84075J59223j26898O9476K73565L8383
17336E97824c7268A82151J25466j10435n6876n4589M37841j65869C668L94277
17326C97945Q8945n2688B11759J56144J38004k33917m9690L69983A34677B8598
17315A66919K45125A56744J64610K01359Q5791F6112K65670A50833J31836J2190
17305B94859Q8193J88863j03571L8526A7400Q6796N68599C00946A27930L00515
17295D28445A02897M36352j32204O4210j31879J74395k49255L40585j06301J79546
$$ y = [375631, 463755, 405052, 115493, 360239, 268050, -110366, 555339, 179974, 442860, 19579, 374641, 362952, 392836, 261569, 481733, 328082, -114789, 469835, 193843, 188920, 380090, 44611, 386387, 417275, 456451, 184075, 343298, 216400, 285876, 559441, 597824, -37268, 182151, 307617, 197182, 140306, 85717, 523558, 357689, 3668, 397945, 486890, 434202, 211759, 367903, 505907, 271990, 222300, 592283, 134677, 28598, 166919, 412044, 156744, 321354, 522713, 608504, 66112, 331782, 150833, 282669, 294859, 383052, 571915, 468344, 506870, 17400, 104196, 672795, 300946, 127930, 428445, 102897, 539249, 407045, 471255, 339376, 513771, 264516, 605101, 498800, 678346]
17285F78346I2330O7897J80272j04563N47118C36410J52901B04241L1578L83603
17275F19422G3414L19767j5430E2614A6009M37172J55989k98240K68618B29309
17264a25277E53627A49004A5832J95723J32172A57778J02773M42368C13036m6508
17254B66528r9640R3810D3330K93981L22418C02280J65218R4151j52732n2455
17244C56462J09445B13967O05628C47372l7365K02298C9055M17538q8650Q2735
17234D50678A44668K89614j47284R905A36357K62073j58434J67941K83193j37195
17224E53935k8382j16025B7855J17885K18771A55283J52351L21588l11634M8212
17214C65800j11384k8952Q7279j53186J53805J07791M72801C43078L02304C11367
$$ y = [678346, 92330, 160227, 340499, 235936, 783054, 336410, 489311, 204241, 235819, 619422, 73414, 393181, 377751, 52614, 16009, 453181, 609170, 310930, 579548, 229309, -125277, 553627, 149004, 15832, 211555, 343727, 157778, 260551, 702919, 313036, 266528, 166888, 260698, 43330, 337311, 659729, 302280, 467498, 561649, 408917, 356462, 465907, 213967, 819595, 347372, 310007, 512305, 39055, 456593, 367943, 450678, 144668, 434282, 286998, 296903, 136357, 398430, 239996, 407937, 691130, 553935, 525553, 409528, 27855, 145740, 364511, 155283, 307634, 629222, 317588, 365800, 254416, 225464, 312743, 159557, 313362, 421153, 893954, 343078, 645382, 311367]
17203I2647L61068C8652L38410J23299B40410L08991m7143K69775l79529J42193
17193E34697A20085J13820K14877m7943L00011l04609E7319N91945C04464K97744
17183F02208j05089Q9038B48800L99427k54204J49487P0909k18701O1462m6129
17173D11051j4280n6408K64188r6799J78928j70150B13075K07350Q8584K60181
17163G69190C67703J12078j16301L24800k23250k00399M26487Q73Q7291C59300
17152E29076j27612Q0658L4296k06801M75888j18408N7907l59464K65485j83694
17142D47331M6843J34808M2354j66824P1849j77140j41117N01633k34834Q6425
17132F11328l02900M4016K23471k04938J668o6864J70591J72936k83368L24767
$$ y = [92647, 453715, 38652, 377062, 500361, 240410, 549401, 502258, 772033, 392504, 534697, 120085, 233905, 448782, 400839, 700850, 396241, 57319, 649264, 304464, 602208, 497119, 586157, 248800, 648227, 394023, 543510, 614419, 395718, 457180, 411051, 396771, 340363, 604551, 507752, 686680, 516530, 213075, 420425, 509009, 769190, 367703, 479781, 363480, 688280, 465030, 264631, 691118, 691991, 779282, 359300, 529076, 401464, 482122, 516418, 309617, 785505, 667097, 725004, 365540, 631025, 447331, 494174, 628982, 671336, 504512, 576361, 399221, 258104, 759737, 524903, 611328, 308428, 352444, 575915, 370977, 372645, 305781, 476372, 649308, 365940, 690707]
17122F90707k67071L97500k56235n3312l2776M81098k8764m9788r7387k08685
17112E75287k02880K97022k97370O83213l65404J27395n7497j6694B94854J24745
17102D19599M42622l49000J95998J8165j71855J78508K06238j95647j94406L86209
17092I36431l16276K12663k92182B42314K13490k9436J42190J23211k09561K89226
17082G71434J38264N7386j36269j8467k65210K95072J37991k65459B93942L17009
17072F10951J66911k05781J07900o5166J83757k13940K77940J3441k08944J73093
17062H40162Q4863p9507r218J83383r4902J66016k02761k5288k7798J18686N2185
17051A005821N8310m08860k0687L54304k7554j38416J83366j49492L00879j19103
$$ y = [690707, 423636, 821136, 564901, 511589, 478813, 959911, 931147, 881359, 783972, 575287, 372407, 669429, 372059, 1055272, 689868, 817263, 759766, 743072, 294854, 419599, 862221, 513221, 709219, 727384, 555529, 734037, 940275, 744628, 550222, 936431, 620155, 832818, 540636, 242314, 455804, 426368, 568558, 691769, 482208, 771434, 909698, 967084, 830815, 812348, 547138, 842210, 980201, 714742, 293942, 610951, 777862, 572081, 679981, 614815, 798572, 584632, 862572, 876013, 667069, 840162, 925025, 845518, 836300, 1019683, 924781, 1090797, 888036, 862748, 834950, 953636, 1005821, 1064131, 655271, 634584, 988888, 961334, 822918, 1006284, 856792, 1157671, 1038568]
17041A038568l96059Q1063L27027J14197k83932k4786o6389K08327J87417l60134
17031H25299K16404j18844R132r7020O4673J13393j27330L27967J81009m51019
17021I43664j72959J53879M45063n06318K0551J32871r7739J04798q8668J72802
17011A107944k0214L67322k72397N0302j77824K89514j53101j38811p1131p169
17001I74435N17715k74282M3387n4839r9457L51486k38951k21187L35985l85891
16991I48401K57770k91053m304L94324k01992J93255O6540J15703l49644L05972
16981A434972k88280L18924l06455K39066N5053o0588K6349J06569l43330K29249
16971A411529P3300j53992J57851q7507j71446R6141K53699k97189P1929J01070
$$ y = [1038568, 642509, 723572, 1050599, 1164796, 880864, 856078, 789689, 998016, 1185433, 825299, 1041703, 922859, 931991, 834971, 899644, 1013037, 885707, 1213674, 1394683, 943664, 770705, 924584, 1369647, 863329, 883880, 1016751, 919012, 1023810, 935142, 1107944, 1087730, 1455052, 1182655, 1232957, 1055133, 1344647, 1191546, 1052735, 981604, 974435, 1492150, 1217868, 1261255, 1206416, 1106959, 1458445, 1219494, 998307, 1334292, 948401, 1206171, 915118, 910814, 1305138, 1103146, 1296401, 1362941, 1478644, 1129000, 1434972, 1146692, 1465616, 1159161, 1398227, 1453280, 1392692, 1419041, 1525610, 1182280, 1411529, 1484829, 1330837, 1488688, 1401181, 1229735, 1325876, 1579575, 1282386, 1354315, 1455385]
16961A455385R0706K74213k11675J6586J59777k26641r8968K48042O7696j27837
16951A647284k24521L86293j84942J41872o224l73039L35366K61946k46046J81193
16941A919182j46863K6679P5455K20927j87714M617K3587j01301J84720m66092
16931A553197N51217P3277m04372K43952J12233m48302L12243L85497k55250Q160
16921B131852n4355J76470P6291m04138J01079N15146j46437k45162O2010K48646
16911B461402O431l18593L89741k20169Q4134j42347K80655k75233J24289O5485
16901B455795j4388O8787K4956K26691j80908K99918n1276j64255M07165j32824
16891B939661K04711m81117J18779L4242L24018j4257L8115N1733m55855K98219
$$ y = [1455385, 1546091, 1820304, 1608629, 1625215, 1784992, 1558351, 1459383, 1707425, 1775121, 1647284, 1422763, 1809056, 1624114, 1765986, 1759762, 1386723, 1722089, 1984035, 1737989, 1919182, 1772319, 1798998, 1874453, 2095380, 1907666, 1912283, 1935870, 1834569, 2019289, 1553197, 2104414, 2177691, 1773319, 2017271, 2129504, 1681202, 1993445, 2378942, 2123692, 2131852, 2077497, 2253967, 2330258, 1926120, 2027199, 2542345, 2395908, 2150746, 2212756, 2461402, 2467833, 2149240, 2538981, 2318812, 2402946, 2260599, 2541254, 2266021, 2390310, 2455795, 2441407, 2510194, 2535150, 2761841, 2580933, 2880851, 2829575, 2665320, 3072485, 2939661, 3144372, 2663255, 2782034, 2816276, 3140294, 3126037, 3164152, 3215885, 2760030, 3058249]
16881C058249q9696J32941J55666P7347j1100J23573K05723l61070L72155K0983
16871C684771k4584m51202J47935K48569L92420l15548j25973L93212J38491k6721
16861D061370o3179q634K7902M1319P5921j89096N68603k91620P092L19498n8473
16850D490703k0383O52167j19606k29547R1473J88217P885l75626M09428J84937
16840E279648k81451J05244N0160L46042L33046j83302J72259k19049L32523P7468
16830F012588o2393K56913P3591R5605L04397k48249J99759l3982j00082L24724
16820F822871O16314l91438N45080j37302J55796M4618J31771L36556J10545K07042
16810H441853j41083N48113L6066L887J36536L39818j27356L29777K21388K95155
$$ y = [3058249, 2968553, 3101494, 3257160, 3334507, 3323407, 3446980, 3652703, 3291633, 3663788, 3684771, 3660187, 3208985, 3356920, 3605489, 3997909, 3682361, 3556388, 3949600, 4088091, 4061370, 3998191, 3989557, 4017459, 4058778, 4134699, 3945603, 4514206, 4222586, 4229678, 4549176, 4490703, 4470320, 5122487, 5002881, 4773334, 4864807, 5053024, 5060909, 4685283, 5094711, 5279648, 4998197, 5103441, 5153601, 5499643, 5832689, 5649387, 5821646, 5602597, 5935120, 6012588, 5950195, 6207108, 6280699, 6376304, 6680701, 6432452, 6632211, 6598229, 6498147, 6822871, 7439185, 7047747, 7592827, 7455525, 7611321, 7655939, 7787710, 8124266, 8234811, 8441853, 8300770, 8848883, 8884949, 8888836, 9025372, 9365190, 9237834, 9567611, 9788999, 10084154]
16800A0084154J71557m1862K84446M64870P0897N26691l8745M91300j20730M07653
16790A2300231J83936L71173L02715M18713J15265J82257N10766J88366M91543
16781A5064965L11989M03932L30035J73041P49659P9990O24090L85710O62575
16772A8785986J52828O24296O81889O00511K33389R00476O01943M31680R55445
16763B3968443M16522P95634O16495R95767Q13261P42218J282823N72993Q88939
16754C1093095J011353Q32418J420777Q99633J164896J497962J095490J083860
16746D0099484J673350J251780J705968J610544J764216J305017K258912J597984
16738E3267255J914437K264779J848617K685477K013787K740365K177604K320694
$$ y = [10084154, 10255711, 10213849, 10498295, 10963165, 11034062, 11560753, 11522008, 12013308, 11892578, 12300231, 12484167, 12855340, 13158055, 13576768, 13692033, 13874290, 14385056, 14573422, 15064965, 15376954, 15780886, 16110921, 16283962, 17033621, 17113611, 17737701, 18123411, 18785986, 18938814, 19563110, 20244999, 20845510, 21078899, 21979375, 22581318, 23012998, 23968443, 24384965, 25180599, 25797094, 26792861, 27606122, 28348340, 29631163, 30204156, 31093095, 32104448, 32936866, 34357643, 35257276, 36422172, 37920134, 39015624, 40099484, 41772834, 43024614, 44730582, 46341126, 48105342, 49410359, 51669271, 53267255, 55181692, 57446471, 59295088, 61980565, 63994352, 66734717, 68912321, 71233015]
16730G1233015K950261K275777L026082L063261K611047K458710L387612K738781
16722I3744546L196628K867566K876524K995515K904845K609337K383321K315254
16714A15893536K308060J961750J794496J098868J505420P98690N00256Q4516
16706A25945592L34777p77958o55880p04192j337754j598615j817217k312878
16698A17075875k050759k522818k471276l009144k864859k409734l341587k934394
16690I5471304k746688l222211l235206k883444k967715k815264k639807k796672
16682G2164297k658072k370801k432790k516019k020871k509873k071649j874280
16674E3709942j913539k049269j586292j891647j922228j344569j490960j131252
$$ y = [71233015, 74183276, 76459053, 79485135, 82548396, 85159443, 87618153, 91005765, 93744546, 96941174, 99808740, 102685264, 105680779, 108585624, 111194961, 113578282, 115893536, 118201596, 120163346, 121957842, 123056710, 124562130, 125360820, 125861076, 125945592, 126280369, 125502411, 124846531, 124142339, 122804585, 121205970, 119388753, 117075875, 115025116, 112502298, 110031022, 107021878, 104157019, 101747285, 98405698, 95471304, 92724616, 89502405, 86267199, 83383755, 80416040, 77600776, 74960969, 72164297, 69506225, 67135424, 64702634, 62186615, 60165744, 57655871, 55584222, 53709942, 51796403, 49747134, 48160842, 46269195, 44346967, 43002398, 41511438, 40380186]
16666D0380186k068801j054631j373519r52838j136623j090063j254302j022280
16658C0427129j087424o52779j104950p15249p89712q84799j182702k42919m63698
16649B3302897j316802l97005n67592k36354o16124o88576k94404j214120j39083
16640A7832837m72038j89036m35088q70195j18741n77275j48518m53688j69798
16631A4398460n61167l02853m81512j71707k15132j76712l54546l57239J2819
16622A1790411p69848l47453N2988N3399n75167o7677n60433Q1652k936m86794
16612I168142k76530p7297K0261k22149O9687l09676j80594j85158k83191k90517
16602G432978j87186K19579j61665k57353K2253O0676l37809Q6353j70964j35195
$$ y = [40380186, 38311385, 37256754, 35883235, 34930397, 33793774, 32703711, 31449409, 30427129, 29339705, 28686926, 27581976, 26866727, 26077015, 25192216, 24009514, 23766595, 23302897, 21986095, 21589090, 21021498, 20785144, 20169020, 19480444, 19186040, 17971920, 17832837, 17360799, 17171763, 16736675, 15866480, 15747739, 15170464, 15021946, 14568258, 14398460, 13837293, 13534440, 13052928, 12881221, 12666089, 12489377, 12134831, 11777592, 11790411, 11020563, 10673110, 10726098, 10779497, 10204330, 10136653, 9576220, 9657872, 9654936, 9168142, 8891612, 8814315, 8834576, 8612427, 8682114, 8372438, 8191844, 8006686, 7723495, 7432978, 7245792, 7465371, 7303706, 7046353, 7068606, 7129282, 6791473, 6877826, 6706862, 6571667]
16592F571667k93825k82749n867j39590k4056p5065r946j98066N2741m76911r96
16581E117337J18468m13133J39678l993m3914j01002j35440o7044O9594J99358
16571D879909m35689j85166K74734n45489M55611n28781L87549k21564m2216J91798
16561D230696p11818L2185K09995r8763L69590m30569Q9948j86910j29450J93408
16551C568312m263J43231k79168j15489L5499J74345m40652L269j93229O0139
16541B951994J65976r9764K15096o6180m08951J06400j06339j7064j16506j18872
16531B505790Q5183K0183R3343j11891k20304O2590R4782j7639k97231K43161
16521B457967l8117J43754k05710l40707N6308M64986j97021k93558K30026L03647
$$ y = [6571667, 6277842, 5995093, 5989226, 5849636, 5825580, 5750515, 5740569, 5542503, 5595244, 5118333, 5117337, 5235805, 4822672, 4962350, 4958357, 4914443, 4813441, 4678001, 4610957, 4680551, 4879909, 4444220, 4259054, 4533788, 3988299, 4443910, 3915129, 4302678, 4081114, 4038898, 4230696, 3518878, 3551063, 3761058, 3662295, 4031885, 3601316, 3691264, 3504354, 3374904, 3568312, 3564049, 3707280, 3428112, 3312623, 3348122, 3522467, 3081815, 3085084, 2891855, 2951994, 3117970, 3018206, 3233302, 3167122, 2758171, 2864571, 2758232, 2741168, 2624662, 2505790, 2590973, 2611156, 2704499, 2592608, 2372304, 2434894, 2529676, 2512037, 2214806, 2457967, 2419850, 2563604, 2357894, 2017187, 2073495, 2538481, 2341460, 2047902, 2277928, 2581575]
16511B581575l59923j25956k06288K20951K5584j64073p8984j9182R9138J52049
16501B124891k8482j81083m3565J93908j30781j17758k48072K65050p3210M3873
16491A804771J1125L1827j10043l1231O8900j39610P6477j45508J10780M661l4824
16480A647325l77774J54542o2871L23035k07995k61330M01285j40342M4957N1416
16470A572248j40090l5870Q1871J53245n33344M6386K78319j56694M80331o14788
16460A131614K01238J63643q7808k10633N96441m00062l58827M88161l04737r678
16450A209352J63723m70395N45494n33126q1152M89809l08749K59244K423q3372
16440A193251j30220O5787K50633k23955j42408L56055n14814L00288k1017q1044
$$ y = [2581575, 2221652, 2095696, 1889408, 2110359, 2135943, 1971870, 1892886, 1873704, 1972842, 2124891, 2096409, 1915326, 1871761, 2065669, 1934888, 1817130, 1569058, 1834108, 1760898, 1804771, 1815896, 1847723, 1737680, 1706449, 1775349, 1635739, 1712216, 1566708, 1677488, 1682149, 1647325, 1269551, 1424093, 1361222, 1684257, 1476262, 1214932, 1616217, 1475875, 1520832, 1572248, 1432158, 1396288, 1478159, 1631404, 1098060, 1144446, 1422765, 1266071, 1746402, 1131614, 1332852, 1496495, 1408687, 1198054, 1794495, 1394433, 1035606, 1523767, 1219030, 1209352, 1373075, 902680, 1448174, 915048, 833896, 1323705, 1014956, 1274200, 1276623, 1193251, 1063031, 1128818, 1379451, 1155496, 1013088, 1369143, 854329, 1154617, 1133600, 1052556]
16430A052556Q9770l73688M84100m4835J72955j53832j60654K0770o9137D91703
16419I06404j64505L72969l15641j12125j0561K91626J5168k00614J4657n1875
16409G45503Q8850j34155J21327P4134P1501n220m4973P0858J12428N3385k49609
16398I04029J20933j68503j69631L2132K52679D60035L22060j75888n393L04612
16388I05426j13554O9938k47007J68452J30223j06900l03465K25171K12080j79859
16378G60505r5554O7577M53446m15332K3277J2506p9992j42020R289J16596r2414
16367F17884N3869N1817j55105M24018l83818R371q3862M02354l70998p9177L47953
16356H34306j31250j09739l3356J93782j11669B82981J59618J09915K15618m4506
$$ y = [1052556, 1142326, 768638, 1252738, 1207903, 1380858, 1227026, 1066372, 1087142, 1018005, 491703, 906404, 741899, 1114868, 799227, 687102, 676541, 968167, 983335, 782721, 797378, 745503, 834353, 700198, 821525, 895659, 967160, 961940, 916967, 987825, 1100253, 1153638, 904029, 1024962, 856459, 686828, 718960, 971639, 460035, 782095, 606207, 600814, 905426, 791872, 861810, 614803, 783255, 913478, 806578, 503113, 728284, 940364, 760505, 664951, 732528, 1185974, 770642, 793919, 806425, 726433, 584413, 593702, 710298, 617884, 671753, 723570, 568465, 992483, 608665, 618036, 534174, 936528, 565530, 486353, 834306, 703056, 593317, 559961, 753743, 642074, 282981, 442599, 552514, 768132, 723626]
16346G23626B71786K40905J27173l12880K03467P7443j11356O0262o9654j67780
16336C19366J12417K17329Q9565B19136N10830J5218O200j53106j45137n1414
16326D01727J60742B05791L98295n2154L45197m07696J75841j09042j23430K50515
16316F83317j79139L86555l09863k80483A23827K53495N1858Q5910o2765k09093
16306B43232J98195Q2983A24205M74297K2109j86049M0864q1375J40990r1844
16296D43197J57223q2277j97052P0658j36114K65958j28715m4578M07663l26482
16286D29481A03128L46989I5506J41879K76965j25212A60915J14777K32080k44919
16276B62853J21642A80654l3518K74876A97913K17588J17221J09250k75204J9920
$$ y = [723626, 271786, 512691, 639864, 326984, 530451, 607894, 496538, 556800, 487146, 319366, 431783, 649112, 738677, 219136, 729966, 745184, 751384, 598278, 453141, 401727, 562469, 205791, 604086, 551932, 897129, 489433, 665274, 556232, 432802, 683317, 504178, 890733, 580870, 300387, 123827, 377322, 429180, 515090, 452325, 243232, 441427, 524410, 124205, 598502, 620611, 434562, 475426, 394051, 535041, 443197, 600420, 518143, 321091, 391749, 255635, 521593, 392878, 348300, 755963, 429481, 103128, 450117, 95506, 237385, 514350, 389138, 160915, 275692, 507772, 262853, 384495, 180654, 147136, 422012, 197913, 415501, 532722, 641972, 366768, 386688]
16266C86688A61965k5068L78305j89448O505H7665L08506j20159L42623A94714
16255C93883j8576J49965j19269Q2982K7802n1468j86122K2581J57112k6208B12802
16243B67667J01953L4396m4862K93996k80198l6530j62462K33076l4148N1563
16233D24451P669N6434o9951j62042d8196B56768L0687o6953J72145K04048A27707
16221C03234R4730p0754J14908N6760A3952J91381K27425j53011o1830J85257
16211D03174E1300L80216O056j72760b2073B30807K02063O880G8199K77148m0194
16200C15153L3512j26390g8587B95269A32530J62750J23908j98438K2374M20822
16190F63946A59446M10816d344A45442N1287e354A66662H65J66209m4705j686
$$ y = [386688, 161965, 136897, 515202, 325754, 332259, 87665, 396171, 276012, 618635, 194714, 393883, 375307, 525272, 406003, 488985, 516787, 465319, 279197, 301778, 458890, 432682, 212802, 267667, 369620, 404016, 359154, 653150, 372952, 336422, 173960, 407036, 372888, 424451, 432120, 488554, 418603, 256561, -48196, 256768, 287455, 220502, 392647, 596695, 127707, 303234, 397964, 327210, 442118, 498878, 13952, 205333, 432758, 279747, 217917, 403174, 51300, 431516, 437572, 264812, -22073, 230807, 432870, 439750, 78199, 355347, 315153, 348665, 222275, -78587, 295269, 132530, 295280, 419188, 220750, 243124, 663946, 159446, 570262, -4344, 145442, 196729, -5354, 166662, 865, 167074, 122369, 120683]
16179A20683E8824J6670c5903A77350h7509k4040A35766K40418C2675K25346b25361
16167F8621Q1514E7041k1970L00142A55749L30151p4752A26672J09131m9283a28196
16155A70559J7692N991l2806O8806L16592A02140K66919G4354J84203o4080J46836
16144C41313j37533b03068H9854m4840J639J72635G2961L0288K65072A57148b47592
16132C85485j35763I9802C8196K01582H6346J38304K02683a76042g4263C09006
16121D05863B8514K56860j5559j1084P3942A11959a91469A65427J51600A43010
16110B4381J19260j3960J4349n7056C5024J97917g2637B99278H979K37594a39995
16098D2506L24166j58181f3391A52267F6580f6386A2162L8163M6334K70785b3157
$$ y = [120683, 58824, 75494, -35903, 177350, -87509, -111549, 135766, 376184, 32675, 258021, -225361, 68621, 150135, 57041, 35071, 335213, 155749, 485900, 411148, 126672, 235803, 186520, -128196, 170559, 188251, 194242, 161436, 230242, 546834, 102140, 369059, 74354, 258557, 194477, 341313, 203780, -203068, 89854, 45014, 46653, 219288, 72961, 103249, 368321, 157148, -247592, 385485, 249722, 99802, 38196, 239778, 86346, 224650, 427333, -176042, -74263, 309006, 405863, 28514, 285374, 269815, 258731, 332673, 111959, -191469, 165427, 317027, 143010, 24381, 143641, 129681, 144030, 86974, 35024, 232941, -72637, 299278, 8979, 246573, -139995, 42506, 366672, 208491, -63391, 152267, 66580, -66386, 12162, 50325, 96659, 367444, -23157]
16086a42733B71730C2494h719B19861a69869B17464i9436B35240a8593k3176B01103
16074E54898a76526o026A27775a9059j3979B14317A03044g5233B22317m5664J38243
16063C14896j45610a5198E8159M89F878e794C1097O6543a10994I7515k5736J05002
16051A76781B4501J32650n979o8046a77604Q4447B45623I2756K5410m6328K44811
16040C16649a13880E19062A10070J33037L1779A20533P3143J45967a57637A60340
16029a24978B78724g0718B61331j13509l8564n2789M5685a35654N6863j01868
16019a80659B480N6701a82874A3027B649b6630k78370B69338j18613J86886b58458
16007e4781A9076R8262K7417f5301j37484B70277A5277b93962A48045C7770L11251
$$ y = [-142733, 271730, 32494, -8719, 219861, -169869, 217464, -99436, 235240, -18593, -41769, 201103, 554898, -176526, -182552, 127775, -19059, -33038, 214317, 103044, -75233, 222317, 176653, 314896, 169286, -15198, 58159, 58648, 6878, -5794, 31097, 97640, -110994, 97515, 71779, 176781, 24501, 157151, 151172, 83126, -177604, -93157, 245623, 92756, 118166, 71838, 316649, -113880, 519062, 110070, 243107, 274886, 120533, 193676, 339643, -157637, 160340, -124978, 278724, -70718, 261331, 147822, 109258, 56469, 102154, -135654, -78791, -180659, 2480, 59181, -182874, 13027, 2649, -26630, -305000, 269338, 150725, 337611, -258458, -54781, 19076, 117338, 144755, -65301, -202785, 270277, 15277, -293962, 148045, 37770, 349021]
15996C49021h2918D7654a71227H8942K9128K2870J15343a27635A87020R5043j29447
15985A52616c9129k41246e0690g555m2456b1937p1659j16627h8212A23032J14084
15974B37116G8790O44884l21714J00492L60149J86194P4090k2413k00967B90536
15963E24810k09044k2879k2124A00083k7775O4449J6615N7937P1027j15723J18221
15952B84834D3928a30384j48244c0923B44254A5456a66640a7816l16870P1562
15942b63124A27947a9951j2001M900l9919j04855r1611A57636n2211a0876A21431
15930a02642j99883A39880J28142a33512A01324b54013B64644a56324L3911r3552
15920b15965e1707C35969a44939E764a41295B22210p2601A8057K49161b46426
$$ y = [349021, -82918, 47654, -171227, 88942, 118070, 140940, 256283, -127635, 187020, 282063, 152616, -39129, -280375, -50690, -7555, -50011, -21937, -93596, -210223, -88212, 123032, 237116, 78790, 723674, 401960, 502452, 862601, 1048795, 1122885, 1100472, 899505, 290536, 524810, 315766, 292887, 270763, 100083, 72308, 136757, 153372, 211309, 282336, 166613, 284834, 43928, -130384, -278628, -30923, 244254, 15456, -166640, -17816, -334686, -263124, 127947, -19951, -31952, -27052, -66971, -171826, -263437, 157636, 105425, -10876, 121431, -102642, -302525, 139880, 268022, -133512, 101324, -254013, 264644, -156324, -122413, -215965, -51707, 335969, -144939, 5764, -141295, 222210, 149609, 18057, 267218, -246426]
15909A32749a23306F9116b4378D033O3235a05064j06980A50427j660J59463A6587
15897F6614a87042f0850B4696K06034P7846h7584D9896K14278Q6440d08609a24707
15885e1347A78796a71556j00423E5947J93824r7020k9752J46552D1659a9854j98493
15874b18347C11786b20910d3288l70268g4310Q516H3574K4125D6799a64564e5295
15862A11653h5891l3834k63637A20189K59157a90203j60388a27810C30798I3171
15851A37749c39913A26525a38068A12361c5484G7088c7493B4649c24500a6115
15840H6319A6066c080j76127c522D9469K82747D9200A9358L06734F332a57595
15828a16625H9775a94490B50346o2131a4636A48987a60373B591Q2425c2129j74415
$$ y = [132749, -123306, 69116, -24378, 4033, 67268, -105064, -212044, 150427, 148767, 308230, 16587, 66614, -187042, -60850, 24696, 230730, 308576, -87584, 49896, 264174, 350614, -408609, -124707, -51347, 178796, -171556, -271979, 55947, 249771, 152751, 122999, 269551, 41659, -19854, -218347, 311786, -220910, -43288, -413556, -74310, -65794, 83574, 107699, 46799, -164564, -55295, 111653, -85891, -119725, -383362, 120189, 379346, -190203, -350591, -127810, 330798, 93171, 137749, -339913, 126525, -138068, 112361, -35484, 77088, -37493, 24649, -324500, -16115, 86319, 16066, -3080, -179207, -3522, 49469, 332216, 49200, 19358, 326092, 6332, -157595, -116625, 89775, -194490, 250346, 188215, -14636, 148987, -160373, 2591, 85016, -32129, -206544]
15817b06544A55383b58960f0767B19288i4758I508J9888e3888k1755o790B7940
15805a8735j60417N7761g475D6901e5557B23207c74640P2516J45972f1894B7655
15793c58412A07196b5151C01249q4805E3723J48109a29890e7698j85549H7144
15782B19569a86118h5949A45702i9898B2376L9617a92451C11208C601a91367A17313
15770d8962j58113A68489K23415A70970J00479H9594a73860l3288b2991A45715
15759D352J25505n9324Q5841d31469A06586Q5836N7456F3408i8040A75312b24404
15747A01509a24587D60838a9943j81702B04447F5387k4457a86462A37501q28o4014
15736G2659F170K20762H3661h7550A09903k9347f7583J007A7400Q9957C0777Q3949
$$ y = [-206544, 155383, -258960, -60767, 219288, -94758, 9508, 29396, -53888, -75643, -82433, 27940, -18735, -179152, -121391, -7475, 46901, -55557, 223207, -374640, -302124, -156152, -61894, 27655, -358412, 107196, -25151, 301249, 216444, 53723, 201832, -129890, -57698, -243247, 87144, 219569, -186118, -85949, 145702, -99898, 22376, 61993, -192451, 311208, 3601, -191367, 117313, -48962, -207075, 168489, 391904, 170970, 271449, 89594, -173860, -207148, -22991, 145715, 4352, 129857, 70533, 156374, -431469, 106586, 192422, 249878, 63408, -98040, 175312, -224404, 101509, -124587, 460838, -19943, -201645, 204447, 65387, 40930, -186462, 137501, 136673, 72659, 6170, 226932, 83661, -87550, 109903, 80556, -67583, -66576, 17400, 107357, 30777, 114726]
15724A14726K89975i0862C81717a24322A81066D4351L9616d36251a04463A81899
15713I794K23450c69194a39974a0759k32665i2427j83660e8719q812n0994j1684
15702a30209r0992B6340j2112L5473O4823a16785a298G745P6143b81580e3581
15690h5209k46364A43461i5119H386b64128A32600H697M7946J28385I0337J31177
15679B21514C698J43856K1229o7979Q7727p9453a38831A98198J19170c5124C93
15667a00113L430a5591m39225K05302n5228a10415K9336K8569r9246A35137h0756
15655a60826a2340C42531c9649d338k30352f5336G4488a52319j26229b3433j66550
15644a89983A50907C8711a19962N5066A19388K75803a30700c7623l3572A17358
$$ y = [114726, 404701, -90862, 381717, -124322, 181066, 44351, 83967, -436251, -104463, 181899, 9794, 233244, -369194, -139974, -10759, -243424, -92427, -276087, -58719, -67531, -118525, -130209, -221201, 26340, 14228, 49701, 114524, -116785, -1298, 7745, 83888, -281580, -53581, -85209, -331573, 143461, -95119, 8386, -264128, 132600, 8697, 56643, 185028, 90337, 221514, 3698, 147554, 168783, 100804, 188531, 109078, -138831, 198198, 317368, -35124, 393, -100113, -96683, -15591, -454816, -249514, -304742, -110415, -81079, -52510, -151756, 135137, -80756, -160826, -12340, 342531, -39649, -4338, -234690, -65336, 74488, -152319, -278548, -23433, -189983, 150907, 38711, -119962, -64896, 119388, 395191, -130700, -37623, -71195, 117358]
15633a35709J8757A4195J0327P3695l9975K68131A33936C522R9374e1645C50872
15621A45866K8620A1913a66724a8516A69639e08510a99778C63636a23739G8648
15610a33254D6214a6577A67483D9481P5050f6445l42423a90986j48126a19460
15599b25280f6982C5437j637N6370c7977F6222a55019D33282f8873L3245C0053
15587A22698b53796A91610I2711A5484O9380c8673k07680F4846k3230a02726A7500
15575b57930a22864A4264K63275a13285b470l23896b912j87125J755D4208N1438
15564I5646D0570c92735a84325Q2001j58418C8858L8609c08652d1740D8534J34970
15553A83504B4983Q0808d979l8022A94423k9736C713K58398a9329k26853J19487
$$ y = [-135709, -116952, 14195, 24522, 98217, 58242, 326373, 133936, 3522, 102896, -51645, 350872, 145866, 174486, 11913, -166724, -18516, 169639, -508510, -199778, 363636, -123739, 78648, -133254, 46214, -16577, 167483, 49481, 124531, -66445, -408868, -190986, -339112, -119460, -225280, -66982, 35437, 33800, 90170, -37977, 66222, -155019, 433282, -68873, -35628, 30053, 122698, -253796, 191610, 92711, 15484, 84864, -38673, -246353, 64846, 41616, -102726, 17500, -257930, -122864, 14264, 277539, -113285, -2470, -326366, -2912, -190037, -188282, 44208, 95646, 40570, -392735, -184325, -102324, -260742, 38858, 77467, -308652, -41740, 48534, 183504, 24983, 105791, -4979, -43001, 194423, 164687, 3713, 262111, -19329, -246182, -126695]
15542a26695L0921o1159A34307A4449K28527c6427l55A00465m8919f9962F9363
15530I132K91609I5624c06195a05075j30935d601B49945a98834o8911A11940N951
15519A17891a35825B27683h345k9180D49371a37247A22219K1710e6416C83097
15508A5667j68b39184h5691o7929A89666a3720B04890Q6733A1823J96691j00917
15497A07597K3279k6726L34642I7324J57781C1672J70164Q6596C4736J24339a246
15485A85489e7376A11787J71491a82156A43999L53702k28506L0401G6709b20100
15474B34135A04046J60475r9891K9490B7470g5966B53680a01852B08688r6300
15464A12388J13959B5853L20495A63499R2559J14433K29502k63461Q4468A19289
$$ y = [-126695, -95774, -156933, 134307, 14449, 242976, -36427, -36782, 100465, 51546, -69962, 69363, 9132, 300741, 95624, -306195, -105075, -236010, -4601, 249945, -198834, -267745, 111940, 117891, -135825, 227683, -8345, -37525, 449371, -137247, 122219, 143929, -56416, 383097, 15667, 15499, -239184, -85691, -153620, 189666, -13720, 204890, 291623, 11823, 208514, 107597, 130876, 104150, 438792, 97324, 255105, 31672, 201836, 288432, 34736, 159075, -1246, 185489, -57376, 111787, 283278, -182156, 143999, 497701, 269195, 299596, 76709, -220100, 234135, 104046, 264521, 164630, 194120, 27470, -75966, 253680, -101852, 208688, 112388, 226347, 25853, 346348, 163499, 256058, 370491, 599993, 336532, 421000, 119289]
15453a19189K3428N518b138A7982K60251A20141K3369l1278a46250D4870P0021
15442A14891J83033a13547A11104d8956o263I3553K3843n5779a02342R733B9112
15430A17855J82989P2989O2621k5419O28947j13296j17092p2956q1770n7185j49773
15419D47910m826I3994R9034a55700B09898k0089N9462j413e5712A09182g8396
15407c4174A22130a77321A07922P751K6639g1910C61623c8604J7147B4581L03371
15396C27952g7462k00286A59418o6284a3021k5625A87074g2439n2316D83810A57147
15384C2849b83964B52948q341d2337G9511M6684N312i1255M5469H8607M6576E3197
15371i2578E1722J37598D9218h2881j69794C45202a6141n4679B17019r8620n0542
$$ y = [-119189, -95761, -90243, -2138, 17982, 278233, 120141, 143510, 112232, -146250, 44870, 114891, 297924, -113547, 111104, -48956, -55219, 93553, 117396, 61617, -102342, -92609, 29112, 117855, 300844, 373833, 436454, 411035, 1039982, 926686, 809594, 736638, 654868, 597683, 447910, 443084, 93994, 193028, -155700, 209898, 189809, 249271, 247858, -55712, 109182, -78396, -34174, 122130, -177321, 107922, 115673, 142312, -71910, 361623, -38604, -21457, 24581, 327952, -77462, -277748, 159418, 93134, -13021, -38646, 187074, -72439, -124755, 483810, 157147, 32849, -283964, 252948, 244607, -42337, 79511, 126195, 131507, -91255, -45786, 88607, 135183, 53197, -92578, 51722, 189320, 49218, -82881, -252675, 345202, -16141, -70820, 217019, 118399, 67857]
15360F7857J33586R1957O5222p0913A1547M71831A12878Q1930f4405I3958Q7178
15349A81136c50029D57935k10330D887J26148M09592f7230D96450A63667K80220
15339D43887a05998F0205L336B9980M66447j13361A00961j2450J15783J2289J51945
15328C68528Q3367j32995j49188D4685J8987J79494L3566A37113R826i9774A11107
15316a36030L4098C89181K043A2713J4935K80795o5393J87666c3184B81370A23219
15304E23192g5301D57425H0515B1327a33424B27426m7301L4467G2622i6794I9034
15292A90872J43243G2690J0383M61080b33945d1805F3517K3619L8811K93280j63943
15281B55284b01584B24297l0433L0441a95004D7110P248K20253d2564A96667p7698
$$ y = [67857, 201443, 293400, 358622, 287709, 11547, 483378, 112878, 194808, -64405, 93958, 181136, -350029, 457935, 247605, 4887, 131035, 540627, -67230, 496450, 163667, 443887, -105998, 60205, 63541, 29980, 496427, 383066, 100961, 88511, 204294, 216583, 368528, 451895, 318900, 169712, 44685, 63672, 243166, 276732, 137113, 146939, -99774, 111107, -136030, -101932, 389181, 391224, 12713, 27648, 308443, 243050, 430716, -33184, 281370, 123219, 523192, -75301, 457425, 80515, 21327, -133424, 227426, 180125, 214592, 72622, -96794, 99034, 190872, 334115, 72690, 83073, 544153, -233945, -41805, 63517, 87136, 125947, 419227, 255284, -201584, 224297, 193864, 224305, -195004, 47110, 54358, 274611, -42564, 196667, 118969]
15270A18969K30365e3474j06909A90735k7506l5896B525a94645h7333C04876A48486
15258A23050K91004j45499L1425A33785E0407O4819E3630K6392e7952M526g5B5666
15245e3578k59960D62743a54134H5335L83499c815H7406a15813B7584J14172c49650
15233A26738i5552B78078I4954K53586C2060L10583O20009K97479p7767M12966
15223A595330k93518l27237C28729J98450B06096Q3072E1796a31203A74185a73328
15212A13433b2979p9487F8409e7850o5981j32539B35311a79376G2424j720f9222
15200f2074R340o274A96072k0091K9698Q9433b02529B43440q028H239K07428R4707
15188C10374D3847a14287A97691M9658a1593b988A43487J858n7328a17226B4318
$$ y = [118969, 349334, -53474, -160383, 190735, 163229, 127333, 2525, -194645, -87333, 304876, 148486, 123050, 414054, 268555, 299980, 133785, 50407, 115226, 53630, 80022, -57952, -53426, -75, 25666, -53578, -313538, 462743, -154134, 85335, 468834, -3815, 87406, -115813, 27584, 141756, -349650, 126738, -95552, 278078, 94954, 348540, 32060, 342643, 962652, 1260131, 1182364, 1595330, 1301812, 974575, 328729, 527179, 206096, 289168, 51796, -131203, 174185, -173328, 113433, -22979, -102466, 68409, -57850, -123831, -256370, 235311, -179376, 72424, 70704, -69222, -62074, -52734, -59008, 196072, 175981, 205679, 295112, -202529, 243440, 235412, 8239, 215667, 310374, 43847, -114287, 197691, 247349, -11593, -2988, 143487, 145345, 88017, -117226, 24318]
15176A08594F223J32955k1042g9688a9450C9140L39370O7804i6644r426c8305
15164A49255a34564C66181I5455c0586B25262M7818O6170J0560b09249B95395
15153D44076k13705Q8879O5704B1960f11j94699B21292r9040L13136H6648k0967
15142F5681d4180C43430o3060A3931O6611J41285E7706J04927D601i1211B65613
15130A33263b84704a0830l5430I2077l0618a34210d1458A66769Q2938A12775i4834
15118b3038E28496D135J22288k3545K10408i9150C10543a40767A87373o3477L893
15107A27789j9626J70735K47266A39908M58576B92671K80308B32372p3574J34920
15097B93718a42002G0352P322M51128A92474c7446H9657A7989J66216J9015K6911
$$ y = [108594, 6223, 139178, 118136, -79688, -19450, 39140, 378510, 446314, -96644, -106070, -38305, 149255, -134564, 366181, 95455, -30586, 225262, 273080, 339250, 349810, -209249, 295395, 444076, 230371, 319250, 384954, 21960, -611, -195310, 221292, 122252, 435388, 86648, 65681, -44180, 343430, 280370, 13931, 80542, 221827, 57706, 162633, 4601, -91211, 265613, 133263, -284704, -10830, -46260, 92077, 61459, -134210, -41458, 166769, 249707, 112775, -94834, -23038, 528496, 4135, 126423, 102878, 313286, -99150, 310543, -140767, 187373, 123896, 127789, 108163, 278898, 526164, 139908, 598484, 292671, 572979, 232372, 158798, 293718, -142002, 70352, 77674, 528802, 192474, -37446, 89657, 17989, 184205, 203220, 230131]
15086B30131k1790N8399q8471q6974J51024l9685j628B2503e6602B93851l7933
15075B55918l6855e750B09990D4796K61475P5425A51467n8994C0340a60092e7752
15063I4392d4108C74482A27739D9464O473J06654C2532J01593K19612F7938K5696
15052I3634N7053N4349J96100j16482m2644K61410j04858q0089O4280J5283I5216
15040C3677K23120J55097j83141M3269N8219j20040K84684K1586B53400J97260
15030D50660k00337A01706J70972o9780L62450j27917j09339J00395A32195M94895
15020F27090f7647A11899K57964K5047M3494j01207K72442J73474q5006q4410
15010F13697M6694C14545K60565K01887L1615l54958J95359A6548L93506L71236
$$ y = [230131, 208341, 266740, 178269, 91295, 242319, 202634, 201006, 22503, -56602, 293851, 255918, 219063, -5750, 209990, 44796, 306271, 381696, 151467, 92473, 30340, -160092, -57752, 94392, -44108, 374482, 127739, 49464, 55937, 162591, 32532, 134125, 353737, 67938, 93634, 150687, 205036, 401136, 284654, 242010, 503420, 398562, 318473, 382753, 398036, 95216, 33677, 256797, 411894, 228753, 272022, 330241, 210201, 494885, 516471, 253400, 450660, 250323, 101706, 272678, 202898, 565348, 437431, 328092, 428487, 132195, 627090, -67647, 111899, 369863, 394910, 438404, 337197, 609639, 783113, 698107, 613697, 660391, 314545, 575110, 776997, 808612, 453654, 649013, 16548, 410054, 781290]
15000G81290l41793p5042K95566j23301k478k17201J11458j46085I7449L32383
14990D29832J538k14833K41389j88072M22694l01461J87391B62520L465m5414
14980B20571P8230p463J05227J44515j88262P5557L4599p4531J14510j98123N18678
14969H23508j70154J47766k84623J79730j49151L60490k74380J18545k96730j03966
14959C51035K45769r2731J71411j05080K49739l1071p1249j32976H0728K13815
14949B94543n1743l5807L42559B49696J74749J39976j21870J27351k04175r384
14939C56343J96427j2218A2919J98633L86788k62805K47853k40528M81980A59938
14928E61233K02758j40434j725o519K58667j59028k99128K65955o5091N1573j34955
$$ y = [781290, 439497, 364455, 660021, 536720, 534242, 317041, 428499, 282414, 97449, 429832, 431370, 216537, 457926, 269854, 692548, 391087, 578478, 262520, 265985, 220571, 298801, 291338, 396565, 541080, 352818, 428375, 462974, 388443, 502953, 304830, 823508, 653354, 801120, 516497, 696227, 547076, 907566, 633186, 751731, 455001, 351035, 596804, 504073, 675484, 570404, 820143, 789072, 717823, 584847, 80728, 294543, 242800, 206993, 549552, 249696, 424445, 564421, 442551, 569902, 365727, 356343, 552770, 540552, 12919, 211552, 598340, 335535, 583388, 342860, 824840, 159938, 561233, 763991, 623557, 621832, 615313, 873980, 714952, 415824, 681779, 616688, 668261, 533306]
14917E33306L17069L6335Q3227j22386J24602M64663J34715Q9441R1733k05569
14907A547136J15217N4268j24232J4627K88458j01218M69375k1247l88644j79794
14897A673946o73703K35102o3478l16726j81131N8437J43508l70553J51786o8560
14887E88628k35441J34143O9079K1699j98807K41280J47167B37257J46154l4609
14877C48802J40294J37226k3227B10076M75398n3476r5615k811K21957N5347K57831
14866A068707j42098k77157N42227l91577J13601k15975M3727B91130J34236J10364
14856E35730M9050k8653J16990O6173k05461J97374M5190j234Q3631l44652K88165
14845H02303k14908n4840K02015B02809k5133L20549K5852J35172k62765j4325
$$ y = [533306, 850375, 886710, 969937, 847551, 972153, 1436816, 1571531, 1660972, 1752705, 1547136, 1662353, 1716621, 1592389, 1607016, 1895474, 1794256, 2263631, 2242384, 1853740, 1673946, 1000243, 1235345, 1171867, 855141, 674010, 732447, 875955, 505402, 657188, 588628, 353187, 487330, 556409, 578108, 379301, 620581, 767748, 237257, 383411, 348802, 489096, 626322, 603095, 210076, 685474, 631998, 536383, 533572, 755529, 810876, 1068707, 926609, 649452, 1191679, 800102, 913703, 697728, 741455, 291130, 425366, 535730, 584780, 556127, 673117, 739290, 533829, 731203, 776393, 775159, 858790, 514138, 802303, 587395, 532555, 734570, 202809, 177676, 498225, 524077, 659249, 396484, 382159]
14835C82159K75338j59721l1597j66229L70602J51270l7578L25517j08694j78194
14825H22873J72223J08221J7736m04646M90746l59515m04301Q3586R5534J03571
14815G26028j37677k58172j807M6332M78170l76105J09444K09183Q9397r6623
14805G88170j78176J26577P3698J13535j77720m2274K03924k06627L00103l21827
14795F79383k052k0522J31850j6588L61658p6191L1096k66919K4138l40662L79039
14784H84230N5805l68919J04217j07603j86145R9942J52968r6969L13364k07106
14774F43784j65808M1322K08320m0094J2794n7205m136L48208j40870J76306j95784
14763H26837p6116j83601L80438n9387o9296j57113L09479l11978j60478R0966
$$ y = [382159, 657497, 497776, 466179, 299950, 670552, 821822, 784244, 1109761, 1001067, 822873, 995096, 1103317, 1121053, 716407, 1207153, 847638, 443337, 526923, 622457, 726028, 588351, 330179, 328372, 374704, 852874, 476769, 586213, 795396, 884793, 788170, 609994, 736571, 810269, 923804, 746084, 703810, 907734, 701107, 1001210, 679383, 677331, 656809, 788659, 772071, 1133729, 1057538, 1088634, 821715, 845853, 505191, 884230, 940035, 571116, 675333, 567730, 381585, 481527, 634495, 537526, 850890, 643784, 477976, 519298, 727618, 687524, 700318, 643113, 638977, 987185, 846315, 1022621, 826837, 750721, 567120, 947558, 888171, 818875, 661762, 971241, 659263, 498785, 589751]
14753E89751k5226M57457M3161D99333M43046k21049j89125L6376K98969l77388
14743D90162J7161o8285J59386L60884m66175J95347O2914m5412k40904N70319
14733A035397j55527k36599K27752r8569L33352l23988J41027j30995R8437l38842
14723E51445K62927j12753K3475K1811Q0563J10411n5592K91508j13404J95734
14713A256125M83481r4789K06001j17723o22239K72043j64132p9776k76433R6100
14703I58658j30801j24276J71550j16126K3686L87318j1761l85919p6475L79328
14693A075182j73908L60764l25764M21926j32113M17115l17298J29813N93772
14684B049489m90108k78698J79104J6924m66076L24809n14261K55193j55604K84080
$$ y = [589751, 564525, 1021982, 1065143, 499333, 942379, 721330, 532205, 568581, 867550, 490162, 507323, 439038, 598424, 959308, 493133, 688480, 751394, 705982, 465078, 1035397, 879870, 643271, 871023, 772454, 1105806, 781818, 922845, 791850, 890287, 551445, 814372, 701619, 725094, 746905, 827468, 937879, 882287, 1173795, 1060391, 1256125, 1739606, 1644817, 1850818, 1733095, 1110856, 1382899, 1218767, 1138991, 862558, 958658, 827857, 703581, 875131, 759005, 782691, 1170009, 1158248, 772329, 695854, 1075182, 901274, 1262038, 936274, 1358200, 1226087, 1643202, 1325904, 1455717, 2049489, 1559381, 1280683, 1459787, 1476711, 1010635, 1335444, 821183, 1076376, 920772, 1204852]
14674A204852j08737j11899R1343N3145m23514N8749L6665K80999j86536J9263
14664I14330J49589j29705J39657p7925o4587J93553j15396L6681j88176J07752
14654I65773J35500j74447L6783Q3256j64537J74598L04122j29890j88307j58559
14644H84292O81979m91287M4766k5323R7696K36110L21063K3225k60273m13067
14634A099181R9144J38334K0436j03812j41636K16178j49468L4646L60415J1990
14624A585408j66467l35955J58930N4245m5919J16235J36690k46073K26472n24143
14614I59423M77934r6529L21386m18976M47251p4164P4232m4767j62484L5219
14604A518525j75611K21214L08457m79524L49077k31690k13459L30146L3276j19492
$$ y = [1204852, 1096115, 984216, 1075559, 1128704, 705190, 763939, 800604, 1081603, 895067, 914330, 1063919, 934214, 1073871, 995946, 931359, 1124912, 1009516, 1046197, 858021, 965773, 1101273, 926826, 963609, 1046865, 882328, 1056926, 1361048, 1231158, 1042851, 884292, 1566271, 1074984, 1119750, 1094427, 1192123, 1428233, 1749296, 1772521, 1512248, 1099181, 1198325, 1336659, 1357095, 1253283, 1111647, 1327825, 1178357, 1213003, 1573418, 1585408, 1418941, 1082986, 1241916, 1296161, 1250242, 1366477, 1503167, 1257094, 1483566, 959423, 1437357, 1340828, 1662214, 1243238, 1690489, 1616325, 1690557, 1645790, 1483306, 1518525, 1342914, 1564128, 1872585, 1393061, 1742138, 1510448, 1296989, 1627135, 1660411, 1540919]
14594A540919K0640o7894J77378p2655O1030p4454L05249k85790N127r9421j39796
14583A370333O90734m20138M6794p8353L17176o8755L12612l09986K33958l59691
14573A734684J92591k92371j7195J08919J18584N1740j8834k8273K2906J33092
14563B005843K36511k33921l00786O09793o22923O77297k42974k01343L44250
14554B271747l4246j15887L81547J36378M2091L7530N0573l46114L60466M35519
14544C219604m87822N08739J45230P525N26049P4429K61497P45220Q26091R09953
14534F736515K026016L594807O626760J1960673N55392j1497762o289828l916446
14526I796127k446735k210574j031582j29276M27330L86402j137698l81685k89676
$$ y = [1540919, 1561559, 1493665, 1671043, 1598388, 1659418, 1584964, 1890213, 1604423, 1609550, 1510129, 1370333, 2061067, 1640929, 1687723, 1609370, 1926546, 1857791, 2170403, 1860417, 2094375, 1734684, 1927275, 1634904, 1617709, 1726628, 1845212, 1896952, 1878118, 1849845, 1872751, 2005843, 2242354, 2008433, 1707647, 2317440, 1694517, 2371814, 2128840, 1927497, 2271747, 2237501, 2121614, 2503161, 2639539, 2681630, 2719160, 2769733, 2423619, 2784085, 3219604, 2731782, 3240521, 3385751, 3393276, 3919325, 3993754, 4255251, 5000471, 5826562, 6736515, 8762531, 12357338, 18984098, 30944771, 31500163, 20002401, 13712573, 9796127, 7349392, 5138818, 4107236, 3977960, 4405290, 4791692, 3653994, 3272309, 2982633]
14517B982633m8336m42759j11757J64816M8307j40768k26822j7570J57521J02471
14507B467736j9979l126n1619P492M27198n0556k32213K35929l03393M23013L24474
14496C224956k06981O6246m39658K74445k4091K77106k02542R6225L1242L12815
14486C409763Q0527k10382J45583O3414k8700M5235P793n24836R50597n55812
14476C383182L79631j44885j27089M17764j10048J64169J25331k95590M35540
14467D228005n90166J52608K41560j58799K34987p3928k054J35360L39473l83631
14457D123415k3629K22667J9256K19673m8574P4085j0944k92496O18909o6237
14447D836125k97239K95490N2731L29333K62119j74793j93001K92822p1945q7027
$$ y = [2982633, 2934297, 2491538, 2379781, 2544597, 2592904, 2452136, 2225314, 2207744, 2365265, 2467736, 2447757, 2444631, 2393012, 2400504, 2827702, 2777146, 2544933, 2780862, 2477469, 2900482, 3224956, 3017975, 3084221, 2644563, 2919008, 2894917, 3172023, 2969481, 3065706, 3096948, 3409763, 3490290, 3279908, 3425491, 3488905, 3460205, 3505440, 3513233, 2988397, 3938994, 3383182, 3762813, 3617928, 3490839, 3908603, 3798555, 3962724, 4088055, 3792465, 4228005, 3637839, 3790447, 4032007, 3873208, 4108195, 4034267, 4032213, 4167573, 4507046, 4123415, 4099786, 4322453, 4341709, 4561382, 4512808, 4586893, 4575949, 4283453, 4902362, 4836125, 4538886, 4834376, 4887107, 5216440, 5478559, 5303766, 5110765, 5403587, 5331642, 5244615]
14437E244615K14333J72183k84754K55433m7939N68330k27870J48732l48609L41205
14427F035659l55268M53270L61911k11479L96042j19716j52949K60144L31444
14418F999058L0893p5546l6671N01576K95782k28762k0104J93244j20432K74625
14408G813663K89007k18023M34796K90138O6217J37215k43080M09065M9235L41667
14398I369900j13284Q8865j89703j29662O54944j42707L71809m6032P86784l37138
14388A0313776K35832K13782l3062k29879M07991K93443K48148n1319N74955l0939
14378A1942728Q5451N53738J16507k21036O57512N2891J04251K34360J01157N17005
14368A4144564K45113K22436L72920M66461K6562L36337K70403M06625J76093
$$ y = [5244615, 5458948, 5631131, 5346377, 5601810, 5553871, 6122201, 5894331, 6043063, 5694454, 6035659, 5680391, 6133661, 6495572, 6284093, 6680135, 6560419, 6407470, 6667614, 6999058, 7029951, 6954405, 6917734, 7419310, 7715092, 7486330, 7466226, 7659470, 7539038, 7813663, 8102670, 7884647, 8319443, 8609581, 8675798, 8813013, 8569933, 8978998, 9028233, 9369900, 9256616, 9345481, 9155778, 9026116, 9681060, 9538353, 9910162, 9864130, 10650914, 10313776, 10549608, 10763390, 10730328, 10500449, 10908440, 11201883, 11450031, 11398712, 11973667, 11942728, 12028179, 12581917, 12698424, 12477388, 13134900, 13187791, 13292042, 13526402, 13627559, 14144564, 14389677, 14612113, 14985033, 15451494, 15478056, 15814393, 16084796, 16491421, 16667514]
14359A6667514K26583K88277J85125P89188p815N84143K24676P54163M28460N60266
14349B0700580N33558Q4879L32413P91055K47902M15162L61792M72833R42112
14340B4882286L33260Q43483K82443P51283N85554P71648N97786N52999Q91881
14331C0492623Q42772O29185R88201R33453Q94697J004876R72806P94355R94484
14322C8547452J442524P71257J457218J452798J422861J455315R80671J677278
14314D9207374J308760J658467J715309J823228K206970J739798J901851K512882
14306F4074639K149355K133269K607920K736521K853516K536071K981301K947070
14298H5019662L735995L513694L991916L900997M469857M304069M855043N055499
$$ y = [16667514, 16894097, 17182374, 17367499, 18156687, 18148872, 18733015, 18957691, 19711854, 20140314, 20700580, 21234138, 21319017, 21651430, 22442485, 22690387, 23105549, 23467341, 23940174, 24882286, 25215546, 26059029, 26341472, 27092755, 27678309, 28449957, 29047743, 29600742, 30492623, 31335395, 31964580, 32952781, 33886234, 34780931, 35785807, 36758613, 37552968, 38547452, 39989976, 40761233, 42218451, 43671249, 45094110, 46549425, 47530096, 49207374, 50516134, 52174601, 53889910, 55713138, 57920108, 59659906, 61561757, 64074639, 66223994, 68357263, 70965183, 73701704, 76555220, 79091291, 82072592, 85019662, 88755657, 92269351, 96261267, 100162264, 104632121, 108936190, 113791233, 118846732]
14290A18846732N288124N683208O178403O359223O950598P106085P718140Q470724
14282A72601237Q180548R423198R651438J0164190J0822294J1127903J2097899
14275B44068707J2501819J3266344J3554928J4254558J4538002J4502425J4742294
14268C41429077J5080725J5340870J4994767J3568893J2448201J1007980J0378983
14261D34249496R479566Q177772P639133O794483L413477J273485p96229o296247
14253D63934936q249901o039749l264327m282344q864325j0561681j3249395j4160295
14245C95262919j3125200j4437178j4925774j3812325j4067229j4023092j4575430
14238B96296691j3573768j2686311j2288429j1661050j1486891j1534807j0881585
$$ y = [118846732, 124134856, 129818064, 135996467, 142355690, 149306288, 156412373, 164130513, 172601237, 180781785, 190204983, 199856421, 210020611, 220842905, 231970808, 244068707, 256570526, 269836870, 283391798, 297646356, 312184358, 326686783, 341429077, 356509802, 371850672, 386845439, 400414332, 412862533, 423870513, 434249496, 443729062, 451906834, 459545967, 466340450, 469753927, 471027412, 470231183, 463934936, 455685035, 449645286, 446380959, 442098615, 433234290, 422672609, 409423214, 395262919, 382137719, 367700541, 352774767, 338962442, 324895213, 310872121, 296296691, 282722923, 270036612, 257748183, 246087133, 234600242, 223065435, 212183850]
14231B12183850j0842227j0435785r399116r101059q692515p701433p265307p263695
14223A41482713o351246o206717n749615n791216m373800n095442m742760l992998
14215I9178919m079551l723044l932554l121275l102337l357223k751711k853456
14207G2257768k659230k399341k326993k075606j978468k415069j947954j624503
14199E4830604j637297j465782j849912j272933j505080j489309j430282o50262
14191D3529747j256748j317858j311208j233763p71955j244528p16320r10280
14183C4767087j206679q57902n30727r08348p55810m17013q48851p35474q84483
14174B7621800n82979p12174p67206l67312n50716p13302o52824n14802k6655
$$ y = [212183850, 201341623, 190905838, 181506722, 172405663, 163713148, 156011715, 148746408, 141482713, 135131467, 128924750, 123175135, 117383919, 113010119, 107914677, 103171917, 99178919, 95099368, 91376324, 87443770, 84322495, 81220158, 77862935, 75111224, 72257768, 69598538, 67199197, 64872204, 62796598, 60818130, 58403061, 56455107, 54830604, 53193307, 51727525, 49877613, 48604680, 47099600, 45610291, 44180009, 43529747, 42272999, 40955141, 39643933, 38410170, 37638215, 36393687, 35677367, 34767087, 33560408, 32702506, 32171779, 31263431, 30507621, 30090608, 29241757, 28506283, 27621800, 27038821, 26326647, 25559441, 25192129, 24641413, 23928111, 23275287, 22760485, 22733830]
14165B2733830p41898l49644o14195n30795k14695o56765l11906k35991l98249
14156A8679692j32668m89697k32500o87776j60135j70063m34740n46694k27342
14147A5598077k76248Q678o76484j50084l1181l50143K75727p31782k3517m92526
14137A3150517j65760l13298k65295K46787j89136k83003k76293l17348l09594
14128A1277577L9887j36280k35122j89607k14833l443k07486k69034j15238k96915
14118I649506j37137K08319o78763J83930j59664J17827l58097j4672l49104j30780
14108H331365Q7597N4208k99142j87772p5934k8939j82584J23288j33243l44766
14098G344078M0385k58697p4581J64808p0833l73674R4956r1624k25836m2223
$$ y = [22733830, 21991932, 21642288, 21028093, 20497298, 20282603, 19625838, 19313932, 19077941, 18679692, 18547024, 18057327, 17824827, 17137051, 16976916, 16806853, 16372113, 15825419, 15598077, 15321829, 15330507, 14654023, 14503939, 14472758, 14122615, 14398342, 13666560, 13643043, 13150517, 12984757, 12671459, 12406164, 12652951, 12463815, 12180812, 11904519, 11587171, 11277577, 11317464, 11181184, 10946062, 10756455, 10541622, 10538179, 10330693, 10061659, 9946421, 9649506, 9512369, 9720688, 9041925, 9225855, 9066191, 9184018, 8825921, 8811249, 8462145, 8331365, 8418962, 8473170, 8174028, 7986256, 7910322, 7881383, 7698799, 7822087, 7688844, 7344078, 7384463, 7125766, 7051185, 7215993, 7145160, 6771486, 6866442, 6774818, 6548982, 6506759]
14088F506759J4537m46720P0007l83780Q64934n30978j48348M4674m0380J8772
14078E969477j97554K42000m21556k42248L9640J87539n50802M19294l9708k2745
14068E383337j89898k62361M46639m50374k87793N91731l89493L96883n79077
14059D659594j85303J74879j94463J16230N9058k82149L62906m85123K40653j36991
14049D329291k26094L66745k86112l1327J5686K78561j07048j33505q4728n33673
14039C587796L02904l14694L31961l03709J93485k41612j07955J05991L15134
14030C869301k76760O8554m83335K31349J52433m97088M0009M67945l3181m56728
14020C082499J82218k09837j03798J10076M66866l44272k11746r6197K39048l57528
$$ y = [6506759, 6521296, 6074576, 6144583, 5760803, 6625737, 6094759, 5946411, 5991085, 5950705, 5969477, 5771923, 6013923, 5592367, 5350119, 5389759, 5577298, 5026496, 5445790, 5406082, 5383337, 5193439, 4931078, 5377717, 4927343, 4639550, 5231281, 4841788, 5238671, 4659594, 4474291, 4649170, 4454707, 4570937, 4629995, 4347846, 4710752, 4225629, 4466282, 4329291, 4103197, 4469942, 4183830, 4152503, 4168189, 4446750, 4339702, 4206197, 4121469, 3587796, 3890700, 3576006, 3907967, 3604258, 3797743, 3556131, 3448176, 3554167, 3869301, 3592541, 3661095, 3177760, 3409109, 3561542, 3064454, 3104463, 3572408, 3539227, 3082499, 3264717, 3054880, 2951082, 3061158, 3528024, 3183752, 2972006, 2875809, 3114857, 2757329]
14010B757329J57475j32400j59798q305K55404K9813k31902J25387l41338J1940
14000B463605n3182J40109J37386m52811L52511K83871l80567K04486l98392j9612
13990B277404R9013J31523j57363k02269Q3874l1262J67106Q7035J15158k56757
13980B313462M17870o0318K08457j27227O02019M38054J189839K553870N829926
13971A3365952J1886001P671487r565830o654941m099152l002570k605914j225088
13963E769945q36269n52123k43972m96326l49035k36953k1513l35177N7191j22373
13953B633395l82436M25879k41405N0629J0081j60854k30750L12356k83573J47757
13943B281079J09078k79311J30596m83301N87136l22517j86301O8787K7645n02981
$$ y = [2757329, 2914804, 2782404, 2622606, 2614301, 2869705, 2899518, 2667616, 2793003, 2451665, 2463605, 2410423, 2550532, 2687918, 2235107, 2587618, 2871489, 2490922, 2695408, 2297016, 2277404, 2376417, 2507940, 2350577, 2148308, 2232182, 2200920, 2368026, 2455061, 2570219, 2313462, 2731332, 2671014, 2879471, 2752244, 3354263, 3792317, 4982156, 7536026, 13365952, 25251953, 32923440, 23357610, 16702669, 12603517, 9600947, 6995033, 5769945, 4933676, 4381553, 4137581, 3641255, 3292220, 3055267, 3033754, 2698577, 2755768, 2633395, 2250959, 2676838, 2435433, 2486062, 2496143, 2335289, 2104539, 2416895, 2133322, 2281079, 2390157, 2110846, 2241442, 1758141, 2345277, 2022760, 1836459, 1905246, 1932891, 1429910]
13933A429910O48000j45268r5179K32316m49599L66113k49273j03987K19538m2459
13923A810112J85472k20123J02703m13406K26187J4578P091Q7292J26822j63485
13913A763243M2843k15104m0211L5051Q7983j26943n8753J11469L2971k18850
13903A413699K08435l64627L08844p071l43372M17751j38263j66222j9837M67308
13893A776645p7660j96314j78013J60068J15660l44191P5709K81194j63128m11320
13883A038650J33383J29011Q4794m7602k46811K9963K58257j6910Q9255l17734
13873A134256K50830r1268R9262o4549j01924K66130l72112P8659K39330m12317
13863A026297R7203M8539N7105j70099n3858J52588j97279L55564k57442L09684
$$ y = [1429910, 2077910, 1932642, 1837463, 2069779, 1620180, 1986293, 1737020, 1633033, 1852571, 1810112, 1995584, 1775461, 1878164, 1464758, 1690945, 1705523, 1712614, 1799906, 1926728, 1763243, 1806086, 1590982, 1550771, 1585822, 1673805, 1546862, 1488109, 1599578, 1632549, 1413699, 1622134, 1257507, 1566351, 1559280, 1215908, 1633659, 1495396, 1329174, 1309337, 1776645, 1698985, 1502671, 1324658, 1484726, 1600386, 1256195, 1331904, 1613098, 1449970, 1038650, 1172033, 1301044, 1385838, 1338236, 1091425, 1121388, 1379645, 1362735, 1451990, 1134256, 1385086, 1293818, 1393080, 1328531, 1226607, 1492737, 1120625, 1199284, 1438614, 1026297, 1123500, 1172039, 1229144, 1059045, 1005187, 1157775, 960496, 1316060, 1058618, 1368302]
13853A368302j78725J64701k7567m24979K8581M6499L31516k25176L37930j68280
13843A252802k46657n670K25235j65111p0350J04789j89923J62215j60289J14271
13833A021312m0210K10491k34318J26730o4561Q5543j78282L18650k73481m0890
13823I30984K69735K8081k42380k07671P9144j85373p6047K07810N37522l86395
13813I55410J05055r947r6920n4646J39503k67838K51677J45214n53126L14127
13803I28509n7832O6403L4675j50412J67031k54315L44767m14807L7924O7362
13793G69305L00382O2162k42736q1600j00038K77397k40414K7568L74215l72413
13783G73828j67608L87904q8088J5291l44405L6389R9320r4552J22564L76029
$$ y = [1368302, 1189577, 1354278, 1326711, 901732, 930313, 976812, 1308328, 1083152, 1421082, 1252802, 1006145, 1000475, 1225710, 1060599, 990249, 1095038, 905115, 1067330, 907041, 1021312, 981102, 1191593, 957275, 1084005, 1019444, 1104987, 926705, 1245355, 971874, 930984, 1200719, 1228800, 986420, 778749, 857893, 672520, 596473, 804283, 1341805, 955410, 1060465, 1050518, 953598, 898952, 1038455, 770617, 1022294, 1167508, 614382, 928509, 870677, 937080, 971755, 821343, 988374, 734059, 1078826, 664019, 701943, 769305, 1069687, 1131849, 889113, 807513, 707475, 984872, 744458, 772026, 1146241, 773828, 606220, 994124, 906036, 921327, 576922, 613311, 712631, 618079, 740643, 1116672]
13773A116672k38917j08118K73602k92085p463N4741J05400j10440J6269k71724
13763E37937J24315K43053m31064M04708j04840k15154J35229K36632n1600J8447
13753H97663k10982J28121J36865r5577j67756k6656k1829m6057M4130l3524r7207
13742E07191N1887J21598L69m1599j03j1959N3659q9251Q2123Q3833L2014j4850
13730G74912j66954k36777K24263J33746k44134k25361J89636l5108M21935k90081
13720E46077L47304l16445L6812k19290L07557j62059j13356L03273r7425l7159
13710E95289K36452l82565K23219J12162l8977l4087C30279N11450k22711m3226
13700E75792M8330j89695k8157M03446l30382J18176L0803k68639J39279m7868
$$ y = [1116672, 877755, 769637, 1043239, 751154, 743691, 798432, 903832, 793392, 809661, 537937, 662252, 905305, 474241, 878949, 774109, 558955, 694184, 930816, 879216, 897663, 686681, 814802, 951667, 856090, 688334, 661678, 639849, 593792, 637922, 604398, 507191, 559078, 680676, 681045, 639446, 639343, 627384, 681043, 591792, 673915, 757748, 789762, 774912, 607958, 371181, 595444, 729190, 485056, 259695, 449331, 414223, 836158, 546077, 893381, 576936, 613748, 394458, 702015, 539956, 426600, 729873, 632448, 595289, 831741, 449176, 672395, 784557, 745580, 711493, 330279, 841729, 619018, 575792, 624122, 434427, 406270, 809716, 479334, 597510, 628313, 359674, 498953, 451085]
13690D51085L55148k95070p5202J72919n5607j28022j1078L4188K18173q6231
13680E80303R0918C27243M11163k77826j60111K14805K58091C03738M8518L10706
13670F62962j01687n2973L12849k82539p8471q9647J95135k0636K6074j30053
13660D41014N7213k9101J40719B92000J27058q3372m5060M08156j14449o2298
13650E22035R2364j28075B27953K85143J55657k80210K22753B23218L43507j12262
13640D54463A62014K57302K15952j49230A53120M13546n1504m742L24456A95122
13629C06925P1338M821J13428O5958J0585k81094L8363K78310B35537R2238M8043
13618C75818K4624A16897K43339K6559j20832K01687Q1731l8097k2821k30649
$$ y = [451085, 806233, 511163, 435961, 608880, 553273, 425251, 414173, 448361, 666534, 580303, 671221, 327243, 738406, 460580, 300469, 515274, 773365, 303738, 352256, 662962, 561275, 508302, 821151, 538612, 460141, 370494, 565629, 544993, 571067, 441014, 498227, 469126, 609845, 292000, 419058, 335686, 290626, 698782, 584333, 522035, 614399, 486324, 227953, 513096, 668753, 388543, 611296, 223218, 566725, 454463, 162014, 419316, 635268, 486038, 153120, 566666, 515162, 510420, 834876, 195122, 306925, 378263, 383084, 496512, 562470, 573055, 291961, 330324, 608634, 235537, 327775, 375818, 400442, 116897, 360236, 386795, 265963, 467650, 549381, 511284, 488463, 257814]
13608B57814N9134K42313A89139k4769L92907A47850K95839B21162J91342O6033
13598D78537r0266A82937N8782J50982A63005J17857l0493i200B63671R5960J5874
13587C75505J88914K62116D07638k01800H4651N9419J69274N0077J15074j64472
13577C14023J02787o7341L5620A61050L42316k28666R4107m758p3336A36300K55598
13566C91898j70492K40959j4317J25100k83757O5836J04668j92934J13646R1522
13556D72129J42217d793C64360J16927K42316a2443C97439R5r382G9295N3521
13545A32816P4318l1655K44781L9062K954B06377M87995l04099F2103f7370D86160
13533I4841C1530K89451J40999j66999A10865A2116J0888M34907A46294a9049
$$ y = [257814, 316948, 559261, 189139, 164370, 557277, 147850, 443689, 221162, 412504, 478537, 388271, 182937, 241719, 392701, 163005, 280862, 250369, -9200, 263671, 359631, 375505, 564419, 826535, 407638, 205838, 84651, 144070, 313344, 363421, 478495, 314023, 416810, 349469, 385089, 161050, 503366, 274700, 368807, 364049, 290713, 136300, 391898, 221406, 462365, 448048, 573148, 289391, 355227, 459895, 266961, 380607, 472129, 614346, -4793, 364360, 481287, 723603, -12443, 397439, 397534, 388152, 79295, 132816, 207134, 175479, 420260, 459322, 462276, 206377, 694372, 390273, 62103, -67370, 486160, 94841, 31530, 320981, 461980, 294981, 110865, 12116, 23004, 457911, 146294, -19049]
13522E43222A41367M74675A01338K9689J29258p8599R0714o8321K54796A84559
13511A98836J1394J84259p7548Q2398r0138R0818j25254r2948J16772P2491J43802
13500E14882j17702J72567A24906K95162j39370Q3951A05161M71216A072M6200
13490D7272K31614M3830j629I1171J85775j11921J79455J01315a5881B48636A02869
13478E25558H5731K69127J22811a03688C36373r9163K40688D2610M65425B46673
13467B50103p1321L12203j68140e8343b6885A13718K50338j78642J18680A11624
13456C25216A42691K00897D1050N23292B50246p7448E6755J92358J18275j08509
13446B58879N3839p3674J024J48946K301j46827o7185k769L9144q0873j248K46277
$$ y = [543222, 141367, 616042, 101338, 131027, 260285, 181686, 272400, 204079, 458875, 184559, 198836, 210230, 394489, 316941, 399339, 309201, 400019, 274765, 181817, 298589, 371080, 514882, 397180, 569747, 124906, 420068, 280698, 364649, 105161, 576377, 1072, 47272, 278886, 322716, 321087, 91171, 276946, 165025, 344480, 445795, -15881, 248636, 102869, 525558, 85731, 354858, 477669, -103688, 336373, 237210, 477898, 42610, 508035, 246673, 250103, 178782, 490985, 322845, -58343, -26885, 113718, 364056, 185414, 304094, 111624, 325216, 142691, 343588, 41050, 564342, 250246, 172798, 56755, 249113, 367388, 258879, 312718, 239044, 240068, 389014, 391315, 244488, 177303, 174534, 213678, 132805, 131557, 377834]
13434C77834j68347n1818C2639K18843J19429M2844i6008B12633l2686L10559
13424D90506A94888K11556j64856N685I4367J52639o2553P4868d1601B22251R998
13413B32249J53721l4716a4939A18420K5363L8232a59999A75413j89Q609a58444
13401B41248H9594Q4288p2578K29888q5091a03507C23951j46069o1067c7738r1333
13390a29071A17584B9176J79579C6588J74228K9429a27062A90593J50006a45868
13379B69777f7244A19883j6624g7777A09226A3085C254J3948d320D49566b58188
13367A19400J64525N0736a7328A21024R6072g4523A71122h044A81388K95567A47423
13355B89362g6308J6605k457A25048L42540F9239N39885B00056C3384M22487A38752
$$ y = [377834, 209487, 157669, 32639, 251482, 370911, 413755, -96008, 212633, 179947, 490506, 194888, 406444, 241588, 247273, 94367, 247006, 184453, 259321, -41601, 222251, 232249, 385970, 351254, -14939, 118420, 143783, 182015, -159999, 175413, 175224, 183833, -158444, 241248, 89594, 173882, 101304, 331192, 246101, -103507, 323951, 177882, 116815, -37738, -129071, 117584, 29176, 208755, 36588, 210816, 240245, -127062, 190593, 340599, -145868, 269777, -67244, 119883, 103259, -77777, 109226, 13085, 3254, 17202, -4320, 449566, -258188, 119400, 283925, 334661, -17328, 121024, 217096, -74523, 171122, -8044, 181388, 476955, 147423, 289362, -76308, -59703, -62160, 125048, 467588, 69239, 609124, 200056, 33384, 455871, 138752]
13343E4466K65763F2056a62994C34143a8039B05115K10321J3600A34569R3578
13333B28147o108b5945C36953N0754j72996m3346O6670J36160J59411j10457A11082
13321E03729A48792j6615K7251Q2249n5118p0589J23499O8761h9279D6646b2486
13309E1118K92689a1405F3289P018a39390A03215J69471J82724A01612K18098
13299C19710j8554G0543L05965j13381d9578C08278c48815b4825D10768b58797
13288E39265p8078k00182M9673N1065j09621L8949A00351m5502h5491E8902M6354
13277A05256k4781B053M974M00297I7357e2905a5813B54130o8414p4535J01669
13266B12850a05305H8838J72923J06709q6385A36885B5681Q7770f5718K3925A1977
$$ y = [54466, 320229, 62056, -162994, 334143, -18039, 205115, 415436, 429036, 134569, 228147, 222039, -25945, 336953, 387707, 214711, 171365, 238035, 374195, 533606, 423149, 111082, 503729, 148792, 132177, 159428, 241677, 186559, 115970, 239469, 308230, -89279, 46646, -22486, 51118, 343807, -11405, 63289, 70307, -139390, 103215, 272686, 455410, 101612, 319710, 301156, 70543, 376508, 263127, -49578, 308278, -348815, -24825, 410768, -258797, 539265, 461187, 261005, 310678, 361743, 252122, 291071, 100351, 54849, -85491, 58902, 105256, 80475, 2053, 7027, 407324, 97357, -52905, -15813, 254130, 185716, 111181, 212850, -105305, 88838, 261761, 368470, 282085, 136885, 25681, 113451, -65718, -41793, 11977]
13254B7091Q7677a34213B30135E2554M00667a009A92535D7380J76272b50138B86719
13242B1242Q8591A0423a39641A45474d8279A27837a25165p3318A93701l8429e0213
13230H1848J6563N9280m1529C655J7447h5495L3643b815A06783j230J15217i6751
13217D27934p3264A73250O8132H8844g2321A58378b04071i4612d1738B31396g0343
13205a57332D44329A22808F0399L16479B3019J77503q3545k9474b0777A63314
13194B35739J54191n9246A34810o2004K6580a51910J3476B3562L82947r1355j04702
13183B10452e0136A75120a42229b6826B42291a77365B38746J3655I9686Q990L2819
13172A41495a59507D6004O5096b4091A33739a3597H5389Q9992K96740a84099D78817
$$ y = [27091, 114768, -134213, 230135, 52554, 453221, -1009, 192535, 47380, 223652, -250138, 286719, 21242, 109833, 10423, -139641, 145474, -48279, 127837, -125165, -198483, 193701, 155272, -50213, 81848, 98411, 157691, 116162, 3655, 21102, -85495, -51852, -2815, 106783, 105553, 220770, -96751, 427934, 354670, 173250, 241382, 88844, -72321, 158378, -204071, -94612, -41738, 231396, -70343, -157332, 444329, 122808, 60399, 376878, 23019, 200522, 116977, 87503, -20777, 163314, 235739, 389930, 330684, 134810, 72806, 99386, -151910, -138434, 23562, 406509, 315154, 210452, -50136, 175120, -142229, -26826, 242291, -177365, 238746, 252401, 99686, 108676, 141495, -159507, 46004, 111100, -24091, 133739, -13597, 85389, 175381, 472121, -184099, 478817]
13160E291a76307Q1935c6389F4510b0880D4028f2573R293B4484L57529E1903b8691
13147a57276M9030A33002a92932J8030b898C86952A36025b19097Q6198A03112
13136i2860n0172G2476B8108J12226J3576i7063M6084j05783L8159A70382a12528
13124D1349J85553J73632E0047L8283K6765c8071j05930e1399A79939j1242M7083
13113B15780k3292Q2321i3858C13806b31076B22887a680A39076b9496k91243a2600
13101A62962J64110a13107B26700C41J03856i4655A82553a80878A36136a4747
13090e8484B4188R7334a15446B70328q7489L8409E794J29618d4396B97456j16225
13079A81231R3571H6623b5104A01186J69948D8455a44103D00193a96811A60195
$$ y = [5291, -176307, -94372, -36389, 64510, -20880, 44028, -62573, -53280, 24484, 382013, 51903, -28691, -157276, -108246, 133002, -192932, -174902, -2898, 386952, 136025, -219097, -132899, 103112, -92860, -143032, 72476, 28108, 140334, 153910, -97063, -50979, -156762, -118603, 170382, -112528, 41349, 226902, 400534, 50047, 88330, 115095, -38071, -144001, -51399, 179939, 168697, 215780, 192488, 274809, -93858, 313806, -231076, 222887, -1680, 139076, -29496, -320739, -12600, 162962, 327072, -113107, 226700, 341, 104197, -94655, 182553, -180878, 136136, -14747, -58484, 24188, 121522, -115446, 270328, 182839, 221248, 5794, 135412, -44396, 297456, 181231, 274802, 86623, -25104, 101186, 271134, 48455, -144103, 400193, -196811, 160195]
13068A84237b12485H2503O7129h7760o1050k06674d5050r644C57866m8366l6029
13057B73471l5906d86698J98712g6258A74611J91483a83682O7623B59640R9383
13047C59023j34413D8609M1661J34939C189L47276a79957f5108j8674m1109G2716
13035A34035h1950c6891A09474l1384Q3875C5475f3775j7668a3469A84785L3972
13024B18757K6546H9943R0024K2412l2616a15177D7770k0436b0323B86313A01097
13012b24532B44712j1708D4481c54352B91775r6665g1973j7043C50022j41144
13002B08878g6236B02168a86783B13844a66988A92167J19179A11532J68831l0025
12992B50338J97082E7747K17440f1245H5911I62P9562m613J40202n1647F3921
$$ y = [184237, -212485, 82503, 149632, -87760, -148810, -355484, -45050, -54694, 357866, 309500, 273471, 237565, -486698, -287986, -76258, 174611, 366094, -183682, -116059, 259640, 359023, 224610, 48609, 90270, 225209, 3189, 350465, -179957, -65108, -83782, -124891, 72716, 134035, -81950, -36891, 109474, 78090, 161965, 35475, -63775, -81443, -13469, 184785, 218757, 245303, 89943, 179967, 202379, 169763, -115177, 47770, 27334, -20323, 286313, 101097, -224532, 244712, 233004, 44481, -354352, 291775, 195110, -71973, -89016, 350022, 208878, -76236, 202168, -186783, 213844, -166988, 192167, 311346, 111532, 280363, 250338, 447420, 57747, 275187, -61245, 85911, 962, 80524, 75911, 216113, 164466, 63921]
12980a54343B13788e2192A87588l0035g9838E6816k7581F082Q2377e889B49534
12968D9494e6093B78115b5969A01319J03879k9845k7310c98494J90183J01527
12958a06784p1261a0182A34290a47404q2646p0142B5974a18247I3143L04917b9219
12946E6520e8921A3391J32458E7778a20080A03864r44M12464b19424e6095A26419
12934A33809f2516A01519a18930j04797G3806b46741A42259l6455a7513C9213
12923C39482A22070L47259b59419J12361B30087D0881a8075l3950C39021D8254
12912i3898h939G7137i2811m4867A19215J89372o0326a61095C69121e8153E0628
12900b38034B38300m0461L9716b08872o5917a30186B58064b5852A49322J47462
$$ y = [-154343, 213788, -52192, 187588, 157553, -79838, 56816, 29235, 6082, 88459, -5889, 249534, 49494, -56093, 278115, -25969, 101319, 205198, 175353, 148043, -398494, -208311, -106784, -178045, -10182, 134290, -147404, -230050, -300192, 25974, -118247, 93143, 398060, -29219, 56520, -58921, 13391, 145849, 57778, -120080, 103864, 102920, 515384, -219424, -56095, 126419, 133809, -62516, 101519, -118930, -223727, 73806, -246741, 142259, 105804, -17513, 39213, 339482, 122070, 469329, -259419, -147058, 230087, 40881, -18075, -52025, 339021, 48254, -93898, -8939, 77137, -92811, -137678, 119215, 308587, 248261, -161095, 369121, -58153, 50628, -238034, 238300, 197839, 237555, -208872, -274789, -130186, 258064, -25852, 149322, 296784]
12890B96784a782A87596M01173G5566J78927g9342C69114E8466J06220E6627N2839
12879A09466A0013J48338l1252j7545C3023O6305e8061A81117a5604A75011L50074
12868E25085F1159a22632A08454L2845f7227j39665N4319N8498D7107f3241k0811
12857h4052m3030A8578J02887J15635D0139a04371o7577C72934h1869i478H1366
12845b21172g092j9812r638A30511a23736L343j02983b0077A11276G070c0989
12833d7381p6464M5577B78079b68167L9837a4484j20088B06435l8703p9225a15971
12821a83073N9195A90166a43182b8989i626A45979e1390p0161D5957a22891a7761
12809A2641a56599E5537d8388k92733g6202B58297g7497k89145h3477A00172b42777
$$ y = [296784, -1782, 187596, 588769, 75566, 254493, -79342, 369114, 58466, 164686, 56627, 109466, 10013, 158351, 127099, 109554, 33023, 99328, -58061, 181117, -15604, 175011, 525085, 61159, -122632, 108454, 141299, -67227, -206892, -152573, -94075, 47107, -63241, -84052, -127082, 18578, 121465, 237100, 40139, -104371, -171948, 372934, -81869, -9478, 81366, -221172, -7092, -26904, -36542, 130511, -123736, -120393, -223376, -20077, 111276, 7070, -30989, -47381, -123845, -78268, 278079, -268167, -228330, -14484, -134572, 206435, 167732, 88507, -115971, -183073, -123878, 190166, -143182, -28989, -9626, 145979, -51390, -121551, 45957, -122891, -17761, 12641, -156599, 55537, -48388, -341121, -76202, 258297, -77497, -366642, -83477, 100172, -242777]
12797A36726a00947B49884l4161q7265c39824B11277n2723c23316A70905f3028
12786b07908j04084N3553c8948D42209e0731p1509B98855a50153l3753A29831
12775c436k02913a5399k6876H9362N0586c03412e0416D4443a62990j0428R09H8685
12762C18549d0590B03712J0663e4723a6734C67989A30194b07939j33647C37712
12751A36895g5979B40409j1824Q284d2922k80958a20173r5548j91820a9824A59700
12739a25244H953i7638M2589A13951a0j98730h1915I8901k7621a69141j008j4878
12727a85027N5738A5225e2116l8034C80833d857D1967R758N7710J0385A0328J78680
12715A89008C9680e29A07666G006f6117m76722A54124J14306a37308j64308A17104
$$ y = [136726, -100947, 249884, 215723, 128458, -339824, 211277, 158554, -323316, 170905, -63028, -207908, -311992, -258439, -38948, 442209, -50731, -122240, 298855, -150153, -183906, 129831, -3436, -206349, -15399, -42275, 89362, 139948, -303412, -50416, 44443, -162990, -173418, -172509, 88685, 318549, -40590, 203712, 214375, -54723, -16734, 367989, 130194, -207939, -341586, 337712, 136895, -75979, 240409, 228585, 236869, -42922, -323880, -120173, -215721, -407541, -19824, 159700, -125244, 8953, -97638, -55049, 113951, -10, -198740, -81915, 98901, 71280, -169141, -170149, -185027, -129289, 15225, -52116, -90150, 380833, -4857, 41967, 51725, 109435, 119820, 10328, 189008, 39680, -529, 107666, 7006, -66117, -542839, 154124, 268430, -137308, -301616, 117104]
12703A75999a12448J803c1885B29767Q5707F3050a77213B37234R8740I1525M000
12692I5525K15604j9838A606K49754O4653c20012F7937R6054d53480D10924n7109
12681C53815G5835a50219H5215b09432e8974A13050D3343E102a45372f4966p7177
12670a42143a1656C18432r3879b39453G2535a88504Q9995B26244a50392I9493
12659I065N03961B9896R7566J3953n223a25784j11346J16982B3953d038A67246
12647a8208C02658i0728B9973J91500b90052e2561C37049g143b008A34998a33882
12635c0236D6491L40121j37678a64700B58622b8967I5961C6506b4693j38005E4341
12623a09112A51906L0901E5642N5775J62502r9039H4774b84957B84333i232G7405
$$ y = [175999, -112448, -110645, -31885, 229767, 315474, 63050, -177213, 237234, 335974, 91525, 95525, 311129, 291291, 1606, 251360, 316013, -320012, 67937, 163991, -453480, 410924, 353815, 75835, -150219, 85215, -209432, -58974, 113050, 43343, 5102, -145372, -64966, -142143, -11656, 318432, 224553, -239453, 72535, -188504, -98509, 226244, -150392, 99493, 9065, 513026, 29896, 127462, 141415, 136192, -125784, -237130, -120148, 23953, -4038, 167246, -18208, 302658, -90728, 29973, 221473, -290052, -52561, 337049, -7143, -2008, 134998, -133882, -30236, 46491, 386612, 248934, -164700, 258622, -28967, 95961, 36506, -24693, -162698, 54341, -109112, 151906, 182807, 55642, 111417, 273919, 174880, 84774, -284957, 284333, -9232, 77405]
12611c9399C08293a8808e035D94443b2657B88839L1158c23251f8646A42181E2035
12599C8740b50005h5016J3291a7015g622A36180P4157a89748j41860A06229l0959
12588G5270l6850K34b33869I489b67123C77821r0831D7271A5721b21727E2878
12576B46789e2079F5452R8825J7636c17859D4763J89733g4061a2711l53828B28179
12564D08976b79909i1004C13412j26301O3955F882K24668k4112a59939A80347
12553A97747g2948A94160b73217A89308b10754B01772G7638J15017m6560d2808
12542A77562J25953r2077a13914A40350B7515P7049p706D5810g8458l1413j12270
12531b22141F9713g5718A60917K42364a48246f2162k67114b684j64089H8887B8151
$$ y = [-39399, 308293, -18808, -5035, 494443, -22657, 288839, 319997, -323251, -68646, 142181, 52035, 38740, -250005, -85016, -71725, -17015, -7622, 136180, 210337, -189748, -331608, 106229, 75270, 38420, 38654, -233869, 9489, -267123, 377821, 286990, 47271, 15721, -221727, 52878, 246789, -52079, 65452, 164277, 181913, -317859, 44763, 234496, -74061, -12711, -366539, 228179, 408976, -279909, -91004, 313412, 187111, 251066, 6882, 231550, 207438, -159939, 180347, 197747, -72948, 194160, -273217, 189308, -210754, 201772, 77638, 192655, 146095, -42808, 177562, 303515, 211438, -113914, 140350, 27515, 104564, 96858, 45810, -78458, -109871, -222141, 69713, -75718, 160917, 403281, -148246, -62162, -329276, -2684, -166773, 88887, 28151]
12519i8590j41270B93785b13119G780a37036j61231a44578c5389j09346B22191
12508b19533G7081K6730i2813J9606H6119M044m995l2036f970j47298G4261a81089
12495A35491a58444d5199J1552m7839I2341J10771L0193p3454a03483j83583g9728
12483B47936J17713A2862e5148p6620D2095R2969A8700a96427L950N917B64125
12471B63557b4319j26122J7489q5816h7865j50939J2145a7067B80247h6410C9017
12459b6882H5047b6664j39008q1054E713e5958A41966o9381J41016q3508g0496
12447B7674P5657a58424F2635j1895N081i4586G900b1997B60856B8739c53090
12435A72815a03734i984A30936b99328I0412l957a48051n1543j29289a52044q6244
$$ y = [-98590, -239860, 293785, -213119, 7780, -137036, -298267, -144578, -35389, -144735, 222191, -219533, 77081, 103811, -92813, -73207, 86119, 90163, 85168, 53132, -6970, -154268, 74261, -181089, 135491, -158444, -45199, -33647, -81486, 92341, 203112, 233305, 159851, -103483, -287066, -79728, 247936, 365649, 12862, -55148, -131768, 42095, 135064, 18700, -196427, -192477, -186560, 264125, 263557, -24319, -150441, -132952, -218768, -87865, -238804, -226659, -17067, 280247, -86410, 39017, -26882, 85047, -26664, -165672, -246726, 5713, -55958, 141966, 72585, 213601, 130093, -70496, 27674, 103331, -158424, 62635, 50740, 55821, -94586, 7900, -21997, 260856, 28739, -353090, 172815, -103734, -9984, 130936, -299328, 90412, 86455, -148051, -199594, -328883, -152044, -238288]
12424b38288N9192n998g7144b3825R933B97343G142O8020K82485f9132K4467A35188
12411A30763D2787a27928A01916b4743E3507a22432B14181A06635k1646l2189
12401E2800c3734j27270j7913D656L5601a64030k01481A34369a31999d2507A3818
12389a32804N0416L8950I1959l6499a03550j458A04975a99710E3930a26063q3659
12378b09722B92273J02051A00610C5083Q058J48931R3512p7278B7255q491M7312
12367F6076a89129A90499b74196C7283a9064A79283J58619L0441M9928j15993
12357C02278j26760c988j57956I0607a3023B15892a74318r412L1347G1208b19473
12345a19416e6694o77j37129K7385d6199E0469g6771E3374b26128j1535A74594
$$ y = [-238288, -179096, -185094, -77144, -23825, -13892, 297343, 7142, 75162, 357647, -69132, -44665, 135188, 130763, 42787, -127928, 101916, -24743, 53507, -122432, 214181, 106635, 84989, 52800, -33734, -161004, -178917, 4656, 40257, -164030, -365511, 134369, -131999, -42507, 13818, -132804, -82388, -43438, 91959, 55460, -103550, -105008, 104975, -199710, 53930, -126063, -209722, 292273, 394324, 100610, 35083, 43141, 192072, 285584, 208306, 27255, 18764, 66076, -189129, 190499, -274196, 37283, -19064, 179283, 337902, 368343, 418271, 302278, 175518, -3988, -161944, 90607, -13023, 215892, -174318, -183730, -152383, 71208, -219473, -119416, -56694, -57371, -194500, -167115, -46199, 50469, -76771, 53374, -226128, -237663, 174594]
12333b31268R4629O8173k6166j0633A53796F9802b02300a8573m8081j13330l5959
12322b15943J6674D39378O7121B02236a62083b6587B75923r214k9196K60224A13671
12310B83119h7915B76815a6284D39480m7180b3085C91936h6654B33301J68126
12300D01427B7372b0082D63646j18537b1912K63A05524J89662A44074D7386a52520
12288F4846J1898Q9743a6362D5334K35852f0351A62020p5716D0512a38472B4753
12276B07343C0109a19837A29753d1092E60851f1754b3834m5040k72512H5666d3151
12264C98546A51859a16989B56100r4098m6461J11155M1024l0521b0542B90620
12253h2316B51377e29141F13113C0415J50753j1427J3742H5111L13942a41439
$$ y = [-231268, -136639, -68466, -94632, -105265, 153796, 69802, -202300, -18573, -66654, -179984, -215943, -199269, 439378, 506499, 202236, -162083, -26587, 275923, 266709, 237513, 497737, 113671, 283119, -87915, 276815, -16284, 439480, 392300, -23085, 391936, -86654, 233301, 401427, 27372, -20082, 463646, 345109, -21912, -21649, 105524, 295186, 144074, 47386, -152520, 64846, 76744, 166487, -16362, 45334, 281186, -60351, 162020, 86304, 40512, -138472, 24753, 207343, 30109, -119837, 129753, -41092, 560851, -61754, -23834, -68874, -341386, 85666, -43151, 398546, 151859, -116989, 256100, 162002, 115541, 226696, 267720, 237199, -20542, 290620, -82316, 251377, -529141, 613113, 30415, 181168, 169741, 183483, 85111, 399053, -141439]
12242F23843B11472b84874C69865M3833j89806A3010N7741N9007j0452K76845
12232C96151A3291b4412A45867R0753h3779A60728b4676p7717L2384G4257J11067
12221A85324l4580j7963e0039A47317C8658E146b330H8864L41465j57677H4678
12209A10302J0531K89442R031p3544K98412I7433M65932B46681j8485j1918A5554
12197B94185k0605B2139a29613r0183A72730K3654n6028n9775L38080A11260Q8910
12186B00170G8653b89188A93993n6037J81094A30883K05397p9111k188p3273M23246
12175F04954B6007J3860J2509M10485A07806J52465a47286C60035b83491A92231
12164c932G2956h679A69433r786K50068A32650R3309k3581K2263q7090b93951
$$ y = [623843, 211472, -284874, 369865, 413698, 223892, 13010, 70751, 129758, 119306, 396151, 13291, -24412, 145867, 236620, -83779, 160728, -24676, -102393, -70009, 74257, 185324, 150744, 132781, -50039, 147317, 38658, 5146, -2330, 88864, 430329, 272652, 84678, 110302, 120833, 410275, 419306, 345762, 644174, 97433, 563365, 246681, 228196, 216278, 15554, 294185, 273580, 22139, -129613, -219796, 172730, 196384, 140356, 80581, 418661, 111260, 200170, 78653, -289188, 193993, 137956, 319050, 130883, 336280, 257169, 254981, 181708, 604954, 26007, 39867, 52376, 462861, 107806, 260271, -147286, 360035, -283491, 192231, -3932, 72956, -8679, 169433, 159647, 409715, 132650, 225959, 202378, 224641, 137551, -293951]
12152h1218q1283C7980K98984P6921K57018k98192A23669J52738L7199F0036b3679
12140B12101b0244o3890B80243j7632b2734A57013P1578e7401C5538a7463k17088
12129b34551A98241d8354o6124p2400A30459o3870J93507k4671I3877m1808g9295
12117g485C35902p1013k005n5650c2110C34719A10406g766A22800L26367j45328
12106C03839A04166e4312K3039B97332k2392a70606A20160L67588j85900o2065
12096B39783a03911k0111b6663H3769f2364I8955J71537M2919j5452A37411J51062
12085B88473K00984H868a17560j74389A70162m4986J09151C9330J55459d0649
12074C31963b89473N1961h1111B97967A10200C0439a0327G3180e8665C3187M67997
$$ y = [-81218, -162501, 37980, 336964, 413885, 670903, 372711, 123669, 276407, 313606, 60036, -23679, 212101, -20244, -84134, 280243, 262611, -22734, 157013, 228591, -57401, 35538, -17463, -234551, 198241, -48354, -114478, -186878, 130459, 66589, 260096, 235425, 93877, 52069, -79295, -7485, 335902, 264889, 262884, 207234, -32110, 334719, 110406, -7766, 122800, 449167, 303839, 104166, -54312, -31273, 297332, 274940, -170606, 120160, 487748, 301848, 239783, -103911, -124022, -26663, 83769, -62364, 98955, 270492, 313411, 297959, 137411, 288473, 489457, 8868, -117560, -291949, 170162, 125176, 234327, 39330, 194789, -40649, 331963, -289473, -237512, -81111, 297967, 110200, 30439, -10327, 73180, -58665, 33187, 501184]
12063E01184d2203a7924C55671j54008l1434L89884k43717a48107H3096R3161
12053A76257O8443j05667K36841m8328e4626l96979A87881h0653j51974A43072
12042A07657J21573p2165N2139G4252B6845g2221m7170A44232a83275b4698A73952
12030a2185j07270A16262n5208e3722A23035N3467q670a38617l27191a6046j03811
12019a19857A81924a18395a4719n9964E9680D314K10378b4300o010j09313m6701
12008a86324j08697C2062f6272l2397A89726q8532A6044O3037a01754B07194B363
11996C65710k3773h662k85297J29336a8529A2251K37820N3290D0787J3066J60078
11985B13931J06648A20269P851a30277F1592e7471B19224f3690D5542j497M5792
$$ y = [501184, -42203, -17924, 355671, 201663, 170229, 560113, 316396, -148107, 83096, 176257, 244700, 139033, 375874, 327546, -54626, -451605, 187881, -80653, -232627, 143072, 107657, 229230, 157065, 209204, 74252, 26845, -72221, -119391, 144232, -183275, -24698, 173952, -12185, -119455, 116262, 61054, -53722, 123035, 176502, 167832, -138617, -465808, -16046, -119857, 181924, -118395, -14719, -74683, 59680, 4314, 214692, -24300, -30310, -139623, -186324, -295021, 32062, -66272, -98669, 189726, 101194, 16044, 79081, -101754, 207194, 2363, 365710, 341937, -8662, -293959, -164623, -18529, 12251, 250071, 303361, 40787, 53853, 213931, 320579, 120269, 128120, -130277, 61592, -57471, 219224, -63690, 45542, 44045, 89837]
11974H9837a00579I8245f7234b1168B7867a7974A13243m6181a2798k24059b9957
11962A57569A0799O7355J06749R2284a74016A07895I640f3073C4661a11937k08624
11951c20561J59814J0028H1091b19397A95778e0030A3324a35744A15641a75062
11940a29545j3929c444j12929B13454d2075j37591B43588j9178b1736r658B8545
11928g987p6609A83669f7588j46303A82409J92537d26070A35158n4200N5802d5370
11916A56827a547n0607H7840J6654b40335h4816A34237k5106j5363a66D8216f8420
11903B06425d03112C7641a45234B47635A22224M1596b14462Q4572B05567O4532
11893B70099o0825b54662A56964b0828G764b65393A76899b04446b8662F8871a17278
$$ y = [89837, -100579, 98245, -67234, -21168, 27867, -17974, 113243, 67062, -12798, -236857, -29957, 157569, 10799, 78154, 184903, 277187, -174016, 107895, 9640, -63073, 34661, -111937, -320561, -160747, -150719, 81091, -219397, 195778, -50030, 13324, -135744, 115641, -175062, -129545, -143474, -3444, -116373, 213454, -42075, -179666, 243588, 224410, -21736, -31394, 28545, -7987, -84596, 183669, -67588, -213891, 182409, 374946, -426070, 135158, 80958, 136760, -45370, 156827, -1547, -52154, 87840, 104494, -240335, -84816, 134237, 109131, 93768, -166, 48216, -68420, 206425, -403112, 37641, -145234, 247635, 122224, 163820, -214462, -129890, 205567, 270099, 209274, -254662, 156964, -20828, 7764, -265393, 176899, -204446, -28662, 68871, -117278]
11881a36676D0047d690D0061a55094j03630A26402j3266M6246a79756A97403b18110
11869A34077a81384m6687g5912F5422a32630C47565b17405j73365M2819A40141
11858A5135J70955o360N9413d55764P2156B6729M718K76204H5032j2877a02348
11846h0703o4328B13840a73151B59645j3614A00295b30870e6495K4503j11957
11836a43949L7680j0604B7049c64923D2716j2682b07795A0774Q7904K31367F9551
11824B05035G0027l4901K81732F8513J14340a51546m4002m0532g482j24357o7179
11813a99018a4726p354G620c29103d5453F9000b78625D06931F0857G935c65146
11801A77625a01279o0543d0318B03786b05985b6079D9263a39121l7185L2825c2057
$$ y = [-136676, 40047, -4690, 40061, -155094, -258724, 126402, 113136, 159382, -179756, 197403, -218110, 134077, -181384, -228071, -75912, 65422, -132630, 347565, -217405, -390770, -347951, 140141, 15135, 186090, 179730, 239143, -455764, -383608, 26729, 31447, 307651, 85032, 72155, -102348, -80703, -145031, 213840, -173151, 259645, 246031, 100295, -230870, -56495, -31992, -143949, -106269, -116873, 27049, -364923, 42716, 30034, -207795, 10774, 98678, 330045, 69551, 205035, 70027, 35126, 316858, 68513, 182853, -151546, -195548, -236080, -7482, -131839, -199018, -14726, -22080, 7620, -329103, -45453, 69000, -278625, 406931, 60857, 7935, -365146, 177625, -101279, -161822, -40318, 203786, -205985, -26079, 49263, -139121, -176306, -143481, -32057]
11789c19403j03641B9281a64989o0057A34797b36990E0331j1196a65958A3799
11778A02444Q9029b68151E0074K96906a53916o8335Q8312C8553O2296q925m0448
11767E1476M9982b62006b6446j11143d2292P82j07342f4193B90966N3514j44462
11756B00018f1092A5948d685k05905B99188K0254g9415j11001C9002c65902J66210
11745a99692C4431K0835L4471B709N4146b53201L3355A35131b45461a03398j30853
11734b34251h4523a6915A10876P1635a17740o418l2721k18059a79048B03086a3491
11722B2373c0502I8899D2273J34357g4075m7646K7196E1279N902K01029p0321
11711A87889C4763N8415C0623M9696i2386J9062j99013A59016g6219H9243B0427
$$ y = [-319403, -423044, 29281, -164989, -225046, 134797, -236990, 50331, 39135, -165958, 13799, 102444, 191473, -268151, 50074, 346980, -153916, -222251, -133939, 38553, 100849, 91924, 51476, 101458, -262006, -26446, -137589, -42292, -41510, -148852, -64193, 290966, 344480, 200018, -61092, 15948, -4685, -210590, 299188, 319442, -79415, -190416, 39002, -365902, -199692, 34431, 55266, 89737, 2709, 56855, -253201, -219846, 135131, -245461, -103398, -234251, -84523, -16915, 110876, 182511, -117740, -124158, -156879, -374938, -179048, 203086, -13491, 22373, -30502, 98899, 42273, 176630, -74075, -121721, -94525, 51279, 57181, 258210, 187889, 34763, 93178, 30623, 80319, -92386, -73324, -272337, 159016, -76219, 89243, 20427]
11699f9250n0721C22975G0035b44770I2783l4163h0381G630e7234A50529j3986
11688A36543K9817R628B1209i5149j45349c6216A595c9443j9717A02209j732c47852
11675B26916b40631B34022j13215B5705J70241N7500j12810K62313b20241A19174
11664a80171A7538a37405j56081a10407A62946E6958i050C05554k23b5457E3213
11652H3920B7092b3489E7774b53633M0927A68661a98278l3555E8739j7726J17923
11641A58936c49098C38795a69966L4822D2402K49905a22119A52338a03205H3057
11630d5533a3681q2112B7056Q7238a65809O0962J3022C5508a07137d6683j39866
11619a86549j08012B41433B4704a52061B34243D9385A0328R0709C2825J82143
$$ y = [-69250, -119971, 322975, 70035, -244770, 92783, 58620, -80381, 7630, -57234, 150529, 136543, 166360, 175988, 21209, -95149, -240498, -36216, 1595, -39443, -59160, 102209, 100477, -347852, 226916, -240631, 234022, 120807, 25705, 195946, 253446, 140636, 402949, -220241, 119174, -180171, 17538, -137405, -293486, -110407, 162946, 56958, -9050, 305554, 305331, -25457, 53213, 83920, 27092, -23489, 57774, -253633, -212706, 168661, -198278, -231833, 58739, 41013, 158936, -349098, 338795, -169966, -135144, 42402, 292307, -122119, 152338, -103205, 83057, -45533, -13681, -95793, 27056, 114294, -165809, -104847, -91825, 35508, -107137, -46683, -186549, -294561, 241433, 24704, -152061, 234243, 49385, 10328, 101037, 32825, 214968]
11609B14968b47026g3759j93715J29248M6409k12145C46377q0553i1071I7962
11598g4888j41506a07467f857j96676D1931J59519a59644G188f0691h062l45866
11587c53928D1947J65380k8050B9397h5911k7248N3667G8424j8403c139A08489
11575d0121k28671J13588A03941Q9471a1888A01468J83866F9182J09033M1160
11565B19375D7470J08471K3835E6129a42569E5639k40L61243h8020m051C61457
11553E6695J10036a17077j10821B34122r1866M00570a81640A97863e2684B78157
11542G6965L3491L20129E1582J30749j5723i8985A85187M1050g0658m5023l2388
11531a48069A73204J35484A40849K14319C8470F392K17654b50963I8880Q3786
$$ y = [214968, -247026, -73759, -267474, -138226, -91817, -303962, 346377, 265824, -91071, 97962, -74888, -216394, -107467, -6857, -203533, 41931, 201450, -159644, 7188, -60691, -8062, -353928, 41947, 207327, 179277, 29397, -85911, -113159, -59492, 78424, 60021, -3139, 108489, -40121, -268792, -155204, 103941, 193412, -11888, 101468, 285334, 69182, 178215, 219375, 47470, 155941, 179776, 56129, -142569, 55639, 55399, 416642, -88020, -92071, 361457, 56695, 166731, -117077, -227898, 234122, 142256, 542826, -181640, 197863, -52684, 278157, 76965, 110456, 430585, 51582, 182331, 166608, -98985, 185187, 226237, -70658, -115681, -148069, 173204, 308688, 140849, 355168, 38470, 6392, 224046, -250963, 98880, 182666]
11521A82666J28379o0729j24906O8485a16564h181G0730O1657o3807K65723c05808
11509g5214D7944K96172j49848q2153a58571A41584D3488N6364K26347B6854J57439
11498A84293O4856j06915o4751a26075C42424e6272n8040A29426J5492n9102K73845
11487C59661G4910b051B41740a482A61277K1196H3625k0948L29240j89392h1874
11475C12338p9967R011P2054N1252G2869K28629a8287A58319J8628K03893j85593
11464A95247r3831L7477H682J79277J01096a03465A28660L4646B0497d6159A24531
11452g709B85460r8342A6537L68541d5704j94659D5541j6051a29783C45958b32507
11440a53290A31084c20473A7270e8335b2080A87049g2541j1114B32154b79003
$$ y = [182666, 311045, 250316, 125410, 193895, -116564, -8181, 70730, 132387, 68580, 334303, -305808, -75214, 47944, 344116, 194268, 112115, -158571, 141584, 43488, 99852, 326199, 26854, 184293, 249149, 142234, 77483, -126075, 342424, -56272, -114312, 129426, 144918, 85816, 359661, 74910, -2051, 241740, -1482, 161277, 182473, 83625, 62677, 391917, 202525, -81874, 312338, 232371, 241382, 313436, 364688, 72869, 301498, -18287, 158319, 176947, 380840, 195247, 101416, 138893, 8682, 187959, 289055, -103465, 128660, 163306, 20497, -46159, 124531, -7709, 285460, 187118, 16537, 385078, -45704, -240363, 45541, 29490, -129783, 345958, -232507, -153290, 131084, -320473, 17270, -58335, -22080, 187049, -72541, -83655, 232154, -279003]
11429a42002O0133A13893a61263k54843B17637a21226H9844K02925j34352a71410
11418g2241A90260r723A817O6686J5794J1940K44713h5668D6686M5823J7398l5410
11406G4497c4917j7956A2899b71544a4734A63236F9510c33847i3796F88a33912
11394C0408K41433A22585a33049F3932b5476p2142K4462o9368B35687c0470A78299
11382f1728J8479A81444e858A71580J28813j45000D6197b16161N4276A09113H947
11370b0940B08766b28042n1245B38519A10551J27109i6371f403B436a3835l40117
11359c53952B67397c1038j71059L7102l03800B36704A03694N3490b67616J09566
11349a58050O580O3493l15349a12568r2001p0233A3880c14348N6874j30897Q8311
$$ y = [-142002, -81869, 113893, -161263, -416106, 217637, -121226, 89844, 292769, 158417, -171410, -72241, 190260, 180537, 1817, 68503, 84297, 96237, 340950, -85668, 46686, 92509, 109907, 74497, -34917, -52873, 12899, -271544, -14734, 163236, 69510, -333847, -93796, 688, -133912, 30408, 271841, 122585, -133049, 63932, -25476, -97618, -73156, -142524, 235687, -30470, 178299, -61728, -43249, 181444, -5858, 171580, 300393, 155393, 46197, -216161, -161885, 109113, 8947, -20940, 208766, -228042, -279287, 238519, 110551, 237660, -96371, -6403, 2436, -13835, -353952, 267397, -31038, -202097, -164995, -468795, 236704, 103694, 157184, -267616, -158050, -151470, -87977, -403326, -112568, -204569, -274802, 13880, -314348, -257474, -388371, -300060]
11338c00060B01401K50555I2514a84652g9535m9544M9787L7639k12755J20644
11328a33764A18207a85588h0985a8995k5725B92002b84684A01155l6728b0668
11317b9440B19859r590d16208J23552i574F0425e5853K6611j39016C5576d4299
11305d54552K17949f8213B25965B1494J38147c9865B36374d43288a28091j06052
11295b34143D356a20977A94294b41628N9640e4935J2515f520o9171k22672a6768
11283i4577m1249p0935A14010b45666R1500J8110A22859B3878a47461D14232d9844
11271b38358c41j80584B61215g3419Q168j46134R8354C2613c1990k25582H6726
11259B40650q5998A1602M5485a58692C23389a8758o81A29539E1719J15949c50339
$$ y = [-300060, 201401, 451956, 92514, -184652, -79535, -129079, -79292, -41653, -254408, -133764, 118207, -185588, -80985, -18995, -44720, 292002, -284684, 101155, 64427, -20668, -29440, 219859, 210269, -416208, -292656, -9574, 60425, -55853, -29242, -168258, 35576, -44299, -454552, -236603, -68213, 225965, 21494, 159641, -39865, 236374, -443288, -128091, -234143, 4356, -120977, 194294, -241628, -181988, -54935, -42420, -6520, -75691, -298363, -16768, -94577, -135826, -206761, 114010, -245666, -154166, -136056, 122859, 23878, -147461, 414232, -49844, -238358, -341, -180925, 261215, -73419, -65251, -211385, -113031, 32613, -31990, -257572, 86726, 240650, 154652, 11602, 57087, -158692, 323389, -18758, -19439, 129539, 51719, 167668, -350339]
11247D5179a93712g9898A91806d65435i0367C83908b22633i4152l29222f4355
11236a2988D838a31553A04248a08048C16537a9205k26674R1296A01122a79555
11225B6467a76665A11302j6505J7621q885a10347E1412B2595a04013j28932f3946
11213C47194a4430B37133r7968C8668J54907a60617f314o8223j2272B00151A1989
11201C4007b70702r3167A9385H828L0906K475c56714A6410b44636e544A02791
11189c6419k42581a2998o7238A88474a43091A13145K67847A71799a64727M5188
11179a19539j18692A85346i4996A22178d0670A59314a04914d1857k7480A22544
11168e5846p9397C3051J94112h4597L5497r9569I6609a59626k25588a09909B3976
$$ y = [45179, -193712, -79898, 191806, -465435, -90367, 383908, -222633, -94152, -423374, -64355, -12988, 4838, -131553, 104248, -108048, 316537, -19205, -245879, -154583, 101122, -179555, 26467, -176665, 111302, 94797, 112418, 103533, -110347, 51412, 22595, -104013, -232945, -63946, 347194, -14430, 237133, 139165, 38668, 193575, -160617, -6314, -74537, -86809, 200151, 11989, 34007, -270702, -363869, 19385, 8828, 39734, 42209, -356714, 16410, -244636, -5544, 102791, -36419, -279000, -12998, -80236, 188474, -143091, 113145, 380992, 171799, -164727, -119539, -238231, 185346, -94996, 122178, -40670, 159314, -104914, -41857, -69337, 122544, -55846, -135243, 33051, 227163, -84597, -49100, -148669, 96609, -159626, -385214, -109909, 23976]
11156f1353j03495j37925b0513r569n0310n3785B46651e8052j03462O6898A38835
11144b34412e6904A25868c10760P259k8280K4216b074B96251d2095j4688A45067
11132a31292j53989C5912i8229q005C10298I3023b71427a2029k9935r2709k41776
11121c76449G1329c12537A58721c01545b7345k22624E3676R6700e0408A00712
11110h9341o0306d3496H7483J46470a45881J6451B3967a54926N023f368B74569
11098a10599A70096p7324c06823B30796j11369B7411M06943a02466C02404a63615
11087F9630J55633H648a27810A06986p35a70763A83900a47421A60945J30413M4140
11076C35498j27048f9423k23B79688L99901a39884C70483j25348R5873f2459a0017
$$ y = [-61353, -164848, -302773, -20513, -30082, -80392, -134177, 246651, -58052, -161514, -94616, 138835, -234412, -56904, 125868, -310760, -303501, -331781, -307565, -2074, 296251, -42095, -56783, 145067, -131292, -285281, 35912, -98229, -106234, 310298, 93023, -271427, -12029, -41964, -134673, -376449, 71329, -312537, 158721, -301545, -27345, -249969, 53676, 150376, -50408, 100712, -89341, -149647, -43496, 87483, 233953, -145881, -129430, 23967, -154926, -149903, -6368, 274569, -110599, 170096, 92772, -306823, 230796, 119427, 27411, 434354, -102466, 302404, -163615, 69630, 225263, 8648, -127810, 106986, 106251, -170763, 183900, -147421, 160945, 291358, 335498, 208450, -69423, -69646, 279688, 679589, -139884, 370483, 245135, 341008, -62459, -10017]
11064F80J44331m4446L08946A40130a91080A24210k8815B9997a37170A76940P5832
11053B52772K2045r061A24666n0123J55226r9720k6498L12948R4947o7610A44061
11041A77114J32405j19396L38755B19500L19875J56892k91108Q1460L261j27297
11031C62583J73568K0789q1642R969J63354k40781L01478j80332M789J94906K6402
11020G55083l42502l9249J22872J01707J89100A08087O09579k58645J12042j09263
11010D61800L33203K16447D16365K79810j63010k1170J3811J59851A89063K29606
11000D18669N0614l2939J75270j07555j99379L50570A74186L92030K44800k74535
10990E36481K5380J5046R1354m3436j12482K59049B68241O7939J43526k03996
$$ y = [680, 145011, 100565, 409511, 140130, -191080, 124210, 95395, 29997, -137170, 176940, 252772, 274817, 265756, 124666, 74543, 229769, 130049, 103551, 416499, 511446, 443836, 144061, 177114, 309519, 190123, 528878, 219500, 539375, 696267, 405159, 486619, 489880, 362583, 536151, 556940, 475298, 485267, 648621, 407840, 709318, 528986, 533775, 728681, 755083, 412581, 373332, 496204, 597911, 787011, 108087, 717666, 459021, 571063, 461800, 795003, 1011450, 416365, 696175, 533165, 511995, 525806, 685657, 189063, 418669, 469283, 436344, 611614, 504059, 304680, 655250, 174186, 566216, 811016, 536481, 561861, 576907, 668261, 624825, 512343, 771392, 268241, 336180, 479706, 275710]
10980B75710K51364B21741N78359C19892m3616K97199q2709Q3072m0533J08230
10970F41535K8417J55628n7968l21873K93718K87084m89512J01442L73988m6843
10960I65616p0431K79073n9422L75019J4396K42798M29371l5642O6855l19599
10950A888034M37103k12001k70019j1455m4476j87329r106J9409k51761m6695
10940A311704K23816J73400K2475j62840j14119J93172P1930r995k98979O8113
10930A478677m51034k33513o7835j59708J99739l05010j8504L76547C04266R5622
10920C99888g023A73745b67338A48632J2817e0052B54589a4623B63808K5611A40135
10908D1081a28950a6501q4012A70459f7513k5243F7797d916A1801Q5256l6033
$$ y = [275710, 527074, 221741, 800100, 319892, 276276, 573475, 490766, 573838, 533305, 641535, 669952, 825580, 767612, 445739, 739457, 1026541, 537029, 638471, 1012459, 965616, 895185, 1174258, 1114836, 1489855, 1504251, 1747049, 2176420, 2140778, 2207633, 1888034, 2325137, 2113136, 1843117, 1831662, 1787186, 1599857, 1590751, 1610160, 1358399, 1311704, 1535520, 1708920, 1731395, 1568555, 1454436, 1647608, 1719538, 1709543, 1410564, 1478677, 1027643, 794130, 726295, 566587, 766326, 461316, 442812, 819359, 304266, 399888, -7023, 173745, -267338, 148632, 161449, -50052, 254589, -14623, 263808, 289419, 140135, 41081, -128950, -16501, -100513, 170459, -67513, -92756, 67797, -4916, 11801, 97057, 61024]
10897F1024K59134b64703B08384i2504H48J01833g6233A64229j6211e3156e882
10885f3047I3313d2125l7740k339j47121h3612k11373E9809J62172D7604b26054
10873a67828A33151g2405n5338L5015B65673c3857P333D14353a13879B08452A1081
10861A92666K81263A5000J56014a03043A37511e9117k62248a37398j16813H2303
10850c27287B20147R642d24090a18035F9934M2704d2523J2682D6212h9020q2221
10839a71241c2782j94732d4614E0593a30869N4412A52553b02093g4960g920C42077
10827B34532b14123M1729p9576f158D3054J97160n5678D4185b95496J04545B10486
10815E9435J432R8947d2455I1127B7735L5922N7946a97424i4264k7364J4288D5002
$$ y = [61024, 320158, -264703, 208384, -92504, 848, 102681, -76233, 164229, 148018, -53156, -5882, -63047, 93313, -42125, -79865, -82204, -229325, -83612, -294985, 59809, 221981, 47604, -226054, -167828, 133151, -72405, -127743, -92728, 265673, -33857, -26524, 414353, -113879, 208452, 11081, 192666, 473929, 15000, 171014, -103043, 137511, -59117, -321365, -137398, -254211, 82303, -327287, 220147, 229789, -424090, -118035, 69934, 112638, -42523, -29841, 46212, -89020, -171241, -32782, -227514, -44614, 50593, -130869, -76457, 152553, -202093, -74960, -7920, 342077, 234532, -214123, -172394, -251970, -6158, 43054, 240214, 184536, 44185, -295496, -190951, 210486, 59435, 60867, 159814, -42455, 91127, 27735, 63657, 121603, -197424, -94264, -121628, -107340, 45002]
10802b34459k45559E8524b24547c4685r4204J9545H5142g6155j04582h268B31007
10790i8951j49336A23058i738A68015d6764k67259p0896I1446a39659e6640o5413
10779a22053K4619j1094A02873e4361l6960h357k0123A17401E1955a75806E7061
10767B88612g3264q0944g6203E7820J56007F1356b95781b1953j91248O388k4768
10756b31581E820O0607c05968F7607o664a05157m1160B0657e4029l62243a71391
10744D0115a49107B68830b29535N098P9074j27581B1418a97165B1707i5872p2937
10733a68809E2514c3179j18896e9924p0023c5747o3438p4717l6043a5128k17273
10722b32401F4295C0673K7224O482j0415a57713E4723B480d76003A98085a11034
$$ y = [-234459, -480018, 58524, -224547, -34685, -128889, -109344, 85142, -76155, -180737, -8268, 231007, -98951, -248287, 123058, -9738, 168015, -46764, -314023, -384919, 91446, -139659, -56640, -122053, -97434, -108528, 102873, -54361, -91321, -8357, -28480, 117401, 51955, -175806, 57061, 288612, -73264, -154208, -76203, 57820, 213827, 61356, -295781, -21953, -213201, -206813, -231581, 5820, 66427, -305968, 67607, 60943, -105157, -146317, 20657, -54029, -416272, -171391, 40115, -149107, 268830, -229535, -224437, -145363, -272944, 21418, -197165, 21707, -95872, -168809, 52514, -33179, -152075, -59924, -129947, -35747, -99185, -173902, -209945, -15128, -232401, 64295, 30673, 57897, 64379, 53964, -157713, 54723, 2480, -476003, 198085, -111034]
10710b34933j49322A72071a19415k4575A6581b85534J06554f9418j76328d4639
10699B9887J08731a93598m6649h0783m6371j33590j21630h2287H8315a15677k5970
10688a41647c1352A70942b85544M6458d5651p5070C58121A0475b29498A05655
10677d90711a17959A3575N180c96182h426g39k174q1462n6241G2714a79207K2293
10665a56914F295a96813e4816H7845f5130A73327a48006m428F2866b0272C2309
10653a66408j4907B30748H6899a40438M477j99599P5789k4064e6137C26176j53427
10642A72749c14124A1394K05893d95176J04228e6522j80140A8633a92706c3255
10631A53619j9059M0557c77757e2525k17616N9863M151F2933a3074D4879f9460
$$ y = [-234933, -384255, 172071, -119415, -143990, 16581, -285534, -178980, -69418, -245746, -44639, 29887, 138618, -193598, -240247, -80783, -127154, -260744, -382374, -82287, 88315, -115677, -141647, -31352, 170942, -285544, -239086, -45651, -120721, 358121, 10475, -229498, 105655, -490711, -117959, 13575, 18755, -396182, -8426, -739, -2913, -84375, -140616, 72714, -179207, -156914, 6295, -196813, -54816, 87845, -65130, 173327, -148006, -152434, 62866, -20272, 32309, -166408, -181315, 230748, 86899, -140438, -135961, -335560, -259771, -283835, -56137, 326176, 172749, -314124, 11394, 217287, -495176, -390948, -56522, -236662, 18633, -192706, -33255, 153619, 134560, 175117, -377757, -52525, -270141, -210278, -206127, 62933, -13074, 44879, -69460]
10619a99651b3844G1458M7215f210k20467e7698p7491f5472A5789a47078A37458
10607C95119c11582A4519K30144I8722g8849C9389p47L6550b8047j26614p4803
10596b29464j12402g7038m2183A17921d59m10277A577c502m7257j43486A02243
10584b7629A7013a36693m38919a84930A04503A1538L01585A44540R4318c51026
10573C0524a92572a9302j49414h1141m2519I6064a90751P3262A04602b96964J41249
10562a55715b1017B05327C6114J17224a01446A87756B1350b46793g8013j73249
10552b51262B0639F667R0276b9518j7379j34878A83912b90529c9500E1974J0567
10541F2541r590a21507A91687m2069d7867C297i0584A44738F8776b00601m8151
$$ y = [-199651, -23844, 71458, 118673, -6210, -226677, -57698, -135189, -65472, 15789, -147078, 137458, 395119, -311582, 14519, 244663, 98722, -78849, 39389, 38642, 75192, -28047, -154661, -229464, -341866, -77038, -119221, 117921, -459, -410736, 1577, -3502, -50759, -194245, 102243, -27629, 17013, -136693, -575612, -184930, 104503, 11538, 313123, 144540, 238858, -351026, 30524, -192572, -19302, -168716, -81141, -123660, 96064, -190751, -117489, 104602, -296964, -155715, -21017, 205327, 36114, 153338, -101446, 187756, 21350, -246793, -78013, -251262, 20639, 6667, 96943, -29518, -46897, -181775, 183912, -290529, -39500, 51974, 62541, 52951, -121507, 191687, 149618, -47867, 3297, -90584, 144738, 68776, -200601, -248752]
10530b48752g9075q8892h0939B5026g1271l16530M2653J67866A30710a72069B95168
10518d12576a89937d3311C96128A6161J31120c21589B4281i0219J6491D6296J33383
10507A79679b24843j68506J14056A8376M3852g3858m5223a5093A78648Q400B6583
10495i2072K9022A24463c54133a40847O9266B79114b4338B6421c6828D18325f1511
10483A83177b49855J21055A88253l2910g592H6396l4927g7501Q89b0747G2669
10471A5726e7897A7720o321k962p51P1471B6691P55K3321b05716g1599A66203
10458E03704r2484M9822l4229P3419E9772a50332A43673D0886J38491J67030A9818
10446b0456B99669E5681K31746e6100J273A60187d729k44672m5054P1724g3635
$$ y = [-248752, -79075, -167967, -80939, 25026, -71271, -387801, -345148, -177282, 130710, -172069, 295168, -412576, -189937, -43311, 396128, 16161, 147281, -321589, 24281, -90219, -73728, 46296, 179679, -224843, -393349, -279293, 18376, 62228, -73858, -119081, -15093, 178648, 187048, 26583, -92072, -63050, 124463, -354133, -140847, -71581, 279114, -24338, 26421, -36828, 418325, -61511, 183177, -249855, -128800, 188253, 155343, -7592, 86396, 51469, -77501, -76612, -20747, 72669, 15726, -57897, 17720, 11399, 8437, 7686, 79157, 26691, 27446, 50767, -205716, -71599, 166203, 503704, 411220, 461042, 426813, 500232, 59772, -150332, 143673, 40886, 179377, 346407, 19818, -20456, 299669, 55681, 287427, -56100, -54827, 160187, -4729, -249401, -294455, -222731, -73635]
10434a50825B031b78569A18676E0094e8434B70273a06229a1914r7926H6198L3188
10423A19386b45711J06749o4102B3983J57478N371p3864a29036j38585C5144J03262
10412A38406a96689K1844D1550d5081j84323e2661J0590k30723j09618C21669
10401h316k9750j04510B4000a19228N3625A72498F5701I447b82657A66897b52551
10389c7100j25810g1511H0823a17224D4858K2557Q684a91635B96143A00259J67265
10378B67524j27664a58571H4358A2084K60043J50487c87635C26732N0990g7996
10367B17849a71847A06816a02279A4179J40599f0673C47712A2843J11009D1227
10356a17004E4803J45306e1254D21438q6231O97A8805K03251M91202B75741J59287
$$ y = [-150825, 2031, -278569, 118676, 50094, -58434, 270273, -106229, -11914, -109840, 86198, 119386, -245711, -138962, -203064, 23983, 181461, 186832, 112968, -129036, -267621, 35144, 138406, -196689, -174845, 41550, -45081, -229404, -52661, -42071, -272794, -382412, 321669, -8316, -38066, -142576, 24000, -119228, -65603, 172498, 65701, 9447, -282657, 166897, -252551, -37100, -162910, -71511, 80823, -117224, 44858, 67415, 76099, -191635, 296143, 100259, 267524, 139860, -158571, 84358, 12084, 272127, 422614, -387635, 326732, 377722, -77996, 217849, -171847, 106816, -102279, 14179, 154778, -60673, 347712, 12843, 123852, 41227, -117004, 54803, 200109, -51254, 421438, 335207, 335904, 18805, 222056, 713258, 275741, 435028]
10345D35028b91239C1688L53640H2736L55744j68826A14025J82623R740n8674
10335B47714K39948m5940I6537a7663C02823O6246q3882p3222J12860J66259A50232
10323B45132J02121o4998j35048d9877A93681G8343J7469D2980b37053C14955
10312D13789D5813Q6399g3804C04931c89047A37438N9738n0585a65479c5793A648
10300F9450a72896I6918a05382a3295l8511A97270a21252j41895R2133a2504j28611
10289a41115B33827a00A96220a05407D3389n192a78646h1503j05071B1683f7053
10277a94999c9176A9375K3001a21826E1752b6712k44736c2779B35662a1488o418
10266a7906k06735R8790n7084h1857k3998N1809B87645a82990G3282c4256A13666
$$ y = [435028, -291239, 31688, 385328, 82736, 438480, 269654, 114025, 296648, 306388, 247714, 487662, 441722, 96537, -17663, 302823, 369069, 285187, 211965, 324825, 491084, 150232, 245132, 347253, 282255, 147207, -49877, 193681, 78343, 95812, 42980, -237053, 314955, 413789, 45813, 132212, -73804, 304931, -389047, 137438, 197176, 146591, -165479, -35793, 1648, 69450, -172896, 96918, -105382, -13295, -51806, 197270, -121252, -263147, -171014, -12504, -141115, 233827, -100, 196220, -105407, 43389, 38197, -178646, -81503, -186574, 21683, -67053, -194999, -39176, 19375, 42376, -121826, 51752, -26712, -271448, -32779, 235662, -11488, -17906, -224641, -125851, -182935, -81857, -105855, -54046, 287645, -182990, 73282, -34256, 113666]
10254C2222K84165c52679h1144r8477m093E0523N2274a84993j12981a36928H7775
10242D6329g9562E4030B1830L50065b8791j83207B37147K03931I8286K61494A50464
10230B1045a02807B29161a32676q6036Q2222D6478h423o8918B15011a23188q6885
10219b10073c4233B5064d78339a33124H4604K20005A41546a80452e7707c578B2234
10207c9206A5277b245m18980e6347j58152A33524a88092j19067Q1204A04923e4715
10195b78140H4373J27125f9548A52881f3966A64085k7801a27384i652A51842c20672
10183g6512K9804B19258a09317F2377O8627b4807j02544A405K87551a29724A44024
10171H7238i3589b5896B2189N5817a85587A27267b40179c2531A29219b35097k1523
$$ y = [32222, 316387, -352679, -81144, -179621, -183714, 50523, 102797, -184993, -297974, -136928, 87775, 46329, -79562, 54030, 21830, 371895, -28791, -211998, 237147, 441078, 98286, 359780, 150464, 21045, -102807, 229161, -132676, -218712, -136490, 46478, -8423, -77341, 215011, -123188, -210073, -34233, 25064, -478339, -133124, 84604, 304609, 141546, -180452, -57707, -3578, 22234, -39206, 15277, -2245, -421225, -56347, -214499, 133524, -188092, -307159, -225955, 104923, -54715, -278140, 84373, 211498, -69548, 152881, -63966, 164085, 136284, -127384, -9652, 151842, -320672, -76512, -46708, 219258, -109317, 62377, 131004, -24807, -127351, 1405, 288956, -129724, 144024, 87238, -93589, -25896, 22189, 78006, -185587, 127267, -240179, -32531, 129219, -235097, -256620]
10160b56620K5860j1305l7440R3938O6245B9628d0091k05798D2745c40825a37275
10148c42765c4453G1960c25790a09708j69067c5094k56790h7786F7079B0716a36334
10136b08868E0549b23005E2067k5494a97176D2103b72116a04760B33922d9696
10125H0662B6600a92619B60060b57685H836a86728N401K0891A01648L7314a69315
10113b02514c0696k52081D2817e9589m6502F9552p277a71057b7988C5343e8802
10101b08037A53059b72059M813a1411m2218b531k54864A97979k9763b04868A31435
10089a93683D2616c4975j08016L322M3278b5295F5204K22968a09716B11477c11737
10077A15974b35136n7642J23490K7747r7547E4185j3039a40896B35768f8172j80942
$$ y = [-256620, -230760, -242065, -279505, -185567, -119322, 29628, -40091, -245889, 42745, -340825, -137275, -342765, -34453, 71960, -325790, -109708, -278775, -35094, -291884, -87786, 67079, 20716, -136334, -208868, 50549, -223005, 52067, 26573, -197176, 42103, -272116, -104760, 233922, -49696, 80662, 26600, -192619, 260060, -257685, 8836, -186728, -181327, -160436, 101648, 138962, -169315, -202514, -30696, -282777, 42817, -59589, -106091, 69552, 62275, -171057, -27988, 35343, -58802, -208037, 153059, -272059, -267246, -11411, -53629, -2531, -257395, 197979, 168216, -204868, 131435, -193683, 42616, -34975, -142991, -139669, -96391, -25295, 65204, 288172, -109716, 211477, -311737, 115974, -235136, -292778, -169288, -141541, -239088, 54185, 41146, -140896, 235768, -68172, -249114]
10066b49114P3997N8222a2467j74468A47824a76215j75475e1225o0882L102A45144
10054b0180k37537O5282j23310d1996p0651B53463j11059a69706A12828c6029
10043c65400P7765B25420b81561G8423a06820n8413O3794C4195b71318R186P3145
10032a88987i0268c2021l8506l4565r7587L3759L0183K1987B14759k0828H4120
10020b12749H0671j4429B3212b32719N398I5066a17201k12202K1836A852L27675
10009C29527c24809A26939a98387A19891d07459A78857G1183l0254c5470m8334
9999h3804r969C7743J16860d84371K33458O3591j90726E2126j7249e0341j71700
9988b22041J04423H7870c45065A19817a14255N1302C04736j20244d07006a27496
$$ y = [-249114, -175117, -116895, -12467, -186935, 147824, -176215, -351690, -51225, -112107, -109005, 145144, -20180, -257717, -192435, -315745, -41996, -112647, 253463, 142404, -169706, 112828, -36029, -365400, -287635, 225420, -281561, 78423, -106820, -165233, -101439, 34195, -271318, -262132, -188987, -90268, -32021, -70527, -105092, -202679, -168920, -138737, -116750, 214759, 193931, 84120, -212749, 80671, 66242, 23212, -232719, -227321, 95066, -117201, -329403, -307567, 1852, 329527, -324809, 126939, -198387, 119891, -407459, 178857, 71183, 40929, -35470, -83804, -93773, 37743, 154603, -484371, -250913, -187322, -378048, 52126, 34877, -50341, -222041, -117618, 87870, -345065, 119817, -114255, -62953, 304736, 184492, -407006, -127496]
9977e9478q6231f630F0693a81435A33447b4769F2779g033C58953a40834C69156
9965a02382c2560D05600a88106I442c09684J22563q3186B79084F2704J2298i6366
9953b30249n5863B60229c268k2138A2554h7807r2092B2417b20287G1049a99057
9941a70694C67204I1793J30599c4643k87567Q4342b7761n2610l30217a17268c8212
9929F591f8777A14574b38798B790b89892M2270F4442c5945o9341b5838r8525k5726
9917a50089G6739J97532H3349a89855I8056a43978B7315J79168a6421n1514K2770
9906d5165j09620B70575e9845F210a87318b0896A64645M4180b6601j09799C97746
9894a38291f4650I2493a7299k81359e0268n0008J5987F2879B3961a60046k4967
$$ y = [-59478, -145709, -6630, 60693, -181435, 133447, -24769, 62779, -7033, 358953, -140834, 369156, -102382, -32560, 405600, -188106, 9442, -309684, -187121, -270307, 279084, 62704, 75002, -96366, -230249, -286112, 260229, -3268, -25406, 12554, -87807, -179899, 22417, -220287, 71049, -199057, -170694, 367204, 91793, 222392, -34643, -322210, -237868, -27761, -80371, -410588, -117268, -38212, 6591, -68777, 114574, -238798, 2790, -289892, -247622, 64442, -35945, -105286, -25838, -124363, -150089, 76739, 274271, 83349, -189855, 98056, -143978, 27315, 206483, -16421, -67935, -45165, -154785, 270575, -59845, 6210, -187318, -20896, 164645, 208825, -26601, -136400, 397746, -138291, -64650, 92493, -17299, -298658, -50268, -100276, -84289, 62879, 23961, -160046, -185013]
9883a85013j55736a25204q2841R7659l7125j18100a31098m8114B42593c20350
9872a59046A32543a02727e38j21387I4098h0005A54809d07759a49938p4820Q6978
9861a37780H497J6450e0033K675c55l38632A46355K1574B7255b25208I0053J78738
9849B68791C274a00050p3746J3296k07115a69047I5760c2459j13430p8258h651
9837B91819a22130G9649a23800e3638j4154A19611b42341C0709a47230f8928k28214
9826b97142f0762A46995K6203a71854g7782l75667A1850a11575m404j11477I0383
9814d50795a6440j80316A53412a27918d6413p6143k0940E9496N6097c9369r5943
9803a35312n3745F9327M4019P072b27221J1352J02943p6281C7707b76379B54446
$$ y = [-185013, -340749, -125204, -208045, -110386, -147511, -265611, -131098, -179212, 242593, -320350, -159046, 132543, -102727, -538, -121925, 94098, -80005, 154809, -407759, -149938, -224758, -137780, 8497, 24947, -50033, -47358, -355, -338987, 146355, 167929, 27255, -225208, 90053, 268791, 3274, -100050, -173796, -160500, -367615, -169047, 95760, -32459, -145889, -224147, -8651, 291819, -122130, 79649, -123800, -53638, -67792, 119611, -242341, 30709, -147230, -68928, -297142, -60762, 146995, 173198, -171854, -77782, -453449, 11850, -111575, -115979, -227456, 90383, -450795, -16440, -196756, 153412, -127918, -46413, -122556, -143496, 59496, 115593, -39369, -135312, -189057, 69327, 113346, 120418, -227221, -215869, -112926, -189207, 37707, -276379, 254446]
9791E7019f7187F339a71525B41474i6662E9982a29362J9244c8013m7236j4142
9780i9391G8721a63042q2283R6220D7883a01425j25889d6904I8063a74423F2223
9768a43555n198k10652a61998F2699a59854A38703d1175F1354a7846k68056I5283
9756b5114k85443J17469A82490c52720Q6729A0167h1729A34844m9304a13081F4406
9744b67583O6423j01572G5457a8952I7228d7304k50944A9833h2234j24964B9989
9732a91176k312H8829a1025A4236a62311A32991K2333a46147q5639g6423A40386
9720a80803a3437k19088a06494M0741B8889J28680B6684a05550r8257n1678k205
9709b57690a16976j06224C7177e0293j93337A49461D917J5417R8613b07878A01786
$$ y = [57019, -67187, 6339, -171525, 241474, -96662, 59982, -129362, -110118, -38013, -85249, -99391, 78721, -163042, -245325, -149105, 47883, -101425, -227314, -46904, 98063, -174423, 62223, -143555, -148753, -359405, -161998, 62699, -159854, 138703, -41175, 61354, -17846, -285902, 95283, -25114, -310557, -193088, 182490, -352720, -265991, 10167, -81729, 134844, 85540, -113081, 64406, -267583, -201160, -302732, 75457, -18952, 97228, -47304, -298248, 19833, -82234, -207198, 29989, -191176, -193488, 88829, -11025, 14236, -162311, 132991, 155324, -146147, -231786, -76423, 140386, -180803, -13437, -232525, -106494, -65753, 28889, 157569, 26684, -105550, -203807, -255485, -257690, -116976, -223200, 37177, -50293, -243630, 149461, 4917, 20334, 118947, -207878, 101786]
9697b2166D68343b13792A71377a60154q6823h3800a9156j65127N9528l6843d4848
9685B62545o4021c02190a7750n1342E7569e7482j82049B5236b81497N3585R2647
9674a35265b2209A11085a36122A4123D156L4636a89848F4317a70445j14291j0963
9663b95699o9965i6879G8784a99924L4413K9697B07575h5664l44788J90024N4417
9652a86011K5471g2998C7404b3368n1129A84422P7017c48484a64576C7097o650
9641C0447b44415J6324C3361a4154H6281a46141N5905A33664C888J4932b62973
9629a17019A05151K16800c5771k54228B01813e1265q4169J9570p6632l191F7361
9617f7205j60339k01863J02118a59026n5575B7618b19989g4669j95067F8071K61332
$$ y = [-22166, 468343, -213792, 171377, -160154, -246977, -83800, -19156, -184283, -124755, -161598, -44848, 262545, 198524, -302190, -17750, -69092, 57569, -57482, -239531, 25236, -281497, -227912, -135265, -22209, 111085, -136122, 14123, 4156, 38792, -189848, 64317, -170445, -284736, -295699, -365664, -96879, 78784, -199924, -165511, -135814, 207575, -85664, -430452, -240428, -186011, -160540, -72998, 37404, -23368, -74497, 184422, 261439, -348484, -164576, 37097, 30447, -244415, -228091, 33361, -14154, 86281, -146141, -90236, 133664, 3888, 18820, -262973, -117019, 105151, 321951, -35771, -289999, 201813, -51265, -135434, -115864, -192496, -195687, 67361, -67205, -227544, -429407, -327289, -159026, -214601, 27618, -219989, -74669, -269736, 68071, 329403]
9606C29403A8598a83017A59308e5332K2259l7581H443M8484c5628k32011N3278
9595b14361F2729b0181B06198i849j78456e7616C6044c3146r6744j4610j30590
9584b75090B41555a28123g89I3824K7834R9570A329c43001G4914a3091k5719C0329
9571F2984Q3964a31358l9358k99682B44144i1401m27814B55868q0197K6903J29290
9560C31864a2042k02380p5343f6485A34003l469a21840k14703J34576p2969a32163
9548d00493i5399n874H6501a94178B7151K0384O1413b11433E0503D26R2860c01350
9535i5195A34346J19016j11019b05935j08563a27722k3812k11464L0341a23670
9524b11784r6432e8974i43j24930o6296I138P4790b04468m4261N6168i4039m35912
$$ y = [329403, 18598, -183017, 159308, -55332, -33073, -70654, 8443, 56927, -35628, -267639, -214361, 62729, -20181, 206198, -9849, -188305, -57616, 36044, -33146, -129890, -144500, -275090, 241555, -128123, -789, 93824, 121658, 221228, 1329, -343001, 74914, -13091, -38810, 30329, 62984, 146948, -131358, -170716, -470398, 244144, -91401, -519215, 255868, 175671, 202574, 331864, -12042, -214422, -289765, -66485, 134003, 130534, -121840, -336543, -201967, -274936, -132163, -400493, -95399, -101273, 86501, -194178, 27151, 47535, 108948, -211433, 50503, 426, 93286, -301350, -95195, 134346, 253362, 142343, -205935, -314498, -127722, -151534, -362998, -332657, -123670, -211784, -308216, -58974, -943, -125873, -192169, 9138, 83928, -204468, -248729, -192561, -94039, -529951]
9512e29951a56954A04192c18281A19884a15907H0232a53285A32826i4949a086
9501f5481j6584R998j13528c016j94386a0B47157e4186A59770b61865F5181L4266
9489I9447A8859a70975j3115A11717l3832b81346A9002b21393D6163a99983g6934
9477f3464B51225a28527k93715b05638c5406B08305a01809A43451D6549L0645
9467G7194d8499A74834f2756B34692c44544A21527j291a6266k75791C6172b12017
9455E0842f6823j16147c0911p6489k7835n6722d8644G242O0458B6451R505b44701
9442a23045a0878I3231J0198a79992H789J14762a26237L2097K0996r716j04397
9431a87257k404q5743O5124A75350g6240j20624A69161a99813m8018A25768b30896
$$ y = [-529951, -156954, 104192, -318281, 119884, -115907, 80232, -153285, 132826, -94949, -1086, -65481, -82065, -72067, -185595, -3016, -197402, -10, 247157, -54186, 159770, -261865, 65181, 99447, 18859, -170975, -184090, 111717, 77885, -281346, 19002, -221393, 46163, -199983, -76934, -63464, 251225, -128527, -422242, -205638, -35406, 208305, -101809, 143451, 46549, 77194, -48499, 174834, -62756, 234692, -344544, 121527, 120236, -16266, -292057, 36172, -212017, 50842, -66823, -182970, -30911, -107400, -135235, -191957, -48644, 7242, 67700, 26451, 35956, -244701, -123045, -10878, 93231, 103429, -179992, 8789, 123551, -126237, -94140, -73144, -82860, -187257, -189661, -275404, -210280, 175350, -76240, -196864, 169161, -199813, -247831, 125768, -230896]
9419d0672k1977m937j36167E3472J39608o7378c17776h3528m2713M31l37429C0202
9406a68746k63751G1217L6843a0753m09010B43403a82782a0325B9769d8358j32000
9395a80358N0610A64739D9139L46518g7987o1082O0501j12057k41758a30965B6507
9383a45777k67761A71418D7732a22826A9139h2038n7890l4603A3323g8197B44552
9371B25456d21868a06513A34992a15992j9464B06524a96044E0617c32778q7098
9361d19876c5725k18494F0593J25150b59440P0465R1564B42554i8531H6892c93653
9349b53870B00134A5386a87299B0755R09O6580a44011D8267N2435e6135j92151
9338b48286A1444N2974b13018h2324o9530r4427B43122I0198j9743i2109E9745
$$ y = [-40672, -62649, -67586, -203753, 53472, 193080, 125702, -317776, -83528, -126241, -125810, -463239, 30202, -168746, -432497, 71217, 108060, -10753, -419763, 243403, -182782, -10325, 29769, -48358, -180358, -129748, 164739, 49139, 395657, -77987, -139069, -78568, -190625, -432383, -130965, 26507, -145777, -413538, 171418, 47732, -122826, 19139, -82038, -139928, -174531, 13323, -78197, 244552, 225456, -421868, -106513, 134992, -115992, -135456, 206524, -196044, 50617, -332778, -419876, -35725, -254219, 60593, 185743, -259440, -188975, -97411, 242554, -98531, 86892, -393653, -253870, 200134, 15386, -187299, 20755, 21664, 88244, -144011, 48267, 100702, -56135, -248286, 11444, 64418, -213018, -82324, -151854, -246281, 243122, 90198, 70455, -92109, 59745]
9326a17508C7054J22242D8772N6408i9449j8194A36837b52158R4722b3966G8534
9314A78395o4894D442b0272j30528I4547j7630a27992K3637C26894d0150j99136
9303b39286B19490a77580A67659b12499j58370A15937f5113m967p7879j28455
9293b76414J8893a14964p7709L2812B2281c79050a06870F2638Q6126c2735C9486
9281e1040q5612P493c0439a4877l20179i1858B3342b01860h7157k29237f9728
9269B28310a85258P9103K6505d386E186g8060F651N1459a68297k0109A20744a70419
9256g4003B18119F9470a65383B95279A26705c89815a53721j5156n6708j23632
9246c49217B44304r5552m4678a46281j50557O6139e9932I9335K7945a83476d765
$$ y = [-117508, 37054, 159296, 48772, 105180, -99449, -117643, 136837, -252158, -157436, -23966, 78534, 178395, 113501, 4442, -20272, -150800, 94547, 76917, -127992, -104355, 326894, -40150, -239286, 219490, -177580, 167659, -212499, -370869, 115937, -65113, -70080, -147959, -276414, -257521, -114964, -192673, -159861, 22281, -379050, -106870, 62638, 148764, -32735, 39486, -51040, -136652, -129159, -30439, -14877, -335056, -91858, 23342, -201860, -87157, -316394, -69728, 228310, -185258, -106155, -79650, -4386, 5186, -78060, 6651, 58110, -168297, -188406, 120744, -170419, -74003, 218119, 69470, -165383, 295279, 126705, -389815, -153721, -168877, -225585, -349217, 244304, 148752, 104074, -146281, -296838, -230699, -59932, 99335, 127280, -183476, -4765]
9234b60851A03275C6986a05499i919k86248A08625a93336a1640p5332i086A04065
9222h4464A5105c76232A67103R051b2278j64699e375G8238d8752A00213b5639
9210C5650P2934b04400q565a01128B0356M4665O2326a17471k11598a04389c4875
9198c11244A57061A0330b61015L1976Q9845N263f1074a9413B31745a12543k6560
9187a39103j36248F5244A8331c08803C3091b43179a00809A493g4236j575A66981
9175f1391A4272b3863E9856J3798O7550K5729p0590a55226I7290a04765q2725
9164a87490G19i9021n2206g2720j26678j31915b1324e249A26374i0208j61155
9153b51363H8535k0665a60881l7454b7959k00266H4920a47283b365l29896J63442
$$ y = [-260851, 103275, 36986, -105499, -9919, -296167, 108625, -193336, -11640, -86972, -9086, 104065, -84464, 15105, -376232, 167103, 176154, -22278, -186977, -5375, 78238, -48752, 100213, -25639, 35650, 108584, -204400, -212965, -101128, 20356, 65021, 127347, -117471, -329069, -104389, -34875, -311244, 157061, 10330, -261015, -229039, -139194, -133931, -61074, -19413, 231745, -112543, -139103, -275351, 65244, 18331, -308803, 33091, -243179, -100809, 1493, -74236, -75811, 166981, -61391, 14272, -23863, 59856, 73654, 141204, 166933, 96343, -155226, 97290, -104765, -187490, 719, -99021, -151227, -72720, -199398, -331313, -21324, -5249, 126374, -90208, -251363, 88535, 67870, -160881, -198335, -27959, -228225, 84920, -147283, -2365, -332261, -168819]
9142a68819A23706f1318A75465d20118A25118c45567a28489c4975A82759l6437
9132A46322b70205A67101E6689A9109a19381J6330a6500k02484B99875n1896C5425
9120A88921B0321c38193c2641J1794B1392P8127a01637A78568c5895A59666E4275
9108A18807b58860b3981n4880l05759J49667d8721j1670j28582m7302C1725c0038
9096D4199R330J38307c3827A48865c4902c469j09167B6897a42430j19085P8974
9085a82541j10234b6075l42752P1868k5638f4826r5028C1896d5722a2964k00404
9074b13368B0953h799j75892E216L9303i6437j85049A66287a5786r5146K7690
9063h3242B3496a13289M5188l83795B70335A33140f9511A37809R4812c8283C37181
$$ y = [-168819, 123706, -61318, 175465, -420118, 125118, -345567, -128489, -34975, 182759, 146322, -270205, 167101, 56689, 19109, -119381, -103051, -16500, -218984, 299875, 247979, 35425, 188921, 20321, -338193, -32641, -20847, 21392, 99519, -101637, 178568, -35895, 159666, 54275, 118807, -258860, -23981, -78861, -384620, -234953, -48721, -60391, -188973, -236275, 31725, -30038, 44199, 53529, 191836, -33827, 148865, -34902, -3469, -112636, 26897, -142430, -261515, -182541, -292775, -26075, -368827, -296959, -322597, -64826, -159854, 31896, -45722, -12964, -213368, 20953, -8799, -184691, 5216, 44519, -96437, -281486, 166287, -15786, -110932, -83242, 23496, -113289, -68101, -451896, 270335, 133140, -69511, 137809, 232621, -38283, 337181]
9051h9634p9865m3156g5213C44361B7602b32212d843j99152A48756a05000d0708
9039B16865M3566a79900j33461A93177d967k35613F9634h9040J4469j45313j15001
9028c34885B39660R9760E1348b07052A28313A4207d19845A06017I144d2456o2411
9017a04867c5732D3193B033c73413i4596B21243I6114a1224p8036k235A01024
9005F2977c8449H4780a03159p7364J6525d9847H8104L1304a92040A26586a34875
8993A02871J19722b57774I2267H06J53319b2568q6032B11710B0117G594J8499
8982B6093a84803o2225k946A43485a19113C22053b62801F9121P1893a59056A06252
8970b93561j5091e8827A81311b93039J27911F499d71661J54276a53721D381a53872
$$ y = [-89634, -169499, -212655, -75213, 344361, 27602, -232212, -4843, -203995, 148756, -105000, -40708, 216865, 260431, -179900, -313361, 193177, -4967, -240580, 69634, -89040, -74571, -219884, -334885, 239660, 339420, 51348, -207052, 128313, 14207, -419845, 106017, 9144, -42456, -104867, -35732, 43193, 2033, -373413, -94596, 221243, 96114, -11224, -89260, -91495, 101024, 62977, -38449, 84780, -103159, -180523, -163998, -49847, 88104, 119408, -192040, 126586, -134875, 102871, 222593, -257774, 92267, 806, 154125, -22568, -108600, 211710, 20117, 7594, 26093, -184803, -247028, -249974, 143485, -119113, 322053, -262801, 69121, 141014, -159056, 106252, -293561, -308652, -58827, 181311, -293039, -165128, 6499, -471661, -317385, -153721, 4381, -153872]
8958e9688j78173C3219J42400b0578k31656J8443i6973C7169J16912c21344D7190
8946A1864b23996A63732A4359a46471D04b45154J10572n188B01683i2628K3206
8935f9422k42029A80634F1575b5045n7399A04486g8094G4428a79697H775a74326
8923b25752R2665a6616B1474J79419K93573A05053K93039A29449a25129A14755
8912B21300k0943g4634A88123O2548A13372M65403K59997K84925J255459M023065
8902F402221j616276j728874q78069o28082G27802j20377j79782j97788D9908
8892B78477a79910C97817j1944A5953K37180D426a73550q037O5337l04730B9619
8880c39249b1702r7659l4996G8175K7489b3294A67380a13917B67060c31180J09945
$$ y = [-59688, -237861, 33219, 175619, -20578, -252234, -233791, -96973, 37169, 154081, -321344, 47190, 11864, -223996, 163732, 14359, -146471, 404, -245154, -134582, -139770, 201683, -92628, -69422, -311451, 180634, 61575, -25045, -82444, 104486, -78094, 74428, -179697, 8775, -174326, -225752, -133087, -16616, 21474, 200893, 494466, 105053, 398092, 129449, -125129, 114755, 221300, 200357, -74634, 188123, 250671, 113372, 578775, 838772, 1123697, 2379156, 6402221, 4785945, 3057071, 2179002, 1550920, 727802, 607425, 427643, 229855, 49908, 278477, -179910, 397817, 385873, 15953, 253133, 4426, -173550, -181587, -116250, -420980, 29619, -339249, -21702, -119361, -154357, 78175, 105664, -23294, 167380, -113917, 267060, -331180, -221235]
8869b21235I1735a72356g2045I915a59625G8383C1012g1620A71713e39021h6492
8857i9709h632B04213a09588l0372K31C1175c3207m6466q0299A80443b13264F3070
8844b74622H3057a6296p7279j54902j1798D6091a85168B04154B8104f8282j06550
8833a74832A10934d8013G7774d2623F1285J6473d82552B38213A16174b04045k0255
$$ y = [-221235, 91735, -172356, -72045, 9915, -159625, 78383, 31012, -71620, 171713, -539021, -86492, -99709, -8632, 204213, -109588, -139960, -139729, 31175, -33207, -79673, -159972, 180443, -213264, 63070, -274622, 83057, -16296, -93575, -248477, -260275, 46091, -185168, 204154, 28104, -68282, -174832, 110934, -48013, 77774, -42623, 61285, 77758, -482552, 238213, 116174, -204045, -224300]
$$ [...]
##END NTUPLES=NMR SPECTRUM
##END=
