
##TITLE=AC1187_Casanare-tamara2_5898548_FrpgbTuwfZ
##JCAMPDX= 6.0         $$ Bruker NMR JCAMP-DX V2.0
##DATA TYPE= NMR SPECTRUM
##DATA CLASS= NTUPLES
##ORIGIN= BRUKER
##OWNER= Administrator
$$ 1.72 TOPSPIN		Version 2.1
$$ 2012-04-03 20:11:34.328 -0500  Administrator@TOPSPIN
$$ Compression mode = diff/dup
##.OBSERVE FREQUENCY= 400.13188235
##.OBSERVE NUCLEUS= ^1H
##.ACQUISITION MODE= SIMULTANEOUS (DQD)
##.ACQUISITION SCHEME= undefined
##.AVERAGES= 64
##.DIGITISER RES= 22
##SPECTROMETER/DATA SYSTEM= spect
##.PULSE SEQUENCE= noesygpps1d.comp
##.SOLVENT NAME= COFFEE_meoh
##.SHIFT REFERENCE= INTERNAL, COFFEE_meoh, 1, 14.96864
##AUDIT TRAIL= $$ (NUMBER, WHEN, WHO, WHERE, PROCESS, VERSION, WHAT)
$$ ##TITLE= Audit trail, TOPSPIN		Version 2.1
$$ ##JCAMPDX= 5.01
$$ ##ORIGIN= Bruker BioSpin GmbH
$$ ##OWNER= Administrator
$$ $$ C:\Bruker\TOPSPIN/data/COFFEE/nmr/AC1187_Casanare-tamara2_5898548_FrpgbTuwfZ/12/pdata/1/auditp.txt
$$ ##AUDIT TRAIL=  $$ (NUMBER, WHEN, WHO, WHERE, PROCESS, VERSION, WHAT)
(   1,<2012-04-03 20:11:29.484 -0500>,<Administrator>,<TOPSPIN>,<go>,<TOPSPIN 2.1>,
      <created by zg
	started at 2012-04-03 19:59:57.828 -0500,
	POWCHK enabled, PULCHK disabled,
       configuration hash MD5:
       1A 1E CE 29 27 FD 77 03 67 4E F0 E3 C4 B2 CB 90
       data hash MD5: 64K
       A7 C7 A4 E7 29 BE DA A9 52 6A E6 24 E5 C1 6D 55>)
(   2,<2012-04-03 20:11:32.359 -0500>,<Administrator>,<TOPSPIN>,<proc1d>,<TOPSPIN 2.1>,
      <Start of raw data processing
       efp LB = 0.3 FT_mod = 6 PKNL = 1 PHC0 = 0 PHC1 = 0 SI = 128K 
       data hash MD5: 128K
       FA E6 7B 9A 38 A5 A2 37 37 24 9F EA BB 05 B5 DA>)
(   3,<2012-04-03 20:11:33.546 -0500>,<Administrator>,<TOPSPIN>,<proc1d>,<TOPSPIN 2.1>,
      <pk PHC0 = 35.84839 PHC1 = 0 
       data hash MD5: 128K
       AC CD 0F BA FE 2D 00 1D 94 9A AF B1 9C E7 04 59>)
(   4,<2012-04-03 20:11:33.781 -0500>,<Administrator>,<TOPSPIN>,<proc1d>,<TOPSPIN 2.1>,
      <abs ABSG = 1 
       data hash MD5: 128K
       57 E9 AB 18 C7 16 E0 05 9A 86 03 F1 16 2B 38 7E>)
(   5,<2012-04-03 20:11:33.859 -0500>,<Administrator>,<TOPSPIN>,<proc1d>,<TOPSPIN 2.1>,
      <abs ABSG = 2 
       data hash MD5: 128K
       CF 2F CD 0A 5D FD A1 99 65 EE 17 A5 20 73 B4 2C>)
(   6,<2012-04-03 20:11:33.906 -0500>,<Administrator>,<TOPSPIN>,<proc1d>,<TOPSPIN 2.1>,
      <abs ABSG = 3 
       data hash MD5: 128K
       E8 D9 AE C6 09 DF 2A 59 4E 6A 47 ED 6F 59 40 0E>)
(   7,<2012-04-03 20:11:34.125 -0500>,<Administrator>,<TOPSPIN>,<proc1d>,<TOPSPIN 2.1>,
      <abs ABSG = 4 
       data hash MD5: 128K
       16 80 3C 59 A3 AF F9 D2 24 EC A4 98 76 98 46 28>)
(   8,<2012-04-03 20:11:34.234 -0500>,<Administrator>,<TOPSPIN>,<proc1d>,<TOPSPIN 2.1>,
      <abs ABSG = 5 
       data hash MD5: 128K
       A9 9F 6A 56 AE 31 5E F3 F2 B9 CD BC 50 E0 D0 EA>)
$$ ##END=
$$ 
$$ $$ hash MD5
$$ $$ E6 03 4C 7E 87 AA AE 19 CF 9E 69 46 5F 85 69 28
##$RELAX= 
##$RELAX= 
##$RELAX= 
##$RELAX= 
##$RELAX= 
##$RELAX= 
##$RELAX= 
##$RELAX= 
$$ [...]
##$TP07= 0
##$TPNAME0= <>
##$TPNAME1= <>
##$TPNAME2= <>
##$TPNAME3= <>
##$TPNAME4= <>
##$TPNAME5= <>
##$TPNAME6= <>
##$TPNAME7= <>
##$TPOAL= (0..7)
0.5 0.5 0.5 0.5 0.5 0.5 0.5 0.5
##$TPOFFS= (0..7)
0 0 0 0 0 0 0 0
##$TUNHIN= 0
##$TUNHOUT= 0
##$TUNXOUT= 0
##$USERA1= <user>
##$USERA2= <user>
##$USERA3= <user>
##$USERA4= <user>
##$USERA5= <user>
##$V9= 5
##$VALIST= <valist>
##$VCLIST= <CCCCCCCCCCCCCCC>
##$VD= 0
##$VDLIST= <DDDDDDDDDDDDDDD>
##$VPLIST= <PPPPPPPPPPPPPPP>
##$VTLIST= <TTTTTTTTTTTTTTT>
##$WBST= 2048
##$WBSW= 25
##$XGAIN= (0..3)
0 0 0 0
##$XL= 0
##$YL= 0
##$YMAX_a= 14024920
##$YMIN_a= -6280898
##$ZGOPTNS= <>
##$ZL1= 120
##$ZL2= 120
##$ZL3= 120
##$ZL4= 120
##$ABSF1= 14.96864
##$ABSF2= -5.58389
##$ABSG= 5
##$ABSL= 3
##$ALPHA= 0
##$AQORDER= 0
##$ASSFAC= 0
##$ASSFACI= 0
##$ASSFACX= 0
##$ASSWID= 0
##$AUNMP= <proc_prof1d_extract.lims>
##$AXLEFT= 0
##$AXNAME= <>
##$AXNUC= <1H>
##$AXRIGHT= 0
##$AXTYPE= 0
##$AXUNIT= <>
##$AZFE= 0.1
##$AZFW= 0.1
##$BCFW= 0
##$BC_mod= 0
##$BYTORDP= 0
##$COROFFS= 0
##$CY= 15
##$DATMOD= 1
##$DC= 0
##$DFILT= <>
##$DTYPP= 0
##$F1P= 0
##$F2P= 0
##$FCOR= 0.5
##$FTSIZE= 131072
##$FT_mod= 6
##$GAMMA= 0
##$GB= 0
##$INTBC= 1
##$INTSCL= 1
##$ISEN= 128
##$LB= 0.3
##$LEV0= 0
##$LPBIN= 0
##$MAXI= 10000
##$MC2= 0
##$MEAN= 0
##$ME_mod= 0
##$MI= 0
##$NCOEF= 0
##$NC_proc= -3
##$NLEV= 6
##$NOISF1= 0
##$NOISF2= 0
##$NSP= 0
##$NTH_PI= 0
##$NZP= 0
##$OFFSET= 14.96864
##$PC= 1
##$PHC0= 35.84839
##$PHC1= 0
##$PH_mod= 1
##$PKNL= yes
##$PPARMOD= 0
##$PPDIAG= 0
##$PPIPTYP= 0
##$PPMPNUM= 2147483647
##$PPRESOL= 1
##$PSCAL= 4
##$PSIGN= 0
##$PYNMP= <proc.py>
##$REVERSE= no
##$SF= 400.13000479153
##$SI= 131072
##$SIGF1= 0
##$SIGF2= 0
##$SINO= 400
##$SIOLD= 131072
##$SPECTYP= <>
##$SREGLST= <1H.CDCl3>
##$SSB= 0
##$STSI= 131072
##$STSR= 0
##$SW_p= 8223.68421052632
##$SYMM= 0
##$S_DEV= 0
##$TDeff= 65536
##$TDoff= 0
##$TI= <>
##$TILT= no
##$TM1= 0
##$TM2= 0
##$TOPLEV= 0
##$USERP1= <user>
##$USERP2= <user>
##$USERP3= <user>
##$USERP4= <user>
##$USERP5= <user>
##$WDW= 1
##$XDIM= 131072
##$YMAX_p= 461854182
##$YMIN_p= -413874972
##$CURPLOT= <Network HP LaserJet P1505>
##$CURPRIN= <$Network HP LaserJet P1505>
##$DFORMAT= <normdp>
##$LAYOUT= <+/1D_H.xwp>
##$LFORMAT= <normlp>
##$PFORMAT= <normpl>
##$SURQMSG= 1
$$ End of Bruker specific parameters
$$ ---------------------------------
##NTUPLES= NMR SPECTRUM
##VAR_NAME=  FREQUENCY,     SPECTRUM/REAL,   SPECTRUM/IMAG
##SYMBOL=    X,             R,               I
##VAR_TYPE=  INDEPENDENT,   DEPENDENT,       DEPENDENT
##VAR_FORM=  AFFN,          ASDF,            ASDF
##VAR_DIM=   131072,        131072,          131072
##UNITS=     HZ,            ARBITRARY UNITS, ARBITRARY UNITS
##FACTOR=    0.0627417313425165, 1,          1
##FIRST=     8223.62146879498, -615,         -95558
##LAST=      0,             978,             -97228
##MIN=       0,             -413874972,      0
##MAX=       8223.62146879498, 461854182,    0
$$ Real data points
##PAGE= N=1
##DATA TABLE= (X++(R..R)), XYDATA
$$ [...]
60681A690719Q870O649M889L971L212K055N64r77k450l931n522p064q022q051
60667A684912p759q318j0088j2108j3341j3901j4514j5220j5215j3844j1286q481
60655A540837o653o476p201p186n881m791n490p204p800p048p181r618j2624j3387
60641A432297j1406q571o611n816n786n939n320l274o46Q24O50J39M74J407K362
60626A384784L534M911N282L680J231M3K95j24k824o960j0611j3050j4815j6260
60612A339116j7116j7294j7153j6798j5757j3789j1567j0129r676r329q265o820
60600A185423o062o354o871o815o544o978q043q442p118m430j696O8P45R14J330
60585A119127K304L240L037J252j243l024l343k379o24J449L254M190M111L417
$$ y = [1690719, 1699589, 1706238, 1711127, 1715098, 1718310, 1720365, 1720929, 1719952, 1717502, 1713571, 1708049, 1700985, 1692963, 1684912, 1677153, 1668835, 1658747, 1646639, 1633298, 1619397, 1604883, 1589663, 1574448, 1560604, 1549318, 1540837, 1534184, 1527708, 1520507, 1513321, 1507440, 1502649, 1497159, 1489955, 1482155, 1475107, 1467926, 1458308, 1445684, 1432297, 1420891, 1412320, 1405709, 1399893, 1394107, 1388168, 1382848, 1379574, 1378928, 1379752, 1380402, 1380541, 1381015, 1382422, 1384784, 1388318, 1393229, 1398511, 1402191, 1403422, 1403465, 1403760, 1403636, 1400812, 1393852, 1383241, 1370191, 1355376, 1339116, 1322000, 1304706, 1287553, 1270755, 1254998, 1241209, 1229642, 1219513, 1209837, 1200508, 1192243, 1185423, 1179361, 1173007, 1166136, 1159321, 1152777, 1145799, 1137756, 1129314, 1122196, 1117766, 1116070, 1116138, 1116883, 1117797, 1119127, 1121431, 1124671, 1127708, 1128960, 1127717, 1124693, 1121350, 1118971, 1118347, 1119796, 1123050, 1127240, 1131351, 1134768]
60571A134768K635K176K509M083O738R431J1010J1398J1709J3055J5419J7874
60559A242805J9824K1508K3171K4348K4549K4394K5080K6676K7806K7513K6520
60548A514194K5864K5160K3414K1065J9581J8903J6899J2127N903O69k817n486
60536A675476p957r919j1336j2809j4546j5970j6609j6570j5898j4458j2751j1875
60524A514778j2050j2008j0642q650p672q099q697q272o952n746n461o122p001
60511A407406p200o631o317p033p769o470k605J868M719N840O642P720Q423Q557
60497A407150R074J0524J2113J3166J4553J7239J9968K0247J7895J5932J7098
60486A574959K0720K4287K7001L0054L3954L7601M0328M3137M7122N1838N6171
$$ y = [1134768, 1137403, 1139579, 1142088, 1146171, 1152909, 1162340, 1173350, 1184748, 1196457, 1209512, 1224931, 1242805, 1262629, 1284137, 1307308, 1331656, 1356205, 1380599, 1405679, 1432355, 1460161, 1487674, 1514194, 1540058, 1565218, 1588632, 1609697, 1629278, 1648181, 1665080, 1677207, 1683110, 1683779, 1680962, 1675476, 1667519, 1657600, 1646264, 1633455, 1618909, 1602939, 1586330, 1569760, 1553862, 1539404, 1526653, 1514778, 1502728, 1490720, 1480078, 1471428, 1463756, 1455657, 1446960, 1438688, 1431736, 1425990, 1420529, 1414407, 1407406, 1400206, 1393575, 1387258, 1380225, 1372456, 1365986, 1363381, 1365249, 1369968, 1375808, 1382450, 1390170, 1398593, 1407150, 1416224, 1426748, 1438861, 1452027, 1466580, 1483819, 1503787, 1524034, 1541929, 1557861, 1574959, 1595679, 1619966, 1646967, 1677021, 1710975, 1748576, 1788904, 1832041, 1879163, 1931001, 1987172]
60475A987172N9673O2009O1880N7880N0138M0038K8539J5921L107p979j5938k1031
60463B321409k4322k6218k6417k4965k2607j9893j6360j1111m331K225O757R364
60451B163531J1874J5689K0387K4680K8105L1281L5018L9804M5780N2701O0125
60440B528975O8034P7004Q7470R9405J13023J28956J47052J65960J84971K05440
60430C806290K28953K54577K79666L03204L26561L50597L73568L92293M03485
60421F719194M02930L84946L44829K81916J99829J04531L094r6526j86450k60638
60411G897655l15833l51479l69441l73528l68197l57098l42676l26705l10534
60402D782164k94854k79559k63980k47425k29848k12135j95357j79589j63984
$$ y = [1987172, 2046845, 2108854, 2170734, 2228614, 2278752, 2318790, 2347329, 2363250, 2366357, 2358378, 2342440, 2321409, 2297087, 2270869, 2244452, 2219487, 2196880, 2176987, 2160627, 2149516, 2145185, 2147410, 2154167, 2163531, 2175405, 2191094, 2211481, 2236161, 2264266, 2295547, 2330565, 2370369, 2416149, 2468850, 2528975, 2597009, 2674013, 2761483, 2860888, 2973911, 3102867, 3249919, 3415879, 3600850, 3806290, 4035243, 4289820, 4569486, 4872690, 5199251, 5549848, 5923416, 6315709, 6719194, 7122124, 7507070, 7851899, 8133815, 8333644, 8438175, 8441269, 8344743, 8158293, 7897655, 7581822, 7230343, 6860902, 6487374, 6119177, 5762079, 5419403, 5092698, 4782164, 4487310, 4207751, 3943771, 3696346, 3466498, 3254363, 3059006, 2879417, 2715433]
60393B715433j48221j33268j20292j09367r9749r0901q2709p5023o7751o1184
60383A726968n5696n1247m7596m4712m2483m0315l7581l4415l1457k8881k6222
60372A286363k3196k0191j7761j5960j4386j2760j1263j0225r495q392o627n027
60360A131080m702n403n423l530m73J914K627K103J328J121J889L446M923N404
60346A136304M789L867L532M034M822N027M347L658M347O718R364J0549J0007
60333A211365Q902Q222P677O360M198K478K637M501O133N907M363L276L108K568
60319A281695R19n87l54J220K140J146j077k812k788j026J210K423K272J859K407
60304A288647L952N524O194N772M889M632N537O805P193O715O622P467Q431Q968
$$ y = [2715433, 2567212, 2433944, 2313652, 2204285, 2104536, 2013635, 1930926, 1855903, 1788152, 1726968, 1671272, 1620025, 1572429, 1527717, 1485234, 1444919, 1407338, 1372923, 1341466, 1312585, 1286363, 1263167, 1242976, 1225215, 1209255, 1194869, 1182109, 1170846, 1160621, 1151126, 1142734, 1136107, 1131080, 1126378, 1120975, 1115552, 1112022, 1111549, 1113463, 1116090, 1118193, 1119521, 1120642, 1122531, 1125977, 1130900, 1136304, 1141093, 1144960, 1148492, 1152526, 1157348, 1162375, 1166722, 1170380, 1174727, 1181445, 1190809, 1201358, 1211365, 1220267, 1228489, 1236166, 1242526, 1246724, 1249202, 1251839, 1256340, 1262473, 1268380, 1272743, 1276019, 1279127, 1281695, 1282614, 1282027, 1281673, 1282893, 1285033, 1286179, 1285102, 1282290, 1279502, 1278476, 1279686, 1282109, 1284381, 1286240, 1288647, 1292599, 1298123, 1304317, 1310089, 1314978, 1319610, 1325147, 1331952, 1339145, 1345860, 1352482, 1359949, 1368380, 1377348]
60290A377348R748J1298J2926J4011J5031J6225J6504J5231J3879J4151J5308
60279A531660J5265J3685J2028J0918R544P686O309N912N997O517Q265J1311J4458
60266A659555J6655J7841J8172J7763J7293J7356J6969J4225Q857K743k451o669
60254A798309j0116j2293j3091j3343j3503j3180j2666j3297j5200j6300j4897
60243A650423j2023r893r113q787q373p922p299o438n838n617m867l081j347p50
60229A559075m97P73K487K897J987J678K949M600N258N171N363O211P616R634
60215A615202J2306J5265J7954J9895K0764K0846K1385K3623K7276L0741L3052
60204A858309L4839L7080L9792M2566M5721M9971N5181O0230O4380O8325P3506
$$ y = [1377348, 1387096, 1398394, 1411320, 1425331, 1440362, 1456587, 1473091, 1488322, 1502201, 1516352, 1531660, 1546925, 1560610, 1572638, 1583556, 1593100, 1600786, 1607095, 1613007, 1619004, 1625521, 1633786, 1645097, 1659555, 1676210, 1694051, 1712223, 1729986, 1747279, 1764635, 1781604, 1795829, 1804686, 1807429, 1804978, 1798309, 1788193, 1775900, 1762809, 1749466, 1735963, 1722783, 1710117, 1696820, 1681620, 1665320, 1650423, 1638400, 1628507, 1619394, 1610607, 1602234, 1594312, 1587013, 1580575, 1574737, 1569120, 1564253, 1561172, 1559825, 1559075, 1558578, 1559351, 1561838, 1564735, 1566722, 1568400, 1571349, 1575949, 1581207, 1586378, 1591741, 1597952, 1605568, 1615202, 1627508, 1642773, 1660727, 1680622, 1701386, 1722232, 1743617, 1767240, 1794516, 1825257, 1858309, 1893148, 1930228, 1970020, 2012586, 2058307, 2108278, 2163459, 2223689, 2288069, 2356394, 2429900]
60193B429900Q0409Q7945R4837J01290J08543J16860J25033J32472J40655J51147
60183C569091J62747J72171J77749J81060J84421J87773J88839J85619J77990
60174E187460J67288J55089J42192J28302J12667R5297P7374O0289M4512K9526
60164F199996J4669o2j3520k3674k8965k9792k8215k5688k1630j4699m947O187
60152F029660J7740L0052M3693N8445P3731Q9383J05453J21609J37009J50462
60142F857237J60616J66550J68518J67641J64346J57662J46545J31409J13587
60133H234111R3698P1504M7236K2062k751k6285m7574o5878q1528r5211j06074
60122H043310j11897j12015j08657j04181r7939q7608p2939n6334l9739k2741
$$ y = [2429900, 2510309, 2598254, 2693091, 2794381, 2902924, 3019784, 3144817, 3277289, 3417944, 3569091, 3731838, 3904009, 4081758, 4262818, 4447239, 4635012, 4823851, 5009470, 5187460, 5354748, 5509837, 5652029, 5780331, 5892998, 5988295, 6065669, 6125958, 6170470, 6199996, 6214665, 6214603, 6201083, 6177409, 6148444, 6118652, 6090437, 6064749, 6043119, 6028420, 6023473, 6029660, 6047400, 6077452, 6121145, 6179590, 6253321, 6342704, 6448157, 6569766, 6706775, 6857237, 7017853, 7184403, 7352921, 7520562, 7684908, 7842570, 7989115, 8120524, 8234111, 8327809, 8399313, 8446549, 8468611, 8465860, 8439575, 8392001, 8326123, 8244595, 8149384, 8043310, 7931413, 7819398, 7710741, 7606560, 7508621, 7421013, 7348074, 7291740, 7252001, 7229260]
60112G229260m205J5598L5275N3677P0289Q4745R6503J04746J08618J08016J03958
60101H006480R7430Q8175P5734O1422M7718L5527K3707J1916K093l915o565o868
60089H432854l715M977J8946L5518N2842P1573R2933J16769J42170J69004J97760
60078I331631K28563K61060K95103L30838L68106M06132M43817M80045N13554
60069A2658849N42660N65572N81374N90450N93281N88727N74293N48526N12586
60060A7756318M68882M18712L61958K98659K29874J57027Q1228L687p3588j47906
60050A9554851k16782k78747l33181l79056m14064m35826m44360m42566m33620
60041A6176649m18381l95933l66085l30402k91173k50282k08833j66961j24073
$$ y = [7229260, 7225055, 7240653, 7275928, 7329605, 7399894, 7484639, 7581142, 7685888, 7794506, 7902522, 8006480, 8103910, 8192085, 8267819, 8329241, 8376959, 8412486, 8436193, 8448109, 8450202, 8446287, 8439722, 8432854, 8429139, 8434116, 8453062, 8488580, 8541422, 8612995, 8705928, 8822697, 8964867, 9133871, 9331631, 9560194, 9821254, 10116357, 10447195, 10815301, 11221433, 11665250, 12145295, 12658849, 13201509, 13767081, 14348455, 14938905, 15532186, 16120913, 16695206, 17243732, 17756318, 18225200, 18643912, 19005870, 19304529, 19534403, 19691430, 19772658, 19776345, 19702757, 19554851, 19338069, 19059322, 18726141, 18347085, 17933021, 17497195, 17052835, 16610269, 16176649, 15758268, 15362335, 14996250, 14665848, 14374675, 14124393, 13915560, 13748599, 13624526]
60032A3624526q0217l7241K063L5844O3529Q4579R8018J03221J00259Q9426P1467
60021A4155474M8421K3026l171l0245n8136q5675j11963j37521j62984j87447
60011A3449779k09237k27743k43273k55452k63139k66102k65625k62981k57963
60002A1198264k49345k36300k19049j98632j76519j53949j31121j07147q1149
59993I645053n3349k4710M242L3521O2525Q9432J12378J30948J45784J56723J62102
59982A0464649J60372J51872J38346J21043J00010P5272M7742J8499j2104m3790
59972A1221911p5186j04130j29309j50775j68651j82064j89996j92629j90990
59963I838181j85609j76448j64215j50510j36027j19531r9622p7007n3927l1478
$$ y = [13624526, 13544309, 13507068, 13509131, 13544975, 13608504, 13693083, 13791101, 13894322, 13994581, 14084007, 14155474, 14203895, 14226921, 14223750, 14193505, 14135369, 14049694, 13937731, 13800210, 13637226, 13449779, 13240542, 13012799, 12769526, 12514074, 12250935, 11984833, 11719208, 11456227, 11198264, 10948919, 10712619, 10493570, 10294938, 10118419, 9964470, 9833349, 9726202, 9645053, 9591704, 9566994, 9571236, 9604757, 9667282, 9756714, 9869092, 10000040, 10145824, 10302547, 10464649, 10625021, 10776893, 10915239, 11036282, 11136292, 11211564, 11259306, 11277805, 11265701, 11221911, 11146725, 11042595, 10913286, 10762511, 10593860, 10411796, 10221800, 10029171, 9838181, 9652572, 9476124, 9311909, 9161399, 9025372, 8905841, 8806219, 8729212, 8675285, 8643807]
59953H643807q558J6409M3712P2574J01985J30743J57489J81586K03515K23520
59943I766782K40092K50466K52717K46869K34217K16066J93068J65355J33251
59934A1698883R8112O2077K6568q628m4038p8538j09577j35362j55878j71493
59924A1182126j81581j85359j83422j77405j68166j55104j37649j16839r4894
59915I781707p3330n1874k9277m968K0295M5122O8537R0248J10127J27693J42138
59904A0226418J52773J59454J62520J62448J59562J54080J46181J35968J23734
59895A1583138J10533R8216Q8384Q1352P6630P4372P5770Q1949R3102J08944J29470
59884A2601860J54816J84760K18835K56655K97768L41404L86658M32648M78078
$$ y = [8643807, 8635249, 8651658, 8695370, 8767944, 8869929, 9000672, 9158161, 9339747, 9543262, 9766782, 10006874, 10257340, 10510057, 10756926, 10991143, 11207209, 11400277, 11565632, 11698883, 11796995, 11859072, 11885640, 11877012, 11832974, 11754436, 11644859, 11509497, 11353619, 11182126, 11000545, 10815186, 10631764, 10454359, 10286193, 10131089, 9993440, 9876601, 9781707, 9708377, 9656503, 9627226, 9622258, 9642553, 9687675, 9756212, 9846460, 9956587, 10084280, 10226418, 10379191, 10538645, 10701165, 10863613, 11023175, 11177255, 11323436, 11459404, 11583138, 11693671, 11791887, 11880271, 11961623, 12038253, 12112625, 12188395, 12270344, 12363446, 12472390, 12601860, 12756676, 12941436, 13160271, 13416926, 13714694, 14056098, 14442756, 14875404, 15353482]
59875A5353482N20924N58873N89805O11318O19971O11810N84071N36343M70055
59866B0456652L87113K89394J79690O3018n3610j63292k61324l45203m13266m64362
59856A9674810m98938n19344n28337n27759n18844n02805m80296m50984m14902
59847A5232601l74069l31644k89205k45642j99062j49456r9055n0267l702M1439
59837A3531938Q4946J24096J55221J76631J89067J93108J87196J68892J37371
59828A4948466R3953M0976j8950q2971j48191k11679k69977l19544l58709l88581
59818A3284793m10988m26183m33679m34517m30858m23560m11938l95994l77079
59809I539997l56101l32989l08577k85039k63260k41338k17383j92681j70410
$$ y = [15353482, 15874406, 16433279, 17023084, 17634402, 18254373, 18866183, 19450254, 19986597, 20456652, 20843765, 21133159, 21312849, 21375867, 21322257, 21158965, 20897641, 20552438, 20139172, 19674810, 19175872, 18656528, 18128191, 17600432, 17081588, 16578783, 16098487, 15647503, 15232601, 14858532, 14526888, 14237683, 13992041, 13792979, 13643523, 13544468, 13494201, 13490499, 13531938, 13616884, 13740980, 13896201, 14072832, 14261899, 14455007, 14642203, 14811095, 14948466, 15042419, 15083395, 15064445, 14981474, 14833283, 14621604, 14351627, 14032083, 13673374, 13284793, 12873805, 12447622, 12013943, 11579426, 11148568, 10725008, 10313070, 9917076, 9539997, 9183896, 8850907, 8542330, 8257291, 7994031, 7752693, 7535310, 7342629, 7172219]
59800G172219j51979j36368j22668j11381j02983r6734r1558q7069q3184p9446
59790F108849p5263p0324o4390n7257m9302m1528l4715k9027k4909k3686k6468
59779E611980l2677m0438m8324n5898o2610o7290o9295o9389o8554o6457o2025
59768D969023n5385m8159m1557l5030k7314j8134q208J924J2276K2769L2943M2372
59756D847520N1004N8944O6385P3709Q1235Q8635R4998R9714J03012J05188J05377
59745E775721J01762R3355Q1471O8837N7260M6630L6432K7584K2037K0766K2928
59734F354783K7058L2483L9383M8053N8557P0744Q4437R9823J17664J38802J63496
59723G235283J91698K23779K60055K99512L39962L80022M20118M60747M99986
$$ y = [7172219, 7020240, 6883872, 6761204, 6649823, 6546840, 6450106, 6358548, 6271479, 6188295, 6108849, 6033586, 5963262, 5898872, 5841615, 5792313, 5750785, 5716070, 5687043, 5662134, 5638448, 5611980, 5579303, 5538865, 5490541, 5434643, 5372033, 5304743, 5235448, 5166059, 5097505, 5031048, 4969023, 4913638, 4865479, 4823922, 4788892, 4761578, 4743444, 4735236, 4737160, 4749436, 4772205, 4805148, 4847520, 4898524, 4957468, 5023853, 5097562, 5178797, 5267432, 5362430, 5462144, 5565156, 5670344, 5775721, 5877483, 5970838, 6052309, 6121146, 6178406, 6225036, 6261468, 6289052, 6311089, 6331855, 6354783, 6381841, 6414324, 6453707, 6501760, 6560317, 6631061, 6715498, 6815321, 6932985, 7071787, 7235283, 7426981, 7650760, 7910815, 8210327, 8550289, 8930311, 9350429, 9811176, 10311162]
59714A0311162N32986N53278N54063N29217M74878L91423K84677J65386M6685
59705A3843755n9753j46800k12158k56484k81929k91935k90694k81853k67899
59696A1754250k50533k30569k07547j80880j51816j22795r4478o5035l3281p86
59686A0416530L0388O0585R1654J24366J58270J93183K29137K65595L02165L39535
59676A2211408L78335M18009M58290N00838N47669N98710O52529P08590P66758
59667A7241136Q25465Q82665R38070R91963J042018J083831J114657J134336J142520
59658B6396661J137798J120394J093497J061122J026734R94686R70611R58687
59650C4760190R59570R71720R93124J020895J050751J078081J098495J106893
$$ y = [10311162, 10844148, 11397426, 11951489, 12480706, 12955584, 13347007, 13631684, 13797070, 13843755, 13784002, 13637202, 13425044, 13168560, 12886631, 12594696, 12304002, 12022149, 11754250, 11503717, 11273148, 11065601, 10884721, 10732905, 10610110, 10515632, 10450597, 10417316, 10416530, 10446918, 10507503, 10599157, 10723523, 10881793, 11074976, 11304113, 11569708, 11871873, 12211408, 12589743, 13007752, 13466042, 13966880, 14514549, 15113259, 15765788, 16474378, 17241136, 18066601, 18949266, 19887336, 20879299, 21921317, 23005148, 24119805, 25254141, 26396661, 27534459, 28654853, 29748350, 30809472, 31836206, 32830892, 33801503, 34760190, 35719760, 36691480, 37684604, 38705499, 39756250, 40834331, 41932826, 43039719]
59642D3039719J097558J066168J010763R30882Q27679P05559N71591M32331K92831
59633D9975081J59281L9923n8599j34283j87743k18877k27114k13355j79633j27776
59623D8826905n9910K1005J13075K17006L34031M62844N99847P41228Q83138J020537
59613E3159706J147318J256637J339477J383911J378053J313987J188238J000322
59605F3167649P53817M59124J33115k04625n34886q39888j104785j320077j482504
59596E9026940j593765j658850j684621j678212j646458j597428j541635j490109
59588D6135862j451214j429966j429148j448697j483779j525160j562404j586666
59580C4218828j591802j575212j538402j485730j422125j352103j279715j207584
$$ y = [43039719, 44137277, 45203445, 46214208, 47145090, 47972769, 48678328, 49249919, 49682250, 49975081, 50134362, 50174285, 50115686, 49981403, 49793660, 49574783, 49347669, 49134314, 48954681, 48826905, 48766995, 48788000, 48901075, 49118081, 49452112, 49914956, 50514803, 51256031, 52139169, 53159706, 54307024, 55563661, 56903138, 58287049, 59665102, 60979089, 62167327, 63167649, 63921466, 64380590, 64513705, 64309080, 63774194, 62934306, 61829521, 60509444, 59026940, 57433175, 55774325, 54089704, 52411492, 50765034, 49167606, 47625971, 46135862, 44684648, 43254682, 41825534, 40376837, 38893058, 37367898, 35805494, 34218828, 32627026, 31051814, 29513412, 28027682, 26605557, 25253454, 23973739, 22766155]
59572B2766155j136119j065111r95788r29821q66780q04789p43829o86254o33404
59563A4904260n83663n34908m87321m42647m01845l64631l30455k98961k70069
59554A1189760k44435k23333k07450j96208j88576j83806j81138j79706j79315
59545I405793j80515j83242j86030j87307j86774j84954j81965j77457j71368
59536G766181j63946j55367j45941j36332j26899j17027j05853r3581q1409p0050
59526F569776n8962m7452l5957k5487j5857n459O479J8001K6037K9983L2473L6187
59514F529762M1085M5764N0273N6038O3424P1285P9083Q8021R9319J12319J25086
59503G361459J36485J47224J59106J73495J90290K08340K26988K46874K68849
$$ y = [22766155, 21630036, 20564925, 19569137, 18639316, 17772536, 16967747, 16223918, 15537664, 14904260, 14320597, 13785689, 13298368, 12855721, 12453876, 12089245, 11758790, 11459829, 11189760, 10945325, 10721992, 10514542, 10318334, 10129758, 9945952, 9764814, 9585108, 9405793, 9225278, 9042036, 8856006, 8668699, 8481925, 8296971, 8115006, 7937549, 7766181, 7602235, 7446868, 7300927, 7164595, 7037696, 6920669, 6814816, 6721235, 6639826, 6569776, 6510814, 6463362, 6427405, 6401918, 6386061, 6380602, 6387081, 6405082, 6431119, 6461102, 6493575, 6529762, 6570847, 6616611, 6666884, 6722922, 6786346, 6857631, 6936714, 7024735, 7124054, 7236373, 7361459, 7497944, 7645168, 7804274, 7977769, 8168059, 8376399, 8603387, 8850261, 9119110]
59494I119110K92596L17111L42167L68207L94808M20343M43538M64435M83326
59485A2645641M99351N10731N16167N15624N09984N00118M86441M69386M50049
59476A7103492M29516M07413L82164L53535L23996K96562K72125K50232K31553
59467B0050588K17608K08291K01670J96306J91703J85951J74975J55139J25335
59458B1707566Q5878L7043k0334q4364j53388k26494l01607l74464m40936m99242
59448A9729658n48596n87284o14135o30788o39924o41619o33920o17116n94952
59439A4221324n70790n44638n15100m82531m48816m15240l82082l49624l18062
59430A0194441k86847k55294k23795j93420j64404j36020j07955q0763n4699k8916
$$ y = [9119110, 9411706, 9728817, 10070984, 10439191, 10833999, 11254342, 11697880, 12162315, 12645641, 13144992, 13655723, 14171890, 14687514, 15197498, 15697616, 16184057, 16653443, 17103492, 17533008, 17940421, 18322585, 18676120, 19000116, 19296678, 19568803, 19819035, 20050588, 20268196, 20476487, 20678157, 20874463, 21066166, 21252117, 21427092, 21582231, 21707566, 21793444, 21830487, 21810153, 21725789, 21572401, 21345907, 21044300, 20669836, 20228900, 19729658, 19181062, 18593778, 17979643, 17348855, 16708931, 16067312, 15433392, 14816276, 14221324, 13650534, 13105896, 12590796, 12108265, 11659449, 11244209, 10862127, 10512503, 10194441, 9907594, 9652300, 9428505, 9235085, 9070681, 8934661, 8826706, 8745943, 8691244, 8662328]
59420H662328k319K5319N3544Q2055J10854J39832J68732J97513K26437K55616
59410I919911K84547L12046L36572L56789L71676L80122L80507L71174L51288
59401A3064632L20866K79971K28599J67738J00018K8726m3301j13470j78758k36435
59391A3618586k85348l25771l58031l82049l98183m07623m11561m10618m05188
59382A0234214l95781l82909l67293l50206l32824l15136k96275k76200k56161
59373G261429k37208k19140k01249j83196j64722j45656j26834j09942r5495q1940
59363E696047o7700n3190l9677k7146j4746k726P800J6793K5365L3934M1977M9890
59351E666621N9445P1365Q3397R1906R5172R4775R4222R6624J03169J13147J25365
$$ y = [8662328, 8660009, 8685328, 8738872, 8820927, 8931781, 9071613, 9240345, 9437858, 9664295, 9919911, 10204458, 10516504, 10853076, 11209865, 11581541, 11961663, 12342170, 12713344, 13064632, 13385498, 13665469, 13894068, 14061806, 14161824, 14190550, 14147249, 14033779, 13855021, 13618586, 13333238, 13007467, 12649436, 12267387, 11869204, 11461581, 11050020, 10639402, 10234214, 9838433, 9455524, 9088231, 8738025, 8405201, 8090065, 7793790, 7517590, 7261429, 7024221, 6805081, 6603832, 6420636, 6255914, 6110258, 5983424, 5873482, 5777987, 5696047, 5628347, 5575157, 5535480, 5508334, 5493588, 5490862, 5498662, 5515455, 5540820, 5574754, 5616731, 5666621, 5726066, 5797431, 5880828, 5972734, 6067906, 6162681, 6256903, 6353527, 6456696, 6569843, 6695208]
59340F695208J39644J56849J77476K00524K23815K45220K63812K80453K97607
59331H680608L18209L44346L76740M15072M58384N05348N54747O05974O58766
59322A2918194P12049P63057Q07896Q43307Q67919Q81499Q83063Q70701Q43802
59313B0391487Q04683P57041P03425O45475N85821N27320M70201M12250L52667
59304B5650370K93271K34559J72950J04626L0627m4543j18522j92194k65163l32956
59294B5533025l89997m33644m64392m83768m93418m95663m93719m91137m90908
59285B1296379m94569n02148n13335n28341n46904n66866n84922n98792o07901
59276A6352601o12164o11205o04794n93070n76203n54708n30044n04005m77523
$$ y = [6695208, 6834852, 6991701, 7169177, 7369701, 7593516, 7838736, 8102548, 8383001, 8680608, 8998817, 9343163, 9719903, 10134975, 10593359, 11098707, 11653454, 12259428, 12918194, 13630243, 14393300, 15201196, 16044503, 16912422, 17793921, 18676984, 19547685, 20391487, 21196170, 21953211, 22656636, 23302111, 23887932, 24415252, 24885453, 25297703, 25650370, 25943641, 26178200, 26351150, 26455776, 26486403, 26441860, 26323338, 26131144, 25865981, 25533025, 25143028, 24709384, 24244992, 23761224, 23267806, 22772143, 22278424, 21787287, 21296379, 20801810, 20299662, 19786327, 19257986, 18711082, 18144216, 17559294, 16960502, 16352601, 15740437, 15129232, 14524438, 13931368, 13355165, 12800457, 12270413, 11766408, 11288885]
59267A1288885m50661m23553l96382l68854l40873l13510k88029k64116k40307
59258H202600k16132j92561j70269j48885j28082j08158q9255p1220n4360l9081
59248F984597k4617r502O397K1642L5495M9054O3598P8954R4204J08996J23497
59237G532315J37818J52023J66037J79248J90905K01098K10488K18934K25384
59228I214250K29265K30936K30665K28270K23924K18219K11258K02952J94281
59219A1184020J86865J81001J75647J70493J66337J62797J57516J48651J36547
59210A2669874J21833J03480Q0267N3044K3839o615l8987p3177j07176j37971
59200A2688411j62900j80483j90648j94188j91811j84046j71932j56809j39277
$$ y = [11288885, 10838224, 10414671, 10018289, 9649435, 9308562, 8995052, 8707023, 8442907, 8202600, 7986468, 7793907, 7623638, 7474753, 7346671, 7238513, 7149258, 7078038, 7023678, 6984597, 6959980, 6950478, 6956875, 6978517, 7014012, 7063066, 7126664, 7205618, 7299822, 7408818, 7532315, 7670133, 7822156, 7988193, 8167441, 8358346, 8559444, 8769932, 8988866, 9214250, 9443515, 9674451, 9905116, 10133386, 10357310, 10575529, 10786787, 10989739, 11184020, 11370885, 11551886, 11727533, 11898026, 12064363, 12227160, 12384676, 12533327, 12669874, 12791707, 12895187, 12975454, 13028498, 13052337, 13045722, 13006735, 12933558, 12826382, 12688411, 12525511, 12345028, 12154380, 11960192, 11768381, 11584335, 11412403, 11255594, 11116317]
59191A1116317j19275r7428p5062n2507k8603k654K4264N0699P6474J02214J28194
59180A1122633J54422J80826K06529K29975K50741K70362K90360L10370L29271
59171A3345489L47446L66560L87428M09013M29422M47079M60901M69493M70111
59162A7132942M58722M31986L89186L31353K58958J72259P4084k9939j34845k38246
59152A8846460l37722m28435n05524n67603o15935o50978o71905o79195o75626
59143A3713537o64333o47290o25825o01316n74765n46473n16547m85554m54543
59134H596891m24609l96151l68522l40901l13601k87888k64375k42563k22207
59125E736074k04046j88480j74507j60753j46863j33383j21023j10441j01728
$$ y = [11116317, 10997042, 10899614, 10824552, 10772045, 10743442, 10740788, 10765052, 10815751, 10892225, 10994439, 11122633, 11277055, 11457881, 11664410, 11894385, 12145126, 12415488, 12705848, 13016218, 13345489, 13692935, 14059495, 14446923, 14855936, 15285358, 15732437, 16193338, 16662831, 17132942, 17591664, 18023650, 18412836, 18744189, 19003147, 19175406, 19249490, 19219551, 19084706, 18846460, 18508738, 18080303, 17574779, 17007176, 16391241, 15740263, 15068358, 14389163, 13713537, 13049204, 12401914, 11776089, 11174773, 10600008, 10053535, 9536988, 9051434, 8596891, 8172282, 7776131, 7407609, 7066708, 6753107, 6465219, 6200844, 5958281, 5736074, 5532028, 5343548, 5169041, 5008288, 4861425, 4728042, 4607019, 4496578, 4394850]
59116D394850r3657q4506p4224o4610n6873n0421m4533l9353l4360k7823j9410
59105C805080j1450n794q79N814J3800K0587K5862L1935M0091M8991N7010O4098
59093D095145P0732P6809Q2310Q7894R4042J00477J06848J13381J20593J28939
59083E077170J38638J49190J59225J67674J75018J82712J91412K00309K08033
59074F649381K13625K16946K18763K20118K21026K20116K16052K08832J99295
59065H584154J88233J76713J66426J58648J53350J50260J50104J53843J61306
59056A0043037J71603J84286J98970K14267K28276K39797K48135K52017K49548
59047A2029936K38801K17799J84838J40110Q6647K8709l0257q7485j39933j85087
$$ y = [4394850, 4301193, 4216687, 4142463, 4077853, 4020980, 3970559, 3926026, 3886673, 3852313, 3824490, 3805080, 3793630, 3787836, 3786957, 3792771, 3806571, 3827158, 3853020, 3884955, 3925046, 3974037, 4031047, 4095145, 4165877, 4242686, 4324996, 4412890, 4506932, 4607409, 4714257, 4827638, 4948231, 5077170, 5215808, 5364998, 5524223, 5691897, 5866915, 6049627, 6241039, 6441348, 6649381, 6863006, 7079952, 7298715, 7518833, 7739859, 7959975, 8176027, 8384859, 8584154, 8772387, 8949100, 9115526, 9274174, 9427524, 9577784, 9727888, 9881731, 10043037, 10214640, 10398926, 10597896, 10812163, 11040439, 11280236, 11528371, 11780388, 12029936, 12268737, 12486536, 12671374, 12811484, 12898131, 12926840, 12896583, 12809098, 12669165, 12484078]
59037A2484078k22100k50769k69964k78691k78417k72758k64614k54528k41692
59028A0150545k25569k06794j87367j69625j54177j39443j24223j10021r9614
59019H733712r3961r1931r2545r5825j01678j09518j19123j30604j43369j56178
59009G598980j68305j79694j89983j98239k03766k06555k07045k05911k03777
59000E835705k00707j96359j90890j84901j78254j70235j61412j53785j48143
58991D251019j42840j36410j29752j24119j18586j11656j04112r7881r2836q7140
58981C105687q0244p3470o7747o2717n7946n3265m8247m2801l7863l4051l0361
58970B516975k5860k1773j9772j8973j7015j3711j1155j0360j0053r053p621o194
$$ y = [12484078, 12261978, 12011209, 11741245, 11462554, 11184137, 10911379, 10646765, 10392237, 10150545, 9924976, 9718182, 9530815, 9361190, 9207013, 9067570, 8943347, 8833326, 8733712, 8639751, 8547820, 8455275, 8359450, 8257772, 8148254, 8029131, 7898527, 7755158, 7598980, 7430675, 7250981, 7060998, 6862759, 6658993, 6452438, 6245393, 6039482, 5835705, 5634998, 5438639, 5247749, 5062848, 4884594, 4714359, 4552947, 4399162, 4251019, 4108179, 3971769, 3842017, 3717898, 3599312, 3487656, 3383544, 3285663, 3192827, 3105687, 3025443, 2951973, 2884226, 2821509, 2763563, 2710298, 2662051, 2619250, 2581387, 2547336, 2516975, 2491115, 2469342, 2449570, 2430597, 2413582, 2399871, 2388716, 2378356, 2368303, 2359250, 2351629, 2345435]
58958B345435m509k472n19Q90J213r7k161k432L31L962N839O609Q364J0451J0540
58943B381444R108R006J0581J1143R868R455J1633J4432J5546J5676J6658J8531
58931B533081K0319K1985K3973K6096K7916K9170K9508K9195L0033L3408L7448
58920B842132L8622L6618L4913L5989L8859M2036M5563M8771M9468M7678M7343
58909C307992N1638N8653O4201O7121O9323P2138P5288P8518Q1826Q4634Q6625
58898D097957Q8986R3194R9015J04943J10105J14705J19454J25475J33801J43996
58888E231631J54227J63743J74074J86729K00995K15322K29754K45466K62716
58879G064657K80713K99067L18324L39422L63197L89735M17887M46357M75714
$$ y = [2345435, 2340926, 2338454, 2337935, 2338825, 2340038, 2339941, 2337780, 2335348, 2335679, 2339641, 2345480, 2352089, 2360453, 2370904, 2381444, 2390552, 2399558, 2410139, 2421282, 2431150, 2440605, 2452238, 2466670, 2482216, 2497892, 2514550, 2533081, 2553400, 2575385, 2599358, 2625454, 2653370, 2682540, 2712048, 2741243, 2771276, 2804684, 2842132, 2880754, 2917372, 2952285, 2988274, 3027133, 3069169, 3114732, 3163503, 3212971, 3260649, 3307992, 3359630, 3418283, 3482484, 3549605, 3618928, 3691066, 3766354, 3844872, 3926698, 4011332, 4097957, 4186943, 4280137, 4379152, 4484095, 4594200, 4708905, 4828359, 4953834, 5087635, 5231631, 5385858, 5549601, 5723675, 5910404, 6111399, 6326721, 6556475, 6801941, 7064657, 7345370, 7644437, 7962761, 8302183, 8665380, 9055115, 9473002, 9919359, 10395073]
58870A0395073N08169N44945N85278O28415O74865P24934P77833Q33157Q91487
58861A6564156R52258J012673J070024J123367J171350J209787J232959J236063
58853B5572637J215042J165604J084694R72479Q31628O65642M79411K80421P7582
58844C2345140j21040l08607m78897o27070p50858q50172r26076r80842j017756
58835B6283822j039548j047495j042776j027792j005230r76730r43266r05928
58827A8295057q65466q22126p76860p31712o88182o46143o05051n65070n26469
58818A2067978m89322m54513m23445l95903l69778l43836l19002k95928k73374
58809H702877k50595k29313k11331j95635j79873j63557j47845j33177j19032
$$ y = [10395073, 10903242, 11448187, 12033465, 12661880, 13336745, 14061679, 14839512, 15672669, 16564156, 17516414, 18529087, 19599111, 20722478, 21893828, 23103615, 24336574, 25572637, 26787679, 27953283, 29037977, 30010456, 30842084, 31507726, 31987137, 32267558, 32345140, 32224100, 31915493, 31436596, 30809526, 30058668, 29208496, 28282420, 27301578, 26283822, 25244274, 24196779, 23154003, 22126211, 21120981, 20144251, 19200985, 18295057, 17429591, 16607465, 15830605, 15098893, 14410711, 13764568, 13159517, 12594447, 12067978, 11578656, 11124143, 10700698, 10304795, 9935017, 9591181, 9272179, 8976251, 8702877, 8452282, 8222969, 8011638, 7816003, 7636130, 7472573, 7324728, 7191551, 7072519]
58800G072519j05307r2309p9941o8070n7007m6540l5634k4080j3003k559R143
58789F557212K3228L7873N0778O2408P4744Q8244J02179J16769J32526J48369
58779G394330J62852J76843J92780K11412K31243K50934K70627K91093L13112
58770I495226L37429L64075L92028M20696M51050M84308N20438N59207O01527
58761A3625984O48224O98418P50733Q05240Q62604R22091R81619J038631J089519
58752B1423063J129598J155245J164629J154655J119124J052434R53823Q25852
58744B9978423O70757M91774K96777R6681j00022k88395m63306o18296p48984
58735B9315409q54978r37689r98524j039623j063904j073514j070038j056351
$$ y = [7072519, 6967212, 6874903, 6794962, 6726892, 6669885, 6623345, 6587711, 6563631, 6550628, 6548069, 6557212, 6580440, 6618313, 6669091, 6731499, 6806243, 6894487, 6996666, 7113435, 7245961, 7394330, 7557182, 7734025, 7926805, 8138217, 8369460, 8620394, 8891021, 9182114, 9495226, 9832655, 10196730, 10588758, 11009454, 11460504, 11944812, 12465250, 13024457, 13625984, 14274208, 14972626, 15723359, 16528599, 17391203, 18313294, 19294913, 20333544, 21423063, 22552661, 23707906, 24872535, 26027190, 27146314, 28198748, 29152571, 29978423, 30649180, 31140954, 31437731, 31534412, 31434390, 31145995, 30682689, 30064393, 29315409, 28460431, 27522742, 26524218, 25484595, 24420691, 23347177, 22277139, 21220788]
58727B1220788j035964j009999r77214r37912q95618q53720q12313p69812p26220
58718A3202016o83237o42039o02422n63946n26960m92337m60489m30881m02783
58709H396922l76439l52752l31538l11115k90361k70119k51601k34540k18179
58700E760278k02880j89229j76429j63263j49975j37609j26212j15373j05659
58691D393649r7700r0525q2799p5096o8988o4414o0100n6108n3641n2526n1139
58680C640613m8913m6685m4550m1614l8324l6768l7803l9732m0617m0505m0468
58669C184634m0754m0876m0825m1359m3180m5820m7472m6711m4737m4649m7567
58658B700684n0852n1548n0051m8592m7605m6098m4555m4425m4998m3746m0135
$$ y = [21220788, 20184824, 19174825, 18197611, 17259699, 16364081, 15510361, 14698048, 13928236, 13202016, 12518779, 11876740, 11274318, 10710372, 10183412, 9691075, 9230586, 8799705, 8396922, 8020483, 7667731, 7336193, 7025078, 6734717, 6464598, 6212997, 5978457, 5760278, 5557398, 5368169, 5191740, 5028477, 4878502, 4740893, 4614681, 4499308, 4393649, 4295949, 4205424, 4122625, 4047529, 3978541, 3914127, 3854027, 3797919, 3744278, 3691752, 3640613, 3591700, 3545015, 3500465, 3458851, 3420527, 3383759, 3345956, 3306224, 3265607, 3225102, 3184634, 3143880, 3103004, 3062179, 3020820, 2977640, 2931820, 2884348, 2837637, 2792900, 2748251, 2700684, 2649832, 2598284, 2548233, 2499641, 2452036, 2405938, 2361383, 2316958, 2271960, 2228214, 2188079]
58647B188079l6511l4615l3435l1389k8646k6294k4601k3084k1425j9741j8493
58636A889845j8160j8465j8280j7097j5904j5668j5765j5107j3801j2296j0064
58625A719238o879m385m316n925p220p929r103j0592j1422j1973j3328j4874j5036
58612A596256j3943j2925j1808r411o424m949n115m901l356j431M85K974N370
58599A530822N929M776M129N054O442P554R120J1434J3876J6718K0903K5611K8619
58586A690987K9655L0828L3298L6218L9453M4270N0418N5543N8751O2083O7048
58575B198552P2344P6570Q0752Q6540R3898J02119J11334J21645J32546J44396
58565C220696J58637J75417J92927K10228K28762K49773K72149K94052L14851
$$ y = [2188079, 2151568, 2116953, 2083518, 2052129, 2023483, 1997189, 1972588, 1949504, 1928079, 1908338, 1889845, 1871685, 1853220, 1834940, 1817843, 1801939, 1786271, 1770506, 1755399, 1741598, 1729302, 1719238, 1712359, 1707974, 1703658, 1697733, 1690513, 1682584, 1673481, 1662889, 1651467, 1639494, 1626166, 1611292, 1596256, 1582313, 1569388, 1557580, 1548169, 1541745, 1536796, 1531681, 1526780, 1523424, 1521993, 1522478, 1525452, 1530822, 1536751, 1541527, 1545656, 1550710, 1557152, 1564706, 1573826, 1585260, 1599136, 1615854, 1636757, 1662368, 1690987, 1720642, 1751470, 1784768, 1820986, 1860439, 1904709, 1955127, 2010670, 2069421, 2131504, 2198552, 2270896, 2347466, 2428218, 2514758, 2608656, 2710775, 2822109, 2943754, 3076300, 3220696, 3379333, 3554750, 3747677, 3957905, 4186667, 4436440, 4708589, 5002641, 5317492]
58556E317492L33956L49426L59109L61656L55229L36805L04325K58487K01627
58547H178112J36418O6557k951o7666j25061j73602k12113k40689k60667k72956
58537G025382k77918k77197k73650k68710k61749k52732k43201k33782k22937
58528D713506k09609j95084j80882j66707j51786j36600j21944j07906r4980q4481
58518C263527p6739p0311o4020n8088n2619m7051m2113m0039m1327m3394m3972
58507B683854m3785m4343m5203m5438m5860m7391m8750m8097m6106m5102m5749
58496B178030m6500m6007m4464m2663m1013l9436l7543l5093l2595l0852k9797
58485A752067k8577k6925k5372k4073k2772k1965k2358k3004k1895j8862j5947
$$ y = [5317492, 5651448, 6000874, 6359983, 6721639, 7076868, 7413673, 7717998, 7976485, 8178112, 8314530, 8381087, 8378136, 8310470, 8185409, 8011807, 7799694, 7559005, 7298338, 7025382, 6747464, 6470267, 6196617, 5927907, 5666158, 5413426, 5170225, 4936443, 4713506, 4503897, 4308813, 4127931, 3961224, 3809438, 3672838, 3550894, 3442988, 3348008, 3263527, 3186788, 3116477, 3052457, 2994369, 2941750, 2894699, 2852586, 2812547, 2771220, 2727826, 2683854, 2640069, 2595726, 2550523, 2505085, 2459225, 2411834, 2363084, 2314987, 2268881, 2223779, 2178030, 2131530, 2085523, 2041059, 1998396, 1957383, 1917947, 1880404, 1845311, 1812716, 1781864, 1752067, 1723490, 1696565, 1671193, 1647120, 1624348, 1602383, 1580025, 1557021, 1535126, 1516264, 1500317]
58474A500317j4457j3570j2504j1833j1755j1141r542q157p675o962n217l788
58462A383716m382o736r236j0685j0626r251p802p729q789r323q834q547q970
58449A272806q896p679o549o696p557p980p758p353p340q318r889j0033p430m061
58435A165267l055m234m752m065m641p136q637p198m853m352n656p342q859r762
58421A080725r120p170n452m234k338j92J7j751k684j698j114k119k311j66J700
58406A042093O17j827k548j501m82K83J461K497K954M106O694Q868Q736P246O369
58391A085566O093N374M300L336K096O00j15k75j951n652q744r280q842r523j0512
58376A052471j0163r093q783q928q547p826o940n032k293q17j562k667k564k240
$$ y = [1500317, 1485860, 1472290, 1459786, 1447953, 1436198, 1425057, 1415515, 1407358, 1399683, 1392721, 1387504, 1383716, 1379334, 1372598, 1363362, 1352677, 1342051, 1332800, 1324998, 1317269, 1308480, 1299157, 1290323, 1281776, 1272806, 1263910, 1256231, 1249682, 1242986, 1235429, 1227449, 1219691, 1212338, 1204998, 1196680, 1186791, 1176758, 1169328, 1165267, 1162212, 1157978, 1153226, 1149161, 1144520, 1137384, 1128747, 1121549, 1116696, 1112344, 1106688, 1099346, 1090487, 1080725, 1071605, 1064435, 1058983, 1054749, 1052411, 1052219, 1052236, 1050485, 1047801, 1046103, 1044989, 1042870, 1040559, 1040393, 1042093, 1042710, 1040883, 1038335, 1036834, 1036352, 1036635, 1038096, 1040593, 1043547, 1047653, 1054347, 1063215, 1071951, 1079197, 1085566, 1091659, 1097033, 1101333, 1104669, 1106765, 1107365, 1107250, 1106975, 1105024, 1099372, 1090628, 1081348, 1072506, 1062983, 1052471, 1042308, 1033215, 1024432, 1015504, 1006957, 999131, 992191, 987159, 984866, 984049, 982487, 979820, 977256, 975016]
58362I75016k596k367p58N99N24L53J035J179K54N95L552O686P641P779R017J0027
58346A018536Q901O923O402P106P875R349J1980J3825J3369J2166J1868J1236
58334A139536R120P576Q698J0842J1409J0938J1128J1175R494P030N667N289N038
58321A252940N191N325L461k64k237n21J831J641J93l16j091l578n530m492k134
58306A250419j028k40J762L064J777L68J938M837N594M543M084L971K984K635
58292A286708M685P224P529O450N993N302L111J281J710K728K510K797N066O836
58278A349930O136N657P731R481Q213P132R848J3442J3473J1857J2983J5563J5484
58265A486930J3664J4081J6454J7624J7703J8582J8948J7137J5939J8258K1081
$$ y = [975016, 972420, 970053, 969295, 969894, 970418, 970771, 971806, 972985, 973239, 973834, 977386, 984072, 991713, 999492, 1008509, 1018536, 1027437, 1034360, 1040762, 1047868, 1055743, 1065092, 1077072, 1090897, 1104266, 1116432, 1128300, 1139536, 1148656, 1156232, 1164930, 1175772, 1187181, 1198119, 1209247, 1220422, 1229916, 1236946, 1242613, 1247902, 1252940, 1258131, 1263456, 1266917, 1266653, 1264416, 1263895, 1265726, 1267367, 1267560, 1267244, 1266153, 1262575, 1257045, 1252553, 1250419, 1249391, 1249151, 1250913, 1253977, 1255754, 1256122, 1258060, 1262897, 1268491, 1273034, 1277118, 1281089, 1284073, 1286708, 1291393, 1298617, 1306146, 1312596, 1318589, 1323891, 1327002, 1328283, 1329993, 1332721, 1335231, 1338028, 1343094, 1349930, 1356066, 1361723, 1369454, 1378935, 1387148, 1394280, 1404128, 1417570, 1431043, 1442900, 1455883, 1471446, 1486930, 1500594, 1514675, 1531129, 1548753, 1566456, 1585038, 1603986, 1621123, 1637062, 1655320, 1676401]
58254A676401K0250J7803J7974J9565J9473J9885K4126K8822K8520K5088K4342
58243A922249K6149K6178K4699K5247K7022K6937K6626K9224L2079L1119K9311
58232B226840L1918L6490L6946L4551L5055L7818L7982L6806L9282M3663M4090
58221B641441M1895M3639M9435N3785N6261O0727O5616O5914O3487O4515O8231
58210C274946O9187O8819P3122Q0531Q4083Q4261Q7610R4020R7724R9602J05714
58199D219619J14820J20349J23635J31975J44632J54312J61385J72550J86543
58190E529820J95752K01171K10768K23788K32294K37502K48450K64764K77353
58181G621662K86221L00420L20250L37093L51498L73348M03407M33124M63391
$$ y = [1676401, 1696651, 1714454, 1732428, 1751993, 1771466, 1791351, 1815477, 1844299, 1872819, 1897907, 1922249, 1948398, 1974576, 1999275, 2024522, 2051544, 2078481, 2105107, 2134331, 2166410, 2197529, 2226840, 2258758, 2295248, 2332194, 2366745, 2401800, 2439618, 2477600, 2514406, 2553688, 2597351, 2641441, 2683336, 2726975, 2776410, 2830195, 2886456, 2947183, 3012799, 3078713, 3142200, 3206715, 3274946, 3344133, 3412952, 3486074, 3566605, 3650688, 3734949, 3822559, 3916579, 4014303, 4113905, 4219619, 4334439, 4454788, 4578423, 4710398, 4855030, 5009342, 5170727, 5343277, 5529820, 5725572, 5926743, 6137511, 6361299, 6593593, 6831095, 7079545, 7344309, 7621662, 7907883, 8208303, 8528553, 8865646, 9217144, 9590492, 9993899, 10427023, 10890414]
58172A0890414N04269N54970O03838O49448P01549P60105Q14886Q67175R29742
58163A7276396J003399J076418J148424J230496J319965J401389J475525J560740
58155B7492752J663125J773006J893083K038986K208319K381375K556809K753666
58147D4761121K975716L211358L472168L790077M172112M603421N100317N710478
58139G7796768O456599P340046Q409145R755886J1429569J3421100J5732142J8359883
58131A68701138K1219111K4253248K7670023L1778937L6258350L9606812L9646238
58124C89133857L4841424K5280772J2598129q27343j2724539k1555083k6839035
58117C99908182k9033377k9011130k7572532k5334869k2837797k0526539j8623688
$$ y = [10890414, 11394683, 11949653, 12553491, 13202939, 13904488, 14664593, 15479479, 16346654, 17276396, 18279795, 19356213, 20504637, 21735133, 23055098, 24456487, 25932012, 27492752, 29155877, 30928883, 32821966, 34860952, 37069271, 39450646, 42007455, 44761121, 47736837, 50948195, 54420363, 58210440, 62382552, 66985973, 72086290, 77796768, 84253367, 91593413, 100002558, 109758444, 121188013, 134609113, 150341255, 168701138, 189920249, 214173497, 241843520, 273622457, 309880807, 349487619, 389133857, 423975281, 449256053, 461854182, 461026839, 448302300, 426747217, 399908182, 370874805, 341863675, 314291143, 288956274, 266118477, 245591938, 226968250]
58110B26968250j7126530j5945673j4992919j4167495j3360627j2508901j1606188
58103A27259917j0662086r684654q693770p707755o719685n720135m733683l801705
58095F9536444k942844k155848j429945p14876P1277R21178J630081J887352J511956
58086F8314775N80493o54118j908867k948392l622330l903949l880390l673917
58078D8303305l376443l053642k764256k542158k379525k251339k143875k047828
58070B7744239j945574j824864j692128j558582j425721j294775j175484j073382
58062A5753729r80874q91034q08524p38278o75833o17366n67252n27518m91245
58053I455805m53897m20170l92966l67073l40159l18460l05012k93574k80441
$$ y = [226968250, 209841720, 193896047, 178903128, 164735633, 151375006, 138866105, 127259917, 116597831, 106913177, 98219407, 90511652, 83791967, 78071832, 73338149, 69536444, 66593600, 64437752, 63007807, 62292931, 62364208, 63285386, 64915467, 66802819, 68314775, 68895268, 68241150, 66332283, 63383891, 59761561, 55857612, 51977222, 48303305, 44926862, 41873220, 39108964, 36566806, 34187281, 31935942, 29792067, 27744239, 25798665, 23973801, 22281673, 20723091, 19297370, 18002595, 16827111, 15753729, 14772855, 13881821, 13073297, 12335019, 11659186, 11041820, 10474568, 9947050, 9455805, 9001908, 8581738, 8188772, 7821699, 7481540, 7163080, 6858068, 6564494, 6284053]
58044F284053k70771k66672k60530k47181k32042k20451k09328j96035j84914
58035D196129j78133j69835j56312j42714j33296j24413j13447j05140j02205
58026B970634r8943r1212q4054q2190q1257p5838o8727o4876o3022o0138n7791
58015B142586n7528n5963n0588m4916m2408m0933l8122l6256l6894l6666l3321
58004A668991l0162k9794k9322k6163k2775k1271j9444j6248j5046j7165j8516
57993A423085j6806j5532j6598j5941j1319p539q556j0832j0071q359q970r839
57981A282723q016n176l383p39L562N376K311j238j221m65k342l693p81K847J662
57966A271427k779n082m924n927q381r582r434j0018j1212j1624j1977j3365j4234
$$ y = [6284053, 6013282, 5746610, 5486080, 5238899, 5006857, 4786406, 4577078, 4381043, 4196129, 4017996, 3848161, 3691849, 3549135, 3415839, 3291426, 3177979, 3072839, 2970634, 2871691, 2780479, 2696425, 2614235, 2532978, 2457140, 2388413, 2323537, 2260515, 2200377, 2142586, 2085058, 2029095, 1978507, 1933591, 1891183, 1850250, 1812128, 1775872, 1738978, 1702312, 1668991, 1638829, 1609035, 1579713, 1553550, 1530775, 1509504, 1490060, 1473812, 1458766, 1441601, 1423085, 1406279, 1390747, 1374149, 1358208, 1346889, 1339350, 1330794, 1319962, 1309891, 1301532, 1292562, 1282723, 1274707, 1269531, 1266148, 1265409, 1268971, 1274347, 1276658, 1275420, 1274199, 1273734, 1271392, 1267699, 1266918, 1269765, 1271427, 1268648, 1263566, 1258642, 1252715, 1244334, 1234752, 1225318, 1215300, 1204088, 1192464, 1180487, 1167122, 1152888]
57953A152888j3025j1406j1170j0784q576o363o215o829o638p018q734r129o932
57940A040069n786q456j1417j0157o261m064l599k289o53p61j296L70L110L978
57926I92788L450L983N117M666L254L192M187M269L605L521L319J856N74J126
57912A038907J710l44l973o188o912q138r764j0172r745j0243j1465j1790j0976
57899I40907r812q331o837o851q521r176p236n104n372o706o634n706n411m743
57885H44467k594r54j707k697j145J443K086J662K748M327L654J700J512K385
57871H56887R54k595m596m011l621m877o093o237o412o758n623k870q52j019k019
57856H00258j850j6K723N025N525M428L906N323P084P091N916N392N428M785L644
$$ y = [1152888, 1139863, 1128457, 1117287, 1106503, 1097927, 1091564, 1085349, 1078520, 1071882, 1064864, 1056130, 1047001, 1040069, 1034283, 1025827, 1014410, 1004253, 997992, 993928, 990329, 988040, 987387, 986626, 985330, 985700, 988810, 992788, 996238, 1000221, 1005338, 1010004, 1013258, 1016450, 1020637, 1024906, 1028511, 1032032, 1035351, 1037207, 1037781, 1038907, 1040617, 1040273, 1036300, 1030112, 1023200, 1015062, 1005298, 995126, 985381, 975138, 963673, 951883, 940907, 931095, 922764, 915927, 909076, 900555, 891379, 884143, 879039, 873667, 866961, 860327, 854621, 849210, 844467, 841873, 840919, 839212, 836515, 835370, 836813, 838899, 840561, 843309, 847636, 851290, 852990, 854502, 856887, 857841, 855246, 850650, 846639, 843018, 838141, 832048, 825811, 819399, 812641, 807018, 804148, 803296, 802277, 800258, 798408, 798392, 801115, 806140, 811665, 816093, 819999, 825322, 832406, 839497, 845413, 850805, 856233, 861018, 864662]
57841H64662K878J948J62j370j568j791l642n836o180n210m834m750l654k635
57827H28180l886o764q477q092o929n754m586m283n244n521l353o18m84k523l624
57812G58042k917k171j881o98J364K710L189M304O307P940Q885R736R901Q399
57798H13110O282N403N284M144K426K055K682K016l78k870n064p915j0764j1665
57784H04746j0822j0263j0113q640o272n830p931r554q360n659l861l513l905
57771G10023m555n158n600o382p578p857o396m989n781p685q028p062p397r172
57757F16383r565p540n481n249n819n929o079o645o654n620m385l266j638r0m47
57742E41976k623l849k230Q28K896L426L376L559M273N380O205O413O877Q385
$$ y = [864662, 867540, 869488, 869650, 868280, 866712, 864921, 861279, 855443, 849263, 844053, 839219, 834469, 830815, 828180, 824294, 817530, 809053, 800961, 794032, 788278, 783692, 779409, 774165, 768644, 765291, 764673, 764189, 761666, 758042, 755125, 752954, 751073, 750375, 751739, 754449, 757638, 761942, 768249, 776189, 785074, 794810, 804711, 813110, 819392, 824795, 830079, 834223, 836649, 838704, 841386, 843402, 843024, 840154, 835090, 827175, 816411, 804746, 793924, 783661, 773548, 764908, 758636, 752806, 744875, 735321, 726961, 721302, 717441, 713928, 710023, 705468, 700310, 694710, 688328, 680750, 672893, 666497, 661508, 655727, 648042, 640014, 632952, 625555, 616383, 606818, 599278, 593797, 588548, 582729, 576800, 570721, 564076, 557422, 551802, 547417, 544151, 542513, 542423, 541976, 539353, 535504, 533274, 534102, 536998, 540424, 543800, 547359, 551632, 557012, 563217, 569630, 576507, 584892]
57728E84892R928R975Q911Q165P593O173M713M918N960N113K049n77j241j247
57714F55325j563j093O97K102J530m50k525m228n231m922l556k266j396l07J044
57699F33161K023K713L480L508K104R43K204M772N413L782K840L918M943M519
57685F80323M226N467P055P610P707Q129Q390Q210Q175P968O419M288M203O772
57671G74942R504J0709J1484J2579J2711J1772J2511J6483K1024K2800K2191K1722
57659I60432K2193K2834K3632K5163K7279K9670L2476L5164L6578L7182L9119
57648A291722M2731M5606M6701M8558N3245N8858O2746O5700P0053P5724Q1376
57637A943020Q7747R6395J06449J15861J24960J35710J48273J61364J75358J91862
$$ y = [584892, 594820, 604795, 613706, 621871, 629464, 635637, 640350, 645268, 651228, 656341, 658390, 657813, 656572, 655325, 653762, 652669, 653366, 655468, 656998, 656548, 654023, 649795, 644564, 639642, 636086, 633820, 632424, 632117, 633161, 635184, 637897, 641377, 644885, 646989, 647932, 650136, 654908, 660321, 664103, 666943, 670861, 675804, 680323, 684549, 690016, 697071, 704681, 712388, 720517, 728907, 737117, 745292, 753260, 759679, 763967, 768170, 774942, 784446, 795155, 806639, 819218, 831929, 843701, 856212, 872695, 893719, 916519, 938710, 960432, 982625, 1005459, 1029091, 1054254, 1081533, 1111203, 1143679, 1178843, 1215421, 1252603, 1291722, 1334453, 1380059, 1426760, 1475318, 1528563, 1587421, 1650167, 1715867, 1785920, 1861644, 1943020, 2030767, 2127162, 2233611, 2349472, 2474432, 2610142, 2758415, 2919779, 3095137, 3286999]
57627C286999K10311K27989K43649K58545K73330K86176K94321K95720K88771
57618E665811K72224K46058K11535J70443J25234P9591L7475J631k6292m5216
57608F738494n5880o2361p0641q5337j08049j37577j69993j99251k19955k30263
57598E399187k31625k26369k16573k04322j91303j78038j64587j51519j39148
57589C695703j26572j12865r8672q5226p2491n9870m8077l8316k9796k0097q274
57578B995447M148J5689K6781L8499N0744O2714P4432Q6905J00939J16248J31743
57567C704289J46656J61303J76484J92071K06655K18639K26845K29691K24893
57558E487526K10920J88200J58072J21213P8027L0230j8831o5289j05961j39124
$$ y = [3286999, 3497310, 3725299, 3968948, 4227493, 4500823, 4786999, 5081320, 5377040, 5665811, 5938035, 6184093, 6395628, 6566071, 6691305, 6770896, 6808371, 6810002, 6783710, 6738494, 6682614, 6620253, 6549612, 6464275, 6356226, 6218649, 6048656, 5849405, 5629450, 5399187, 5167562, 4941193, 4724620, 4520298, 4328995, 4150957, 3986370, 3834851, 3695703, 3569131, 3456266, 3357594, 3272368, 3199877, 3140007, 3091930, 3053614, 3023818, 3003721, 2995447, 2999595, 3015284, 3042065, 3080564, 3131308, 3194022, 3268454, 3355359, 3456298, 3572546, 3704289, 3850945, 4012248, 4188732, 4380803, 4587458, 4806097, 5032942, 5262633, 5487526, 5698446, 5886646, 6044718, 6165931, 6243958, 6274188, 6255357, 6190068, 6084107, 5944983]
57548E944983j64885j84457j98645k07613k12192k14207k14706k12832k07535
57539D127911j99578j90970j82904j75229j67366j58980j50023j40757j31358
57530B630746j21402j10593j00060r1599q5250p9142p2282o5852o0848n6368n1533
57519A735817m7288m4496m1828l7586l2451k8436k5993k4153k2502k0968j8509
57508A391607j4345r933p368o112l663N54M236N587N526N938P390R339J1359J3470
57494A413585J5995J9333K3231K6523K8497L0109L2870L6998M1786M6971N2242
57483A768140N6283N8325O0189O4576P1485P8588Q5142R2984J03158J14196J24731
57472B677797J35605J47783J59920J69686J76382J80714J82769J81458J75395
$$ y = [5944983, 5780098, 5595641, 5396996, 5189383, 4977191, 4762984, 4548278, 4335446, 4127911, 3928333, 3737363, 3554459, 3379230, 3211864, 3052884, 2902861, 2762104, 2630746, 2509344, 2398751, 2298691, 2207092, 2121842, 2042700, 1970418, 1904566, 1843718, 1787350, 1735817, 1688529, 1644033, 1602205, 1564619, 1532168, 1503732, 1477739, 1453586, 1431084, 1410116, 1391607, 1377262, 1367329, 1359961, 1353849, 1350186, 1350740, 1354976, 1360563, 1366089, 1372027, 1379417, 1388756, 1400115, 1413585, 1429580, 1448913, 1472144, 1498667, 1527164, 1557273, 1590143, 1627141, 1668927, 1715898, 1768140, 1824423, 1882748, 1942937, 2007513, 2078998, 2157586, 2242728, 2335712, 2438870, 2553066, 2677797, 2813402, 2961185, 3121105, 3290791, 3467173, 3647887, 3830656, 4012114, 4187509]
57463D187509J63379J44496J18801Q7632N2860J6272k0049n3668q2695j06309
57453D508228j24216j36532j44416j49579j52547j52408j48942j43844j38946
57444C216798j34252j28706j21977j14334j05672r5995q6315p7700o9752o1298
57434B220797n2350m4158l7300l0978k4286j7183r910k641M126R785J4781K0594
57422B051277K7982L5974M3263M9870N6666O4033P1955Q0826R0952J01471J11182
57411B785451J20397J30594J41820J51918J59016J63417J65866J65010J58069
57402D141558J43443J21277R2075N6733J8025j9769n3787q4080j11590j35577
57392D168308j53915j65461j71321j73832j74583j73376j69291j62747j55776
$$ y = [4187509, 4350888, 4495384, 4614185, 4701817, 4754677, 4770949, 4750900, 4697232, 4614537, 4508228, 4384012, 4247480, 4103064, 3953485, 3800938, 3648530, 3499588, 3355744, 3216798, 3082546, 2953840, 2831863, 2717529, 2611857, 2515862, 2429547, 2351847, 2282095, 2220797, 2168447, 2124289, 2086989, 2056011, 2031725, 2014542, 2004632, 2001991, 2006117, 2015902, 2030683, 2051277, 2079259, 2115233, 2158496, 2208366, 2265032, 2329065, 2401020, 2481846, 2572798, 2674269, 2785451, 2905848, 3036442, 3178262, 3330180, 3489196, 3652613, 3818479, 3983489, 4141558, 4285001, 4406278, 4498353, 4555086, 4573111, 4553342, 4499555, 4415475, 4303885, 4168308, 4014393, 3848932, 3677611, 3503779, 3329196, 3155820, 2986529, 2823782, 2668006]
57383B668006j49726j43585j35835j27128j19391j12703j05293r6711q8743q2582
57373A506309p7273p1831o6793o2449n7611n1722m6339m2786m0004l6651l3720
57362I19130l2802l2957l1793k8801k5411k2493k0136j9215k0449k2182k1675
57351F41216j8807j6125j5093j4606j3595j2551j1748j0310q092o507o395o758
57339E00629o654o662p339p901p747p722q480q986q269p395p932r366r888r155
57325C87133q442q336q134p561p365p756p716o599n207m385l465j361J215J988
57311C14009l0k929l924k516p81n95j644k325j798n10O83J156P55pl27j57k54
57294B98806o69j19K044M116L848J569j29J68J341J918J959K129K461K837L533
$$ y = [2668006, 2518280, 2374695, 2238860, 2111732, 1992341, 1879638, 1774345, 1677634, 1588891, 1506309, 1429036, 1357205, 1290412, 1227963, 1170352, 1118630, 1072291, 1029505, 989501, 952850, 919130, 886328, 853371, 821578, 792777, 767366, 744873, 724737, 705522, 685073, 662891, 641216, 622409, 606284, 591191, 576585, 562990, 550439, 538691, 528381, 520289, 513782, 507387, 500629, 493975, 487313, 479974, 472073, 464326, 456604, 448124, 439138, 430869, 423474, 415542, 406176, 396288, 387133, 378691, 370355, 362221, 354660, 347295, 339539, 331823, 325224, 320017, 315632, 312167, 310806, 312021, 314009, 313979, 311050, 307126, 304610, 303829, 303234, 301590, 299265, 297467, 296957, 297640, 298796, 299551, 299544, 299217, 299060, 298806, 298137, 298018, 300062, 304178, 308026, 309595, 309466, 309634, 310975, 312893, 314852, 316981, 319442, 322279, 325812]
57279C25812M373M512L874L788N153O900P411O678N850N243M118K334Q85N95J147
57264C88673J782K272K832L401L534L096K791L567N328O782P114P306Q881J1550
57250D58909J3335J3235J2538J2956J4530J6087J6878J6900J6348J5691J5837
57239F23244J7238J8973J9562J8569J7049J6534J7834K0456K2859K3769K3506
57228H39593K3555K4543K5559K5854K6174K7506K9407L0617L0911L1254L2528
57217A147501L4952L8230M1354M2697M1433L8562L5619L2791K9210K4581J9281
57206A526211J3273O338q21p042j2159j6794k0817k3413k4581k5113k5078k3901
57194A366103k1979k0514j9480j7547j4414j1406r021n920j387L065N881P559
$$ y = [325812, 330185, 334697, 338571, 342359, 347512, 354412, 361823, 368501, 374351, 379594, 383712, 386046, 386931, 387526, 388673, 390455, 392727, 395559, 398960, 402494, 405590, 408381, 411948, 417276, 424058, 431172, 438478, 447359, 458909, 472244, 485479, 498017, 510973, 525503, 541590, 558468, 575368, 591716, 607407, 623244, 640482, 659455, 679017, 697586, 714635, 731169, 749003, 769459, 792318, 816087, 839593, 863148, 887691, 913250, 939104, 965278, 992784, 1022191, 1052808, 1083719, 1114973, 1147501, 1182453, 1220683, 1262037, 1304734, 1346167, 1384729, 1420348, 1453139, 1482349, 1506930, 1526211, 1539484, 1545822, 1545001, 1537959, 1525800, 1509006, 1488189, 1464776, 1440195, 1415082, 1390004, 1366103, 1344124, 1323610, 1304130, 1286583, 1272169, 1260763, 1251742, 1245822, 1244435, 1247500, 1253381, 1260940]
57182A260940Q975R270P387M551L111L555M504N094N513N653N190M934O342R595
57168A344614J3512J7302K1138K5096K8925L2639L6091L8201L8077L6395L4119
57157A666109L0403K3947J6178J0566Q468Q012P714Q755J2627J8762K5910L4044
57145A871495M3267N2303N9646O5198O9542P2751P5221P8384Q3001Q7477Q9389
57134B647674Q8165Q5126Q1406P6998P1660O5919O1107N8492N7938N7725N6633
57123C408843N5691N6259N6800N4128M8052M1973L7944L4204K9163K4794K3601
57112C871452K4667K5504K5983K7425K9324L0025K9650K9582K9771K9213K8260
57101D180856K7760K6556K2622J6332R882L673m071j4036k4463l3401m0277m5188
$$ y = [1260940, 1269915, 1279185, 1286572, 1291123, 1294234, 1297789, 1302293, 1307387, 1312900, 1318553, 1323743, 1328677, 1335019, 1344614, 1358126, 1375428, 1396566, 1421662, 1450587, 1483226, 1519317, 1557518, 1595595, 1631990, 1666109, 1696512, 1720459, 1736637, 1747203, 1755671, 1763683, 1771397, 1780152, 1792779, 1811541, 1837451, 1871495, 1914762, 1967065, 2026711, 2091909, 2161451, 2234202, 2309423, 2387807, 2470808, 2558285, 2647674, 2735839, 2820965, 2902371, 2979369, 3051029, 3116948, 3178055, 3236547, 3294485, 3352210, 3408843, 3464534, 3520793, 3577593, 3631721, 3679773, 3721746, 3759690, 3793894, 3823057, 3847851, 3871452, 3896119, 3921623, 3947606, 3975031, 4004355, 4034380, 4064030, 4093612, 4123383, 4152596, 4180856, 4208616, 4235172, 4257794, 4274126, 4284008, 4287681, 4283610, 4269574, 4245111, 4211710, 4171433, 4126245]
57089D126245m8493n1225n4437n8057o1612o5639p1204p8791q8824j02171j18774
57078C327018j37065j56134j76872j99567k22451k44374k66513k89316l10631
57069A324095l29680l49859B70506a29406m23812m46775m72409n01434n33099
57060b506935n69702o14564o67514p27330p96503q78420r72336j077023j196867
57051a0007194j337995j500790j683038j887804k120810k382836k673348k999342
57043b6593157l371747l795496m272518m811378n423342o112885o884875p757639
57035f9023037q755570r895209j1194598j2680837j4350218j6120665j7869503
57028a59889637j9535981k1136765k2631885k3801456k4320506k3984473k2856162
$$ y = [4126245, 4077752, 4026527, 3972090, 3914033, 3852421, 3786782, 3715578, 3636787, 3547963, 3445792, 3327018, 3189953, 3033819, 2856947, 2657380, 2434929, 2190555, 1924042, 1634726, 1324095, 994415, 644556, 270506, -129406, -553218, -999993, -1472402, -1973836, -2506935, -3076637, -3691201, -4358715, -5086045, -5882548, -6760968, -7733304, -8810327, -10007194, -11345189, -12845979, -14529017, -16416821, -18537631, -20920467, -23593815, -26593157, -29964904, -33760400, -38032918, -42844296, -48267638, -54380523, -61265398, -69023037, -77778607, -87673816, -98868414, -111549251, -125899469, -142020134, -159889637, -179425618, -200562383, -223194268, -246995724, -271316230, -295300703, -318156865]
57021c18156865k1200922j9287551j7208564j4818640j1826935q005193l370302
57014d13874972J809482P169750J2388599J7189138K1282200K4385314K6320645
57007c03329844K7080319K6795534K5655693K3853913K1585474J9071058J6556235
57000a42731618J4262644J2324027J0770109R571664Q688495Q071179P641822
56993g1401678P303657O975503O610068O186951N705293N183400M650095M128820
56985b4657891L633343L175564K766891K410607K101126J832821J603679J410099
56977e723761J244954J102279R78655Q69610g58276g9785E17304N25668M61642
56968A504614M04590L56406L16982K84043K56789K35412K17673K00386J83586
$$ y = [-318156865, -339357787, -358645338, -375853902, -390672542, -402499477, -410504670, -413874972, -412065490, -404895740, -392507141, -375318003, -354035803, -329650489, -303329844, -276249525, -249453991, -223798298, -199944385, -178358911, -159287853, -142731618, -128468974, -116144947, -105374838, -95803174, -87114679, -79043500, -71401678, -64098021, -57122518, -50512450, -44325499, -38620206, -33436806, -28786711, -24657891, -21024548, -17848984, -15082093, -12671486, -10570360, -8737539, -7133860, -5723761, -4478807, -3376528, -2397873, -1528263, -758276, -79785, 517304, 1042972, 1504614, 1909204, 2265610, 2582592, 2866635, 3123424, 3358836, 3576509, 3776895, 3960481]
56959C960481J68761J53999J36033J16432J00433Q9564Q0318P0193O0084N0414
56949D986712L9643K7500J5628M486o742j7175k5263l2897m4393o0630p7570r0584
56937D718715r7011r5219q5741p3939o7959p3555r3130j27586j73870k21406k56963
56926C352336k74517k76845k68236k51129k30055k12151k00831j93068j84960
56917A260544j76203j67711j59214j51256j45660j41710j35354E9109e1836r8030
56907a49866q5253p1677n8581m7412l7553k8189k0018j3247o341J385Q183J2587
56895d95982J5302J6748J5127R053L09p764j3160j5350j4476j1839r456p910o120
56882e25518l811k238j754r57P80K282L196N325J0109J6659K3365K9455L3985
$$ y = [3960481, 4129242, 4283241, 4419274, 4535706, 4636139, 4725703, 4806021, 4876214, 4936298, 4986712, 5026355, 5053855, 5069483, 5073969, 5067227, 5050052, 5024789, 4991892, 4947499, 4886869, 4809299, 4718715, 4621704, 4526485, 4440744, 4366805, 4298846, 4225291, 4132161, 4004575, 3830705, 3609299, 3352336, 3077819, 2800974, 2532738, 2281609, 2051554, 1839403, 1638572, 1445504, 1260544, 1084341, 916630, 757416, 606160, 460500, 318790, 183436, 59109, -51836, -149866, -235119, -306796, -365377, -412789, -450342, -478531, -498549, -511796, -518137, -516752, -508569, -495982, -480680, -463932, -448805, -439752, -439443, -447207, -460367, -475717, -490193, -502032, -511488, -519398, -525518, -529329, -531567, -533321, -534278, -533498, -531216, -528020, -522695, -512586, -495927, -472562, -443107, -409122]
56869d09122L5359L3105K8410K2212J4630O702K97m386q626j1934j1931q582n518
56856c19384n484p100p861p783q143q814q965q680q184p000n256m157l972l431
56842d14214k086j177j005P9K688M862N191N139O421Q226R006R136R883J1330
56828c46521J2981J4781J6189J6067J4788J4205J4243J2128O812J443p91p62q00
56815b25237n17J812N474Q161R344J0189J1274J2840J5946K0757K4934K6510K7369
56802e1144b0018A8220M5789N1235N3768N2491M6331L5977K3720J1299l59r723
56790C28748j5216j7175j7335j6278j3180q066k538K036N794R654J4393K0431
56778B91268K7596L5203M3027N1663O1053O9183P3099P0572O0380M2466J9372
$$ y = [-409122, -373763, -340658, -312248, -290036, -275406, -268704, -268407, -272793, -281419, -293353, -305284, -313866, -319384, -324868, -331968, -339829, -347612, -355755, -364569, -373534, -382214, -390398, -397398, -402654, -406811, -410783, -414214, -416300, -417477, -418482, -418403, -415715, -410853, -405662, -400523, -394102, -385876, -376870, -367734, -357851, -346521, -333540, -318759, -302570, -286503, -271715, -257510, -243267, -231139, -224327, -222884, -223675, -224437, -225237, -225754, -223942, -218468, -210307, -200963, -190774, -179500, -166660, -150714, -129957, -105023, -78513, -51144, -20018, 18220, 64009, 115244, 169012, 221503, 267834, 303811, 327531, 338830, 338471, 328748, 313532, 296357, 279022, 262744, 249564, 241498, 238960, 240996, 246790, 256444, 270837, 291268, 318864, 354067, 397094, 448757, 509810, 578993, 652092, 722664, 783044, 825510, 844882]
56767H44882l536k1104l1717l6956l8935l8997l8015l6388l3908l0539k6738k2518
56755D85531j7162j0640m107J760P766J4721K2345L0319L8453M4628M4664L6259
56743F94537K1725N353j0274k3869l3532l8038l8815l8171l6449l3028k8974k6139
56731D14326k4327k1783j8074j4353j1102p663l720M97N183J0474J5331J8306
56719C63095J8830J6504J0355O37r658j7105k1009k2571k2102j9249j5184j2118
56707B70425j0913j0956j1694j2524j2074r763p343o837p853q958j0343j2419
56695A48748j3042r642l721J20j90k429l998m546m301k892q70Q8m65j125r65n96
56679A00174n09l18j72q27j903k012j051l77m27l50k43j431l764n063m220k789
$$ y = [844882, 841346, 820242, 788525, 751569, 712634, 673637, 635622, 599234, 565326, 534787, 508049, 485531, 468369, 457729, 453622, 455382, 463148, 477869, 500214, 530533, 568986, 613614, 658278, 694537, 716262, 721615, 711341, 687472, 653940, 615902, 577087, 538916, 502467, 469439, 440465, 414326, 389999, 368216, 350142, 335789, 324687, 317024, 313304, 313801, 318984, 329458, 344789, 363095, 381925, 398429, 408784, 409421, 399763, 382658, 361649, 339078, 316976, 297727, 282543, 270425, 259512, 248556, 236862, 224338, 212264, 202501, 195158, 188321, 180468, 171510, 161167, 148748, 135706, 126064, 122343, 122463, 122273, 119844, 115846, 111300, 106999, 104107, 103237, 103325, 102860, 101735, 100770, 100174, 99665, 99347, 99175, 98348, 96445, 94433, 93382, 93005, 92578, 92228, 91985, 90554, 86790, 81727, 77507, 74718]
56663G4718k529l214l879m286m199l055j430j145k635l876l097j086L92J071J625
56648D3375J964J590R11Q65J576K319K454J791N34n96o80M52K028L216L746L610
56632F9155K854J841J152J096J659K657L445L148J860R04R23O47j258l942n484
56617H0657n406m516l156j544r25k041l085j710J211K473J143l95j82J137K288
56602F5949K972K819J254q64j653r16l66o40m80N62J251J306K197M100M897L639
56586H6027K377K718L049J432r64j778j135q46j233j206o82n67q35o59k69p97
56570H4632k215k957j835N73K559K844J683P29J438L391M826M788L819K589J210
56555A08074J34J96J180J707J187M81K28m1n44o70m27o99j304p17J247K441J419
$$ y = [74718, 72189, 68975, 65096, 60810, 56611, 53556, 52126, 50981, 48346, 44470, 41373, 40287, 40679, 41750, 43375, 45339, 46929, 47840, 48705, 50281, 52600, 55054, 56845, 57379, 56783, 56103, 56555, 58583, 61799, 65545, 69155, 72009, 73850, 75002, 76098, 77757, 80414, 83859, 87007, 88867, 89771, 90694, 91341, 90083, 86141, 80657, 75251, 70735, 67579, 66035, 65110, 63069, 59984, 58274, 59485, 61958, 63101, 62706, 62524, 63661, 65949, 68921, 71740, 72994, 72130, 70477, 69561, 69195, 68555, 68075, 68637, 69888, 71194, 73391, 77491, 82388, 86027, 88404, 91122, 94171, 95603, 94639, 92861, 91726, 90880, 89647, 88441, 87759, 87192, 86357, 85698, 85429, 84632, 82417, 79460, 77625, 78198, 80757, 83601, 85284, 86013, 87451, 90842, 95668, 100456, 104275, 106864, 108074, 108208, 108404, 109584, 111291, 112478, 112959, 113187, 113146, 112602, 111932, 111505, 110806, 109502, 108785, 110032, 112473, 113892]
56538A13892l73j007r61j695k794k644j086N24J360J664J659J332R42P20M96L56
56522A12385Q75J945K369J595P82J156K343L379M225M931M601K818J183J664L820
56507A50071N337N094M292M510N815P059P355O995P095Q266R730J0269R831R341
56493B51060R143Q770Q136P579O764N252M104M867O671O709M262J872J407J413
56479C28009n6k393m071n303o887q069p832p007o943p124o249m708l993m380n037
56464B47957n620o181o130n041l798l450l678l692l661l874l626k519j649j873
56450A93165k157j469r80k171l914l852j904o2O99J033J148N47k96j73Q71J524
56434A82009J207M21o08k012l159l138k203j311m92Q88K540L488L600L496L348
$$ y = [113892, 113519, 112512, 111551, 109856, 107062, 104418, 103332, 103856, 105216, 106880, 108539, 109871, 110813, 111533, 112029, 112385, 113260, 115205, 117574, 119169, 119951, 121107, 123450, 126829, 131054, 135985, 140586, 143404, 144587, 146251, 150071, 155408, 160502, 164794, 169304, 175119, 182178, 189533, 196528, 203623, 211889, 221619, 231888, 241719, 251060, 260203, 268973, 277109, 284688, 291452, 296704, 300808, 305675, 312346, 319055, 323317, 325189, 326596, 328009, 327953, 325560, 321489, 316186, 309299, 301230, 293398, 286391, 279448, 272324, 266075, 261367, 257374, 252994, 247957, 242337, 236156, 230026, 224985, 221187, 217737, 214059, 210367, 206706, 202832, 199206, 196687, 195038, 193165, 191008, 189539, 188559, 186388, 182474, 178622, 176718, 176656, 177355, 178388, 179536, 180083, 179787, 179614, 180485, 182009, 183216, 183637, 183029, 181017, 177858, 174720, 172517, 171206, 170714, 171602, 174142, 177630, 181230, 184726, 188074]
56419A88074L100L339M364M990L948K030J164J820K905L763M459M671M123L810
56405B36560M877O547P017O196N674O131O670O747O858P108O906O463P010Q945
56391C29709J0854J0945Q818N747L541K927K744J399p01j480l59Q28R83J479L135
56376C80569L878J893r25j673j065k060m963p180p395o879o869p382q348r320
56362C22281q520m941q60N40m89j394j979m176p481q719o966m857m079l314j759
56347B63287j073k081k832j909q60j228j687l33K197L801L608J922q58l647m582
56332B53725l109r92oJ36N95J608K907M410N489M973K971J275J070J621K003K422
56316B81098K919K532J007o7Q23L211N565O941O923N358L105J842K148K772K536
$$ y = [188074, 191174, 194513, 198877, 203867, 207815, 209845, 211009, 212829, 215734, 219497, 223956, 228627, 232750, 236560, 241437, 247984, 255001, 261197, 266871, 273002, 279672, 286419, 293277, 300385, 307291, 313754, 320764, 329709, 340563, 351508, 360326, 366073, 369614, 372541, 375285, 376684, 375983, 374503, 374144, 374972, 375955, 377434, 380569, 384447, 386340, 385415, 383742, 382677, 380617, 375654, 368474, 361079, 354200, 347331, 339949, 331601, 322281, 313761, 308820, 307960, 308500, 308011, 306617, 304638, 300462, 292981, 284262, 277296, 272439, 268360, 265046, 263287, 262214, 260133, 257301, 255392, 254532, 253304, 251617, 251284, 253481, 257282, 260890, 262812, 261954, 258307, 253725, 250616, 249624, 249618, 249754, 250349, 251957, 254864, 259274, 264763, 269736, 272707, 273982, 275052, 276673, 278676, 281098, 284017, 286549, 287556, 287489, 288312, 291523, 297088, 304029, 310952, 316310, 319415, 321257, 323405, 326177, 328713]
56301C28713J694Q83J57k78K46J570K373J952J206J194J740J967J259n16k578
56286C41582l076q28K760N112N750O397P909R234R523R042P787N433L043K494
56272D12162L825N418O872R012J0880J0146P359O344Q832J1869J2366J1323J1292
56259E27700J2358J3070J3247J3414J3071J1753J0482J0336J0814J1040J1181
56248F58466J1271J0351Q205O340N857N928N581N200N097M571L765M246O314P902
56234G49094P721P309Q278R819J0845J2244J4874J7452J8718J9788K2114K4926
56222I23182K6891K8438L0309L1817L2776L5080L9895M5225M8938N2221N7192
56211A351964O2847O6662O8819P1829P6936Q3725R2101J01847J11213J18970J27023
$$ y = [328713, 330407, 331290, 331447, 331169, 331415, 332985, 335358, 337310, 338516, 339710, 341450, 343417, 344676, 344160, 341582, 338506, 337678, 340438, 345550, 351300, 357697, 365606, 374840, 384363, 393405, 401192, 406625, 409668, 412162, 415987, 421405, 428277, 437289, 448169, 458315, 465674, 472018, 480850, 492719, 505085, 516408, 527700, 540058, 553128, 566375, 579789, 592860, 604613, 615095, 625431, 636245, 647285, 658466, 669737, 680088, 688293, 694633, 700490, 706418, 711999, 717199, 722296, 726867, 730632, 734878, 741192, 749094, 756815, 764124, 772402, 782221, 793066, 805310, 820184, 837636, 856354, 876142, 898256, 923182, 950073, 978511, 1008820, 1040637, 1073413, 1108493, 1148388, 1193613, 1242551, 1294772, 1351964, 1414811, 1481473, 1550292, 1622121, 1699057, 1782782, 1874883, 1976730, 2087943, 2206913, 2333936]
56200B333936J38160J52055J66205J79943J94547K10019K24858K38713K52352
56191D090788K65101K75006K81541K85534K86426K82062K71491K55737K35504
56182F529190K10171J79553J44965J08196P0705L3908q95l2826o0889q3856j01730
56171F996492j16390j29459j40539j48832j55265j61281j66615j70230j72410
56162E635471j74155j75352j75551j75616j76664j78060j78272j77015j75034
56153D049752j72517j69357j65902j62008j56611j49754j43445j38680j33420
56144B658058j25661j16809j09438j03363r6728q9619q3531p8339p2779o7156
56134A714635o2691n8806n3960m8556m4265m0949l7039l2561k9051k6601k3659
$$ y = [2333936, 2472096, 2624151, 2790356, 2970299, 3164846, 3374865, 3599723, 3838436, 4090788, 4355889, 4630895, 4912436, 5197970, 5484396, 5766458, 6037949, 6293686, 6529190, 6739361, 6918914, 7063879, 7172075, 7242780, 7276688, 7275793, 7242967, 7182078, 7098222, 6996492, 6880102, 6750643, 6610104, 6461272, 6306007, 6144726, 5978111, 5807881, 5635471, 5461316, 5285964, 5110413, 4934797, 4758133, 4580073, 4401801, 4224786, 4049752, 3877235, 3707878, 3541976, 3379968, 3223357, 3073603, 2930158, 2791478, 2658058, 2532397, 2415588, 2306150, 2202787, 2106059, 2016440, 1932909, 1854570, 1781791, 1714635, 1651944, 1593138, 1539178, 1490622, 1446357, 1405408, 1368369, 1335808, 1306757, 1280156, 1256497]
56123A256497j9731j6048j3515j1919j0948j0216q766o204l670k105o32J631L574
56110A157948L994L952M978O414P028P702R690J1736J1882J0864J0649J0897J0015
56097A267749Q550Q205Q567Q101P412Q129R601J0067J0175J1747J3983J4716J4704
56084A401706J6800K1254K5693K9411L3913L9345M4186M8538N4184O1283O8356
56073A844669P5525Q4441R4966J05023J13478J20154J23548J22046J17096J11834
56063B912780J07071J01734R6322R2012Q7240P9266O8502N7181M4632K8715J1491
56052C686946j710r372j5326k2739l1189m0234n1221o4192p6878q7731r6566j01996
56040C087792j02280r9122r6497r5092r1886q5787p9489p5012p1341o7343o3368
$$ y = [1256497, 1236766, 1220718, 1207203, 1195284, 1184336, 1174120, 1165354, 1159150, 1155480, 1153375, 1152743, 1154374, 1157948, 1161942, 1165894, 1170872, 1177286, 1184314, 1192016, 1201706, 1213442, 1225324, 1236188, 1246837, 1257734, 1267749, 1276299, 1284504, 1293071, 1301172, 1308584, 1316713, 1326314, 1336381, 1346556, 1358303, 1372286, 1387002, 1401706, 1418506, 1439760, 1465453, 1494864, 1528777, 1568122, 1612308, 1660846, 1715030, 1776313, 1844669, 1920194, 2004635, 2099601, 2204624, 2318102, 2438256, 2561804, 2683850, 2800946, 2912780, 3019851, 3121585, 3217907, 3309919, 3397159, 3476425, 3544927, 3602108, 3646740, 3675455, 3686946, 3685236, 3675864, 3660538, 3637799, 3606610, 3566376, 3515155, 3450963, 3374085, 3286354, 3189788, 3087792, 2985512, 2886390, 2789893, 2694801, 2602915, 2517128, 2437639, 2362627, 2291286, 2223943, 2160575]
56029B160575n9214n3932m8059m2891l7759l1459k5637k2680k1185j8013j4015
56018A785731j2508j2783j0782n977j845N25L423O896Q255P809R034J2279J4210
56005A804267J4310J5818J9261K1207K0602K0245K0883K0165J8611K0082K4698
55994B020149K7785K7579K7560K9508L0873L0800L1974L4585L5227L3900L5107
55983B365047L9778M3194M3276M3726M6467M8414M8640N1127N7063O1836O3151
55972B911719O4861O9206P2649P3212P4702P9555Q4534Q7461R1326R7895J04156
55961C811276J08712J14672J22810J29249J33176J39166J48650J57325J64148
55952E029184J73832J86964J97280K02830K09845K21045K30629K35954K43408
$$ y = [2160575, 2101361, 2047429, 1999370, 1956479, 1918720, 1887261, 1861624, 1838944, 1817759, 1799746, 1785731, 1773223, 1760440, 1749658, 1743681, 1741836, 1742361, 1745784, 1752680, 1760935, 1768744, 1777778, 1790057, 1804267, 1818577, 1834395, 1853656, 1874863, 1895465, 1915710, 1936593, 1956758, 1975369, 1995451, 2020149, 2047934, 2075513, 2103073, 2132581, 2163454, 2194254, 2226228, 2260813, 2296040, 2329940, 2365047, 2404825, 2448019, 2491295, 2535021, 2581488, 2629902, 2678542, 2729669, 2786732, 2848568, 2911719, 2976580, 3045786, 3118435, 3191647, 3266349, 3345904, 3430438, 3517899, 3609225, 3707120, 3811276, 3919988, 4034660, 4157470, 4286719, 4419895, 4559061, 4707711, 4865036, 5029184, 5203016, 5389980, 5587260, 5790090, 5999935, 6220980, 6451609, 6687563, 6930971]
55943F930971K56857K71049K82593K96527L15321L32703L45901L62819L89310
55934I784051M20274M51179M86892N30781N76815O21301O70490P27550P84348
55925A5053681Q35952Q90724R55982J026471J097079J173087J256882J339236
55917B3629094J415922J498501J596664J705516J822432J958509K118772K289591
55909C8035001K461727K646962K856159L082985L328288L616729L967616M374542
55901F4370009M838312N392844O071769O881878P843531R022561J0480040J2225762
55893A27126706J4270386J6687058J9569073K2975028K6964484L1538475L6271880
55886B95403090L9924645M0645909L6882985K8320893J6133086K501708j0160169
$$ y = [6930971, 7187828, 7458877, 7741470, 8037997, 8353318, 8686021, 9031922, 9394741, 9784051, 10204325, 10655504, 11142396, 11673177, 12249992, 12871293, 13541783, 14269333, 15053681, 15889633, 16780357, 17736339, 18762810, 19859889, 21032976, 22289858, 23629094, 25045016, 26543517, 28140181, 29845697, 31668129, 33626638, 35745410, 38035001, 40496728, 43143690, 45999849, 49082834, 52411122, 56027851, 59995467, 64370009, 69208321, 74601165, 80672934, 87554812, 95398343, 104420904, 114900944, 127126706, 141397092, 158084150, 177653223, 200628251, 227592735, 259131210, 295403090, 335327735, 375973644, 412856629, 441177522, 457310608, 459812316, 449652147]
55879D49652147j9950948k6012455k8623535k8758518k7445859k5424483k3187787
55872B70248562k1091064j9320033j7860745j6606783j5488972j4484709j3563931
55865A51832325j2688325j1844673j1037980j0261767r499363q740640p978798
55858G9780779p207304o438334n708515n049408m465063l949305l505764l135433
55850D0321653k821938k546707k306184k100328j918014j748339j594181j460678
55842B3825284j341521j229516j129484j047816r79214r15979q60569q16850p78159
55833A4726176p36018o92582o53323o15243n73304n31112m94688m62412m30802
55824I536692m03238l83212l65627l44521l23216l07605k95419k81310k66752
$$ y = [449652147, 429701199, 403688744, 375065209, 346306691, 318860832, 293436349, 270248562, 249157498, 229837465, 211976720, 195369937, 179880965, 165396256, 151832325, 139144000, 127299327, 116261347, 105999580, 96500217, 87759577, 79780779, 72573475, 66135141, 60426626, 55377218, 50912155, 46962850, 43457086, 40321653, 37499715, 34953008, 32646824, 30546496, 28628482, 26880143, 25285962, 23825284, 22483763, 21254247, 20124763, 19076947, 18097733, 17181754, 16321185, 15504335, 14726176, 13990158, 13297576, 12644253, 12029010, 11455706, 10924594, 10429906, 9967494, 9536692, 9133454, 8750242, 8384615, 8040094, 7716878, 7409273, 7113854, 6832544, 6565792]
55815F565792k55799k46455k35052k24125k17401k11871k03114j93716j88297
55806D589962j84823j78867j72017j67932j64232j56480j46548j39222j33675
55797C146166j25729j15544j06076r6725q5296p3624o4981n8587n2379m8202m8468
55786B270555n0834n1786n2167n3696n3772m9728m4670m2839m2517l9828l6278
55775A752440l5898l7665l7483l5570l5525l7615l8921l8711l8382l7504l4864
55764A344302l1909l0803l0749l0130k9811l0417k9414k5221k1079k0219k0548
55753A044002j8928j6947j7066j6715j2401o578m017l987k503L9K04j452j384
55740I42267J90J0j820k384k052l969p975j0922j2541j5197j8206j8259j5639
$$ y = [6565792, 6309993, 6063538, 5828486, 5604361, 5386960, 5175089, 4971975, 4778259, 4589962, 4405139, 4226272, 4054255, 3886323, 3722091, 3565611, 3419063, 3279841, 3146166, 3020437, 2904893, 2798817, 2702092, 2616796, 2543172, 2478191, 2419604, 2367225, 2319023, 2270555, 2219721, 2167935, 2115768, 2062072, 2008300, 1958572, 1913902, 1871063, 1828546, 1788718, 1752440, 1716542, 1678877, 1641394, 1605824, 1570299, 1532684, 1493763, 1455052, 1416670, 1379166, 1344302, 1312393, 1281590, 1250841, 1220711, 1190900, 1160483, 1131069, 1105848, 1084769, 1064550, 1044002, 1025074, 1008127, 991061, 974346, 961945, 955367, 951350, 947363, 944860, 944899, 945103, 943651, 942267, 942457, 942467, 940647, 938263, 936211, 932242, 924267, 913345, 900804, 885607, 867401, 849142, 833503]
55727H33503j4437j6084j7787j7760j7269j6955j5714j3764j2661j1913r541o188
55715F63430m751n778o987p487q633j0658j2120j2845j3994j5301j5357j4359
55703E35160j3405j1897r010o701p382r558r873q596q822j0823j1860j1278j1144
55690D04811j1718j0872q554p364p877p466m798j935q91j298k229l376l902l026
55676C29505k157l395n752n909k999K94J674J374J90j508k651k213j366k272m727
55661B98088o545o905o576n537l447j865k527l978l449j573j346k776k729r3L018
55646B51760N443Q020R984Q823M836J912K291M055M949N207N304M408K584J585
55632C21161K043K562K442K549K737J614l48p87M79Q19o35j309K81J866J234l95
$$ y = [833503, 819066, 802982, 785195, 767435, 750166, 733211, 717497, 703733, 691072, 679159, 669618, 663430, 658679, 652901, 645914, 638427, 629794, 619136, 607016, 594171, 580177, 564876, 549519, 535160, 521755, 509858, 500848, 494147, 486765, 477207, 467334, 458738, 449916, 439093, 427233, 415955, 404811, 393093, 382221, 373667, 366303, 358426, 350960, 346162, 344227, 343336, 342038, 339809, 336433, 332531, 329505, 327348, 323953, 318201, 312292, 309293, 309587, 311261, 312635, 312825, 311317, 308666, 306453, 305087, 302815, 298088, 291543, 284638, 278062, 272525, 269078, 267213, 264686, 260708, 257259, 255686, 254340, 251564, 248835, 248742, 251760, 257203, 265223, 275207, 284030, 288866, 290778, 293069, 297124, 302073, 307280, 312584, 316992, 319576, 321161, 323204, 325766, 328208, 330757, 333494, 335108, 334760, 333973, 334452, 335271, 334636, 333327, 333608, 335474, 336708, 336313]
55616C36313r74r07j404j943j580r57r47j014n38k13o38j028o43o2N2k5r3m99
55598C22900q93k78J065J526O72j56j91j66l58OO71M4k231m550o054p693r804
55581B94510j0999j0575r736r383q859p960p837q777r249q385p384p297p542p541
55567A72986p740p898o664m005j964j756k261k465l066m398n133m481l562l097
55553A14496k049n0J067K8j674k195j975k165k304j610r35j370k215k217j608
55538I3224j176o37L58Q37r4j468j755j102q09j363k191k602k050l67J465J922
55522H2192J056O41J551K519K420J923J791J365K32k59J173L628N203N211M145
55507A14791K695J872K668M379M759L051J199Q78J035O8j388j790j442j815k975
$$ y = [336313, 335339, 334432, 333028, 331085, 329505, 328548, 327601, 326587, 326049, 325836, 325198, 324170, 323527, 323465, 323517, 323492, 323399, 322900, 322007, 321729, 322794, 324320, 324992, 324836, 324645, 324479, 324121, 324127, 324798, 324842, 322611, 318061, 312007, 304314, 294510, 283511, 272936, 263200, 253817, 244958, 236998, 229161, 220384, 211135, 202750, 195366, 188069, 180527, 172986, 165246, 157348, 150684, 146679, 144715, 142959, 140698, 138233, 135167, 130769, 125636, 121155, 117593, 114496, 112447, 112397, 113464, 113492, 111818, 109623, 107648, 105483, 103179, 101569, 100634, 99264, 97049, 94832, 93224, 92048, 91411, 91769, 92606, 92512, 91044, 89289, 88187, 87378, 86015, 83824, 81222, 79172, 78805, 80270, 82192, 83248, 83889, 85440, 87959, 90379, 92302, 94093, 95458, 95690, 95431, 96604, 100232, 105435, 110646, 114791, 117486, 119358, 122026, 126405, 131164, 134215, 135414, 136292, 137327, 137395, 136007, 134217, 132775, 130960, 127985]
55492A27985l573k806r34J402L140L061J421L00R86K031J413m30j370o90L33M19
55476A32688m66j632k263j823o52K40N83J237K614L650L079R24j834m020m367
55461A27958k279P94K188J028r57k189l000l844l866k729k011l020m685n325n155
55446I2908n382o010o237o068n852n192l749k374j925j927j634j485k155k999
55432C9919k835j491L70K074K761J672m33j609j429j601k886l484k143o51j054
55417B7180k344k436j807k262l361l108j570p55j150j232n02k91j023j069O79
55402D949K953L791K843J179l07j527k711l709C647A077B83r8f97j646r44P75
55386b512e15A518J343P47Q39J446J335m36k619A308B27K79ok18R88K059J278
$$ y = [127985, 124412, 121606, 120672, 122074, 125214, 128275, 129696, 129996, 130982, 133013, 134426, 133996, 132626, 131936, 132269, 132688, 132222, 130590, 128327, 126504, 125852, 126092, 126675, 127912, 130526, 134176, 137255, 138179, 136345, 132325, 127958, 125679, 126473, 128661, 129689, 128732, 126543, 123543, 119699, 115833, 113104, 111093, 108073, 103388, 98063, 92908, 87526, 81516, 75279, 69211, 63359, 58167, 54418, 52044, 50119, 48192, 46558, 45073, 42918, 39919, 37084, 35593, 35963, 38037, 40798, 42470, 42037, 40428, 38999, 37398, 34512, 31028, 28885, 28234, 27180, 24836, 22400, 20593, 18331, 14970, 11862, 10292, 9537, 8387, 7155, 6653, 6362, 5339, 4270, 4949, 7902, 11693, 14536, 15715, 15408, 13881, 11170, 7461, 3647, 1077, 283, 185, -697, -2343, -3287, -2512, -515, 1518, 2861, 3608, 4447, 5893, 7228, 6792, 4173, 1308, 227, 506, 500, 282, 1270, 3329, 4607]
55369D607j74k76N25N94J84O25J494J325L53J17P89J136P09J04m70j098j275p16
55351H553k65l60J82K033L425K528N08k69J60J71j91K80J164J128P15J350K163
55334B3275J029j533k782k013j255j579j879j580j450j354k42J160P47j222j936
55319G386l67J226J166N84N73J90j105j750o97O69R80J051J832K362J641O21M03
55302A6765K38q41k062k520l036D163i72l680j079K73J00k5L43J04r69j639j289
55285h833r02j329j956j720n14Q48J638J764J636J647J766J689J402J083N88m05
55269a598j570k067j780j575j927k077j260r0K07m99j079o51L36P74L21r9N85
55252a4049K094K922K161O03m45p89j006j122p35l4M67Q88J597K109J683Q13O75
$$ y = [4607, 4433, 4157, 4682, 5276, 5460, 6085, 7579, 8904, 9257, 9374, 10163, 11299, 12008, 12112, 11642, 10544, 9269, 8553, 8288, 7928, 8110, 10143, 13568, 16096, 16604, 16335, 16495, 16666, 16475, 16755, 17919, 19047, 19762, 21112, 23275, 24304, 22771, 19989, 17976, 16721, 15142, 13263, 11683, 10233, 8879, 8637, 9797, 10544, 9322, 7386, 7019, 8245, 9411, 9995, 10568, 10758, 9653, 7903, 7206, 7875, 8855, 9906, 11738, 14100, 15741, 16362, 16765, 17003, 16162, 14100, 11580, 8544, 4163, -972, -4652, -5731, -5458, -5358, -5383, -5040, -4936, -5905, -7544, -8833, -9735, -11064, -13020, -14740, -15254, -14406, -12768, -11004, -9368, -7721, -5955, -4266, -2864, -1781, -1193, -1598, -3168, -5235, -7015, -8590, -10517, -12594, -13854, -13944, -13737, -14236, -15315, -15966, -15630, -14856, -14535, -14634, -14049, -11955, -9033, -6872, -6269, -6714, -7503, -8509, -9631, -10366, -10400, -9933, -9045, -7448, -5339, -3656, -2843, -2168]
55235b168i79A46K80A79C3e83k158l227k304j37J214R19j13p35n75J94J308K453
55217c744e33B591K116R17N54J051J150K0j456k002j844A091a243j799n37J66
55201c413%O1Q64i52D23P41p8c03k938l569k719j171K44J517K548K621J529J73
55183b068n85q48r46q08n35n75q33n20O21J877K607A54K162N73j136B45c38L0
55165c08j85a40B425M612M135J561m87n64L25O18L6o52q10n22k56k26k42k46n45
55146I162j014p52O68J987J600j79j475j329m13O05J674K273J443m84j815j679
55130A0272q81k11N06J122P42o15j421o99O49J316J100L44o80j186l09J170J327
55113A2546N8n13M84J094r2j414j026j08o28j631p34J718K999K131R27Q31J205
$$ y = [-2168, -979, 146, 426, 179, 33, -583, -2741, -5968, -8272, -8409, -7195, -6276, -6389, -7124, -7699, -7505, -6197, -3744, -533, 2591, 4707, 5624, 6178, 7229, 8379, 8399, 6943, 4941, 3097, 1091, -1243, -3042, -3579, -3413, -3413, -3352, -2488, -952, 423, 1164, 1086, -303, -3241, -6810, -9529, -10700, -10456, -8939, -6391, -3770, -2241, -2068, -2653, -3501, -4447, -5255, -5790, -6365, -7198, -7718, -7097, -5220, -2613, 154, 2316, 2889, 1753, 245, -338, -308, -493, -140, 2425, 7037, 11172, 12733, 12246, 11682, 12007, 12625, 12661, 12009, 11199, 10677, 10421, 10195, 9953, 9707, 9162, 8148, 7396, 8064, 10051, 11651, 11472, 9997, 8668, 8255, 8860, 10534, 12807, 14250, 13766, 11951, 10272, 9391, 9180, 9686, 10808, 11550, 10935, 9514, 8815, 9464, 10780, 11880, 12224, 11544, 10358, 10049, 11219, 12546, 12604, 12091, 12575, 13669, 13577, 12163, 11137, 11029, 10401, 8770, 8036, 9754, 12753, 14884, 15811, 16642, 17847]
55096A7847J057M45l83j544k675k933k202j129Q0J563K489J495j098k912k167
55081G933K20J953J926Q37j52n85p05r06j326j768j860j243J70J760K242Q20j588
55064G728l014B126H49j71R15K528M108M496L408J655J29p28p53M7J465L179M562
55047B5689M586K721J16j121l33R38J058J47p06r13l76Q87K172K222J003L11J417
55030C9818L073L215J925J101J577K150J536K7j120j201n87r1J3K40Q05O93j077
55013E2097l349l546j023J848K822K421K281K456K011J067L44m47j857k942k199
54998E1984n6J389J154L00J6J65J25r3m6M94J245J440L81j518k787k603j804j531
54980D8255j573j064m9O02L89n56j762k294j315L62N38j314k658j205J603K523
$$ y = [17847, 18904, 19349, 18966, 17422, 14747, 11814, 9612, 8483, 8563, 10126, 12615, 14110, 13012, 10100, 7933, 8153, 10106, 12032, 12869, 12717, 12132, 11427, 10521, 9195, 7427, 5567, 4324, 4494, 6254, 8496, 9316, 7728, 4714, 2126, 849, 678, 1593, 4121, 8229, 12725, 16133, 17788, 17917, 17189, 16436, 16483, 17948, 21127, 25689, 30275, 32996, 33112, 31991, 31658, 32596, 33654, 33801, 33095, 32182, 31806, 32693, 34865, 37087, 38090, 38401, 39818, 42891, 46106, 48031, 49132, 50709, 52859, 54395, 54422, 53302, 52101, 51514, 51423, 51436, 51676, 52481, 53174, 52097, 48748, 45202, 44179, 46027, 48849, 51270, 53551, 56007, 58018, 59085, 59429, 58982, 57125, 54183, 51984, 51928, 53317, 54471, 54771, 54787, 54952, 55077, 54984, 54938, 55432, 56677, 58117, 58498, 56980, 54193, 51590, 49786, 48255, 46682, 45618, 45569, 46171, 46560, 46004, 44242, 41948, 40633, 40995, 41533, 40219, 37561, 36356, 37959, 40482]
54964D0482J004o02p36j51K04M93Q43P83L40K50P98J617K624L749L968K404K19
54947E8289m07O70J403O99k90l50J41M40O15O83J32r26j421r04k25JK07M89j29
54928E9117k033l832l936k488q03L99J261J864J937J329M30J90J437L609M705
54913F3186L494J503J287K907L892K908J505J501K499L061K919K728K745K976
54899I9111L719M983O097O753P447Q179P916O459N680P456J1203J4780J7111J8477
54885B25371J8889J7937J5984J3911J1588Q084L630j14k238l792o084q707j0291
54872B84168j0630j0894j1768j2372j1590r810q495q225q013p038o094o373p365
54859A65501p266n518l618k857k566j514nQ78J526L603P360J0643J1421J0376
$$ y = [40482, 41486, 40884, 40148, 39997, 40201, 40694, 41537, 42320, 42660, 42910, 43708, 45325, 47949, 51698, 55666, 58070, 58289, 57882, 58552, 59955, 60654, 60364, 60014, 60155, 60595, 61210, 61893, 62025, 61099, 59678, 58774, 58549, 58550, 58757, 59246, 59117, 57084, 53252, 49316, 46828, 46025, 46424, 47685, 49549, 51486, 52815, 53245, 53435, 54872, 58481, 63186, 66680, 68183, 69470, 72377, 76269, 79177, 80682, 82183, 84682, 87743, 90662, 93390, 96135, 99111, 102830, 107813, 113910, 120663, 128110, 136289, 144205, 150664, 156344, 163800, 175003, 189783, 206894, 225371, 244260, 262197, 278181, 292092, 303680, 311764, 315394, 315280, 313042, 309250, 303166, 294459, 284168, 273538, 262644, 250876, 238504, 226914, 217104, 208609, 200384, 192371, 185333, 179239, 172866, 165501, 158235, 152717, 149099, 146242, 143676, 142162, 142157, 143035, 144561, 148164, 155524, 166167, 177588, 187964]
54845A87964R880J0958J2412J2938J2769J2673J2362J0888Q186N078J879j886
54833B96101o132r674j1559j2190j2480j2582j2134j1281j0608j0301j0065r666
54821A67429r098q376p618p027o565o010n547n659o058n603l946k348j986k297
54807H9291k039j195n13R7J116J861J123p06j819j551j166j712k596k907k819
54792G4465k806k517j439M0J052J300J003K29j089k617l629l652k848j741o13
54777E5138P05K218L100K267j6j857j687k2J397J639R49j78j213j295Q1K118L503
54760F6847L959M105M036L183J533l8p18k75J103K676L306K822K656L928N460
54745A04583N369M039L624M714N669N537N502O765Q809J0734J2590J4443J5441
$$ y = [187964, 197844, 208802, 221214, 234152, 246921, 259594, 271956, 282844, 291030, 296108, 297987, 296101, 289969, 280295, 268736, 256546, 244066, 231484, 219350, 208069, 197461, 187160, 177095, 167429, 158331, 149955, 142337, 135310, 128745, 122735, 117188, 111529, 105471, 99868, 95922, 93574, 91588, 89291, 87252, 86057, 85544, 85641, 86757, 88618, 89741, 89035, 87216, 85665, 84499, 82787, 80191, 77284, 74465, 71659, 69142, 67703, 67743, 68795, 70095, 71098, 71327, 70238, 67621, 63992, 60340, 57492, 55751, 55138, 55843, 58061, 61161, 63428, 63412, 61555, 59868, 59846, 61243, 62882, 63831, 63653, 62440, 61145, 61226, 63344, 66847, 70806, 74911, 78947, 82130, 83663, 83625, 82907, 82632, 83735, 86411, 89717, 92539, 95195, 99123, 104583, 109952, 113991, 117615, 122329, 127998, 133535, 139037, 145802, 154611, 165345, 177935, 192378, 207819]
54732B07819J5045J4103J3708J3855J3952J3726J2825J0511O762K818q5k034l745
54719C19260n349o542p368q118q760q984q482p120n228l729l278l385l120k592
54705B37205k663l293l413k609j630r44RJ743L935N989P439P775P038O622Q074
54690B71277J1073J3915J5978J7965J9736K0053J8812J7287J5512J1831O232J628
54678D41299O9k99k529o597j0012j1577j2364j3441j4542j4983j4551j3505j2447
54665C14521j2000j2182j2564j3102j3864j3855j1784q414o312o403o680n473
54653A91888l944l737m179l816l166l528m338l955k355p64O04K223L259K270j94
54638A66268j835j582n58L8L25P00R54Q68P55R86J530J909J351l72j901j244J451
$$ y = [207819, 222864, 236967, 250675, 264530, 278482, 292208, 305033, 315544, 322306, 325124, 325039, 323005, 319260, 313911, 307369, 300001, 291883, 283123, 274139, 265657, 258537, 253309, 249580, 246302, 242917, 239797, 237205, 234542, 231249, 227836, 225227, 223597, 222653, 222662, 224405, 228340, 234329, 241768, 249543, 256581, 263203, 271277, 282350, 296265, 312243, 330208, 349944, 369997, 388809, 406096, 421608, 433439, 439671, 441299, 441368, 441069, 438540, 431943, 421931, 410354, 397990, 384549, 370007, 355024, 340473, 326968, 314521, 302521, 290339, 277775, 264673, 250809, 236954, 225170, 216756, 210444, 204041, 197361, 191888, 187944, 184207, 180028, 176212, 173046, 169518, 165180, 161225, 158870, 158106, 158710, 160933, 164192, 166462, 166268, 164433, 162851, 162293, 162331, 162656, 163356, 164310, 165178, 165933, 166919, 168449, 170358, 171709, 171337, 169436, 168192, 169643]
54621A69643L483L062J632J188J015n56k540k339J00K109K260J956K687M025M975
54606A92700N301M962L914L011L455M930N821N660N710O744P884Q218P979P533
54592B73822O653N422M469L811K840J880K150L564M258L256K132K832N085P156
54578C29330Q144Q446Q645R129J0239J1817J3068J3466J3358J3011J1785Q993
54566D59431N058J135k049m408o159p756r716j1898j3394j3650j3186j2732j2120
54553C58556j0795r019p801p673q070q044p235o056n082m372l493k270j198p96
54539B76652p48l33L13R1j548l538m278l524k742l341m980o007n605m796m997
54524B30619o085o775o523n873n027l571k105k467n148p842q020o117m596m617
$$ y = [169643, 173126, 176188, 177820, 179008, 180023, 179467, 176927, 174588, 174688, 176797, 179057, 181013, 183700, 187725, 192700, 198001, 202963, 206877, 209888, 213343, 218273, 224094, 229754, 235464, 242208, 250092, 258310, 266289, 273822, 280475, 285897, 290366, 294177, 297017, 298897, 301047, 304611, 308869, 312125, 314257, 317089, 322174, 329330, 337474, 345920, 354565, 363694, 373933, 385750, 398818, 412284, 425642, 438653, 450438, 459431, 464489, 465624, 463575, 459167, 453008, 445252, 435536, 423638, 410244, 396594, 383408, 370676, 358556, 347761, 338742, 330941, 323268, 315198, 307154, 299919, 293863, 288781, 284409, 280916, 278646, 277448, 276652, 275904, 275571, 275884, 275975, 274427, 270889, 266611, 263087, 260345, 257004, 252024, 246017, 240412, 235616, 230619, 224534, 217759, 211236, 205363, 200336, 196765, 194660, 192193, 187045, 179203, 171183, 165066, 160470, 155853]
54510A55853n326n904o323o128m404j586K34l00k102k959j829N28K471K605O85
54495A25515j988l544l243k040j297j346j453q79K16Q88M92m03o18J57J112J669
54479A13238K097K522K340J393O35Q25J568K345L342M318M221L258L638O410R037
54464A61187Q590O140N234O634P651O582M705L377K075L31q45q33q26k041l962
54449B03999n348n791n446m450l412l313m285n434o101o240n606m055k602k419
54435A39497k804k211j201j906m163n039l236j179j222k403k728k323k167j669
54421A05246K6J822K101J220O08M83M90J303L323M843M016J907J167K111K496
54406A33162J110q23j911k119j701m97J045J764J275M37L8P3M43J157J592R16
$$ y = [155853, 150527, 144623, 138300, 132172, 127768, 126182, 126416, 126116, 124014, 121055, 119226, 119754, 122225, 124830, 125515, 123527, 119983, 116740, 114700, 113403, 112057, 110604, 109725, 109941, 110829, 111321, 110918, 110300, 110457, 111569, 113238, 115335, 117857, 120197, 121590, 122225, 123050, 124618, 126963, 130305, 134623, 138844, 142102, 145740, 152150, 161187, 169777, 175917, 181151, 187785, 195436, 202018, 206723, 210100, 212175, 212506, 211661, 210828, 210002, 207961, 203999, 198651, 192860, 187414, 182964, 179552, 176239, 171954, 166520, 160419, 154179, 148573, 144518, 141916, 139497, 136693, 134482, 133281, 131375, 127212, 122173, 118937, 117758, 116536, 114133, 111405, 109082, 106915, 105246, 105272, 107094, 109195, 110415, 111023, 111506, 111996, 113299, 116622, 121465, 125481, 127388, 128555, 130666, 133162, 134272, 133449, 131538, 129419, 127718, 127221, 128266, 130030, 131305, 131742, 131780, 131853, 132296, 133453, 135045, 135961]
54390A35961m71j103m38M54O34N06O59M49j144l740n533n208l371j798j492j826
54374A12539j815j667k232l158k866r46Q28Q77J81Q60K979M350L443J143o12q08
54358A13096K90J744K475J985R72P52J702K832L121K776K664K851K495J300M56
54343A41511J395L701N245M822L773L981N062N132M044L804N299O621N785L694
54329B03869K857M087N967O965O719N685M699M580N118M878K977N64n67m01m60
54314B57537j462k591l176l756n037o696p700p470o488n881o219o592n566l311
54300A85592j986l181n750p167o449m647k887j367j48L32j0n04m26L10J227J761
54284A54700J721J522J686K046K028J837K388L735M739M980N559O908P293N180
$$ y = [135961, 135490, 134387, 133949, 134403, 135037, 135543, 136202, 136651, 135507, 131767, 126234, 121026, 117655, 115857, 114365, 112539, 110724, 109057, 106825, 103667, 100801, 99855, 100683, 101560, 101741, 102601, 105580, 109930, 113373, 114516, 113904, 113096, 113386, 115130, 117605, 119590, 120562, 121314, 123016, 125848, 128969, 131745, 134409, 137260, 139755, 141055, 141511, 142906, 146607, 151852, 156674, 160447, 164428, 169490, 174622, 178666, 182470, 187769, 194390, 200175, 203869, 206726, 210813, 216780, 223745, 230464, 236149, 240848, 245428, 250546, 255424, 258401, 258965, 258398, 257997, 257537, 256075, 253484, 250308, 246552, 241515, 234819, 227119, 219649, 213161, 207280, 201061, 194469, 188903, 185592, 183606, 180425, 174675, 167508, 161059, 156412, 153525, 152158, 152010, 152342, 152332, 151828, 151402, 151712, 152939, 154700, 156421, 157943, 159629, 161675, 163703, 165540, 167928, 171663, 176402, 181382, 186941, 193849, 201142, 206322]
54270B06322J958L20P02J400J645K259L313L524K403R77k13j920m302n923n741
54255B06724m704m234m318m149l795m047n146o506p438p612p050o132n262m526
54241A31805l965l986m672m979l731j510k27o44j616k152k666l462l486j864L72
54226I3217J508J352R18M38o91k204k701j534R9O07j92j281j896j949j274N56
54210H4973L206N050M568K199P7k49P99J749J684N89r53j874j279K80R61o0j251
54193A00469q63M57P18l43r73j56J222K124K562K575J589l74k141k812k742k425
54177I8887j595k20O62J73j051j695j449j077j189j627j792j101N08K279L299
54162I3012L522L445K773O69k306l941l006r66O5L1L74J435K066J545N26j16k39
$$ y = [206322, 208280, 208600, 209302, 210702, 212347, 214606, 217919, 221443, 223846, 224823, 224610, 222690, 218388, 212465, 206724, 202020, 197786, 193468, 189319, 185524, 181477, 176331, 169825, 162387, 154775, 147725, 141593, 136331, 131805, 127840, 123854, 119182, 114203, 110472, 108962, 108735, 108091, 106475, 104323, 101657, 98195, 94709, 92845, 93217, 94725, 96077, 96995, 97433, 96742, 94538, 91837, 90303, 90402, 91009, 90817, 89536, 87640, 85691, 84417, 84973, 88179, 93229, 97797, 99996, 100073, 99824, 100623, 102372, 104056, 104645, 103692, 101818, 100539, 100819, 101780, 101720, 100469, 99606, 100063, 100781, 100438, 99465, 99309, 100531, 102655, 105217, 107792, 109381, 109007, 106866, 104054, 101312, 98887, 97292, 97072, 97734, 97907, 96856, 95161, 93712, 92635, 91446, 89819, 88027, 86926, 87434, 89713, 93012, 96534, 99979, 102752, 103421, 101115, 97174, 94168, 93202, 93267, 93298, 93672, 95107, 97173, 98718, 99244, 99128, 98889]
54145I8889p0L00P10P84L64j46j25N64J085J46k372m509l890p33J951J814r1r56
54127I3715K16J983K771K446J679J016P56Q45P09j28j175j460p95J17O47O22j06
54110A03858j409k305j725p3J001P10L1J4K61j91j178j580q26M74J337J317O85
54093A00401R9m4j07q42k283l457l456k385q65R19L014M830N304M027J639q13
54077A05981k464k717j533J79J071O19n32j521j997j763o16R21J488M83p84o17
54061I6198P01J241K09r85q80NK46l21o78m62m43j116j834j753r16qM79M91K40
54042I0414J60O97J702K248J539n3j313j563j203q18l59K46K37j178l209l824
54026H3723k241o0Q49P15R65J620J316k06j324p53P85J911K334K437K117J157
$$ y = [98889, 98819, 99119, 99829, 100613, 100977, 100831, 100706, 101270, 102355, 102501, 100129, 95620, 91730, 90997, 92948, 94762, 94671, 93715, 93931, 95914, 98685, 101131, 102810, 103826, 104582, 105427, 106136, 106008, 104833, 103373, 102578, 102695, 103342, 103964, 103858, 102449, 100144, 98419, 98346, 99347, 100057, 100088, 100102, 100363, 100172, 98994, 97414, 96588, 97062, 98399, 99716, 100401, 100500, 100456, 100349, 99507, 97224, 93767, 90311, 87926, 87061, 87980, 90994, 95824, 101128, 105155, 106794, 105981, 103517, 100800, 99267, 99446, 100517, 101136, 100604, 99083, 97086, 95323, 94707, 95628, 97116, 97599, 96815, 96198, 96899, 98140, 98349, 97364, 96484, 96489, 96735, 96414, 95736, 95274, 94831, 93715, 91881, 90128, 89212, 89204, 89683, 90174, 90414, 90574, 91271, 92973, 95221, 96760, 96707, 95394, 93831, 92628, 91810, 91451, 91697, 91934, 90756, 87547, 83723, 81482, 81422, 82271, 82986, 83951, 85571, 86887, 86681, 85357, 84604, 85389, 87300, 89634, 92071, 94188, 95345]
54010I5345R1l26o3N02J323K248K598J963R06K0j029k495l304k206J42J581R78
53993I8274p22j801j239Q55L289M433L735K453K030K291K297K149K473K653J624
53978A24794J55K72K233M141M938N615O764P056N566L728L446M509N530O343P750
53963A92840R512J0241R174O989M977M133M708N910O452O030N634N798N447L522
53949B81367J025Q5J235K821L028J554p06k759m020m342l872k818j416k21K1r57
53933B70025k596l945m070k391O08L016L057J280JK19N18l49j441j362n50k50
53917B61770l75k07l21j797l881m576l591k851l558m330l088K07L412M363K773
53902B43950L32j079j373k077l874n265m657k803j719j701j243L02J705J894J391
$$ y = [95345, 95436, 95110, 95047, 95549, 96872, 99120, 101718, 103681, 104587, 104607, 103578, 101083, 97779, 95573, 95715, 97296, 98274, 97552, 95751, 94512, 95367, 98656, 103089, 106824, 109277, 111307, 113598, 115895, 118044, 120517, 123170, 124794, 124949, 125221, 127454, 131595, 136533, 142148, 148912, 155968, 161534, 165262, 168708, 173217, 178747, 185090, 192840, 202352, 212593, 221767, 228756, 233733, 237866, 242574, 248484, 254936, 260966, 266600, 272398, 277845, 281367, 282392, 282477, 283712, 286533, 289561, 291115, 290409, 287650, 283630, 279288, 275416, 272598, 271182, 270961, 270982, 270025, 267429, 263484, 259414, 257023, 257631, 260647, 263704, 264984, 264985, 265204, 265722, 265373, 263932, 262570, 262020, 261770, 261395, 261188, 260867, 259070, 255189, 250613, 247022, 244171, 240613, 236283, 233195, 233402, 236814, 241177, 243950, 244282, 243203, 241830, 239753, 235879, 230614, 225957, 223154, 221435, 219734, 218491, 218793, 220498, 222392, 223783]
53887B23783J233J682K453L094K882J602P18K253N944Q963R369Q444Q506R687
53873B90613J0389J0087R946J0816J2040J2551J2172J1471J0833R869P716M127
53861D12630M81r41O80L441M493L022P51k39N07J994L097L364L043K767L022L714
53845D45826M285M361M141M049M151M041L318K062P23m28j501k512k994k557j724
53830D65241j707l027m818n835n876n789o292p265q149q511q173p205o137n734
53816C80723o211o885p085p117p732q682q665p162n474n224o273p146p151p041
53802B82875p503q122q217p709o747n301l756l106l813n063n759n711n262m473
53788B02333l464k885l115l525l411l095l078k883j952j046j261k062k065j483
$$ y = [223783, 225016, 226698, 229151, 232245, 235127, 236729, 237447, 239700, 245644, 254607, 263976, 272420, 280926, 290613, 301002, 311089, 321035, 331851, 343891, 356442, 368614, 380085, 390918, 400787, 408503, 412630, 413111, 412170, 412850, 416291, 420784, 423806, 424557, 424318, 424825, 426819, 429916, 433280, 436323, 439090, 442112, 445826, 450111, 454472, 458613, 462662, 466813, 470854, 474172, 476234, 476957, 476529, 475028, 472516, 469522, 466965, 465241, 463534, 460507, 455689, 449854, 443978, 438189, 431897, 424632, 416483, 407972, 399799, 392594, 386457, 380723, 374512, 367627, 360542, 353425, 345693, 337011, 328346, 321184, 315710, 310486, 304213, 297067, 289916, 282875, 275372, 267250, 259033, 251324, 244577, 239276, 235520, 232414, 228601, 223538, 217779, 212068, 206806, 202333, 198869, 195984, 192869, 189344, 185933, 182838, 179760, 176877, 174925, 173879, 172618, 170556, 168491, 167008]
53774A67008j818k988k916p29J617K018Q80j51o74j163j407j048r44k100l618
53759A51967l476j314J090K270K525K636K531J966J442J567K072K209J842J591
53745A70918J989K824L212K330L43j434j582J23K747N248P031P696P193O363O360
53730B21361P116P160N603L564K871L831N157N747N572N027M393M038M182M222
53716B89844L057N95j743k585k136j672k001l017m238n080m903l692k540k559
53702B57330l287l126j574n2lj078k000k538l480m896n642m951l520k516k056
53687B16611j497p81n48r21j092o32m37j513l234l886k921j597j035q24k94J7
53671A95416n79j216n08J052J489L82l19Q58K823L727L525L414L684L751L650
$$ y = [167008, 165190, 162202, 159286, 158557, 160174, 162192, 163072, 162921, 162247, 161084, 159677, 158629, 157685, 155585, 151967, 148491, 147177, 148267, 150537, 153062, 155698, 158229, 160195, 161637, 163204, 165276, 167485, 169327, 170918, 172907, 175731, 178943, 181273, 181616, 180182, 178600, 178723, 181470, 186718, 193749, 201445, 208638, 215001, 221361, 228477, 235637, 241240, 244804, 247675, 251506, 256663, 262410, 267982, 273009, 277402, 281440, 285622, 289844, 292901, 293496, 291753, 289168, 287032, 285360, 283359, 280342, 276104, 271024, 266121, 262429, 259889, 257330, 254043, 250917, 249343, 249291, 249288, 248210, 246210, 243672, 240192, 235296, 229654, 224703, 221183, 218667, 216611, 215114, 214333, 213785, 212864, 211772, 211140, 210703, 209190, 205956, 202070, 199149, 197552, 196517, 195693, 195399, 195416, 194837, 193621, 193113, 194165, 195654, 196036, 195717, 196575, 199398, 203125, 206650, 210064, 213748, 217499, 221149]
53656B21149M030M735M803L997L294L660N044O667P625P302N897M439L569K620
53642B88831P89j124j383L01K306L163K923K171J061j29n78L7R17J313J522K007
53626C04127K275J646N07j83k94m20o41m25K46P37Q71J295K247K795J998L54o44
53609C16491l50M17P61R93J863L046L306K249J042Q33J247J154L64l17m31k84
53593C32384j14J81M71L99J57M40J416K457L096L473L602L056J742L04o13r05
53577C51546p06l47o15j974l229k462K74K591K850K017J369J91k335m487l808
53562C40875q35J513K087K463L590M209L547L061M015N167M677K932J642J192
53548C80135P60L89J046K832M678N846O335N939M427K788K790M733O843P474O948
$$ y = [221149, 225179, 229914, 234717, 238714, 242008, 245668, 250712, 257379, 265004, 272306, 278203, 282642, 286211, 288831, 289620, 288496, 287113, 287414, 289720, 292883, 295806, 297977, 299038, 298909, 298331, 298368, 299285, 300598, 302120, 304127, 306402, 308048, 308555, 308372, 308078, 307658, 307017, 306592, 306838, 307575, 308446, 309741, 311988, 314783, 316781, 317135, 316491, 316141, 316558, 317319, 318312, 320175, 323221, 326527, 328776, 329818, 330651, 331898, 333052, 333416, 333099, 332668, 332384, 332270, 332451, 332922, 333321, 333478, 333918, 335334, 337791, 340887, 344360, 347962, 351018, 352760, 353064, 352451, 351546, 350840, 350493, 349878, 347904, 344675, 342213, 342487, 345078, 347928, 349945, 351314, 351505, 349170, 344683, 340875, 340040, 341553, 343640, 346103, 349693, 353902, 357449, 360510, 364525, 369692, 374369, 377301, 378943, 380135, 380895, 381284, 382330, 385162, 389840, 395686, 402021, 407960, 412387, 415175, 417965, 422698, 429541, 437015, 443963]
53533D43963O523O462O038M940L761L226L453L935L946L217K324K248L292M790
53519E02118N954O517O397N425L841K520K067K103K017J986K475K991K358L92
53505E49161j414j302Q93L511M509L206R00k11R59L434N347N800N276M582M013
53490E88664L539L164K971L162M071N577O677O334M986M486O092Q984J1204J1655
53476F71566J0792R626Q686P938P356P278Q034R352J0439J0960J1482J2475J3373
53463G99357J3415J3242J4386J7001J9245J9507J8296J7233J6988J7210J7813
53452I83693J9182K1163K2865K3630K3671K3612K3819K4198K4563K5157K6753
53441A242306K9741L3130L5156L5269L4743L4820L5091L4561L3588L3584L5035
$$ y = [443963, 450486, 456948, 462986, 467926, 471687, 474913, 478366, 482301, 486247, 489464, 491788, 494036, 497328, 502118, 508072, 514589, 520986, 526411, 530252, 532772, 534839, 536942, 538959, 540945, 543420, 546411, 548769, 549161, 547747, 546445, 547338, 550849, 555358, 558564, 559464, 559253, 560212, 563646, 568993, 574793, 580069, 584651, 588664, 592203, 595367, 598338, 601500, 605571, 611148, 617825, 624159, 629145, 633631, 639723, 648707, 659911, 671566, 682358, 691984, 700670, 708608, 715964, 723242, 731276, 740628, 751067, 762027, 773509, 785984, 799357, 812772, 826014, 840400, 857401, 876646, 896153, 914449, 931682, 948670, 965880, 983693, 1002875, 1024038, 1046903, 1070533, 1094204, 1117816, 1141635, 1165833, 1190396, 1215553, 1242306, 1272047, 1305177, 1340333, 1375602, 1410345, 1445165, 1480256, 1514817, 1548405, 1581989, 1617024]
53430A617024L6826L7553L6839L5396L4375L4498L5331L5626L4908L4077L3839
53419B006292L3351L1633K9658K9325L0503L0798K8814K6127K5137K6038K6950
53408B324626K6446K4948K3713K3105K2117J9614J5930J2870J1694J1633J0990
53397B527686R181O774L954L63l587o668q434r712j1161j2519j3637j5028j6824
53384B450388j8323j9234k0256k1748k2951k3368k3819k5145k6821k7906k8429
53373B192388k8728k8438k7362k6500k6635k6597k4658k1288j8648j7384j5796
53362A930354j2676r216p220o626n887m131j970n14j85k80N22K932O068Q191Q648
53347A908010Q611R628J2008J4911J7428J9230K0678K2654K5681K8885L0623L0735
$$ y = [1617024, 1653850, 1691403, 1728242, 1763638, 1798013, 1832511, 1867842, 1903468, 1938376, 1972453, 2006292, 2039643, 2071276, 2100934, 2130259, 2160762, 2191560, 2220374, 2246501, 2271638, 2297676, 2324626, 2351072, 2376020, 2399733, 2422838, 2444955, 2464569, 2480499, 2493369, 2505063, 2516696, 2527686, 2536867, 2543641, 2547595, 2547958, 2544371, 2537703, 2529269, 2519557, 2508396, 2495877, 2482240, 2467212, 2450388, 2432065, 2412831, 2392575, 2370827, 2347876, 2324508, 2300689, 2275544, 2248723, 2220817, 2192388, 2163660, 2135222, 2107860, 2081360, 2054725, 2028128, 2003470, 1982182, 1963534, 1946150, 1930354, 1917678, 1908462, 1901242, 1894616, 1888729, 1884598, 1882628, 1882114, 1881929, 1881649, 1882171, 1885103, 1891171, 1899362, 1908010, 1916621, 1926249, 1938257, 1953168, 1970596, 1989826, 2010504, 2033158, 2058839, 2087724, 2118347, 2149082]
53335B149082L1350L4375L8837M2077M3288M4352M6892N0125N2530N4291N6685
53324B643884N9733O2133O3362O4433O6174O8062O9328P0150P0867P0821O9103
53313C378050O6106O3293O1527O0448N9411N8122N6172N2883M8093M2580L7266
53302C983951L2413K7911K3754J9741J5100R222K742k882p119j1194j6769k4027
53290D052843l1523l7770m2422m5924m8760n1301n3770n5787n6509n5890n5214
53279C517973n5466n5678n4305n1936n0825n1538n1912n0264m7771m6305m5572
53268B956401m4243m2683m2325m2886m2414m0073l6944l3978l1048k8292k6566
53257B544949k5856k4827k2696k0442j9443j9843k0728k1037k0050j7943j6103
$$ y = [2149082, 2180432, 2214807, 2253644, 2295721, 2339009, 2383361, 2430253, 2480378, 2532908, 2587199, 2643884, 2703617, 2765750, 2829112, 2893545, 2959719, 3027781, 3097109, 3167259, 3238126, 3308947, 3378050, 3444156, 3507449, 3568976, 3629424, 3688835, 3746957, 3803129, 3856012, 3904105, 3946685, 3983951, 4016364, 4044275, 4068029, 4087770, 4102870, 4112092, 4114834, 4111952, 4104833, 4093639, 4076870, 4052843, 4021320, 3983550, 3941128, 3895204, 3846444, 3795143, 3741373, 3685586, 3629077, 3573187, 3517973, 3462507, 3406829, 3352524, 3300588, 3249763, 3198225, 3146313, 3096049, 3048278, 3001973, 2956401, 2912158, 2869475, 2827150, 2784264, 2741850, 2701777, 2664833, 2630855, 2599807, 2571515, 2544949, 2519093, 2494266, 2471570, 2451128, 2431685, 2411842, 2391114, 2370077, 2350027, 2332084, 2315981]
53246B315981j5833j6655j7008j6502j5916j5078j2922j0080r036j0565j1984
53235B164402j0439o273j713K080M957O441O581P128R694J3350J5970J7319J8863
53222B248360K0994K2620K3344K4216K5984K8144K9937L0954L0708K9044K7120
53211B541425K6632K7759K8867K8468K6417K3155J9075J4870J1419Q860O555M071
53199B767573J529r91l497n625p118q703j1405j4970j7953j9555k0375k1357k2857
53186B614696k4794k6786k8098k8488k8828k9907l0852l0252k8527k7484k7467
53175B303213k6901k5108k3490k3082k2992k2466k2556k4010k5068k3587k0404
53164B043549j8453j8902k0175k0601k0036j8740j6622j4230j2870j2939j3406
$$ y = [2315981, 2300148, 2283493, 2266485, 2249983, 2234067, 2218989, 2206067, 2195987, 2186951, 2176386, 2164402, 2153963, 2147690, 2145977, 2148057, 2153014, 2159455, 2166036, 2173164, 2182858, 2196208, 2212178, 2229497, 2248360, 2269354, 2291974, 2315318, 2339534, 2365518, 2393662, 2423599, 2454553, 2485261, 2514305, 2541425, 2568057, 2595816, 2624683, 2653151, 2679568, 2702723, 2721798, 2736668, 2748087, 2756947, 2763502, 2767573, 2769102, 2768111, 2764614, 2758989, 2751871, 2743168, 2731763, 2716793, 2698840, 2679285, 2658910, 2637553, 2614696, 2589902, 2563116, 2535018, 2506530, 2477702, 2447795, 2416943, 2386691, 2358164, 2330680, 2303213, 2276312, 2251204, 2227714, 2204632, 2181640, 2159174, 2136618, 2112608, 2087540, 2063953, 2043549, 2025096, 2006194, 1986019, 1965418, 1945382, 1926642, 1910020, 1895790, 1882920, 1869981, 1856575]
53153A856575j3692j4693j6834j8395j7500j5108j4148j5716j7913j8962j9670
53142A673944k1603k4170k5291k4399k3080k2613k2570k2293k2275k3050k3740
53131A418860k2980k0900j9166j9111k0623k2746k4697k6073k6712k6569k5685
53120A163598k4263k2817k1931k1831k2273k2893k3169k2335k0133j7762j6952
53109I27239j7798j8516j7909j6855j6623j6844j6391j5261j4300j3757j3344
53098G49641j3133j3140j2745j1746j1281j2137j2942j1900r694q610r140r615
53086F13558r263r195r943j0211r076p507o702o443o024n408m710l828l306m082
53072E17860n648o124n023m080m225l768j327J297J535N3k02J606L311L213K125
$$ y = [1856575, 1842883, 1828190, 1811356, 1792961, 1775461, 1760353, 1746205, 1730489, 1712576, 1693614, 1673944, 1652341, 1628171, 1602880, 1578481, 1555401, 1532788, 1510218, 1487925, 1465650, 1442600, 1418860, 1395880, 1374980, 1355814, 1336703, 1316080, 1293334, 1268637, 1242564, 1215852, 1189283, 1163598, 1139335, 1116518, 1094587, 1072756, 1050483, 1027590, 1004421, 982086, 961953, 944191, 927239, 909441, 890925, 873016, 856161, 839538, 822694, 806303, 791042, 776742, 762985, 749641, 736508, 723368, 710623, 698877, 687596, 675459, 662517, 650617, 640923, 632313, 623173, 613558, 604295, 595100, 585157, 574946, 565870, 558363, 551661, 545218, 539194, 533786, 529076, 525248, 521942, 517860, 512212, 506088, 501065, 496985, 492760, 488992, 487665, 488962, 490497, 490550, 490348, 491954, 495265, 498478, 500603]
53057E00603J532J555J443P94l85j811k679k171o85K55m22k434m911p199q723
53042D74762r041q404p576o793n737m747m954o590q091p949o701n995o155o070
53028C79959n424n456o860q297q176p055o789p611p716o062m033l498m343n042
53014B93597m937m636m564m345l642k658j690r25o55j009j546j786j923k383k882
52999B54016k859k481k274k005j150k18l11j330k070k113k103k039r78R56K046
52984B35087J364J66j65j30p77j574j149N21J976J971L42k205m289m523k973j318
52968B22324q08q84o67o79j687k827k599j253m68q48j297q86J73J493L031M312
52952B16430M380L051J440P43J084J751J938J240l6q67m67Q12J957K595L042L316
$$ y = [500603, 502135, 503690, 505133, 505927, 505542, 503731, 501052, 498881, 498196, 498451, 498029, 495595, 490684, 483485, 474762, 465721, 457317, 449741, 442948, 437211, 432464, 427510, 420920, 412829, 404880, 398179, 392184, 386029, 379959, 374535, 369079, 362219, 353922, 345746, 338691, 331902, 324291, 316575, 310513, 306480, 302982, 298639, 293597, 288660, 284024, 279460, 275115, 271473, 268815, 267125, 266200, 265545, 264536, 262990, 261204, 259281, 256898, 254016, 251157, 248676, 246402, 244397, 243247, 243029, 242718, 241388, 239318, 237205, 235102, 233063, 232085, 233041, 235087, 236451, 236617, 236452, 236322, 235545, 233971, 232822, 233343, 235319, 237290, 237632, 235427, 231138, 226615, 223642, 222324, 221516, 220632, 219965, 219286, 217599, 214772, 212173, 210920, 210452, 209604, 208307, 207421, 207594, 209087, 212118, 216430, 220810, 223861, 225301, 226044, 227128, 228879, 230817, 232057, 232021, 231154, 230687, 231499, 233456, 236051, 239093, 242409]
52936B42409K922J814Q64R86K121L261L277K006O55P75K485M191M441L486K535
52921B78228K218K576L725N444O687O733O317O507O955O647N894N876O415O070
52907C56292M638L710M134M600L733K221J638K112K303J186r75l141m193l626
52893C74632k066q21n66q86j416k575m532o135n902l886j725q55j292k173k888
52878C36914l355l535l223k467j828j782j941j439k72M61J76j23P83K355K880
52863C23604J837N30K26O80Q55K37q85j761j575j38J604K412K179J784J579J102
52847C34270L87K47P76Q24l13j692k102j657j070k98R65K085K139J357Q01Q26
52831C37545R18Q53R31J107R71O48O94R64N96n00j206p44J26J79n24p99K7J430
$$ y = [242409, 245331, 247145, 248009, 248995, 251116, 254377, 257654, 259660, 260315, 261090, 263575, 267766, 272207, 275693, 278228, 280446, 283022, 286747, 292191, 298878, 305611, 311928, 318435, 325390, 332037, 337931, 343807, 350222, 356292, 360930, 364640, 368774, 373374, 377107, 379328, 380966, 383078, 385381, 386567, 385592, 382451, 378258, 374632, 372566, 371745, 371179, 370293, 368877, 366302, 361770, 355635, 349733, 345847, 344122, 343267, 341975, 339802, 336914, 333559, 330024, 326801, 324334, 322506, 320724, 318783, 317344, 317072, 317533, 317709, 317586, 318369, 320724, 323604, 325441, 325971, 326197, 326877, 327732, 327969, 327084, 325323, 323748, 323610, 325214, 327626, 329805, 331589, 333168, 334270, 334657, 334904, 335680, 336504, 336191, 334499, 332397, 330740, 329670, 329372, 330337, 332422, 334561, 335918, 336719, 337545, 338463, 339316, 340247, 341354, 342325, 342973, 343667, 344631, 345227, 344727, 343521, 342777, 342903, 343082, 342558, 341759, 341786, 343216]
52813C43216K660L664M676N329M861L231J541Q98J116J182Q15Q79J884K943K965
52798C81860K339K492L844N256N633N124M393L610K845K769L919N686O852P027
52784D43649O746O207N019L411K602L278M342M089K245P7j326k121l008m184n170
52769D65856n342m504l253k667l293m616n946p308q768r365q073n715m481n056
52755C87469n722m969l712l662m638m964l973k575j699j548k218l621m666l971
52741C35531j770K7J24p51j207j008q76j215j751k070k004j770j963l002m434
52726C11861n260n185m842m602l967k723j865k449l839m099k308K13J262J20j774
52711B70543k451j540m53m39r72p23L20O99m00j901k259j394m76m29j340l012
$$ y = [343216, 345876, 349540, 354216, 359545, 364406, 367637, 369178, 370076, 371192, 372374, 373189, 374068, 375952, 378895, 381860, 384199, 386691, 390535, 395791, 401424, 406548, 410941, 414551, 417396, 420165, 424084, 429770, 436622, 443649, 450395, 456602, 461621, 465032, 467634, 470912, 475254, 479343, 481588, 481665, 480339, 478218, 475210, 471026, 465856, 460514, 456010, 452757, 450090, 446797, 442181, 436235, 428927, 420159, 410794, 402721, 397006, 392525, 387469, 381747, 376778, 373066, 369404, 364766, 359802, 355829, 353254, 351555, 350007, 347789, 344168, 339502, 335531, 333761, 333788, 333912, 333161, 331954, 330946, 330070, 328855, 327104, 325034, 323030, 321260, 319297, 316295, 311861, 306601, 301416, 296574, 291972, 288005, 285282, 283417, 280968, 277129, 273030, 270722, 270935, 272197, 272317, 270543, 268092, 266552, 266099, 265660, 264688, 263965, 264285, 264984, 264584, 262683, 260424, 259030, 258554, 258125, 256785, 253773]
52695B53773n080o612o494m589k124o20o63j754l030l887m061l600k901k526k673
52680B03159k819k296j288p90j224j712j311n31o73j765k346j543k97L2o08j328
52664A82660j583j264j10J834L503L682K566J480R77K63j166k326j927j00J730
52649A90219K470K143J433J018J259J986K594K871L474M827N796M609J444j059
52635B25084q05J078J777M48j059j080j21M02J9j027k647m472n292m283k424j542
52619B04056k139l168l744l987m095l798l053k433k363k611k840l071l303l335
52605A60116l203l192l158k499j197j55r5p14j448k361l570m365l944k664j660
52590A25891j174l74R66J605M34j665k532j308N61J204N35m5K33N55j05j476k287
$$ y = [253773, 248693, 242081, 235587, 230998, 228874, 228254, 227591, 225837, 222807, 218920, 214859, 211259, 208358, 205832, 203159, 200340, 198044, 196756, 195966, 194742, 193030, 191719, 191188, 190515, 188750, 186404, 184861, 184564, 184596, 183988, 182660, 181077, 179813, 179703, 181537, 185040, 188722, 191288, 192768, 193745, 194008, 192842, 190516, 188589, 188489, 190219, 192689, 194832, 196265, 197283, 198542, 200528, 203122, 205993, 209467, 214294, 220090, 224699, 226143, 225084, 224279, 225357, 227134, 227582, 226523, 225443, 225322, 225724, 225743, 224716, 222069, 217597, 212305, 208022, 205598, 204056, 201917, 198749, 195005, 191018, 186923, 183125, 180072, 177639, 175276, 172665, 169825, 166754, 163451, 160116, 156913, 153721, 150563, 148064, 146867, 146712, 146617, 145903, 144455, 142094, 138524, 134159, 130215, 127551, 125891, 124717, 124343, 125309, 126914, 127348, 125683, 123151, 121843, 122404, 123608, 124143, 124098, 124331, 124886, 124781, 123305, 121018]
52573A21018j764k56J390K575L021K633J542K56m69j51Q40J432R42J3k05K65J17
52556A33199j302k881l193k425j813j738j384k05J264K129J902O33r67j599m92
52541A21128J425K363J782Q63O22O09m5j066j415p73J21N28M25J21l45r74j298
52524A24071o44Q33J964J941J453J605K025J429P0j51J345K480J517j97l20R55
52508A40376J575J069Q27J286J362R15J282K853M193M375M167M139L502J945O85
52493A74551M74L01n93j076q6J289J453R02J208K335K777J949O63l25p28o4J809
52476A86839L622L747K348J242J388J818J283lp26Q4K119L935M084K569R56O28
52460B15933J311J891K062K221K182J259l78j420r35M56J296R93N31J339L285
$$ y = [121018, 119254, 118998, 120388, 122963, 125984, 128617, 130159, 130415, 129946, 129795, 130635, 132067, 133009, 133022, 132817, 133082, 133199, 131897, 129016, 125823, 123398, 121585, 119847, 118463, 118258, 119522, 121651, 123553, 124186, 123219, 121620, 121128, 122553, 124916, 126698, 127561, 128183, 128792, 128747, 127681, 126266, 125493, 125614, 126142, 126567, 126688, 126343, 125369, 124071, 123427, 124260, 126224, 128165, 129618, 131223, 133248, 134677, 134747, 134596, 135941, 138421, 139938, 139741, 139421, 140376, 141951, 143020, 143847, 145133, 146495, 147410, 148692, 151545, 155738, 160113, 164280, 168419, 171921, 173866, 174551, 175025, 175326, 174733, 173657, 173571, 174860, 176313, 177215, 178423, 180758, 183535, 185484, 186147, 185822, 185094, 185030, 186839, 190461, 194208, 196556, 197798, 199186, 201004, 202287, 202284, 201558, 201642, 203761, 207696, 211780, 214349, 215305, 215933, 217244, 219135, 221197, 223418, 225600, 226859, 226481, 225061, 224126, 224582, 225878, 226871, 227402, 228741, 232026]
52445B32026M243K430r41k635j297R34J506O83M82J467K235J554l56k409l413
52430B36509k665q53J1j191l048l311j794k10M06N70Q89J300J833K690L341K912
52414B37389J667Q75R12P08n24k125k965k641j389L15J691K065J720J560J784
52399B41042J705J132R26J748L008L650L383K762K396K334K038J009l93j064n68
52384B65108J67L29N85J819L130K828J195M15J483K847K740J313k57j374j817
52369B80511j184M10J825K096J516R60Q32J267K509M180M986M009J960L40j89
52354C06028MM86J081J556J719J764K033K522K873K683J739M14k28N79J985K130
52338C29368M98j138q68R20K119J535P2o69k53L04j21j347k116j785j345k057
$$ y = [232026, 236269, 238699, 237758, 235123, 233826, 234760, 236266, 236949, 237431, 238898, 241133, 242687, 242331, 239922, 236509, 233844, 232991, 233002, 231811, 228763, 225452, 223658, 223448, 223854, 224424, 225313, 226613, 228446, 231136, 234477, 237389, 239056, 239931, 240843, 241551, 241027, 238902, 235937, 233296, 231907, 232222, 233913, 235978, 237698, 239258, 241042, 242747, 243879, 244805, 246553, 249561, 253211, 256594, 259356, 261752, 264086, 266124, 267133, 266740, 265676, 265108, 265275, 265604, 266189, 268008, 271138, 273966, 275161, 275576, 277059, 279906, 282646, 283959, 283702, 282328, 280511, 279327, 279737, 281562, 283658, 285174, 286134, 286966, 288233, 290742, 294922, 299908, 303917, 305877, 306217, 306028, 306032, 306518, 307599, 309155, 310874, 312638, 314671, 317193, 320066, 322749, 324488, 324902, 324674, 325253, 327238, 329368, 329866, 328728, 327860, 328780, 330899, 332434, 332506, 331837, 331584, 331888, 331767, 330420, 328304, 326519, 325174, 323117]
52322C23117l484m001l205k519k934l533k989j474p6Q53J547J742J008o0j67R86
52306C04811K182K110P94m53k86J471L578M484L937L190L434M396M816L963K232
52291C44659O00j37J90J128K249L754N890P867Q223O690M690L527L086K913L424
52276C98753M897O231O183N229M859N390N898O101O668P609P868O962N755N164
52262D83567N147N529O607Q246R407R477R249R761J0771J1327J1271J1108J0865
52249F02332J0277R907J0896J3250J5570J6836J7676J9198K1307K2877K3243K2688
52237H06057K1813K1241K1886K4543K8720L2519L4252L3960L3006L2489L2576
52226A123062L3099L4136L5679L7147L7704L7087L5981L5378L5627L6218L6469
$$ y = [323117, 319633, 315632, 312427, 309908, 306974, 303441, 300452, 298978, 298902, 299755, 301302, 303044, 304052, 303992, 303825, 304811, 306993, 309103, 309897, 309444, 309158, 310629, 314207, 318691, 322628, 325818, 329252, 333648, 338464, 342427, 344659, 345259, 345122, 345312, 346440, 348689, 352443, 358333, 366200, 374423, 381113, 385803, 389330, 392416, 395329, 398753, 403650, 409881, 416064, 421293, 426152, 431542, 437440, 443541, 450209, 457818, 465686, 472648, 478403, 483567, 488714, 494243, 500850, 509096, 518503, 527980, 537229, 546990, 557761, 569088, 580359, 591467, 602332, 612609, 622516, 633412, 646662, 662232, 679068, 696744, 715942, 737249, 760126, 783369, 806057, 827870, 849111, 870997, 895540, 924260, 956779, 991031, 1024991, 1057997, 1090486, 1123062, 1156161, 1190297, 1225976, 1263123, 1300827, 1337914, 1373895, 1409273, 1444900, 1481118, 1517587]
52215A517587L6160L5296L3743L1619K9770K8983K8684K7334K4372K0995J8494
52204A833037J6708J4890J3237J2455J2302J1677R969P396M343J491K14J435L938
52191A943092N235M482L287L174L580L263K539K849M639O816Q284R159J0415J2730
52177B023544J5742J8208J9046J8429J7628J7756J8908K0469K1695K1907K0861
52166B234193J9303J8597J9320K0619K1170K0278J7920J4427J0629P594N612L891
52154B413553J677q54l288n905r156j2668j5527j7379j8722k0219k2127k4149
52142B265236k5552k5853k5542k5712k6627k7333k7097k6420k6082k5932k5467
52131A977619k4833k4299k3302k1214j8688j7036j6416j5792j4648j3546j2859
$$ y = [1517587, 1553747, 1589043, 1622786, 1654405, 1684175, 1713158, 1741842, 1769176, 1793548, 1814543, 1833037, 1849745, 1864635, 1877872, 1890327, 1902629, 1914306, 1924275, 1931671, 1936014, 1937505, 1937719, 1939154, 1943092, 1948327, 1952809, 1956096, 1959270, 1962850, 1966113, 1968652, 1971501, 1976140, 1982956, 1991240, 2000399, 2010814, 2023544, 2039286, 2057494, 2076540, 2094969, 2112597, 2130353, 2149261, 2169730, 2191425, 2213332, 2234193, 2253496, 2272093, 2291413, 2312032, 2333202, 2353480, 2371400, 2385827, 2396456, 2404050, 2409662, 2413553, 2415230, 2414376, 2411088, 2405183, 2396027, 2383359, 2367832, 2350453, 2331731, 2311512, 2289385, 2265236, 2239684, 2213831, 2188289, 2162577, 2135950, 2108617, 2081520, 2055100, 2029018, 2003086, 1977619, 1952786, 1928487, 1905185, 1883971, 1865283, 1848247, 1831831, 1816039, 1801391, 1787845, 1774986]
52120A774986j2134j1119j0352j0184j0022r289q419q150q194p533n963m710n118
52107A663799p100r144r825r098q083p810q391r213r551q938p441n824n035n184
52093A553162n401m971m290m275n137o131o421n750m431l107k383k328k477k551
52079A493509k904l870m960n312m773l963l412l131k987k889k559j685m61M70
52065A451073O91K20q93k595m308n003m226k697j531j111j027q03k55P08K057
52050A430300L356L937L659L307L959O091R367J3102J6589J9199K0701K1636K2913
52037A578116K4802K6739K8333L0023L2242L4488L5972L6952L8481M0819M2974
52026A949941M4039M4206M4091M3745M2923M1849M0964M0110L8528L5849L2774
$$ y = [1774986, 1762852, 1751733, 1741381, 1731197, 1721175, 1711886, 1703467, 1695317, 1687123, 1679590, 1673627, 1668917, 1663799, 1656699, 1647555, 1637730, 1628632, 1620549, 1612739, 1604348, 1595135, 1585584, 1576646, 1569205, 1563381, 1558346, 1553162, 1547761, 1542790, 1538500, 1534225, 1529088, 1522957, 1516536, 1510786, 1506355, 1503248, 1500865, 1498537, 1496060, 1493509, 1490605, 1486735, 1481775, 1476463, 1471690, 1467727, 1464315, 1461184, 1458197, 1455308, 1452749, 1451064, 1450603, 1451073, 1451764, 1451984, 1451091, 1448496, 1444188, 1439185, 1434959, 1432262, 1430731, 1429620, 1428593, 1427790, 1427535, 1428243, 1430300, 1433656, 1437593, 1441252, 1444559, 1448518, 1454609, 1463976, 1477078, 1493667, 1512866, 1533567, 1555203, 1578116, 1602918, 1629657, 1657990, 1688013, 1720255, 1754743, 1790715, 1827667, 1866148, 1906967, 1949941, 1993980, 2038186, 2082277, 2126022, 2168945, 2210794, 2251758, 2291868, 2330396, 2366245, 2399019]
52015B399019L0515K9441K8413K5830K1426J6693J3125J0526P557L572q11m668
52003B580638p513r265j0365j1682j3519j4855j4745j4122j4831j6857j8154j7658
51991B417072j6782j7163j8285j8396j6678j3564r887o628m607l500k024J30J638
51978B291326J825K211M447P735J0030J1022J2138J3942J5353J5518J4863J4065
51966B414475J3167J2113J1174J0455R553P895N183J738j334k948l539m803p311
51953B465818r439r855r926j1938j5778j9285k1611k4124k7837l1781l4431l5411
51941B214402l5398l5486l6752l9262m1509m2111m1927m2914m4943m5785m4666
51930A763649m3622m4370m5705m5450m3625m2111m2065m2960m3538m2654l9846
$$ y = [2399019, 2429534, 2458975, 2487388, 2513218, 2534644, 2551337, 2564462, 2574988, 2582545, 2586117, 2585306, 2580638, 2573125, 2563860, 2553495, 2541813, 2528294, 2513439, 2498694, 2484572, 2469741, 2452884, 2434730, 2417072, 2400290, 2383127, 2364842, 2346446, 2329768, 2316204, 2306317, 2299689, 2295082, 2291582, 2289558, 2289688, 2291326, 2293151, 2295362, 2299809, 2307544, 2317574, 2328596, 2340734, 2354676, 2370029, 2385547, 2400410, 2414475, 2427642, 2439755, 2450929, 2461384, 2470937, 2478832, 2484015, 2485753, 2484419, 2481471, 2477932, 2473129, 2465818, 2456379, 2446524, 2436598, 2424660, 2408882, 2389597, 2367986, 2343862, 2316025, 2284244, 2249813, 2214402, 2179004, 2143518, 2106766, 2067504, 2025995, 1983884, 1941957, 1899043, 1854100, 1808315, 1763649, 1720027, 1675657, 1629952, 1584502, 1540877, 1498766, 1456701, 1413741, 1370203, 1327549, 1287703]
51919A287703l6144l3708l3589l4364l4006l2398l0854k9702k7975k5478k3529
51908I45956k3049k2979k1635j9037j6913j6481j7144j7711j8079j8847j9585
51897G34496j8801j6027j2818j0869r976q977p929p911q856r333q791q504r560
51884E96144j1106j1536j0574r249q281p455o420n377m857n110n732n968n579
51871D98900n280n816o727o693n160l051j674j533k272l173l471k814j663q64
51857D48709p16r43j433k269l193l833m396n289o025n613m089k592j676p94K53
51842D06101O77O9q24j435k288l639m451l876k927l248m711n533m597k582q94
51827C65842l16p48j512j814j414q60p53j062j378j509j349o27N86J474J119n02
$$ y = [1287703, 1251559, 1217851, 1184262, 1149898, 1115892, 1083494, 1052640, 1022938, 994963, 969485, 945956, 922907, 899928, 878293, 859256, 842343, 825862, 808718, 791007, 772928, 754081, 734496, 715695, 699668, 686850, 675981, 666005, 657028, 649099, 641188, 632332, 622999, 614208, 605704, 596144, 585038, 573502, 562928, 553679, 545398, 537943, 531523, 526146, 521289, 516179, 510447, 504479, 498900, 493620, 487804, 481077, 474384, 469224, 466173, 464499, 462966, 460694, 457521, 454050, 451236, 449573, 448709, 447993, 447050, 445617, 443348, 440155, 436322, 431926, 426637, 420612, 414999, 410910, 408318, 406642, 405848, 406101, 406778, 406847, 406023, 404588, 402300, 398661, 394210, 390334, 387407, 384159, 379448, 373915, 369318, 366736, 365842, 365526, 364778, 363266, 361452, 360038, 359178, 358425, 357363, 355985, 354476, 353127, 352500, 353086, 354560, 355679, 355177]
51811C55177k546m049m433l621k067m08J156K697L809L698K422J223J048J436
51797C55542J478J223J246J510J507J209R10M57l41p59K99K619M475M503L204
51782C79082K158K110K358J951J068Q23J651K524K233J169Q47J785K816K764J871
51767D07210R56J02r39j711j421j14J205J565P26r07k594l751m426n017n329m530
51751C81025k456j99J122J541J552J065l4r71r14l27l28q18n43Q46J941J370l11
51734C83561j211k45J847L553M227M348M325L621J608j022k681k791k343k175
51720C94622j702j30J920L022K725J745P18l06j239j695j475p44J88J044J673
51705D00366K213K806K894J579p83k239j345R64K565K645J983J365R55R75J604
$$ y = [355177, 352631, 348582, 344149, 340528, 338461, 338053, 339209, 341906, 345715, 349413, 351835, 353058, 354106, 355542, 357020, 358243, 359489, 360999, 362506, 363715, 364625, 365082, 364741, 363982, 364281, 366900, 371375, 375878, 379082, 381240, 383350, 385708, 387659, 388727, 389550, 391201, 393725, 395958, 397127, 397974, 399759, 402575, 405339, 407210, 408166, 408268, 407329, 405618, 404197, 404083, 405288, 406853, 407579, 406672, 404078, 400327, 395901, 390884, 385555, 381025, 378569, 378370, 379492, 381033, 382585, 383650, 383616, 382645, 381731, 381404, 381076, 380258, 379715, 380561, 382502, 383872, 383561, 382350, 382105, 383952, 387505, 391732, 396080, 400405, 404026, 405634, 404612, 401931, 399140, 396797, 394622, 392920, 392790, 394710, 397732, 400457, 402202, 402920, 402614, 401375, 399680, 398205, 397461, 397649, 398693, 400366, 402579, 405385, 408279, 409858, 409075, 406836, 405491, 406455, 409020, 411665, 413648, 415013, 415968, 416943, 418547]
51690D18547K248K107J463J314J714J812J657K481M667O673O859N603M687N103
51676D66935O165O571N770M408L663M005M685M838M883N992Q211J0096J0655J0595
51662E57472J0953J1307J0592R152Q702R991J1612J1702J0320R352J0195J2099
51650F83449J2936J1242P331K839m46j562r60k63r78l051m970n523n035m619m625
51635F85765m420l476k180j529k317m487o928q042o972m423k005p53m10j00O18
51620F38341J521K416L657N578P475P755N563J940j247l168m299n147n634n698
51606F49053n513n096m450m111m509m855l869j752n7N88J055J623J160n83j718
51591F16966p24J260K186J949J768J868J646J215R13j20k735n741p077o722o369
$$ y = [418547, 420795, 422902, 424365, 425679, 427393, 429205, 430862, 433343, 438010, 444683, 451542, 457145, 461832, 466935, 473100, 479671, 485441, 489849, 493512, 497517, 502202, 507040, 511923, 517915, 526126, 536222, 546877, 557472, 568425, 579732, 590324, 599476, 608178, 618169, 629781, 641483, 651803, 661155, 671350, 683449, 696385, 707627, 714958, 717797, 717351, 715789, 714829, 714566, 713588, 710537, 705567, 700044, 695009, 690390, 685765, 681345, 677869, 675689, 674160, 671843, 667356, 660428, 652386, 645414, 640991, 638986, 638233, 637823, 637723, 638341, 639862, 642278, 645935, 651513, 658988, 666743, 672306, 674246, 672999, 669831, 665532, 660385, 654751, 649053, 643540, 638444, 633994, 629883, 625374, 620519, 616650, 614898, 614841, 615429, 616484, 618107, 619267, 618684, 616966, 616242, 617502, 619688, 621637, 623405, 625273, 626919, 628134, 629047, 628927, 626192, 620451, 613374, 606652, 600283]
51576F00283o423n644m009l549n518q459r992r346p515o023n878o750p046n822
51562E08309m396m658o113o590n714n351o341p219o961o453o120m680j923l83
51548D35407j984m831n815m944m455m685l878j835p33j727l129k997j730r55j128
51533C90581j518j683j886k269k494k160j286l64R4J84N89J491J921R51o21p73
51517C80757J246L737M487L336K200K722M534N972O078N511N540O488P501P621
51503D47730O708N312M071L401L351L487L203K341J281K87p69j822k255j673p04
51488D73949m00j038j997k682l029l093k780k144j469r27m03O9K17J09M99J966
51472D56847L843M669M036L393M337O437P569O585M732L977M647N490N537M876
$$ y = [600283, 593860, 588216, 584207, 580658, 575140, 566681, 556689, 547343, 539828, 533805, 527927, 521177, 514131, 508309, 503913, 499255, 493142, 486552, 480838, 475487, 469146, 461927, 454966, 448513, 442393, 437713, 435790, 435407, 433423, 428592, 422777, 417833, 413378, 408693, 404815, 402980, 402247, 400520, 397391, 394394, 392664, 391709, 390581, 389063, 387380, 385494, 383225, 380731, 378571, 377285, 376921, 377015, 377199, 377788, 379279, 381200, 382151, 381530, 380757, 382003, 385740, 390227, 393563, 395763, 398485, 403019, 408991, 415069, 420580, 426120, 432608, 440109, 447730, 454438, 459750, 463821, 467222, 470573, 474060, 477263, 479604, 480885, 481172, 480403, 478581, 476326, 474653, 473949, 473549, 472511, 470514, 467832, 464803, 461710, 458930, 456786, 455317, 454390, 453987, 454056, 454273, 454382, 454881, 456847, 460690, 465359, 469395, 472788, 477125, 483562, 491131, 497716, 502448, 506425, 511072, 516562, 522099, 526975]
51458E26975L845K502J064O8k48q6M81J510K390J958rk073k628j757q67p63q62
51441E31500l59N60J036O84n7n29m39J95J212K174K442J869J231J401K053J878
51425E46851K17k072l657m049l573k715j949j679j799j809j694j984k542k329
51411E15217j057K0Jp8J071K708L129K354J857K082K211K148K646L466L579L459
51395E44813M874P743R483Q498O352N278N433N904O624P574P596O020M440M914
51381F35546P095Q738Q651P470N937M080K086O80L50R78K106K991K839J701N70
51366F91818k6p78k154l247l200k784l027l159j734P82K492K864L035L276K292
51351F86450k81k582k812j538o30q29j562k474l946o023p817q374p874p617q535
$$ y = [526975, 530820, 533322, 534386, 534454, 534206, 534120, 534601, 536111, 538501, 540459, 540450, 538377, 535749, 533992, 533125, 532362, 531500, 531141, 531701, 532737, 533421, 533364, 532835, 532396, 532591, 533803, 535977, 538419, 540288, 541519, 542920, 544973, 546851, 547068, 544996, 541339, 537290, 533717, 531002, 529053, 527374, 525575, 523766, 522072, 520088, 517546, 515217, 514160, 514180, 514181, 514103, 515174, 517882, 521011, 523365, 525222, 527304, 529515, 531663, 534309, 537775, 541354, 544813, 549687, 557430, 566913, 575411, 581763, 587041, 592474, 598378, 605002, 612576, 620172, 626192, 630632, 635546, 642641, 651379, 660030, 667500, 673437, 677517, 679603, 680283, 680633, 681611, 683717, 686708, 689547, 691248, 691818, 691792, 691014, 688860, 685613, 682413, 679629, 676602, 673443, 671709, 672491, 674983, 677847, 680882, 684158, 686450, 686169, 683587, 680775, 679237, 678607, 677778, 676216, 673742, 669796, 663773, 655956, 647582, 639708, 632091, 623556]
51336F23556r898r978q235o185n663o745q089q727q629p945o811n838n666n997
51322E19150n918n252m671m420l897k668j111P5L37p06k712m135l448j087R28
51307D80465J551J690K225K460J474k37j679l021m912o708o980n731m700n128
51293D50769o437p558q539r904j1158j1064r299p137o167o781q027q601p861o212
51279C36024m798m632n749p179p678o587m248j927j144k342m094m276k405j86
51265B78779O23J61l17l57l82n15n70r21k052l274l278k064r34m38K95J723K861
51248B69340K775J861R45K54l3M85J358J342M29L59J900L205K558J276J766L788
51232B93608N119N358O316Q484R760Q493N835L871K980K252J355Q04R48J545J852
$$ y = [623556, 613658, 603680, 595445, 589260, 583597, 576852, 568763, 560036, 551407, 543462, 536651, 530813, 525147, 519150, 513232, 507980, 503309, 498889, 494992, 492324, 491213, 491288, 491625, 490919, 488207, 484072, 480624, 479537, 480465, 482016, 483706, 485931, 488391, 489865, 489628, 487949, 484928, 480016, 473308, 466328, 460597, 455897, 450769, 444332, 436774, 428235, 418331, 407173, 396109, 386810, 379673, 373506, 366725, 358698, 350097, 342236, 336024, 331226, 326594, 320845, 313666, 305988, 299401, 295153, 293226, 292082, 289740, 285646, 281370, 278965, 278779, 279402, 279563, 279246, 278889, 278507, 277992, 277422, 276501, 274449, 271175, 267897, 265833, 264899, 264461, 264756, 266479, 269340, 272115, 273976, 274921, 275175, 275142, 275627, 276985, 278327, 278756, 279115, 281015, 284220, 286778, 288054, 289820, 293608, 298727, 304085, 310401, 318885, 328645, 337138, 342973, 346844, 349824, 352076, 353431, 354235, 355183, 356728, 358580]
51217C58580P89k213n925p741o236l030j255k374m925o354n620l978l343m184
51203C02191n245n330m767m651n148n449n110m600m314l889k849j506p86j205
51189B47342k112k089m92J498J902J89k239l946m812n071m324k573r81l51K28
51174B22169J724L182L052J758R76R21N22l7N46J936K034K68j279r54K96R05R95
51157B39014J334J713J768K121L096L441J990k34j126k06J139J783J923K184K697
51142B62637L119K982K159J237R54R79J29j799l281k926j222K95P47J43j184k379
51126B62590k253p01P80R70M88L56J02j169k630k532r36K24j11r04r32m30k73
51109B52639o02j033j462k080k930l807m243l630j869J84J483J908J988J762P48
$$ y = [358580, 359369, 357156, 351231, 343490, 337254, 334224, 332969, 330595, 325670, 319316, 313696, 309718, 306375, 302191, 296946, 291616, 286849, 282198, 277050, 271601, 266491, 261891, 257577, 253688, 250839, 249333, 248547, 247342, 245230, 243141, 242649, 244147, 246049, 246238, 243999, 240053, 235241, 230170, 225846, 223273, 222292, 221941, 222169, 223893, 227075, 230127, 231885, 232861, 233782, 234304, 234267, 234813, 236749, 238783, 239051, 237772, 236818, 237114, 238019, 239014, 240348, 242061, 243829, 245950, 249046, 252487, 254477, 254243, 253117, 252911, 254050, 255833, 257756, 259940, 262637, 265756, 268738, 270897, 272134, 273088, 274067, 274196, 272397, 269116, 266190, 264968, 265263, 266010, 266153, 264969, 262590, 260337, 259636, 260416, 261386, 261874, 262230, 262332, 261163, 258533, 256001, 255065, 255289, 255178, 254274, 253342, 252912, 252639, 252037, 251004, 249542, 247462, 244532, 240725, 236482, 232852, 230983, 231167, 232650, 234558, 236546, 238308, 239056]
51094B39056q76k111k363j959j280j75J265K222K049J187N52L82J05q46k401l811
51078B30996m001k396K41K100J909J42j591k106j400j52R97J706J870J532P65
51063B30612k77j191j482j135q84j351k083j956p66K36q6j132j259P5J710K437
51047B21468K260J759J157P05J177K870M612M931M041L627M599O103O765N992
51033B72066L909J176p93o23J399L294L607K784J858R11k86j105q09J68Q72J264
51017B89692J715J636J94j679j796K87K247J944K09m98N57J680J195o74k553l465
51001B90691l183j831K7J303J189N2j006j418j370q68M71K334L356K678J263P70
50985B94458J409J988J874J728K077K381K080J685J966K659K854K372J940J942
$$ y = [239056, 238180, 236069, 233706, 231747, 230467, 230292, 231557, 233779, 235828, 237015, 237567, 237949, 238054, 237208, 234807, 230996, 226995, 224599, 224840, 226940, 228849, 228991, 227400, 225294, 223894, 223742, 224739, 226445, 228315, 229847, 230612, 230335, 229144, 227662, 226527, 225643, 224292, 222209, 220253, 219487, 219723, 219637, 218505, 217246, 217321, 219031, 221468, 223728, 225487, 226644, 227349, 228526, 231396, 236008, 240939, 244980, 248607, 253206, 259309, 266074, 272066, 275975, 277151, 276358, 275735, 277134, 280428, 284035, 286819, 288677, 289588, 289302, 288197, 287388, 287556, 288428, 289692, 291407, 293043, 293237, 291558, 289762, 290049, 292296, 294240, 294449, 293951, 294508, 296188, 297383, 296709, 294156, 290691, 287508, 285677, 285704, 287007, 288196, 288248, 287242, 285824, 284454, 283586, 284057, 286391, 289747, 292425, 293688, 294458, 295867, 297855, 299729, 301457, 303534, 305915, 307995, 309680, 311646, 314305, 317159, 319531, 321471, 323413]
50971C23413J767P44o61j091Q9J975L268M015N359P457Q744Q025O238N020M277
50956C78639K877J257J211K868L965L107J943K652M665N599M655L364L127L583
50942D23512L706L379L393M372O039P530Q442R446J1270J3218J3682J2490J1577
50929E32056J2561J4691J6148J6550J6969J8178K0185K2972K6292K8993L0030
50918G55625L0137L1201L3909L7261M0441M3760M7386N0605N3218N6607O2299
50907A242449P0023P8008Q4889R0548R5357R9583J03695J08519J14515J20995
50897B208581J26482J29813J30713J29219J25165J18649J10597J02069R3066Q2643
50887C356997P0431N7251M4071L1112J8376O321m532j4011k1887k7771l1945l5514
$$ y = [323413, 325180, 325924, 325263, 324172, 324261, 326236, 329504, 333519, 338878, 346335, 355079, 363104, 369342, 374362, 378639, 381516, 382773, 383984, 386852, 390817, 393924, 395867, 398519, 403184, 408783, 413438, 416802, 419929, 423512, 427218, 430597, 433990, 438362, 444401, 451931, 460373, 469819, 481089, 494307, 507989, 520479, 532056, 544617, 559308, 575456, 592006, 608975, 627153, 647338, 670310, 696602, 725595, 755625, 785762, 816963, 850872, 888133, 928574, 972334, 1019720, 1070325, 1123543, 1180150, 1242449, 1312472, 1390480, 1475369, 1565917, 1661274, 1760857, 1864552, 1973071, 2087586, 2208581, 2335063, 2464876, 2595589, 2724808, 2849973, 2968622, 3079219, 3181288, 3274354, 3356997, 3427428, 3484679, 3528750, 3559862, 3578238, 3584559, 3580027, 3566016, 3544129, 3516358, 3484413, 3448899]
50875C448899l9004m1641m2803m3409m4829m7098m9326n1359n3825n6956o0573
50864B918076o4963p0294p5356p8279p8932p9330q1219q4143q6306q6549q5034
50853B047671q2549p9754p6771p3396o9730o6386o3536o0208n5326m9236m3484
50842A327295l9130l6099l3955l2262l0243k7057k2795j8497j5029j2486j0586
50831A049156q893o816m235k008r68m15J193M118O964Q555R040Q987Q728R069
50817A082475J1252J5376J9758K2687K4103K4922K5550K5971K6677K8583L2025
50806A339379L6448M0821M4293M6760M9056N2257N6705O2083O8193P4972Q1949
50795A952916Q8709R5912J04738J15276J26720J39139J53366J68749J82988J95308
$$ y = [3448899, 3409895, 3368254, 3325451, 3282042, 3237213, 3190115, 3140789, 3089430, 3035605, 2978649, 2918076, 2853113, 2782819, 2707463, 2629184, 2550252, 2470922, 2389703, 2305560, 2219254, 2132705, 2047671, 1965122, 1885368, 1808597, 1735201, 1665471, 1599085, 1535549, 1475341, 1420015, 1370779, 1327295, 1288165, 1252066, 1218111, 1185849, 1155606, 1128549, 1105754, 1087257, 1072228, 1059742, 1049156, 1040263, 1033447, 1029212, 1027204, 1026236, 1025821, 1027014, 1031132, 1038096, 1046651, 1055691, 1064678, 1073406, 1082475, 1093727, 1109103, 1128861, 1151548, 1175651, 1200573, 1226123, 1252094, 1278771, 1307354, 1339379, 1375827, 1416648, 1460941, 1507701, 1556757, 1609014, 1665719, 1727802, 1795995, 1870967, 1952916, 2041625, 2137537, 2242275, 2357551, 2484271, 2623410, 2776776, 2945525, 3128513, 3323821]
50785C323821K07993K23208K39779K54771K67097K77442K85435K89285K88062
50776E656893K82324K72121K56342K34547K07928J77833J44766J09571P4366M1218
50766G457909J0731j7317m2645o4441q1977r4550j01584j03589j02523j00381
50756F759633r7820r4902r2646r2818r6375j02918j11428j20742j29655j37773
50746E682556j46350j57037j69449j80991j89582j95496j99749k01819k00274
50737D041809j95006j87528j79185j70297j61032j51924j43262j34870j26749
50728B591956j19050j11325j02808r3806q5751p9227p2971o5626n7707n0919m6061
50717A706705m2481l9124l5319l0853k6079k1764j8364j5685j3583j2363j1905
$$ y = [3323821, 3531814, 3755022, 3994801, 4249572, 4516669, 4794111, 5079546, 5368831, 5656893, 5939217, 6211338, 6467680, 6702227, 6910155, 7087988, 7232754, 7342325, 7416691, 7457909, 7468640, 7451323, 7408678, 7344237, 7262260, 7167710, 7066126, 6962537, 6860014, 6759633, 6661813, 6566911, 6474265, 6381447, 6285072, 6182154, 6070726, 5949984, 5820329, 5682556, 5536206, 5379169, 5209720, 5028729, 4839147, 4643651, 4443902, 4242083, 4041809, 3846803, 3659275, 3480090, 3309793, 3148761, 2996837, 2853575, 2718705, 2591956, 2472906, 2361581, 2258773, 2164967, 2079216, 1999989, 1927018, 1861392, 1803685, 1752766, 1706705, 1664224, 1625100, 1589781, 1558928, 1532849, 1511085, 1492721, 1477036, 1463453, 1451090, 1439185]
50706A439185j1229r689q061p436p638p604o799n347l287p42J607L380N241P792
50692A389373J0369J2245J4222J7414K1129K3872K5985K9031L2753L5275L6584
50681A648252L9186M4387N0493N5893O1624O9033P6866Q2941Q7534R3004J00828
50670B410041J10588J21178J31329J39749J46467J53404J61789J69628J73621
50661C717794J73158J70364J66304J59360J47869J32225J13551R1931O7322M1048
50651D980926J5125r205l1258m9824o3603p2627p8323q1947q3503q2510p9373
50640D363878p5606p2642p0747o9306o8098o7896o9671p3533p8859q5127r2127
50629C540266r9425j06212j11866j16289j19516j21258j21041j18651j14356j08769
$$ y = [1439185, 1427956, 1418267, 1410206, 1402770, 1395132, 1387528, 1380729, 1375382, 1372095, 1371353, 1372960, 1376340, 1381581, 1389373, 1399742, 1411987, 1426209, 1443623, 1464752, 1488624, 1514609, 1543640, 1576393, 1611668, 1648252, 1687438, 1731825, 1782318, 1838211, 1899835, 1968868, 2045734, 2128675, 2216209, 2309213, 2410041, 2520629, 2641807, 2773136, 2912885, 3059352, 3212756, 3374545, 3544173, 3717794, 3890952, 4061316, 4227620, 4386980, 4534849, 4667074, 4780625, 4872556, 4939878, 4980926, 4996051, 4986846, 4955588, 4905764, 4842161, 4769534, 4691211, 4609264, 4525761, 4443251, 4363878, 4288272, 4215630, 4144883, 4075577, 4007479, 3939583, 3869912, 3796379, 3717520, 3632393, 3540266, 3440841, 3334629, 3222763, 3106474, 2986958, 2865700, 2744659, 2626008, 2511652, 2402883]
50619B402883j02625r6548r0765q5038p8983p2638o6587o1304n6491n1375m5674
50608A594855l9845l4334k9114k4256k0227j7086j3964j0121o016k491N66L814
50596A401781P169J0145J3007J6206J9042K0583K1852K5065L0239L4763L7080
50585A636932L8900M2370M6988N1109N4948N9844O5485P0164P3443P6475P9733
50574B296391Q2349Q4006Q5683Q7905Q9616Q9442Q7183Q3444P8646P2874O6193
50563C203732N8809N1305M4741L9694L5217K9513K2114J4679R350O750N936N813
50551C527653O119P089Q529R583R664R407J0027J1482J2177J0910Q298N558K557
50538C639053j854q208j6177k5475l5932m6758n6917o6055p4259q1104q6048q9474
$$ y = [2402883, 2300258, 2203710, 2112945, 2027907, 1948924, 1876286, 1809699, 1748395, 1691904, 1640529, 1594855, 1555010, 1520676, 1491562, 1467306, 1447079, 1429993, 1416029, 1405908, 1399892, 1397401, 1397967, 1401781, 1408950, 1419095, 1432102, 1448308, 1467350, 1487933, 1509785, 1534850, 1565089, 1599852, 1636932, 1675832, 1718202, 1765190, 1816299, 1871247, 1931091, 1996576, 2066740, 2140183, 2216658, 2296391, 2378740, 2462746, 2548429, 2636334, 2725950, 2815392, 2902575, 2986019, 3064665, 3137539, 3203732, 3262541, 3313846, 3358587, 3398281, 3433498, 3463011, 3485125, 3499804, 3509154, 3515904, 3521840, 3527653, 3533772, 3540861, 3549390, 3558973, 3568637, 3578044, 3588071, 3599553, 3611730, 3622640, 3630938, 3636496, 3639053, 3637199, 3628991, 3612814, 3587339, 3551407, 3504649, 3447732, 3381677, 3307418, 3226314, 3140266, 3050792]
50526C050792r2141r3820r3819r2665r1738r1107q9355q5871q1686p7525p2730
50515B088335o7026o1759n8003n4653m9930m3908l8046l2761k7167k1101j5859
50504A618122j2482j0324p920m549n46L543P634J1965J6453K0267K2503K3504
50492A688170K4996K8284L2572L5791L7009L7363L8526M0862M3409M5138M5864
50481B097984M6143M6580M7111M7054M6197M5701M7098N0197N2955N4177N5502
50470B636699N9485O6176P3135P8976Q5208R3736J04015J13933J22594J30653
50460C564610J38427J45382J51401J56951J61700J64261J63806J60716J55287
50451D962541J47018J35858J22886J08795R2630P3143N0807K7633N363j5320l4295
$$ y = [3050792, 2958651, 2864831, 2771012, 2678347, 2586609, 2495502, 2406147, 2320276, 2238590, 2161065, 2088335, 2021309, 1959550, 1901547, 1846894, 1796964, 1753056, 1715010, 1682249, 1655082, 1633981, 1618122, 1605640, 1595316, 1587396, 1582847, 1582301, 1585844, 1593478, 1605443, 1621896, 1642163, 1664666, 1688170, 1713166, 1741450, 1774022, 1809813, 1846822, 1884185, 1922711, 1963573, 2006982, 2052120, 2097984, 2144127, 2190707, 2237818, 2284872, 2331069, 2376770, 2423868, 2474065, 2527020, 2581197, 2636699, 2696184, 2762360, 2835495, 2914471, 2999679, 3093415, 3197430, 3311363, 3433957, 3564610, 3703037, 3848419, 3999820, 4156771, 4318471, 4482732, 4646538, 4807254, 4962541, 5109559, 5245417, 5368303, 5477098, 5569728, 5642871, 5693678, 5721311, 5726674, 5711354, 5677059]
50440E677059n1516o6793p9553q9202r5898j00292j02148j00086r3365q2915p0172
50429D745119n5981m1387k8013j6426n532M893J2230J3580R338K083p434k0775
50417D611695l8314n7674p6117r2493j06296j16732j23809j28868j33016j35937
50407C602439j36873j35799j33107j29088j24240j19170j13860j07844j01219
50398B501239r4463q7276p8921o9937o1889n5140m8436m1186l4423k8759k3241
50387A877568j7259j1904p986m132J374P996J3746J7794K0784K3297K5580K8238
50375A975096L1635L4855L6763L7828L9494M1852M3444M3510M3049M3087M2996
50364B413609M1303L7601L3127K9535K7337K5578K2968J9345J5688J2906J1190
$$ y = [5677059, 5625543, 5558750, 5479197, 5389995, 5294097, 5193805, 5091657, 4991571, 4898206, 4815291, 4745119, 4689138, 4647751, 4619738, 4603312, 4597780, 4602673, 4614903, 4628483, 4637821, 4639904, 4632470, 4611695, 4573381, 4515707, 4439590, 4347097, 4240801, 4124069, 4000260, 3871392, 3738376, 3602439, 3465566, 3329767, 3196660, 3067572, 2943332, 2824162, 2710302, 2602458, 2501239, 2406776, 2319500, 2240579, 2170642, 2108753, 2053613, 2005177, 1963991, 1929568, 1900809, 1877568, 1860309, 1848405, 1840419, 1836287, 1837661, 1845657, 1859403, 1877197, 1897981, 1921278, 1946858, 1975096, 2006731, 2041586, 2078349, 2116177, 2155671, 2197523, 2240967, 2284477, 2327526, 2370613, 2413609, 2454912, 2492513, 2525640, 2555175, 2582512, 2608090, 2631058, 2650403, 2666091, 2678997, 2690187]
50353B690187J0612J1513J3817J6711J9555K2490K5771K9191L2792L7165M2279
50342B952083M6837M9764N1669N3709N5672N6273N4847N1579M6480L9405L0846
50331C489164K1556J1482J63j2066k4346l6562m9076o1271p1548p8897q3450q5468
50319C019681q5086q3112q0723p7900p3304o6170n7335m7937l8226k8329j9193
50308B362366j1863o428k445R4Q68j47k887p690j4757k3211l1244l7404m1604
50295B183648m4914m8482n2410n5620n6945n6211n4133n1424m8641m6471m5193
50284A623204m3810m0809l6260l2047k9528k7818k5286k1990j9379j7935j6426
50273A311916j3654r969o610m213k395m83J799M183O133P351Q274R947J3118J7315
$$ y = [2690187, 2700799, 2712312, 2726129, 2742840, 2762395, 2784885, 2810656, 2839847, 2872639, 2909804, 2952083, 2998920, 3048684, 3100353, 3154062, 3209734, 3266007, 3320854, 3372433, 3418913, 3458318, 3489164, 3510720, 3522202, 3522365, 3510299, 3485953, 3449391, 3400315, 3339044, 3267496, 3188599, 3105149, 3019681, 2934595, 2851483, 2770760, 2692860, 2619556, 2553386, 2496051, 2448114, 2409888, 2381559, 2362366, 2350503, 2344075, 2341630, 2341724, 2342592, 2342445, 2339558, 2331868, 2317111, 2293900, 2262656, 2225252, 2183648, 2138734, 2090252, 2037842, 1982222, 1925277, 1869066, 1814933, 1763509, 1714868, 1668397, 1623204, 1579394, 1538585, 1502325, 1470278, 1440750, 1412932, 1387646, 1365656, 1346277, 1328342, 1311916, 1298262, 1288293, 1281683, 1277470, 1275075, 1274592, 1276391, 1280574, 1286707, 1294058, 1302332, 1312279, 1325397, 1342712]
50259A342712K0987K2783K2767K2244K2332K3092K4158K5666K7798K9640K9596
50248A613775K7318K4495K3010K2921K2781K1472J8968J5669J1998Q492N442K412
50236A818753j011m071n478n417n813q025j1286j4057j5923j7110j7219j6013
50224A697330j4848j5577j7845j9102j7821j5467j4582j5933j8257j9894j9914
50213A508090j8418j6696j6500j8254k0415k1174k0338j8903j7501j6184j5186
50202A308521j4812j4753j4343j3269j1436q724n696l743l364l035j221J135J919
50189A217179J174J093K679M572N539N902N823M456K065Q88K189M033L852K007
50175A263451P09L54p95l519o289p358o742n742n563o550p938q368p405o287o264
$$ y = [1342712, 1363699, 1386482, 1409249, 1431493, 1453825, 1476917, 1501075, 1526741, 1554539, 1584179, 1613775, 1641093, 1665588, 1688598, 1711519, 1734300, 1755772, 1774740, 1790409, 1802407, 1810899, 1816341, 1818753, 1817742, 1813671, 1808193, 1802776, 1796963, 1788938, 1777652, 1763595, 1747672, 1730562, 1713343, 1697330, 1682482, 1666905, 1649060, 1629958, 1612137, 1596670, 1582088, 1566155, 1547898, 1528004, 1508090, 1489672, 1472976, 1456476, 1438222, 1417807, 1396633, 1376295, 1357392, 1339891, 1323707, 1308521, 1293709, 1278956, 1264613, 1251344, 1239908, 1231184, 1225488, 1221745, 1218381, 1215346, 1214125, 1215260, 1217179, 1218353, 1219446, 1222125, 1226697, 1232236, 1238138, 1243961, 1248417, 1250482, 1251370, 1253559, 1257592, 1261444, 1263451, 1264160, 1264514, 1263719, 1260200, 1253911, 1246553, 1239811, 1234069, 1228506, 1221956, 1214018, 1205650, 1198245, 1191958, 1185694]
50160A185694o660n879m001k839l164l452k063N29K555L220L231L501M114M584
50146A179370M650M560M549M196K851Q65k36N08J988K166M94j659k920l293l464
50131A194625l790m407n562p087q023p451n691m271m465n967p205p025n910n271
50117A112500n736o792p917r115j0164j0415r989j0057j1081j1789j0969r375
50105I99101q461p983o545m155k378k133k974m596p165r873j1114j0827j0956
50092I09941j2559j3967j3116j0552q703q917j0517j2230j3272j3253j2250j1007
50080G69598j0283r920r154p720o181n150m692m554m557m627m530l742j908L39
50066F92919J487P47o73q22N05J689J854K249M276P221R053Q906P767P021P257
$$ y = [1185694, 1179034, 1173155, 1169154, 1166315, 1163151, 1159699, 1157636, 1158165, 1160720, 1163940, 1167171, 1170672, 1174786, 1179370, 1184020, 1188580, 1193129, 1197325, 1200176, 1201041, 1200805, 1201313, 1203301, 1205467, 1205961, 1204302, 1201382, 1198089, 1194625, 1190835, 1186428, 1180866, 1173779, 1165756, 1158305, 1152614, 1148343, 1143878, 1137911, 1130706, 1123681, 1117771, 1112500, 1106764, 1099972, 1092055, 1082940, 1072776, 1062361, 1052372, 1042315, 1031234, 1019445, 1008476, 999101, 990640, 982657, 976112, 971957, 969579, 967446, 964472, 959876, 952711, 942838, 931724, 920897, 909941, 897382, 883415, 870299, 859747, 851044, 842127, 831610, 819380, 806108, 792855, 780605, 769598, 759315, 749395, 740241, 732521, 726340, 721190, 716498, 711944, 707387, 702760, 698230, 694488, 692580, 692919, 694406, 695153, 694480, 693658, 694163, 695852, 697706, 699955, 704231, 711452, 720505, 729411, 737178, 744199, 751456]
50051G51456Q202R064R084Q419Q378R994J2497J3820J2798J0406Q764R226J1284
50038H83392J3061J2939J1070R136Q436Q533Q169P090O344O831Q171R113Q798
50025A001083P516O611P535J0468J3706J4811J2864R603Q014R533J2751J5051
50013A129546J5404J5025J5437J6808J8735K1400K4689K6868K5991K2862K0815
50002A353580K1774K3957K4539K3316K2307K2519K2900K2361K1242K0274J9238
49991A598007J7426J4911J2591J1156J0459R966R377Q594P295N160K549L65j196
49978A706660l139o142r114j0396j0199j0478j2238j4351j5487j5777j5855j5548
49966A567936j4618j3760j3671j3851j3492j2850j2606j2452j1587j0218r260
$$ y = [751456, 759658, 768722, 777806, 786225, 794603, 804597, 817094, 830914, 843712, 854118, 862882, 872108, 883392, 896453, 909392, 920462, 929598, 938034, 946567, 954736, 961826, 968170, 975001, 983172, 992285, 1001083, 1008599, 1015210, 1022745, 1033213, 1046919, 1061730, 1074594, 1084197, 1092211, 1101744, 1114495, 1129546, 1144950, 1159975, 1175412, 1192220, 1210955, 1232355, 1257044, 1283912, 1309903, 1332765, 1353580, 1375354, 1399311, 1423850, 1447166, 1469473, 1491992, 1514892, 1537253, 1558495, 1578769, 1598007, 1615433, 1630344, 1642935, 1654091, 1664550, 1674516, 1683893, 1692487, 1699782, 1704942, 1707491, 1707856, 1706660, 1703521, 1697379, 1688265, 1677869, 1667670, 1657192, 1644954, 1630603, 1615116, 1599339, 1583484, 1567936, 1553318, 1539558, 1525887, 1512036, 1498544, 1485694, 1473088, 1460636, 1449049, 1438831, 1429571]
49955A429571q797q162p343p040p241o948n559l672k280j872k303k877k714j812
49941A360951j496k924n312o757o762o690p640r117j0193j0809j1407j2134j2962
49928A256748j3833j4415j4443j4567j5867j8166j9906k0189j9896j9955j9708
49917A065803j8131j5887j4619j4503j3969j2047r825r006r778j0822j0992j0269
49905I15955r198q070o984o191n817n335l995j964m54k95q38q81k92K6l80q95
49889H64392p73K1J066J943K268J877J271J350K428L762M344L793K459R89lk14
49873H90973K52J169K488M021N143N304M714L959L192K292J449P30o22l288o355
49858I15421q038q070q094r313j1107j2549j3828j5228j5893j4842j2551j0356
$$ y = [1429571, 1420774, 1412612, 1405269, 1398229, 1390988, 1384040, 1378481, 1374809, 1372529, 1370657, 1368354, 1365477, 1362763, 1360951, 1359455, 1356531, 1351219, 1344462, 1337700, 1331010, 1323370, 1314253, 1304060, 1293251, 1281844, 1269710, 1256748, 1242915, 1228500, 1214057, 1199490, 1183623, 1165457, 1145551, 1125362, 1105466, 1085511, 1065803, 1047672, 1031785, 1017166, 1002663, 988694, 976647, 966822, 957816, 948038, 937216, 926224, 915955, 906757, 898687, 891703, 885512, 879695, 874360, 870365, 868401, 867947, 867652, 866814, 865933, 865641, 865667, 865287, 864392, 863619, 863640, 864706, 866649, 868917, 870794, 872065, 873415, 875843, 879605, 883949, 887742, 890201, 891190, 891187, 890973, 891225, 892394, 894882, 898903, 904046, 909350, 914064, 918023, 921215, 923507, 924956, 925686, 925064, 921776, 915421, 907383, 899313, 891219, 881906, 870799, 858250, 844422, 829194, 813301, 798459, 785908, 775552]
49846G75552q924q182q153q834r660j0009r905r563q850q015q082r432j0580r727
$$ y = [775552, 766628, 758446, 750293, 741459, 731799, 721790, 711885, 702322, 693472, 685457, 677375, 667943, 657363, 647636]
$$ [...]
##END NTUPLES=NMR SPECTRUM
##END=
