
##TITLE=AC1188_Casanare-tamara3_5891106_5QFzoaXt77
##JCAMPDX= 6.0         $$ Bruker NMR JCAMP-DX V2.0
##DATA TYPE= NMR SPECTRUM
##DATA CLASS= NTUPLES
##ORIGIN= BRUKER
##OWNER= Administrator
$$ 1.72 TOPSPIN		Version 2.1
$$ 2012-04-02 20:49:38.687 -0500  Administrator@TOPSPIN
$$ Compression mode = diff/dup
##.OBSERVE FREQUENCY= 400.13188235
##.OBSERVE NUCLEUS= ^1H
##.ACQUISITION MODE= SIMULTANEOUS (DQD)
##.ACQUISITION SCHEME= undefined
##.AVERAGES= 8
##.DIGITISER RES= 22
##SPECTROMETER/DATA SYSTEM= spect
##.PULSE SEQUENCE= zg30
##.SOLVENT NAME= COFFEE_meoh
##.SHIFT REFERENCE= INTERNAL, COFFEE_meoh, 1, 14.98061
##AUDIT TRAIL= $$ (NUMBER, WHEN, WHO, WHERE, PROCESS, VERSION, WHAT)
$$ ##TITLE= Audit trail, TOPSPIN		Version 2.1
$$ ##JCAMPDX= 5.01
$$ ##ORIGIN= Bruker BioSpin GmbH
$$ ##OWNER= Administrator
$$ $$ C:\Bruker\TOPSPIN/data/COFFEE/nmr/AC1188_Casanare-tamara3_5891106_5QFzoaXt77/10/pdata/1/auditp.txt
$$ ##AUDIT TRAIL=  $$ (NUMBER, WHEN, WHO, WHERE, PROCESS, VERSION, WHAT)
(   1,<2012-04-02 20:49:31.171 -0500>,<Administrator>,<TOPSPIN>,<go>,<TOPSPIN 2.1>,
      <created by zg
	started at 2012-04-02 20:48:24.375 -0500,
	POWCHK enabled, PULCHK disabled,
       configuration hash MD5:
       1A 1E CE 29 27 FD 77 03 67 4E F0 E3 C4 B2 CB 90
       data hash MD5: 64K
       E7 F8 17 5B 4E 40 9C D1 97 CA 0F 47 8A 13 80 44>)
(   2,<2012-04-02 20:49:34.031 -0500>,<Administrator>,<TOPSPIN>,<proc1d>,<TOPSPIN 2.1>,
      <Start of raw data processing
       efp LB = 0 FT_mod = 6 PKNL = 1 PHC0 = 0 PHC1 = 0 SI = 32K 
       data hash MD5: 32K
       78 F4 53 BA 6F CB 01 55 D8 41 7A 71 9E DC 17 CE>)
(   3,<2012-04-02 20:49:34.421 -0500>,<Administrator>,<TOPSPIN>,<proc1d>,<TOPSPIN 2.1>,
      <pk PHC0 = 214.3433 PHC1 = 0 
       data hash MD5: 32K
       36 3D 09 D4 5B 5A 49 BA 23 13 5B 44 B6 04 DE 98>)
(   4,<2012-04-02 20:49:34.500 -0500>,<Administrator>,<TOPSPIN>,<proc1d>,<TOPSPIN 2.1>,
      <abs ABSG = 1 
       data hash MD5: 32K
       79 CF 07 CC CB 8D FA B9 EB A5 0D 95 3C B5 45 EC>)
(   5,<2012-04-02 20:49:34.546 -0500>,<Administrator>,<TOPSPIN>,<proc1d>,<TOPSPIN 2.1>,
      <abs ABSG = 2 
       data hash MD5: 32K
       AB 8A 69 B9 AD 7E 42 5A 32 0B 61 36 BE A9 8A FF>)
(   6,<2012-04-02 20:49:34.578 -0500>,<Administrator>,<TOPSPIN>,<proc1d>,<TOPSPIN 2.1>,
      <abs ABSG = 3 
       data hash MD5: 32K
       12 C4 A7 5A 82 D4 5B 66 8B BB 4D 05 EA 0A D1 1D>)
(   7,<2012-04-02 20:49:34.609 -0500>,<Administrator>,<TOPSPIN>,<proc1d>,<TOPSPIN 2.1>,
      <abs ABSG = 4 
       data hash MD5: 32K
       C1 E6 54 31 45 73 3C FC 2E 1B 81 DD BE FE B0 8E>)
(   8,<2012-04-02 20:49:34.687 -0500>,<Administrator>,<TOPSPIN>,<proc1d>,<TOPSPIN 2.1>,
      <abs ABSG = 5 
       data hash MD5: 32K
       63 A2 A2 6A A6 86 93 D6 A1 E3 58 AC BA ED 45 A7>)
$$ ##END=
$$ 
$$ $$ hash MD5
$$ $$ 08 B0 9A CE 83 FC 0C 6B 79 E1 E2 AB 15 C1 94 2C
##$RELAX= 
##$RELAX= 
##$RELAX= 
##$RELAX= 
##$RELAX= 
##$RELAX= 
##$RELAX= 
$$ Bruker specific parameters
$$ --------------------------
$$ [...]
##$TP= (0..7)
150 150 150 150 150 150 150 150
##$TP07= 0
##$TPNAME0= <>
##$TPNAME1= <>
##$TPNAME2= <>
##$TPNAME3= <>
##$TPNAME4= <>
##$TPNAME5= <>
##$TPNAME6= <>
##$TPNAME7= <>
##$TPOAL= (0..7)
0.5 0.5 0.5 0.5 0.5 0.5 0.5 0.5
##$TPOFFS= (0..7)
0 0 0 0 0 0 0 0
##$TUNHIN= 0
##$TUNHOUT= 0
##$TUNXOUT= 0
##$USERA1= <user>
##$USERA2= <user>
##$USERA3= <user>
##$USERA4= <user>
##$USERA5= <user>
##$V9= 5
##$VALIST= <valist>
##$VCLIST= <CCCCCCCCCCCCCCC>
##$VD= 0
##$VDLIST= <DDDDDDDDDDDDDDD>
##$VPLIST= <PPPPPPPPPPPPPPP>
##$VTLIST= <TTTTTTTTTTTTTTT>
##$WBST= 2048
##$WBSW= 25
##$XGAIN= (0..3)
0 0 0 0
##$XL= 0
##$YL= 0
##$YMAX_a= 521765
##$YMIN_a= -632426
##$ZGOPTNS= <>
##$ZL1= 120
##$ZL2= 120
##$ZL3= 120
##$ZL4= 120
##$ABSF1= 14.98061
##$ABSF2= -5.57192
##$ABSG= 5
##$ABSL= 3
##$ALPHA= 0
##$AQORDER= 0
##$ASSFAC= 0
##$ASSFACI= 0
##$ASSFACX= 0
##$ASSWID= 0
##$AUNMP= <proc_prof1d_extract_pilot.lims>
##$AXLEFT= 0
##$AXNAME= <>
##$AXNUC= <1H>
##$AXRIGHT= 0
##$AXTYPE= 0
##$AXUNIT= <>
##$AZFE= 0.1
##$AZFW= 0.1
##$BCFW= 0
##$BC_mod= 0
##$BYTORDP= 0
##$COROFFS= 0
##$CY= 15
##$DATMOD= 1
##$DC= 0
##$DFILT= <>
##$DTYPP= 0
##$F1P= 0
##$F2P= 0
##$FCOR= 0.5
##$FTSIZE= 32768
##$FT_mod= 6
##$GAMMA= 0
##$GB= 0
##$INTBC= 1
##$INTSCL= 1
##$ISEN= 128
##$LB= 0
##$LEV0= 0
##$LPBIN= 0
##$MAXI= 10000
##$MC2= 0
##$MEAN= 0
##$ME_mod= 0
##$MI= 0
##$NCOEF= 0
##$NC_proc= -8
##$NLEV= 6
##$NOISF1= 0
##$NOISF2= 0
##$NSP= 0
##$NTH_PI= 0
##$NZP= 0
##$OFFSET= 14.98061
##$PC= 1
##$PHC0= 214.3433
##$PHC1= 0
##$PH_mod= 1
##$PKNL= yes
##$PPARMOD= 0
##$PPDIAG= 0
##$PPIPTYP= 0
##$PPMPNUM= 2147483647
##$PPRESOL= 1
##$PSCAL= 4
##$PSIGN= 0
##$PYNMP= <proc.py>
##$REVERSE= no
##$SF= 400.13
##$SI= 32768
##$SIGF1= 0
##$SIGF2= 0
##$SINO= 400
##$SIOLD= 32768
##$SPECTYP= <>
##$SREGLST= <1H.CDCl3>
##$SSB= 0
##$STSI= 32768
##$STSR= 0
##$SW_p= 8223.68421052632
##$SYMM= 0
##$S_DEV= 0
##$TDeff= 65536
##$TDoff= 0
##$TI= <>
##$TILT= no
##$TM1= 0
##$TM2= 0
##$TOPLEV= 0
##$USERP1= <user>
##$USERP2= <user>
##$USERP3= <user>
##$USERP4= <user>
##$USERP5= <user>
##$WDW= 1
##$XDIM= 32768
##$YMAX_p= 460952958
##$YMIN_p= -660451
##$CURPLOT= <Network HP LaserJet P1505>
##$CURPRIN= <$Network HP LaserJet P1505>
##$DFORMAT= <normdp>
##$LAYOUT= <+/1D_H.xwp>
##$LFORMAT= <normlp>
##$PFORMAT= <normpl>
##$SURQMSG= 1
$$ End of Bruker specific parameters
$$ ---------------------------------
##NTUPLES= NMR SPECTRUM
##VAR_NAME=  FREQUENCY,     SPECTRUM/REAL,   SPECTRUM/IMAG
##SYMBOL=    X,             R,               I
##VAR_TYPE=  INDEPENDENT,   DEPENDENT,       DEPENDENT
##VAR_FORM=  AFFN,          ASDF,            ASDF
##VAR_DIM=   32768,         32768,           32768
##UNITS=     HZ,            ARBITRARY UNITS, ARBITRARY UNITS
##FACTOR=    0.250966925370066, 1,           1
##FIRST=     8223.43324360095, -177961,      -4357
##LAST=      0,             -37684,          -104665
##MIN=       0,             -660451,         0
##MAX=       8223.43324360095, 460952958,    0
$$ Real data points
##PAGE= N=1
##DATA TABLE= (X++(R..R)), XYDATA
$$ [...]
19475B13372b39458f8868B79724a53521p3468R0549A52645G1524b79442B90578
19464G8865a52184B80257c16501e2774l08k09863e4397l76430g8277B7972d39100
19452c51035d1676Q475B49820G5380e0134D8383P7349c94234d7538A98385a68429
19440a40320O7686c2758l0544o627m8456r3297a2664p9394B1495a93669A57616
19428b91330J28348D8567b34085A24920j0880C0553i8295c0223D6605N7821b09770
19416A4309a32230L371G2006a03345e1610J2428k80329J26904k9775r1499q9423
19405d03304A89241D2018a9233j28099A60681a63330n5876I7981k7582k4302b81053
19393d92529a07670j479o5523B09973a43138d5207J4288l0323k61009J59883o3520
$$ y = [213372, -239458, -68868, 279724, -153521, -226989, -136440, 152645, 71524, -279442, 290578, 78865, -152184, 280257, -316501, -52774, -53082, -262945, -54397, -430827, -78277, 27972, -439100, -351035, -41676, -33201, 249820, 75380, -50134, 48383, 125732, -394234, -47538, 198385, -168429, -140320, -72634, -32758, -63302, -69929, -118385, -211682, -12664, -92058, 21495, -193669, 157616, -291330, -162982, 48567, -234085, 124920, 114040, 30553, -98295, -30223, 46605, 104426, -209770, 14309, -132230, -128859, 72006, -103345, -51610, -39182, -319511, -192607, -222382, -313881, -403304, 189241, 42018, -19233, -147332, 160681, -163330, -219206, 97981, 70399, 46097, -281053, -492529, -107670, -109149, -174672, 209973, -143138, -45207, -30919, -61242, -322251, -162368, -225888]
19382b25888C1804b07639B27337e7263j02136a7363q1852j5447E9642k688R9902
19371A56856b09470D13459b982r9747p9054E3546J75601b25563A76977d4874B3583
19359a58812d2557o2265A22883a19541L3933F239d6737B27547c21630h0520j04215
19348a84735k3723Q9496q9820C23251b10775f1055J9364j66933j4065i8579H0499
19336a45247j16747A57034c04933c8979m1423A40320b05955F5548a14762A12476
19325I0659f6450m78511f3612k68361D0048a19768j7997A46665b83200b0610A27591
19313B924R2795c37357O9204B1322M8299R7812a85487i1499B2998K01967H7845
19301B96453A45293a87515B15368a78250j41653a35855j27950P3012D2773b62136
$$ y = [-225888, 31804, -207639, 227337, -57263, -159399, -17363, -99215, -114662, 59642, 56954, 156856, -209470, 413459, -2982, -102729, -181783, 53546, 229147, -225563, 176977, -44874, 23583, -158812, -42557, -104822, 122883, -119541, -85608, 6239, -46737, 227547, -321630, -80520, -184735, -208458, -118962, -208782, 323251, -210775, -61055, -41691, -208624, -222689, -98579, 80499, -145247, -261994, 157034, -304933, -38979, -80402, 140320, -205955, 65548, -114762, 112476, 90659, -66450, -544961, -63612, -331973, 40048, -119768, -137765, 146665, -283200, -20610, 127591, 2924, 95719, -337357, -268153, 21322, 69621, 167433, -185487, -91499, 22998, 224965, 87845, 296453, 145293, -187515, 215368, -178250, -319903, -135855, -263805, -190793, 42773, -262136]
19290B2525a2593j25694B2206K02251b70287A42666b21786A16183a25526q2425
19280b07951R9897A19131e1628k24072b038j72651r6177F5118a47027A5340a41789
19268c59068a58981j32987a582n6460b4968n068k65977c2506j32845B8407a57603
19256E00622D6625k2303g0464B10579A2386J77816G4990b50193j71008J01963
19246c19238B67502E9712a45029b1012n2159a6699l80984B57013g6290K9538k59191
19235c05943p5383A88116F4753j1658c7200A11080A9742Q178a12408K1252L9784
19224e1372A475b77963O2498C9568K737b31936a1714r4338l0724l9652B41799
19212A31704a4351k04897q7323d3554B2399a71885K2795A27343c2122j22355k83981
$$ y = [22525, -12593, -138287, 22206, 224457, -270287, 142666, -221786, 116183, -125526, -207951, -108054, 119131, -51628, -275700, -2038, -174689, -270866, 65118, -147027, 15340, -141789, -359068, -158981, -291968, -1582, -58042, -24968, -30036, -296013, -32506, -165351, 28407, -157603, 500622, 46625, 24322, -70464, 210579, 12386, 190202, 74990, -250193, -421201, -319238, 267502, 59712, -145029, -21012, -73171, -16699, -397683, 257013, -76290, -46752, -305943, -381326, 188116, 64753, 53095, -37200, 111080, 19742, 27920, -112408, -91156, -51372, 1475, -277963, -215465, 39568, 42305, -231936, -11714, -106052, -136776, -176428, 241799, 131704, -14351, -219248, -306571, -43554, 22399, -171885, -149090, 127343, -32122, -154477, -438458]
19201d38458a96408C23793a89923j18051K0185P9204r4733d4449r7639e6510B3344
19189b85344q8989a4511F4701a83043J3402Q3402J1828o8270n79A19843R287a21622
19176d07751c8563n5779m06243f8478C27646i1884n2456O6764A20379a04488K9373
19165g5115L3550I2097C4339a25387i376j77827A07284d6330a4554A29083c59073
19153g259B8165c5344H929a68579O9959o2858K0976a0628j87266B94407G9950
19141g4272j02503E5762b98567e9417B50973a99080C6124b6354A74829B8269d50562
19129c26973i7847a7729j18971B90048G7311j6989b84116C176b66124c7504H3801
19117a20138F9923M0696L32791a66954F2593g559m5222r1943A30729i5759k00047
$$ y = [-438458, -196408, 323793, -189923, -307974, -287789, -208585, -303318, -44449, -142088, -56510, 23344, -285344, -374333, -14511, 64701, -183043, -169641, -86239, -74411, -142681, -143260, 119843, 129130, -121622, -407751, -38563, -94342, -500585, -68478, 327646, -91884, -144340, -77576, 120379, -104488, -75115, -41565, 92097, 34339, -125387, -9376, -187203, 107284, -46330, -14554, 129083, -359073, -7259, 28165, -35344, 8929, -168579, -98620, -161478, -140502, -10628, -197894, 294407, 79950, -74272, -176775, 55762, -298567, -59417, 250973, -199080, 36124, -26354, 174829, 28269, -450562, -326973, -97847, -17729, -136700, 290048, 77311, 60322, -284116, 3176, -266124, -37504, 83801, -120138, 69923, 110619, 443410, -166954, 62593, -7559, -52781, -144724, 130729, -95759, -295806]
19106b95806e4377C9838K24516d0251j55173B37269B599N400J21096m4750b38601
19094C10969I3056B4073a08205G2911b26508C1048a60396L251j5698e6121k66304
19083c22425J14053j34945a48814N3605J3302B7315i5666B08265f3194l8679A60
19071A00772b23989R3907M2756L8714j13454H7115e1786j28807A37876i0151A37172
19059B7404b40354d6626A16532a06826M1287C30633j50489A1184m92a40673j23705
19048b64378a30675F7454J475a65752A51053b88591c2878Q805l7186j63006I6971
19036C31141a9078m02684A25383l7765C1114c56861N2236l1464a15739r6254L9906
19025a72087e1630q8120k98670J69094A77844a59981a0849j54894O9058A78433
$$ y = [-295806, -54377, 39838, 264354, -40251, -195424, 237269, 2599, 7999, 129095, 84345, -238601, 310969, 93056, 24073, -108205, 72911, -226508, 31048, -160396, -157145, -172843, -56121, -322425, -208372, -343317, -148814, -95209, -81907, 27315, -95666, 208265, -63194, -101873, 160, 100772, -223989, -130082, -87326, -48612, -162066, 87115, -51786, -180593, 137876, -90151, 137172, 27404, -240354, -46626, 116532, -106826, -65539, 330633, 180144, 11184, 10692, -140673, -264378, -130675, 67454, 68929, -165752, 151053, -288591, -32878, -24073, -61259, -224265, 96971, 331141, -19078, -421762, 125383, 87618, 31114, -356861, -304625, -336089, -115739, -211993, -172087, -51630, -139750, -438420, -269326, 177844, -159981, -10849, -165743, -96685, 178433]
19014a26540D3894O4520h8153A14788B1822b06397A79676B8277f3063j21143M3870
19003a40336g01k98790f8287A92634c5262k49973B43512a27930o0811A81524l485
18992A78039k2781b7120j68428r3312B36931G9060J6182D3912K5441N8987B5354
18980a08481l7804Q069q7023a3786j82673H572P1852J49851b20190C2603J28103
18969A60706g110A76462j3608F6321a82137k062k33581A67887b09266D9773L06095
18958C55868K38057J72994C82646m3260j26917D6530d6912l1142A48904b34502
18947C2939A5014e68974H2402O2904B541J45662a19186g22j30155B88053F8689
18935b78260P3395l1723A22327g2536M501A7665e1658B09735i0475l61664A70271
$$ y = [-126540, 43894, 108414, -88153, 114788, 21822, -206397, 179676, 28277, -63063, -184206, -140336, -701, -299491, -68287, 192634, -35262, -285235, 243512, -127930, -188741, 181524, 178039, 155258, -27120, -195548, -288860, 236931, 79060, 95242, 43912, 69353, 128340, 25354, -108481, -146285, -138216, -225239, -13786, -196459, 8572, 80424, 230275, -220190, 32603, 160706, -7110, 176462, 162854, 66321, -182137, -184199, -417780, 167887, -209266, 49773, 355868, 593925, 766919, 382646, 339386, 212469, 46530, -46912, -78054, 148904, -234502, 32939, 15014, -568974, 82402, 145306, 2541, 148203, -119186, -722, -130877, 288053, 68689, -278260, -204865, -236588, 122327, -72536, -68035, 17665, -51658, 209735, -90475, -452139, 170271]
18923C08917r4710G1180b1409A33975n2141b6303j81357A08737a917l75928J72763
18912b05082D289N7803N6675a57163A14700a8691l37477A05557J98131D5613a33987
18900c19962G5491c63288G1960K2260J32516K55740J63599k88635K89438k29782
18890D17096j95883p6846c12974c2784j19619g1571o7703C08049F9596d12302
18879A23936c77040J45880A48157k0686B4610b67029B69027b18387A37799m3526
18869I4273b72901a13466D2816a19360j07925J5165i5690E8959a74473Q4663I8680
18857a1902k32543I8919b1031A24185A0532a27017j79015a23155j3368h289m05187
18846d13476I2579D4491a9227k95889a08363o50G2795a67072j94499h9091k3984
$$ y = [308917, 214207, 71180, -21409, 133975, 81834, -26303, -207660, 108737, -1917, -377845, -205082, 4289, 62092, 118767, -157163, 114700, -18691, -356168, 105557, 303688, 45613, -133987, -319962, 75491, -363288, 71960, 94220, 226736, 482476, 646075, 357440, 646878, 417096, 221213, 144367, -312974, -32784, -152403, -71571, -139274, 308049, 69596, -412302, 123936, -377040, -231160, 148157, 127471, 24610, -267029, 269027, -218387, 137799, 94273, -272901, -113466, 42816, -119360, -227285, -212120, -95690, 58959, -174473, -89810, 98680, -11902, -244445, 98919, -21031, 124185, 10532, -127017, -306032, -123155, -136523, -8289, -413476, 92579, 44491, -19227, -315116, -108363, -109013, 72795, -167072, -361571, -89091, -113075]
18835a13075A82157a37257f5573A6390b66214J20840K3330A63313D7698J17412
18825A65110a8032o8895o1439G6345f15443A0539b34788B7475f8335D5912b03437
18813a95830l42A52249a07522n6670B65242b80971a2257o0199B71462I0448a90460
18801F5411g4483j27710O5384D72052a37519C33919j22612A0915a83187b4419
18790E9002b8518B00780n5337E143J96751I8822a82422H4423a94271A4932f9511
18778C8212R8828E1593H402O7336J37723d3353j63672R4181j58103a24186D51157
18766a75459B32454d4056A10440B7136a72274f2740l7259b9618k07736e9654H2395
18754i2650j39423m0673A95779b16130A17289a12652M7561A99336f2376l8364
$$ y = [-113075, 182157, -137257, -65573, 16390, -266214, -145374, -122044, 163313, 47698, 165110, -18032, -86927, -148366, 76345, -615443, 10539, -234788, 27475, -68335, 45912, -203437, -195830, -196172, 152249, -107522, -164192, 265242, -280971, -12257, -72456, 271462, 90448, -190460, 65411, -74483, -202193, -136809, 472052, -137519, 333919, 211307, 10915, -183187, -24419, 59002, -28518, 200780, 145443, 5143, 201894, 98822, -182422, 84423, -194271, 14932, -69511, 38212, 137040, 51593, 8402, 75738, 213461, -43353, -207025, -112844, -270947, -124186, 451157, -175459, 232454, -44056, 110440, 27136, -172274, -62740, -99999, -29618, -237354, -59654, 82395, -92650, -232073, -272746, 195779, -216130, 117289, -112652, -65091, 199336, -62376, -100740]
18744a00740j29011A91523h1161j4844p6089b3395B6363a58544R794B89047j24511
18733A64536c8616l17268c2326R094L973I4498J62308p7208c16977B15254b91861
18721c11183B7320R189O6513A4438J3095a56902p7677F4969a08315j70600B37717
18709a60566f8639J7850j26510G6983b2421j97497N9071G9230b9403k72227A26401
18697b1191p1244A06322d09657I320J26700b0889k01863d192j90881i4564K3280
18686g1284E1495a42163H8387b13271k8536J01657B51990h0292F1635J22185K687
18675A86507a38527k27977a01437J7017o3331l3700M3996j92814a10952l6362
18665a47314c6898A45117i2986l27176A31372h3542m2102A30104b36474C6154
$$ y = [-100740, -229751, 191523, -81161, -96005, -172094, -23395, 26363, -158544, -148750, 289047, 164536, -38616, -355884, -32326, -23232, -19259, 94498, 256806, 179598, -316977, 215254, -291861, -311183, 27320, 36509, 103022, 14438, 27533, -156902, -234579, 64969, -108315, -278915, 237717, -160566, -68639, -50789, -177299, 76983, -22421, -219918, -160847, 79230, -29403, -301630, 126401, -21191, -92435, 106322, -409657, 9320, 136020, -20889, -222752, -4192, -195073, -94564, -71284, 51495, -142163, 88387, -213271, -241807, -140150, 251990, -80292, 61635, 183820, 186507, -138527, -366504, -101437, -84420, -147751, -181451, -137455, -330269, -110952, -147314, -36898, 145117, -92986, -420162, 131372, -83542, -125644, 130104, -236474, 36154]
18654e2981A33329J6529j6969e26642f9853j66941A13876J14436a98163A05037
18643A9256b87740a35846E1964c0290r9908I7369l6832J55184I4431a54198I1363
18631a90201D3801a51647E3777b35052A56995C5107c29130L3422A06910B2785
18620h5561K7232K3533k31369G1949M5301i4230j04514j38901K8280A37758c11657
18608b46925j17132B28728D4072a06926l3156O4595F1510H016b67160M2378R0765
18597a34017c6002k00919A27524h0293l3164n7252L6036O5521A51236b38558a05824
18585a96879Q8149F6770a16672N2700k0189k0666k4481q5282A7970O0149N4574
18574A32693g7727l5668m7277B72051b55796O7570P5770M8417b0709l16112H2735
$$ y = [-52981, 133329, 149858, 132889, -526642, -69853, -236794, 113876, 228312, -198163, 105037, 19256, -287740, -135846, 51964, -30290, -130198, 97369, 60537, 215721, 94431, -154198, 91363, -190201, 43801, -151647, 53777, -235052, 156995, 35107, -329130, -295708, 106910, 22785, -85561, -58329, -34796, -266165, 71949, 117250, -94230, -198744, -337645, -309365, 137758, -311657, -246925, -364057, 228728, 44072, -106926, -140082, -75487, 61510, 8016, -267160, -224782, -134017, -36002, -236921, 127524, -80293, -113457, -170709, -134673, -69152, 151236, -238558, -105824, -196879, -108730, 66770, -116672, -63972, -84161, -104827, -129308, -214590, 17970, 78119, 132693, -77727, -113395, -160672, 272051, -255796, -188226, -112456, -64039, -20709, -336821, 82735]
18562C0968e4918n7001F7819e0563G647a0549n04j04074R590F3543Q9684J26887
18550B80114q0288b40960J03254q9506n3859M2622i5661a3720k46618G1737B4330
18538a7455k06017A52756f0913B8827a16539A5720a45885E1020c12173A14706
18527C3264E778J77057b59880A75065c47724B65274r9975e6798E7448L4621K5378
18516A17447c1729A75949a54045j44214R092A61481B6257N2574e8480I680e4885
18504a72789e6475j1774b9837j74489j02771B10798d11505A33445B3154c07002
18493b72240F3916L46226I349b95395a5704j52778k60501b428A57345R7351H0291
18481a14754k54270A5591J33269b10977j56338J51431a6480A22413k0126J84632
$$ y = [30968, -54918, -111919, 67819, -50563, 7647, -10549, -11053, -115127, -105537, 63543, 153227, 280114, 199826, -240960, -137706, -227212, -281071, -238449, -95661, -13720, -260338, 71737, 24330, -17455, -223472, 152756, -60913, 28827, -116539, 15720, -145885, 51020, -312173, 114706, 33264, 5778, 182835, -259880, 175065, -347724, 265274, 165299, -56798, 57448, 92069, 117447, -31729, 175949, -154045, -298259, -289167, 161481, 26257, 78831, -58480, 9680, -54885, -172789, -56475, -68249, -29837, -204326, -307097, 210798, -411505, 133445, 23154, -307002, -272240, 63916, 410142, 9349, -295395, -15704, -168482, -428983, -2428, 157345, 254696, 80291, -114754, -369024, 15591, 148860, -210977, -367315, -215884, -16480, 122413, 102287, 286919]
18471B86919c45649c0344j25014B04382d5937A30728J3208l8680c72774A01611
18460a55555Q478j4096G342J62179M999a59926p8173e7717A67795E3659b26241
18448A58952F4113a97873A29049M8555i6872j87813i0216d520k40292A98324J9724
18437B18048b45014M5793B02207O6697K5265a84957o2485N7381H3001a8531C03056
18425b43793A97145h4174A35004F3097a04523E5838b12722C4964K9665a73032
18414B03162L825H9574O9646d7778j11455A46585C6720R9678J67088i5594j72871
18403b68465K4493B80197o1778a38634A12748J01444b45082e5719j2F6954a70862
18391B37516k3243B3147P6630L7696L5110e5329G284j718Q0456J22510b62799
$$ y = [286919, -345649, -30344, -155358, 204382, -45937, 130728, 143936, 105256, -372774, 101611, -155555, -147077, -161173, 7342, 169521, 174520, -159926, -238099, -57717, 167795, 53659, -226241, 158952, 64113, -197873, 129049, 177604, -96872, -284685, -90216, -4520, -244812, 198324, 218048, -245014, -199221, 202207, 268904, 294169, -184957, -247442, -190061, 83001, -18531, 303056, -243793, 197145, -84174, 135004, 63097, -104523, 55838, -212722, 34964, 64629, -173032, 203162, 206987, 89574, 159220, -47778, -159233, 146585, 36720, 136398, 303486, -95594, -268465, -243972, 280197, 218419, -138634, 112748, 214192, -245082, -55719, -55731, 66954, -170862, 237516, 214273, 23147, 99777, 137473, 172583, -55329, 7284, 5566, 86022, 208532, -262799]
18379b37895C9709b90303c5252j27523o6301A10577a0521I6187c8057A71327b6472
18367b79869C42126B8495f0885B90037A38107O1939n329b63658d2561k5687A63690
18355I481c9269j38088N9936K025D8781a02353A05190a70262f9914C03371d4943
18343A11780b66926H139J21780a49134A91898a12096E7761e4430o4951j54464
18333b73845A2145f8988j57346Q713d9907j04477k79794A54635j3201A8272c6331
18321G1069j3778O389j447j9087b12004j996a01707F8791b294m969A39196F5072
18308b60553J1336R4475j4232a0809A47804D3306b54207h5312B313K04140a37463
18296h9401A93578E5247i7625E15f4234B36633a31285d6784k678F7124f7535j25240
$$ y = [-237895, 39709, -290303, -35252, -162775, -229076, 110577, -10521, 96187, -38057, 171327, -26472, -279869, 342126, 28495, -60885, 290037, 138107, 200046, 194717, -263658, -42561, -68248, 163690, 9481, -39269, -177357, -117421, -115396, 48781, -102353, 105190, -170262, -69914, 303371, -44943, 111780, -266926, 8139, 129919, -149134, 191898, -112096, 57761, -54430, -119381, -273845, 12145, -68988, -226334, -217621, -49907, -154384, -434178, 154635, 141434, 18272, -36331, 71069, 57291, 63680, 62233, 43146, -212004, -214000, -101707, 68791, -2294, -7263, 139196, 65072, -260553, -249217, -154742, -168974, -10809, 147804, 43306, -254207, -85312, 2313, 206453, -137463, -89401, 193578, 55247, -97625, 515, -64234, 236633, -131285, -46784, -49462, 67124, -67535, -192775]
18284a92775L1344A00540g4087r3675d4314E4643M3854i8509D2574J80693a774
18272E6942b21906a3721l0904p7893C89310H0796a77735J8595C3059d3812k47006
18261b90818I0005d7979E2960h4114A32895I684a82331b5305r2773j03980d6122
18249H1420l9005J08865a28671C15894i3232B21771d120j28708B4578f8147i344
18237B18563h8695D02446e5600B89714g1657A65441b6306B37998b8848j36589
18227a65437K1301L6798M5779j01803H1061M1585P5229d04807A71615b47642G5933
18215G211J71452d9370j07590b2564B8261d67342D2550a07824A07881d7333J1408
18204c5925j42881j365E74690F2561A5736b36669d0226B33697g7002a4763B84960
$$ y = [-192775, -161431, 100540, -74087, -167762, -44314, 54643, 98497, -98509, 42574, 223267, -1774, 56942, -221906, -13721, -44625, -122518, 389310, 80796, -177735, -159140, 33059, -43812, -290818, 90005, -47979, 52960, -84114, 132895, 9684, -182331, -25305, -118078, -222058, -46122, 81420, 42415, 151280, -128671, 315894, -93232, 221771, -4120, -132828, 24578, -68147, -9344, 218563, -88695, 402446, -55600, 289714, -71657, 165441, -26306, 237998, -28848, -165437, -144136, -107338, -61559, -163362, 81061, 122646, 197875, -404807, 171615, -247642, 75933, 7211, 178663, -49370, -156960, -22564, 28261, -467342, 42550, -107824, 107881, -47333, -35925, -178806, -180171, 574690, 62561, 15736, -236669, -40226, 233697, -77002, -14763, 284960]
18192B23280p9288K07674d62465A55952b32859j617R7551F8602e6145j40070e6924
18180E853J86152a13299c452j36795e1121k14914J01370A96106a73687N5523n733
18169a23897a4357p2597l55675a7857j31938l1590e8747B49766a25242a5027A81126
18157a00750r4104B68312A7355a0041j14148d7274a1396N675A14947n3868a87364
18145b17567c4433j34627D8316c0806B21580b0509A37936d2714a4378K997B77616
18133A24368a30039A52532d8338a3298A43993g1084j29974C1210a7491o4933j37423
18122b19847j61523A12521l4557L4935f4173o8650b4709g993F3994a62227B39758
18110e9016j73840J11360D2837K38556c8933o7956a6326k66250A45492l3861c51184
$$ y = [223280, 143992, 351666, -462465, 155952, -232859, -234476, -136925, 68602, -56145, -196215, -56924, 5853, 192005, -113299, -3452, -140247, -51121, -266035, -164665, 196106, -173687, -118164, -123897, -14357, -86954, -442629, -17857, -149795, -181385, -58747, 249766, -125242, -15027, 181126, -100750, -194854, 268312, 17355, -10041, -124189, -47274, -11396, -5721, 114947, 61079, -187364, -217567, -34433, -169060, 48316, -30806, 221580, -20509, 137936, -42714, -14378, -11381, 277616, 124368, -130039, 152532, -48338, -13298, 143993, -71084, -201058, 31210, -17491, -82424, -219847, -381370, 112521, 77964, 112899, -64173, -132823, -24709, -7993, 63994, -162227, 239758, -59016, -232856, -121496, 42837, 281393, -38933, -106889, -16326, -282576, 145492, 111631, -351184]
18098a13221H8780J34896a53258G0629b0910l23451N8962I7182K3919c88748J55483
18087b33265f345q1452G300a94480A83448a49186A72201e3720A71364i1481j68960
18076b60441Q3617A13919c24702D0734b26745j37396H8321a20984H0900a90889
18065G431a26283f474l4137A88664F7360h3811I0809b03004A54848d7648j73374
18054b21022e7399j07022i206A21292R6064I026K67499A3342K7855M072a78963
18042A30854f5235C9136d3959B53930J07536C9143j7218i8489B06188c25p7273
18031g7598B456b1142l6821l05906h5056j6884C16363j26970C3725a08011b5106
18019C943c31125A6347L4967B39g8205E1564b51792A01965L08314C5379L57813
$$ y = [-113221, 88780, 223676, -153258, 70629, -20910, -344361, -285399, 97182, 121101, -388748, -233265, -6345, -87797, 7300, -194480, 183448, -149186, 172201, -53720, 171364, -91481, -260441, -176824, 113919, -324702, 40734, -226745, -364141, 88321, -120984, 80900, -190889, 7431, -126283, -6474, -40611, 188664, 67360, -83811, 90809, -203004, 154848, -47648, -221022, -57399, -164421, -9206, 121292, 217356, 9026, 276525, 13342, 41197, 45269, -178963, 130854, -65235, 39136, -43959, 253930, 361466, 39143, 21925, -98489, 206188, -325, -77598, 2456, -21142, -57963, -363869, -85056, -101940, 316363, 189393, 33725, -108011, -25106, 3943, -331125, 16347, 51314, 239, -78205, 51564, -251792, 101965, 410279, 35379, 393192]
18008C93192b27869A27515l1249K66452a91402A3274J63494M7627d725j922A67752
17996H6081l1412d28821b4452r2977C4062J49481g8866A51603h6651B17021c10377
17984B7773Q3826J98893a86876N9823e5609F4714c91760e0806o5979F8284a95451
17972C16915d6219R37B01179D8994j4163c09025A38348B6833a59419A0688d149
17960C2999c96974c1442j5430G0422f3742j56773B40987I2936b53217R5510M5056
17949a12651A56324J03203c81273a10765j3679m673d1056E8086K443i9532B18035
17937b48187I8079b01441A7237d7799j26442a089j11255A45525a26977B74638
17926i6521a237j89237l78370g982j48406J7781C14653k0563j36858O3151a70261
$$ y = [393192, -227869, 127515, 96266, 362718, -191402, 13274, 176768, 224395, -4725, -6647, 167752, 86081, 54669, -428821, -24452, -117429, 34062, 183543, -78866, 151603, -86651, 217021, -310377, 27773, 111599, 310492, -186876, -127053, -55609, 64714, -391760, -50806, -116785, 68284, -195451, 316915, -46219, -45282, 201179, 48994, 34831, -309025, 138348, 26833, -159419, 10688, -4149, 32999, -396974, -31442, -46872, 70422, -63742, -220515, 240987, 92936, -253217, -157707, -112651, 156324, 259527, -381273, -110765, -124444, -129117, -41056, 58086, 60529, -99532, 218035, -248187, 98079, -201441, 17237, -47799, -174241, -1089, -112344, 145525, -126977, 274638, -96521, -1237, -190474, -568844, -7982, -156388, -138607, 314653, 294090, 157232, 220383, -170261]
17914B2277K88738j43614m2065B5341a15368B64483h1294A12433c49885A73014
17903G7452R4729k1783F3366g366j30871B09197a74831C9460D535c0717B8050
17891A47027I373J64324a08277D2342J06495J65760F3199a91751d8706n4376c9840
17879d01846f2497j8366D2494J53531a68906A09329P0511J370a25923L3449B22257
17867a10644G3072K3759k1482g6201F5838J10882a44596C49607A18106i9566n8970
17856a58536a3416A25712b00259r9217J3935D2853N4988g1679F574K78907j20582
17845A64899A1694P9369J36519a23709B0356J25945n436h833B24456E8169e5007
17833d7568E04977A05748l3124g177m3208j36850A41566f3053B10639F2719a55761
$$ y = [22277, 311015, 167401, 125336, 25341, -115368, 264483, -81294, 112433, -349885, 173014, 77452, 172181, 150398, 63366, -7366, -138237, 209197, -174831, 39460, 4535, -30717, 28050, 147027, 9373, 173697, -108277, 42342, 148837, 314597, 63199, -191751, -48706, -103082, -39840, -401846, -62497, -80863, 42494, 196025, -168906, 109329, 179840, 181210, -125923, -92474, 222257, -110644, 73072, 96831, 75349, -76201, 65838, 176720, -144596, 349607, 118106, -99566, -158536, -13416, 125712, -200259, -299476, -285541, 42853, 97841, -71679, 6574, 285481, 164899, 11694, 91063, 227582, -123709, 20356, 146301, 140865, -8833, 224456, 58169, -55007, -47568, 504977, 105748, 72624, -7177, -50385, -187235, 141566, -63053, 210639, 62719, -155761]
17821H388J14026E4308b64095R5145F9854N9171O0362d15411A6784K12133f247
17809b59935f5896I8895l637G259h3521B07113A6020c84904B27880m9807K25845
17798D03918A73434o2786m2208k23i6332A80133b87274P0267p2789m8536H5351
17786h7814B02237p4413k6898a6417C63125A29731A8949b175n5393B05405l3734
17775A71671a28042A00007l9284J78869d5006j40925O1276A33056K5445b75538
17764a26338A19994j7650G500K17560e7126E16314c05437G1025J56459A9521f2988
17752c16455d9342A53498o2581J03066b05326G2238i1314B33924Q338o1470b7643
17740A70952p4995a69752D1824K09936b3511E2916J96286K5730j7074k4815f488
$$ y = [8388, 122414, 54308, -264095, -168950, 69854, 129025, 189387, -415411, 16784, 228917, -6247, -259935, -65896, 98895, 95258, 7259, -83521, 207113, 16020, -384904, 227880, 178073, 403918, 173434, 110648, 68440, 68217, -96332, 180133, -287274, -217007, -289796, -338332, 85351, -87814, 202237, 127824, 100926, -16417, 363125, 129731, 18949, -2175, -57568, 205405, 171671, -128042, 100007, 60723, 239592, -45006, -185931, -124655, 133056, 158501, -275538, -126338, 119994, 102344, 7500, 225060, -57126, 516314, -305437, 71025, 227484, 19521, -62988, -316455, -49342, 153498, 90917, 193983, -205326, 72238, -91314, 233924, 242262, 180792, -27643, 170952, 95957, -169752, 41824, 251760, -23511, 52916, 249202, 274932, 257858, 233043, -6488]
17728E9464K13036K9922E0866J07744g4740A95765a9168p3305j21909l0255a8153
17716B06520I3378a13189B92811A44177N3296G4199K11525m3235I7216C7537K6488
17705F4025L1969J58070C2163b90917B31165g9172D53644a1361A07894i0833A10655
17693a76371F9000M3956J8297i4503A31766a02750A3644g7790C19878j27801F4330
17681a52924C19670i5898a0868B37531P973a27200f3133G8278g9328j30005A57420
17669C83927A15101i1835A15219a45140b3725B36190B6336A2333J33745K2588
17659A68666O5699q5516E4767P9178k176F0891O5245a76153n0127i1793A21923
17647a627l13220B2135M15989I5400K45285f6805j1705D7262K63128a4304A79810
$$ y = [59464, 272500, 302422, 50866, 158610, -74740, 195765, -19168, -92473, -214382, -244637, -18153, 206520, 93378, -113189, 292811, 144177, 197473, 74199, 285724, 242489, 97216, 37537, 64025, 95994, 254064, 32163, -290917, 231165, -79172, 453644, -11361, 107894, -90833, 110655, -176371, 69000, 112956, 131253, -94503, 131766, -102750, 13644, -77790, 319878, 192077, 64330, -152924, 319670, -95898, -10868, 237531, 245504, -127200, -63133, 78278, -79328, -209333, 157420, 383927, 115101, -91835, 115219, -145140, -23725, 236190, 26336, 12333, 146078, 168666, 234365, 148849, 54767, 133945, 131769, 60891, 126136, -176153, -226280, -91793, 121923, -1627, -314847, 22135, 438124, 95400, 340685, -66805, -78510, 47262, 310390, -14304, 179810]
17635C89474C0930b82348A33451A872P862J60392o1696N3197H941b95112E4654
17623A83803J58050d2230P513B16944i6302A50285b3014A14624J02038O6446a36937
17611A56935j2058m2030d39636H0566B7343e4723L878g058C26919d0792p646B32780
17598B56292h6393A97436p3937A9470b52612F30037f9609D2293J55518b60044
17587C39838j65395G1361K590J72063K20614f1598c981C52121r3518j17240a85671
17575A41526J38356F8705i5861B54979H5129j8097b15688C25792j16565b6858
17564F0154k294M5430K27375H9880b2203r7906g058B28739C9381R7912J84242
17553C21535N3063j46975c3614C98238h2354B03973K91974j70967J52729q8620
$$ y = [389474, 30930, -282348, 133451, 1872, 9734, 170126, 108430, 161627, 8941, -295112, 54654, 183803, 341853, -42230, -34717, 216944, -96302, 150285, -23014, 114624, 216662, 283108, -136937, 156935, 144877, 102847, -439636, 80566, 27343, -54723, -50845, -7058, 326919, -40792, -48438, 232780, 256292, -86393, 197436, 123499, 19470, -252612, 630037, -69609, 42293, 197811, -260044, 339838, 174443, 71361, 73951, 246014, 466628, -61598, -3981, 352121, 258603, 141363, -185671, 141526, 279882, 68705, -95861, 254979, 85129, 67032, -215688, 325792, 209227, -26858, 60154, 57860, 103290, 330665, 89880, -22203, -120109, -7058, 228739, 39381, 137293, 321535, 374598, 227623, -33614, 398238, -82354, 203973, 495947, 324980, 477709, 389089]
17543C89089j06801I3548J1384C8630L58175A10955J19516A8838J19184J17239
17533B55261J11466j00519J01827C9169R4199K4485P148M4385j03251J68099J48732
17522D22966l3454A07816J79526J78627I6941K50786n9667K46014k007j69656
17512C62411K84408K68312J88885n04030J35864K2092k7281q5739k24751j43172
17502B76999J347K61584N4264j81478L07247k69548L73850o4186R3490P3060k04414
17491G22215O4022q2101q5485B34507M44961B46226J28261k6218j35965J0116
17481B22420K18320p0853j03337m8662k7351K38709I5631J60962A16501J38283
17471B54784K5936M9787c2067A16552O6776J56753F1700j0834N19314G8979K67880
$$ y = [389089, 282288, 93548, 104932, 38630, 396805, 110955, 230471, 18838, 138022, 255261, 366727, 266208, 368035, 39169, 133368, 157853, 165001, 209386, 106135, 274234, 422966, 389512, 107816, 287342, 465969, 96941, 347727, 288060, 534074, 532067, 362411, 646819, 915131, 1104016, 599986, 735850, 757942, 730661, 644922, 420171, 276999, 278346, 539930, 594194, 412716, 719963, 450415, 824265, 760079, 853569, 926629, 722215, 786237, 704136, 618651, 234507, 679468, 246226, 374487, 348269, 212304, 222420, 440740, 369887, 266550, 217888, 190537, 429246, 95631, 256593, 116501, 254784, 280720, 330507, -32067, 116552, 183328, 340081, 61700, 50866, 570180, 78979, 346859]
17460C46859j54186h436E84253k23959A43087K26414j11536K46863A73354K05326
17450C78680l8194I1187K92464A47224N6366F7424L9170K12129o0498d1219D38830
17438A6467a04255B94749K67023A79519B2680M63846j07682p3480K83715j63670
17428D25409j08681K94896k09383Q2483B37114J35581N4895J30798L9728A18597
17417B11882L49017n9549k16512K2231A30438K21020m3473j44816L17687J67193
17407F48049j59986k25067j20181L04960A00640R0912J93741a51818E3368J08321
17397A61689j9204K10139j02506J03178j51810n1887J54091j38070K04568j69655
17387B00533J91831m5350a63683B96169J69784j93623J93939A72320K63613p4888
$$ y = [346859, 192673, -8436, 584253, 360294, 143087, 369501, 257965, 504828, 173354, 378680, 340486, 91187, 383651, 147224, 203590, 67424, 106594, 318723, 258225, -41219, 438830, 16467, -104255, 294749, 561772, 179519, 22680, 486526, 378844, 305364, 589079, 425409, 316728, 611624, 402241, 484724, 237114, 372695, 427590, 558388, 598116, 118597, 211882, 560899, 501350, 284838, 307069, 130438, 351458, 307985, 163169, 480856, 648049, 488063, 262996, 142815, 447775, 100640, 191552, 385293, -151818, 53368, 161689, 142485, 352624, 250118, 353296, 201486, 149599, 303690, 165620, 370188, 200533, 392364, 347014, -163683, 296169, 465953, 272330, 466269, 172320, 435933, 361045]
17377C61045j13311l8434N4454K0818O2116J8989A60276m4295a31177B90609R6065
17366C86674K94934k53165j56670N7254r6548J15420K12862A53409J47182A24828
17355E60348B69679a9520A85296n2558J35457r3003J29299M7940j665L9109N9958
17344D49833j70260J21184h8220C62422I1955L87903n0862k08970A03880J19241
17334B23121J59312I9126L34150J0933j59878l2448m1819J00456A03147K48248
17324C51395p5126j5817J0305J6761p8980j3687R829j7046k7489C25L33166F9561
17311C76501m9957F0952N053Q1208K37259J00267L31537B61937k911Q9435K2278
17300C70739M02680C83129A60311n8931K40028q6578l5856a51616A60764J03209
$$ y = [361045, 247734, 209300, 263754, 284572, 346688, 365677, 160276, 115981, -131177, 290609, 386674, 681608, 428443, 271773, 329027, 232479, 347899, 560761, 153409, 300591, 124828, 560348, 269679, -19520, 185296, 132738, 268195, 175192, 304491, 352431, 350766, 389875, 449833, 279573, 400757, -88220, 362422, 91955, 479858, 428996, 220026, 103880, 223121, 382433, 99126, 433276, 444209, 284331, 251883, 210064, 310520, 103147, 351395, 276269, 260452, 270757, 287518, 208538, 194851, 204680, 187634, 160145, 325, 333491, 69561, 376501, 326544, 60952, 66005, 147213, 384472, 484739, 816276, 261937, 259026, 348461, 370739, 773419, 383129, 160311, 101380, 341408, 254830, 218974, -151616, 160764, 263973]
17290B63973C2582M36026A62369M4471J87343J04280A75162K3371a21699A65546
17279A93539R3027J15958R0714Q0510j26631L5672k9075B06458J93595K7470A55598
17267B69043K68242k28661k7852j34589K34922N7815J15259j65875q3170B0669
17256E03847p2449J46555j42141j81467L28771n8344A49466J36548A15330J69834
17246B85164j16464K16080j67994P1605j09022e2794C53987j46231M20244j22179
17236E05821k21536J25928R1224k37923M3274J35644r1016m2430N1628j09114
17226B51500J31539K4115L4010r6319A58774K65025A57470M12267k56541I5112
17215A70782c1005F46515j79865Q1693K36242l60237j3759l8531G9254J86178
$$ y = [263973, 32582, 468608, 162369, 206840, 394183, 498463, 175162, 198533, -121699, 165546, 193539, 286566, 402524, 493238, 573748, 447117, 482789, 453714, 206458, 400053, 427523, 155598, 269043, 537285, 308624, 280772, 146183, 381105, 438920, 554179, 388304, 305134, 20669, 503847, 431398, 577953, 435812, 254345, 583116, 524772, 149466, 286014, 115330, 285164, 168700, 384780, 216786, 288391, 179369, -52794, 353987, 207756, 628000, 505821, 284285, 410213, 501437, 263514, 306788, 442432, 351416, 308986, 360614, 251500, 383039, 407154, 441164, 344845, 158774, 423799, 157470, 569737, 313196, 95112, 170782, -31005, 646515, 466650, 548343, 784585, 424348, 410589, 372058, 79254, 265432]
17205B65432L50678j66149m4239J88806B78025K3292j7941K16268j48148N6360
17195D07856K33175k30123j26556J24279L30705A39677L14655j49955r5430K38396
17185D47343K8137E8550K71641J15455L3017K19485B30847K05011D1050K20709
17175B61759L17021K06738A83707J74311J26361O8693A95576K59115j51454J25154
17165D28391P0511k3430K51984k36702k9803A90115M29735j52608j12520q8946
17155B65776K84813R1766K03992j58464C43274J07036j17124N25911B98022M72204
17145G70226j30276Q1562l51630K76206j90808J20069r2167J19746k92220M27218
17135G37926k14352J57226C38523L40568j84294J38150B17195L79037P5428J87189
$$ y = [265432, 616110, 449961, 405722, 594528, 278025, 301317, 283376, 499644, 351496, 407856, 641031, 410908, 284352, 408631, 739336, 139677, 454332, 304377, 208947, 447343, 475480, 58550, 330191, 445646, 478663, 698148, 230847, 435858, 41050, 261759, 578780, 785518, 183707, 358018, 484379, 553072, 195576, 454691, 303237, 428391, 498902, 475472, 727456, 490754, 460951, 190115, 619850, 467242, 354722, 265776, 550589, 642355, 846347, 687883, 343274, 450310, 333186, 859097, 298022, 770226, 639950, 721512, 369882, 646088, 455280, 575349, 483182, 602928, 310708, 737926, 523574, 680800, 338523, 679091, 494797, 632947, 217195, 596232, 671660, 858849]
17125H58849m23121j71290J37589K7018P6451K75762l54412M9244D3842R11379
17115I55221k90348j8926p605J02094k54123j8863M27525j82317j18001N5209
17105F49866q8949K03930k80076K24351J37475j52457J92k52919K94752k22734
17095E13431K92152n0133r1351k58664L05816Q0084r8881j77532J65803r960j24223
17084E46542L38642D39574J21939p2279K35018J98083r3485K35278l59366K31322
17074I36084k89876R2746R5094k50600J78513J35777J94070m06867K6927P5207
17064G87075J1817L3282J67268m21077N94501n67958K45889J90229m28635K03283
17054H15674N0183j11093M93038k26727j90712J64627o308m5174k32034R7491
$$ y = [858849, 435728, 264438, 402027, 429045, 505496, 781258, 426846, 476090, 43842, 955221, 664873, 645947, 638342, 740436, 486313, 467450, 894975, 712658, 594657, 649866, 560917, 764847, 484771, 709122, 846597, 694140, 694332, 441413, 736165, 513431, 805583, 755450, 664099, 405435, 711251, 791335, 692454, 514922, 680725, 670765, 546542, 885184, 439574, 561513, 489234, 724252, 922335, 828850, 1064128, 704762, 936084, 646208, 738954, 834048, 583448, 761961, 897738, 1091808, 684941, 711868, 787075, 798892, 832174, 999442, 578365, 1172866, 604908, 850797, 1041026, 612391, 815674, 865857, 754764, 1247802, 1021075, 830363, 994990, 988682, 943508, 711474, 808965]
17044H08965k25785J1966N24480k86247K78980j98666P0005J4697j36427K28936
17034A090904m63906Q20346F66826M9542K64206m4385J14417J66272j40740l09677
17024G66461L5035K94819k68562j87488N19406k4072k9363k4742J08718j62860
17014A027352L55172n7960k09830J35606j48481n9161K2775K00812l08272O7916
17004A025929O2557K05559k95773k5954J18413Q1257N154k91374k15234N76788
16994A247322j87273k67121L33396Q9200n791K19777p2238j3197L7464J06319
16984A487858l57613L14285k39010l3557k804j15478L16440q3551N9494p0070
16974A275994L6464K55928n74375M54163l80005L7628K78269k803m1449n7951
$$ y = [808965, 583180, 595146, 1119626, 833379, 1112359, 913693, 983698, 998395, 861968, 1090904, 626998, 1447344, 666826, 716368, 980574, 936189, 1050606, 1216878, 1076138, 766461, 801496, 1096315, 827753, 640265, 1159671, 1135599, 1106236, 1081494, 1190212, 1027352, 1382524, 1324564, 1114734, 1250340, 1101859, 1042698, 1065473, 1266285, 958013, 1025929, 1088486, 1294045, 998272, 972318, 1090731, 1171988, 1177142, 885768, 670534, 1247322, 1060049, 792928, 1126324, 1215524, 1209733, 1429510, 1357272, 1344075, 1381539, 1487858, 1130245, 1444530, 1205520, 1171963, 1169159, 1053681, 1370121, 1286570, 1346064, 1275994, 1312458, 1568386, 994011, 1448174, 1068169, 1105797, 1384066, 1381263, 1339814, 1281863]
16964A281863Q2671l52691L17872J71162m35881M76788p7274L44594k33523J98052
16954A773633j44394j53753r81R7819K11839j74159J98242k09192k03393L24345
16944A720006j41934r0596M01626l32047O2903K22196j34915O8731l7019r5984
16934A642967M10014l14954j74852N19142k65232P9284l2191l3052J86588K42758
16924B260472l70039K68460j85432L01015M9216n41652K13367K08945M27Q6399
16914B291178L7987j20638j23967J86785J55043J0002K65802m25080L72729m11905
16904B237936K59407Q3173l32254K78492K13226j95313J95780Q8734k79605J39023
16894B688599j16537J58456M1497k29419O0304J34035R8168K27595k01455J74591
$$ y = [1281863, 1364534, 1011843, 1329715, 1500877, 1064996, 1541784, 1464510, 1809104, 1575581, 1773633, 1629239, 1475486, 1474505, 1572324, 1784163, 1610004, 1808246, 1599054, 1395661, 1720006, 1578072, 1487476, 1889102, 1557055, 1619958, 1842154, 1707239, 1775970, 1738951, 1642967, 2052981, 1738027, 1563175, 2082317, 1817085, 1896369, 1864178, 1831126, 2017714, 2260472, 1890433, 2158893, 1973461, 2274476, 2323692, 1782040, 1995407, 2204352, 2204779, 2291178, 2329165, 2208527, 2084560, 2271345, 2426388, 2436390, 2702192, 2277112, 2649841, 2237936, 2497343, 2580516, 2248262, 2526754, 2739980, 2544667, 2740447, 2829181, 2549576, 2688599, 2572062, 2730518, 2772015, 2542596, 2602900, 2736935, 2835103, 3062698, 2861243, 3035834]
16884C035834n4960j29977J48991o0945M42288l09167J11999j11646n3767O01254
16874C619904k53310J20351K8476j7398j95996M74873k19276P7752j0692M32217
16864D056901L0857N5943j79340M3012L22794n02100M35541l12687J96608K64324
16854D411853j26976J51434o5490l6906N04677k28506M8301k7373J36530n6001
16844D711543R1701L17132j7248k9912K56662j69001M19286K9584k64621J14719
16834E459845K24630N2712L83325n9828r0839m6760L3735K06762M32086j74637
16824F421031q4083K98824j08540M43754K95908m23645L61066J32413j4469L58222
16814G680481j23046O9195L30220J22409M28613O2194J25422K41462J94994Q4422
$$ y = [3035834, 2980874, 2850897, 2999888, 2938943, 3381231, 3072064, 3184063, 3072417, 3018650, 3619904, 3366594, 3486945, 3515421, 3498023, 3302027, 3776900, 3557624, 3635376, 3624684, 4056901, 4087758, 4143701, 3964361, 4007373, 4330167, 3828067, 4263608, 3950921, 4147529, 4411853, 4284877, 4436311, 4370821, 4333915, 4838592, 4610086, 4658387, 4631014, 4767544, 4711543, 4803244, 5120376, 5103128, 5073216, 5329878, 5160877, 5580163, 5609747, 5345126, 5459845, 5684475, 5737187, 6120512, 6060684, 5969845, 5923085, 5956820, 6163582, 6595668, 6421031, 6336948, 6635772, 6527232, 6970986, 7266894, 6843249, 7204315, 7336728, 7322259, 7680481, 7557435, 7626630, 7956850, 8079259, 8507872, 8570066, 8695488, 8936950, 9131944, 9216366]
16804I216366N4690N32114P2357R8296n6061L28773K99081l02811O77451L72669
16794A1292925J48238M23814l8633L74143L1227L27430L84874N84787K8014L18350
16784A3875169L94673L14790O49887J57890L10647N72834Q6959N12876N40742
16775A7416467N55284k80518J296357K03500N32231M70351N00226N88595N43182
16766B1825675P53653N96199N92995R93751N76196N97241R10498P19951Q67001
16757B8433160Q95693Q20167J018759J136025Q50483J121459J536797J089152
16749C6901695P23845J671388J088777J764547J275401J321940J664800J818244
16741D8230637K033937J487878K216417J587719K099236K184836K095121K605995
$$ y = [9216366, 9271056, 9803170, 9875527, 9973823, 9917762, 10246535, 10545616, 10242805, 10920256, 11292925, 11441163, 11864977, 11826344, 12200487, 12231714, 12559144, 12944018, 13528805, 13556819, 13875169, 14269842, 14584632, 15234519, 15392409, 15703056, 16275890, 16362849, 16875725, 17416467, 17971751, 17691233, 18987590, 19191090, 19723321, 20193672, 20693898, 21282493, 21825675, 22579328, 23175527, 23768522, 24762273, 25338469, 25935710, 26846208, 27566159, 28433160, 29328853, 30149020, 31167779, 32303804, 33154287, 34275746, 35812543, 36901695, 37625540, 39296928, 40385705, 42150252, 43425653, 44747593, 46412393, 48230637, 50264574, 51752452, 53968869, 55556588, 57655824, 59840660, 61935781, 64541776]
16733F4541776J967982K820281K345062K737016K473871K689699K468879K959810
16725H5004376K874293K811738L122509K672263L069400K355327K849159K720407
16717A07479472K589035K367266K138792K042358J810099J185446J185344J395661
16709A22193473P00965L13407J00138l41329m84977j021509j146721j647182j716882
16700A16949383j876056k132332k350913k696430k657276k381785k938574k794720
16692I7121297l100410l055613k933123k622258l010900k611106k972259k710563
16684G4105065k926703k555813k117122k603164k083662k576963k391640k008673
16676E4841325j825542k102576j648849j854507j964139j439548j402400j572499
$$ y = [64541776, 66509758, 69330039, 71675101, 74412117, 76885988, 79575687, 82044566, 85004376, 87878669, 90690407, 93812916, 96485179, 99554579, 101909906, 104759065, 107479472, 110068507, 112435773, 114574565, 116616923, 118427022, 119612468, 120797812, 122193473, 122894438, 123207845, 123307983, 122966654, 122481677, 121460168, 120313447, 118666265, 116949383, 115073327, 112940995, 110590082, 107893652, 105236376, 102854591, 99916017, 97121297, 94020887, 90965274, 88032151, 85409893, 82398993, 79787887, 76815628, 74105065, 71178362, 68622549, 66505427, 63902263, 61818601, 59241638, 56849998, 54841325, 53015783, 50913207, 49264358, 47409851, 45445712, 44006164, 42603764, 41031265]
16668D1031265j625282j023337j476635j187379j194557j429998r78307r33053
16660C1182717j365065r32722p63227p90365o48026j195569o14244m84955r77613
16651B3410931o47749o80722q17998k67680p77674l94289q22286m42738o94320
16642A7865475j87444o41147l46117j67573n57233k03056o18647m45097l66613
16633A4332548l71125l19555o09918l08763J03960n71946l71022k09060r9805
16624A1575314l42537k85481m08n04464j74405n60177M44575k98104n06294j6435
16614I331584k269m52557J7065j44559j43137n90545j30960J10599k57500j85111
16604G552610Q7321M4j58746l86806l39861R9714j78036n1548j1018p0569k12222
$$ y = [41031265, 39405983, 38382646, 36906011, 35718632, 34524075, 33094077, 32115770, 31182717, 29817652, 28884930, 28121703, 27331338, 26683312, 25487743, 24873499, 24388544, 23410931, 22763182, 22082460, 21264462, 20996782, 20219108, 19824819, 19002533, 18559795, 17865475, 17678031, 17036884, 16690767, 16523194, 15965961, 15762905, 15144258, 14699161, 14332548, 13961423, 13641868, 13031950, 12723187, 12827147, 12255201, 11884179, 11675119, 11575314, 11232777, 10947296, 10946888, 10442424, 10268019, 9707842, 10152417, 9854313, 9348019, 9331584, 9329315, 8876758, 8893823, 8749264, 8606127, 8015582, 7884622, 7995221, 7737721, 7552610, 7639931, 7639975, 7481229, 7094423, 6754562, 6854276, 6676240, 6624692, 6613674, 6543105, 6330883]
16593F330883J4241q7274k36105k5433j55535j52019j42219q0917j63656J79443
16583E481409m98337N94339p22194J97435n41887J53374R703P0415R958k30268
16573D523947K24691k28410m42476L38674K3876k07139l06140J15805k90197j83571
16563C569060J99578J24849o3401k95979M17573k5827l99290J35587M5634j97645
16553C510139j49541q2978m0139K33Q0275m956l30782K01246j21812L96061m62207
16542B995539L37236m97635K20213l72677K53435l19426K70228M5987m60428L23212
16532B795684k48410K5508m87093M08694L19785l72288j10301K64483m7886j20751
16522B427425k11478j8662L52956j10094Q4450j84600J93186m39886N5320k8656
$$ y = [6330883, 6345124, 6257850, 6021745, 5996312, 5840777, 5688758, 5546539, 5465622, 5301966, 5481409, 4983072, 5577411, 4855217, 5052652, 4510765, 4664139, 4673842, 4744257, 4754215, 4523947, 4748638, 4520228, 4077752, 4416426, 4440302, 4233163, 3927023, 4042828, 3752631, 3569060, 3768638, 3893487, 3830086, 3534107, 3951680, 3925853, 3526563, 3662150, 3707784, 3510139, 3360598, 3277620, 3237481, 3237714, 3317989, 3313033, 2982251, 3183497, 3061685, 3457746, 2995539, 3332775, 2835140, 3055353, 2682676, 2936111, 2616685, 2886913, 2932900, 2472472, 2795684, 2547274, 2572782, 2085689, 2494383, 2814168, 2441880, 2331579, 2596062, 2548176, 2427425, 2215947, 2197285, 2550241, 2440147, 2524597, 2339997, 2533183, 2093297, 2148617, 2119961]
16512B119961N1056Q6996j26681o8087j52179K13625m2915n45875O90556j30942
16502B095515j35906j17625K4274L4745l87280L55340o8987k66335j55365L91766
16492A770142K14089k96990o5726J19271l2799k05291K64951p4752j46702K67231
16482A813424o6936m23822K99589j11590j88720L75762m61862L39030L41052j80783
16472A735144K997l09819r4003k5675J98435k31154o4556k2567K0849K33737p9262
16461A364126L94054m01119j63378K6077L6119N6342j3721q1676m4495P1160k09220
16450A034269J47489j27247J08251J85723k06933K07301j90437R5426k7k99625
16440I54190K64554j65040J3467J68400n3624l05262K23536m0415l4573M86132
$$ y = [2119961, 2171017, 2258013, 2131332, 2063245, 1911066, 2124691, 2081776, 1535901, 2226457, 2095515, 1959609, 1841984, 1866258, 1901003, 1513723, 1869063, 1800076, 1533741, 1378376, 1770142, 1984231, 1687241, 1621515, 1740786, 1707987, 1502696, 1767647, 1692895, 1546193, 1813424, 1746488, 1322666, 1622255, 1510665, 1321945, 1697707, 1235845, 1574875, 1915927, 1735144, 1738141, 1428322, 1334319, 1308644, 1507079, 1275925, 1211369, 1188802, 1209651, 1443388, 1364126, 1758180, 1357061, 1193683, 1219760, 1255879, 1312221, 1298500, 1216824, 1172329, 1243489, 1034269, 1181758, 1054511, 1162762, 1348485, 1141552, 1348853, 1158416, 1253842, 1253815, 954190, 1218744, 1053704, 1067171, 1235571, 1181947, 876685, 1100221, 1059806, 1025233, 1511365]
16430A511365o56406K00275j4255k73742M00492k24522k9500M19681j85094k49010
16420H99284j9802q3286J30144k89402M06441q3736j13549j33404J16764p0441
16410G59013J74900l7962j76636R1672J54367J06330k80810j35408K47110j29535
16400G73041R0229L81504n72341J92134q0946m9531L45017L8677m37951J17636
16390G97469p0411J69203m04861J13584K09655C04369L72686K16126r5876j21880
16380F75425p049j67812Q9455J25809J05885k16748K57382n9954P9452l00576
16370E81269N2478C13087O6779N01106l12855j31882J62713L49472l47419k08479
16360C92522k0769K04775m6632Q389j18606L19328j61251n4446k42062K70819
$$ y = [1511365, 854959, 1055234, 1040979, 767237, 1167729, 943207, 913707, 1333388, 1148294, 899284, 879482, 796196, 926340, 636938, 1043379, 959643, 846094, 712690, 829454, 759013, 933913, 895951, 719315, 810987, 965354, 1071684, 790874, 655466, 902576, 773041, 863270, 1244774, 672433, 864567, 783621, 734090, 1079107, 1117784, 679833, 797469, 727058, 896261, 491400, 604984, 814639, 304369, 677055, 893181, 797305, 675425, 668376, 500564, 590019, 715828, 821713, 604965, 862347, 802393, 881845, 581269, 633747, 313087, 379866, 880972, 568117, 436235, 598948, 948420, 601001, 392522, 371753, 576528, 529896, 538285, 419679, 739007, 577756, 523310, 281248, 552067]
16350E52067J06511J16849k76742J21712j66445M40131C20103K90308n5730j96331
16340C58350r9119M23925l21611K65271k02936j31405J92692L54597l26173R3336
16330F06927M970O1394k94680L54799q8197j14273j47994L86375C39040L05625
16320F44665M9614m1650k76251J86521l1204l6336j53007J38185A69748R1912
16310B61660J14950L2562K74220B04969K10239l4768K01758B89738L48636I3941
16299C62438K31J98246O140k52105q1438L70975k59965Q8380N7124J14668C3260
16287C12694J01996j15863J89194j36729L50385j58779j57956M4223J78746B98181
16276A66477p218p4472K05864M2800m0017J67458q0957K927j0183j01596J9194
$$ y = [552067, 658578, 775427, 498685, 620397, 453952, 894083, 320103, 610411, 554681, 358350, 259231, 683156, 361545, 626816, 423880, 292475, 485167, 839764, 513591, 606927, 611897, 673291, 378611, 733410, 645213, 530940, 382946, 769321, 339040, 644665, 694279, 652629, 376378, 562899, 531695, 495359, 342352, 480537, 169748, 261660, 376610, 409172, 683392, 204969, 415208, 380440, 582198, 289738, 638374, 93941, 362438, 362669, 560915, 567055, 314950, 233512, 604487, 344522, 432902, 490026, 604694, 33260, 312694, 414690, 298827, 488021, 351292, 701677, 542898, 384942, 429165, 607911, 298181, 166477, 159259, 84787, 290651, 333451, 293434, 460892, 379935, 382862, 372679, 271083, 290277]
16265B90277K36970A90964J92786J41432j64812H4942L36597j83824M4747J24907
16255D07369j00554l8857r098m8199K74927A15657k6750M71746j89176A41262
16244B10521m4908M63663B11767K32695J8349b6454B55792M7767K71042I6658
16233B3686M02140l6388J1814l1091J63395D4318L95408a46021B57975B1621K35040
16222B56661a86540D29012A24461p325b6559A51901Q0889O2924L9894p6467K824
16211B61965j0469L375J40649o8997j11043o5561o2269O0840K69344J08156B46091
16199A81559n1322P2890l0319L0151o7417K16208J03783f7548B01885J00705o6614
16188B35976K84384A77174J63531J11960B11259J60564I5543J7754K09160J0540
$$ y = [290277, 527247, 190964, 383750, 525182, 360370, 84942, 421539, 237715, 282462, 407369, 306815, 267958, 258860, 210661, 485588, 115657, 88907, 560653, 371477, 141262, 210521, 165613, 629276, 211767, 444462, 462811, -26454, 255792, 303559, 574601, 96658, 23686, 425826, 389438, 401252, 370161, 533556, 44318, 439726, -146021, 257975, 21621, 256661, -186540, 429012, 124461, 117136, -26559, 151901, 232790, 295714, 335608, 259141, 261965, 251496, 254871, 395520, 326523, 215480, 149919, 87650, 148490, 417834, 525990, 246091, 181559, 130237, 203127, 172808, 202959, 135542, 351750, 455533, -67548, 201885, 302590, 235976, 520360, 177174, 340705, 452665, 211259, 371823, 95543, 113297, 322457, 332997]
16178C32997O3701F7251P3084J27501C4484E558L49964Q4707A71476L7036K58531
16167D67043j98695d2293B1298K83318j49528j8052K18915j70346K8617I2721
16156D50301j74307c10717A43944E9947O0593O4010J9491q4309K56537b51474
16145A42653l8825d0822A1195K23671j8822o5231F8236L49909G1925J54768L1346
16134B58039j09928M3368F1437J42043L2537G0570g7680B1515p689J71357p7058
16123A08125M9631d0031A8461a23532k35871c8356D82618B07747H8198J59834
16113B48032i4433K6025G2568K8694P9150f6302B48371E9997B6611K70828E6281
16101h0560p5224D6865Q1062h6365N9H6411J49537J27184J06737f15943a29350
$$ y = [332997, 396698, 67251, 140335, 267836, 34484, 5558, 355522, 440229, 171476, 208512, 467043, 268348, -42293, 21298, 304616, 155088, 137036, 355951, 185605, 214222, 92721, 450301, 275994, -310717, 143944, 59947, 120540, 184550, 204041, 119732, 376269, -251474, 142653, 103828, -40822, 11195, 234866, 216044, 150813, 68236, 418145, 71925, 226693, 258039, 148111, 191479, 61437, 203480, 236017, 70570, -77680, 21515, 13826, 185183, 108125, 157756, -40031, 18461, -123532, -359403, -38356, 482618, 207747, 88198, 248032, -94433, -68408, 72568, 101262, 180412, -66302, 248371, 59997, 26611, 297439, 56281, -80560, -155784, 46865, 127927, -86365, -86306, 86411, 235948, 363132, 469869, -615943, -129350]
16089I1555B9547J57721J13283d402C33410j04792a96700b8688B38561J50729
16079C89290F4702j4269d5989D2094J51381A1775J25086K7674g0365j67441R4568
16068a43238C17872a1759B28724a55011A42492Q551a06286B74544N3109e7439
16057A43774e3657B27315i3341a3067C17350l5619j9925a97051A97072C028L87510
16046C90538A72497J08183d7247A38054b91257A88149a2184A26529A521b13761
16035C79056j83365L5596b60284B99359a69988o6564J6436I223d2149C8661f6636
16023G2933K0147I455K87938p7398e13421b47820A10741D3251J06635F12L18356
16012C18968a71158J4520A49918K63703j75991H6721P2593E8664k33D281g4532
$$ y = [91555, 29547, 187268, 300551, -4402, 333410, 228618, -196700, -28688, 238561, 389290, 64702, 50433, -45989, 42094, 193475, 11775, 136861, 164535, -70365, -237806, -143238, 317872, -11759, 228724, -155011, 142492, 151043, -106286, 274544, 327653, -57439, 143774, -53657, 227315, -93341, -13067, 317350, 281731, 261806, -197051, 197072, 3028, 390538, 172497, 280680, -47247, 138054, -291257, 188149, -12184, 126529, 1521, -213761, 379056, 195691, 231287, -260284, 299359, -169988, -236552, -220116, 9223, -42149, 38661, -66636, 72933, 93080, 9455, 297393, 219995, -513421, -247820, 110741, 43251, 149886, 612, 318968, -171158, -156638, 149918, 413621, 237630, 86721, 159314, 58664, 58431, 4281, -74532]
16000a84468i1663B02072c54632g3564A63008J06794R7399A96K46625a13171o8822
15989a81993C66997J5941b91353G5873a00991E1571b02041g2872p8487O3441A96595
15977B13761J02698j38237R5953q9431K44256j77581N11449K99085K5439J584
15967A088976L58403m43422l20162B48337B6322L56731a08700A18236B4583i0004
15956A20423i0523F3153b90731I553J31975F0753a0865n6900J842b6001j38094
15945a64095N4335r2473D9826a02297b5107A70369e4933J4505B0475a98443G297
15933a75136g0083D41790b10950H514K6403J15403a76242A42126a55175A9560
15922b24879H2402A0472J94502e3065D6757M4264c4955E6499J14899i4058A439
$$ y = [-184468, -91663, 202072, -354632, -73564, 163008, 269802, 367201, 196, 246821, -113171, -181993, 366997, 382938, -291353, 75873, -100991, 51571, -202041, -72872, -151359, -87918, 196595, 213761, 316459, 178222, 274175, 184744, 429000, 251419, 762868, 1061953, 1087392, 1088976, 1447379, 1003957, 683795, 248337, 26322, 383053, -108700, 118236, 24583, -90004, 120423, -90523, 63153, -290731, 9553, 141528, 60753, -10865, -67765, -65923, -26001, -164095, -109760, -202233, 49826, -102297, -25107, 170369, -54933, -40428, 20475, -198443, 7297, -175136, -70083, 441790, -210950, 8514, 34917, 150320, -176242, 142126, -155175, 19560, -224879, 82402, 10472, 204974, -53065, 46757, 91021, -34955, 56499, 171398, -94058, 1439]
15910A27723d4412A50354c1084J3994d938A07142b99057c8931B4699a48622A62814
15898A46189a80299D1030b06066B1019N3698d4161n2169M1850A03920D9659a11889
15886B92241D1705b20277e1973k11393p1504J47100g4480j1785k04123B41987
15875A43603e33374a91101B89521A14808k322F162J14142e021k28585j63316C9596
15863f6004j43565Q7060o2011b0370B844a81995A44644n8037K2743h638D088M8013
15851E2101f6131l19427A26136b37662i9504j5457G8986a11534m5044j69303C8553
15839g8030A12098a50261A2288a44802b9410j3175k77898A9716K24216a62349
15828C5783a90096l6087A22587R5740C5133J2781b3882m6409j41479d9310C66861
$$ y = [127723, -44412, 150354, -31084, -17090, -4938, 107142, -299057, -38931, 24699, -148622, 162814, 146189, -180299, 41030, -206066, 21019, 74717, -44161, -96330, -54480, 103920, 49659, -111889, 292241, 41705, -220277, -51973, -263366, -334870, -187770, -74480, -86265, -290388, 241987, 143603, -533374, -191101, 289521, 114808, 112486, 6162, 120304, -5021, -233606, -396922, 39596, -66004, -209569, -122509, -184520, -20370, 2844, -181995, 144644, 86607, 109350, -8638, 4088, 52101, -66131, -385558, 126136, -237662, -99504, -114961, 78986, -111534, -156578, -325881, 38553, -78030, 112098, -150261, 12288, -144802, -29410, -42585, -320483, 19716, 243932, -162349, 35783, -190096, -226183, 122587, 218327, 35133, 47914, -23882, -70291, -211770, -49310, 366861]
15816a83573A13500a35448l070A62750a48219e4117A51185b41582E8014e9318
15805B3481b08258c1852B9307a60091A16900d39413a08814j237q3151F6042e2164
15793B08754a90780B84950B9630J53581l9658e16224A07266K3408H198i6449r4242
15782a90691B3307h3256A05512K8148l7559j9171M9817a28665B22374P3981A2739
15770a84224G6013e7795K4485j07573K3680a9171q9111F2773b10796n4639D64891
15758b8781j83367j5203e6638A42531E2188a39635A81644k3289e0156j44293A96917
15746A84382a44951k26390A06144J64871d333n4055l5958j05333b7763j06985
15736a34748j12327B20422g515D25257A66273f8198B03645G1456J895J69830b0003
$$ y = [-183573, 113500, -135448, -138518, 162750, -148219, -54117, 151185, -241582, 58014, -59318, 23481, -208258, -31852, 29307, -160091, 116900, -439413, -108814, -110051, -193202, 66042, -52164, 208754, -190780, 284950, 29630, 183211, 143553, -516224, 107266, 130674, 8198, -96449, -190691, 23307, -83256, 105512, 133660, 96101, 76930, 126747, -128665, 222374, 296355, 12739, -184224, 76013, -57795, -33310, -140883, -117203, -19171, -108282, 62773, -210796, -265435, 464891, -28781, -212148, -227351, -56638, 142531, 52188, -139635, 181644, 158355, -50156, -194449, 196917, 184382, -144951, -371341, 106144, 271015, -4333, -58388, -94346, -199679, -27763, -134748, -247075, 220422, -7515, 425257, 166273, -68198, 203645, 71456, 73351, 243181, -20003]
15724a70157E9440i8184C025J62202g4479E4043a69606d5392G5752N6126h5274
15712A40390b96494I9247l4140j1590P6980M1578b7290B43491a23994l41635b9616
15700g1235K7227B70046j05768b26664I408e1197D7282a21193A26737a46128C8477
15688b7429G4753a38462I8131a78706i086I2393b17588K0646A54483b222B97104
15676A69747J8623g5663r4437A62522k9320J16135j3915A10876K4686e9049F7585
15664C1250J63052a83983B5319Q3426l2879e0431k20628A12820b51353M2439E685
15652e2777h87l83325e8463k40433F7087o623K9274B2942K47394b26934A43471
15640b23716c3390k77561B33654A04823b18461Q618c3054B6960K12541b8086k1995
$$ y = [-170157, 59440, -98184, 3025, 165227, -74479, 54043, -169606, -45392, 75752, 131878, -85274, 140390, -296494, 99247, 65107, 53517, 130497, 172075, -27290, 243491, -123994, -465629, -29616, -71235, -44008, 270046, 164278, -226664, 9408, -51197, 47282, -121193, 126737, -146128, 38477, -27429, 74753, -138462, 98131, -178706, -9086, 92393, -217588, -196942, 154483, -2222, 297104, 169747, 188370, -75663, -170100, 162522, 133202, 249337, 235422, 110876, 135562, -59049, 67585, 31250, 194302, -183983, 25319, 108745, 75866, -50431, -271059, 112820, -251353, -208914, 5685, -52777, -887, -384212, -58463, -298896, 67087, 60464, 89738, 22942, 270336, -226934, 143471, -223716, -33390, -310951, 233654, 104823, -218461, -209843, -33054, 26960, 239501, -28086, -50081]
15629e0081j00576F4626d29735a70045C53678H9584e05803B4462c56410A37604
15618A74453J4637a42449q3077P7215A01205a05185m8457A20556l7071A0891b11571
15606G3333c0929k21332C66368o4121D5643J1585J00059c0583A39283J37571b7417
15594F6359e7705p5600n5631A34231A9898b52294A11922d02169G8548k7863c75
15582b70858L8999m305j80637H6453i6183k51204G207d29287a13721A0223b0246
15570i494j16327N808l9310G7933d92608H5262b25370R4863p1258A97255m4665
15559A52590a88427d5591A98388b86957f4159j10837m6631g6401J8112C8232g0587
15547A01370b36357j20950g191m9819D7869a68449A79303b57B18231a93126L3931
$$ y = [-50081, -150657, 64626, -429735, -170045, 353678, 89584, -505803, 24462, -356410, 137604, 174453, 189090, -142449, -225526, -148311, 101205, -105185, -153642, 120556, 83485, 10891, -211571, 73333, -30929, -252261, 366368, 302247, 45643, 57228, 157287, -30583, 139283, 276854, -27417, 66359, -57705, -133305, -188936, 134231, 19898, -252294, 111922, -402169, 78548, 50685, -375, -270858, -231859, -236164, -416801, 86453, -96183, -347387, 7207, -429287, -113721, 10223, -20246, -9494, -125821, -120013, -159323, 77933, -492608, 85262, -225370, -130507, -201765, 197255, 152590, -188427, -45591, 198388, -286957, -64159, -174996, -221627, -76401, -58289, 38232, -70587, 101370, -236357, -357307, -7191, -57010, 47869, -168449, 179303, -257, 218231, -193126, -159195]
15536a59195j45629F5124a77305l9273A9480d7339e94r0982B891f9834C14889
15524a0477r8131d0249I4003a8996A23296B3853c6003B81902n3697a53503A5556
15512a7190D48214a32898A94153B7975h4665A60199K56668g6364D29979j13646
15502C16333A07888e6308B70964q2199E5840P6675J24034p5309q3461J3615K54809
15491C66203A53947b39458e8065C96401j05740A09911g1801B70651j17128i5676
15480B51691B9980K78709F1654k2569J36907J38658A28050J26651K14352j74292
15470B94761J10030B02326a32601A48339K35185A09489r74L21122H8074h8983
15459C39676Q4886J66515K20949B83781q424O4782j05901M8170b0623A34334E2173
$$ y = [-159195, -304824, 65124, -177305, -216578, 19480, -47339, -594, -91576, 2891, -69834, 314889, -10477, -108608, -40249, 94003, -18996, 123296, 23853, -36003, 281902, 228205, -153503, 15556, -17190, 448214, -132898, 194153, 27975, -84665, 160199, 416867, -76364, 429979, 316333, 107888, -56308, 270964, 188765, 55840, 132515, 256549, 181240, 97779, 111394, 366203, 153947, -239458, -58065, 396401, 290661, 109911, -71801, 270651, 153523, -95676, 251691, 29980, 308689, 61654, 39085, 175992, 314650, 128050, 254701, 469053, 294761, 404791, 202326, -132601, 148339, 383524, 109489, 108515, 429637, 88074, -88983, 339676, 424562, 591077, 812026, 283781, 275357, 340139, 234238, 282408, -20623, 134334, 52173]
15447a42670B18045r9391J84392a51842A10773b01725B92026H0147N3006J97517
15437C30670c0792m9005b6931A85068b34896H4434J2996J66508a6545D09380K48566
15426F57946K85142J52259j85240j038B86766A13147J12185C6281K16025q1714
15416A70592b46711A14544h1634C62744q2320m8424k7452H1383c543A14784L4354
15405A49138g7990F3463c632D0973M7832g5630j23540k93988A11618a27657j21441
15394b49098I3731l7971g6341D6917m629L1438b48675C4559J13930k1974j8237
15383A08278J03535F9016a05400G4607c56080a71800e9941A10536K20412D4166
15372D17767D201a96757e7511A22253C1171K15206a80194e5077B58283a18799
$$ y = [-142670, 218045, 118654, 303046, -151842, 110773, -201725, 292026, 80147, 133153, 330670, -30792, -79797, -26931, 185068, -234896, 84434, 97430, 263938, -16545, 409380, 657946, 943088, 1095347, 910107, 909069, 286766, 113147, 225332, 36281, 252306, 170592, -246711, 114544, -81634, 362744, 280424, 232000, 204548, 81383, -3543, 114784, 149138, -77990, 63463, -3632, 40973, 88805, -75630, -199170, -493158, 111618, -127657, -249098, 93731, 55760, -76341, 46917, 42288, 73726, -248675, 34559, 148489, 126515, 108278, 211813, 69016, -105400, 74607, -356080, -171800, -59941, 110536, 330948, 44166, 417767, 4201, -196757, -57511, 122253, 31171, 246377, -180194, -55077, 258283, -118799]
15361f5057k0033H1028l8735L02871l8876j39988k1159Q8144r3650J8519p8471
15350G9683J48342j04673n1427L72203A33069A7138N7278L19682j79486r4663
15340A19949K14972M442q4826J26900A82324G7793O148Q1049d3101H4196J27562
15329B11758D1947L73404n7984A64846K7726P974O0217D9890A3239f5961D16569
15317B12381n3354c31074J26701A28487K73331j22938J91892b70053i8964D65661
15306A11114D8208K01141q7202L68142A87011Q5099E4823A7471L25642A64510
15295A73947M00463A73204a08130I8658m3003J45226L71422A0557a25923H1694
15284F0774b8528A34926F2016K4480K28402d6186B44723D4210J74745K25970f6477
$$ y = [-65057, -85090, 81028, 42293, 345164, 306288, 166300, 145141, 233285, 139635, 158154, 79683, 228025, 123352, 71925, 444128, 133069, 17138, 74416, 394098, 214612, 119949, 334921, 339363, 254537, 381437, 182324, 77793, 83941, 164990, -43101, 84196, 211758, 41947, 415351, 357367, 164846, 192572, 200546, 260763, 49890, 13239, -65961, 416569, 212381, 159027, -331074, -204373, 128487, 401818, 278880, 470772, -270053, -98964, 465661, 111114, 48208, 249349, 162147, 530289, 187011, 272110, 54823, 17471, 343113, 164510, 173947, 574410, 173204, -108130, 98658, 55655, 200881, 572303, 10557, -125923, 81694, 60774, -28528, 134926, 62016, 86496, 314898, -46186, 244723, 44210, 218955, 444925, -66477]
15272A01431a04491j94097E3121a39193G6200J11862o9932J67817a80558C13606
15261A83035J66143r7470E3666J01286B5256a65467A72969f6833A51332J37647
15251B88979b6631k63110N0020H8858f3207r2209H3819J5939g7662A64088f6782
15239A92408k5954P7913G7016a44666A05794J13525f0405B22216q2653N8882J5176
15228B13621J49849K44056J16111P42801J84052k62382n795o90267j82037I2075
15217b3206r7967A53820M7432D4320J09140k5559L8649b00896j2858B91913h0911
15205A52592f9640D8171J85783k3223r8933k1851J00923p9937k2872Q0294J36829
15194C05184A27972J12528H9191B3656b490k32405J08277a6929F8198L46663j57887
$$ y = [101431, -104491, -298588, 53121, -139193, 76200, 188062, 118130, 285947, -180558, 313606, 183035, 349178, 251708, 53666, 154952, 25256, -165467, 172969, -66833, 151332, 288979, -26631, -289741, -239721, 88858, -63207, -155416, 83819, 99758, -77662, 164088, -66782, 192408, 166454, 244367, 77016, -144666, 105794, 219319, -60405, 222216, 139563, 198445, 213621, 363470, 607526, 723637, 1466438, 1650490, 1388108, 1382313, 692046, 510009, 92075, -23206, -121173, 153820, 201252, 44320, 153460, 127901, 166550, -200896, -213754, 291913, -80911, 152592, -69640, 48171, 233954, 210731, 111798, 89947, 190870, 110933, 88061, 168355, 305184, 127972, 240500, 89191, 23656, -2490, -234895, -126618, -16929, 68198, 414861, 256974]
15183B56974I8425f8112K7646F16978a57688N5764H2535j847K82397j57103D8402
15171A31717K12170F5879K38461n501A10381a12801H164b80426c438D1471a33151
15159A6739J62a9061A95093b20510C39522c5339B82185r3908l4987d2524A60334
15147A29777b22753A80740p9989K64526j40131p3277k5376F1845b94917F24341
15136C19893I2348B1838J24788l0228J46206K03478F0041K8947Q4924J5388I1256
15124C12982a1273A81947P7056K29354B13985D5278Q5989n5740O3162J21290q0202
15113A79777f7744B75910F0329R5201a44718G9095p42J40336n5395K79661A7120
15101C13113j04077j9955I3193J12366J11334k6176p2695c4630j41565I0418l655
$$ y = [256974, 98425, -68112, -40466, 616978, -157688, -101924, 82535, 80688, 363085, 205982, 48402, 131717, 343887, 65879, 304340, 298839, 110381, -112801, 8164, -280426, -3438, 41471, -133151, 16739, 16901, -19061, 195093, -220510, 339522, -35339, 282185, 188277, 153290, -42524, 160334, 129777, -222753, 180740, 100751, 365277, 225146, 151869, 126493, 61845, -294917, 624341, 319893, 92348, 21838, 146626, 116398, 262604, 466082, 60041, 88988, 173912, 189300, 91256, 312982, -11273, 181947, 259003, 488357, 213985, 45278, 131267, 75527, 138689, 259979, 179777, -67744, 275910, 60329, 155530, -144718, 79095, 78353, 218689, 163294, 442955, 17120, 313113, 209036, 189081, 93193, 205559, 316893, 290717, 218022, -34630, -176195, 90418, 86763]
15090H6763L1833Q24K33165G4766M3217B79L25065F9288b63115a1283A76401F7017
15077B70236p253a32544A90393H6114J74328b5529I3079J82431I6237m7447K8355
15066G7145R5380a72328A84079a20324A05564P0210b0691A22043c5859A07252
15055a3617A15998Q8443p058J47663l1438j24984n7345N9791L49807B13680k1465
15044A92215K95812A11390M81628B00406m5800D5970J14815J27468I1946j0739
15034H1207J18813K39631j00674F2309K56175L0330F031J17915N29030j1346B60768
15022D80272j18039I6612L54742k585j41507K96887k14741L05230J22259r711
15012H07186j35258J97616C53218K86536B79122K8275P1034J3412K89243k05465
$$ y = [86763, 118596, 119420, 352585, 74766, 117983, 279, 325344, 69288, -263115, -11283, 176401, 67017, 270236, 262983, -132544, 190393, 86114, 260442, -25529, 93079, 275510, 96237, 48790, 77145, 172525, -172328, 184079, -120324, 105564, 175774, -20691, 122043, -35859, 107252, -13617, 115998, 204441, 197383, 345046, 313608, 188624, 131279, 191070, 540877, 213680, 192215, 488027, 111390, 593018, 200406, 154606, 45970, 160785, 288253, 91946, 81207, 200020, 439651, 338977, 62309, 318484, 348814, 6031, 123946, 652976, 641630, 260768, 480272, 362233, 96612, 451354, 448769, 307262, 604149, 389408, 694638, 816897, 807186, 671928, 869544, 353218, 639754, 279122, 307397, 378431, 391843, 681086, 475621]
15002D75621k726n8783J37997B70482r3921K6555J11905K81655k3879j42699J30468
14991E60566B77905J84622o1853K7288A91535M31135j20343j61371J97666J2354
14981E50976K6467A18959K01977K18693j33057O4708K53182j04524C08604l5343
14971B73261L86980j40260J04464L0077K89627k59145Q0937k55826P3582j68002
14961D15695n0975J03689P8158R220J95496N9768j96512A71374M02011j13644
14951D59741J79337j77781A56550N41780A63316p5438L05054A19611M45338j88312
14941C76637N1130A89495Q7421J73609n0153q9763j40750K60404n2814J17770
14931D95219A95865O09719B95682K31776L23824C40988M41249k56894K12303k63899
$$ y = [475621, 472895, 414112, 552109, 270482, 176561, 203116, 315021, 596676, 572797, 430098, 560566, 277905, 462527, 400674, 427962, 191535, 622670, 502327, 340956, 538622, 550976, 577443, 118959, 320936, 539629, 406572, 471280, 724462, 619938, 308604, 273261, 660241, 519981, 624445, 654522, 944149, 685004, 765941, 510115, 583697, 415695, 364720, 468409, 546567, 555787, 751283, 811051, 614539, 171374, 573385, 459741, 639078, 461297, 156550, 698330, 163316, 87878, 392932, 119611, 564949, 376637, 427767, 189495, 276916, 450525, 400372, 310609, 169859, 430263, 377449, 495219, 195865, 805584, 295682, 527458, 851282, 340988, 782237, 525343, 737646, 473747]
14921D73747j81343j03555M71268P6921j81853M16339j14646R0365J06066N4098
14911A107407O88671j3164l69956J85460o6075j58225K54668N2407K12688N3365
14901A947246K94834j12223n79956n6747J8706k78999n83783J41977J14505l3594
14891H71966l50402P9976A48697N51413j45644B46015K14262r1595j36535K64209
14881D96356r6550o0446J24635k20822L44255o3162A22132L60935K11945j73536
14871E21476J73388k18373R8563J25025J76072M134J7097k52219K83881l7680
14861H91364C69890J59060p4966J81849k16346j04845J12651k4929N1746K86591
14851G40701l20446J08895L61900j70900k26482K38303j10230j48646k4901K16597
$$ y = [473747, 292404, 188849, 660117, 737038, 555185, 971524, 856878, 947243, 1053309, 1107407, 1796078, 1782914, 1412958, 1598418, 1532343, 1374118, 1628786, 1681193, 1893881, 1947246, 2242080, 2129857, 1549901, 1493154, 1511860, 1232861, 649078, 791055, 905560, 871966, 521564, 601540, 148697, 700110, 554466, 246015, 460277, 368682, 232147, 496356, 399806, 339360, 463995, 243173, 587428, 524266, 122132, 483067, 695012, 521476, 694864, 476491, 575054, 700079, 876151, 880285, 897382, 645163, 929044, 891364, 369890, 528950, 453984, 635833, 419487, 314642, 427293, 402364, 454110, 740701, 420255, 529150, 891050, 720150, 493668, 731971, 621741, 473095, 448194, 664791]
14841F64791j59879J9116J22823C03727j41252J38715m7834N14121j96489l7393
14831E33595J1773K70536j45955L32910J10572n8640J47534m56711p1528j857
14821F72229j6219J35980k90328J30597M8765k10764K44609j80969k14288K0052
14811C39664L41912B68715M68514N0675q6249K08118m15999K20756j4109o8386
14801F32035K28144l93835J42675K17446j14009J9999K64622j84430K46469P4420
14791A133536m98695K77329m964j95869K64639l21656j80109N8574J27091n6828
14781F03048o4157j34839J19613j44533J72157K23889k37207n8841J62681B92899
14770H22379o2026p9987j44806L98859O3076O9237l57463L93061l5271q6850k19867
$$ y = [664791, 504912, 524028, 646851, 303727, 162475, 301190, 253356, 767477, 570988, 533595, 545368, 815904, 669949, 1002859, 1113431, 1054791, 1202325, 745614, 674086, 672229, 656010, 791990, 501662, 632259, 681024, 470260, 714869, 533900, 319612, 339664, 681576, 268715, 737229, 787904, 701655, 909773, 493774, 714530, 700421, 632035, 860179, 466344, 609019, 826465, 712456, 732455, 997077, 812647, 1059116, 1133536, 634841, 912170, 907206, 711337, 975976, 654320, 474211, 532785, 659876, 603048, 538891, 404052, 523665, 379132, 551289, 775178, 537971, 479130, 641811, 292899, 822379, 760353, 680366, 535560, 934419, 997495, 1066732, 709269, 1102330, 1067059, 980209, 760342]
14759G60342K1831K46583l32049L00056j38211k68793M02499k07135l5386k30694
14749E19043n0648K42433B10756L09737j72788K42341k8849N40648k69786k2170
14739H09889r7909N31j02760j2732q2739N37981j58999C87662L16576K7382k87866
14728D43754K82512J76184m12694K00767J34450k175j12469N65785m30128K34361
14718A080347l6843K31685k47403J44627K27623L16098L19677l67963l85955k73398
14708A008495J75021n2616j98406l4251k96964M83739m59264L76061J07323k62562
14698H46576J93577q3757J13802J10337k96923K22953N1052l4749K57784J97629
14688A578281J5885K04105L8197j62339p7611l05162J00914j51092p1686K86227
$$ y = [760342, 782173, 1028756, 696707, 996763, 858552, 589759, 992258, 785123, 749737, 519043, 468395, 710828, 210756, 520493, 347705, 590046, 561197, 1101845, 832059, 809889, 711980, 712511, 609751, 597019, 514280, 1052261, 893262, 387662, 704238, 731620, 443754, 726266, 902450, 489756, 690523, 824973, 822798, 710329, 1276114, 845986, 1080347, 1043504, 1275189, 1027786, 1172413, 1400036, 1716134, 2035811, 1667848, 1281893, 1008495, 1183516, 1130900, 932494, 898243, 601279, 1085018, 625754, 1001815, 1109138, 846576, 1040153, 956396, 1070198, 1180535, 883612, 1106565, 1157617, 1122868, 1380652, 1578281, 1594166, 1798271, 1836468, 1674129, 1596518, 1291356, 1392270, 1241178, 1169492, 1455719]
14678A455719m33275K47698n00102l7970k01179N04231R8568K405j69145J07833
14668A074783l3111D78809M95584J07895k56359L39784N3617k21575j48215M5453
14658H94993j17394K48666l5355k68276M25876J5897j07222k66597M43511k23820
14648A010279j4292L9194j99415k57205R18700m36537k15499K33425L54698k63795
14638A169553K4838K53M6061K7691m7338k48192J42963J95426J72045k89052j17204
14627A077044K18372K03457J1552k53109j34243J16505L4290k96178M39072k68408
14617A148354m9177q1675N19287M7061l36440j19033M96384m11747L41396l83303
14607A171107O5056K01918j23688m0802L7985p030K87700m36735n8298K59000
$$ y = [1455719, 1022444, 1270142, 770040, 732070, 530891, 1035122, 1133690, 1136095, 966950, 1074783, 1041672, 478809, 974393, 1082288, 825929, 1165713, 1219330, 997755, 849540, 894993, 777599, 1026265, 990910, 722634, 1148510, 1164407, 1057185, 790588, 1234099, 1010279, 995987, 1035181, 835766, 578561, 1497261, 1060724, 845225, 1078650, 1433348, 1169553, 1194391, 1194644, 1240705, 1268396, 1221058, 972866, 1115829, 1311255, 1483300, 1194248, 1077044, 1295416, 1498873, 1510425, 1257316, 1123073, 1239578, 1273868, 977690, 1416762, 1148354, 1099177, 1017502, 1536789, 1583850, 1247410, 1128377, 1624761, 1213014, 1554410, 1171107, 1236163, 1438081, 1314393, 1273591, 1311576, 1304546, 1592246, 1155511, 1097213, 1356213]
14597A356213O0775J60005p4635k08184J38251M9892j9154N9852J44954q5855
14587A582114k2742j16479R1472L45557j10674l9809j2086p4562l4532j14496
14577A493763J11042j25395N39130q2199j98105l1310K07530k748j19323J90045
14567A982430J40665k42153k17678K65139J52891o5122K2597l3920K3455Q2298
14557B110602N6492J2592J11478k4491J16897J2555j58311L24391p4049M0917
14547B529073P5083L42387N5419l71339N87806j2577N19333j21365N51604k8870
14537D126554J223479J87191J733836K677769L510205O613332J1818886J585608
14529C3476860j4508308p740236m793509j774021j167878p9497l45542O12712
$$ y = [1356213, 1416988, 1576993, 1502358, 1294174, 1432425, 1482317, 1463163, 1523015, 1667969, 1582114, 1559372, 1442893, 1534365, 1879922, 1769248, 1729439, 1717353, 1642791, 1608259, 1493763, 1604805, 1479410, 2018540, 1936341, 1738236, 1706926, 1914456, 1911708, 1792385, 1982430, 2123095, 1880942, 1663264, 1928403, 2081294, 2016172, 2038769, 2004849, 2028304, 2110602, 2167094, 2179686, 2291164, 2266673, 2383570, 2396125, 2237814, 2562205, 2488156, 2529073, 2604156, 2946543, 3001962, 2630623, 3218429, 3205852, 3725185, 3603820, 4155424, 4126554, 5350033, 5537224, 7271060, 9948829, 13459034, 20072366, 31891252, 33476860, 18968552, 11228316, 6434807, 4660786, 3492908, 3413411, 3067869, 3680581]
14521C680581P14316l83061q03078p25082J19662m09199J88237k72306L01960
14512B412030j05850J80058k58677j54061P22268j43365L5373j82447n3076R9542
14502B551795N54983m36931k40659K43805M0940J53494o8444P4637j07666L21563
14492C087517k23215J42174L31943l87707K31291l41K67552k63405j32755P6849
14482C129903p7211J36727O7215k85630N52890l22449P8372K80831p4499j87848
14472C298301N44532j69690K52505k64173p8620J60798K77167l80923J36333J35426
14462C911656J75987M0492l25301K38172K65417k7434L33048k00902j25705K95543
14452D580973K3797J00085J39375J51631j84865l32634K79192l22792R6322L76303
$$ y = [3680581, 4394897, 4011836, 3208758, 2483676, 2603338, 2194139, 2382376, 2110070, 2412030, 2306180, 2486238, 2227561, 2073500, 2795768, 2652403, 2687776, 2505329, 2452253, 2551795, 3106778, 2669847, 2429188, 2672993, 2713933, 2867427, 2798983, 2873620, 2765954, 3087517, 2864302, 3006476, 3338419, 2950712, 3182003, 3181662, 3449214, 3185809, 3053054, 3129903, 3052692, 3189419, 3256634, 2971004, 3523894, 3201445, 3279817, 3560648, 3486149, 3298301, 3842833, 3673143, 3925648, 3661475, 3582855, 3743653, 4020820, 3639897, 3776230, 3911656, 4087643, 4128135, 3802834, 4041006, 4306423, 4278989, 4612037, 4411135, 4285430, 4580973, 4604770, 4704855, 4844230, 4995861, 4810996, 4478362, 4757554, 4434762, 4531084, 4907387]
14442D907387M9887K56323K49314k91934N0717J06381J15625R298J9119p728L45761
14431E810150Q8633j99566K48172n3767K7518J7096K63022k47021N89135k57883
14421F285489K90425k02457J73242J27971K79101n9881K48090P6277k0743K61059
14411G458573K57704k26239J93357n2789N30339J75051q3511K31376K3116K60669
14401H767646l18254L05340K13994k84564K48913j96682O82594Q3991m2633N65607
14391A0025952n6957L83535N5795m4366K78685p3097J52437q5510P28832j12538
14381A1252768K40341K77733P2989K20837J10685M86022K15894j08023O4419P59443
14371A3593108n9439J53311K79174K52787L77093N55894j82771N53477K61598
$$ y = [4907387, 4957274, 5213597, 5462911, 5170977, 5221694, 5328075, 5443700, 5452998, 5472117, 5464389, 5810150, 5898783, 5699217, 5947389, 5893622, 5921140, 5938236, 6201258, 5954237, 6543372, 6285489, 6575914, 6373457, 6546699, 6674670, 6953771, 6893890, 7141980, 7218257, 7197514, 7458573, 7716277, 7490038, 7683395, 7630606, 8160945, 8335996, 8252485, 8483861, 8506977, 8767646, 8449392, 8754732, 8968726, 8684162, 8933075, 8736393, 9418987, 9502978, 9460345, 10025952, 9968995, 10352530, 10408325, 10363959, 10642644, 10569547, 10721984, 10636474, 11365306, 11252768, 11493109, 11770842, 11843831, 12064668, 12175353, 12661375, 12877269, 12769246, 12833665, 13593108, 13533669, 13686980, 13966154, 14218941, 14596034, 15151928, 14969157, 15522634, 15784232]
14362A5784232J60267N78364J89626M6343O59186J83878N13536J74065N63478
14353A8852975N07931L05531K72524K82529N53672M60238M14920J11025Q13045
14344B2574390P86331k33840Q87990L92679P70515O27993O27323L44724Q90899
14335B7669004P95430N31589O34025Q81172O12588J155720O63954P80342J169117
14326C4892941P93161P99337J132832J178565P64829J487303J238798J235585
14318D3523351J316044J183220J562246J641976J524603J709993J443574J778919
14310E5683926K014134J816640K517114J861883K527586K226417K734669K489491
14302G3871860K750532K772045L295344K864760L729693L849442L703916M090507
$$ y = [15784232, 15944499, 16522863, 16712489, 16758832, 17418018, 17601896, 18115432, 18289497, 18852975, 19360906, 19666437, 19938961, 20221490, 20775162, 21235400, 21650320, 21761345, 22574390, 23360721, 23126881, 24014871, 24407550, 25178065, 25806058, 26433381, 26778105, 27669004, 28464434, 28996023, 29630048, 30511220, 31123808, 32279528, 32943482, 33723824, 34892941, 35686102, 36485439, 37618271, 38796836, 39561665, 41048968, 42287766, 43523351, 44839395, 46022615, 47584861, 49226837, 50751440, 52461433, 53905007, 55683926, 57698060, 59514700, 62031814, 63893697, 66421283, 68647700, 71382369, 73871860, 76622392, 79394437, 82689781, 85554541, 89284234, 93133676, 96837592, 100928099]
14294A00928099L941263M773118M886458N115079N435408N866298N970061O787960
14286A43703744P103400P335025P338949Q232744Q744835R082826R647052J0460998
14278B11649573J0669977J1290066J2072989J2543628J3365407J3490293J3836966
14271B98918899J3995829J4166209J4250558J4204904J3992835J3273843J2721770
14264C95524847J1791505J1104850J0168321R309133Q004658P083293L603283
14257D56589890J344171J127134J891763j138003q481011m727723o964840r672500
14249D29968881j0447605j1991080j3865327j3290666j3935553j3954440j4385966
14242C38098244j4509896j4139491j3898349j3044916j2679437j2754087j2186450
$$ y = [100928099, 104869362, 109642480, 114528938, 119644017, 125079425, 130945723, 136915784, 143703744, 150807144, 158142169, 165481118, 173713862, 182458697, 191541523, 201188575, 211649573, 222319550, 233609616, 245682605, 258226233, 271591640, 285081933, 298918899, 312914728, 327080937, 341331495, 355536399, 369529234, 382803077, 395524847, 407316352, 418421202, 428589523, 437898656, 445903314, 452986607, 456589890, 457934061, 459061195, 460952958, 459814955, 451333944, 446606221, 439641381, 429968881, 419521276, 407530196, 393664869, 380374203, 366438650, 352484210, 338098244, 323588348, 309448857, 295550508, 282505592, 269826155, 257072068, 244885618]
14235B44885618j2159234j2138662j1640469j0455874r206489r712282q691173
14228A70881435q502216p573431p396029o830381o498602n983105n812866n233339
14220A17051466n015700n082207m118688m264213l551137m115437l733822l506984
14212H3663278l170057l044115l010342k428352l047885k349618k087338k417411
14204F2108160j883166j976303k070678j820665j595339j375531j541348j678545
14196D8166585j423566j328053j610910j086180p11438j176349j273792j464685
14188C8091612r58089j351671l09930p52056j034575j049770m73360j177669p74170
14179C0210322n22571r28500q05161l90842q73325r22187n05466l52907r52885
$$ y = [244885618, 232726384, 220587722, 208947253, 198491379, 189284890, 179572608, 170881435, 162379219, 154805788, 147409759, 140579378, 134080776, 128097671, 122284805, 117051466, 112035766, 106953559, 102834871, 98570658, 95019521, 90904084, 87170262, 83663278, 80493221, 77449106, 74438764, 72010412, 68962527, 66612909, 64525571, 62108160, 60224994, 58248691, 56178013, 54357348, 52762009, 51386478, 49845130, 48166585, 46743019, 45414966, 43804056, 42717876, 42006438, 40830089, 39556297, 38091612, 37133523, 35781852, 35471922, 34719866, 33685291, 32635521, 32162161, 30984492, 30210322, 29687751, 28759251, 27954090, 27563248, 26689923, 25767736, 25262270, 24909363, 23956478]
14170B3956478m77596l39040m72262R409q13084n70603k34394n31788m13000m72354
14160A9641766n33091l62792m28305j61116o41648j81683j38267m05695j83410
14151A6605759p67873l38800J28366m70998j34198l43797l03911l00206l83938
14142A3690404l37225l6894J45199n40252m4599l39553j79274M2746o54294k3098
14132A1723160J73710n86214P7407p82132r192r6399L00462k54623j16935m82446
14122I946798J39398n52245L45207k00548l2944k09735m06516K13998n12298k95397
14112H435718J34238O9375j47301m55826J27985j6401k91141J32500n83493J40395
14102G546049K60504N825o44536r4058K0413P8946R587R7221m65677j03278J19698
$$ y = [23956478, 23478882, 23139842, 22667580, 22676989, 21863905, 21293302, 21058908, 20527120, 20114120, 19641766, 19108675, 18745883, 18317578, 18156462, 17514814, 17333131, 17194864, 16789169, 16605759, 15837886, 15499086, 15627452, 15156454, 15022256, 14678459, 14374548, 14074342, 13690404, 13353179, 13316285, 13461484, 12921232, 12876633, 12537080, 12357806, 12400552, 11746258, 11723160, 11896870, 11310656, 11388063, 10605931, 10596739, 10500340, 10800802, 10546179, 10429244, 9946798, 10086196, 9533951, 9879158, 9678610, 9645666, 9435931, 9029415, 9243413, 8731115, 8435718, 8569956, 8639331, 8492030, 8036204, 8164189, 8147788, 7856647, 7989147, 7405654, 7546049, 7806553, 7812378, 7167842, 7073784, 7094197, 7173143, 7182730, 7279951, 6814274, 6710996, 6830694]
14091F830694m38069K19529l5941m53212K1417K7612j01502J20336l35354M8173
14081E903683j67553k40570N75025m48134N7276r0821k78864k61565K13949K22838
14071E485264m38946J06193j63477L49609m26797j92798K18655p7544K30901l81074
14061D709986j63658j13616K82319j66596J12648l36382j6406J30988K21339m05903
14051D254719J32468K09466n14331k06896N13523j82152j6722O2322j08989J66958
14041D310366j22171l74250K85061k41649j28193J35343k68814K07682k10843
14032C592532R2800k32232m1158n0353k1336k45552M28986j58986k87694J80811
14022C257818J0687m18948N24665q3273L9150q3584m54852K87656J69940m05792
$$ y = [6830694, 6392625, 6612154, 6576213, 6123001, 6144418, 6172030, 6070528, 6190864, 5855510, 5903683, 5736130, 5495560, 6070585, 5622451, 5679727, 5588906, 5310042, 5048477, 5262426, 5485264, 5046318, 5152511, 4989034, 5338643, 4911846, 4719048, 4937703, 4860159, 5091060, 4709986, 4546328, 4432712, 4715031, 4548435, 4661083, 4324701, 4308295, 4439283, 4660622, 4254719, 4387187, 4596653, 4082322, 3875426, 4388949, 4206797, 4190075, 4252397, 4143408, 4310366, 4188195, 3813945, 4099006, 3857357, 3729164, 3864507, 3595693, 3803375, 3592532, 3685332, 3453100, 3411942, 3361589, 3340253, 3094701, 3523687, 3364701, 3077007, 3257818, 3268505, 2849557, 3374222, 3290949, 3330099, 3246515, 2791663, 3079319, 3249259, 2843467]
14012B843467J36893j16460j01383M09920l14760n7834K20346l27544j97170p8510
14002B416965J40379L86874k71658k76524L64974r871k90196J92804L38201p54413
13992B237535J96443l36751K73581m05335J52930K58917J14361l71887J19156
13983B238950R5835P6487K48896j34034K76367P243K09595P04060Q21188J722012
13973F266599K771491N534302J1396591R253465j1767912q339473m912552k788540
13965G413971j693632j016925n86071m13002k11292k55421l5084j92211j36705
13956B873628j91043j14520j61905P9738j55186Q2530j65683p2039J44593L5435
13946B355548k68831J5970J7858l0034r2955L74588o23272M93817l67016J29696
$$ y = [2843467, 2980360, 2863900, 2762517, 3172437, 2857677, 2799843, 3020189, 2692645, 2495475, 2416965, 2557344, 2944218, 2672560, 2396036, 2761010, 2751139, 2460943, 2653747, 2991948, 2237535, 2433978, 2097227, 2370808, 1965473, 2118403, 2377320, 2491681, 2119794, 2238950, 2334785, 2411272, 2660168, 2526134, 2802501, 2809744, 3019339, 3723399, 4544587, 6266599, 9038090, 14572392, 25968983, 35222448, 23454536, 15115063, 10202511, 7413971, 5720339, 4703414, 4117343, 3704341, 3493049, 3237628, 3202544, 3010333, 2873628, 2682585, 2568065, 2406160, 2485898, 2330712, 2413242, 2247559, 2175520, 2320113, 2355548, 2086717, 2102687, 2120545, 2090511, 1997556, 2372144, 1748872, 2242689, 1875673, 2005369]
13936B005369l914k19597J42498J18263m98884Q3372K55418m9930R9218j69789
13926A762024J61786j11484O5076n07620J32447K76699k61998Q7883L61945k36415
13916A730343k74029J25473m1057K20503k31905l5741J46571o46880Q64525m58730
13906A399073J40009k80172L00219o069J23968l12493K7516n7394J62493l3777
13896A463373P7117M1906l57436L34260k83287M61294k30271k27664K16747l94828
13886A101211j50167P67517m19657k00120J89334P3168k7484R7030j72977k5563
13876A232292j7883J14167j0361k42200J95415K13993m97070L96332l63368K84255
13866A305572j48099m4667K79169l63026L87533l5055q3840J8840O1163l14480
$$ y = [2005369, 2001455, 1781858, 1924356, 2042619, 1543735, 1627107, 1882525, 1832595, 1931813, 1762024, 1923810, 1812326, 1877402, 1369782, 1502229, 1778928, 1516930, 1604813, 1966758, 1730343, 1456314, 1581787, 1540730, 1761233, 1529328, 1493587, 1640158, 993278, 1857803, 1399073, 1539082, 1258910, 1559129, 1553060, 1677028, 1364535, 1392051, 1334657, 1497150, 1463373, 1540490, 1582396, 1224960, 1559220, 1275933, 1737227, 1506956, 1279292, 1496039, 1101211, 951044, 1718561, 1298904, 1098784, 1288118, 1361286, 1333802, 1430832, 1257855, 1232292, 1214409, 1328576, 1318215, 1076015, 1271430, 1485423, 988353, 1384685, 1021317, 1305572, 1157473, 1112806, 1391975, 1028949, 1416482, 1381427, 1297587, 1316427, 1377590, 1063110]
13856A063110O9691q2090K09476j5268K14208l02518J04400N7572j69074p3976
13846A075531j60945J09633J49222m69500K93945k9145J7092p11q3213M8004J79405
13835A129318j58159M62968n57808J45540J48754q2134j37268K42266r6026K20081
13825A317532k40394P3124p8420o1539n9658K32314k91722J27778l90764K64634
13815H92885o1283J62573l22981K75308K30378l37383K56216k17916r0557Q2668
13805H69908K05950j08799k51903K04390J01837k88173k6637M599L20795r7533
13795I34434l8523j80916K68192j9278j25605m5782j8599K7412J26742j96828
13785G31249k14683L46233Q7746j43866k615j6050P1101j03648C39797M01023
$$ y = [1063110, 1132801, 1050711, 1260187, 1244919, 1459127, 1156609, 1261009, 1318581, 1149507, 1075531, 914586, 1024219, 1173441, 703941, 997886, 968741, 985833, 985122, 901909, 949913, 1129318, 971159, 1434127, 876319, 1021859, 1170613, 1088479, 951211, 1193477, 1097451, 1317532, 1077138, 1150262, 1071842, 1010303, 950645, 1182959, 891237, 1019015, 628251, 892885, 831602, 994175, 671194, 946502, 1176880, 839497, 1095713, 877797, 787240, 869908, 1075858, 967059, 715156, 919546, 1021383, 733210, 706573, 711172, 1031967, 934434, 895911, 714995, 983187, 963909, 838304, 792522, 773923, 801335, 928077, 731249, 516566, 862799, 950545, 806679, 804064, 788014, 859115, 755467, 339797, 740820]
13775G40820j95655m241J72860K66535k73492J07806o9905j63659J01706L18519
13765A001294j45895j25888R4460j51060L08452k69265J55828j53824J40950j39966
13755G15086L5288k855l6023m5069J83859D12834O4216L18021n2280O1279l84591
13744D19479J90529j7499K31434l37249L27505j50854j44121J57995Q9445J64837
13734I31501l76492L09477k71157J2446K60422j7405N4946j52271M0783j32312
13724F59938j76222K85707k6082l19339J31222M1662K57852m11302K65679j07938
13714F01177L1330Q137k29014J37797J24927O1126k67517J07550L0896l4817K26380
13703G97972r0564m6031L7607j03703k46624L25211j09081A70320M17373B87105
$$ y = [740820, 545165, 540924, 713784, 980319, 706827, 814633, 744728, 581069, 682775, 1001294, 855399, 729511, 823971, 672911, 981363, 712098, 867926, 714102, 855052, 715086, 750374, 747519, 711496, 666427, 850286, 412834, 477050, 795071, 742791, 804070, 419479, 610008, 592509, 823943, 486694, 814199, 663345, 519224, 677219, 766664, 931501, 555009, 864486, 593329, 605775, 866197, 848792, 903738, 751467, 792250, 659938, 483716, 769423, 743341, 424002, 555224, 596886, 854738, 443436, 709115, 601177, 632507, 640644, 411630, 549427, 674354, 735480, 467963, 575513, 606409, 571592, 797972, 707408, 661377, 698984, 595281, 348657, 673868, 564787, 170320, 587693, 287105]
13692A80878K95108M1221O2973n1891k57510M75432C58739J17314j592J03634
13682E78095k1253J3258O6593m9834k41221J32536j76743K93780Q6748k24391
13672D57568q8182M2773K74847k95539J79137O9538m9521k28868J39088L37838
13662H38679B51638K77740K12274k31942q0191J64279k02751O9068O8227r3893
13652D34449k8008l2588J78940p3873j96493l2536M19654k87190L66574C43169
13641E25637A16452K73015A19098L77237J77253A33667O08017j77645J26705k26054
13631D64690Q0743K74845l84140q4094O8426J47749A39734K78476J07992k49453
13621B76749J11824j41212L80634j05935A71316J7609J25720r577K87253r0485
$$ y = [180878, 475986, 517207, 580180, 528289, 270779, 746211, 358739, 476053, 474461, 578095, 556842, 570100, 636693, 586859, 345638, 478174, 301431, 595211, 681959, 457568, 369386, 412159, 687006, 391467, 570604, 640142, 590621, 361753, 500841, 838679, 251638, 529378, 741652, 509710, 429519, 593798, 391047, 460115, 528342, 434449, 406441, 373853, 552793, 478920, 282427, 249891, 669545, 382355, 748929, 343169, 525637, 116452, 389467, 119098, 496335, 673588, 133667, 741684, 564039, 690744, 464690, 545433, 820278, 436138, 352044, 420470, 568219, 139734, 418210, 526202, 276749, 388573, 247361, 627995, 522060, 171316, 188925, 314645, 305068, 592321, 501836]
13611E01836l7584A05182K08473J42591m4374L2893A13554L14020p5011L10312
13601F62875j86840B17156K19155a7243D89050A85797K96957r038j37727o5595
13591B70394J69468o9683g0847g277C46749A47511O925J0330K33439Q9251j42260
13580C45196L24020B24189P6717J65236k19697O31313C54722A51897K2468L85789
13570E60154B55799J56980A73117O0809P2476J01296O5404r8428P8366A81937
13559C08916p7020J80948K11909B49605n8889M2035P4824K35114o942j87842J58857
13548E06762B27347O9083k3427O7760N2756j44625K39202j82697J28755A91740
13537A65719L3142r3036R7297n4582J8265L01341P929j24749A68789K86985j19994
$$ y = [501836, 464252, 105182, 313655, 456246, 411872, 444765, 113554, 427574, 352563, 662875, 476035, 217156, 436311, -17243, 489050, 185797, 482754, 473716, 335989, 270394, 439862, 370179, -70847, -7277, 346749, 147511, 154436, 164766, 398205, 487456, 345196, 669216, 224189, 300906, 466142, 246445, 877758, 354722, 151897, 174365, 560154, 255799, 412779, 173117, 233926, 306402, 407698, 473102, 374674, 453040, 181937, 308916, 231896, 412844, 624753, 249605, 190716, 232751, 307575, 542689, 535747, 347905, 506762, 227347, 296430, 273003, 340763, 393519, 248894, 488096, 305399, 434154, 191740, 165719, 198861, 105825, 203122, 148540, 166805, 468146, 476075, 351326, 168789, 455774, 335780]
13526C35780P1645J18102j12973J65474B77294K8925J56116A65035N2639A08064
13515A99640M1229F3393L45816A07676L07278L8059A00338M366C7342J32861L93594
13504E63797A46810g4108D33564M196B12943o3600h0245C38901J99569A39852
13493B93888a04912C81601p5692H3202g7779K0005C34124J91329B05269C9310
13482a6599C41051A45670n738L3714J03063j33171a02034D07963r5663o2513C4174
13470D21074a48181C09548h5513A48681m1066J9356d0997B86915F3811J98218
13460B62029o6909F6662L0686J19484c4033C78374A07266J77778E6302K32927
13450B89229N3647j04408k0031P1723L4439A27277M7449J22186N1405O8482A60302
$$ y = [335780, 407425, 525527, 412554, 578028, 277294, 306219, 462335, 165035, 217674, 108064, 199640, 240869, 63393, 409209, 107676, 414954, 453013, 100338, 104704, 37342, 170203, 563797, 146810, -74108, 433564, 437760, 212943, 149343, -80245, 338901, 538470, 139852, 293888, -104912, 381601, 305909, 83202, -77779, -57774, 334124, 525453, 205269, 39310, -16599, 341051, 145670, 139932, 173646, 276709, 143538, -102034, 407963, 312300, 249787, 34174, 421074, -148181, 309548, -85513, 148681, 107615, 126971, -40997, 286915, 63811, 262029, 195120, 66662, 97348, 216832, -34033, 378374, 107266, 285044, 56302, 289229, 342876, 238468, 218437, 290160, 324599, 127277, 174726, 296912, 348317, 416799, 160302]
13438B59997B520K32577I3658O56J63263A13106R5307J30591L80037l12654b32440
13426C0133O8996Q7159e0947B23574H218J78896b7308D39199A95810p2143L20625
13415D44292E0971M0012M55557r6174A98867r2937K01073j17557J86545J3494
13405C89485A66609J59631N256n6088L796H9608J82462a28034C93421A08802e8394
13393B26803K2776N5279a0489B24942A07923J70553b04049I0495L26665F9582
13382A89195J59995qI3882L26879k03639R7218a05149B86022J9007K8356j8823
13371C14562j19447g369C22644h1475n1365B02773J58676j35617K10550q8007
13361C48375b97462B48998m0698e412B16024A1922K41069h0886E10573a323A49814
$$ y = [259997, 2520, 235097, 93658, 94314, 257577, 113106, 208413, 339004, 719041, 406387, -232440, 30133, 99129, 186288, -50947, 223574, 8218, 187114, -27308, 439199, 195810, 123667, 444292, 50971, 90983, 546540, 450366, 198867, 105930, 307003, 189446, 375991, 389485, 166609, 326240, 331496, 275408, 279204, 89608, 272070, -128034, 393421, 108802, -58394, 226803, 249579, 304858, -10489, 224942, 107923, 278476, -204049, 90495, 417160, 69582, 189195, 349190, 349182, 93882, 420761, 217122, 314340, -105149, 286022, 305029, 333385, 314562, 195115, -7369, 322644, -81475, -132840, 202773, 361449, 225832, 436382, 348375, -297462, 248998, 208300, -5412, 216024, 11922, 252991, -80886, 510573, -1323, 149814]
13349A57978D9350O8225L06447q7133A26714N0460j0440J92168J41468i2987D9576
13337B57867J89927B11079D3012L37033r6175b4601D695k8K22422K23667I9040
13325E35600o5331j45135B4114L28208K53435A97562P5028I6367K58448o678L8078
13314C86215j91549n4192Q7991k7569B7488N18290J23336A57164K8951Q7753K35118
13303E08986B54086M2241q4997L4849q4953n9253J41408E3035M11622A18291L3333
13292A51624R1109k5221H0243K03815Q6476P7976I8382c2214A62157L7957K19456
13281D19570k00105g1889C42044J8141j42548o785J03120J45872A84327c91670
13270h6744H0917b8744A42136O4891b56959A97521a33272M1303C0009L95840G2590
$$ y = [157978, 49350, 117575, 424022, 336889, 126714, 177174, 166734, 358902, 500370, -92987, 49576, 257867, 447794, 211079, 43012, 380045, 283870, -24601, 4695, 4667, 227089, 450756, 99040, 535600, 470269, 325134, 24114, 352322, 605757, 197562, 272590, 96367, 354815, 348137, 386215, 194666, 140474, 228465, 200896, 27488, 545778, 669114, 157164, 186115, 273868, 508986, 254086, 296327, 211330, 246179, 161226, 101973, 243381, 53035, 464657, 118291, 151624, 242733, 217512, 80243, 284058, 370534, 448510, 98382, -32214, 162157, 200114, 419570, 219465, -71889, 342044, 360185, 217637, 210852, 313972, 459844, 184327, -391670, -86744, 80917, -28744, 142136, 207027, -256959, 197521, -133272, -91969, 30009, 425849, 72590]
13258C13876P6280j76134c03422A00999A4161L7241J7624a2441D4843J74666a78369
13246D9898P5505l862K07879g994A01742K69989k9928A48278m3521J27213o8684
13235A63286L55517A04240D9740K8601a7801B28872a45357j00259c5319k57086
13225b92405Q7419A70575q2310f3721N654C5673a69277B13617n7570K9535F7186
13213B02024n4187M794p878N8225a48943F5395A8406Q4271J44711n5988D4434
13201c051D44685E5501A7767D579d8882C71080l6833A31590n1192J31863O1130
13190B73391A9149M5053J98168G1658h1904k7957o116B48847l4199j0725O6362
13179B70285a08749A09427i453r7278c5890A00356k4502m862a8258A17777N0674
$$ y = [313876, 390156, 214022, -303422, 100999, 14161, 51402, 69026, -12441, 44843, 219509, -178369, 49898, 125403, 121541, 329420, -7994, 101742, 371731, 341803, 148278, 104757, 231970, 163286, 518803, 104240, 49740, 78341, -17801, 228872, -145357, -245616, -35319, -292405, -204986, 170575, 88265, -63721, -58067, 35673, -169277, 213617, 156047, 185582, 67186, 202024, 147837, 152631, 144753, 202978, -148943, 65395, 18406, 102677, 247388, 191400, 44434, -3051, 444685, 55501, 17767, 4579, -48882, 371080, 334247, 131590, 80398, 212261, 273391, 19149, 64202, 262370, 71658, -81904, -109861, -115977, 248847, 214648, 203923, 270285, -108749, 109427, -9453, -106731, -35890, 100356, 75854, 70992, -18258, 117777, 168451]
13168A68451K6498c2391I7771J7910a19362D4240i4803n4080M469b1547B37464
13156A3868J5690N5982J2990m188J70611A2136f1999D5323j9706R7456P6487i6578
13143D5119b86122D06678a34916I6885P6087a75301c4173A94351A7647a70326
13132B79577m9598D3627k332a08758C86306A34J77623B0917a24557M0898C731
13120a39359B321b55831G3615a17841F3800a36421r821a2002A90633q3732f5517
13108H4730A6791e0628A10795n3910a26702A99464b1407G3712b25751M629M3792
13097a77330A37360F6896a00318k10245A52047a94655A2422J28451D730J47327
13087A52057K61083a00740B52724d0168B93002E200M36665q1073a4059j23077
$$ y = [168451, 194949, -32391, 97771, 115681, -119362, 44240, -94803, -148883, -144414, -21547, 237464, 13868, 29558, 85540, 98530, 94342, 264953, 12136, -61999, 45323, 25617, 123073, 199560, -96578, 45119, -286122, 406678, -134916, 96885, 172972, -175301, -34173, 194351, 17647, -170326, 279577, 229979, 43627, 41295, -108758, 386306, 134, 177757, 20917, -124557, -83659, 3731, -139359, 2321, -255831, 73615, -117841, 63800, -136421, -146242, -12002, 190633, 106901, -65517, 84730, 16791, -50628, 110795, 56885, -126702, 199464, -21407, 73712, -225751, -221122, -177330, 137360, 66896, -100318, -310563, 152047, -194655, 12422, 140873, 4730, 152057, 413140, -100740, 252724, -40168, 293002, 5200, 441865, 360792, -14059, -137136]
13077a37136F0645J33122b50853J02784B37693k4967b7591A86629n0651Q5003
13067B20981b87555R8521F0905N502J3971K55035A02198M4936a770E49431e6590
13055a64894a023D7171J67968I3605b26316D652b0713B53341o8535K13800j55166
13044B43440q2909L0942K04667Q2336A75668a12662m6826A36445g2366A17124
13033c00A1065J91530a15762B75437p5579E3570a1113n4606E0827h0150Q849j12242
13021a83543A45875g6513j46658i5742B75745G0940M2342d5317H1689a134A53648
13009A21376a2823A21369b26461M8469A88131P1925b41127G1382Q807b00915A01766
12997d5716q435F6690a28766B49267H8619K58409g5082B48185N4107A01177M1983
$$ y = [-137136, 60645, 193767, -250853, -148069, 237693, 212726, -27591, 186629, 135978, 220981, -287555, -189034, 60905, 66407, 80378, 335413, 102198, 147134, -1770, 549431, -56590, -164894, -1023, 47171, 215139, 93605, -226316, 4652, -20713, 253341, 184806, 398606, 243440, 160531, 191473, 396140, 478476, 175668, -112662, -159488, 136445, -72366, 117124, -300, 11065, 202595, -115762, 275437, 199858, 53570, -11113, -65719, 50827, -80150, -71301, -183543, 145875, -76513, -223171, -95742, 275745, 70940, 113282, -45317, 81689, -1134, 153648, 121376, -12823, 121369, -226461, -177992, 188131, 260056, -241127, 71382, 80189, -200915, 101766, -45716, -54151, 66690, -128766, 249267, 88619, 347028, -75082, 248185, 302292, 101177, 143160]
12986A43160m1200a8735p752A27435B6864a99736C73874A61852D2068f4317A30570
12974G3430J82916a49579k20660C58263c2179A7764i4418B22932B3343a69275
12963f7095D04876j33223j32442b47183i1476J677D4436O6580n2133a0385B59864
12951A00000e352A02647i6433B4991b2155H7575e3227j22549B14329a00955A14793
12939a52247O3454b2853A21509a96298A32063c15192A52377m6127Q6649I2959
12928a15834B27021c9137m0174k4241D7818b21079H4443P5173f5932C58252b02103
12916A65731g2577B97349d23571A99512a17478B75907A27992J5319N1662B5414
12905H0162g4700A02018Q2112i5934B12976d8193a1908A52999b55588A76323G2853
$$ y = [143160, 101960, -18735, -26487, 127435, 26864, -199736, 373874, 161852, 42068, -64317, 130570, 73430, 256346, -149579, -370239, 358263, -32179, 17764, -94418, 222932, 23343, -169275, -67095, 404876, 271653, 139211, -247183, -91476, -89799, 44436, 111016, 58883, -10385, 259864, 100000, -5352, 102647, -96433, 24991, -22155, 87575, -53227, -175776, 214329, -100955, 114793, -152247, -88793, -22853, 121509, -196298, 132063, -315192, 152377, 106250, 192899, 92959, -115834, 227021, -39137, -79311, -103552, 47818, -221079, 84443, 159616, -65932, 358252, -202103, 165731, -72577, 297349, -423571, 199512, -117478, 275907, 127992, 143311, 194973, 25414, 80162, -74700, 102018, 184130, -95934, 212976, -48193, -11908, 152999, -255588, 176323, 72853]
12893H3755k9777B4558a77715G2473K9174b13561B96105b77989C4979r060N884
12882C1803g2947q8411B6950a81677J2431d6741A29777J1339b95857A62034K83368
12871D45402f6242C02261A2742R3606J5011E3018a49514G4831J70003a37286j42381
12860b79667L5814e4750J3217l5377L3487k7373k8004j1170c9561j79469L2477
12849a86553h3868F8253J4638K06774h1081p1495O7121C32163a38313p2832A75070
12837a05523C7858J32876h1189j66539I7444b40110I39J64561a76663f0032A95490
12825B16591a7293A13081g6087q4835B60269C7191A2878P7145a28395J9073b6242
12813A42632b4215j44690A65240K62313A08510b0817C7430J6373A1751L0787a96751
$$ y = [83755, 53978, 24558, -177715, 72473, 101647, -213561, 296105, -277989, 34979, 25919, 31803, -72947, -161358, 26950, -181677, -169246, -46741, 129777, 141116, -295857, 162034, 445402, -66242, 302261, 12742, 106348, 121359, 53018, -149514, 74831, 244834, -137286, -279667, -243853, -54750, -41533, -76910, -43423, -70796, -98800, -109970, -39561, -219030, -186553, -83868, 68253, 82891, 289665, -81081, -152576, -85455, 332163, -138313, -211145, 175070, -105523, 37858, 170734, -81189, -247728, 97444, -240110, 939, 165500, -176663, -60032, 195490, 216591, -17293, 113081, -76087, -160922, 260269, 37191, 12878, 90023, -128395, -109322, -26242, 142632, -24215, -168905, 165240, 427553, 108510, -20817, 37430, 53803, 11751, 42538, -196751]
12801H8202m216e4035B0590N8701j6006a46980A76312K9004E5645N1031e2528
12789b79314L5275d8305D17349b60634B74684b48231A7944a69808E0404K3844
12779G4248B384N8902Q9564h8226j71491C261b4095r1409A71184a77119B6049
12767a89762e1465k4505a5187B38403c88897G3192d3411k8571c0891p4701B19253
12755b6281A73290c02084c1180B22354A02624b01525f128B94775a96627B06900
12744i9947L9464n6918B13387H2188a63639A97704a50206A71106c61163a8339
12733E0418b57778i7779A69400e6979j39078J7333A84092c28654J25001B88024
12722B68662l3625K94719e0068D4844j9714i1545m607A57969j4622c08858a6992
$$ y = [88202, 83986, -54035, 20590, 79291, 63285, -146980, 176312, 205316, 55645, 106676, -52528, -279314, -244039, -48305, 417349, -260634, 274684, -248231, 17944, -169808, 50404, 74248, 2384, 61286, 150850, -88226, -259717, 3261, -24095, -115504, 171184, -177119, 26049, -189762, -51465, -75970, -15187, 238403, -388897, 73192, -43411, -71982, -30891, -105592, 219253, -26281, 173290, -302084, -31180, 222354, 102624, -201525, -6128, 294775, -196627, 206900, -99947, -60483, -117401, 213387, 82188, -163639, 197704, -150206, 171106, -361163, -18339, 50418, -257778, -97779, 169400, -56979, -196057, -178724, 184092, -328654, -203653, 288024, 268662, 235037, 529756, -50068, 44844, 25130, -91545, -96152, 157969, 143347, -308858, -16992]
12710a71522I7716d48619D17624f3434p9257r8385o1615C7618L8745e6374B13888
12698c7816B7834K04053b0368e468A2037K61219j15667J69443m1629n7007M7153
12687B75549A9569a04690B99490D6005L74910A58581B8159a50519A16680O5529
12677A82209O590o9964K2820J02996A07484R6969F189d548E6442R808a36796k8587
12665a65383a6671p3173f693B03319c9778A33864i0797B11870a4425I102b07516
12653A60801C250c5845A39678O3877o9305j9974b63961A73118c53615G8093J97430
12642B75523j12974J74542A35886Q6038F9018a83291E4566M0767J12270J33061
12632C40664B1080e6864m7573l8355l7632P7297d4114A21424k5142P7756c3267
$$ y = [-171522, 97716, -448619, 417624, -63434, -142691, -241076, -302691, 37618, 76363, -56374, 213888, -37816, 27834, 231887, -20368, -5468, 12037, 273256, 157589, 327032, 285403, 228396, 275549, 19569, -104690, 299490, 46005, 420915, 158581, 28159, -150519, 116680, 182209, 188799, 118835, 141655, 244651, 107484, 204453, 6189, -4548, 56442, 66250, -136796, -165383, -16671, -89844, -6693, 203319, -39778, 133864, -90797, 211870, -14425, 9102, -207516, 160801, 3250, -35845, 139678, 203555, 134250, 114276, -263961, 173118, -353615, 78093, 275523, 162549, 337091, 135886, 221924, 69018, -183291, 54566, 95333, 207603, 340664, 21080, -56864, -104437, -142792, -180424, -103127, -44114, 121424, 96282, 174038, -33267]
12620h8068j4122l0910B46169a883B0127R4058A4497a76190D8421N89460A55956
12608I0167f5458D6626a8315B48555A21001l7489g4037a7726l8532r7044F5406
12596a6718A10795C1860d337m5753A08822c5866n0051A16207B4374N487c04605
12584B16022a41718M3392k46084A24985R3634g987A96194g6691D14881a05198
12573A48996a9167j11002A9034R4659a47590A50795b73416d0058E0932c11607
12562b3019D4488R2363a27905A37317F182a912B66073F7921b26464B5814L13396
12551C39210A2351K25568c20231a26494j5119C147h6902A12955L35942A32683
12540a03308c4486A04129d69657C08174I4389d9384B1379a91724B19771I3410
$$ y = [-88068, -102190, -133100, 246169, -1883, 20127, 114185, 14497, -176190, 48421, 637881, 155956, 90167, -65458, 46626, -18315, 248555, 121001, 83512, -74037, -17726, -56258, -153302, 65406, -16718, 110795, 31860, -4337, -50090, 108822, -35866, -85917, 116207, 24374, 29861, -304605, 216022, -141718, -98326, -344410, 124985, 218619, -7987, 196194, -76691, 414881, -105198, 148996, -19167, -130169, 19034, 113693, -147590, 150795, -273416, -40058, 50932, -311607, -23019, 44488, 136851, -127905, 137317, 6182, -1912, 266073, 67921, -226464, 25814, 339210, 12351, 237919, -320231, -126494, -141613, 3147, -86902, 112955, 448897, 132683, -103308, -34486, 104129, -469657, 308174, 94389, -49384, 21379, -191724, 219771, 93410]
12529e1456k5707B15205F0041a97510j69646A33639P1574g5422j7356C7632b05032
12517b89191N9347g1098A51775f9303j22726F8184N3939b26944A05705a21077
12506b14650m1313a26885A05389g6782C5230e7215j20690D5239J41264d3933l6623
12495h0556e133B36674A14065h1434j23719A0915a95003k1760A25419i0549E0875
12483a5858l6341l9927m4740B4669J41794B3977J49424a74121B57530c8258B21236
12471a50638B13655H2607a03435B25287b63315E883a08291k50403e8385r6647
12461a55032e8622l63232D0169d0643B41273c23967d1675E663Q4417h6337n5353
12450a41690D7307a43729A35740a20078J4481A3820b45038A58317g7705k76165
$$ y = [-51456, -77163, 215205, 60041, -197510, -367156, 133639, 205213, -75422, -92778, 37632, -205032, -289191, -229844, -71098, 151775, -69303, -192029, 68184, 122123, -226944, 105705, -121077, -214650, -255963, -126885, 105389, -76782, 35230, -57215, -177905, 45239, 186503, -43933, -80556, -5133, 236674, 114065, -81434, -205153, 10915, -195003, -216763, 125419, -90549, 50875, -15858, -52199, -92126, -136866, 24669, 166463, 23977, 173401, -174121, 257530, -38258, 221236, -150638, 213655, 82607, -103435, 225287, -263315, 5883, -108291, -358694, -58385, -155032, -58622, -421854, 40169, -40643, 241273, -323967, -41675, 5663, 90080, -86337, -141690, 47307, -143729, 135740, -120078, -105597, 13820, -245038, 158317, -77705, -353870]
12440c53870f2331P498E8293a93275c6411k2364B05250D5033K09271G6816d37218
12428a7592B10758M9416a53324N928B5400M0357a50162B82242F9319k3435a45777
12416c56467A08687d280A51703a2271m1091j87502a16980A12965d3176K0528A49519
12404c7658P251p8078A2573a67517F1854e6226F0996K69966g0677j70253i6971
12392A13227N0551e9359b0750k7860o5293D1370J54855o4004E837h2541r3314
12381a75855j40785c4578n7262I6956a49000j44151i2660B66536a61300C42221
12370A67032L2060b9135j38303b4965B17720E40P5298b72123A65210a4074C11380
12358H8419b3925B81910A14270D3065R5201c8465k12280a8037A46568b37330Q1910
$$ y = [-353870, -62331, -54833, 58293, -193275, -36411, -58775, 205250, 45033, 254304, 76816, -437218, -17592, 210758, 260174, -153324, -147396, 25400, 65757, -150162, 282242, 69319, 45884, -145777, -356467, 108687, -4280, 151703, -12271, -53362, -240864, -116980, 112965, -43176, -22648, 149519, -37658, -30407, -108485, 12573, -167517, 61854, -56226, 60996, 330962, -70677, -240930, -96971, 113227, 163778, -59359, -20750, -48610, -113903, 41370, 196225, 132221, 5837, -82541, -175855, -316640, -34578, -91840, 96956, -149000, -293151, -92660, 266536, -161300, 342221, 167032, 199092, -29135, -167438, -24965, 217720, 540, 75838, -272123, 165210, -14074, 311380, 88419, -23925, 281910, 114270, 43065, 138266, -38465, -250745, -18037, 146568, -237330, -155420]
12347a55420B23774d9144j80645h0479B33171a07202A57086c547m6311p2053A49466
12335a87462P3521D4994J61219e0982j75923e1733A41682q519a07670d8254j7139
12324f5393B28106J634a61420H3497C0799g9320p5313C14883E5842N2916j7435
12313I1323C0542L52156A68383J06974A32423P0847J63308c7485E5948K18745
12303B74693j03175P8684R0901j12147J20595A10254M1149m9428D2917j8023J61421
12292A86315r2871a1062B42195K7082p3691a76053A47696l4002c0494q037k91
12281c8822A36472C6531K76917A2690K4399O7687m2542c67987c6515l5688B8148
12269A38221J82751D7827j5448K03157A03050J91803A07654L66905B30942a8892
$$ y = [-155420, 223774, -49144, -229789, -80479, 233171, -107202, 157086, -3547, -49858, -121911, 149466, -187462, -113941, 44994, 206213, -50982, -226905, -51733, 141682, 133163, -107670, -48254, -65393, 228106, 229740, -161420, 83497, 30799, -79320, -154633, 314883, 55842, 108758, 91323, 30542, 382698, 168383, 275357, 132423, 203270, 366578, -37485, 55948, 274693, 171518, 250202, 341103, 228956, 349551, 110254, 151403, 101975, 42917, 24894, 186315, 93444, -11062, 242195, 269277, 195586, -176053, 147696, 113694, -30494, -38531, -38822, 136472, 36531, 313448, 12690, 37089, 104776, 62234, -367987, -36515, -72203, 28148, 138221, 320972, 47827, 32379, 235536, 103050, 294853, 107654, 474559, 230942, -18892]
12258b29718A58587P8794J14853e8659A41797K462b18093C55531n2306b6202A86342
12246B6834K84398B3996e2496B49017D6607e15674B5333N29337j56164A11287
12235a31187A36372m6249b73144A1999J25636J22454i998G6426a4525G2887j4761
12224E8126K35881A07296m868J92981I4502J65368q0928c5819A81904c3023D02948
12212i2927E49738G4732J58931N2924a790B76273A30565j65a33359A31075J5003
12201A46078C6302K66859C5747K04983g5929c0067A62870C6382d3226A25042J76435
12190C01477b1743A97685Q905I5512R5348B5783J55088H9629f5247a5160A58734
12178A11493b84890A14716E3681o581J84199J03841q6451a035D80977A26566P3718
$$ y = [-229718, 158587, 237381, 352234, -58659, 141797, 144259, -218093, 355531, 303225, -26202, 186342, 26834, 311232, 23996, -52496, 249017, 46607, -515674, 25333, 554670, 398506, 111287, -131187, 136372, 90123, -273144, 11999, 137635, 260089, -9998, 76426, -14525, 72887, 58126, 294007, 107296, 102428, 295409, 94502, 259870, 178942, -35819, 181904, -33023, 402948, -92927, 549738, 74732, 233663, 286587, -1790, 276273, 130565, 130400, -133359, 131075, 146078, 36302, 303161, 35747, 240730, -75929, -30067, 162870, 36382, -43226, 125042, 301477, -21743, 197685, 206590, 95512, 190860, 25783, 180871, 89629, -65247, -15160, 158734, 111493, -284890, 114716, 53681, 47100, 231299, 335140, 248689, -1035, 480977, 126566, 200284]
12167B00284c04764C88323A25659J1929m4299J23590q4063j5244d7017A55745
12156d39487B29975l9527L10370C9170J73853H4976J25641l8557K20630A10833
12145e1884r9008A62362J15254A24291l3722R4109J26230f6148l8486D0215K03715
12134B43930j16431G882J5687K10755b07743A37445J51075a08236A07585J17007
12124B24592a90021h965B50732J8757C1396b06346A78931j4619N6414K4608j20137
12113A25197Q3992g2492A62205D502A137L152c8921C75785o3251A35025l5582
12102I9443K83070A46274J05373A04654Q2258B2106p405K51620F6001A8426J9305
12091C7731a31273A43021Q1161I1815K07048C3543K78674a66463B26612m0109
$$ y = [200284, -304764, 388323, 125659, 137588, 93289, 216879, 132816, 117572, -47017, 155745, -439487, 229975, 190448, 500818, 39170, 213023, 84976, 210617, 172060, 392690, 110833, -51884, -150892, 162362, 277616, 124291, 90569, 184678, 310908, -66148, -104634, 40215, 243930, 127499, 7882, 23569, 234324, -207743, 137445, 288520, -108236, 107585, 224592, -190021, -8965, 250732, 269489, 31396, -206346, 178931, 164312, 220726, 245334, 125197, 209189, -72492, 162205, 4502, 1137, 4289, -38921, 375785, 312534, 135025, 99443, 382513, 146274, 251647, 104654, 186912, 22106, 14701, 266321, 66001, 18426, 37731, -131273, 143021, 224182, 91815, 298863, 33543, 312217, -166463, 226612, 186503]
12081A86503K14999j94279b46212B5851a59472g005A18892k5053B5125k219K58086
12070B80992A12980L6560l9985B4246b7765a0974D279K67337b18513B23653F7885
12058A03266K64596J8693p0388j31592O3052a89039B23688C3865M43760a14989
12047E74863e8804n4332A68076a37468B90350a64476j9938l9596C5400P5491j6922
12036I3969J75332L8685G0630c05367A92758f6170A22021Q3133h6573l6584C70583
12024c59078B19244c6739m5955A24947g8710A2746L5044J88304J86028D1496K94822
12013C36318A09426c7147m3373j5658C0655P0804g8811n5192J8571A353K14031
12002B15384D4137a56096F0134L48386A02596j7799O9361p2172K43810a49308
$$ y = [186503, 401502, 207223, -246212, 25851, -159472, -7005, 118892, 93839, 25125, 22906, 280992, 112980, 149540, 109555, 24246, -27765, -10974, 4279, 271616, -218513, 223653, 67885, 103266, 367862, 386555, 316167, 184575, 247627, -189039, 223688, 33865, 477625, -114989, 574863, -58804, -113136, 168076, -137468, 290350, -164476, -184414, -224010, 35400, 110891, 93969, 269301, 307986, 70630, -305367, 192758, -66170, 122021, 205154, -86573, -123157, 370583, -359078, 219244, -36739, -82694, 124947, -78710, 12746, 47790, 236094, 422122, 41496, 336318, 109426, -37147, -80520, -96178, 30655, 101459, -78811, -134003, -115432, 1353, 215384, 44137, -156096, 60134, 408520, 102596, 84797, 154158, 81986, 325796, -149308]
11991h2315C5290K6324J68346Q5019m9953L1541b48290A23784P3546m0248K1730
11980A78812c9248c957A10092a06048E9176O5402b25941F0128b1369j23976o4325
11969b09670A33328i5739j64031b104k29180a08695F2773a43566p7553A41148
11958b9579B09204b05450N4148B86304b61191k8630e7651A62173o8554a46024
11947A62225G0043a37420c3585B4844a34784N8064A69435h908q5417A810J94751
11936A96561a75790j29273a09518H2538i7455j43320n7372A42246k782H411h7698
11924A76072c11603N7633B53927r6015h4263b1163C04239f7166I7397h3488A63259
11912A8823J66748b20510C86K86964C7047J21617G9288J84642a27755B2496K92157
$$ y = [-82315, 35290, 61614, 229960, 314979, 265026, 296567, -248290, 123784, 197330, 157082, 178812, -39248, -3957, 110092, -106048, 59176, 124578, -225941, 60128, -21369, -145345, -209670, 133328, -95739, -259770, -2104, -231284, -108695, 62773, -143566, -221119, 141148, -29579, 209204, -205450, -151302, 286304, -261191, -289821, -57651, 162173, 93619, -146024, 162225, 70043, -137420, -33585, 24844, -134784, -76720, 169435, -8908, -94325, 1810, 196561, -175790, -305063, -109518, 82538, -97455, -240775, -298147, 142246, 139464, 8411, -87698, 176072, -311603, -253970, 253927, 157912, -84263, -21163, 304239, -67166, 97397, -83488, 163259, 18823, 185571, -220510, 386, 287350, 37047, 158664, 79288, 263930, -127755, 22496, 314653]
11901C14653e2700B66644B6888J11510K4578J01756D462b72180D0838a44693M2560
11890a02133B11991b1775A43507b12873B4212J60409b09261i0865K9830C35217
11879I7208C7642a2265l00570a39530O6385k53335J25607o3528a09127K9414E4397
11867b71561j85266b08142l19573a12581q5146B03149H2667J86371f6937k9655
11857i6592m9263c4708j673k23287G6016g0026D2687b95064Q5510L0434A15051
11845d05473d6417A14787l8324a66155E5440b12369j34429A32049i6375o2588
11835a58963A3386J82010i2429A32111b38506k6026K4796A8160J34366o3718e2299
11823f9006H1796d4071j23172p8356d3753j28777D4469g9418J8862a5389A80263
$$ y = [314653, -52700, 266644, 26888, 138398, 162976, 264732, 4462, -272180, 40838, -144693, -102133, 211991, -21775, 143507, -212873, 24212, 184621, -209261, -90865, -61035, 335217, 97208, 37642, -12265, -312835, -139530, -73145, -326480, -200873, -264401, -109127, -79713, 54397, -271561, -456827, -208142, -527715, -112581, -197727, 203149, 82667, 269038, -66937, -96592, -145855, -34708, -36381, -259668, 76016, -70026, 42687, -295064, -209554, -179120, 115051, -405473, -46417, 114787, 76463, -166155, 55440, -212369, -346798, 132049, -96375, -158963, 13386, 195396, -92429, 132111, -238506, -264532, -239736, 18160, 152526, 88808, -52299, -69006, 81796, -44071, -167243, -245599, -43753, -172530, 44469, -79418, -60556, -15389, 180263]
11811E5332a36204B10010Q9203I0419M5130F226a42542B6402O8876l790a31714
11799a87176j44830b3080j25307B30047b9671r0406j6899A04322J01851A5227
11788B895g4471k91782C13159A44280i5231d1996l29084C95K23098d35769a69146
11776a56462k32154a18590K6218r1697j30333J38322f4311j4048A4353M1454c15164
11764H330d45450B58162b3676k09693p4699B03574E4845h2428n0172j00553p0551
11753c03704C18933b05640a5582k42121A41764e7808A09712c6453A96510m4177
11743A52333j0291K55813a99344F0483f8496B9155e9650B9354J5593J80004E749
11731C82545h4345I9632k8641M4116a96403E0309e1650l47036R0857a00709C3302
$$ y = [55332, -136204, 210010, 299213, 90419, 135549, 6226, -142542, 26402, 95278, 91488, -131714, -187176, -332006, -23080, -148387, 230047, -29671, -120077, -136976, 104322, 206173, 15227, 2895, -74471, -366253, 313159, 144280, -95231, -41996, -371080, 395, 223493, -435769, -169146, -156462, -388616, -118590, -92372, -184069, -314402, -176080, -64311, -78359, 14353, 55807, -315164, 8330, -445450, 258162, -23676, -233369, -308068, 203574, 54845, -82428, -132600, -233153, -303704, 318933, -205640, -15582, -257703, 141764, -57808, 109712, -36453, 196510, 152333, 142042, 397855, -199344, 60483, -68496, 29155, -59650, 29354, 44947, 224951, 5749, 382545, -84345, 99632, 70991, 115107, -196403, 50309, -51650, -398686, -307829, -100709, 33302]
11719e8277A82683b58368d4333C75316A59303J56517b41460A50340a8504A18710
11708A69861p3754A8235J4303J02070J0495a53944j91729a04581A35092a30547
11697A44131o7083a53032b7822j35363A15649f7446j52263E5363c0822C4858R3791
11686A28649b1615m7836B6778e0153A52507a76032B00942i1393K7818A02810b6391
11674D8667a7543A72473P932a9153j80775B3745c29724B564J57995b84348e0507
11662A09005p889O8539D6308J2477K20138H8586A3521L5815L84394a81209H6061
11650A14643b19763E6426O632b0020A19916c25749O1901A23068d18771d675k14178
11639b18853C28065g4966A55233M3946r0986A4816J62475h4161j69847A21070
$$ y = [-58277, 182683, -258368, -44333, 375316, 159303, 315820, -241460, 150340, -18504, 118710, 169861, 96107, 18235, 32538, 134608, 145103, -153944, -345673, -104581, 135092, -130547, 144131, 77048, -153032, -27822, -163185, 115649, -67446, -219709, 55363, -30822, 34858, 128649, -21615, -69451, 26778, -50153, 152507, -176032, 200942, -91393, -63575, 102810, -26391, 48667, -17543, 172473, 180405, -19153, -199928, 23745, -329724, 2564, 160559, -284348, -50507, 109005, 101116, 169655, 46308, 58785, 278923, 88586, 13521, 49336, 433730, -181209, 86061, 114643, -219763, 56426, 63058, -20020, 119916, -325749, -263848, 123068, -418771, -4675, -218853, 328065, -74966, 155233, 199179, 108193, 14816, 177291, -84161, -254008, 121070]
11628a01998C9869K48218j09935e5728A6728J70200d77695K34333H1829h0066
11617A22174J58074H6261J22095a83717d4283j83274A15688l1684e6295A70326
11606H4792R2227H6689O051a28910B4250H355L53973b42757E9370D967J31518
11595A36485a70666A1971P8818B2215a61597j48641j8576E5862h4284j31628r4729
11584c10641a9735k84718H2688a17078B55503j07982b49466A68396D5096O3135
11574A08231a20828C3434O5449K2934K2024a60143A36267J62576a16038A17183
11563G4187C5722g2602l15676G9449a18614A14523J03670h5245j79238J4045F5539
11551A62441A1008K79470a44761I8819m3087R2097O4268f0846a5608D90349B36588
$$ y = [-101998, 39869, 288087, 178152, -55728, 16728, 186928, -477695, -243362, 81829, -80066, 122174, 280248, 86261, 208356, -183717, -44283, -227557, 115688, 84004, -56295, 170326, 84792, 177019, 86689, 92740, -128910, 24250, 8355, 362328, -242757, 59370, 4967, 136485, -170666, 11971, 90789, 22215, -161597, -310238, -328814, 55862, -84284, -215912, -310641, -19735, -304453, 82688, -117078, 255503, 147521, -249466, 168396, 45096, 108231, -120828, 33434, 98883, 121817, 143841, -160143, 136267, 298843, -116038, 117183, 74187, 35722, -72602, -388278, 79449, -118614, 114523, 218193, -85245, -264483, -250438, 65539, 162441, 11008, 290478, -144761, 98819, 55732, 147829, 212097, -60846, -15608, 490349, 236588]
11539I7995J00902j5332l6930C9776L50759c032A56588F653c274B65825A16891
11527B30844b16574A73483q2240h3094C30271b077B10613b33852A83516K6577
11517B10093p2310E0067L0550f8766B15653a33585H0397j3323B414J98045m5837
11506A54622b17239B18287A00254C5143J84855J44597j28393g0590b9015A64076
11495B02259o5712b05479d906j85862k1597d0975J8718B88318I6622a19677L3535
11484h6142A56053b7713C53502a17805A08742M2367L19803j10284a49825H3427
11473A7636b18795e449B86357b1202j92566B33436a7548E05121I8277h7526I3882
11461f7303B25072J08246m961n0318a67490I9168m139M6567b47184A51426j6768
$$ y = [97995, 198897, 183565, 146635, 39776, 390535, -3032, 156588, 6653, -3274, 265825, 116891, 230844, -216574, 173483, 91243, -83094, 330271, -2077, 210613, -233852, 183516, 210093, 137783, 50067, 80617, -68766, 215653, -133585, 80397, 67074, 2414, 200459, 154622, -217239, 218287, 100254, 35143, 219998, 364595, 236202, -70590, -29015, 164076, 202259, 136547, -205479, -4906, -190768, -212365, -40975, -22257, 288318, 96622, -119677, -86142, 156053, -27713, 353502, -117805, 108742, 151109, 470912, 360628, -149825, 83427, 17636, -218795, -5449, 286357, -21202, -213768, 233436, -17548, 505121, 98277, -87526, 93882, -67303, 225072, 333318, 328357, 278039, -167490, 99168, 95029, 141596, -247184, 151426, 134658]
11450A34658Q5017k9076h0495b8463C7761d4076B47277A15709E5351K29012A20408
11438C0886P2090M397c13996A53217K7047l7800J082h9973A36389E7661J00016
11427A57677m1044a40040L971A47688K0150R2827j759J4188H9834Q5191a09057
11415A22096K17470a5403C42624E6501A9609R0400b26635l6307f9465A82563n7842
11404A24721C3060P190K48368F2767Q8587P852c11175h6602e969b826j22830A10117
11391F5891e306b239r6240A03371b2057q0909q9968A15925r896h7313C7575J93718
11379B31293n9647F3777i1477k80697A04055K7858a06257A52768L4450a0859l08864
11368c19723b6298A5037J04584l2260A1474M04807C7684a23534G1580h0620L5242
$$ y = [134658, 219675, 190599, -80495, -28463, 37761, -44076, 247277, 115709, 55351, 284363, 120408, 30886, 102976, 107373, -313996, 153217, 180264, 142464, 143546, -89973, 136389, 57661, 157677, 116633, -140040, -136069, 147688, 167838, 260665, 258906, 273094, 89834, 175025, -109057, 122096, 339566, -15403, 342624, 56501, 19609, 110009, -226635, -262942, -69465, 182563, 124721, 33060, 40250, 288618, 62767, 151354, 159206, -311175, -86602, -5969, -2826, -125656, 110117, 65891, -5306, -2239, -98479, 103371, -22057, -102966, -192934, 115925, 106029, -87313, 37575, 231293, 171646, 63777, -91477, -372174, 104055, 131913, -106257, 152768, 187218, -10859, -319723, -26298, 15037, 119621, 87361, 11474, 416281, 37684, -123534, 71580, -80620, -45378]
11357d5378B8024J4913i7728m995k7171K3999j587C36655A8637a02343p4940p8191
11345b55474a044l986l8777G525a60604L5273A8676a21484o9315G3765e4743A83010
11332a57409o3841b611i92A51656k528A0772R3090a10255D69976h2492F3789C299
11319C13151D4065P5503d6860j50948f5866k96102a69259g1969j33886a4553G2276
11307a2357j71767j17809e6552l41248c9788A01061c8820R254a075k5152r5482
11296a21709C13554i5814b7598C4249e7771C7175a38777F545i4411p2316C56061
11284a82762d3530G5850b61429a11516B12678l692a20556A98673a07088p8046
11274a85134B5478R1738a86959Q4416k7368o4352h5517R723L2272l31388i9574
$$ y = [-45378, 28024, 42937, -97728, -102723, -129894, -105895, -107482, 336655, 18637, -102343, -177283, -255474, -1044, -5030, -43807, 7525, -160604, -125331, 18676, -121484, -190799, 73765, -54743, 183010, -157409, -221250, -2611, -992, 151656, 149128, 10772, 103862, -110255, 469976, -82492, 63789, 3299, 313151, 44065, 119568, -46860, -197808, -65866, -361968, -169259, -71969, -205855, -14553, 72276, -12357, -184124, -301933, -56552, -397800, -39788, 101061, -38820, -29566, -1075, -26227, -121709, 313554, -95814, -27598, 34249, -57771, 37175, -138777, 6545, -94411, -166727, 356061, -182762, -43530, 75850, -261429, -111516, 212678, 208986, -120556, 198673, -107088, -185134, 25478, 117216, -186959, -102543, -129911, -194263, -85517, -75794, -43522, -374910, -99574]
11262C5050M7189a63403D549b12295a9315A81397b9430E2579j9977a44188A0145
11250d187k15252j34597a25552l232j45177a16673I1701g4305G6826a73108A73908
11238b75959a20361j19908O5879A69405A9859b38935B05484E2790O5068b02589
11227E4692b42693F592e0593j22346j79904B01014b47374e8596k22284J28846
11217a52034A7319b97684b0632A82120c12481B19325a26078D8930Q111M2943a35807
11205C9640J35327D9977c04629a05178C8209J04162N7836A1500J1846A0954c71939
11193D4340P7583k8249e468j66352r9577D8825i7158J721p3070D7441a04603d3604
11180h6389C6620L5836a68276r5182f0595l8079M7521j87106N8718k7130k3714
$$ y = [35050, 82239, -163403, 4549, -212295, -19315, 181397, -29430, 52579, 32602, -144188, 10145, -4187, -219439, -354036, -125552, -128784, -273961, -116673, 91701, -74305, 76826, -173108, 173908, -275959, -120361, -240269, -174390, 169405, 19859, -238935, 205484, 52790, 117858, -202589, 54692, -242693, 6592, -50593, -172939, -352843, 201014, -247374, -58596, -280880, -152034, 17319, -297684, -20632, 182120, -312481, 219325, -126078, 48930, 57041, 99984, -135807, 39640, 174967, 49977, -304629, -105178, 38209, 142371, 200207, 11500, 23346, 10954, -371939, 44340, 121923, 93674, -5468, -171820, -271397, 48825, -97158, -95437, -168507, 47441, -104603, -43604, -86389, 36620, 72456, -168276, -263458, -60595, -98674, -51153, -238259, -179541, -206671, -230385]
11169b30385A24264c02676H7492b49590a07061a2206D2428f2016B43834c37710
11158C4726b1503j45230C69812d3339k94676a37293q6861Q2644d2302A06563h782
11146A19532K1121b07675Q4030J3581c6793k44314A3037d7369A41791o1366J54826
11135B35251b99493P5304l0206A2317O5869a48488C22312c66482J76332B164b8863
11123H2191h1489m7522G6008c02603B08176m3501a62759A59130a00929L3773r6178
11112a63334Q725P7079r3042A14170b43144K9830G5485d430A37728a17041c8539
11100A35689K84357A09042j0631L9376J1032Q7108a1254j49681a8443B12329b36714
11088a85489A47391a1044I6188J07669F0059R9100f4855C21295K6749G9606e6281
$$ y = [-230385, 124264, -302676, 87492, -249590, -107061, -12206, 42428, -62016, 243834, -337710, 34726, -21503, -166733, 369812, -43339, -338015, -137293, -224154, -141510, -42302, 106563, -8782, 119532, 140653, -207675, -123645, -110064, -36793, -281107, 13037, -47369, 141791, 80425, 235251, -299493, -224189, -254395, 12317, 78186, -148488, 322312, -366482, -190150, 2164, -28863, 82191, -81489, -129011, 76008, -302603, 208176, 164675, -162759, 159130, -100929, -67156, -163334, -154609, -77530, -170572, 114170, -243144, -213314, 75485, -4430, 137728, -117041, -38539, 135689, 420046, 109042, 98411, 137787, 148819, 235927, -11254, -160935, -18443, 212329, -236714, -185489, 147391, -11044, 96188, 203857, 60059, 159159, -64855, 321295, 348044, 79606, -56281]
11076B84202j25004H481K94594E3687K0383K4736a74333B76944A09930K15420
11066C25350d6005C75378h9190p2518b4044H4198a20037B88928O766l8585G6107
11054D77682b74733A65545K05241p7028l1899E6556d9523C02915l1347k3661L99897
11043F47804A2798b25857D80172j389K0054N5466K65283C13423R2968N92251C82658
11031C57008q6830K97552O5378k58469L07770J92568l10762L35893l13591M6534
11021F33051L45278m38690J61998r1667o3294K59759l72417J43762B44503N39556
11011G84059J682m5777C40490M20925l35016J92390J20598J82440A57118M52418
11001F09536J05936l1678J75961l79518j91936M28062k01238k09232J02414j38298
$$ y = [284202, 159198, 8481, 303075, 53687, 74070, 98806, -174333, 276944, 109930, 325350, -46005, 375378, -89190, -161708, -24044, 84198, -120037, 288928, 295694, 257109, 76107, 477682, -274733, 165545, 370786, 293758, 261859, 56556, -49523, 302915, 271568, 247907, 647804, 12798, -225857, 480172, 478783, 498837, 554303, 819586, 313423, 406391, 998642, 382658, 357008, 270178, 567730, 633108, 374639, 682409, 874977, 564215, 900108, 586517, 633051, 978329, 539639, 701637, 609970, 546676, 806435, 434018, 577780, 244503, 784059, 785741, 739964, 340490, 761415, 426399, 618789, 739387, 921827, 157118, 609536, 715472, 683794, 859755, 480237, 288301, 716363, 515125, 305893, 408307, 270009]
10991B70009J10758j21399L34022j53367j84944K35367B39882L08804k272l0445
10981E15969B12694L59016m3158M6541L0224j60427N0613K26346B73388J32327
10971D05715J04774M0683K60894r5492k15818J89953J66196O9271k89352J09353
10961G46177j3200M32908J63859j86435M84464K1230J42928J59969L6790J07301
10951B095991k0858J20640n81593J48403j76589P2632m73336J88408R1334k03707
10941A261325j42904P27048J2751n905J13772m39272J80734j91252n7319n4571
10931A404407j43814m04866k7768n0043p3480r0475A12609K43796B7602M46413
10921D74015Q0130B3632K62631G1525R9324q3778e3834F4743a06198M5559I0773
$$ y = [270009, 380767, 259368, 593390, 440023, 255079, 490446, 239882, 548686, 546414, 515969, 212694, 571710, 528552, 575093, 605317, 444890, 495503, 721849, 273388, 405715, 510489, 551172, 812066, 716574, 500756, 690709, 856905, 926176, 636824, 746177, 732977, 1165885, 1329744, 1143309, 1627773, 1649003, 1791931, 1951900, 1988690, 2095991, 2075133, 2195773, 1614180, 1762583, 1585994, 1658626, 1185290, 1373698, 1465032, 1261325, 1118421, 1845469, 1858220, 1852315, 1966087, 1526815, 1707549, 1516297, 1458978, 1404407, 1260593, 855727, 827959, 777916, 704436, 613961, 112609, 356405, 27602, 474015, 554145, 23632, 286263, 71525, 170849, 87071, -53834, 64743, -106198, -60639, 90773]
10909I577b35559n7992l4457B95206l2714r2543R6429E6888f2729O559n1622B58303
10896H5019c34212B05685N0689G2095G732b91529b609B55925b8831j47968A11914
10884E6984b14140C25578c00786d2830k13376B01845b68657A37157a75772J1339
10874a64433Q1291j5325b3063l35353P524a1925B91226d9487k8362A97212b22724
10862G0745b47479b0130j27471l3642c0661k40373A24666k981d6901b1260k08697
10851b29957A68845c83800C37613A66040i4944H0962b30070a7957j16666a5747
10840i5949j85039h8498K6637m9300k1139o2817I0701B6489b0155A4663c3685
10828a76433d6363j20780Q0646j29490q4872d7110A88978a0212j76747B43g4542
$$ y = [9577, -235559, -293551, -328008, 295206, 262492, 169949, 266378, 56888, -62729, -56170, -107792, 258303, 85019, -334212, 205685, 256374, 72095, 7732, -291529, -2609, 255925, -28831, -176799, 111914, 56984, -214140, 325578, -300786, -42830, -256206, 201845, -268657, 137157, -175772, -164433, -83142, -98467, -23063, -358416, -350892, -11925, 291226, -49487, -77849, 197212, -222724, 70745, -247479, -20130, -147601, -181243, -30661, -271034, 124666, 121685, -46901, -21260, -229957, 168845, -383800, 337613, 166040, -94944, 80962, -230070, -17957, -134623, -15747, -95949, -280988, -88498, -61861, -111161, -132300, -195117, 90701, 26489, -20155, 14663, -33685, -176433, -46363, -167143, -86497, -215987, -300859, -47110, 188978, -10212, -186959, 243, -74542]
10816A10805J4736L380R881a93345A99507a47059j0189p3974K170D96521a36015
10804B32498j08594a21990J2926G803b59385K5529d0720A47979O8069a44477m4317
10793a88794g0579o0993A3594L77914a56151A16223b38451B2267b37052a2667
10782a78511f5675A24486f8632A83181F6192f857B25469a32827A53915c93653
10771b4810l60108a46978N1190A32570k9241B1621b5017r0780b9725m0010l8132
10760a07867A46868a01643K3739j97091j23582g2531k4789A76429D7197O5941
10750A13138a18142B5720J8021b76482H8506b93550g7278j6913j52323a13992
10739b40926J4255J02927F1303j4286j9610b99150A27939E168b67437a00825k77145
$$ y = [110805, 125541, 128921, 138802, -193345, 199507, -147059, -157248, -231222, -229052, 496521, -136015, 232498, 123904, -121990, -109064, 7803, -259385, -233856, -40720, 147979, 216048, -144477, -188794, -70579, -131572, 13594, 391508, -156151, 116223, -238451, 22267, -237052, -12667, -178511, -65675, 124486, -68632, 183181, 66192, -6857, 225469, -132827, 153915, -393653, -24810, -384918, -146978, -95788, 132570, 103329, 21621, -25017, -115797, -29725, -69735, -107867, 146868, -101643, -77904, -274995, -398577, -72531, -97320, 176429, 47197, 113138, -118142, 25720, 43741, -276482, 88506, -293550, -77278, -94191, -246514, -113992, -240926, -226671, -123744, 61303, 47017, 27407, -299150, 127939, 5168, -267437, -100825, -377970]
10728c77970J82553g0771a1186A41774a27596H212i0594o8372L4935j36034a14535
10716b26710a05686B8588b33943A82944J64480a11397j06995A19937a11332j20475
10706b31807a03037I9411a03866j14444K9971a4647q3981j97047g1841c209A3489
10694B24257q7086g4444j02281e0511j42569c1320D1627g1226k53188A60656C4909
10682a53071e9472A49255i9756r0794a9260m1616l7129j0866a1291p1520l5586
10671a18397j68459B93987g4735k4019A55045j5436b74489E5730h9083j55626
10661b44709R3476q4283e3000k17312b8291l61422J42286E7877a79578F556h5597
10649d90051E2943d5355j37710f4254D5020j4044a15181B9391K12453I9367M316
$$ y = [-377970, -195417, -70771, -11186, 141774, -127596, 8212, -90594, -158966, -124031, -260065, -114535, -226710, -105686, 28588, -233943, 182944, 347424, -111397, -218392, 119937, -111332, -231807, -103037, 99411, -103866, -218310, -188339, -14647, -98628, -295675, -71841, -3209, 13489, 224257, 137171, -74444, -176725, -50511, -193080, -31320, 41627, -71226, -324414, 160656, 34909, -153071, -59472, 149255, -99756, -190550, -19260, -60876, -98005, -108871, -11291, -82811, -118397, -286856, 293987, -74735, -98754, 155045, 139609, -274489, 55730, -89083, -244709, -151233, -235516, -53000, -270312, -28291, -389713, -247427, 57877, -179578, 6556, -85597, -490051, 52943, -45355, -183065, -64254, 45020, 30976, -115181, 29391, 241844, 99367, 103683]
10638A03683k6625a82943a1135j8794k3522A11997b42657j79362P9022R6763A13008
10626b64437a26661F991a98372e2137A01433K08038g8533B25192d4467A07022
10615e7005j93535c9782H9971A5038L5342a24520A30094b58114g4997q3856B2629
10603b97614a17647p9118J0645j6279O6664B17283F0482a31841f1978F4919f0987
10591b06283B18969c25321a54342B07409h6601B86153h3879O649j48954B18206
10580h4319B02875A00951B3540g4225B25539a41795B12663h999o7319A06881i4168
10568B30944b33545A38439b9223o9534A49670d16306a64717g1522D5072h5210
10557G432J00380b05896P8854I854a60502A35588C0686L02814a0984A79702a47973
$$ y = [103683, 77058, -182943, -11135, -29929, -53451, 111997, -242657, -422019, -342997, -246234, 113008, -264437, -126661, 6991, -198372, -52137, 101433, 309471, -78533, 225192, -44467, 107022, -57005, -250540, -39782, 89971, 15038, 50380, -124520, 130094, -258114, -74997, -158853, 22629, -297614, -117647, -196765, -186120, -202399, -135735, 217283, 60482, -131841, -61978, 64919, -60987, -206283, 218969, -325321, -154342, 207409, -86601, 286153, -83879, -77230, -226184, 218206, -84319, 202875, 100951, 23540, -74225, 225539, -141795, 212663, -8999, -76318, 106881, -94168, 230944, -233545, 138439, -29223, -98757, 149670, -416306, -164717, -71522, 45072, -85210, 7432, 107812, -205896, -127042, 9854, -160502, 135588, 30686, 333500, -10984, 179702, -147973]
10545g0067n8337C0410c65627b3910A75316b14216I6635j6123L9045c344B01431
10533G0552C2724N5846L66534a40084f1713b2215j17734I4660Q3263b65555p1052
10522c36607a00208j76503a37411H055a03728A344a588H0576h0958k8809j0948
10511a20715K7486J0826b3588C40735b60415i2978j95237A28399J76701d68737
10500B5732g7061J088k78j7992B5648c7984a4469G6887a27848A02849a42332A87751
10487b89382q6154h6190j13892O4424q2274D2006b17494B0702g4939m51865E6142
10475b75140l5180B06314a44837k9913j87887a41902A27903a93189j0542b8808
10464b17295H9646N4587l5701O7893l3393J67828r3538R9374B4771N4062k9080
$$ y = [-70067, -128404, 30410, -365627, -23910, 175316, -214216, 96635, 80512, 119557, -3344, 201431, 70552, 32724, 88570, 455104, -140084, -61713, -22215, -139949, 94660, 177923, -265555, -336607, -100208, -276711, -137411, 8055, -103728, 1344, -1588, 80576, -80958, -109767, -120715, -93229, -82403, -23588, 340735, -260415, -92978, -288215, 128399, 305100, -468737, 25732, -77061, -75973, -76251, -94243, 25648, -37984, -14469, 76887, -127848, 102849, -142332, 187751, -289382, -375536, -86190, -200082, -135658, -217932, 42006, -217494, 20702, -74939, -526804, 56142, -275140, -310320, 206314, -144837, -174750, -362637, -141902, 127903, -193189, -203731, -28808, -217295, 89646, 144233, 108532, 176425, 143032, 310860, 217322, 316696, 24771, 78833, 49753]
10453D9753L90246j73393j21171a17229l760C0954J44525g3756H7678b3734j0689
10442c4423H8328d4094B6767a62405e8857k27563B02023h3853E0744e9257I4155
10430A64494a34547b1594j56466C2302c4868A74147E6772a98062g4353Q605k41994
10419c07742o1324a38207k34874i278j32284j3186B79598a03912L4313L0960a2317
10407B05303b26356h4249n1932O2623B74119h7970q0883I8584a21007A96900F947
10395a70608p6951D2576e9653G4096K20459a3462D3251L7735a69176B4410R4660
10384A19070D6346N9442d6777k42473E7897J8442K6276J19255g65B11445H7959
10372D3695J13833b22840j2804M0427e5142A55048b58932a05908B476a8810A22318
$$ y = [49753, 439999, 266606, 145435, -117229, -120989, 30954, 175479, -73756, 87678, -23734, -34423, 88328, -44094, 26767, -162405, -58857, -286420, 202023, -83853, 50744, -59257, 94155, 164494, -134547, -21594, -178060, 32302, -34868, 174147, 56772, -198062, -74353, -65748, -307742, -369066, -138207, -373081, -9278, -141562, -154748, 279598, -103912, -69599, -38639, -12317, 205303, -226356, -84249, -136181, -73558, 274119, -87970, -168853, 98584, -121007, 196900, 6947, -170608, -247559, 42576, -59653, 74096, 294555, -13462, 43251, 80986, -169176, 24410, 119070, 46346, 105788, -46777, -289250, 57897, 76339, 102615, 221870, -765, 211445, 87959, 43695, 157528, -222840, -235644, -195217, -55142, 155048, -258932, -105908, 2476, -18810, 122318]
10360B90002Q7225A540M00917A27190F2248L63932K2464M9132q2512j96698a31664
10348B15728K62501j41694J82642B37974q6035l105K30500i467C73166j80056
10338A93110n5759K10690j59950L56121b628E4172K61118k5511j07398n0152O4759
10327A96988J70881c12417B65380l5722N9954q465j16010L73372B06612c8821
10316A33870e6186B01637o6405F0991b60785B60406f4171A37642i0560K5199K562
10305f2799p1972A03293B94a16226B9990K2258a62360C16283j54681J67799A24029
10293A25664a6972A5067c77992A88433r3395k0276a49945A22172b98027J31227
10283a66800C4937L61285a14227c5B20969E1967c6983A46776f6709B23569a40555
$$ y = [290002, 377227, 1540, 402457, 127190, 62248, 426180, 448644, 497776, 415264, 218566, -131664, 215728, 478229, 336535, 519177, 237974, 151939, 148834, 379334, -9467, 373166, 193110, 137351, 348041, 188091, 544212, -2628, 54172, 315290, 289779, 182381, 132229, 196988, 367869, -312417, 265380, 229658, 289612, 281147, 165137, 538509, 206612, -38821, 133870, -56186, 201637, 135232, 60991, -260785, 260406, -64171, 137642, -90560, -65361, -62799, -134771, 103293, 294, -116226, 29990, 52248, -162360, 316283, 161602, 329401, 124029, 125664, -16972, 15067, -377992, 188433, 95038, 74762, -149945, 122172, -298027, -166800, 34937, 396222, -114227, -35, 220969, 51967, -36983, 146776, -66709, 223569, -140555]
10271A45199d7897j80495C23279B5892a4313j1401B0370b66761b3539D3254a10700
10259a66359a9439A47813C8438b02702B87675n0689A9711p992d21091J41545J11500
10248a68046A74756a59338E8387a36222A22625b43564k71576A21833J92558h8335
10237A91939D3262K29012N6765A44341J3114n6542a07750c366D8239a17353E2750
10225I1315j5520b41700C30254a80452C8652a99968i003B30640c79368A7750c83749
10213b4423B10850g6290o8737O2650A58312i6113E259a58925m7326A60998C5811
10201F0009a66597A65985a94802e9342H8461c51367a04990A7769a84558F6944
10190b85578C49813h9129D7958a22449A66856e9356h776C11658c90450I9121b31408
$$ y = [145199, -47897, -228392, 323279, 25892, -14313, -25714, 20370, -266761, -23539, 43254, -110700, -166359, -19439, 147813, 38438, -202702, 287675, 236986, 19711, 11719, -421091, -279546, -168046, 174756, -159338, 58387, -136222, 122625, -243564, -515140, 121833, 314391, -88335, 191939, 43262, 272274, 329039, 144341, 157455, 100913, -107750, -3366, 48239, -117353, 52750, 91315, 75795, -241700, 330254, -180452, 38652, -199968, -9003, 230640, -379368, 17750, -383749, -24423, 210850, -76290, -145027, -82377, 158312, -96113, 5259, -158925, -206251, 160998, 35811, 60009, -166597, 165985, -194802, -59342, 88461, -351367, -104990, 17769, -184558, 66944, -285578, 349813, -89129, 47958, -122449, 166856, -59356, -8776, 311658, -390450, 99121, -231408]
10178h5142C3878a14783r9833b3024q4230j48730O2054B391h6901m7208r0987
10167b25096C2191M4000b11702A91452d29849C120N6806a6681j57457M9552C29618
10155B52661h0210b2964E1139m51h5432L7360C459J00221c0220k72517h3711m6235
10143a29946m3900a423l28658a40571C1160R3057j4893j1237B8261j1658a29191
10131h6994F4028Q4180f3886j08041B3916f5153a1996m9132A87052b45316a07486
10119C0386a22028A272c20967J13977B6643a13956A76931E5656J6226a39588A27726
10107A867a13949m0266J9645I0390e24798a40744P445j14313c5618a0748q6298
10096i7046I5653l6964J89371b74861J08359J1482f6273j17407A56051a24020
$$ y = [-85142, 33878, -114783, -214616, -23024, -107254, -255984, -193930, 2391, -86901, -134109, -225096, 32191, 76191, -211702, 191452, -429849, 3120, 59926, -16681, -174138, -124586, 329618, 252661, -80210, -22964, 51139, 50688, -85432, -48072, 3459, 103680, -30220, -302737, -83711, -129946, -173846, -1423, -330081, -140571, 31160, 124217, 109324, 98087, 28261, 16603, -129191, -86994, 64028, 148208, -63886, -171927, 23916, -65153, -11996, -61128, 187052, -245316, -107486, 30386, -122028, 1272, -320967, -206990, 26643, -113956, 176931, 55656, 71882, -139588, 127726, 1867, -113949, -154215, -134570, 90390, -524798, -140744, -133299, -247612, -35618, -10748, -97046, 95653, 58689, 248060, -274861, -166502, -155020, -66273, -183680, 156051, -124020]
10085A74236a87569C4776J29307a56490p4140A30715d38669a92549A75292J51968
10075C27260g9160C614K4790Q9697m6006B2508J73695f0070A57985K21392A81298
10063f3044n2195F0525b28862l6743a7352l5020k4869j480A04226H684a96565
10051a56213a3210l62566B02168c6159A37250a46027H0095c31970J39948r6644
10041b88666L477d9123C03587H0340a56395J9858n4309b8436A19336I856b76460
10029A12073b67292C0888J035b77838B18150k3553b54918A67276c26554d1063
10018b42601I8080l7060a72784B58801a12022k68875A01436a20000A78285c80796
10007c19297k02262A50229D67a66682p2787j21198a79472k01180B77647b31393
$$ y = [174236, -187569, 34776, 164083, -156490, -230630, 130715, -438669, -192549, 175292, 327260, -79160, 3614, 28404, 118101, 72095, 22508, 196203, -60070, 157985, 379377, 181298, -63044, -115239, 60525, -228862, -265605, -17352, -52372, -77241, -78721, 104226, 8684, -196565, -156213, -13210, -375776, 202168, -36159, 137250, -146027, 80095, -331970, -192022, -288666, -285189, -49123, 303587, 80340, -156395, -136537, -190846, -28436, 119336, 9856, -276460, 112073, -267292, 30888, 31923, -277838, 218150, 194597, -254918, 167276, -326554, -41063, -242601, 98080, 61020, -172784, 258801, -112022, -380897, 101436, -120000, 178285, -380796, -319297, -521559, 150229, 467, -166682, -239469, -360667, -179472, -380652, 277647, -231393]
9996B05100a26078A40212h0365B06372q1975D11i4114A80399c35214G7004a77503
9984b64432d6511D945b30553G2655k1964a70025B47561a31483p5705g3218G8340
9972C8243a40919H9310R2847a2395A71559a56876K5508f3763A29033b36147j40903
9961c77050A4263a98785k2469F2177e31244B7048M976J7691h5965C1127a47388
9949a83276A5776P1204E244g1198k5487q3500c0032k34135C3839a78546k7842
9938b06388P6666j8903N8386o584j03157K3094m0240k43770A37540c84375E2825
9926b3216o8509j87744n3661a34429d5330l11978J16351j2076h4466r686F091
9914B02280G0584h8750D28J31862b8783H4808d3999K0804b821E3641a47631c2658
$$ y = [205100, -126078, 140212, -80365, 206372, 124397, 411, -94114, 180399, -335214, 77004, -177503, -264432, -46511, 4945, -230553, 72655, 50691, -170025, 247561, -131483, -207188, -73218, 78340, 38243, -140919, 89310, 182157, -12395, 171559, -156876, -131368, -63763, 129033, -236147, -377050, 14263, -198785, -221254, 62177, -531244, 27048, 32024, 49715, -85965, 31127, -147388, -183276, 15776, 86980, 5244, -71198, -96685, -180185, -30032, -264167, 33839, -178546, -206388, -129722, -148625, -90239, -96823, -199980, -176886, -217126, -460896, 137540, -384375, 52825, -23216, -91725, -279469, -333130, -134429, -45330, -357308, -240957, -253033, -84466, -94152, 6091, 202280, 70584, -88750, 428, 132290, -28783, 84808, -43999, -23195, -2821, 53641, -147631, -32658]
9901A19987f7742k42362c3136a5884k29710g1489B93488a47401C25668d64776
9890G5734f4834n4994B69642a99273c9432k9746C3600a64977k74891B0347h1001
9878A44041A0945b72233A97604b38741k34172e3009A44105a49013j37867i5006
9867g7802c6829A8837j156a8055C2474b05731A2974a94617A4670c12336a25718
9855A42976d5445A05816a90350a2245k71946J12581j42591N4601g8480G2226J47908
9844B20134n7539c64771l648C96609a46153b5508l1059p1355B2225a49226A41724
9832a21206k8665c6991m4292C1335a12234j22511J13021A19106a05296M5854A8710
9820a1067l45595B88396c34751B3890b55961f3458A00827c45142K378E9073a71006
$$ y = [119987, -67742, -310104, -33136, -15884, -245594, -71489, 293488, -147401, 325668, -464776, 75734, -64834, -119828, 269642, -199273, -39432, -69178, 33600, -164977, -439868, 20347, -81001, 144041, 10945, -272233, 197604, -238741, -472913, -53009, 144105, -149013, -286880, -95006, -77802, -36829, 18837, 17681, -18055, 32474, -205731, 12974, -194617, 14670, -312336, -125718, 142976, -45445, 105816, -190350, -12245, -284191, -171610, -314201, -259600, -78480, 72226, 220134, 162595, -364771, -368419, 396609, -146153, -25508, -56567, -127922, 22225, -149226, 141724, -121206, -149871, -36991, -81283, 31335, -112234, -234745, -121724, 119106, -105296, -59442, 18710, -11067, -356662, 288396, -334751, 23890, -255961, -63458, 100827, -345142, -342764, 59073, -171006]
9808c5480B95828c89899C8869a51268A27321c16290A01870Q4797e49303a48198
9797d2501A15604a15415j21115D1559O8942d8255E8340a89041A87990f27120A1085
9785i8796d5938m8506A52491l3237d31586B55509b28310a02634A31441a73733
9774a10418c1256A47934b3973C20954r5338a24888o9921i4688j44518N2367q7108
9763b73947o5637f0657b5557k8384k44249D9535J29985a57371C1330N9944k5907
9752F5367c12665E1692J04927c2675j88658a1390k14579g187k04125m4616M9942
9741b05986B1978J45066J05965i8551k94675d9103C64961A65847c5803A4540d14154
9729a50366m0568K1792Q2463B70399g4952j6660H5815b74578A81806a22234k3324
$$ y = [-35480, 295828, -389899, 38869, -151268, 127321, -316290, 101870, 186667, -549303, -148198, -42501, 115604, -115415, -236530, 41559, 110501, -48255, 58340, -189041, 187990, -627120, 11085, -98796, -45938, -94444, 152491, 119254, -431586, 255509, -228310, -102634, 131441, -173733, -110418, -31256, 147934, -23973, 320954, 225616, -124888, -194809, -94688, -239206, -186839, -273947, -339584, -60657, -25557, -53941, -298190, 49535, 179520, -157371, 31330, 91274, 65367, -312665, 51692, 156619, -32675, -221333, -11390, -225969, -7187, -211312, -255928, -205986, 21978, 167044, 273009, -98551, -393226, -49103, 364961, 165847, -35803, 14540, -414154, -150366, -190934, -169142, -86679, 270399, -74952, -91612, 85815, -274578, 181806, -122234, -145558]
9718a45558O8564l3196K9386j57860C13941a67552f1601B3329e2445j60191n9132
9707b71768B35566i8425H9725L31104g3994D0469f9253K632q541D8669i960G3085
9694b1579l57215C2679R809P4884b42233j11708J46205P4480M7502L0321j69219
9683b24652B63422b10374N1371b6778k16175d9375j57776J7792P4977K806A99025
9671a79508F482c46101j53737b49109J18691N4224d097A0214e5912A81878a28447
9659h6817L0597j67700E0159a75177A50686b30632A67262I535h3441L8663k89258
9648c34036i0838d3177a4276A57806a45793j96583g7248j34096C576J83028h2978
9636I0610c5233k55629B14242I9091a69702k901b4225B6498b60950c7410k8918
$$ y = [-145558, -76994, -110190, -80804, -238664, 313941, -167552, -61601, 23329, -52445, -212636, -271768, 235566, -98425, 89725, 420829, -73994, 40469, -69253, -66621, -75162, 48669, -9960, 73085, -21579, -378794, 32679, 42488, 117372, -242233, -353941, -207736, -133256, -85754, -55433, -224652, 263422, -210374, -159003, -26778, -242953, -49375, -207151, -189359, -114382, -111576, 199025, -179508, 6482, -346101, -499838, -249109, -130418, -76194, -4097, 10214, -55912, 181878, -128447, -86817, -56220, -223920, 50159, -175177, 150686, -230632, 167262, 9535, -83441, -44778, -334036, -90838, -43177, -14276, 157806, -145793, -342376, -77248, -211344, 3576, 186604, -82978, 90610, -35233, -290862, 214242, 99091, -169702, -172603, -24225, 26498, -260950, -37410, -66328]
9625f6328f140k20322n9050A05315D4736b22678c1903m0114k26558B03049c96714
9613a34632I3703h044m86775J72032C2974O3005L10074f8863c4074k54296C2679
9601B0299f0390L0047j25066j73d1121a6081j2319p4371B10164b76287C35370
9589a51109l8485A16733f452A42166F5070b55687a20533j84974e9167l1816A82459
9577A10511B6763K16724m8545o2526E7292b2632i843k25070a1577A3331c6901
9565a49985K7892k5079k73389J30759L3863N4994R3082H0195b31745j09036J33026
9554b07755B34629d12500A36223a09822B6268b9257l6205B45775q754d66234A96052
9542D8525h1841d273k3705k48791A86237h2076B1207a66303j40194a43562A73093
$$ y = [-66328, -6140, -226462, -285512, 105315, 44736, -222678, -31903, -72017, -298575, 203049, -396714, -134632, 93703, -8044, -494819, -322787, 32974, 95979, 406053, -68863, -34074, -288370, 32679, 20299, -60390, -30343, -155409, -155582, -41121, -16081, -28400, -102771, 210164, -276287, 335370, -151109, -189594, 116733, -6452, 142166, 65070, -255687, -120533, -305507, -59167, -90983, 182459, 110511, 26763, 243487, 194942, 132416, 57292, -22632, -9843, -234913, -11577, 13331, -36901, -149985, -122093, -147172, -420561, -289802, -255939, -200945, -107863, 80195, -231745, -340781, -207755, 234629, -412500, 136223, -109822, 26268, -29257, -65462, 245775, 237021, -466234, 196052, 48525, -81841, -4273, -27978, -276769, 186237, -82076, 21207, -166303, -306497, -143562, 173093]
9530I4911a84345n0270O639A69850c74539N8428b9784j14158e1083K536j98616
9519b47163g4175B23155c22073a6271j67732M7038I9714a25697e7638j54698g135
9507b43571A4717a44477L2218m9232Q198e8402k38857C68489b48601a01347l439
9496a04786d3329D7622g7850j12418A7631M3762p826a67550n313I032i1332H5324
9483g5198l1865p9417q503D47K8226c81203a86593A6217J0472a47003j42494B15930
9470B00371d8360A80642p9251O5537J21581a75777c1849H798M5920r307i1251
9458b41695A28022a99884f0742j1144r6785A25816L0571F5933d2374A0717d963
9446d4105m5037j65986I8691a15366B49948C4385p673c01191L5096H5253g0611
$$ y = [94911, -184345, -234615, -227976, 169850, -374539, -316111, -29784, -143942, -51083, -48547, -247163, -74175, 223155, -322073, -16271, -184003, -136965, 99714, -125697, -57638, -212336, -7135, -243571, 14717, -144477, -112259, -161491, -153293, -58402, -297259, 368489, -248601, -101347, -104786, -43329, 47622, -77850, -190268, 17631, 61393, 53567, -167550, -172863, 9032, -91332, 85324, -75198, -107063, -186480, -194983, 447, 28673, -381203, -186593, 16217, 26689, -147003, -289497, 215930, 200371, -48360, 180642, 101391, 166928, 288509, -175777, -31849, 8798, 54718, 45411, -91251, -241695, 128022, -199884, -60742, -71886, -168671, 125816, 156387, 65933, -42374, 10717, -4963, -44105, -89142, -255128, 98691, -115366, 249948, 34385, 26712, -301191, -266095, 85253, -70611]
9434a15180B67787H5554J2845c9720n212n3370H4540C4449a02851B45352i1625
9422c161l31715B19177c69406G4753N8960b36054J11346I9555Q0640R9172k5632
9411B53735a31239j34179J14790H1797a01082D9609g7618B20166a93968P8069
9401a15899B2763J6739a22445k6282p363B6062a03184A55873j9407a61578G2409
9389b96620a28469B64883a71543g4208n3429B24195b49275i5781j41535H5215
9378g4553a3645j22061B24090a45580l15380A7763J17702a17836L7858B15038
9367b3165r5907l5545b623A3576J93509e8014A08374a83359m4847c3258B85231
9355a25921r663B65191A17255a14109E2934J27428F3055a97684e6495a0543j10513
$$ y = [-115180, 267787, 85554, 98399, -39720, -44932, -98302, 84540, 34449, -102851, 245352, -91625, -3161, -334876, 219177, -369406, 74753, 133713, -236054, -124708, 99555, 180195, 279367, 253735, -131239, -265418, -150628, 81797, -101082, 49609, -77618, 220166, -193968, -115899, 22763, 39502, -122445, -148727, -156090, 26062, -103184, 155873, 136466, -161578, 72409, -296620, -128469, 264883, -171543, -74208, -127637, 224195, -249275, -95781, -237316, 85215, -74553, -13645, -135706, 224090, -145580, -460960, 17763, 135465, -117836, -79978, 215038, -23165, -119072, -154617, -2623, 13576, 207085, -58014, 108374, -183359, -228206, -33258, 285231, -125921, -135584, 265191, 117255, -114109, 52934, 180362, 63055, -197684, -56495, -10543, -121056]
9344a21056K728L9503L2494j25032B4661a82040G6683d4619j16142E4277a0134
9332c7376E0025c67040C7971g4194B2812J25692B4695Q6270a19980B12305c16239
9320c12935a47533D2514a298j47207q2578f7494A47519L3119a24482q4810g9181
9308b85918D03809a84085P7524k1740e6758j18664k36105a24171q2501B75191
9297a98397j70156a30341M5722J3514B5436a00725K3828A04821l1764m181R6403
9286A65279a57768n3192h3245B41676K6680a4111E0428O9762c19404J07433a215
9274C8759a05734k29766b1302r6706B7165c82334a73588e7296j16689n6837a04844
9262a32710j32690A96042r4989A8024d1825j52442h1573L2622j23655C6221d27929
$$ y = [-121056, -118328, -78825, -46331, -171363, 24661, -182040, 76683, -44619, -160761, 54277, -10134, -37376, 50025, -367040, 37971, -74194, 22812, 148504, 24695, 110965, -119980, 212305, -316239, -312935, -147533, 42514, -1298, -148505, -231083, -67494, 147519, 180638, -124482, -209292, -79181, -285918, 403809, -184085, -106561, -128301, -56758, -175422, -411527, -124171, -206672, 275191, -198397, -368553, -130341, -84619, -71105, 25436, -100725, -76897, 104821, 73057, 68876, 165279, -157768, -210960, -83245, 241676, 268356, -14111, 50428, 120190, -319404, -211971, -1215, 38759, -105734, -335500, -21302, -118008, 27165, -382334, -173588, -57296, -173985, -230822, -104844, -132710, -265400, 196042, 101053, 18024, -41825, -194267, -81573, -48951, -172606, 36221, -427929]
9250E5230a25394j5698C6371J92685F8937b90244O3327j5095B13168d02995A37425
9238F6035a78295j90927a40626e2009A94040a40329G6796i2110j63650a14510
9227B32630c88024e7203j65840P3976o9659j734C5614a54934j27855A95464e43002
9215a63387J4448n2638H4148d285q1616j6026J2839a7203j91507i6901j90416
9204b87317p8724O1414c2058C16502c72555C06524d79484A19786c65973a18948
9193A0246N5927J08408g4568A5796O2656q498j2294J26375b40675a01939F2377
9181E1507B1023a67995P3863A49776d2580D3720b20832f5118I7106b78933A98057
9169a85603O1433k01907f3260A30632a41253G5160b86723b2911j38358A10116
$$ y = [55230, -125394, -141092, 36371, 229056, 68937, -290244, -226917, -242012, 213168, -402995, 137425, 66035, -178295, -369222, -140626, -52009, 194040, -140329, 76796, -92110, -255760, -114510, 232630, -388024, -57203, -223043, -149067, -218726, -220460, 35614, -154934, -282789, 195464, -543002, -163387, -148939, -201577, 84148, -4285, -85901, -101927, -89088, -17203, -208710, -96901, -287317, -366041, -304627, -32058, 316502, -372555, 306524, -479484, 119786, -365973, -118948, 10246, 66173, 174581, -74568, 15796, 78452, 69954, 57660, 184035, -240675, -101939, 62377, 51507, 21023, -167995, -94132, 149776, -42580, 43720, -220832, -65118, 97106, -278933, 198057, -185603, -124170, -326077, -63260, 130632, -141253, 75160, -286723, -22911, -161269, 110116]
9158a26475A26977c37087k31194C726a97978P8135A23237a83640l0438A07994
9147f0700l67825a77406A17512a14600r017k91518g5578j27773c5994k15333E3040
9135E7746c55147F9995a67600m9534j30471J65073Q9733A3195J98802a49437A56658
9123b05394r8074a19926F5994j3638J98735c22116a50599F2668a25618b3334A88047
9111f4268n7489i876C94986b26697B75516A04106a65608A16293e2052J8448A96496
9099a54315L6302k37145h9492k1790j6202l7716j4402c6252G7109a52977p5701
9088b28678d9247E4453A6702a54008M6096j46426O4683p656d2865m9495J4065
9077g8295b7199E1501a00408B61555e1375b941l4065m837B91063a61105O0034
$$ y = [-126475, 126977, -337087, -568281, 3726, -197978, -119843, 123237, -183640, -214078, 107994, -60700, -428525, -177406, 117512, -114600, -123617, -415135, -75578, -203351, -35994, -251327, 53040, 57746, -355147, 69995, -167600, -217134, -347605, -182532, -92799, 13195, 211997, -149437, 156658, -205394, -303468, -119926, 65994, 52356, 251091, -322116, -150599, 62668, -125618, -23334, 188047, -64268, -121757, -9876, 394986, -226697, 275516, 104106, -165608, 116293, -52052, -33604, 196496, -154315, -118013, -355158, -89492, -111282, -127484, -165200, -179602, -36252, 77109, -152977, -228678, -49247, 54453, 16702, -154008, -107912, -254338, -189655, -197311, -42865, -92360, -78295, -27199, 51501, -100408, 261555, -51375, -2941, -37006, -41843, 291063, -161105, -101071]
9066a01071C2581f6296A49468m2803c8730j99515h583A42718O1651c88205A52817
9054a17654B88856f1950O016j70315j35409C8555M0573a42024O9007j13093P266
9043a78844L7410A12599a1885n3677C1278K21025e5134A14000b90327A57239F068
9031a93197B02866a16133n3264A05977b85874J11109O4124m1166A05037c51973
9020g7382m4675r1546f6623k8629c1300k68177B31507k8209a9246j5680r5254
9009a30180e4281n2797a9645A23143D3568Q5569B4442J12140J73456A14332i2865
8997f9892D58J26302k1039c00747o7611E3506J92087a32883j22900p040g1513
8985a70620M6572H8176M7990b08639C3552a15471m1119K21b7464j4656F7550P2520
$$ y = [-101071, 32581, -66296, 149468, 106665, -38730, -238245, -8583, 142718, 204369, -388205, 152817, -117654, 288856, -61950, -55934, -226249, -361658, 38555, 79128, -142024, -73017, -186110, -178844, -141434, 112599, -11885, -65562, 31278, 252303, -55134, 114000, -290327, 157239, 6068, -193197, 202866, -116133, -169397, 105977, -285874, -174765, -110641, -151807, 105037, -351973, -77382, -122057, -213603, -66623, -95252, -31300, -299477, 231507, 203298, -19246, -34926, -130180, -54281, -107078, -19645, 123143, 43568, 129137, 24442, 136582, 310038, 114332, -92865, -69892, 458, 126760, 105721, -300747, -368358, 53506, 245593, -132883, -255783, -262823, -71513, -170620, -124048, 88176, 136166, -208639, 33552, -115471, -156590, -156369, -27464, -42120, 67550, 140070]
8973A40070B1658k396i3516c3453B37701n3684a02105B25591i9799B01832b4755
8961a67838B09724c18013i268j33443J9987C39960A1519l929c41491i6140B511
8949b69087I789d195A92066a19884n0286A65281J83052a16278K8556I093K1747
8938C0840a77209g257r2000H8253a5801m07754B98553f1533j03668J5o5502B07748
8925c42349h8371L3031k9274l33736J96185P2883F9471K12308I942J26332N8120
8914A94394e9486A00087J9074N2846P2656r2375J55037R9462N37943M76500J353723
8903B774953K987983J038739C178542j345557H06390k26333k18376j33104L5871
8894B64448M0142i581C14864B9754J8824n868g7558J7466a6684j52232j35302
$$ y = [140070, 21658, 19262, -93516, -33453, 237701, 184017, -102105, 225591, -99799, 201832, -24755, -167838, 209724, -318013, -9268, -142711, -122724, 339960, 11519, 7590, -341491, -96140, 2511, -269087, 9789, -4195, 192066, -119884, -170170, 165281, 348333, -116278, -87722, 9093, 30840, -177209, -7257, -99257, 88253, -15801, -423555, 298553, -61533, -165201, -165186, -230688, 207748, -342349, -88371, -55340, -84614, -418350, -222165, -149282, 69471, 281779, 9942, 136274, 194394, -59486, 100087, 119161, 172007, 244663, 152288, 307325, 406787, 944730, 1421230, 2774953, 5762936, 6801675, 3178542, 1832985, 806390, 580057, 361681, 228577, 264448, 304590, -9581, 314864, 29754, 48578, 42710, -77558, -60092, -16684, -168916, -304218]
8883c04218J10909m1811J07899n4700Q9756F5212a05144M6984j20950C769K55579
8872B59348d2534p6564A21514E3322b13211H8349J26439a71460f0436E758b60450
8860d18853a05289N55F4856g2111k2537A96390F0355h8235L392j35846A22422
8848a06319r9513h6984k61599A24114Q7243b01389Q7913j43020A57286E7582j4797
$$ y = [-304218, -193309, -235120, -127221, -181921, -92165, 65212, -105144, -58160, -179110, 3769, 259348, -42534, -119098, 121514, 53322, -213211, 88349, 214788, -171460, -60436, 5758, -260450, -418853, -105289, -104734, 64856, -72111, -94648, 196390, 60355, -88235, -84843, -220689, 122422, -106319, -205832, -86984, -348583, 124114, 211357, -201389, -113476, -256496, 157286, 57582, 42785]
$$ [...]
##END NTUPLES=NMR SPECTRUM
##END=
