
##TITLE=AC1188_Casanare-tamara3_5891106_5QFzoaXt77
##JCAMPDX= 6.0         $$ Bruker NMR JCAMP-DX V2.0
##DATA TYPE= NMR SPECTRUM
##DATA CLASS= NTUPLES
##ORIGIN= BRUKER
##OWNER= Administrator
$$ 1.72 TOPSPIN		Version 2.1
$$ 2012-04-02 21:03:21.515 -0500  Administrator@TOPSPIN
$$ Compression mode = diff/dup
##.OBSERVE FREQUENCY= 400.13188235
##.OBSERVE NUCLEUS= ^1H
##.ACQUISITION MODE= SIMULTANEOUS (DQD)
##.ACQUISITION SCHEME= undefined
##.AVERAGES= 64
##.DIGITISER RES= 22
##SPECTROMETER/DATA SYSTEM= spect
##.PULSE SEQUENCE= noesygpps1d.comp
##.SOLVENT NAME= COFFEE_meoh
##.SHIFT REFERENCE= INTERNAL, COFFEE_meoh, 1, 14.96871
##AUDIT TRAIL= $$ (NUMBER, WHEN, WHO, WHERE, PROCESS, VERSION, WHAT)
$$ ##TITLE= Audit trail, TOPSPIN		Version 2.1
$$ ##JCAMPDX= 5.01
$$ ##ORIGIN= Bruker BioSpin GmbH
$$ ##OWNER= Administrator
$$ $$ C:\Bruker\TOPSPIN/data/COFFEE/nmr/AC1188_Casanare-tamara3_5891106_5QFzoaXt77/12/pdata/1/auditp.txt
$$ ##AUDIT TRAIL=  $$ (NUMBER, WHEN, WHO, WHERE, PROCESS, VERSION, WHAT)
(   1,<2012-04-02 21:03:15.843 -0500>,<Administrator>,<TOPSPIN>,<go>,<TOPSPIN 2.1>,
      <created by zg
	started at 2012-04-02 20:51:43.812 -0500,
	POWCHK enabled, PULCHK disabled,
       configuration hash MD5:
       1A 1E CE 29 27 FD 77 03 67 4E F0 E3 C4 B2 CB 90
       data hash MD5: 64K
       C3 BF 89 E2 C3 C3 BC 6E 0A CD 46 46 94 14 A3 53>)
(   2,<2012-04-02 21:03:19.062 -0500>,<Administrator>,<TOPSPIN>,<proc1d>,<TOPSPIN 2.1>,
      <Start of raw data processing
       efp LB = 0.3 FT_mod = 6 PKNL = 1 PHC0 = 0 PHC1 = 0 SI = 128K 
       data hash MD5: 128K
       5F 9E 82 26 1C 6C 49 E0 A1 12 88 65 00 63 65 34>)
(   3,<2012-04-02 21:03:20.500 -0500>,<Administrator>,<TOPSPIN>,<proc1d>,<TOPSPIN 2.1>,
      <pk PHC0 = 35.64514 PHC1 = 0 
       data hash MD5: 128K
       97 E0 8D 28 2D A6 88 89 B2 28 14 A1 1C 00 CC 9D>)
(   4,<2012-04-02 21:03:21.125 -0500>,<Administrator>,<TOPSPIN>,<proc1d>,<TOPSPIN 2.1>,
      <abs ABSG = 1 
       data hash MD5: 128K
       DA 9F 2E 3E 38 12 BA 20 DB A3 1F 6F 3D 01 F2 53>)
(   5,<2012-04-02 21:03:21.218 -0500>,<Administrator>,<TOPSPIN>,<proc1d>,<TOPSPIN 2.1>,
      <abs ABSG = 2 
       data hash MD5: 128K
       A4 1D 25 36 44 8C 6F A0 81 C9 5F E3 03 45 5A 71>)
(   6,<2012-04-02 21:03:21.281 -0500>,<Administrator>,<TOPSPIN>,<proc1d>,<TOPSPIN 2.1>,
      <abs ABSG = 3 
       data hash MD5: 128K
       13 3B 4F 81 4C D8 A7 AC D7 C5 D8 6D 76 9E C4 88>)
(   7,<2012-04-02 21:03:21.359 -0500>,<Administrator>,<TOPSPIN>,<proc1d>,<TOPSPIN 2.1>,
      <abs ABSG = 4 
       data hash MD5: 128K
       37 72 B7 96 29 68 48 A1 37 B3 3A AE EF 05 65 67>)
(   8,<2012-04-02 21:03:21.421 -0500>,<Administrator>,<TOPSPIN>,<proc1d>,<TOPSPIN 2.1>,
      <abs ABSG = 5 
       data hash MD5: 128K
       46 00 DF 8D D5 E5 60 95 D3 3C AE 04 C0 9F D6 98>)
$$ ##END=
$$ 
$$ $$ hash MD5
$$ $$ 07 2A 44 B8 DD C2 DF 4A 84 9A 0A 5D 98 96 53 67
##$RELAX= 
##$RELAX= 
##$RELAX= 
##$RELAX= 
##$RELAX= 
##$RELAX= 
##$RELAX= 
##$RELAX= 
$$ [...]
150 150 150 150 150 150 150 150
##$TP07= 0
##$TPNAME0= <>
##$TPNAME1= <>
##$TPNAME2= <>
##$TPNAME3= <>
##$TPNAME4= <>
##$TPNAME5= <>
##$TPNAME6= <>
##$TPNAME7= <>
##$TPOAL= (0..7)
0.5 0.5 0.5 0.5 0.5 0.5 0.5 0.5
##$TPOFFS= (0..7)
0 0 0 0 0 0 0 0
##$TUNHIN= 0
##$TUNHOUT= 0
##$TUNXOUT= 0
##$USERA1= <user>
##$USERA2= <user>
##$USERA3= <user>
##$USERA4= <user>
##$USERA5= <user>
##$V9= 5
##$VALIST= <valist>
##$VCLIST= <CCCCCCCCCCCCCCC>
##$VD= 0
##$VDLIST= <DDDDDDDDDDDDDDD>
##$VPLIST= <PPPPPPPPPPPPPPP>
##$VTLIST= <TTTTTTTTTTTTTTT>
##$WBST= 2048
##$WBSW= 25
##$XGAIN= (0..3)
0 0 0 0
##$XL= 0
##$YL= 0
##$YMAX_a= 17552759
##$YMIN_a= -8045420
##$ZGOPTNS= <>
##$ZL1= 120
##$ZL2= 120
##$ZL3= 120
##$ZL4= 120
##$ABSF1= 14.96871
##$ABSF2= -5.58382
##$ABSG= 5
##$ABSL= 3
##$ALPHA= 0
##$AQORDER= 0
##$ASSFAC= 0
##$ASSFACI= 0
##$ASSFACX= 0
##$ASSWID= 0
##$AUNMP= <proc_prof1d_extract.lims>
##$AXLEFT= 0
##$AXNAME= <>
##$AXNUC= <1H>
##$AXRIGHT= 0
##$AXTYPE= 0
##$AXUNIT= <>
##$AZFE= 0.1
##$AZFW= 0.1
##$BCFW= 0
##$BC_mod= 0
##$BYTORDP= 0
##$COROFFS= 0
##$CY= 15
##$DATMOD= 1
##$DC= 0
##$DFILT= <>
##$DTYPP= 0
##$F1P= 0
##$F2P= 0
##$FCOR= 0.5
##$FTSIZE= 131072
##$FT_mod= 6
##$GAMMA= 0
##$GB= 0
##$INTBC= 1
##$INTSCL= 1
##$ISEN= 128
##$LB= 0.3
##$LEV0= 0
##$LPBIN= 0
##$MAXI= 10000
##$MC2= 0
##$MEAN= 0
##$ME_mod= 0
##$MI= 0
##$NCOEF= 0
##$NC_proc= -2
##$NLEV= 6
##$NOISF1= 0
##$NOISF2= 0
##$NSP= 0
##$NTH_PI= 0
##$NZP= 0
##$OFFSET= 14.96871
##$PC= 1
##$PHC0= 35.64514
##$PHC1= 0
##$PH_mod= 1
##$PKNL= yes
##$PPARMOD= 0
##$PPDIAG= 0
##$PPIPTYP= 0
##$PPMPNUM= 2147483647
##$PPRESOL= 1
##$PSCAL= 4
##$PSIGN= 0
##$PYNMP= <proc.py>
##$REVERSE= no
##$SF= 400.1300047631
##$SI= 131072
##$SIGF1= 0
##$SIGF2= 0
##$SINO= 400
##$SIOLD= 131072
##$SPECTYP= <>
##$SREGLST= <1H.CDCl3>
##$SSB= 0
##$STSI= 131072
##$STSR= 0
##$SW_p= 8223.68421052632
##$SYMM= 0
##$S_DEV= 0
##$TDeff= 65536
##$TDoff= 0
##$TI= <>
##$TILT= no
##$TM1= 0
##$TM2= 0
##$TOPLEV= 0
##$USERP1= <user>
##$USERP2= <user>
##$USERP3= <user>
##$USERP4= <user>
##$USERP5= <user>
##$WDW= 1
##$XDIM= 131072
##$YMAX_p= 342372277
##$YMIN_p= -11608
##$CURPLOT= <Network HP LaserJet P1505>
##$CURPRIN= <$Network HP LaserJet P1505>
##$DFORMAT= <normdp>
##$LAYOUT= <+/1D_H.xwp>
##$LFORMAT= <normlp>
##$PFORMAT= <normpl>
##$SURQMSG= 1
$$ End of Bruker specific parameters
$$ ---------------------------------
##NTUPLES= NMR SPECTRUM
##VAR_NAME=  FREQUENCY,     SPECTRUM/REAL,   SPECTRUM/IMAG
##SYMBOL=    X,             R,               I
##VAR_TYPE=  INDEPENDENT,   DEPENDENT,       DEPENDENT
##VAR_FORM=  AFFN,          ASDF,            ASDF
##VAR_DIM=   131072,        131072,          131072
##UNITS=     HZ,            ARBITRARY UNITS, ARBITRARY UNITS
##FACTOR=    0.0627417313425165, 1,          1
##FIRST=     8223.62146879498, 94,           -57497
##LAST=      0,             2681,            -57784
##MIN=       0,             -11608,          0
##MAX=       8223.62146879498, 342372277,    0
$$ Real data points
##PAGE= N=1
##DATA TABLE= (X++(R..R)), XYDATA
$$ [...]
60899B3165751L76184J05000k4096l2763M6997J59820K12555J08143j86161o05336
60889B3326094j027745j352391j542741j614266j599795j529566j428249j313976
60881A1917365j196072j077536r60850q49827p47179o53641n69956m97498m36543
60872D928263l85639l43053l07482k77199k50023k24811k02042j82363j65373
60863B590278j50175j36334j23888j12887j03422r5657q9466q4263p9479p5008
60853A539699p1032o7484o3876n9648n4725m9713m5434m2108l9150l5864l2234
60842I78431k8913k6619k5505k4957k3974k1992j9400j6968j4919j2932j0981
60831G51271r496q569p700o580n567m957m452l731l078k862k816k492k020j813
$$ plain form
60899 23165751 23541935 23646935 23622839 23590076 23637073 23796893 24009448 24117591 23931430 23326094
60889 23326094 22298349 20945958 19403217 17788951 16189156 14659590 13231341 11917365
60881 11917365 10721293 9643757 8682907 7833080 7085901 6432260 5862304 5364806 4928263
60872 4928263 4542624 4199571 3892089 3614890 3364867 3140056 2938014 2755651 2590278
60863 2590278 2440103 2303769 2179881 2066994 1963572 1867915 1778449 1694186 1614707 1539699
60853 1539699 1468667 1401183 1337307 1277659 1222934 1173221 1127787 1085679 1046529 1010665 978431
60842 978431 949518 922899 897394 872437 848463 826471 807071 790103 775184 762252 751271
60831 751271 741775 733206 725506 718926 713359 708402 703950 700219 697141 694279 691463 688971 686951 685138
60817F85138j790j479q11j51K60M89N27K61k74r85j967l229m292m620m408m325
60801F58344m470m132k874j355o82j199k220k771k344j062N21J757K305K361K470
60786F44649L006L891M831N781O951Q276R196R216Q651Q406Q918R636R717Q964
60772G50089P849O885O304O145O266O267N897N518N774O599O988O126M463L171
60758H34341K666K250J265pq92j272j492j672j815k296l587n383o715p086o955
60743H01350o905p016p285q042r374j0622j1039j0650j0012r472r102q971q908
60730F83952q253o489m048j921o26j7J71J09N9K14M47P51J565L133M810N817O440
60713F86114P587R269J0477J0699J0595J0838J1145J0937J0236R432Q639P831
$$ plain form
60817 685138 683348 681869 681058 680907 681167 681656 682183 682444 682170 681185 679218 675989 671697 667077 662669 658344
60801 658344 653874 649742 646868 645513 644831 643632 641412 638641 636297 635235 635756 637513 639818 642179 644649
60786 644649 647655 651546 656377 662158 669109 677385 686581 695797 704448 712854 721772 731408 741125 750089
60772 750089 757938 764823 771127 777272 783538 789805 795702 801220 806994 813593 820581 826707 831170 834341
60758 834341 837007 839257 840522 840515 839623 838351 836859 835187 833372 831076 827489 822106 815391 808305 801350
60743 801350 794445 787429 780144 772102 762728 752106 741067 730417 720405 710933 701831 692860 683952
60730 683952 675699 669210 665162 663241 662615 662598 662769 662878 662937 663151 663598 664349 665914 669047 673857 679674 686114
60713 686114 693701 702970 713447 724146 734741 745579 756724 767661 777897 787329 795968 803799
60701H03799P169O812O564O065N148L948K916K675L403M346M478L753L099L083
60687H67258L272L177L056L293L598L401K597J402j42j963l533m242m159m049
60673H72966m605n908p435q413q376p609o961p007p541p964p944p541o947o298
60659G72417n597m780l884l076k358j433k99L05l20j715k642k645k425k515k498
60644G36535j990j571j997k983l516l094k083j120n92n66p12m95K34J004J315
60629G18369J235J021N76k95j351k180k791l537m531n572o585p659q753r625j0114
60614F58208j0201r868r107q066o967n923n005m313l882l557l160k701k317k073
60600E81068j880j569j047n22m05p94j196j072n68k86l73m00n3N50J288K165K910
$$ plain form
60701 803799 810968 817780 824344 830409 835557 839505 842421 845096 848499 852845 857323 861076 864175 867258
60687 867258 870530 873707 876763 880056 883654 887055 889652 891054 890912 888949 885416 881174 877015 872966
60673 872966 868361 862453 855018 846605 838229 830620 823659 816652 809111 801147 793203 785662 778715 772417
60659 772417 766820 762040 758156 755080 752722 751289 750990 751295 750975 749260 746618 743973 741548 739033 736535
60644 736535 734545 732974 730977 727994 724478 721384 719301 718181 717589 717023 716311 715816 716050 717054 718369
60629 718369 719604 720625 721201 720906 719555 717375 714584 711047 706516 700944 694359 686700 677947 668322 658208
60614 658208 648007 638139 629032 620966 613999 608076 603071 598758 594876 591319 588159 585458 583141 581068
60600 581068 579188 577619 576572 576050 575645 574851 573655 572583 572015 571729 571356 570956 570903 571453 572741 574906 577816
60583E77816L056K622K113J742J258P51P56J278J540J248J271K384M002N015N382
60568F12234N897O786P435P512P480P890Q780R913J1114J2169J2819J3044J3119
60555G36192J3318J3607J3664J3180J2238J1344J0817J0155Q520N943L552K333
60543H54863K098J927J092o57l113n475o804p133p501q509r435r399q717q261
60529G84976q026p360o224n253m693m220l690l262k841k269j992k679m078n084
60515G23305n083m487l813l047k161j453r94l78O22J625K285K863L709M575M950
60500G22518M833M783N233O017O574O530O114O027O678P675Q300Q457Q746R580
60486H18065J0636J1452J2107J3028J4275J5511J6650J8169K0583K3741K6932
$$ plain form
60583 577816 580872 583494 585607 587349 588607 589358 590114 591392 592932 594180 595451 597835 601837 606852 612234
60568 612234 618131 624917 632352 639864 647344 655234 664014 673927 685041 697210 710029 723073 736192
60555 736192 749510 763117 776781 789961 802199 813543 824360 834515 843035 848978 852530 854863
60543 854863 856961 858888 859980 859323 856210 850735 843931 836798 829297 820788 811353 801954 793237 784976
60529 784976 776950 769590 763366 758113 753420 749200 745510 742248 739407 737138 735146 732467 728389 723305
60515 723305 718222 713735 709922 706875 704714 703261 702267 701889 702511 704136 706421 709284 712993 717568 722518
60500 722518 727351 732134 737367 743384 749958 756488 762602 768629 775307 782982 791282 799739 808485 818065
60486 818065 828701 840153 852260 865288 879563 895074 911724 929893 950476 974217 1001149
60475A001149K9631L1846L3551L4124L2782K9436K4659J8857J2060M575k782r330
60463A240558j4810j8770k0491k0018j8574j7194j5451j2379q181m033m54L043
60451A093246O663R799J2034J3778J5464J6895J7930J9247K1708K5242K8971L2352
60439A313329L5743L9825M4903N0937N7983O6206P5412Q4972R4515J04504J15608
60428B083937J27473J38748J48573J57509J66671J76518J86954J97768K07699
60419C591850K13223K09410J92604J62040J19154O6395P119n4163j12319j62635
60409D232678k01608k27521k40844k43837k39326k29633k16386k00821j84005
60400B248697j67019j51052j36924j24408j12421j00291q8607p8483p0140o2708
$$ plain form
60475 1001149 1030780 1062626 1096177 1130301 1163083 1192519 1217178 1236035 1248095 1252670 1249888 1240558
60463 1240558 1225748 1206978 1186487 1166469 1147895 1130701 1115250 1102871 1094690 1090657 1090203 1093246
60451 1093246 1099909 1109708 1121742 1135520 1150984 1167879 1185809 1205056 1226764 1252006 1280977 1313329
60439 1313329 1349072 1388897 1433800 1484737 1542720 1608926 1684338 1769310 1863825 1968329 2083937
60428 2083937 2211410 2350158 2498731 2656240 2822911 2999429 3186383 3384151 3591850
60419 3591850 3805073 4014483 4207087 4369127 4488281 4554676 4561795 4507632 4395313 4232678
60409 4232678 4031070 3803549 3562705 3318868 3079542 2849909 2633523 2432702 2248697
60400 2248697 2081678 1930626 1793702 1669294 1556873 1456582 1367975 1289492 1219352 1156644
60390A156644n5454m8691m3220l9094l5497l1894k8753k6757k5589k4185k2115
60379G75395k0060j8710j7868j6964j5935j4989j3986j2634j1061r629q322o857
60367F08380n344m256l814l801l914l921l535k618j467n37Q8N75Q53P44N41Q17
60351E78791J633K364K445J964J442J308J682K347K881L093L193L350L327K925
60337F12745K562K785L374L596L324L229L725M344M400L760K745J723J066R80
60323F54358J130Q40k5p59p79m85o73j359j788j529j036r09j037q29j52M46N09
60306F45923L37N56J246J895K172K306K619L068L439L631L649L585L752M374N077
60291F87629N185M737M639N352O174O358O264O654P265P091N888M466L514K905
$$ plain form
60390 1156644 1101190 1052499 1009279 970185 934688 902794 874041 847284 821695 797510 775395
60379 775395 755335 736625 718757 701793 685858 670869 656883 644249 633188 623559 615237 608380
60367 608380 603036 598780 594966 591165 587251 583330 579795 577177 575710 575173 575261 575836 576689 577433 577974 578791
60351 578791 580424 582788 585233 587197 588639 589947 591629 593976 596857 599950 603143 606493 609820 612745
60337 612745 615307 618092 621466 625062 628386 631615 635340 639684 644084 647844 650589 652312 653378 654358
60323 654358 655488 656328 656303 655544 654765 654280 653607 652248 650460 648931 647895 646986 645949 645120 644968 645414 645923
60306 645923 646260 646816 648062 649957 652129 654435 657054 660122 663561 667192 670841 674426 678178 682552 687629
60291 687629 692814 697551 702190 707542 713716 720074 726338 732992 740257 747348 753236 757702 761216 764121
60277G64121K396K146K290K427J981Q22n70j451j356m63O36J603K524L318L571
60262G83995L281L151L550L727K871J412M46J50k35j072j909k389k585k423j697
60247G90273p80m65r08j466j741j999k458k862k967k760k111r02L83J003R90J104
60231G72334J637K126K384K810L402L435K655J885J908K520L270M319N878P314
60217H17877P717P064O287O374P715R890J1775J2380J2009J2177J3863J6374J8420
60204I59922J9795K1276K3247K5196K6614K7731K9223L1517L4499L7743M0995
60193A277758M4421M8277N2455N6584O0690O5212P0301P5449Q0023Q3904Q7324
60182B002398R0515R3604R6437R8277R8100R5568R1473Q6828Q1717P5362O7221
$$ plain form
60277 764121 766517 768663 770953 773380 775361 776183 775613 774162 772806 772343 772979 774582 777106 780424 783995
60262 783995 787276 790427 793977 797704 800575 801987 802433 802583 802348 801276 799367 796978 794393 791970 790273
60247 790273 789493 789028 788120 786654 784913 782914 780456 777594 774627 771867 769756 768854 769237 770240 771230 772334
60231 772334 773971 776097 778481 781291 784693 788128 790783 792668 794576 797096 800366 804685 810563 817877
60217 817877 825594 832658 838945 845319 853034 862924 874699 887079 899088 911265 925128 941502 959922
60204 959922 979717 1000993 1024240 1049436 1076050 1103781 1133004 1164521 1199020 1236763 1277758
60193 1277758 1322179 1370456 1422911 1479495 1540185 1605397 1675698 1751147 1831170 1915074 2002398
60182 2002398 2092913 2186517 2282954 2381231 2479331 2574899 2666372 2753200 2834917 2910279 2977500
60171B977500N7665M7578L7496K7352J7154P606l56o732j2532j8265k2888k4896
60159C086682k4114k1621j8262j4009q732k612M289J2138K0838L0033L9597M9457
60147C153684N8942O7117P3904Q0089Q6005R0922R3854R4257R1899Q6821P9664
60136D057158P1260O1718N0616L8124K5066J1831j789j5505k8337l9778n0132
60125D180232n9199o5724o8763o8765o6711o3039n7861n1414m3602l3951k2625
60114C578578j0789N82J1508K2149L2062M0849M8724N5644O0746O3285O3433O1489
60102D028260N7269N0967M3741L6476K8836K0497J2450N910O96m058q016r724
60090D263304q242l729L330J2404K2734L3910M6426O0855P6634R2603J08522J25105
$$ plain form
60171 2977500 3035165 3082743 3120239 3147591 3164745 3172351 3171995 3165263 3152731 3134466 3111578 3086682
60159 3086682 3062568 3040947 3022685 3008676 2999944 2997332 3001621 3013759 3034597 3064630 3104227 3153684
60147 3153684 3212626 3279743 3353647 3433736 3519741 3610663 3704517 3798774 3890673 3977494 4057158
60136 4057158 4128418 4190136 4240752 4278876 4303942 4315773 4313984 4298479 4270142 4230364 4180232
60125 4180232 4121033 4055309 3986546 3917781 3851070 3788031 3730170 3678756 3635154 3601203 3578578
60114 3578578 3567789 3568371 3579879 3602028 3634090 3674939 3723663 3779307 3840053 3903338 3966771 4028260
60102 4028260 4085529 4136496 4180237 4216713 4245549 4266046 4278496 4284406 4285102 4281044 4273028 4263304
60090 4263304 4255062 4251333 4254663 4267067 4289801 4323711 4370137 4430992 4507626 4600229 4708751 4833856
60078D833856J42703J60890J79329J98167K17439K36679K55168K72088K86636
60069F782955K98431L07600L13963L16419L13721L05520K92132K73676K50075
60060I454492K21463J88064J50199J09021O6619K4472j7625o0194j02155j41285
60050I893071j76135k06297k31119k49400k60406k64248k61317k52279k38471
60041G753399k21280k01187j78273j53476j28255j03116p7668n2086k7337l938
60031F606783J8165L8183N4282O5343P1825P4276P2075O4548N2561L7909K1608
60020G177558L702j5424l4492n2234o8259q2839r6251j08634j20198j30912j39898
60009F332119j45749j48000j47940j47111j45164j40243j31668j21085j10368
$$ plain form
60078 4833856 4976559 5137449 5316778 5514945 5732384 5969063 6224231 6496319 6782955
60069 6782955 7081386 7388986 7702949 8019368 8333089 8638609 8930741 9204417 9454492
60060 9454492 9675955 9864019 10014218 10123239 10189858 10214330 10196705 10136511 10034356 9893071
60050 9893071 9716936 9510639 9279520 9030120 8769714 8505466 8244149 7991870 7753399
60041 7753399 7532119 7330932 7152659 6999183 6870928 6767812 6690144 6638058 6610721 6606783
60031 6606783 6624948 6663131 6717413 6782756 6854581 6928857 7000932 7065480 7118041 7155950 7177558
60020 7177558 7181260 7165836 7131344 7079110 7010851 6928012 6831761 6723127 6602929 6472017 6332119
60009 6332119 6186370 6038370 5890430 5743319 5598155 5457912 5326244 5205159 5094791
60000E094791r9504q7504p4402o1004m7223l2226j6129k59J4459K8321M1864N4957
59988D816141O7108P7844Q6483R2193R4558R3672Q9613Q2351P2180N9736M5527
59977E677406K9807J2875m915k3244m1469n8481p3419q6244r7064j05330j10405
59966E119517j12454j11972j08782j02578r4094q4612p4502o3281n0958l8173
59956D278111k5066j1240L049J6975L0608M5027O0517P5756Q9389J01449J12635
59945D777210J22927J31490J37325J39582J37760J32023J22849J10331R4404P5810
59935E981711N5950L5604J4586p041k8267m7980o5677q0976r3243j02081j07553
59924E555033j09571j07906j03022r6041q7444p6733o3883n0129l6667k3414r806
$$ plain form
60000 5094791 4995287 4907783 4833381 4772377 4725154 4692928 4676799 4676540 4690999 4719320 4761184 4816141
59988 4816141 4883249 4961093 5047576 5139769 5234327 5327999 5417612 5499963 5572143 5631879 5677406
59977 5677406 5707213 5720088 5715173 5691929 5650460 5591979 5518560 5432316 5335252 5229922 5119517
59966 5119517 5007063 4895091 4786309 4683731 4589637 4505025 4430523 4367242 4316284 4278111
59956 4278111 4253045 4241805 4244854 4261829 4292437 4337464 4397981 4473737 4563126 4664575 4777210
59945 4777210 4900137 5031627 5168952 5308534 5446294 5578317 5701166 5811497 5905901 5981711
59935 5981711 6037661 6073265 6087851 6080810 6052543 6004563 5938886 5857910 5764667 5662586 5555033
59924 5555033 5445462 5337556 5234534 5138493 5051049 4974316 4910433 4860304 4823637 4800223 4790417
59913D790417L973J7429L0652M3748N5922O6193P4711Q2276Q8731R2868R4086
59902E441006R3165R1039Q7564Q2027P4537O6306N8679N2191M6644M1846L8032
59891F173036L5769L5687L8333M3937N2251O2903P6039R2165J11150J31919J53547
59880G006736J76115J99911K24296K48067K70460K90834L07680L19018L23672
59871I366789L21065L09821K87787K53794K08600J54044R2342K6485l9855j03491
59861A0877381j62218k13918k56202k87578l08210l19037l20892l14967l03168
59852H391191k87170k67613k44796k19602j93060j65611j37541j09531q2064n4762
59842F629441k7263m38K4180M6034O5765Q3725R9044J10317J16654J17737J13264
$$ plain form
59913 4790417 4794390 4811819 4842471 4886219 4942141 5008334 5083045 5165321 5254052 5346920 5441006
59902 5441006 5534171 5625210 5712774 5794801 5869338 5935644 5994323 6046514 6093158 6135004 6173036
59891 6173036 6208805 6244492 6282825 6326762 6379013 6441916 6517955 6610120 6721270 6853189 7006736
59880 7006736 7182851 7382762 7607058 7855125 8125585 8416419 8724099 9043117 9366789
59871 9366789 9687854 9997675 10285462 10539256 10747856 10901900 10994242 11020727 10980872 10877381
59861 10877381 10715163 10501245 10245043 9957465 9649255 9330218 9009326 8694359 8391191
59852 8391191 8104021 7836408 7591612 7372010 7178950 7013339 6875798 6766267 6684203 6629441
59842 6629441 6602178 6601740 6625920 6671954 6737719 6821444 6920488 7030805 7147459 7265196 7378460
59831G378460J02752Q5807O2425L3110j133l8740p7595j15384j50214j80918k06646
59820F891924k26534k40124k47905k50855k49576k44311k35749k25022k12801
59811D759047j99033j83763j67758j52029j37191j23371j10366r7750q5272p3331
59801C429183o2706n3807m6582m1023l7118l4308l1843k9819k9091k9765l0578
59790C002543l0150k8331k5793k2892j9509j5794j2459j0383j0103j1553j4138
59779B801438j7235k0688k4584k8615l2060l4386l5517l5508l4418l2498l0021
59768B475908k6964k3156j8708j3847q516k660L267Q710J3743J8846K4154K9607
59756B480384L5453M1754M7568N1626N3730N4637N4805N4308N3714N3599N3189
$$ plain form
59831 7378460 7481212 7567019 7629444 7662554 7661421 7622681 7545086 7429702 7279488 7098570 6891924
59820 6891924 6665390 6425266 6177361 5926506 5676930 5432619 5196870 4971848 4759047
59811 4759047 4560014 4376251 4208493 4056464 3919273 3795902 3685536 3587786 3502514 3429183
59801 3429183 3366477 3312670 3266088 3225065 3187947 3153639 3121796 3091977 3062886 3033121 3002543
59790 3002543 2972393 2944062 2918269 2895377 2875868 2860074 2847615 2837232 2827129 2815576 2801438
59779 2801438 2784203 2763515 2738931 2710316 2678256 2643870 2608353 2572845 2538427 2505929 2475908
59768 2475908 2448944 2425788 2407080 2393233 2384717 2382057 2385324 2394034 2407777 2426623 2450777 2480384
59756 2480384 2515837 2557591 2605159 2656785 2710515 2765152 2819957 2874265 2927979 2981578 3034767
59745C034767N0871M6312M0776L5118K8977K2323J6358J2144R591Q481R312J2248
59733C327278J6412K1085K6755L4228M3577N4583O7175Q0758R4233J07583J22322
59722C995989J39469J58045J76615J95237K14706K34701K53967K71518K86077
59713E926324K94545K92300K75247K41286J90727J26765N5528j5397p9140j30811
59703G177374j67921j90730k01694k03536j97853j85692j68741j49035j28010
59694E584162j06524q5350o4925m5019k5343o132J2369L0378M8044O5056Q1461
59683E488177R8125J15630J33385J50634J67807J86046K05867K26970K48900K71250
59673G292791K93851L17308L42719L70171L98433M26604M55149M84386N13048
$$ plain form
59745 3034767 3085638 3131950 3172726 3207844 3236821 3259144 3275502 3287646 3297237 3305718 3315030 3327278
59733 3327278 3343690 3364775 3391530 3425758 3469335 3523918 3591093 3671851 3766084 3873667 3995989
59722 3995989 4135458 4293503 4470118 4665355 4880061 5114762 5368729 5640247 5926324
59713 5926324 6220869 6513169 6788416 7029702 7220429 7347194 7402722 7387325 7308185 7177374
59703 7177374 7009453 6818723 6617029 6413493 6215640 6029948 5861207 5712172 5584162
59694 5584162 5477638 5392288 5327363 5282344 5257001 5250869 5263238 5293616 5341660 5406716 5488177
59683 5488177 5586302 5701932 5835317 5985951 6153758 6339804 6545671 6772641 7021541 7292791
59673 7292791 7586642 7903950 8246669 8616840 9015273 9441877 9897026 10381412 10894460
59664A0894460N39411N62825N82840N97697O05221O04732N96921N82491N62380
59655A6128978N38926N15390M94469M78161M68386M66262M70965M80469M93154
59646B0535160N07571N21185N30734N33583N27520N09657M77225M29691L69088
59637B4941414K98422K20900J40520O2009j0214p2439j21556j55687j74839j79950
59627B4948580j71534j50138j17426p5502k5461L2088R5575J63045K33746L07492
59617B5240465L82665M56503N27142N93401O52292O98556P27031P33765P14454
59608C0726274O63907N78439M57986L05737J27437o7798k67458m58218o29000
59599C1437306p72080q82956r60374j005911j022673j014540r86562r44806q95031
$$ plain form
59664 10894460 11433871 11996696 12579536 13177233 13782454 14387186 14984107 15566598 16128978
59655 16128978 16667904 17183294 17677763 18155924 18624310 19090572 19561537 20042006 20535160
59646 20535160 21042731 21563916 22094650 22628233 23155753 23665410 24142635 24572326 24941414
59637 24941414 25239836 25460736 25601256 25663265 25653051 25580612 25459056 25303369 25128530 24948580
59627 24948580 24777046 24626908 24509482 24433980 24408519 24440607 24536182 24699227 24932973 25240465
59617 25240465 25623130 26079633 26606775 27200176 27852468 28551024 29278055 30011820 30726274
59608 30726274 31390181 31968620 32426606 32732343 32859780 32791982 32524524 32066306 31437306
59599 31437306 30665226 29782270 28821896 27815985 26793312 25778772 24792210 23847404 22952373
59590B2952373q41970p90333p45659p13474o97535o98525p13320p35307p56565
59581A6259685p70809p74628p66805p47868p20229o87179o50735o11214n69100
59572I961118n26288m84907m45848m09028l74304l41543l10572k81625k55242
59563F531761k31285k08850j87529j68010j50956j35994j22455j10333r9895r0925
59553E025529q3146p6964p3097p1718p2344p4353p7251q0644q4223q7567q9998
59542D154224r0975r0631q9450q7511q4555q0698p6349p1500o5876n9770n3849
59531C303060m8059m1640l4480k7439k1065j4941q658k600K829P873J2785J7166
59519C144831K0502K2900K4823K6611K8576L1010L3720L6065L7806L9571M2226
$$ plain form
59590 22952373 22110403 21320070 20574411 19860937 19163402 18464877 17751557 17016250 16259685
59581 16259685 15488876 14714248 13947443 13199575 12479346 11792167 11141432 10530218 9961118
59572 9961118 9434830 8949923 8504075 8095047 7720743 7379200 7068628 6787003 6531761
59563 6531761 6300476 6091626 5904097 5736087 5585131 5449137 5326682 5216349 5116454 5025529
59553 5025529 4942383 4865419 4792322 4720604 4648260 4573907 4496656 4416012 4331789 4244222 4154224
59542 4154224 4063249 3972618 3883168 3795657 3711102 3630404 3554055 3482555 3416679 3356909 3303060
59531 3303060 3255001 3213361 3178881 3151442 3130377 3115436 3106778 3104178 3107007 3114880 3127665 3144831
59519 3144831 3165333 3188233 3213056 3239667 3268243 3299253 3332973 3369038 3406844 3446415 3488641
59508C488641M6230N1663N8242O5188P1766P8179Q5360R3708J02698J11878J21493
59497D375046J31868J42888J54409J66564J79400J92627K05986K19259K31926
59488E999973K43380K53463K62163K68794K72320K72437K69571K63933K55536
59479H361570K44984K33160K20185K05976J91670J78799J66875J53572J38053
59470A0094844J22565J09862J00483R3503Q8499Q5311Q2851P9532P4344O6402
59460A0998196N4078L5701J0861j9693n4886r3382j33454j73710k13392k51276
59450A0159043k84959l12214l32616l46989l55782l58883l56562l49588l38502
59441G122948l23585l05452k85093k63507k41626k20317j99993j80532j61861
$$ plain form
59508 3488641 3534871 3586534 3644776 3709964 3781730 3859909 3945269 4038977 4141675 4253553 4375046
59497 4375046 4506914 4649802 4804211 4970775 5150175 5342802 5548788 5768047 5999973
59488 5999973 6243353 6496816 6758979 7027773 7300093 7572530 7842101 8106034 8361570
59479 8361570 8606554 8839714 9059899 9265875 9457545 9636344 9803219 9956791 10094844
59470 10094844 10217409 10327271 10427754 10521257 10609756 10695067 10777918 10857450 10931794 10998196
59460 10998196 11052274 11087975 11098836 11079143 11024257 10930875 10797421 10623711 10410319 10159043
59450 10159043 9874084 9561870 9229254 8882265 8526483 8167600 7811038 7461450 7122948
59441 7122948 6799363 6493911 6208818 5945311 5703685 5483368 5283375 5102843 4940982
59432D940982j44188j27383j10818r4245p8265o3436m9502l5908k2460r062M486
59421D210201J8021L1104M3995N7623P2106Q6277R9451J12578J26709J41216J54633
59410E153914J66519J77266J86586J93422J97025J97074J92951J83817J69259
59401F817833J49133J23153R1413N5119J6067k4229o4376j02647j37483j68034
59391F755949j93571k13022k25973k33512k37046k36783k32405k24678k15163
59382D743796k04642j93000j80415j67595j54912j42475j30818j20408j10512
59373C339019r9779q8119p6965o7445n9229n1408m3612l5850k8092k0460j3361
59362B754699p104j676L086P421J1713J6154K0429K4248K7945L2026L6371M0667
$$ plain form
59432 4940982 4796794 4669411 4558593 4464348 4386083 4322647 4273145 4237237 4214777 4205715 4210201
59421 4210201 4228222 4259326 4303321 4360944 4433050 4519327 4618778 4731356 4858065 4999281 5153914
59410 5153914 5320433 5497699 5684285 5877707 6074732 6271806 6464757 6648574 6817833
59401 6817833 6966966 7090119 7181532 7236651 7252718 7228489 7164113 7061466 6923983 6755949
59391 6755949 6562378 6349356 6123383 5889871 5652825 5416042 5183637 4958959 4743796
59382 4743796 4539154 4346154 4165739 3998144 3843232 3700757 3569939 3449531 3339019
59373 3339019 3239240 3151121 3074156 3006711 2947482 2896074 2852462 2816612 2788520 2768060 2754699
59362 2754699 2747595 2745919 2749005 2756426 2768139 2784293 2804722 2828970 2856915 2888941 2925312 2965979
59350B965979M5354N1067N7054O1195O2205O1170O0588O2335O6835P3548Q1730
59339C649060R1003J01666J14293J28737J43726J57745J70306J82282J95128K09973
59329E143919K27387K47672K70901K96564L23425L50187L76222M01320M24767
59320H062364M45115M60752M70232M72041M64917M48863M25361L96285L62994
59311A2008924L26654K88741K50732K13628J78036J44193J11557P9007M5855J2196
59301A3659523k2124n8085r6344j35935j74616k10108k40604k64755k81928k92265
59291A1882759k96119k93929k87056k78132k69818k63573k59979k59546k62431
59282I412176k67898k74873k82709k90786k97860l02551l04202l02599k97356
$$ plain form
59350 2965979 3011333 3062400 3119454 3180649 3242854 3304024 3364612 3426947 3493782 3567330 3649060
59339 3649060 3740063 3841729 3956022 4084759 4228485 4386230 4556536 4738818 4933946 5143919
59329 5143919 5371306 5618978 5889879 6186443 6509868 6860055 7236277 7637597 8062364
59320 8062364 8507479 8968231 9438463 9910504 10375421 10824284 11249645 11645930 12008924
59311 12008924 12335578 12624319 12875051 13088679 13266715 13410908 13522465 13601472 13647327 13659523
59301 13659523 13637399 13579314 13482970 13347035 13172419 12962311 12721707 12456952 12175024 11882759
59291 11882759 11586640 11292711 11005655 10727523 10457705 10194132 9934153 9674607 9412176
59282 9412176 9144278 8869405 8586696 8295910 7998050 7695499 7391297 7088698 6791342
59273F791342k88368k76539k63242k49181k34222k18171k01191j83849j67148
59264D709431j51971j38090j24294j10004r6035q3198p1043n8881m7203l6948
59254C791764k7946j9240j0571k351N452J3320K1271K8892L6211M3604N1009N7982
59242C989397O4447P0650P6648Q2431Q8183R3684R8002J00539J01842J02563J02181
59231D970567R9812R5623R0455Q4596P8092P1715O6246O1372N6644N3002N1752
59220E779876N2437N3426N4444N6748O0670O4788O7731O9163O8660O5286N8906
59209F452135N0539M0759K9006J5084P7j4887k9667m4246n7821o9519p9005q5811
59197F206644q8890q7548q2152p3443o2050m9037l5881k3138r944M400J9069L2588
$$ plain form
59273 6791342 6502974 6226435 5963193 5714012 5479790 5261619 5060428 4876579 4709431
59264 4709431 4557460 4419370 4295076 4185072 4089037 4005839 3934796 3875915 3828712 3791764
59254 3791764 3763818 3744578 3734007 3731656 3737108 3750428 3771699 3800591 3836802 3880406 3931415 3989397
59242 3989397 4053844 4124494 4201142 4283573 4371756 4465440 4563442 4663981 4765823 4868386 4970567
59231 4970567 5070379 5166002 5256457 5341053 5419145 5490860 5557106 5618478 5675122 5728124 5779876
59220 5779876 5832313 5885739 5940183 5996931 6057601 6122389 6190120 6259283 6327943 6393229 6452135
59209 6452135 6502674 6543433 6572439 6587523 6587600 6572713 6543046 6498800 6440979 6371460 6292455 6206644
59197 6206644 6117754 6030206 5948054 5874611 5812561 5763524 5727643 5704505 5694561 5698961 5718030 5750618
59185E750618M4434N5089O5057P4458Q3114R0551R6401J01237J06400J12618J19430
59174F699407J26409J34150J43396J53915J65074J76987J90118K03859K16225
59165H209540K24940K28356K25432K15380J97468J71002J35566R1478M0006j6909
59155I722259p6891j37196j94996k47888k93966l31591l59533l77495l86155l86651
59145F929897l80293l68670l53363l35397l15340k93948k72230k50828k29913
59136D129915k09766j90895j73505j57446j42774j29749j18155j07327r7105q8060
59126B715133q0485p3864o7625o1804n6478n1223m5718m0458l6104l2435k8590
59115B140349k4278k0160j6889j4216j1289p659l740j79K992O389J0392J4581
$$ plain form
59185 5750618 5795052 5850141 5915198 5989656 6072770 6163321 6259722 6360959 6467359 6579977 6699407
59174 6699407 6825816 6959966 7103362 7257277 7422351 7599338 7789456 7993315 8209540
59165 8209540 8434480 8662836 8888268 9103648 9301116 9472118 9607684 9699162 9739168 9722259
59155 9722259 9645368 9508172 9313176 9065288 8771322 8439731 8080198 7702703 7316548 6929897
59145 6929897 6549604 6180934 5827571 5492174 5176834 4882886 4610656 4359828 4129915
59136 4129915 3920149 3729254 3555749 3398303 3255529 3125780 3007625 2900298 2803193 2715133
59126 2715133 2634648 2560784 2493159 2431355 2374877 2323654 2277936 2237478 2201374 2168939 2140349
59115 2140349 2116071 2095911 2079022 2064806 2053517 2045858 2042118 2041939 2044931 2051320 2061712 2076293
59103B076293J8230K1142K3766K6651L0064L3982L8197M2526M6972N1574N6033
59092B465430N9892O3221O6620P0366P4141P7855Q1925Q6339R0266R3271R6131
59081C325457R9536J02726J04423J04527J03791J02339R9748R6192R2145Q7170
59071D318054Q0366P2089O3888N6679N0205M4477M0381L8468L8315L9677M3175
59060D885774M9243N7214O6158P5914Q6719R8302J09874J20742J30442J38469
59050E818851J44030J45816J42175J31987J15443R3566O7122L6576L018l1478
59040F667106o4448r3579j16996j33793j44327j49479j49795j45812j38716j29917
59030E400244j20213j10095j00390r1751q3989p6951p1580o8945o8690o9725p2012
$$ plain form
59103 2076293 2094523 2115665 2139431 2166082 2196146 2230128 2268325 2310851 2357823 2409397 2465430
59092 2465430 2525322 2588543 2655163 2725529 2799670 2877525 2959450 3045789 3136055 3229326 3325457
59081 3325457 3424993 3527719 3632142 3736669 3840460 3942799 4042547 4138739 4230884 4318054
59071 4318054 4398420 4470509 4534397 4591076 4641281 4685758 4726139 4764607 4802922 4842599 4885774
59060 4885774 4935017 4992231 5058389 5134303 5221022 5319324 5429198 5549940 5680382 5818851
59050 5818851 5962881 6108697 6250872 6382859 6498302 6591868 6658990 6695566 6698584 6667106
59040 6667106 6602658 6509079 6392083 6258290 6113963 5964484 5814689 5668877 5530161 5400244
59030 5400244 5280031 5169936 5069546 4977795 4893806 4816855 4745275 4676330 4607640 4537915 4465903
59019D465903p6252q2049q8102r4106j00738j07641j13190j16648j18933j20722
59009C447522j21383j20433j18561j16372j13393j09212j04501j00031r5590r0612
58999B357434q5130p9481p3865o8683o4462o1077n7768n4302n1168m8438m5567
58988A667493m2652m0634l9659l8457l6030l2984l0463k8696k7234k5689k3680
58977A301315k0849j7545j4706j2698j1081r763r184q991p890n438k816j085Q4
58964A179353J236J981J937J733J957K089J476O00M48J168K155K894L085K696
58950A204808K405L207N004O486O908P037P653Q271Q147P564P244P301P574Q181
58936A297790Q961R297R178R587J1042J2715J3667J4073J4464J4810J5156J6107
$$ plain form
59019 4465903 4389651 4307602 4219500 4125394 4024656 3917015 3803825 3687177 3568244 3447522
59009 3447522 3326139 3205706 3087145 2970773 2857380 2748168 2643667 2543636 2448046 2357434
58999 2357434 2272304 2192823 2118958 2050275 1985813 1924736 1866968 1812666 1761498 1713060 1667493
58988 1667493 1624841 1584207 1544548 1506091 1470061 1437077 1406614 1377918 1350684 1324995 1301315
58977 1301315 1280466 1262921 1248215 1235517 1224436 1214673 1205489 1196498 1188608 1183170 1180354 1179269 1179353
58964 1179353 1180589 1182570 1184507 1186240 1188197 1190286 1191762 1192362 1192810 1193978 1196133 1199027 1202112 1204808
58950 1204808 1207213 1210420 1215424 1221910 1228818 1235855 1243508 1251779 1259926 1267490 1274734 1282035 1289609 1297790
58936 1297790 1306751 1316048 1325226 1334813 1345855 1358570 1372237 1386310 1400774 1415584 1430740 1446847
58924A446847J7735J8961J9004J8536J8591J9217K0077K1258K2632K3447K3582
58913A669887K4176K5960K8076K9584L1015L3228L5787L7843L9616M1613M3343
58902B040128M4280M5223M7178M9634N1454N2853N4860N7449N9818O2146O5445
58891B630468O9888P4715P9700Q5323R1637R8218J05164J12960J21430J29879
58881C599382J38155J46741J55978J66147J77873J91478K06227K21257K36911
58872E240149K54160K73107K93145L14300L37218L61976L87945M14780M42635
58863H319415M71477N00912N30340N58578N83686O03993O18843O27491O27725
58854A3442460O16440N91131N50037M91689M15687L23776K19327J06211j1021
$$ plain form
58924 1446847 1464582 1483543 1502547 1521083 1539674 1558891 1578968 1600226 1622858 1646305 1669887
58913 1669887 1694063 1720023 1748099 1777683 1808698 1841926 1877713 1915556 1955172 1996785 2040128
58902 2040128 2084408 2129631 2176809 2226443 2277897 2330750 2385610 2443059 2502877 2565023 2630468
58891 2630468 2700356 2775071 2854771 2940094 3031731 3129949 3235113 3348073 3469503 3599382
58881 3599382 3737537 3884278 4040256 4206403 4384276 4575754 4781981 5003238 5240149
58872 5240149 5494309 5767416 6060561 6374861 6712079 7074055 7462000 7876780 8319415
58863 8319415 8790892 9291804 9822144 10380722 10964408 11568401 12187244 12814735 13442460
58854 13442460 14058900 14650031 15200068 15691757 16107444 16431220 16650547 16756758 16745737
58845A6745737j26681k35281l33251m18481m88813n42401n79389o01959o12563
58836A2806918o12996o04822n89628n68812n43852n16569m88271m59044m28676
58827G994248l97928l68124l39929l13441k89008k66919k46769k28058k11060
58818E333012j96118j82627j69736j57607j46869j37252j27873j18482j09409
58809C987039j00706r2332q4723p8074p1548o4318n6870n0133m3880l7310l0669
58798C276476k4807j9557j4042q338l321J109O122J2204J8601K4748L1056L8045
58786C338296M5534N2989O0083O6892P4019Q2191R1269J00180J08395J16782J26230
58775D262860J36426J46929J58443J71627J85555J98904K12073K26615K43084
$$ plain form
58845 16745737 16619056 16383775 16050524 15632043 15143230 14600829 14021440 13419481 12806918
58836 12806918 12193922 11589100 10999472 10430660 9886808 9370239 8881968 8422924 7994248
58827 7994248 7596320 7228196 6888267 6574826 6285818 6018899 5772130 5544072 5333012
58818 5333012 5136894 4954267 4784531 4626924 4480055 4342803 4214930 4096448 3987039
58809 3987039 3886333 3794001 3709278 3631204 3559656 3495338 3438468 3388335 3344455 3307145 3276476
58798 3276476 3251669 3232112 3218070 3209732 3206411 3207520 3213642 3225846 3244447 3269195 3300251 3338296
58786 3338296 3383830 3436819 3496902 3563794 3637813 3720004 3811273 3911453 4019848 4136630 4262860
58775 4262860 4399286 4546215 4704658 4876285 5061840 5260744 5472817 5699432 5942516
58766E942516K60962K80240L01425L24261L48014L72860L99509M27609M55869
58757I113265M83584N10717N36599N59757N78773N92031N96939N90585N70991
58748A4133241N36736M86147M18386L34940K38734J32455J9206r5900k06805l08964
58738A5688176l99422m75359n34678n77808o06881o23246o27448o21232o07504
58729A0614598n88250n64313n37094n08526m79425m49662m19935l91602l64880
58720F310911l39135l14794k92910k72951k53292k33976k16778k02237j88987
58711C995851j76354j65312j56185j47602j38606j29889j22072j14594j07100
58702B738137j00205r3998q7434q0018p2724o6508o1244n6592n2524m8505m3775
$$ plain form
58766 5942516 6203478 6483718 6785143 7109404 7457418 7830278 8229787 8657396 9113265
58757 9113265 9596849 10107566 10644165 11203922 11782695 12374726 12971665 13562250 14133241
58748 14133241 14669977 15156124 15574510 15909450 16148184 16280639 16299845 16203945 15997140 15688176
58738 15688176 15288754 14813395 14278717 13700909 13094028 12470782 11843334 11222102 10614598
58729 10614598 10026348 9462035 8924941 8416415 7936990 7487328 7067393 6675791 6310911
58720 6310911 5971776 5656982 5364072 5091121 4837829 4603853 4387075 4184838 3995851
58711 3995851 3819497 3654185 3498000 3350398 3211792 3081903 2959831 2845237 2738137
58702 2738137 2637932 2543934 2456500 2376482 2303758 2237250 2176006 2119414 2066890 2018385 1974610
58691A974610l8854l5198l2955l0727k8001k5865k4804k3708k1921k0425j9954
58680A672198j9641j8600j7353j6636j6201j5725j5600j5946j6071j5772j5859
58669A488794j6717j7620j8134j8813j9782k0205j9980k0418k2204k4071k4646
58658A266204k4359k4432k4984k5221k4672k3403k1652j9938j8744j7784j6418
58647A024597j4965j4460j4858j4853j3795j2395j1241j0113r126q940r279q845
58635H81727p330o006n738n861n673n407n129m282l090k729l342l489k444j435
58621H19772j668k673l515m129m574m420l820l726m166l846k327r72p94r00k41
58606G78001P16J193J580K532L821N112O580P823P602N757M025L947N141O499
$$ plain form
58691 1974610 1935756 1900558 1867603 1836876 1808875 1783010 1758206 1734498 1712577 1692152 1672198
58680 1672198 1652557 1633957 1616604 1599968 1583767 1568042 1552442 1536496 1520425 1504653 1488794
58669 1488794 1472077 1454457 1436323 1417510 1397728 1377523 1357543 1337125 1314921 1290850 1266204
58658 1266204 1241845 1217413 1192429 1167208 1142536 1119133 1097481 1077543 1058799 1041015 1024597
58647 1024597 1009632 995172 980314 965461 951666 939271 928030 917917 908791 899851 890572 881727
58635 881727 874397 868391 862653 856792 851119 845712 840583 836301 833211 830482 827140 823651 821207 819772
58621 819772 818104 815431 811916 807787 803213 798793 794973 791247 787081 783235 780908 779936 779142 778242 778001
58606 778001 778717 779910 781490 784022 787843 792955 799535 807358 814960 820717 824742 828689 833830 840329
58592H40329P775R070J0185J1371J3286J5528J6786J7221J8794K2272K5770K7612
58580A035999K8725L0758L3585L6220L8666M1313M3912M6596N0497N5978O1670
58569A503919O6683P2234P9558Q7778R5505J03200J12189J22485J33189J43914
58559B520654J54408J63833J71815J78955J84975J87605J84624J75599J60433
58550D082901J37974J07848P2185L3847n664m4918q0945j11042j34935j53253
58540C903998j65332j70658j71054j68967j64550j56842j46860j37008j27967
58531B494760j18587j08559r8968r0258q1792p3468o5990n9458n3146m6855m1142
58520A656537l6289l2072k8464k5577k3222k1281k0141j9985k0243k0393k0574
$$ plain form
58592 840329 848104 857174 867359 878730 892016 907544 924330 941551 960345 982617 1008387 1035999
58580 1035999 1064724 1095482 1129067 1165287 1203953 1245266 1289178 1335774 1386271 1442249 1503919
58569 1503919 1570602 1642836 1722394 1810172 1905677 2008877 2121066 2243551 2376740 2520654
58559 2520654 2675062 2838895 3010710 3189665 3374640 3562245 3746869 3922468 4082901
58550 4082901 4220875 4328723 4400908 4434755 4429091 4384173 4303228 4192186 4057251 3903998
58540 3903998 3738666 3568008 3396954 3227987 3063437 2906595 2759735 2622727 2494760
58531 2494760 2376173 2267614 2168646 2078388 1996596 1923128 1857138 1797680 1744534 1697679 1656537
58520 1656537 1620248 1588176 1559712 1534135 1510913 1489632 1469491 1449506 1429263 1408870 1388296
58509A388296k0865k0986k1316k2869k5382k6966k6641k5642k5104k4238k2395
58498A125892k1052k1665k2999k2769k0887j8975j7578j6015j4368j3487j3348
58487I22749j3062j2322j1446j0418r142q093p611p226o604o335o712o896o306
58474H10576n698n659n409m358l370l201l074k361k083l102m273m244l680l827
58460G56237m294m198m232n492p394q655r287r737r335p551n629m950m853m029
58446F66601k953k884l500l606l207k984k697j977j610k217k777k235j336j182
58432F31436j364j289j673k805l130j728l50o76j411p26L64k8j102r38r2l50j177
58415F12961p03P30J242P56N94O52K7m61N16J950J940J118J436K496K432J649
$$ plain form
58509 1388296 1367431 1346445 1325129 1302260 1276878 1249912 1223271 1197629 1172525 1148287 1125892
58498 1125892 1104840 1083175 1060176 1037407 1016520 997545 979967 963952 949584 936097 922749
58487 922749 909687 897365 885919 875501 866359 858266 850655 843429 836825 830490 823778 816882 810576
58474 810576 804878 799219 793810 789452 786082 782881 779807 777446 775363 772261 767988 763744 760064 756237
58460 756237 751943 747745 743513 738021 730627 721972 712685 702948 693613 686062 680433 675483 670630 666601
58446 666601 663648 660764 657264 653658 650451 647467 644770 642793 641183 638966 636189 633954 632618 631436
58432 631436 630072 628783 627110 624305 621175 619447 619097 618421 617010 616284 616648 616620 615518 614580 614488 614138 612961
58415 612961 612258 612988 614230 614986 615580 616232 616259 615798 616314 618264 620204 621322 622758 625254 627686 629335
58399F29335K134L619L956K965K462K706K206R31L96N34l37k301l660m029m669
58384F36248n712n928n349n275n715n413m417l922l762k794j496j402k195k151
58370E80717j202p70r02m05M56L37m12j72R94J685J994L098M459M484L582L531
58354F01474M297M438M186M889N987N800M875N176O430O635N791N731O565O810
58340F79084O529O931P375O376M972N279O338N355K613R96J059Q45K52J027K553
58325G37584K274N57M82K435L531K855K701L834M095K705J634J661J139k67o57
58310G66563L60Q55M07Q92K660L638L105K664K922K782K409L121M178L541J867
58295H01964J588K255J277q19q41J340K565K122K466L863L835K564L244O045P333
$$ plain form
58399 629335 631469 635088 639044 642009 644471 647177 649383 650314 650710 651244 650907 648606 644946 640917 636248
58384 636248 630536 624608 619259 613984 608269 602856 598439 594517 590755 587961 586465 585063 582868 580717
58370 580717 579515 578745 577843 577438 577894 578231 577819 577647 578641 580326 582320 585418 589877 594361 597943 601474
58354 601474 605771 610209 614395 619284 625271 631071 635946 641122 647552 654187 659978 665709 672274 679084
58340 679084 685613 692544 699919 706295 711267 716546 722884 728239 730852 731848 732907 733752 734004 735031 737584
58325 737584 739858 740415 740897 743332 746863 749718 752419 756253 760348 763053 764687 766348 767487 767220 766563
58310 766563 766923 767778 768185 769077 771737 775375 778480 781144 784066 786848 789257 792378 796556 800097 801964
58295 801964 803552 805807 807084 806265 805424 806764 809329 811451 813917 817780 821615 824179 827423 833468 840801
58280H40801O008N162O234P011O694P431R389R872Q667Q835J0779J1244R536Q841
58266I56504R951R817Q008Q198J1176J2855J1523J0684J2147J2783J0981R959
58254A084586J1560J2846J2078J1965J3808J4467J2544J1579J3595J5397J4804
58243A229229J4630J6782J8338J7376J6964J9383K1910K2195K2425K4342K5635
58232A449209K5022K5436K8454L0985L1077L1409L3540L4597L3124L2235L3455
58221A788543L3710L1966L2223L6041L8849L7915L7242M0166M3824M5473M7560
58210B213512N1973N5799N7450O0325O6004P0649P2375P5039Q0500Q4751Q6144
58199B974521Q9322R6437J02927J06845J13315J24381J33781J37721J41476J49106
$$ plain form
58280 840801 846809 851971 858205 865216 871910 879341 888730 898602 907269 916104 926883 938127 947663 956504
58266 956504 966455 976272 984280 992478 1003654 1016509 1028032 1038716 1050863 1063646 1074627 1084586
58254 1084586 1096146 1108992 1121070 1133035 1146843 1161310 1173854 1185433 1199028 1214425 1229229
58243 1229229 1243859 1260641 1278979 1296355 1313319 1332702 1354612 1376807 1399232 1423574 1449209
58232 1449209 1474231 1499667 1528121 1559106 1590183 1621592 1655132 1689729 1722853 1755088 1788543
58221 1788543 1822253 1854219 1886442 1922483 1961332 1999247 2036489 2076655 2120479 2165952 2213512
58210 2213512 2265485 2321284 2378734 2439059 2505063 2575712 2648087 2723126 2803626 2888377 2974521
58199 2974521 3063843 3160280 3263207 3370052 3483367 3607748 3741529 3879250 4020726 4169832
58189D169832J56225J59555J63876J72454J80473J85211J92571K05950K19057
58180E805204K27717K38028K54417K70835K82841K97006L18691L42019L61893
58171H398651L84219M13632M43315M68238M96151N33694N74122O10828O49992
58162A2972842O97314P46045P91535Q43233R08091R77278J044335J120554J216016
58153B1317243J322091J430063J549439J689195J839900J995187K171634K385834
58145C5700586K633288K913529L252500L673180M168636M732153N384733O140161
58137F8598766O977052P886993Q916630J0116538J1484792J3006868J4700477
58130A41688116J6569937J8600519K0865039K3430704K5828735K6626642K3986469
$$ plain form
58189 4169832 4326057 4485612 4649488 4821942 5002415 5187626 5380197 5586147 5805204
58180 5805204 6032921 6270949 6525366 6796201 7079042 7376048 7694739 8036758 8398651
58171 8398651 8782870 9196502 9639817 10108055 10604206 11137900 11712022 12322850 12972842
58162 12972842 13670156 14416201 15207736 16050969 16959060 17936338 18980673 20101227 21317243
58153 21317243 22639334 24069397 25618836 27308031 29147931 31143118 33314752 35700586
58145 35700586 38333874 41247403 44499903 48173083 52341719 57073872 62458605 68598766
58137 68598766 75575818 83462811 92379441 102495979 113980771 126987639 141688116
58130 141688116 158258053 176858572 197723611 221154315 246983050 273609692 297596161
58123B97596161J7097569P121464l418345j2218869j8250588k1629385k2944458
58116B43353549k2829024k1848495k0431340j8810860j7088120j5343694j3655139
58109A13346877j2057050j0558158r188775p987073o952251o050780n258501m564466
58101E0729823l946341l377073k851820k381553j963783j582168j230150r11683
58093C2485252o19338l32096l6921K65990N84862R41199J323263J623951J648744
58084C7884906J235256M03786o13291j517177k130441k450987k561255k533119
58076B7717678k415806k255516k085092j909846j726848j546906j382904j232014
58068A3162746j087246r54856q44274p51313o66686n91884n32145m82426m34609
$$ plain form
58123 297596161 314693730 321815194 318396849 306177980 287927392 266298007 243353549
58116 243353549 220524525 198676030 178244690 159433830 142345710 127002016 113346877
58109 113346877 101289827 90731669 81542894 73555821 66603570 60552790 55294289 50729823
58101 50729823 46783482 43406409 40554589 38173036 36209253 34627085 33396935 32485252
58093 32485252 31865914 31533818 31496897 31762887 32347749 33288948 34612211 36236162 37884906
58084 37884906 39120162 39523948 38910657 37393480 35263039 32812052 30250797 27717678
58076 27717678 25301872 23046356 20961264 19051418 17324570 15777664 14394760 13162746
58068 13162746 12075500 11120644 10276370 9525057 8858371 8266487 7734342 7251916 6817307
58059F817307l91241l58799l34089l09793k87033k70341k56259k38689k20028
58050D151035k05848j93842j78741j63003j52046j43831j33414j23066j17682
58041B739562j14671j08383j00440r5864r2967q6777p8848p4132p1434o6226n9922
58030A789898n7115n6400n2808m7019m3637m2523m0000l6565l5448l5401l2638
58019A310344k8169k5939k5532k3707k1245k1228k2474k1598j9758k0471k2511
58008A057712k1838j8981j7811j8324j7269j4660j3338j3202j1884r995r981j0953
57996H79476j0385r390j0684j2812j2225r649q695r433r138q023q380r221p611
57983G53830m450l255m011l727k234j969k714k002j15N49L64J608L388K714J38
$$ plain form
58059 6817307 6426066 6067267 5733178 5423385 5136352 4866011 4609752 4371063 4151035
58050 4151035 3945187 3751345 3572604 3409601 3257555 3113724 2980310 2857244 2739562
58041 2739562 2624891 2516508 2416068 2320204 2227237 2140460 2061612 1987480 1916046 1849820 1789898
58030 1789898 1732783 1676383 1623575 1576556 1532919 1490396 1450396 1413831 1378383 1342982 1310344
58019 1310344 1282175 1256236 1230704 1206997 1185752 1164524 1142050 1120452 1100694 1080223 1057712
58008 1057712 1035874 1016893 999082 980758 963489 948829 935491 922289 910405 900410 890429 879476
57996 879476 869091 859701 849017 836205 823980 814331 805636 796203 787065 779042 770662 761441 753830
57983 753830 749380 746125 742114 738387 736153 734184 731470 729468 729353 729902 730266 731874 735262 737976 738114
57968G38114r22j53m87k470l498k735k217k884l707m620o330p654o976n760o621
57953F81080q750r369q662q943r857r134p327p048q040p710o128n789o726o582
57939E71015n384n495o876o926n290m390m893m895l828l138k802j177J479L175
57925E20575L936N552P673Q072O812O177O400N517L513K576K911K330L85r70j197
57910E80262j951l589m606m799n494o400n881m460m385n515n430l830k961l387
57896E17574l262k201k022l087l617l158l085l233j876M77J133k40r41J65J225
57881D93852J277J739K966L173J916J079J269P36r91j903j236r53k204l541l948
57866D93231m511n700o067m976l847l400k566j128n12q77m10J329K336J594P17
$$ plain form
57968 738114 737192 737039 736552 734082 730584 727849 725632 722748 719041 714421 708091 700437 693461 687701 681080
57953 681080 672330 662961 654299 645356 635499 626365 619038 611990 603950 596240 590112 584323 577597 571015
57939 571015 565631 560136 553260 546334 541044 536654 531761 526866 523038 519900 517098 515921 517400 520575
57925 520575 524511 530063 537736 545808 552620 558797 565197 570714 574227 576803 579714 582044 582429 581459 580262
57910 580262 578311 574722 570116 565317 559823 553423 547542 543082 538697 533182 527752 523922 520961 517574
57896 517574 514312 512111 510089 507002 503385 500227 497142 493909 492033 492510 493643 493403 492462 492627 493852
57881 493852 495129 496868 499834 503007 504923 506002 507271 508007 507016 505113 503877 502924 500720 497179 493231
57866 493231 488720 483020 476953 471977 468130 464730 462164 461036 460524 459647 459237 460566 462902 464496 465213
57851D65213J002J676K146L140M493M693L711L420M205M166K662J485J419R15
57837E04346n55j190m22m23k279l858l447k553k972l902m070m125m799n014l967
57822D60770k939l073l449l070k639k765k509j416p35j017q00O67J783J459J294
57807D41561K779M558M664L600L070L289L565M032M926N456M991M114L242J750
57793D95597m15k026k572l131m162m567m059m130n298n831m836m101n022o109
57779D39338n605m378l936l721k722j856k325l205l030k302k260k588k508k702
57765C96200l960n262n378n071n608o405o241n594n542n538m528l254l190m010
57751C26619m200l487k727k055j087k54j91m13j75J08k04m33L84J782K662L012
$$ plain form
57851 465213 466215 467891 470037 473177 477670 482363 486074 489494 493699 497865 500527 502012 503431 504346
57837 504346 503791 502601 502179 501756 499477 495619 492172 489619 486647 482745 478675 474550 469751 464737 460770
57822 460770 457831 454758 451309 448239 445600 442835 440326 438910 438175 437158 436358 437025 438808 440267 441561
57807 441561 444340 448898 453562 457162 460232 463521 467086 471118 476044 481500 486491 490605 493847 495597
57793 495597 495182 493156 490584 487453 483291 478724 474665 470535 465237 459406 454570 450469 445447 439338
57779 439338 433733 429355 425419 421698 418976 417120 414795 411590 408560 406258 403998 401410 398902 396200
57765 396200 392240 386978 381600 376529 370921 364516 358275 352681 347139 341601 337073 333819 330629 326619
57751 326619 322419 318932 316205 314150 313063 312809 312618 312205 312030 312138 311934 311501 311885 313667 316329 319341
57735C19341L381L572L387L662N011O462O876O737O950O910N523L337J825J259
57721C84233Q59L83L4m92j395j925j483q31q70j166j057j124k052l008k861k065
57705C65180j713j566p22N18J186J368J769K195K052J718J966K581K947L264L878
57690C86621M266L991L760M195M555M153L837M492N262N062M693N444O632O704
57676D53667N882N551N765N632N466O244P410P532O874P035Q200R048R326J0280
57662E53912J2334J4392J5763J6905J7939J8212J7752J7623J8390J9597K0988
57651G43807K2909K5247K7277K8807L0401L2349L4464L6811L9570M2261M4299
57640A108202M6242M9351N4037N9728O6054P2974Q0109Q7161R4742J03553J13086
$$ plain form
57735 319341 322722 326294 329681 333343 338354 344816 351692 358429 365379 372289 377812 381149 382974 384233
57721 384233 385092 385475 385509 385017 383622 381697 380214 379383 378513 377347 376290 375166 373114 370106 367245 365180
57705 365180 363467 361901 361179 361697 362883 364251 366020 368215 370267 371985 373951 376532 379479 382743 386621
57690 386621 390887 394878 398638 402833 407388 411541 415378 419870 425132 430194 434887 440331 446963 453667
57676 453667 459549 465100 470865 476497 481963 488207 495617 503149 510023 517058 525258 534306 543632 553912
57662 553912 566246 580638 596401 613306 631245 649457 667209 684832 703222 722819 743807
57651 743807 766716 791963 819240 848047 878448 910797 945261 982072 1021642 1063903 1108202
57640 1108202 1154444 1203795 1257832 1317560 1383614 1456588 1536697 1623858 1718600 1822153 1935239
57629A935239J22401J31770J42109J53042J63049J71338J78079J82808J84080
57620C363915J80676J71926J56919J34940J06887P5174M2251J0199j8634m2104
57610D182149n9376p0503p5278p4069o9756o7326p1066q2599j00737j21660j39762
57599C250017j50558j53517j51147j45529j36991j25823j13355j00867q8817p7423
57589B005990o6893n6917m7018l7526k9102k1494j3927o544j16N547J1453J7795
57577A761248K3952L0103L7216M5325N3366O0977O8974P7772Q6763R5644J04837
57566B446177J14117J22270J28678J33991J38497J40895J39223J32213J19295
57557C615356J00285P5640M6506J4311j9108n1257p9884j04186j24191j39279
$$ plain form
57629 1935239 2057640 2189410 2331519 2484561 2647610 2818948 2997027 3179835 3363915
57620 3363915 3544591 3716517 3873436 4008376 4115263 4190437 4232688 4242887 4224253 4182149
57610 4182149 4122773 4052270 3976992 3902923 3833167 3765841 3694775 3612176 3511439 3389779 3250017
57599 3250017 3099459 2945942 2794795 2649266 2512275 2386452 2273097 2172230 2083413 2005990
57589 2005990 1939097 1882180 1835162 1797636 1768534 1747040 1733113 1726569 1726453 1732000 1743453 1761248
57577 1761248 1785200 1815303 1852519 1897844 1951210 2012187 2081161 2158933 2245696 2341340 2446177
57566 2446177 2560294 2682564 2811242 2945233 3083730 3224625 3363848 3496061 3615356
57557 3615356 3715641 3791281 3837787 3852098 3832990 3781733 3701849 3597663 3473472 3334193
57547C334193j48589j52775j53800j52747j49275j43423j36407j29093j21096
57538B046988j12093j02888r4433q6763p9564p2951o7066o1579n6192n1067m6405
57527A215987m2176l8425l5259l2420k9545k6837k4748k3074k1193j9151j7519
57516I05640j6245j4629j2539j0600r107p748o456n490m603l188j395j0Q50J880
57502H16360L268M422N233O478Q564J0800J2349J3167J3756J4681J6401J8807
57490I44286K1013K2381K3522K5405K7883L0229L2753L6381M0884M5090M8868
57479A298695N3274N8626O4059O9255P4981Q1526Q8159R4552J01223J08011J13597
57468B205958J17124J18907J18944J16032J09028R7717Q1899O1096L6024R101
$$ plain form
57547 3334193 3185604 3032829 2879029 2726282 2577007 2433584 2297177 2168084 2046988
57538 2046988 1934895 1832007 1737574 1650811 1571247 1498296 1431230 1369651 1313459 1262392 1215987
57527 1215987 1173811 1135386 1100127 1067707 1038162 1011325 986577 963503 942310 923159 905640
57516 905640 889395 874766 862227 851627 842520 834772 828316 822826 818223 815035 813640 813630 814480 816360
57502 816360 819628 824050 829283 835761 844325 855125 867474 880641 894397 909078 925479 944286
57490 944286 965299 987680 1011202 1036607 1064490 1094719 1127472 1163853 1204737 1249827 1298695
57479 1298695 1351969 1410595 1474654 1543909 1618890 1700416 1788575 1883127 1984350 2092361 2205958
57468 2205958 2323082 2441989 2560933 2676965 2785993 2883710 2965609 3026705 3062729 3071830
57458C071830j7304m2138o4650q3507r7767j07651j13608j15705j14520j11496
57448B203484j07504j02144r5169q7504q0049p2676o5149n8020n1739m5893m0212
57437A397425l5237l1126k6899k1916j7075j3423j0469p060l134O13M211Q286
57425A244196J2730J6688J9754K2405K5353K9094L3932L9842M6341N2832N8959
57414A602126O4637P0045P5703Q1969Q8480R4556R9979J04645J07594J07391J03405
57403B600530R5624Q3423O5936M3852J9346o022l1905n7340p9983r7985j11298
57392B524178j20385j25129j25860j23988j20623j15727j09486j03173r7539r1695
57382A390573q4767p7532p1093o5079n8620n2179m6968m3149l9944l6982l4303
$$ plain form
57458 3071830 3054526 3012388 2947738 2864231 2766464 2658813 2545205 2429500 2314980 2203484
57448 2203484 2095980 1993836 1898667 1811163 1731114 1658438 1593289 1535269 1483530 1437637 1397425
57437 1397425 1362188 1331062 1304163 1282247 1265172 1251749 1241280 1234220 1231086 1231699 1235910 1244196
57425 1244196 1256926 1273614 1293368 1315773 1341126 1370220 1404152 1443994 1490335 1543167 1602126
57414 1602126 1666763 1736808 1812511 1894480 1982960 2077516 2177495 2282140 2389734 2497125 2600530
57403 2600530 2696154 2779577 2845513 2889365 2908711 2902689 2870784 2813444 2733461 2635476 2524178
57392 2524178 2403793 2278664 2152804 2028816 1908193 1792466 1682980 1579807 1482268 1390573
57382 1390573 1305806 1228274 1157181 1092102 1033482 981303 934335 891186 851242 814260 779957
57371G79957l1582k8581k5920k4255k3078k1396j9170j7072j5258j3446j1871
57360E48328j1078j0913j0602r775q731p879p425p373p345o778n631m481l690
57347D46627l072k635k829l621m215m097l446k323n98R26Q20p68j735q46M96N73
57331D19257j6L68J643K385K291K393L131L777L727L174K565K334K919M177N074
57316D59199M886M212M056M408M587M428M186L834L372L303L867M465M645M964
57302E18412N910O782O797O497O832P476P355O375N346M683M304M359M899N341
57288F01368N318N527O612P858Q194P827P640P575P059O417O400O805O946P017
57274F98563P552Q103P937P620Q197R280R630R290R370R864R659Q726Q402R199
$$ plain form
57371 779957 748375 719794 693874 669619 646541 625145 605975 588903 573645 560199 548328
57360 548328 537250 526337 515735 505960 497229 489350 481925 474552 467207 460429 454798 450317 446627
57347 446627 443555 440920 438091 434470 430255 426158 422712 420389 419791 420717 421537 420769 419034 418188 418684 419257
57331 419257 419241 419609 421252 423637 425928 428321 431452 435229 438956 442130 444695 447029 449948 454125 459199
57316 459199 464085 468297 472353 476761 481348 485776 489962 493796 497168 500471 504338 508803 513448 518412
57302 518412 524322 531104 537901 544398 551230 558706 566061 572436 577782 582465 586769 591128 596027 601368
57288 601368 606686 612213 618825 626683 634877 642704 650344 657919 664978 671395 677795 684600 691546 698563
57274 698563 706115 714218 722155 729775 737972 747252 756882 766172 775542 785406 795065 803791 812193 821392
57260H21392J0057J0215J0254J0823J1667J2384J2913J2953J2152J1210J1466
57249I47486J3047J4562J5093J5274J5978J7073J8028J8715J9031J8614J7554
57238A130455J6737J6897J7853J8989J9954K0735K1495K2466K3583K4341K4512
57227A358017K4718K5664K7065K8121K8682K9104K9305K9015K8592K8541K8444
57216A665268K7552K6130K5020K4060K2287J9690J7294J5437J3277J0340P273
57205A873628M782K838J390P37R02J517K557M340O547Q284R337J0503J2333J4366
57191A954061J5934J6991J7922J9005K0274K1475K2323K3135K4724K7113K9058
57180B192015K9745L0171L1701L3979L5763L7130L9113M1485M2941M3447M4456
$$ plain form
57260 821392 831449 841664 851918 862741 874408 886792 899705 912658 924810 936020 947486
57249 947486 960533 975095 990188 1005462 1021440 1038513 1056541 1075256 1094287 1112901 1130455
57238 1130455 1147192 1164089 1181942 1200931 1220885 1241620 1263115 1285581 1309164 1333505 1358017
57227 1358017 1382735 1408399 1435464 1463585 1492267 1521371 1550676 1579691 1608283 1636824 1665268
57216 1665268 1692820 1718950 1743970 1768030 1790317 1810007 1827301 1842738 1856015 1866355 1873628
57205 1873628 1878410 1881248 1882638 1883375 1884277 1885794 1888351 1892691 1899238 1907522 1916859 1927362 1939695 1954061
57191 1954061 1969995 1986986 2004908 2023913 2044187 2065662 2087985 2111120 2135844 2162957 2192015
57180 2192015 2221760 2251931 2283632 2317611 2353374 2390504 2429617 2471102 2514043 2557490 2601946
57169B601946M6606M8965N0992N3397N6504N9415O1597O3873O6965P0312P3020
57158C253592P5054P6810P8486Q0425Q3156Q6528Q9688R2294R4927R7986J01095
57147D210041J03924J06542J08694J09634J09081J07530J05452J03006J00643
57138E164547R8924R7640R6135R4605R4111R5188R7437J00374J03591J06153J07290
57127F255995J07666J08671J10405J11705J12125J12307J12377J11685J10347
57118G253283J09294J08338J05917J01367R5927R0963Q6732Q3484Q2125Q2963
57108H200393Q5056Q7514R0219R2904R5036R7269J01472J08495J16959J24846
57098I200163J31049J35015J36361J35536J33780J31868J30036J29075J29891
$$ plain form
57169 2601946 2648552 2697517 2748509 2801906 2858410 2917825 2979422 3043295 3110260 3180572 3253592
57158 3253592 3328646 3405456 3483942 3564367 3647523 3734051 3823739 3916033 4010960 4108946 4210041
57147 4210041 4313965 4420507 4529201 4638835 4747916 4855446 4960898 5063904 5164547
57138 5164547 5263471 5361111 5457246 5551851 5645962 5741150 5838587 5938961 6042552 6148705 6255995
57127 6255995 6363661 6472332 6582737 6694442 6806567 6918874 7031251 7142936 7253283
57118 7253283 7362577 7470915 7576832 7678199 7774126 7865089 7951821 8035305 8117430 8200393
57108 8200393 8285449 8372963 8463182 8556086 8651122 8748391 8849863 8958358 9075317 9200163
57098 9200163 9331212 9466227 9602588 9738124 9871904 10003772 10133808 10262883 10392774
57089A0392774J31706J32404J31105J28784J26094J22564J18354J14745J12029
57080A1510559J08879J04662J00528R7363R4400R0789Q6726Q2223P6558O9860
57070A2422547O3552N8308N3351M8381M4275M1069L7352L2590K8010K4259K0233
57059A2873927J5109R300K536o593j8012k9317l8637m5993n0937n1561m7222l9708
57047A2572892l0419j8789m275J3267L6409P0096J17415J78754K56220L54729
57037A3546299M76979O21458P87368R77091J191997J430976J695266J988861K311200
57028B5027495K655305L014989L384423L746680M074625M350419M567364M693228
57020E5514528M642874M318428L689403K822987J833520Q16535j68252j079037
$$ plain form
57089 10392774 10524480 10656884 10787989 10916773 11042867 11165431 11283785 11398530 11510559
57080 11510559 11619438 11724100 11824628 11921991 12016391 12107180 12193906 12276129 12352687 12422547
57070 12422547 12486099 12544407 12597758 12646139 12690414 12731483 12768835 12801425 12829435 12853694 12873927
57059 12873927 12889036 12898336 12900872 12894279 12876267 12846950 12808313 12762320 12711383 12659822 12612600 12572892
57047 12572892 12542473 12523684 12519409 12532676 12569085 12639181 12756596 12935350 13191570 13546299
57037 13546299 14023278 14644736 15432104 16409195 17601192 19032168 20727434 22716295 25027495
57028 25027495 27682800 30697789 34082212 37828892 41903517 46253936 50821300 55514528
57020 55514528 60157402 64475830 68165233 70988220 72821740 73638275 73470023 72390986
57012G2390986j884120k566823l119573l531422l791848l906578l900110l801274
57004D5889238l632937l414661l165928k902874k636409k375442k128095j898609
56996B3734283j686768j491794j314164j153494j007977q76796p60776o60245
56988A4782269n74672n04149m48523m04738l67749l34508l05070k79900k58525
56979A1304435k40852k27212k16486k06384j96037j86469j78317j71050j64618
56970I517010j59637j55432j50027j42768j35247j28990j23859j19364j15939
56961H285747j14135j13885j15319j19135j25535j33669j42492j51242j59101
56952G111234j65712j72335j81027j92208k04196k15473k25939k35417k42471
$$ plain form
57012 72390986 70506866 67940043 64820470 61289048 57497200 53590622 49690512 45889238
57004 45889238 42256301 38841640 35675712 32772838 30136429 27760987 25632892 23734283
56996 23734283 22047515 20555721 19241557 18088063 17080086 16203290 15442514 14782269
56988 14782269 14207597 13703448 13254925 12850187 12482438 12147930 11842860 11562960 11304435
56979 11304435 11063583 10836371 10619885 10413501 10217464 10030995 9852678 9681628 9517010
56970 9517010 9357373 9201941 9051914 8909146 8773899 8644909 8521050 8401686 8285747
56961 8285747 8171612 8057727 7942408 7823273 7697738 7564069 7421577 7270335 7111234
56952 7111234 6945522 6773187 6592160 6399952 6195756 5980283 5754344 5518927 5276456
56943E276456k45638k44762k40170k31482k18120k00203j78164j52367j23745
56934C441805r3705o2583l0023P74K0043J6375j3032n7749j01043j31421j47406
56923B842035j53234j52913j48819j43174j37937j33332j28082j21485j14189
56914A608870j06882r9338r1309q3353p6094o9290o2274n4929m7667m0941l5108
56903H41685l0375k6374k2200j7285j1947o866k521N92J747M92k947p899j3351
56890G02751j7829k0074k0274j9843j9649j9229j8089j6633j5220j3356j0720
56879E11835p989n615k722J525O131R317J0976J2776J5869J9502K1728K0585J5005
56866F28923N783m373j2763j8724k3068k5990k6783k5441k3140k0899j8913j7414
$$ plain form
56943 5276456 5030818 4786056 4545886 4314404 4096284 3896081 3717917 3565550 3441805
56934 3441805 3348100 3285517 3255494 3256268 3276311 3292686 3279654 3221905 3120862 2989441 2842035
56923 2842035 2688801 2535888 2387069 2243895 2105958 1972626 1844544 1723059 1608870
56914 1608870 1501988 1402650 1311341 1227988 1151894 1082604 1020330 965401 917734 876793 841685
56903 841685 811310 784936 762736 745451 733504 726638 724117 724709 726456 726948 724001 716102 702751
56890 702751 684922 664848 644574 624731 605082 585853 567764 551131 535911 522555 511835
56879 511835 503846 498231 495509 497034 503165 512482 523458 536234 552103 571605 593333 613918 628923
56866 628923 634706 630333 617570 598846 575778 549788 523005 497564 474424 453525 434612 417198
56854D17198j6870j6896j6111j3843j1140r427q840q529p904o909n525l915k740
56841B88549k545k886k731j795q38m91l15N66K235L950N243O485Q149J0066J1808
56826C25450J3433J5179J6487J6155J3575R328M422m22m472o818p151o266n148
56813C83752l844j797R69L726O039Q341J1344J5268J9745K4210K8334L2263L6458
56800E64808M1124M5595M8143M6432L8730K5427R496n070j5715k2209k5470k6172
56788G25119k4691k1560j7415j2767q014l286J896Q244J5638K2995K9577L5901
56776G51637M2968N1069N9684O7643P2639P1167O0410M0680J5786r008k9407m3348
56764A151920n1024n4073n4243n2459m8928m3780l7409l0403k3323j6420r492
$$ plain form
56854 417198 400328 383432 367321 353478 342338 332911 324071 315542 307638 300729 295204 291289 288549
56841 288549 286004 283118 280387 278592 277754 277263 276948 277514 279749 283699 288942 295427 303576 313642 325450
56826 325450 338883 354062 370549 386704 400279 409607 414029 413607 409135 402317 395166 388900 383752
56813 383752 379908 378111 379080 382806 388845 397186 408530 423798 443543 467753 496087 528350 564808
56800 564808 605932 651527 699670 746102 784832 810259 819755 814685 798970 776761 751291 725119
56788 725119 700428 678868 661453 648686 640672 637386 639282 647526 663164 686159 715736 751637
56776 751637 794605 845674 905358 973001 1045640 1116807 1177217 1217897 1233683 1224675 1195268 1151920
56764 1151920 1100896 1046823 992580 940121 891193 847413 810004 779601 756278 739858 730366
56753G30366k268N029J1898J8332K4924L2018L9049M4602M6523M2265L0391J2388
56741A035517p591k5366l8781m7376n1297n1179m8335m4115l9377l4748l0668
56730F16684k6747k2041j6473j1222o978k816K327P923J2733J6625K0109K2365
56718F12489K1186J5167N194o260j6760k4846l0195l3149l3977l2833l0446k8089
56706D17481k6380k4637k2098j9146j6693j4891j3324j1941j0939j0058q912p732
56694B30730o981o505n793m874m180l740l230k637k259k191k334k649k925k701
56680A77731j954j414j636k229k592k799l074l133k773k494k649k625j866j032
56666A45461j007j378j185o17o44j252j560j487j788k427k347j206p3L8n91j101
$$ plain form
56753 730366 728098 733127 745025 763357 788281 820299 859348 903950 950473 992738 1023129 1035517
56741 1035517 1027926 1002560 963779 916403 865106 813927 765592 721477 682100 647352 616684
56730 616684 589937 567896 551423 540201 533223 530407 532734 540657 553390 570015 590124 612489
56718 612489 633675 648842 654036 647776 631016 606170 575975 542826 508849 476016 445570 417481
56706 417481 391101 366464 344366 325220 308527 293636 280312 268371 257432 247374 238462 230730
56694 230730 223749 217244 211451 206577 202397 198657 195427 192790 190531 188340 186006 183357 180432 177731
56680 177731 175777 174363 172727 170498 167906 165107 162033 158900 156127 153633 150984 148359 146493 145461
56666 145461 144454 143076 141891 141274 140630 139378 137818 136331 134543 132116 129769 128563 128490 128528 127937 126836
56650A26836j141q77n30k79k16k62l66o86j164j321r62o68q82r88j94J072J655
56633A19027J257N84P7m50r68j039n57R3N87P95N56K7j02N06J085P88k6m28l72
56614A21440l90l63J63P73O01k68j017j464j928k070j251J12R84J356J932K434
56598A21044J875N75M8N78P24k66j204r15O9N96M97K31p8l91l53J28N52N53L19
56579A24582nn58j158j317j059q93q39n09k06p54j914k296j262J95J051J501J957
56562A16516J953J026j61m75K99J361J795J263K15l90p4M86L67k16l57n5j10n19
56544A22924l44N73J226J095Q69J020J024N92L58O62Q76O38O40J369K160K279
56528A37961K011J892J761J389J219J617K099K040J537J038P20P12J208J974K387
$$ plain form
56650 126836 125695 124818 124288 124009 123793 123531 123165 122479 121315 119994 119032 118364 117482 116494 116300 117372 119027
56633 119027 120284 120868 120945 120495 119527 118488 117931 118024 118611 119406 119962 119989 119887 120393 121478 122266 122240 121812 121440
56614 121440 121050 120687 120850 121623 122224 121956 120939 119475 117547 115477 114226 114338 115322 116678 118610 121044
56598 121044 122919 123494 123542 124120 124844 124578 123374 122459 122528 123124 123621 123852 123774 123383 123030 123158 123710 124263 124582
56579 124582 124577 124019 122861 121544 120485 119592 118753 118244 118038 117284 115370 113074 111812 112007 113058 114559 116516
56562 116516 118469 119495 119334 118859 119158 120519 122314 123577 123792 123402 123328 123814 124181 123965 123608 123553 123443 122924
56544 122924 122580 123153 124379 125474 126343 127363 128387 128979 129337 129999 130875 131513 132153 133522 135682 137961
56528 137961 139972 141864 143625 145014 146233 147850 149949 151989 153526 154564 155284 155996 157204 159178 161565
56513A61565K351K339K459K374K430L514N412O563O085M940M457M846N798P248
56499B22381Q751R283Q658Q103Q514R087Q727P794P374P501P267O206M707L312
56485C27665K283J537O11q70k483l455l880m552n510n941n713n696o137o205n694
56470B75960n694o742p805p976p777p748p202n577l758k819k552k401k727l840
56456B01342m819m709m004l674l557k966k063j395q32j39J64l14q94q75o84r40
56440A69641j230r65n58n56n05Q0N39K26j35L80J190J184N92L51L87Q7k07K43
56422A70744J012J161R55J341K125K303J905J944K659L251L292L065K688K107
56408B00552J751K082K660K852K988L666M330M002L025K622K921L005K730K967
$$ plain form
56513 161565 163916 166255 168714 171088 173518 177032 182444 189007 195092 200032 204489 209335 215133 222381
56499 222381 231132 240415 249073 257176 265690 274777 283504 291298 298672 306173 313440 319646 324353 327665
56485 327665 329948 331485 332096 331226 328743 325288 321408 316856 311346 305405 299692 293996 287859 281654 275960
56470 275960 270266 263524 255719 247743 239966 232218 225016 219439 215681 212862 210310 207909 205182 201342
56456 201342 196523 191814 187810 184136 180579 177613 175550 174155 173323 173184 173348 173034 172140 171265 170581 169641
56440 169641 168411 167446 166888 166332 165827 165907 166446 166672 166537 166917 168107 169291 169883 170234 170621 170708 170501 170744
56422 170744 171756 172917 173872 175213 177338 179641 181546 183490 186149 189400 192692 195757 198445 200552
56408 200552 202303 204385 207045 209897 212885 216551 220881 224883 227908 230530 233451 236456 239186 242153
56394B42153L944M787M932M738M505L978L103K272J679J185Q81R38J070Q81O24
56379B81670P49R41N55j78m17l5K00k86j366k668l757m179m048m276n407o597
56363B50901o590n392m063l265k878k698k613k342j845j607j800j731r48k50o13
56348B12266j639k186j965j502j015m32r7l29o50m43j4rk65j67K77O55Q88R32
56330B04305M33l97m04R63K524K936K470K139K026J835K129L385M613M521L421
56315B36899K512J996J447J219J809K463K192J556J679K111J538J88l94L22J454
56300B58991K344K891K618J190m02q07k27J83K78P03J248J253J181J883K832K900
56284B79059K416K484K782K213J251J368K409K881K644K983M063M662M539M699
$$ plain form
56394 242153 246097 250884 255816 260554 265059 269037 272140 274412 276091 277276 278157 279095 280165 281046 281670
56379 281670 282419 283360 283915 283737 283320 283285 283485 283199 281833 279165 275408 271229 267181 262905 257498 250901
56363 250901 244311 238919 234856 231591 228713 226015 223402 221060 219215 217608 215808 214077 213129 212879 212266
56348 212266 210627 208441 206476 204974 203959 203527 203430 203101 202451 202008 201994 201985 201720 201553 201830 202485 203373 204305
56330 204305 204738 204341 203937 204900 207424 210360 212830 214969 216995 218830 220959 224344 228957 233478 236899
56315 236899 239411 241407 242854 244073 245882 248345 250537 252093 253772 255883 257421 257609 257215 257537 258991
56300 258991 261335 264226 266844 268034 267632 266825 266598 266781 267059 267762 269010 270263 271444 273327 276159 279059
56284 279059 281475 283959 286741 288954 290205 291573 293982 296863 299507 302490 306553 311215 315754 320453
56270C20453N223N133M611N009O326O943O304N725O051O588O803P122P554P446
56256D07291O990P138P704P480O448N848N830N219L860L023L041K819K154K200
56242D77045L075L314K532K329L558M865M983M620M906N720O563P592Q769R450
56228E49321R535R739J0252J0596J1120J2887J5743J8224J9779K1252K2887K3962
56216G35297K4796K6860L0258L3299L5272L7544M0998M4598M7462N0373N4163
56205A160920N8471O3085O8697P5357Q1953Q8111R4895J02825J10991J18867J27104
56194B151276J35641J43006J48448J52847J56616J58481J57302J53298J46653
56185C503568J36748J23609J08256R0793P0209M6947K3645K318j7273l5624n1946
$$ plain form
56270 320453 325676 330809 335420 340429 346755 353698 360002 365727 371778 378366 385169 392291 399845 407291
56256 407291 414281 421419 429123 436603 443051 448899 454729 459948 463808 466831 469872 472691 474845 477045
56242 477045 480120 483434 485966 488295 491853 496718 501701 506321 511227 516947 523510 531102 539871 549321
56228 549321 558856 568595 578847 589443 600563 613450 629193 647417 667196 688448 711335 735297
56216 735297 760093 786953 817211 850510 885782 923326 964324 1008922 1056384 1106757 1160920
56205 1160920 1219391 1282476 1351173 1426530 1508483 1596594 1691489 1794314 1905305 2024172 2151276
56194 2151276 2286917 2429923 2578371 2731218 2887834 3046315 3203617 3356915 3503568
56185 3503568 3640316 3763925 3872181 3962974 4033183 4080130 4103775 4106093 4088820 4053196 4001250
56174D001250o5643p7237q6818r3480r7293r9748j01426j01339r9545r8075r8045
56163B982601r8202r7498r6850r7012r6987r6057r5198r4966r4105r1826q9383
56152A934517q7768q5864q2514p8481p4760p0792o6044o1540n8126n4919n0946
56141A162763m6791m3144l9437l5291l1670k9213k7000k4241k1495j9212j6853
56130H28416j4477j3197j2991j2243j0440r050q628p599n261l352l006k725j185
56117G24262M59R19J130K237L512M156N094O959Q506Q838R163J0403J1215J0329
56103H07182Q825Q133P775O923O215O213O114N572N738O888P401O693O624Q290
56089I04586J0090J0799J1869J4593J7742K0134K2856K6765L0463L3004L5894
$$ plain form
56174 4001250 3935607 3858370 3771552 3678072 3580779 3481031 3379605 3278266 3178721 3080646 2982601
56163 2982601 2884399 2786901 2690051 2593039 2496052 2399995 2304797 2209831 2115726 2023900 1934517
56152 1934517 1846749 1760885 1678371 1599890 1525130 1454338 1388294 1326754 1268628 1213709 1162763
56141 1162763 1115972 1072828 1033391 998100 966430 937217 910217 885976 864481 845269 828416
56130 828416 813939 800742 787751 775508 765068 756018 747390 739791 734530 731178 728172 725447 724262
56117 724262 724721 725640 726770 729007 732519 736675 741769 748728 757234 766072 775235 785638 796853 807182
56103 807182 816007 824140 831915 838838 845053 851266 857380 862952 868690 875578 882979 889672 896296 904586
56089 904586 914676 925475 937344 951937 969679 989813 1012669 1039434 1069897 1102901 1138795
56078A138795M0131M4055M6534M9439N4503O0511O6051P2061P8921Q3956Q4770
56067A819727Q2330P8225P1912O3451N5703N0539M5914L9798L3814K9468K4176
56056B395057J5093M105n054j2026j8330k3359k6204k9218l5455m4295n3113o1240
56044B105961o8699p3523p4237p2867p1711o9425o4070n7485n2556m8489m3017
56033A409882l7069l2930k9863k5834k1635j9163j7521j4834j2024j0793r982
56022A178234p820n509m699l869j291J097J035M94K385N400O707P117Q775J0419
56008A198475R863Q735R751J1746J2233J2206J3593J4827J4018J3454J5651J8123
55996A352675J7657J6520J8453K1757K2705K2664K5159K8806L0019L0040L2251
$$ plain form
56078 1138795 1178926 1222981 1269515 1318954 1373457 1433968 1500019 1572080 1651001 1734957 1819727
56067 1819727 1902057 1980282 2052194 2115645 2171348 2221887 2267801 2307599 2341413 2370881 2395057
56056 2395057 2410150 2414255 2409201 2397175 2378845 2355486 2329282 2300064 2264609 2220314 2167201 2105961
56044 2105961 2037262 1963739 1889502 1816635 1744924 1675499 1611429 1553944 1501388 1452899 1409882
56033 1409882 1372813 1339883 1310020 1284186 1262551 1243388 1225867 1211033 1199009 1188216 1178234
56022 1178234 1170414 1164905 1160206 1156337 1155046 1156143 1157178 1157672 1160057 1165457 1172164 1179281 1188056 1198475
56008 1198475 1208338 1217073 1226824 1238570 1250803 1263009 1276602 1291429 1305447 1318901 1334552 1352675
55996 1352675 1370332 1386852 1405305 1427062 1449767 1472431 1497590 1526396 1556415 1586455 1618706
55985A618706L5093L4828L2883L3265L5089L4899L3988L5910L9128L9831L9743
55974B013363M3211M8732N1453N2087N5133O0131O3063O4605O8666P4320P7620
55963B672384P9681Q4555R0880R4260R6091J01216J08736J14086J18227J25458
55953C685574J34278J39900J43754J50714J59166J64007J67122J74320J84279
55944E103114J91515J97821K09173K23637K34558K43505K57511K75575K90871
55935G227280L04348L22806L45535L66590L88011M16289M48156M75191N00296
55926A0794502N33460N73423O10644O46297O90243P41947P92383Q43477R05731
55917A7132107R77914J050042J125462J217994J327935J443649J565912J706525
$$ plain form
55985 1618706 1653799 1688627 1721510 1754775 1789864 1824763 1858751 1894661 1933789 1973620 2013363
55974 2013363 2056574 2105306 2156759 2208846 2263979 2324110 2387173 2451778 2520444 2594764 2672384
55963 2672384 2752065 2836620 2927500 3021760 3117851 3219067 3327803 3441889 3560116 3685574
55953 3685574 3819852 3959752 4103506 4254220 4413386 4577393 4744515 4918835 5103114
55944 5103114 5294629 5492450 5701623 5925260 6159818 6403323 6660834 6936409 7227280
55935 7227280 7531628 7854434 8199969 8566559 8954570 9370859 9819015 10294206 10794502
55926 10794502 11327962 11901385 12512029 13158326 13848569 14590516 15382899 16226376 17132107
55917 17132107 18110021 19160063 20285525 21503519 22831454 24275103 25841015 27547540
55909B7547540J864298K028931K207776K421085K672629K955884L287210L698458
55901D8683811M197860M774972N440651O218323P098434Q053861R103107J0304348
55893A03875367J1687008J3250669J5024083J7044312J9289825K1736412K4404241
55886B26311917K7029647K8521526K7065203K1309253J1687811M46920r755779
55879C32616498j7307590k1959292k4214522k4724529k4086464k2796635k1177293
55872A76350173j9382268j7507084j5649613j3874047j2198918j0648698r269994
55865G7819551q083778p065781o186275n432317m784292m209738l693330l243586
55857C5120454k861759k531135k242447k002046j807661j640859j490351j360387
$$ plain form
55909 27547540 29411838 31440769 33648545 36069630 38742259 41698143 44985353 48683811
55901 48683811 52881671 57656643 63097294 69315617 76414051 84467912 93571019 103875367
55893 103875367 115562375 128813044 143837127 160881439 180171264 201907676 226311917
55886 226311917 253341564 281863090 308928293 330237546 341925357 342372277 332616498
55879 332616498 315308908 293349616 269135094 244410565 220324101 197527466 176350173
55872 176350173 156967905 139460821 123811208 109937161 97738243 87089545 77819551
55865 77819551 69735773 62669992 56483717 51051400 46267108 42057370 38364040 35120454
55857 35120454 32258695 29727560 27485113 25483067 23675406 22034547 20544196 19183809
55849A9183809j250576j149067j051379r65645q93681q25677p58456p00598o54488
55840A0934242o10735n65249n25234m93388m62116m28258l98507l75336l51890
55831F723529l25605l03184k87469k72372k55186k41292k32315k21873k07491
55822D376742j95114j87444j79091j67439j57419j51310j44331j34523j26829
55813B933242j23227j18622j10638j04060j01421r8245r1731q5458q1605p6899
55803A941336p0053o5000o3032n9744n3269m7762m5214m1674l5166k9671k7534
55792A403217k5247k0546j6601j5514j4530j2333j2410j6420k0525k1864k2627
55781A204600k4419k4697k2218k0156k0439k0509j8794j7893j9337k0617k0265
$$ plain form
55849 19183809 17933233 16784166 15732787 14767142 13873461 13047784 12289328 11588730 10934242
55840 10934242 10323507 9758258 9233024 8739636 8277520 7849262 7450755 7075419 6723529
55831 6723529 6397924 6094740 5807271 5534899 5279713 5038421 4806106 4584233 4376742
55822 4376742 4181628 3994184 3815093 3647654 3490235 3338925 3194594 3060071 2933242
55813 2933242 2810015 2691393 2580755 2476695 2375274 2277029 2185298 2099840 2018235 1941336
55803 1941336 1871283 1806283 1743251 1683507 1630238 1582476 1537262 1495588 1460422 1430751 1403217
55792 1403217 1377970 1357424 1340823 1325309 1310779 1298446 1286036 1269616 1249091 1227227 1204600
55781 1204600 1180181 1155484 1133266 1113110 1092671 1072162 1053368 1035475 1016138 995521 975256
55770I75256k0500k2213k2724k1095k0155k0819k0068j7067j5478j6954j8177
55759G60006j7222j6975j8987j9761j6763j2801j0883r753p960p306q564q611
55747F04420n557k295j482j367l2O92q44k480k229j946l511n144n059n058p019
55732E61089r192r423q840r096r151p897o978p906r246r390r306r941r865q080
55718D36778o268n826n536m305l355l642m154m650o673j0038j1799j0848r772
55705C49912j0212j0339r063q414r199q595n202k384l157n505o233n910o386o794
55691B52519n840m991n673o077m279j979j559j998j250j88o24j644j406o02r07
55676B13502j842k203k572l550l612j690J92j29j490j796j651k556l594l228k522
$$ plain form
55770 975256 954756 932543 909819 888724 868569 847750 827682 810615 795137 778183 760006
55759 760006 742784 725809 706822 687061 670298 657497 646614 636861 628901 621595 613031 604420
55747 604420 598863 596568 595086 593719 593687 594379 593535 591055 588826 586880 583369 578225 573166 568108 561089
55732 561089 551897 542474 533634 524538 515387 507490 500512 492606 483360 473970 464664 454723 444858 436778
55718 436778 430510 424684 419148 414843 411488 407846 403692 399042 392369 382331 370532 359684 349912
55705 349912 339700 329361 320298 311884 302685 294090 288888 286504 283347 277842 271609 265699 259313 252519
55691 252519 246679 241688 236015 229938 225659 223680 222121 220123 218873 218685 218061 216417 215011 214409 213502
55676 213502 211660 209457 206885 203335 199723 198033 198225 198096 196606 194810 193159 190603 187009 183781 181259
55661A81259l298m711m794l850l353k993j724l69k82p56l28O11J020J487K859
55646A60778M156M208L854M158M169K871J589J873K707K433J699J900K396K014
55632B00805J598K340L123K313O71j24m03j265k099k009k062l278l998k322K85
55617A93575J002o9p33o44j143k109k153j390j161j461j310j010j486k064j473
55602A76371l70l32j030q95Q9O78Q03J284J794J509J101J671K363J429q79k777
55586A82809l717m446n026n012n014n820o624o213n169m791m725l933l072l398
55572A15849m182l793k734k914m376n342n153m716m284l216j759q93n54m9K05
55557G2089o01j678j576o41l54o96m22M31O43J54j6N1p04k132k950k881k764k665
$$ plain form
55661 181259 177961 173250 168456 164606 161253 158260 156536 156167 155885 155129 154801 155412 156432 157919 160778
55646 160778 164934 169142 172996 177154 181323 184194 185783 187656 190363 192796 194495 196395 198791 200805
55632 200805 202403 204743 207866 210179 210850 210726 210323 209058 206959 204950 202888 199610 195612 193290 193575
55617 193575 194577 194508 193775 193131 191988 189879 187726 186336 185175 183714 182404 181394 179908 177844 176371
55602 176371 176001 175669 174639 173744 173833 174511 175314 176598 178392 179901 181002 182673 185036 186465 185586 182809
55586 182809 179092 174646 169620 164608 159594 153774 147150 140937 135768 130977 126252 122319 119247 115849
55572 115849 111667 107874 105140 102226 97850 92508 87355 82639 78355 75139 73380 72487 71933 71884 72089
55557 72089 71488 69810 68234 67593 67239 66543 66121 66552 67195 67349 67333 67384 66680 64548 61598 58717 55953 53288
55539E3288j934r22o33q41m92K07M6r84j677j668j639j665j173l86n9j7M41R87
55521D0879Q19K15n7k68q99j125j20R60N39n98m66P78J250O30L13N58J44r58j201
55502D1393j12R78J171R53O31o2o80l55M58M58k25k84K77J22q19j039j15N82L33
55483D3665J70Q90J809K166K127J894J267N11K95N56P20R81J843K580J921K11
55467F3606q56o73j91J4K68M10j76j051j091m48l64r95j358j401k063l183l444
55450D7004k689k226k532k593j924j289j029n67L0r6q08q59j7N26J64m38r47j696
55432B8014k215j481j5L57o46j262o13K0l61q54m85J60J88k19o61j278j925j895
55414A4829j194p61r31j030q11p88q95m74J30j77j074r00N79J608J243O23O06
$$ plain form
55539 53288 51354 50432 49799 48958 48466 48673 48719 47735 46058 44390 42751 41086 39913 39527 39468 39451 39892 40879
55521 40879 41698 41913 41856 41588 40689 39564 39444 40404 40943 40345 39879 40657 41907 42537 42850 43408 43552 42594 41393
55502 41393 41281 42259 43430 44383 45014 44952 44272 43917 44375 44833 44608 44324 44601 44723 43904 42865 42750 43332 43665
55483 43665 43835 44725 46534 48700 50827 52721 53988 54499 54794 55350 56070 57051 58894 61474 63395 63606
55467 63606 62750 62077 61886 61900 62168 62578 62402 61351 60260 59812 59448 58453 57095 55694 53631 50448 47004
55450 47004 44315 42089 39557 36964 35040 33751 32722 32155 32185 32089 31281 30422 30405 30931 31095 30657 29710 28014
55432 28014 25799 24318 24303 24660 24014 22752 22139 22159 21798 20944 20459 20619 20807 20588 19927 18649 16724 14829
55414 14829 13635 12874 11943 10913 10102 9314 8419 7945 8075 7898 6824 5924 6503 8111 9354 9977 10583
55397A0583L24q08j703j480r31q73o87J95R52Q49N82Q32Q92R3o74l89L02J48o65
55378G542r19k65N41Q63P93P78J118J569J329O8j220j374q21q74j436j140J88
55361F740J081Q37M46O09N84j55r03j125j182j012J57J959K598J398n3l47q6k10
55343A1336k42L99R75P13J84R5J8m49o41k10k02j308k339j911n74J82Q5q3O2M40
55323F530J068J596J201j19j151j260j319j940k194A040n13a39r31M3F23K266
55307B889J770J325J219O92l82j163j126n81NK59j22r08j251q05k73k25j99K52
55289A376N52J12n63F95a00j011r52j24Q76c4A258J397J213L43m95m73l9j40o71
55270B393r02F71a46o97j32L82K21k21k45l4j02j08M79E24R09R4j98L08Q13P48
$$ plain form
55397 10583 10907 10099 8396 6916 5985 5112 4425 4620 5572 6421 7003 7835 8727 8820 8146 7757 8059 8207 7542
55378 7542 6623 6358 6899 7762 8555 9333 10451 12020 13349 13417 12197 10823 10002 9128 7692 6552 6740
55361 6740 7821 8658 9104 9713 10297 10142 9239 8114 6932 5920 6077 8036 10634 12032 11979 11632 11546 11336
55343 11336 11094 11493 12468 13181 13365 13460 13478 13029 12388 12178 11976 10668 8329 6418 5844 6026 6111 6028 6090 6530
55323 6530 7598 9194 10395 10276 9125 7865 6546 4606 2412 1040 527 -139 -1070 -1027 623 2889
55307 2889 4659 5984 7203 7895 7513 6350 5224 4643 4648 4907 4785 3877 2626 1821 1548 1323 1124 1376
55289 1376 1928 2040 1477 695 -100 -1111 -2063 -2187 -1311 -34 1258 2655 3868 4211 3716 3243 3204 3064 2393
55270 2393 1491 671 -146 -843 -975 -593 -372 -593 -838 -872 -974 -1082 -603 524 1433 1527 1329 1637 2450 3198
55250C198L04k52q29A194h2j096p99k80K88L89O7R3g10D06Q65O89J162J571J166
55231E859M73K28%q15j531j140o9M18Q0l16l59j50L84J112J184P0j264j510q49
55212A805m27m51j16P99J508J360M69o28j272r41L0N26M1n99n81k38n4L89J323
55193B943J760R18k48m10L1j62q23p67N6N50L23l2k74n72m74N99J900J946O63
55174G927n01n79jN00O66L44m12r28n86R8J72k49l04N6J57k5N7K64jm06j0R99
55152G238J345O24j62k84j58k18k35r5j46l77k68J94L38m2l20j03K02K41K59M69
55132H502O14M55R2l24n96k62Q60J936J790M12r28j224o81j17k7l49o07l62J65
55113I349K30k51k99P20J928K101J358O10M9o00r23m59Ko33j741j593j6J243J010
$$ plain form
55250 3198 3502 3250 2421 1194 -82 -1178 -1977 -2257 -1969 -1580 -1513 -1420 -710 406 1271 1960 3122 4693 5859
55231 5859 6332 6560 6560 5745 4214 3074 3005 3423 3503 3187 2828 2678 3062 4174 5358 5428 4164 2654 1805
55212 1805 1378 927 811 1610 3118 4478 4947 4319 3047 2106 2136 2662 2703 2104 1523 1285 1231 1620 2943
55193 2943 4703 5621 5373 4963 4994 4832 4009 3242 3298 3848 4171 4139 3865 3293 2819 3418 5318 7264 7927
55174 7927 7426 6847 6846 7346 8012 8356 7944 7016 6430 6528 6700 6451 6147 6203 6360 6335 6392 6656 6655 6249 6239 7238
55152 7238 8583 9207 9045 8761 8603 8385 8150 8055 7909 7532 7264 7458 7796 7754 7434 7331 7533 7774 8033 8502
55132 8502 9116 9571 9663 9339 8743 8481 9341 11277 13067 13479 12551 11327 10646 10529 10502 10153 9546 9184 9349
55113 9349 9579 9328 9029 9749 11677 13778 15136 15746 15795 15195 14272 13813 13815 13182 11441 9848 9832 11075 12085
55094A2085Oo82r24r33n67O6L42L4k83q2N17J160J511J132o0j222j338n66J00
55075A0296L60P01J186J314J083R44P32j16j221j524r25l83k46J13P72R23M57
55058A4466L54R82J390R33L26L19N71N50M68N29K82m88j061p64J14R79J695K162
55040B3807J947J080L56K86L92J81L9M95J227J471R39q2j097j456p54M63J026
55023C0320N55q4q5K19J12m49r51j030o00K70J204J678J592J288R85O50M53O21
55005C6748Q61O22j7m59n77p40r28p30k66l7P8N55R86M31p80j100n7R29O51l38
54985C5832r52j131j206r90m16j25m88q34n32j8J08J74O33J045Q11L23L67Q71
54967C3472J205J238J244J145P03J56l8J60M71P41P92M29qK77J282J800R70l67
$$ plain form
55094 12085 12091 11409 10485 9552 8985 9051 9393 9427 9144 9062 9579 10739 12250 13382 13322 12100 10762 10196 10296
55075 10296 10656 11357 12543 13857 14940 15884 16616 16500 15279 13755 12830 12447 12201 12314 13086 14009 14466
55058 14466 14820 15802 17192 18125 18451 18770 19341 19891 20359 20888 21170 20682 19621 18857 18971 19950 21645 23807
55040 23807 25754 26834 27190 27476 27868 28049 28088 28583 29810 31281 32220 32138 31041 29585 28831 29294 30320
55023 30320 30875 30791 30706 30925 31037 30588 29637 28607 28007 28277 29481 31159 32751 34039 35024 35674 36127 36748
55005 36748 37609 38231 38214 37755 37178 36438 35510 34780 34514 34477 34555 35110 36096 36527 35747 34647 34590 35519 36170 35832
54985 35832 34880 33749 32543 31553 31137 31012 30524 29690 29158 29140 29248 29422 30055 31100 31911 32234 32601 33472
54967 33472 34677 35915 37159 38304 39007 39163 39125 39285 39756 40497 41289 41718 41710 41987 43269 45069 46039 45672
54949D5672p51m1O08L52n75j452j743j363p60n61p55o68j00J76l61r54o15L67
54931C6476R00O98M64N83O20K40k41m72o05q39q66k42Q58J632J541R79P32Q50
54913D3308N47n44j583j492k90J118K124K665K692K318K247L006L860L624K517
54898F6117J967K528L174L010K463K415L164M659O663Q327Q764Q383Q465R080
54884A39179Q843P294N843N479N031K997j20k716m314n545o601p194p489p824
54870A32863p876p154o004n150m625m044l469l122k767k214j948k320k652k082
54856G7436q77R2O45J181J729K136K734L839M951N445N658O268P067P352P182
54841A32838P084O843N758L938K191P65p81k461l755m587n450o490p333p814q110
$$ plain form
54949 45672 44921 44880 45488 45840 45265 43813 42070 40707 39947 39386 38631 37963 37863 38039 37678 36724 36109 36476
54931 36476 37376 38074 38538 39121 39741 39981 39740 39268 38663 37824 36958 36716 37574 39206 40747 41726 42458 43308
54913 43308 43855 43311 41728 40236 39946 41064 43188 45853 48545 50863 53110 56116 59976 63600 66117
54898 66117 68084 70612 73786 76796 79259 81674 84838 89497 96160 104487 113251 121634 130099 139179
54884 139179 148022 155316 161159 166638 171669 174666 174546 171830 167516 161971 155370 148176 140687 132863
54870 132863 124987 117833 111829 106679 102054 98010 94541 91419 88652 86438 84490 82170 79518 77436
54856 77436 76559 76651 77296 78477 80206 82342 85076 88915 93866 99311 104969 111237 118304 125656 132838
54841 132838 139922 146765 152523 156461 158652 159417 158636 156175 152420 147833 142383 135893 128560 120746 112636
54826A12636q110p518o555n796n288m612l709k936k331j701j286j516k060k064
54812E7154j422r49j134j454j163k13Q65J445J183L40k54l9N37O07K1o63j074
54795E3787j271j258j021r39j436k195k429j981j418j107q22l81j3J06J01R2R8
54778C7913K76P45J185J079M54j35l31k46q1J22L18M79O91R14Q42M19J80N83J249
54759D6656J467J213R62P82L55r9J05J050J906J960J479J267J755K641L240L155
54743F9894K707K585K919L194L220L592M639N636N840N827O722Q460R807R998
54729A45040R401Q518P331N747L891J839l51k264l469m191m974n730n881n454
54715A49453n154n317n499n318m842m081k816j246j67p4n74q78n06N38J798K559
$$ plain form
54826 112636 104526 97008 90453 84657 79369 74757 71048 68112 65781 64080 62794 61278 59218 57154
54812 57154 55732 54783 53649 52195 51032 50819 51684 53129 54312 54652 54398 54359 54896 55503 55524 54861 53787
54795 53787 52516 51258 50237 49298 47862 45667 43238 41257 39839 38732 37910 37529 37516 37622 37723 37815 37913
54778 37913 38189 38934 40119 41198 41652 41517 41186 40940 40859 40981 41299 41778 42469 43383 44225 44644 44824 45407 46656
54759 46656 48123 49336 50298 51080 51435 51336 51441 52491 54397 56357 57836 59103 60858 63499 66739 69894
54743 69894 72601 75186 78105 81299 84519 88111 92750 98386 104226 110053 116775 125235 135042 145040
54729 145040 154441 162959 170290 176037 179928 181767 181416 179152 175683 171492 166518 160788 154907 149453
54715 149453 144299 138982 133483 128165 123323 119242 116426 115180 115013 114939 114365 113487 112981 113519 115317 117876
54699A17876K553K421K966L984M550M434M453N277O705Q238R671J0777J1113J0575
54685B05593R601Q554P304N738M098K493N84j900m577o755q117q818r156r272
54671A95370r140q711q156p790p594p107o092n052m582m529m281l714l279l245
54657A12098l474l758l841l297k074r38o49q83p97m52o40j369j669j153o01n94
54641H5909o08m6O82Q95P16O57O71M05Kj11k4j99o11o71j39M05L15k00k70M74
54621H8252J343J426Q23N42J060J631J350M39j09J51Q08J404J883K294K576K698
54605A08571K624K275J842J829K362K844K853K943L760M781M879L975L040K575
54591A51153K167J598J291J368J359J150J359K281L308L795L856L831L727L593
$$ plain form
54699 117876 120429 122850 125816 129800 134350 138784 143237 148514 155219 163457 173128 183905 195018 205593
54685 205593 215194 223748 231052 236790 240888 243381 243965 242065 237488 230733 222616 213798 204642 195370
54671 195370 186230 177519 169363 161573 153979 146872 140780 135728 131146 126617 122336 118622 115343 112098
54657 112098 108624 104866 101025 97728 95654 94716 94067 93184 92387 91935 91295 89926 88257 87104 86503 85909
54641 85909 85301 85255 85937 86832 87548 88205 88876 89281 89283 89172 89148 88949 88338 87667 87528 87933 88248 88048 87778 88252
54621 88252 89595 91021 91844 92386 93446 95077 96427 96866 96757 96908 97716 99120 101003 103297 105873 108571
54605 108571 111195 113470 115312 117141 119503 122347 125200 128143 131903 136684 141563 145538 148578 151153
54591 151153 153320 154918 156209 157577 158936 160086 161445 163726 167034 170829 174685 178516 182243 185836
54577A85836L835M641N556O078O198O078N692N074M444L776K668R25j147l223
54563B36431n210o873p781p940p896q005q027p722p273o871o416n904n533n203
54549A39777m480l313k249j620j116m71L4J33Q1J86L40L62L66L92J19o62j601
54532A26278k222k485k636k773k839k800k678k663l053l769m025l162j682p96
54518H8695r01j322j541j742j970j788j223j072j689k296k166j672j524j642j556
54503F4591j370j470j660j335l84O30J060O66k07p72n17L1j52j083j563q01N74
54486E6238J636K366L012L098K124P15J9J98M92N13O06J044J671K339L000L373
54470H2444L164K655K482K822L286L540L628L615L447L141K770K232J359K59p38
$$ plain form
54577 185836 189671 194312 199868 205946 212144 218222 223914 228988 233432 237208 239876 240801 239654 236431
54563 236431 231221 224348 216567 208627 200731 192726 184699 176977 169704 162833 156417 150513 144980 139777
54549 139777 135297 131984 129735 128115 126999 126528 126562 126695 126776 126962 127302 127664 128030 128422 128541 127879 126278
54532 126278 124056 121571 118935 116162 113323 110523 107845 105182 102129 98360 94335 91173 89491 88695
54518 88695 87794 86472 84931 83189 81219 79431 78208 77136 75447 73151 70985 69313 67789 66147 64591
54503 64591 63221 61751 60091 58756 58372 59002 60062 60728 60521 59749 59232 59263 59111 58028 56465 55664 56238
54486 56238 57874 60240 63252 66350 68474 69189 69208 69406 69898 70411 71017 72061 73732 76071 79071 82444
54470 82444 85608 88263 90745 93567 96853 100393 104021 107636 111083 114224 116994 119226 120585 120844 120106
54455A20106j493k144k813l410l700l482k865k400k647l468m058l779k724j452
54441G9671n41m46j134j773j404k59L23l49j325j381o52j44j78k28n5r0o46j395
54423F7994j740j395n45K29M08Q4r1J99M96L24n7j51LJ20L51J006J786J998J490
54404G2509P85L19L6k86p16j240j779k103j996j458o21L17R93R70L37j60K7N30
54386F6464N85j7r34j841k447k245r90N64J139L39q55j235o41J33L87J53j49l27
54368E8083m92o32n05r5J48o0k31L19J416K169K189J943J765J314L67n10o19r8
54350F6471L70M87N73R73J572J864J447O02K27R16K182L054L230L083K790K302
54334I2143J985K284K791K679K137K134K657K573J640J103J624K172J841J311
$$ plain form
54455 120106 118613 116469 113656 110246 106546 103064 100199 97799 95152 91684 87626 83847 81123 79671
54441 79671 79130 78684 77550 75777 74373 74114 74437 74088 72763 71382 70730 70586 70408 70180 70125 70035 69389 67994
54423 67994 66254 64859 64314 64543 64951 65035 64944 65143 65639 65963 65906 65755 65758 65878 66229 67235 69021 71019 72509
54404 72509 73294 73613 73649 73363 72647 71407 69628 67525 65529 64071 63450 63767 64760 65730 66067 65907 65934 66464
54386 66464 67049 67032 66098 64257 61810 59565 58575 59139 60278 60617 59762 58527 57886 58019 58406 58559 58410 58083
54368 58083 57591 56959 56454 56359 56507 56447 56216 56535 57951 60120 62309 64252 66017 67331 67698 67188 66569 66471
54350 66471 66841 67328 67901 68874 70446 72310 73757 74359 74586 75502 77684 80738 83968 87051 89841 92143
54334 92143 94128 96412 99203 101882 104019 106153 108810 111383 113023 114126 115750 117922 119763 121074
54320A21074J290R24o71k472k790j790j055j193j433j318j198j178r62p32j013
54305A05483j699k271k769l534m197m023l133k293j696j055n69o27p92l46L19
54290G6798K71k27M0J230K222K455K508K599K125J105O57J303K133K277K112K228
54274A01836K371K165J949K122K345K136J519O55m67j440j465o27k03j012k262
54259A09622k758k533k350k367k235k022k046k140j947j694j875k344k545k416
54245G8350k387k584k727k752k847k863k329j193k6O37P35L65n73k000l234l371
54229E1201k248p55J4j10l39p8L93N76N75P47Q75M94r2j7P60J136L28j033j770
54210E0657j577j017n11L2O93J216J268P81M4m62m02N2L70K24j91m58l37J12N75
$$ plain form
54320 121074 122364 123288 122617 120145 117355 115565 114510 113317 111884 110566 109368 108190 107228 106496 105483
54305 105483 103784 101513 98744 95210 91013 86990 83857 81564 79868 78813 78244 77617 76825 76479 76798
54290 76798 77069 76842 76882 78112 80334 82789 85297 87896 90021 91126 91783 93086 95219 97496 99608 101836
54274 101836 104207 106372 108321 110443 112788 114924 116443 117098 116631 115191 113726 113099 112896 111884 109622
54259 109622 106864 104331 101981 99614 97379 95357 93311 91171 89224 87530 85655 83311 80766 78350
54245 78350 75963 73379 70652 67900 65053 62190 59861 58668 58642 59279 60014 60379 59806 57806 54572 51201
54229 51201 48953 48198 48212 48102 47763 47685 48078 48654 49229 49976 50851 51345 51253 51236 51996 53132 53460 52427 50657
54210 50657 49080 48063 47552 47584 48277 49493 50761 51542 51586 51124 50722 50774 51144 51368 51177 50719 50382 50494 51069
54191E1069O31J20n26o38p9O30R59Q53M51j78p82q25m5J059J656J455R13N98N91
54172E7912N72L31m6m72j068j774j986j066O77K001J975Q61m08j170j159l57P29
54155E5552J119L66p39j110o54o1L62P68R83N51m15j193j364j102n79J80Q92J096
54137E4652Q17N01L32J65L0O2J9l80p57n60r5j52n41k01J074K122K050J365R46
54118F1449P96M52j36p36j308j759j741j117k23N86J174J292O61l89j064j182
54102E6755j308j615j537r11m06l19K5R61J567J053J30oN56Q16N39L58N17O20
54084E7795N30N30O05M15Kk11j97l53p22p92k37O63J390J530Q89k31r54o37K05
54065F0220M70l6l60J21P44N84j56m96k16j73r73j970k103j351o98p42j029r32
$$ plain form
54191 51069 51700 51820 51294 50656 50577 51207 52166 53019 53470 53292 52510 51685 51640 52699 54355 55810 56723 57321 57912
54172 57912 58484 58815 58769 58297 57229 55455 53469 52403 53080 55081 57056 57917 57509 56339 55180 54823 55552
54155 55552 56671 57037 56298 55188 54534 54473 54835 55603 56586 57137 56722 55529 54165 53063 52484 52664 53556 54652
54137 54652 55469 55970 56302 56467 56497 56559 56578 56198 55441 54881 54786 54634 54093 53892 54966 57088 59138 60503 61449
54118 61449 62245 62697 62561 61825 60517 58758 57017 55900 55677 56263 57437 58729 59390 59001 57937 56755
54102 56755 55447 53832 52295 51384 50978 50659 50684 51645 53212 54265 54395 54389 54945 55761 56300 56658 57175 57795
54084 57795 58325 58855 59460 59875 59877 59666 59469 59116 58394 57602 57365 58028 59418 60948 61837 61606 60652 60015 60220
54065 60220 60690 60654 60294 60415 61159 61743 61587 61091 60875 60702 59729 57759 55656 54305 53607 52865 51836 50904
54047E0904n16j44K31P41J024O97J37RK12J10l26n10l61m26p57o93r9K05k24o44
54027D9570k66N34Q68N53j7o49j247j404q52m9L02J41m9O3M75R97J192N76o17
54008E0121j379j089k88K40N42R58J130N33l42m41L35J015J017Q19R23J062Q20
53991E5976M01K45K53J6l42j30R42K136K438J832J300J482J839J652J239J454
53975G2733K248K727K595K528K987L579L935M262M625M606M195M089M541M790
53961A24440M283L570L227K873K171J829K433L109K636J391P14Q13P52L16L39
53946A54896J024J398P93k68j100j668k018j848j229q77j154j454j222q53r94
53931A43426j391j250m68J65N6m68o63l50r3l57q10p21k6M48N3q42j431j502j389
$$ plain form
54047 50904 50388 50244 50475 51216 52240 52937 53074 53083 53295 53405 53079 52569 52208 51782 51025 50332 50233 50438 50214 49570
54027 49570 49304 49838 50706 51259 51242 50593 49346 47942 47090 47041 47343 47484 47435 47498 47973 48970 50162 50738 50121
54008 50121 48742 47653 47365 47605 48147 49105 50235 50768 50426 49985 50320 51335 52352 53171 54094 55156 55976
53991 55976 56377 56622 56875 56891 56549 56419 57361 59497 61935 63767 65067 66549 68388 70040 71279 72733
53975 72733 74981 77708 80303 82831 85818 89397 93332 97594 102219 106825 111020 115109 119650 124440
53961 124440 128723 132293 135520 138393 140564 142393 144826 147935 150571 151962 152676 153489 154241 154557 154896
53946 154896 155920 157318 158111 157843 156743 155075 153057 151209 149980 149103 147949 146495 145273 144420 143426
53931 143426 142035 140785 140317 140482 140538 140070 139407 139057 138964 138607 137797 137076 137050 137498 137551 136709 135278 133776 132387
53912A32387j264j035q37r41j212j201q27m40k09R5N55Q07M35n18j564k107j855
53895A20269j058k85K08O46J155J376J052O17P32J384J977K195K291K569L013
53880A38141L382L454L215K977L075L384L532L763M788O401P175O337N180N434
53866B00238O736P054N488L269J854J284Q84M83K37k1n43j115j253p45J99J124
53850B25173J564J428J176J325J796K130K232K433K830L148L222L143K898K344
53836B56842J522N25p73k326l418l354k581k219k475k450j802j500k412l972m967
53821B24640n078m879m714m415m006l993m681n538n581m423k840k073k527l340
53807A66552l519l116k865k995l033k754k579k887l465l885l912l452k544j612
$$ plain form
53912 132387 131123 130088 129251 128310 127098 125897 125070 124630 124421 124516 125071 125878 126313 125795 124231 122124 120269
53895 120269 119211 118926 119134 119780 120935 122311 123363 123980 124712 126096 128073 130268 132559 135128 138141
53880 138141 141523 144977 148192 151169 154244 157628 161160 164923 169711 176112 183287 189624 194804 200238
53866 200238 206974 214028 219516 222785 224639 225923 226807 227290 227527 227506 226963 225848 224595 223850 224049 225173
53850 225173 226737 228165 229341 230666 232462 234592 236824 239257 242087 245235 248457 251600 254498 256842
53836 256842 258364 258889 258116 255790 252372 249018 246437 244218 241743 239293 237491 235991 233579 229607 224640
53821 224640 219562 214683 209969 205554 201548 197555 192874 187336 181755 177332 174492 172419 169892 166552
53807 166552 163033 159917 157052 154057 151024 148270 145691 142804 139339 135454 131542 128090 125546 123934
53793A23934j315j861k750l329l354k949k364j877j663j647j631j537j353r91
53779I5313n10j98j93k02n2j55q62j659j713j057m35j71L6K78K99K48O07J199
53761I0773J153J92q95j344j260r79l36Q10J926K287J843J172P77O78N09q7r32
53744I6287j250n13P41J560J896K508L521M023L451K521K285K829L456L676L556
53729A30547L355L249L240L132K822K558K604K685K337J664J179Q75K75n77j024
53714A58921q26m72k69o3Pn82j685k352k223k086k550l073k989k505k023j388
53698A33842o16m52j212j887j505o95p26j507j876j489j115j122r63m07q2m42
53682A17746r45q72l53j46o25j363j616j085k36K40K50L14O45P54L07j11K93J373
$$ plain form
53793 123934 122619 120758 118008 114679 111325 108376 106012 104135 102472 100825 99194 97657 96304 95313
53779 95313 94803 94605 94412 94210 94158 94003 93141 91482 89769 88712 88277 88106 88142 88420 88719 88967 89574 90773
53761 90773 91926 92118 91223 89879 88619 87640 87304 88114 90040 92327 94170 95342 96119 96797 97306 97219 96287
53744 96287 95037 94524 95265 96825 98721 101229 104750 108773 112224 114745 117030 119859 123315 126991 130547
53729 130547 133902 137151 140391 143523 146345 148903 151507 154192 156529 158193 159372 160247 160522 159945 158921
53714 158921 158095 157623 157354 157291 157298 156716 155031 152679 150456 148370 145820 142747 139758 137253 135230 133842
53698 133842 133226 132774 131562 129675 128170 127475 126749 125242 123366 121877 120762 119640 118677 118270 118188 117746
53682 117746 116801 115929 115576 115430 114805 113442 111826 110741 110505 110745 110995 111309 111954 112708 113015 112904 113197 114570
53664A14570K124J832O90n44j064m62Q47J862K032J868K044K318K009J284J095
53649A32505J770K486K433J888J750K304K928K885K148J296P46L12k79p73p04
53634A53695k72k48q64j375j052r2Q62J560K019J992J239J41n47m81J02P73J182
53617A58634J137P90N42N25M35J30o7L2J14J3J55P76J242R31L82O23J662K471
53599A70527K437J935J430Q61J26m74n63j42M89R25Q63M22J95N53J034R29L02
53582A81849j14j3Q2l81j319k188k461j865n66P10J187P03k80j157j451q54L60
53565A72242J197Q87r7n01J85J292K041K369K539K581K472K376K316K026J440
53550A95365R49Q83J112J408J921K862L877M230L603K452J540J270J528J972K361
$$ plain form
53664 114570 116694 118526 119216 118672 117608 117146 117993 119855 121887 123755 125799 128117 130126 131410 132505
53649 132505 134275 136761 139194 141082 142832 145136 148064 150949 153097 154393 155139 155451 155172 154399 153695
53634 153695 153423 153175 152311 150936 149884 149792 150654 152214 154233 156225 157464 157605 157058 156577 156679 157452 158634
53617 158634 159771 160561 161103 161628 162063 162193 162126 162158 162272 162285 162440 163216 164458 165389 165771 166394 168056 170527
53599 170527 172964 174899 176329 177190 177316 176842 176279 176137 176626 177551 178414 178836 179031 179584 180618 181547 181849
53582 181849 181735 181722 181804 181423 180104 177916 175455 173590 173024 173734 174921 175624 175344 174187 172736 171882 172242
53565 172242 173439 174326 174229 173728 173913 175205 177246 179615 182154 184735 187207 189583 191899 193925 195365
53550 195365 196314 197197 198309 199717 201638 204500 208377 212607 216210 218662 220202 221472 223000 224972 227333
53535B27333K651K940L358L919M358M290L647K847K310J969J597J424J881K742
53521B67266L182K823K139J641J273R31Q26R39P57J61o9O50J625J796J234Q98
53505B88072J172J590J854K138K395K242J652J103Q81Q48Q89J005J000P79Q69
53490C08489J833L211L895L665L437L772M096L809L241K926K697K242J990K610
53476C51913L883M821M843M335M044M242M594M613M234L937M235N041N875O582
53462D17192P426Q402Q960Q776Q345Q390Q948R496R808J0220J1046J2103J2954
53449E42066J3411J3608J3654J3467J3003J2579J2644J3195J3782J4198J4854
53438F90461J6114J7536J8286J8145J7644J7326J7399J8012J9164K0212K0164
$$ plain form
53535 227333 229984 232924 236282 240201 244559 248849 252496 255343 257653 259622 261219 262643 264524 267266
53521 267266 270448 273271 275410 277051 278324 279255 280081 281020 281777 281938 281869 282519 284144 285940 287174 288072
53505 288072 289244 290834 292688 294826 297221 299463 301115 302218 303099 303947 304836 305841 306841 307620 308489
53490 308489 310322 313533 317428 321093 324530 328302 332398 336207 339448 342374 345071 347313 349303 351913
53476 351913 355796 360617 365460 369795 373839 378081 382675 387288 391522 395459 399694 404735 410610 417192
53462 417192 424618 433020 441980 450756 459101 467491 476439 485935 495743 505963 517009 529112 542066
53449 542066 555477 569085 582739 596206 609209 621788 634432 647627 661409 675607 690461
53438 690461 706575 724111 742397 760542 778186 795512 812911 830923 850087 870299 890463
53427H90463J8895J7520J7084J7336J7290J6730J6356J6524J6566J5780J4555
53416A075099J3929J4195J4615J4609J4528J4871J5212J4707J3385J2124J1338
53405A228612J0505R287Q138P422O680N441M144L453L110K380J179n0j355l157
53391A285789n196o586p062p410q376r826j1143j1894j1950j1482j1077j1346
53379A172441j2291j3347j4086j4436j4373j3948j3593j3753j4178j4214j3754
53368A020468j3174j2375j0874q913p493o925o301m917l342k446k105j646j006
53355I38951n69k80L23J320K381L389M522N813P099Q312R362R931R903R889J0797
53340A021143J2716J4748J5978J6340J6386J6609J7288J8691K0969K3647K5632
$$ plain form
53427 890463 909358 926878 943962 961298 978588 995318 1011674 1028198 1044764 1060544 1075099
53416 1075099 1089028 1103223 1117838 1132447 1146975 1161846 1177058 1191765 1205150 1217274 1228612
53405 1228612 1239117 1248404 1256542 1263964 1270644 1276085 1280229 1283682 1286792 1289172 1290351 1290301 1288946 1285789
53391 1285789 1280593 1274007 1266945 1259535 1251159 1241333 1230190 1218296 1206346 1194864 1183787 1172441
53379 1172441 1160150 1146803 1132717 1118281 1103908 1089960 1076367 1062614 1048436 1034222 1020468
53368 1020468 1007294 994919 984045 975132 967639 960714 954413 949496 946154 943708 941603 939957 938951
53355 938951 938382 938102 938425 939745 942126 945515 950037 955850 962949 971261 980623 990554 1000457 1010346 1021143
53340 1021143 1033859 1048607 1064585 1080925 1097311 1113920 1131208 1149899 1170868 1194515 1220147
53329A220147K6195K5957K6433K8350L0786L2391L2990L3392L3901L3982L3443
53318A557967L3039L3400L4077L4230L3818L3451L3386L3240L2653L1685L0507
53307A921453K9121K7432K5419K3066K0351J7250J3851J0396P284M788K736N31
53295B103678k271n514q618j1260j3777j6789k0329k3482k5188k5456k5504k6449
53283A899041k8168k9696l0397l0392l0061k9643k9226k8666k7603k5975k4409
53272A584805k3664k3733k3918k3673k2970k2009k1036k0353k0018j9593j8612
53261A345226j7204j5813j4555j3366j2423j1770j0842r234p683p362q235r135
53249A207604r350r115q587p627o767p067q475r440q827p225n784m743l859l294
$$ plain form
53329 1220147 1246342 1272299 1298732 1327082 1357868 1390259 1423249 1456641 1490542 1524524 1557967
53318 1557967 1591006 1624406 1658483 1692713 1726531 1759982 1793368 1826608 1859261 1890946 1921453
53307 1921453 1950574 1978006 2003425 2026491 2046842 2064092 2077943 2088339 2095623 2100411 2103147 2103678
53295 2103678 2101407 2095893 2087275 2076015 2062238 2045449 2025120 2001638 1976450 1950994 1925490 1899041
53283 1899041 1870873 1841177 1810780 1780388 1750327 1720684 1691458 1662792 1635189 1609214 1584805
53272 1584805 1561141 1537408 1513490 1489817 1466847 1444838 1423802 1403449 1383431 1363838 1345226
53261 1345226 1328022 1312209 1297654 1284288 1271865 1260095 1249253 1240019 1232336 1224974 1216739 1207604
53249 1207604 1198254 1189139 1180552 1172925 1166158 1159091 1150616 1141176 1132349 1125124 1119340 1114597 1110738 1107444
53235A107444l134k718j392N13K153L158L564L468L434M497O905R410J0709J1094
53221A159105J1686J2644J3287J3669J4667J6346J7453J6986J5470J4204J3736
53210A319253J3538J2908J1794J0732J0117R601Q410O242L655J474P5o84j229
53197A405886k087l530n216o548p485q516r741j0686j1249j2023j3267j4333j4664
53184A286541j4668j4964j5381j5415j5098j4730j4281j3746j3575j3937j4141
53173A126605j3583j2759j2417j2255j1527j0459r954j0134j0343j0433j0731
53162A002010j0891j0047q390p309p550q271q377p927p560p399p245p257p711
53149H96076q403q917r264r758j0435j0998j1296j1528j1946j2550j3104j3339
$$ plain form
53235 1107444 1104310 1101592 1100200 1100713 1102866 1106024 1109588 1113056 1116490 1120987 1127892 1137302 1148011 1159105
53221 1159105 1170791 1183435 1196722 1210391 1225058 1241404 1258857 1275843 1291313 1305517 1319253
53210 1319253 1332791 1345699 1357493 1368225 1378342 1387943 1396353 1402595 1406250 1407724 1407799 1407115 1405886
53197 1405886 1403799 1400269 1395053 1388505 1381020 1372504 1362763 1352077 1340828 1328805 1315538 1301205 1286541
53184 1286541 1271873 1256909 1241528 1226113 1211015 1196285 1182004 1168258 1154683 1140746 1126605
53173 1126605 1113022 1100263 1087846 1075591 1064064 1053605 1043651 1033517 1023174 1012741 1002010
53162 1002010 991119 981072 972682 965373 957823 949552 941175 933248 925688 918289 911044 903787 896076
53149 896076 887673 878756 869492 859734 849299 838301 827005 815477 803531 790981 777877 764538
53137G64538j3112j2525j1859j1443j1453j1729j1839j1579j1297j1462j1967
53126F34273j2260j2192j2175j2405j2536j2397j2316j2437j2349j1889j1568
53115D99749j1646j1486j0564r471r087r257r197q743q294p922p481p221p363
53102C82017p332o504n367m879m954m798m512m932n866o016n015m146m449n307
53088C07940n605n267m915m733m483m078l553k927k468k511k758k433j540j105
53074B59564j582j963j246n3K42m81j020o26J43N29O00R23J623K246K304J727
53058B62930Q02j53r33j378j375j092j020j474k163k572k645k713k942l270l755
53043B36247m453n005m979m546m240m041l446k569k301l046l993m132l391k413
$$ plain form
53137 764538 751426 738901 727042 715599 704146 692417 680578 668999 657702 646240 634273
53126 634273 622013 609821 597646 585241 572705 560308 547992 535555 523206 511317 499749
53115 499749 488103 476617 466053 456582 447495 438238 429041 420298 412004 404082 396601 389380 382017
53102 382017 374685 368181 362814 357935 352981 348183 343671 338739 332873 326857 321842 317696 313247 307940
53088 307940 302335 297068 292153 287420 282937 278859 275306 272379 269911 267400 264642 262209 260669 259564
53074 259564 257982 256019 254773 254720 254962 254481 253461 252835 252978 253507 254107 255030 256653 258899 261203 262930
53058 262930 263732 263579 262646 261268 259893 258801 257781 256307 254144 251572 248927 246214 243272 240002 236247
53043 236247 231794 226789 221810 217264 213024 208983 205537 202968 200667 197621 193628 189496 186105 183692
53029A83692j692j439j774k526l127l150k754k289j808j257p63m80l81m89r24
53014A58839j502j752j594j547j915k221j950j353j023r77q05m41k27k75l42l06
52998A40609l77p16j218j649j828j676j223o05O2O72J029R42N14Q5k28n85r87
52981A32821j054n05M42J316J764J599P98k71r79j072r05r08j082j206j177q75
52965A28706j88O03Q11K25l91j78P31J399J228M36m41j001j009n12N0K61L03P43
52947A31776J631K211J818P08k39n57m43j23O07J835K869K698J206m74j083m72
52931A43968M93J011J014R57J210J660J730J086L05M43J619K644K538J862J870
52916A64410K752L627L909L756L329K655K156K315K684K262J002q4n49j056j894
$$ plain form
53029 183692 182000 180561 178787 176261 173134 169984 167230 164941 163133 161876 161113 160633 160252 159763 158839
53014 158839 157337 155585 153991 152444 150529 148308 146358 145005 143982 143005 142200 141759 141532 141257 140915 140609
52998 140609 140232 139516 138298 136649 134821 133145 131922 131317 131379 132051 133080 134022 134536 134621 134393 133808 132821
52981 132821 131767 131262 131704 133020 134784 136383 137181 136910 135931 134859 133954 133046 131964 130758 129581 128706
52965 128706 128518 129121 129932 130157 129766 129588 130319 131718 132946 133382 132941 131940 130931 130419 130469 130730 131033 131776
52947 131776 133407 135618 137436 138144 137905 137348 136905 136782 137389 139224 142093 144791 145997 145523 144440 143968
52931 143968 144461 145472 146486 147443 148653 150313 152043 153129 153434 153877 155496 158140 160678 162540 164410
52916 164410 167162 170789 174698 178454 181783 184438 186594 188909 191593 193855 194857 194773 194224 193168 191274
52901A91274k189j304o2L58m5n08q14j271j844k159k130j949j679j421j512j919
52885A70826j881q40O06J321J016L30j56l57k95J6L51M04R4m76j201j718j465
52868A66575m05O20Q28M41J65J09j08m91p18q37j186j597j489p48L1M37O86J104
52850A63417J562J726J577J442J596J885J769Q83m12j331j582j520j285m91Q17
52835A70053J605R95l98j127o69K16P42R28J125J370J440J159N83J28L49J289
52819A79788K237K519K262J982J713J222P41P53J158J385J320J414J783J899J376
52804B03552N77J07J69N52R56J186J286J526K055K679L136L496L914M200M045
52789B33436L491K773J911R30K54K62N95N59J50kK76L35l18j295j827j640j057
$$ plain form
52901 191274 189085 187781 187719 188077 188032 187524 186710 185439 183595 181436 179306 177357 175678 174257 172745 170826
52885 170826 168945 168105 168711 170032 171048 171378 171222 170865 170570 170586 170937 171341 171435 170959 169758 168040 166575
52868 166575 166170 166790 167618 168059 168224 168333 168225 167734 167016 166179 164993 163396 161907 161159 161190 161627 162313 163417
52850 163417 164979 166705 168282 169724 171320 173205 174974 175857 175445 174114 172532 171012 169727 169236 170053
52835 170053 171658 172653 172255 171128 170459 170675 171417 172345 173470 174840 176280 177439 178022 178150 178499 179788
52819 179788 182025 184544 186806 188788 190501 191723 192464 193217 194375 195760 197080 198494 200277 202176 203552
52804 203552 204129 204236 204405 204957 205913 207099 208385 209911 211966 214645 217781 221277 225191 229391 233436
52789 233436 236927 239700 241611 242541 242795 243057 243652 244211 244361 244359 244635 244970 244652 243357 241530 239890 238833
52772B38833n64m43o59j007j453k111k809l019k622k349k875l746l878l001j932
52757B06365j444j497j679j760j673j430j185j016p08j46J85l05j397k163k062
52742A88085j435r19q62j308k015k523k591k550k718k693j866n23L50K99j94n92
52726A65945q34r93j052j130j264j055k24N61L67o12j320j589k315l623m169l039
52710A43654j225k78k99k87Q5K40q2l89l26k81p58j536j757p99Q88J976J515j08
52692A40233j756k886l720m255m002k957j967j693j791j598j048m70kL03K00l95
52676A12196j115j549j648j461r28k36J32P6R7M82P77N39J07J07N27Q43P52L83
52658A10081m4l78n68p53j063j196o39N66J712K316K545K592K295J680J204J066
$$ plain form
52772 238833 238269 237826 237167 236160 234707 232596 229787 226768 224146 221797 218922 215176 211298 208297 206365
52757 206365 204921 203424 201745 199985 198312 196882 195697 194681 193973 193827 194012 193707 192310 190147 188085
52742 188085 186650 185731 184869 183561 181546 179023 176432 173882 171164 168471 166605 166082 166432 166731 166537 165945
52726 165945 165111 164118 163066 161936 160672 159617 159393 159954 160321 159709 158389 156800 154485 150862 146693 143654
52710 143654 142429 142151 141852 141565 141650 141890 141808 141419 141093 140812 140054 138518 136761 135962 136850 138826 140341 140233
52692 140233 138477 135591 131871 127616 123614 120657 118690 116997 115206 113608 112560 112090 112088 112391 112591 112196
52676 112196 111081 109532 107884 106423 105495 105259 105391 105467 105564 106046 106823 107362 107469 107576 108103 108946 109698 110081
52658 110081 110037 109659 109091 108338 107275 106079 105440 106006 107718 110034 112579 115171 117466 119146 120350 121416
52642A21416R48P38P81J025P89r7p93p09m35o47r76q78p78j308k054k210j920
52625A12892j829j762j089j47j3r82k254l112l413l109k258j395r84p04j97j18
52609H9526j228k720k891j518j46R7l44p90j268j683j409m48J61j71p28q26r07
52592G2707j461j830j181K7O14L60L8J82O36J169J630J697J140L06k11l24l53
52575G5146l56r2M66R91J159Q21J02m78k48P83J663J573Q18K98K30L9n97j284
52557H1034j532j304q67n17m49o28p18m38K3K37J20o9j87k81k15K96J141J702
52539G7348J467N70l79r17j022r93j012q50o9J326K574K768J759K53q84j205p21
52522H0013K14R81J001K34p29j219j044m84J12O04J016J365J526J375J013P69
$$ plain form
52642 121416 122364 123102 123883 124908 125697 125600 124807 124098 123663 123016 122040 121162 120384 119076 117022 114812 112892
52625 112892 111063 109301 108212 108065 108052 107070 104816 101704 98291 95182 92924 91529 90545 89841 89644 89526
52609 89526 88298 85578 82687 81169 81023 81120 80776 79986 78718 77035 75626 75178 75339 75168 74440 73614 72707
52592 72707 71246 69416 68235 68262 68876 69236 69274 69456 70092 71261 72891 74588 75728 76034 75823 75499 75146
52575 75146 74790 74698 75164 76155 77314 78135 78237 77759 77511 78294 79957 81530 82348 82646 82876 82915 82318 81034
52557 81034 79502 78198 77331 76814 76365 75737 75019 74581 74604 74841 74961 74892 74705 74424 74209 74505 75646 77348
52539 77348 78815 79385 79006 78089 77067 76074 75062 74212 74143 75469 78043 80811 82570 82823 81939 80734 80013
52522 80013 80227 81208 82209 82443 81714 80495 79451 78967 79079 79683 80699 82064 83590 84965 85978 86747
52506H6747Q61J099J101P79M39L68M76M14%n07n91JR09J479J459J238J249J389
52488I8910J318J125J289J887K286J865Q46O1NL60N28M32N26J121J907K299K099
52471A18864J610J093M94j48l58K95J429K009J431K20o01n77q0L73O57R00J118
52454A28729J209J147R82O96K57k17m87m63k89j07J14M74R20J263J290Q42k2r34
52436A35404j385j259r76j001j315j618j789j801j351j03J575K668K537J585O63
52421A31834J74M9K03N16O20K11l90n22n0M67N77M65M71N28M19L40O52J160J121
52402A38845J94q98j041K8J410K000J607R55P54R62J024N94o2l58j4O68J116J081
52384A48865Q14O03L83K1j68L28J365K006J597O28Q3K05L90K68J85M81Q91J005
$$ plain form
52506 86747 87608 88707 89808 90587 91026 91394 91870 92284 92284 91777 91186 91187 92096 93575 95034 96272 97521 98910
52488 98910 100228 101353 102642 104529 106815 108680 109526 109587 109592 109952 110480 110912 111438 112559 114466 116765 118864
52471 118864 120474 121567 122061 121913 121555 121850 123279 125288 126719 126939 126338 125761 125681 126054 126711 127611 128729
52454 128729 129938 131085 132067 132763 133020 132803 132316 131853 131564 131457 131571 132045 132965 134228 135518 136360 136338 135404
52436 135404 134019 132760 131784 130783 129468 127850 126061 124260 122909 122806 124381 127049 129586 131171 131834
52421 131834 132008 132057 132260 132776 133396 133607 133217 132695 132645 133112 133689 134154 134625 135153 135572 135912 136564 137724 138845
52402 138845 139039 138141 137100 137128 138538 140538 142145 143100 143854 144816 145840 146434 146372 146014 146000 146668 147784 148865
52384 148865 149679 150282 150665 150686 150518 150846 152211 154217 155814 156442 156525 156730 157120 157388 157573 158054 158945 159950
52366A59950R74J257J871K299K136J510Q76O54R91J602J869J414N83J07K38O06
52350A78937Q80J124J312J015j0j190j681j386r41p20m22J72N63J36r69j924k087
52333A72809j502o09J62N61N67M18L56L64K56J1j80k45l48n77p49o05o4P07J376
52314A72708J519R58P3m57l43L7K54L91P76J317J495J024K36j85J45R14J291P48
52296A82901j57j80J128K719L275K860K632L042L265K610J707J689K669L700L977
52281B17837L534K850K285J939J735J612J712K263L162L873M032L799L401K725
52267B56759J838J503K421M084N129M934M216L894M060M273M319M214L901L379
52253C08924K927K899L415M382N539O495P044P516Q319R121R125Q428Q338R786
$$ plain form
52366 159950 160924 162181 164052 166351 168487 169997 170873 171527 172518 174120 175989 177403 177986 178093 178331 178937
52350 178937 179817 180941 182253 183268 183258 182068 180387 179001 178060 177340 176918 177090 177653 177789 176820 174896 172809
52333 172809 171307 170698 170860 171421 171988 172406 172762 173126 173382 173393 173213 172968 172620 172043 171294 170689 170625 171332 172708
52314 172708 174227 175185 175258 174801 174458 174495 174749 175140 175916 177233 178728 179752 179988 179803 179948 180862 182153 182901
52296 182901 182744 182564 183692 186411 189686 192546 195178 198220 201485 204095 205802 207491 210160 213860 217837
52281 217837 221371 224221 226506 228445 230180 231792 233504 235767 238929 242802 246834 250633 254034 256759
52267 256759 258597 260100 262521 266605 271734 276668 280884 284778 288838 293111 297430 301644 305545 308924
52253 308924 311851 314750 318165 322547 328086 334581 341625 349141 357460 366581 375706 384134 392472 402258
52239D02258J2007J3448J3522J2793J1901J1149J0935J1672J3110J4452J5275
52228E42522J5838J6486J7231J7978J8641J9003J8938J8709J8622J8473J7997
52217G40438J7681J8257J9272J9272J7742J5976J5352J5540J5269J4242J3305
52206I22346J2981J2804J2152J0907R164O958M605K789J988K009K308K476K284
52193A005771J582M52p09j511j920k074j926j291l03M68N57J83J19R08K370L860
52177A006536M906N548O162P121Q468R819J0677J1009J1326J2000J2733J2956
52165A119261J2568J1892J1032R831Q433P375O863O439N540M107K468R65j89j067
52151A205518k192m086o421q117q629q747r599j1208j2581j3023j2835j2717j3004
$$ plain form
52239 402258 414265 427713 441235 454028 465929 477078 488013 499685 512795 527247 542522
52228 542522 558360 574846 592077 610055 628696 647699 666637 685346 703968 722441 740438
52217 740438 758119 776376 795648 814920 832662 848638 863990 879530 894799 909041 922346
52206 922346 935327 948131 960283 971190 980354 987312 991917 994706 996694 998703 1001011 1003487 1005771
52193 1005771 1007353 1007805 1007096 1005585 1003665 1001591 999665 998374 998071 998539 999096 999279 999398 1000306 1002676 1006536
52177 1006536 1011442 1016990 1023152 1030273 1038741 1048560 1059237 1070246 1081572 1093572 1106305 1119261
52165 1119261 1131829 1143721 1154753 1164584 1173017 1180392 1187255 1193694 1199234 1203341 1205809 1206774 1206585 1205518
52151 1205518 1203326 1199240 1192819 1184702 1176073 1167326 1157727 1146519 1133938 1120915 1108080 1095363 1082359
52138A082359j3566j4136j4588j4927j5086j4770j3772j2484j1695j1592j1384
52127I34359j0299q683p589p468p727p576o883o129n883o277o795o645n642m522
52113H36241m038l895l220j995j352k153l781m832m652l817l194k981k807k450
52099G91074k121k026j982j790j739k275l129l400k711j827j694k311l083l774
52085G57212m415m564l624j938o98n55r34j064r64j061j357j551j610j688j670
52070G29519j288o51k44m08j031j723k185k402k613k975l224k845j782p05l03
52055G05140m52m48K3N53P78J010J776K920L676L718L661M315N717P237Q439R353
52039G57416J0030J0489J1043J2134J3582J4676J5263J6094J7605J9059J9642
$$ plain form
52138 1082359 1068793 1054657 1040069 1025142 1010056 995286 981514 969030 957335 945743 934359
52127 934359 924060 915377 907788 900320 892593 885017 878134 872005 866122 859845 853050 846405 840763 836241
52113 836241 832203 828308 825088 823093 821741 819588 815807 810975 806323 802506 799312 796331 793524 791074
52099 791074 788953 786927 784945 783155 781416 779141 776012 772612 769901 768074 766380 764069 760986 757212
52085 757212 752797 748233 744609 742671 741973 741418 740484 739420 738456 737395 736038 734487 732877 731189 729519
52070 729519 728231 727580 727336 726928 725897 724174 721989 719587 716974 713999 710775 707930 706148 705443 705140
52055 705140 704688 704240 704263 704816 705594 706604 708380 711300 714976 718694 722355 726670 732387 739624 748063 757416
52039 757416 767446 777935 788978 801112 814694 829370 844633 860727 878332 897391 917033
52028I17033J9862K0847K2529K3569K3240K2333K1906K1958K1849K1364K0785
52017A157275K0233J9526J8430J6788J4556J2053R905Q452P327N891L998K106
52005A296540P13j28q43j939l519n206o621p827r034j0023j0356j0143j0040j0305
51991A211269j0357r584q219p071o588o554o402n723m567l434k767k282j211O36
51977A137146K484L557M002M476N120N530N542N506N756O232O687O931O846O434
51963A212249N896N430M961M243L258K322J665J056j7j767l784n384o348p172
51949A216608q446j0069j1392j2090j2568j3406j4705j6084j7143j7792j8401
51938A064512j9564k1451k3343k4233k3950k3318k3085k3242k3507k3847k4076
$$ plain form
52028 917033 936895 957742 980271 1003840 1027080 1049413 1071319 1093277 1115126 1136490 1157275
52017 1157275 1177508 1197034 1215464 1232252 1246808 1258861 1268766 1277218 1284545 1290436 1294434 1296540
52005 1296540 1297253 1297125 1296282 1294343 1290824 1285618 1278997 1271170 1262136 1252113 1241757 1231614 1221574 1211269
51991 1211269 1200912 1191328 1183109 1176038 1169450 1162896 1156494 1150771 1146204 1142770 1140003 1137721 1136510 1137146
51977 1137146 1139630 1143187 1147189 1151665 1156785 1162315 1167857 1173363 1179119 1185351 1192038 1198969 1205815 1212249
51963 1212249 1218145 1223575 1228536 1232779 1236037 1238359 1240024 1241080 1241063 1239296 1235512 1230128 1223780 1216608
51949 1216608 1208162 1198093 1186701 1174611 1162043 1148637 1133932 1117848 1100705 1082913 1064512
51938 1064512 1044948 1023497 1000154 975921 951971 928653 905568 882326 858819 834972 810896
51927H10896k3577k2134k0636k0257k1059k1948k1996k1241k0227j9318j8577
51916E79926j7904j7113j6145j5278j4873j4924j5021j4796j4117j2980j1530
51905D15245j0170r337r070r052r034q991q860q507p959p409o893o253n491m895
51891C03324m703m793m823m598m244m074m217m346l906k861k010k225l377m368
51877B48779m268l185j949j309j517k277k853k512j251J7K97m99j614k412k826
51862B20621k873k308j151j38qm53m68J57M12m33j662k060j538r64p38n22l37
51845B05537p49j692k166j606p57n81j013j474j939k540k769k035q68m84j187
51830A83677k024k129j585q95l37j10m12r98j187o33K54Q83J068Q39K17n26q15
$$ plain form
51927 810896 787319 765185 744549 724292 703233 681285 659289 638048 617821 598503 579926
51916 579926 562022 544909 528764 513486 498613 483689 468668 453872 439755 426775 415245
51905 415245 405075 395738 386668 377616 368582 359591 350731 342224 334265 326856 319963 313710 308219 303324
51891 303324 298621 293828 289005 284407 280163 276089 271872 267526 263620 260759 258749 256524 253147 248779
51877 248779 244511 241326 239377 238068 236551 234274 231421 228909 227658 227675 227972 227473 225859 223447 220621
51862 220621 217748 215440 214289 214151 214143 213690 213222 213379 213791 213358 211696 209636 208098 207134 206396 205874 205537
51845 205537 204788 203096 200930 199324 198567 197986 196973 195499 193560 191020 188251 186216 185348 184864 183677
51830 183677 181653 179524 177939 177044 176707 176597 176185 175187 174000 173367 173621 174504 175572 176411 176628 176102 175287
51813A75287l79L16O58N85L95J46l07p79p83p7J003J814J840R54l59j147p02O20
51795A79085J615J498P11K51M08O29N41M30N59O35M25L66Q45J246O39o94j318
51778A87871n52O92J242J055P25M17O1j6M85J152J395J338J420J409P34l59r43
51761A98126p23l93n04q13r09q30p47o66o48q40j049p76Q1J053J626J609R21j93
51743A94325q47k03J222J826R24k78l30N96J198Q86J91l12o35q87r46p98o92p16
51725A94524n39Q5Q51J142P70K46K19O94J064Q88L84o5m09o43l97N41J487J478
51707B02320N80j97l28k88m65m74j1M53M61L72O87J147J207R99J042J304J326
51690B10135J089J063J455J960K251K271K090J855J779J905K045K197K675L434
$$ plain form
51813 175287 174908 175224 175882 176467 176862 177008 176701 175922 175139 175062 176065 177879 179719 180673 180314 179167 178465 179085
51795 179085 180700 182198 182909 183160 183568 184197 184738 185168 185727 186362 186787 187153 187998 189244 189883 189189 187871
51778 187871 187319 188011 189253 190308 191033 191450 191511 191495 191980 193132 194527 195865 197285 198694 199428 199069 198126
51761 198126 197403 197010 196506 195693 194784 193954 193207 192541 191893 191053 190004 189228 189309 190362 191988 193597 194518 194325
51743 194325 193478 193275 194497 196323 197247 196969 196639 197235 198433 199319 199510 199198 198563 197676 196730 195932 195240 194524
51725 194524 193985 194070 194921 196063 196833 197079 197298 197992 199056 199944 200328 200263 199854 199211 198814 199355 200842 202320
51707 202320 202900 202703 202375 202087 201622 201148 201137 201590 202051 202423 203110 204257 205464 206463 207505 208809 210135
51690 210135 211224 212287 213742 215702 217953 220224 222314 224169 225948 227853 229898 232095 234770 238204
51676B38204L792L302K542K335K600K678K552K833L604M232M368M449M968N879
51662B88338O851P543P592O899N973N462N321N061M769M957N368M924L288J535
51648C63881P29N81J82o20j399k105k916l456l106k097j428j559j871j702j307
51633C41807j431k244l126l334k625j288J42J145J466J290J147J424J928K135
51619C38436J969K009K727L730M144L579K297O39j166k687l519l867m257m510
51605C39524l854k337j189j183j444p70N32J181R01O73J090J654J852J930K139
51590C40699K059J311L27j60j28k73j184k721m035m176l076j923k088l529m845
51575C16258n080m719m619m768m732m603m667m671m284l921m102m315l588k149
$$ plain form
51676 238204 241996 245298 247840 250175 252775 255453 258005 260838 264442 268674 273042 277491 282459 288338
51662 288338 295189 302732 310324 317223 323196 328658 333979 339040 343809 348766 354134 359058 362346 363881
51648 363881 364610 365191 365373 364753 363354 361249 358333 354877 351771 349674 348246 346687 344816 343114 341807
51633 341807 340376 338132 335006 331672 329047 327759 327901 329046 330512 331802 332949 334373 336301 338436
51619 338436 340405 342414 345141 348871 353015 356594 358891 359530 358364 355677 352158 348291 344034 339524
51605 339524 335670 333333 332144 330961 329517 328747 329279 330460 331361 332034 333124 334778 336630 338560 340699
51590 340699 342758 344069 344396 344236 344108 343835 342651 339930 335895 331719 328643 326720 324632 321103 316258
51575 316258 311178 306459 301840 297072 292340 287737 283070 278399 274115 270194 266092 261777 258189 256040
51561B56040j339j729k316k112j494j415j946k370k294j975j789j908k325k774
51547B28254k800k261j565j105p26j27N08P07L20m33j347k150k322j589m95Q5
51531B12954lj13J99O33P17M42N9l29p11r37q20l36L54J036J464J502J284J128
51513B18523J221J506J880K281K640K922L186L433L416K887K086J633J853K386
51499B51853K588K101J024k62j308j849j982j972j943j864j813j948k218k354
51485B38053k183j752j154n05k8J50K45N00P09N23K52P05K009L243L561L199K917
51468B50444K962L086L230L504L678L365K710K301K303K188J509N66k1j17j22
51453B81586l70p43r47r70j060j329j548j437j031o07l50k97m24o08n20O9Q97
$$ plain form
51561 256040 254701 252972 250656 248544 247050 245635 243689 241319 239025 237050 235261 233353 231028 228254
51547 228254 225454 223193 221628 220523 219797 219670 220178 220885 221205 220772 219425 217275 214953 213364 212869 212954
51531 212954 212951 212838 213037 213670 214387 214829 214888 214559 213848 212911 212091 211755 212109 213145 214609 216111 217395 218523
51513 218523 219744 221250 223130 225411 228051 230973 234159 237592 241008 243895 245981 247614 249467 251853
51499 251853 254441 256542 257566 257304 255996 254147 252165 250193 248250 246386 244573 242625 240407 238053
51485 238053 235870 234118 232964 232459 232431 232581 232826 233326 234035 234558 234810 235515 237524 240767 244328 247527 250444
51468 250444 253406 256492 259722 263226 266904 270269 272979 275280 277583 279771 281280 281846 281825 281708 281586
51453 281586 281216 280473 279526 278556 277496 276167 274619 273182 272151 271544 271194 270897 270473 269865 269345 269414 270311
51436B70311J438J491J252Q72L67k5rJ63j08q48j358j333j376j976k610k527j898
51419B61826j404j141p56l50m10r34j386j511j403q52M39J998K760K411J790J706
51403B62783K071K501L004L580L772L237K321J610J334J563K518L996N057M997
51389C04344M367M260M747M899M292L625L563L740L416K604K002K060K601L207
51375C53727L537L295K327Q86m25j122j175q59m41q5J28J85J45M3j00j51J15O99
51357C60729J216J227P04M5l66m43l54m07r04j867k811l149k876k641k981l772
51341C41350m528m922m878m451l944l787m017m131l794l371l310l319k801j918
51327B88179j522j989k761l150l017k544j964j697k082k663k433j183MJ63k17
$$ plain form
51436 270311 271749 273240 274492 275364 275731 275706 275697 275860 275752 274904 273546 272213 270837 268861 266251 263724 261826
51419 261826 260422 259281 258525 258175 257765 256831 255445 253934 252531 251679 252118 254116 256876 259287 261077 262783
51403 262783 264854 267355 270359 273939 277711 280948 283269 284879 286213 287776 290294 294290 299347 304344
51389 304344 308711 312971 317718 322617 326909 330534 334097 337837 341253 343857 345859 347919 350520 353727
51375 353727 357264 360559 362886 363772 363347 362225 361050 360191 359750 359665 359793 359978 360123 360166 360066 359915 360030 360729
51357 360729 361945 363172 363876 363921 363555 363112 362758 362351 361447 359580 356769 353620 350744 348103 345122 341350
51341 341350 336822 331900 327022 322571 318627 314840 310823 306692 302898 299527 296217 292898 290097 288179
51327 288179 286657 284668 281907 278757 275740 273196 271232 269535 267453 264790 262357 261174 261178 261341 261124
51312B61124p3N74P80L00m8K71P03N60j8n89j266k419l816m794n188n492n974
51295B34635o138n404m087l300l802n059n682m870l280k239k224k486k216j657
51281A82191j621k322l130l408l107k483j756j119p67o96p72j082j789k563k664
51266A52912j911j075q76r91o58J03N58M00M8k39o52j072p76N69K211L106L028
51249A54685K458J722R02K96K81P15J025R43P19N84M80M32P06J365K047K450K772
51232A74582L271L634L258K184J264J152J461J343P41M10O27O21k74j445j867
51217A90962j712k098l211l870l338k578k836l820m257l785l186k975k838k553
51203A47905k434k593k546j977j296j033j138j274j369j465j376r38l79j58m10
$$ plain form
51312 261124 261051 261625 262405 262705 262657 262928 263631 264191 264173 263584 262318 259899 256083 251289 246101 240609 234635
51295 234635 228497 223093 219006 215706 211904 206845 201163 196293 193013 190774 188550 186064 183848 182191
51281 182191 180570 178248 175118 171710 168603 166120 164364 163245 162478 161782 161010 159928 158139 155576 152912
51266 152912 151001 149926 149050 148059 147401 147504 148062 148462 148510 148271 147619 146547 145771 146340 148551 151657 154685
51249 154685 157143 158865 159767 160063 160344 161059 162084 163027 163746 164330 164810 165242 165948 167313 169360 171810 174582
51232 174582 177853 181487 184745 186929 188193 189345 190806 192149 192890 193300 193927 194548 194274 192829 190962
51217 190962 189250 187152 183941 180071 176733 174155 171319 167499 163242 159457 156271 153296 150458 147905
51203 147905 145471 142878 140332 138355 137059 136026 134888 133614 132245 130780 129404 128466 128087 127929 127519
51188A27519q23r51n70J01M62R4o74j008n66J20M04L63M81Q08R10O24L88O76J327
51169A29685J686J375P63N71J055J772K106J852J166K97m32o48l55j34m71r85
51153A39303q83j09N55O26N10P08J007R20M86J09j07l70o68o73k40L70P66Q22
51135A43132O79M65Q7o13j391j553p15N38J187R79N60L82J26m30q09n97l21o71
51117A41035j310j318o58l01p18j205j041n77n89j067j319j027o00m51n14n75
51101A27765o87r59j185r83k80N53J050J000N30n5l85j76N68J472J984J748Q51
51084A32811j83p59o92l60l05o47j068j328j478j523j213m87J90L47J18JJ46K22
51066A23792k9m99r04r76n59J60O42N91L65M02M16j45j007j168k79Q46J313J093
$$ plain form
51188 127519 126696 125745 125175 125276 125738 125832 125158 124150 123584 123704 124108 124471 124952 125760 126670 127294 127682 128358 129685
51169 129685 131371 132746 133509 134080 135135 136907 139013 140865 142031 142328 141896 141248 140893 140759 140288 139303
51153 139303 138420 138311 138866 139492 140002 140710 141717 142637 143123 143232 143125 142755 142087 141414 141174 141544 142310 143132
51135 143132 143811 144276 144363 143750 142359 140806 140091 140629 141816 142795 143355 143737 143863 143433 142624 142027 141706 141035
51117 141035 139725 138407 137749 137448 136730 135525 134484 133907 133318 132251 130932 129905 129305 128854 128340 127765
51101 127765 127078 126119 124934 123951 123671 124224 125274 126274 126804 126749 126364 126188 126756 128228 130212 131960 132811
51084 132811 132628 131869 131177 130817 130512 129865 128797 127469 125991 124468 123255 122768 122958 123305 123423 123424 123570 123792
51066 123792 123763 123264 122360 121384 120825 120985 121627 122218 122583 122985 123401 123256 122249 121081 120802 121648 122961 124054
51048A24054O20J55j03J65R00J437J346J092J388K187K787K696J941Q51j1j2Q76
51031A42369J783J831J220Q57J077J311J006L41j35j66P6K79K61R8J8J16K47K48
51013A52837J47J6j38k82l34l76o06r26r04l42M20R61J202J218J061R96J353J789
50995A58092J337k95k008k524j849q74qR37J844K253K138J870J444N55n34r84
50979A61394m70M20J049J416J818K319K771K949K672K113J882K225K510K102J554
50964A88724J907K991L527K979K182J764J206J39n56O2J406K034J513P15M57P37
50948B11787J205J639J875J809J664J849K459L199L768M130M373M539M623M666
50934B53585M855N432O329P023P114O977P367Q335R137R431R817J0864J2223J3298
$$ plain form
51048 124054 124674 124829 124726 124891 125791 127228 128574 129666 131054 133241 136028 138724 140665 141516 141505 141493 142369
51031 142369 144152 145983 147203 148060 149137 150448 151454 151795 151660 151494 151570 151849 152110 152208 152226 152342 152589 152837
51013 152837 152984 153000 152862 152580 152246 151870 151264 150338 149434 149092 149512 150473 151675 152893 153954 154950 156303 158092
50995 158092 159429 159134 157126 154602 152753 151879 151871 152808 154652 156905 159043 160913 162357 162912 162378 161394
50979 161394 160924 161344 162393 163809 165627 167946 170717 173666 176338 178451 180333 182558 185068 187170 188724
50964 188724 190631 193622 197149 200128 202310 204074 205280 205419 204863 204925 206331 208365 209878 210593 211050 211787
50948 211787 212992 214631 216506 218315 219979 221828 224287 227486 231254 235384 239757 244296 248919 253585
50934 253585 258440 263872 270201 277224 284338 291315 298682 307017 316154 325585 335402 346266 358489 371787
50920C71787J4221J5484J6980J8152J8950J9872K1179K2694K4424K6672K9400
50909E99815L2037L4209L6307L9042M2584M6428M9933N2878N5513N8200O0982
50898A107928O3476O5187O5904O5784O5089O3820O1594N7965N2933M7010M0620
50887A757310L3669K6060J8349J1287M802j868q900j5398k0521k4366k7278k8922
50875A724224k8820k7465k6176k5837k6252k6738k6949k7109k7706k8981l0661
50864A421530l2385l4335l6915l9705m1491m1810m1753m2532m3822m4372m3799
50853I78611m2785m1702m0137l7900l5488l3271l0985k8333k5517k2856k0447
50842F19190j8363j6701j5251j3602j1779j0212q950p522n818m411l631k969j876
$$ plain form
50920 371787 386008 401492 418472 436624 455574 475446 496625 519319 543743 570415 599815
50909 599815 631852 666061 702368 741410 783994 830422 880355 933233 988746 1046946 1107928
50898 1107928 1171404 1236591 1302495 1368279 1433368 1497188 1558782 1616747 1669680 1716690 1757310
50887 1757310 1790979 1817039 1835388 1846675 1851477 1849609 1840709 1825311 1804790 1780424 1753146 1724224
50875 1724224 1695404 1667939 1641763 1615926 1589674 1562936 1535987 1508878 1481172 1452191 1421530
50864 1421530 1389145 1354810 1317895 1278190 1236699 1194889 1153136 1110604 1066782 1022410 978611
50853 978611 935826 894124 853987 816087 780599 747328 716343 688010 662493 639637 619190
50842 619190 600827 584126 568875 555273 543494 533282 524332 516810 510992 506581 502950 499981 498105
50829D98105o43J38N59J249K435L687M546M961N202N651O571P816Q898R579J0156
50814E68910J0904J1585J1970J2572J4143J6510J8547J9570K0198K1468K3448
50803G49825K5304K6579K7910L0244L3671L7434M0950M4474M8524N3064N7656
50792A175635O2305O7617P3995Q1077Q8277R5560J03273J11351J19125J26027
50782B104242J32109J37686J42567J46030J47497J47000J44693J40070J32090
50773C373984J20239J05168Q8060O9591M9959K9672R755q893k5837m0620n2486
50762C718592o0983o6517o9812p1013o9842o6600o2525n8872n5944n3406n1467
50751C031611n1251n3773n8749o4788p0710p6296q1694q6651r0810r4405r7967
$$ plain form
50829 498105 497462 497600 498159 499408 501843 505530 510076 515037 520239 525890 532461 540277 549175 558754 568910
50814 568910 579814 591399 603369 615941 630084 646594 665141 684711 704909 726377 749825
50803 749825 775129 801708 829618 859862 893533 930967 971917 1016391 1064915 1117979 1175635
50792 1175635 1237940 1305557 1379552 1460629 1548906 1644466 1747739 1859090 1978215 2104242
50782 2104242 2236351 2374037 2516604 2662634 2810131 2957131 3101824 3241894 3373984
50773 3373984 3494223 3599391 3687451 3757042 3807001 3836673 3846428 3837535 3811698 3771078 3718592
50762 3718592 3657609 3591092 3521280 3450267 3380425 3313825 3251300 3192428 3136484 3083078 3031611
50751 3031611 2980360 2926587 2867838 2803050 2732340 2656044 2574350 2487699 2396889 2302484 2204517
50740B204517j01380j03698j04024j02196r8651r4027q8951q3674p7891p1395
50730A278630o4883n9464n5175n0818m5673m0601l6744l3855l0734k6980k3304
50719H10399k0335j7976j6005j4432j3132j1792j0436r496r087q734q013o976
50707F63985n804m515l280k534k380k290j737q63j61K81Q47J886L376N034O496
50692F58341P562Q411R450J0829J2327J3846J5655J7887K0104K1806K3172K4857
50680H44247K7097K9500L1726L4015L6808M0113M3576M7079N0947N5453O0313
50669A300874O4944O9155P3289P7538Q1487Q4732Q7478Q9965R1389R0241Q6008
50658B197100P9840P3064O5579N6259M4481L0667J5622J96j4551k7490l8051m6228
$$ plain form
50740 2204517 2103137 1999439 1895415 1793219 1694568 1600541 1511590 1427916 1350025 1278630
50730 1278630 1213747 1154283 1099108 1048290 1002617 962016 925272 891417 860683 833703 810399
50719 810399 790064 772088 756083 741651 728519 716727 706291 696795 687708 678974 670961 663985
50707 663985 658181 653666 650386 647852 645472 643182 641445 640582 640421 640702 641549 643435 646811 651845 658341
50692 658341 665903 674314 683764 694593 706920 720766 736421 754308 774412 796218 819390 844247
50680 844247 871344 900844 932570 966585 1003393 1043506 1087082 1134161 1185108 1240561 1300874
50669 1300874 1365818 1434973 1508262 1585800 1667287 1752019 1839497 1929462 2020851 2111092 2197100
50658 2197100 2276940 2350004 2415583 2471842 2516323 2546990 2562612 2562808 2548257 2520767 2482716 2436488
50646B436488n1980n5091n5735n4691n2745n0197m7067m3489l9753l6283l3683
50635A915774l2464l2591l3647l5529l8586m2890m7755n2315n6247n9548o1894
50624A422308o2714o1835n9814n7487n5352n3267n0619m6921m2440l8096l4572
50613H59191l1618k8505k4977k1472j8419j5732j3056j0341p957o275n120l799
50601F71920j743P58K754L679M017M730O208Q112J0061J1942J3578J4633J5140
50588G65789J5769J7201J9362K1604K3520K5230K6936K8571L0116L1870L4116
50577A040084L6625L8870M0667M2299M3937M5318M6055M6057M5404M4151M2520
50566A511987M0887L9177L6495L2081K6547K1529J7918J5046J1798Q014M348J325
$$ plain form
50646 2436488 2384508 2329417 2273682 2218991 2166246 2116049 2068982 2025493 1985740 1949457 1915774
50635 1915774 1883310 1850719 1817072 1781543 1742957 1700067 1652312 1599997 1543750 1484202 1422308
50624 1422308 1359594 1297759 1237945 1180458 1125106 1071839 1021220 974299 931859 893763 859191
50613 859191 827573 799068 774091 752619 734200 718468 705412 695071 687114 680839 675719 671920
50601 671920 670177 670935 673689 677368 681385 686115 692323 700435 710496 722438 736016 750649 765789
50588 765789 781558 798759 818121 839725 863245 888475 915411 943982 974098 1005968 1040084
50577 1040084 1076709 1115579 1156246 1198545 1242482 1287800 1333855 1379912 1425316 1469467 1511987
50566 1511987 1552874 1592051 1628546 1660627 1687174 1708703 1726621 1741667 1753465 1761479 1765827 1767152
50554A767152r27k291k715k533k223j838j068J18J329K292L116L880M316M116
50540A772724L323K100K70k710p197j2897j9072k5136l0882l6090m0241m3039
50528A561153m5045m7183m9480n0856n0464m8775m6899m5291m3660m1799l9804
50517A051897l7615l5030l2197k9534k7132k4683k2057j9429j6813j4006j1051
50506G82350q356o139m218k394o12J304L522N736P386Q524R866J1712J3411J4316
50492H36408J4691J5245J6235J7506J8983K0576K1882K2631K3175K3970K4858
50481A056160K5379K5582K5872K6157K5956K5379K5215K5904K6981K8000K9393
50470A345978L1910L5510L9352M2821M6062M9531N3351N7325O1314O5393O9652
$$ plain form
50554 1767152 1766225 1763934 1761219 1758686 1756463 1754625 1753557 1753675 1755004 1757296 1760412 1764292 1768608 1772724
50540 1772724 1776047 1778147 1778417 1775707 1768510 1755613 1736541 1711405 1680523 1644433 1604192 1561153
50528 1561153 1516108 1468925 1419445 1368589 1318125 1269350 1222451 1177160 1133500 1091701 1051897
50517 1051897 1014282 979252 947055 917521 890389 865706 843649 824220 807407 793401 782350
50506 782350 773994 767855 763637 761243 760631 761935 765457 771193 778579 787103 796969 808681 822092 836408
50492 836408 851099 866344 882579 900085 919068 939644 961526 984157 1007332 1031302 1056160
50481 1056160 1081539 1107121 1132993 1159150 1185106 1210485 1235700 1261604 1288585 1316585 1345978
50470 1345978 1377888 1413398 1452750 1495571 1541633 1591164 1644515 1701840 1763154 1828547 1898199
50459A898199P3908P7723Q0616Q2319Q2833Q2304Q0774P8082P3987O8391O1364
50448B740500N2964M3222L2333K0807R181k348j3841k5237l6150m6004n4188o0146
50436B661093o3596o4643o3507o0186n4662m7381l9153l0595k2025j3851o637
50425B194857n73M615Q930J1660J1901R251L709m539j4816k5751l6074m5496n4287
50412B063387o2149o8107p1698p3583p4682p5063p4081p1502o8013o4548o1317
50401A298644n7749n3360m8418m3633l9338l5277l1105k6798k2554j8609j5219
50390I06584j2524j0276q001n476k777J15L268O264Q321R319J0168J1734J3851
50377I30570J5882J7689J9324K0294K0105J9438J9773K1610K3817K4995K4938
$$ plain form
50459 1898199 1972107 2049830 2130446 2212765 2295598 2377902 2458676 2536758 2610745 2679136 2740500
50448 2740500 2793464 2836686 2869019 2889826 2899007 2896659 2882818 2857581 2821431 2775427 2721239 2661093
50436 2661093 2597497 2532854 2469347 2409161 2354499 2307118 2267965 2237370 2215345 2201494 2194857
50425 2194857 2194284 2198899 2207829 2219489 2231390 2240641 2244350 2239811 2224995 2199244 2163170 2117674 2063387
50412 2063387 2001238 1933131 1861433 1787850 1713168 1638105 1564024 1492522 1424509 1359961 1298644
50401 1298644 1240895 1187535 1139117 1095484 1056146 1020869 989764 962966 940412 921803 906584
50390 906584 894060 883784 875783 870307 867530 867645 870913 877177 885498 894817 904985 916719 930570
50377 930570 946452 964141 983465 1003759 1023864 1043302 1063075 1084685 1108502 1133497 1158435
50366A158435K4409K3956K3408K2276K0349J7966J5817J4312J3204J1966J0469
50355A356567Q948P548O363N860O542Q142R701J0739J1792J3573J6049J8741K1448
50342A502013K4189K6672K8314K8797K8260K7088K5646K4099K2216J9464J5464
50331A772222J0276M194k543r665j6806k3740l0495l6935m2439m6305m8424m9228
50319A480112m9047m7795m5337m1898l7894l3535k8723k3321j7515j1799o652
50308A136596k232J504M408N996N818L950J084j975m930q132j2088j6728k1253
50295A092018k4773k7047k8544k9821l0934l1412l0716k8870k6598k4721k3311
50284G85271k1794j9877j8049j6824j5911j4598j2768j0903r217p407n403l678
$$ plain form
50366 1158435 1182844 1206800 1230208 1252484 1272833 1290799 1306616 1320928 1334132 1346098 1356567
50355 1356567 1365515 1373063 1379426 1385286 1391828 1399970 1409671 1420410 1432202 1445775 1461824 1480565 1502013
50342 1502013 1526202 1552874 1581188 1609985 1638245 1665333 1690979 1715078 1737294 1756758 1772222
50331 1772222 1782498 1786692 1784149 1774484 1757678 1733938 1703443 1666508 1624069 1577764 1529340 1480112
50319 1480112 1431065 1383270 1337933 1296035 1258141 1224606 1195883 1172562 1155047 1143248 1136596
50308 1136596 1134364 1135868 1140276 1146272 1152090 1156040 1157124 1155149 1150219 1142087 1129999 1113271 1092018
50295 1092018 1067245 1040198 1011654 981833 950899 919487 888771 859901 833303 808582 785271
50284 785271 763477 743600 725551 708727 692816 678218 665450 654547 645330 637923 632520 628842
50272F28842k574j713m86J132K544L210L220L252L993N534P327Q869J0216J1579
50258F84945J2677J3039J2849J2869J3452J4119J4349J4250J4241J4486J4909
50247H36185J5353J5455J4743J3195J1397R852Q414O708M779L042J736P40l11
50234I41288j834l925o017p311p731q016q655r240r237q848q628q664q812r315
50220H35055j0430j1598j1825j0956r923r567r770r929r796r573r491r600r823
50207G02774j0002r967r680r298r015q862q627q001o898n584m349l140j819p02
50193F06830l08m67k89O20J569J839J811K273L149L746L933M135M213L466J962
50178F38482Q54R44J612J702R06k05j130j774k204k559l105l990m970n629n763
$$ plain form
50272 628842 626268 624555 624069 625201 627745 630955 634175 637427 641420 646954 654281 663150 673366 684945
50258 684945 697622 710661 723510 736379 749831 763950 778299 792549 806790 821276 836185
50247 836185 851538 866993 881736 894931 906328 916180 924594 931302 936081 939123 940859 941599 941288
50234 941288 939454 935529 929512 922201 914470 906454 897799 888559 879322 870474 861846 853182 844370 835055
50220 835055 824625 813027 801202 790246 780323 770756 760986 751057 741261 731688 722197 712597 702774
50207 702774 692772 682805 673125 663827 654812 645950 637323 629322 622424 616840 612491 609351 607532 606830
50193 606830 606522 606055 605766 606386 607955 609794 611605 613878 617027 620773 624706 628841 633054 636520 638482
50178 638482 639336 640280 641892 643594 644500 644295 643165 641391 639187 636628 633523 629533 624563 618934 613171
50163F13171n369m532l535k820k578k516k304k068k081k224k055j407n44K35Q78
50148E80251J426J882K241K504K596K429K098J851J846K008K109J889J167O3q92
50133F05468j103n45P0o3j043k212k887k983k904k957l078l092k993k861k759
50118E74058k865l504m673n672n689m886m435n181o526p108o387n038l891l054
50104E05149k244j519j161j134j137j106j337k046l122m352n576o533o898o679
50090D60305o310o153o082n844n554n484n475n079m314l830m027m408m137l116
50076C90492k126j861k178k450k399k263k234k108j657j043o11l48R0Q51J686
50061C71841K308K690K971L300L848M570N021M797M303M474N403N957N260L991
$$ plain form
50163 613171 607802 603270 599735 596915 594337 591821 589517 587449 585368 583144 581089 579682 579138 579373 580251
50148 580251 581677 583559 585800 588304 590900 593329 595427 597278 599124 601132 603241 605130 606297 606360 605468
50133 605468 604365 603820 603890 603827 602784 600572 597685 594702 591798 588841 585763 582671 579678 576817 574058
50118 574058 571193 567689 563016 557344 551655 546769 542334 537153 530627 523519 517132 512094 508203 505149
50104 505149 502905 501386 500225 499091 497954 496848 495511 493465 490343 485991 480415 473882 466984 460305
50090 460305 453995 447842 441760 435916 430362 424878 419403 414324 410010 406180 402153 397745 393608 390492
50076 390492 388366 386505 384327 381877 379478 377215 374981 372873 371216 370173 369562 369214 369304 370155 371841
50061 371841 374149 376839 379810 383110 386958 391528 396549 401346 405649 410123 415526 421483 426743 430734
50047D30734L478L945M514M676M769N056N263N200N044M860M517M122L892L547
50033D93617K700J878K140L496M758N277N654O249O284N245M120M104M947N654
50019E56123O112O854P819Q576R298J0283J0893J0329R237R148J0337J1524J1826
50006F78359J1686J1672J1695J1751J2278J3167J3428J2535J1265J0646J0741
49995H09223J0949J0822J0088Q583O705N360M926M817M457L974L424K217R7j948
49981H83694k753k543k501l051l483l309l157l991n893p901q890q647q140q447
49967H10988r421r769q745p227o592o955p289p013o662o840p195o849n553m063
49953G10815l362l636m139m124l749l697l986l732k364n10O83P49J6j044k013
$$ plain form
50047 430734 434212 438157 442671 447347 452116 457172 462435 467635 472679 477539 482056 486178 490070 493617
50033 493617 496317 498195 500335 503831 508589 513866 519520 525769 532053 537298 541418 545522 550469 556123
50019 556123 562235 569089 576908 585484 594782 605065 615958 626287 635524 644672 655009 666533 678359
50006 678359 690045 701717 713412 725163 737441 750608 764036 776571 787836 798482 809223
49995 809223 820172 830994 841082 849665 856370 861730 866656 871473 875930 879904 883328 885545 885642 883694
49981 883694 880941 878398 875897 872846 869363 866054 862897 858906 853013 845112 836222 827575 819435 810988
49967 810988 801567 791798 783053 775826 769234 762279 754990 747977 741315 734475 727280 720431 714878 710815
49953 710815 707453 703817 699678 695554 691805 688108 684122 680390 678026 677516 678199 678948 678964 677920 675907
49938F75907k427k143j749j981k796l504l800m145n033o356p633q525r003r237
49924F07575r428r533r281q626p987p762p770p570p146o853o759o616o392o257
49910D99595o019n218m014l303l587m174l984k811j372k67N54J395K240K840L076
49895D74951L156L377L773M016L748L024K262J775J540J423J372J267Q17q7j022
49880E05392j373j000l71J5P9m0l35r51j933l190m618o019o994p224o935o801
49864D57702p216p840q037p619o962o523o461o591o485n757m495l323k793k818
49850C74782l020l325l837m254m107l554l266l409l356k725k031j857j944j736
49836C32361j365j453k094k714k870k707k565k568k654k657k323j526m89M09R88
$$ plain form
49938 675907 673480 671337 669588 667607 664811 661307 657507 653362 648329 641973 634340 625815 616812 607575
49924 607575 598147 588614 579333 570707 562720 554958 547188 539618 532472 525619 518860 512244 505852 499595
49910 499595 493576 488358 484344 481041 477454 473280 469296 466485 465113 464846 465400 466795 469035 471875 474951
49895 474951 478107 481484 485257 489273 493021 496045 498307 500082 501622 503045 504417 505684 506501 506414 505392
49880 505392 504019 503019 502648 502663 502742 502702 502367 501416 499483 496293 491675 485656 478662 471438 464503 457702
49864 457702 450486 442646 434609 426990 420028 413505 407044 400453 393968 388211 383716 380393 377600 374782
49850 374782 371762 368437 364600 360346 356239 352685 349419 346010 342654 339929 337898 336041 334097 332361
49836 332361 330996 329543 327449 324735 321865 319158 316593 314025 311371 308714 306391 304865 304376 304785 305773
49821C05773J261J214R08O36O43Q00P83N38K59N5k1J70O79J200J439J603K059
49804C19999K600K559J719O96K45O03J500K524L287L578L508L316L049K700K596
49789C54479L228M571N901O547O550O491O858P591Q151Q036P440P286Q191R622
49775D50942J0512J0587J0461J0387R845Q684P724P612P707P044N954N739O748
49762E59946P847Q026P640P509P473O648M798K626P01j140l072m631n370n713
49748E93288o506p752q580q557q359q722r323r283q499p838q007q743r207q857
49734D75055p852o815o277o121n789n110m692n092n844n944n181m320l967l903
49720C98148l752l590l527l310k855k682l199l870l732k632j413q70j008j325
$$ plain form
49821 305773 307034 308248 309156 309792 310435 311235 312018 312556 312815 312870 312849 313019 313698 314898 316337 317940 319999
49804 319999 322599 325158 326877 327573 327818 328421 329921 332445 335732 339310 342818 346134 349183 351883 354479
49789 354479 357707 362278 368179 374726 381276 387767 394625 402216 410367 418403 425843 433129 441320 450942
49775 450942 461454 472041 482502 492889 502734 511418 519142 526754 534461 541505 547459 553198 559946
49762 559946 567793 575819 583459 590968 598441 605089 609887 612513 613214 612074 609002 604371 599001 593288
49748 593288 586782 579030 570450 561893 553534 544812 535489 526206 517707 509869 501862 493119 483912 475055
49734 475055 467203 460388 454111 447990 442201 437091 432399 427307 421463 415519 410338 406018 402051 398148
49720 398148 394396 390806 387279 383969 381114 378432 375233 371363 367631 364999 363586 362716 361708 360383
49706C60383j423j186p11j90K42O39J018J113O49j04m20L2P38J002R07J198K165
49689C66052L095L104K287J606J702K261K696L017L588M306M547L989L083K579
49675D07912K791L453M155M712N180N592N755N521N145N108N476N821N989O469
49661D79079P484Q275P965O922O388O856P697Q354Q964R491R348Q380P444P246
49647E89893P330O904O150N849O082O183N786N210M852M815N060N423N524N144
49633F70205M510L864K916J313o74k533m301o196p698p976p211o582o726p026
49619F25885o734n937n078m247l492l123l178l096k511j929j977k441k621k383
49605E77138k163k105j917j552j385j566j701j340m93M45J050J007K85p12j293
$$ plain form
49706 360383 358960 357774 357063 356873 357115 357754 358772 359885 360534 360430 360010 360042 360780 361782 362689 363887 366052
49689 366052 369147 372251 374538 376144 377846 380107 382803 385820 389408 393714 398261 402250 405333 407912
49675 407912 410703 414156 418311 423023 428203 433795 439550 445071 450216 455324 460800 466621 472610 479079
49661 479079 486563 494838 502803 509725 516113 522969 530666 539020 547984 557475 566823 575203 582647 589893
49647 589893 597223 604127 610277 616126 622208 628391 634177 639387 644239 649054 654114 659537 665061 670205
49633 670205 674715 678579 681495 682808 682134 679601 675300 669104 661406 653430 646219 639637 632911 625885
49619 625885 619151 613214 608136 603889 600397 597274 594096 591000 588489 586560 584583 582142 579521 577138
49605 577138 574975 572870 570953 569401 568016 566450 564749 563409 562916 563361 564411 565418 565703 564991 563698
49590E63698r96PR72J128L13q26j425j308j077j119j010k46P32R09K0j081j472
49573E57219j043k03P14J446J638J215P12P99J558K483L088L216K865K164J537
49558E79408J492K044K588K588K159J867K119K970M303N802O828O837O078N531
49544F32614N851O605O999P058P578Q872J0226J0912J1245J2025J3261J4080J4007
49531G61333J3688J4098J5353J6726J7625J8178J8895K0008K1293K2380K3152
49520I62729K3813K4647K5784K7294K9194L1251L2839L3478L3536L3990L5249
49509A293804L6632L7407L8002L9531M2151M4569M5459M4982M4489M4951M6086
49498A758063M6907M6704M5434M3520M1510L9823L8492L7078L4955L1822K7972
$$ plain form
49590 563698 562702 562709 563681 564809 565122 564296 562871 561563 560486 559367 558357 558111 558843 559752 559772 558691 557219
49573 557219 556176 555973 556687 558133 559771 560986 561698 562497 564055 566538 569626 572842 575707 577871 579408
49558 579408 580900 582944 585532 588120 590279 592146 594265 597235 601538 607340 614168 621005 627083 632614
49544 632614 638465 645070 652069 659127 666705 675577 685803 696715 707960 719985 733246 747326 761333
49531 761333 775021 789119 804472 821198 838823 857001 875896 895904 917197 939577 962729
49520 962729 986542 1011189 1036973 1064267 1093461 1124712 1157551 1191029 1224565 1258555 1293804
49509 1293804 1330436 1367843 1405845 1445376 1487527 1532096 1577555 1622537 1667026 1711977 1758063
49498 1758063 1804970 1851674 1897108 1940628 1982138 2021961 2060453 2097531 2132486 2164308 2192280
49487B192280K3991K0234J6654J3043R340N625K036j274m161o714r173j1562j3420
$$ plain form
49487 2192280 2216271 2236505 2253159 2266202 2275542 2281167 2283203 2281929 2277768 2271054 2261881 2250319 2236899
$$ [...]
##END NTUPLES=NMR SPECTRUM
##END=
