
##TITLE=AC1189_Casanare-tamara-CTAAH12021_5891238_RKiArXmvme
##JCAMPDX= 6.0         $$ Bruker NMR JCAMP-DX V2.0
##DATA TYPE= NMR SPECTRUM
##DATA CLASS= NTUPLES
##ORIGIN= BRUKER
##OWNER= Administrator
$$ 1.72 TOPSPIN		Version 2.1
$$ 2012-04-02 23:01:45.906 -0500  Administrator@TOPSPIN
$$ Compression mode = diff/dup
##.OBSERVE FREQUENCY= 400.13188235
##.OBSERVE NUCLEUS= ^1H
##.ACQUISITION MODE= SIMULTANEOUS (DQD)
##.ACQUISITION SCHEME= undefined
##.AVERAGES= 64
##.DIGITISER RES= 22
##SPECTROMETER/DATA SYSTEM= spect
##.PULSE SEQUENCE= noesygpps1d.comp
##.SOLVENT NAME= COFFEE_meoh
##.SHIFT REFERENCE= INTERNAL, COFFEE_meoh, 1, 14.96848
##AUDIT TRAIL= $$ (NUMBER, WHEN, WHO, WHERE, PROCESS, VERSION, WHAT)
$$ ##TITLE= Audit trail, TOPSPIN		Version 2.1
$$ ##JCAMPDX= 5.01
$$ ##ORIGIN= Bruker BioSpin GmbH
$$ ##OWNER= Administrator
$$ $$ C:\Bruker\TOPSPIN/data/COFFEE/nmr/AC1189_Casanare-tamara-CTAAH12021_5891238_RKiArXmvme/12/pdata/1/auditp.txt
$$ ##AUDIT TRAIL=  $$ (NUMBER, WHEN, WHO, WHERE, PROCESS, VERSION, WHAT)
(   1,<2012-04-02 23:01:40.140 -0500>,<Administrator>,<TOPSPIN>,<go>,<TOPSPIN 2.1>,
      <created by zg
	started at 2012-04-02 22:50:08.093 -0500,
	POWCHK enabled, PULCHK disabled,
       configuration hash MD5:
       1A 1E CE 29 27 FD 77 03 67 4E F0 E3 C4 B2 CB 90
       data hash MD5: 64K
       7B E7 0A FF BA B4 3E 49 99 F2 FE CD 2E 5D D8 D5>)
(   2,<2012-04-02 23:01:43.593 -0500>,<Administrator>,<TOPSPIN>,<proc1d>,<TOPSPIN 2.1>,
      <Start of raw data processing
       efp LB = 0.3 FT_mod = 6 PKNL = 1 PHC0 = 0 PHC1 = 0 SI = 128K 
       data hash MD5: 128K
       67 E6 6F DB DD D9 05 18 FE 71 30 85 18 D0 99 90>)
(   3,<2012-04-02 23:01:44.984 -0500>,<Administrator>,<TOPSPIN>,<proc1d>,<TOPSPIN 2.1>,
      <pk PHC0 = 33.24463 PHC1 = 0 
       data hash MD5: 128K
       FB 49 74 0F 3F 23 A5 F6 06 52 70 DF E2 1A 81 4B>)
(   4,<2012-04-02 23:01:45.281 -0500>,<Administrator>,<TOPSPIN>,<proc1d>,<TOPSPIN 2.1>,
      <abs ABSG = 1 
       data hash MD5: 128K
       16 35 18 21 91 AC E1 FD 6A 8C 56 2B 17 3A AF 76>)
(   5,<2012-04-02 23:01:45.375 -0500>,<Administrator>,<TOPSPIN>,<proc1d>,<TOPSPIN 2.1>,
      <abs ABSG = 2 
       data hash MD5: 128K
       A9 69 7C AF 33 58 A3 A7 CF 48 86 CE 2C 45 D2 11>)
(   6,<2012-04-02 23:01:45.500 -0500>,<Administrator>,<TOPSPIN>,<proc1d>,<TOPSPIN 2.1>,
      <abs ABSG = 3 
       data hash MD5: 128K
       A4 C7 97 23 BB 2B A7 17 88 77 E6 D1 58 59 F9 6A>)
(   7,<2012-04-02 23:01:45.734 -0500>,<Administrator>,<TOPSPIN>,<proc1d>,<TOPSPIN 2.1>,
      <abs ABSG = 4 
       data hash MD5: 128K
       AD A6 4E F8 2B EE 39 61 C3 7C 69 4F A8 BB 5B A2>)
(   8,<2012-04-02 23:01:45.796 -0500>,<Administrator>,<TOPSPIN>,<proc1d>,<TOPSPIN 2.1>,
      <abs ABSG = 5 
       data hash MD5: 128K
       E4 64 7D 93 66 3A 15 B7 D3 06 5D 66 A0 49 55 1F>)
$$ ##END=
$$ 
$$ $$ hash MD5
$$ $$ CD 11 D1 01 E2 0A D5 4A F8 42 8D 71 27 2A CB DA
##$RELAX= 
##$RELAX= 
##$RELAX= 
##$RELAX= 
##$RELAX= 
##$RELAX= 
##$RELAX= 
##$RELAX= 
$$ [...]
##$TP07= 0
##$TPNAME0= <>
##$TPNAME1= <>
##$TPNAME2= <>
##$TPNAME3= <>
##$TPNAME4= <>
##$TPNAME5= <>
##$TPNAME6= <>
##$TPNAME7= <>
##$TPOAL= (0..7)
0.5 0.5 0.5 0.5 0.5 0.5 0.5 0.5
##$TPOFFS= (0..7)
0 0 0 0 0 0 0 0
##$TUNHIN= 0
##$TUNHOUT= 0
##$TUNXOUT= 0
##$USERA1= <user>
##$USERA2= <user>
##$USERA3= <user>
##$USERA4= <user>
##$USERA5= <user>
##$V9= 5
##$VALIST= <valist>
##$VCLIST= <CCCCCCCCCCCCCCC>
##$VD= 0
##$VDLIST= <DDDDDDDDDDDDDDD>
##$VPLIST= <PPPPPPPPPPPPPPP>
##$VTLIST= <TTTTTTTTTTTTTTT>
##$WBST= 2048
##$WBSW= 25
##$XGAIN= (0..3)
0 0 0 0
##$XL= 0
##$YL= 0
##$YMAX_a= 12032593
##$YMIN_a= -5989366
##$ZGOPTNS= <>
##$ZL1= 120
##$ZL2= 120
##$ZL3= 120
##$ZL4= 120
##$ABSF1= 14.96848
##$ABSF2= -5.58405
##$ABSG= 5
##$ABSL= 3
##$ALPHA= 0
##$AQORDER= 0
##$ASSFAC= 0
##$ASSFACI= 0
##$ASSFACX= 0
##$ASSWID= 0
##$AUNMP= <proc_prof1d_extract.lims>
##$AXLEFT= 0
##$AXNAME= <>
##$AXNUC= <1H>
##$AXRIGHT= 0
##$AXTYPE= 0
##$AXUNIT= <>
##$AZFE= 0.1
##$AZFW= 0.1
##$BCFW= 0
##$BC_mod= 0
##$BYTORDP= 0
##$COROFFS= 0
##$CY= 15
##$DATMOD= 1
##$DC= 0
##$DFILT= <>
##$DTYPP= 0
##$F1P= 0
##$F2P= 0
##$FCOR= 0.5
##$FTSIZE= 131072
##$FT_mod= 6
##$GAMMA= 0
##$GB= 0
##$INTBC= 1
##$INTSCL= 1
##$ISEN= 128
##$LB= 0.3
##$LEV0= 0
##$LPBIN= 0
##$MAXI= 10000
##$MC2= 0
##$MEAN= 0
##$ME_mod= 0
##$MI= 0
##$NCOEF= 0
##$NC_proc= -3
##$NLEV= 6
##$NOISF1= 0
##$NOISF2= 0
##$NSP= 0
##$NTH_PI= 0
##$NZP= 0
##$OFFSET= 14.96848
##$PC= 1
##$PHC0= 33.24463
##$PHC1= 0
##$PH_mod= 1
##$PKNL= yes
##$PPARMOD= 0
##$PPDIAG= 0
##$PPIPTYP= 0
##$PPMPNUM= 2147483647
##$PPRESOL= 1
##$PSCAL= 4
##$PSIGN= 0
##$PYNMP= <proc.py>
##$REVERSE= no
##$SF= 400.130004852801
##$SI= 131072
##$SIGF1= 0
##$SIGF2= 0
##$SINO= 400
##$SIOLD= 131072
##$SPECTYP= <>
##$SREGLST= <1H.CDCl3>
##$SSB= 0
##$STSI= 131072
##$STSR= 0
##$SW_p= 8223.68421052632
##$SYMM= 0
##$S_DEV= 0
##$TDeff= 65536
##$TDoff= 0
##$TI= <>
##$TILT= no
##$TM1= 0
##$TM2= 0
##$TOPLEV= 0
##$USERP1= <user>
##$USERP2= <user>
##$USERP3= <user>
##$USERP4= <user>
##$USERP5= <user>
##$WDW= 1
##$XDIM= 131072
##$YMAX_p= 510122211
##$YMIN_p= -484354228
##$CURPLOT= <Network HP LaserJet P1505>
##$CURPRIN= <$Network HP LaserJet P1505>
##$DFORMAT= <normdp>
##$LAYOUT= <+/1D_H.xwp>
##$LFORMAT= <normlp>
##$PFORMAT= <normpl>
##$SURQMSG= 1
$$ End of Bruker specific parameters
$$ ---------------------------------
##NTUPLES= NMR SPECTRUM
##VAR_NAME=  FREQUENCY,     SPECTRUM/REAL,   SPECTRUM/IMAG
##SYMBOL=    X,             R,               I
##VAR_TYPE=  INDEPENDENT,   DEPENDENT,       DEPENDENT
##VAR_FORM=  AFFN,          ASDF,            ASDF
##VAR_DIM=   131072,        131072,          131072
##UNITS=     HZ,            ARBITRARY UNITS, ARBITRARY UNITS
##FACTOR=    0.0627417313425165, 1,          1
##FIRST=     8223.62146879498, 4821,         -86850
##LAST=      0,             10255,           -86323
##MIN=       0,             -484354228,      0
##MAX=       8223.62146879498, 510122211,    0
$$ Real data points
##PAGE= N=1
##DATA TABLE= (X++(R..R)), XYDATA
$$ [...]
61779B692890k1576j7743j6895j7467j6449j3029q828n320k623n01J125K598M113
61766B580295N065N010N119P168J1074J4890J7349J9077K1132K3725K6758L0384
61754B767046L4516L8816M3517M9120N5014N9686O2856O6286P1749P9176Q7482
61743C415264R6144J05038J13730J22117J31183J41885J53564J64637J74898J86072
61733D804532J99721K15504K32183K49838K70036K93658L19440L45651L72875
61724G303438M03997M41154M83667N29693N78957O32848O92312P56889Q25646
61715A2648601Q98065R73985J053532J137085J224344J313261J400389J481869
61707B2131131J552813J605539J629309J611825J540200J401432J185400Q90735
$$ y = [2692890, 2671314, 2653571, 2636676, 2619209, 2602760, 2589731, 2580903, 2575583, 2572960, 2572459, 2573584, 2576182, 2580295, 2585360, 2590370, 2595489, 2602657, 2613731, 2628621, 2645970, 2665047, 2686179, 2709904, 2736662, 2767046, 2801562, 2840378, 2883895, 2933015, 2988029, 3047715, 3110571, 3176857, 3248606, 3327782, 3415264, 3511408, 3616446, 3730176, 3852293, 3983476, 4125361, 4278925, 4443562, 4618460, 4804532, 5004253, 5219757, 5451940, 5701778, 5971814, 6265472, 6584912, 6930563, 7303438, 7707435, 8148589, 8632256, 9161949, 9740906, 10373754, 11066066, 11822955, 12648601, 13546666, 14520651, 15574183, 16711268, 17935612, 19248873, 20649262, 22131131, 23683944, 25289483, 26918792, 28530617, 30070817, 31472249, 32657649, 33548384]
61699C3548384N29271J25216k89873o83347j027426j304019j506301j636393j701669
61690B6053843j712438j680768j618652j536030j440354j337680j233447j131919
61682A4362555j035382r44492q59573p81364p10355o45969n87279n34453m88399
61673G775289m48499m11876l76059l41608l10900k84858k62253k41743k22846
61664D874647k04962j87336j70570j56559j46010j37108j27578j17075j06819
61655C520630r7762r0080q3764p8705p4464p0551o6665o2455n7759n3353n0538
61644B734534m9329m8050m5613m3245m2734m3687m3995m2763m1217m0493m0124
61633B253284l9380l8789l9095l9473l8331l5844l4159l4442l4974l3296k9527
$$ y = [33548384, 34077655, 34202871, 33912998, 33229651, 32202225, 30898206, 29391905, 27755512, 26053843, 24341405, 22660637, 21041985, 19505955, 18065601, 16727921, 15494474, 14362555, 13327173, 12382681, 11523108, 10741744, 10031389, 9385420, 8798141, 8263688, 7775289, 7326790, 6914914, 6538855, 6197247, 5886347, 5601489, 5339236, 5097493, 4874647, 4669685, 4482349, 4311779, 4155220, 4009210, 3872102, 3744524, 3627449, 3520630, 3422868, 3332788, 3249024, 3170319, 3095855, 3025304, 2958639, 2896184, 2838425, 2785072, 2734534, 2685205, 2637155, 2591542, 2548297, 2505563, 2461876, 2417881, 2375118, 2333901, 2293408, 2253284, 2213904, 2175115, 2136020, 2096547, 2058216, 2022372, 1988213, 1953771, 1918797, 1885501, 1855974]
61622A855974k6089k4397k3470k2078k0558j9627j8759j7156j5379j4562j4460
61611A639439j3644j1463q688o463n586o522q891j0940j0822q570o037m920n527
61598A531366p183q768r156q173p017o840p253p200o703o393n879m349k455j783
61584A442214k479l181l342l743m559m880m489m224m097k951o25J407K282K846
61570A410179L790M578N073O262Q214R203Q066N944M346L223K276K361L896N267
61556A482678M766L036J839J365M99r67k168k757l204l824m714o196q202r706
61542A452445r801q896q070p845q253r220j0072r615p693n683m595l781k421r77
61528A355523qJ187L291N576P118Q417J0393J2877J5387J8274K1644K4424K5998
$$ y = [1855974, 1829885, 1805488, 1782018, 1759940, 1739382, 1719755, 1700996, 1683840, 1668461, 1653899, 1639439, 1625795, 1614332, 1605644, 1599181, 1593595, 1587073, 1578182, 1567242, 1556420, 1547850, 1541813, 1536893, 1531366, 1524183, 1515415, 1506259, 1498086, 1491069, 1484229, 1476976, 1469776, 1463073, 1456680, 1450801, 1446452, 1443997, 1442214, 1439735, 1436554, 1433212, 1429469, 1424910, 1420030, 1415541, 1411317, 1407220, 1404269, 1403644, 1405051, 1407333, 1410179, 1413969, 1418547, 1423620, 1429882, 1438096, 1447299, 1455365, 1461309, 1465655, 1468878, 1471154, 1473515, 1477411, 1482678, 1487444, 1490480, 1492319, 1493684, 1494183, 1493216, 1491048, 1488291, 1485087, 1481263, 1476549, 1470353, 1462151, 1452445, 1442644, 1433748, 1425678, 1417833, 1409580, 1400360, 1390288, 1380673, 1372980, 1367297, 1362702, 1358921, 1356500, 1355523, 1355515, 1356702, 1359993, 1365569, 1372687, 1381104, 1391497, 1404374, 1419761, 1438035, 1459679, 1484103, 1510101]
61515A510101K7444K9611L1512L2490L4408L9090M4871M8387M9047M9062M9751
61504A945774N0591N1521N3206N4804N4244N1256M7893M5644M4048M2494M1190
61493B482665L9857L7392L3538K9262K5221K1437J8406J6550J4505J0237M204
61482B733274r00m071p130j1118j4202j4689j3927j4238j5473j5677j4211j2337
61470B595301j1051r836p527l556J563O647J1006J5365K1031K8127L5506M2487
61458B725063M9567N7220O5239P3732Q3550R5022J07212J19116J30921J43581
61448C650223J57716J73243J89525K05746K21931K39408K59229K80182K99515
61439E676718L15670L28964L39508L45815L45638L36642L16054K81669K34263
$$ y = [1510101, 1537545, 1567156, 1598668, 1631158, 1665566, 1704656, 1749527, 1797914, 1846961, 1896023, 1945774, 1996365, 2047886, 2101092, 2155896, 2210140, 2261396, 2309289, 2354933, 2398981, 2441475, 2482665, 2522522, 2559914, 2593452, 2622714, 2647935, 2669372, 2687778, 2704328, 2718833, 2729070, 2733274, 2732374, 2728303, 2721173, 2710055, 2695853, 2681164, 2667237, 2652999, 2637526, 2621849, 2607638, 2595301, 2584250, 2574414, 2566887, 2563331, 2564894, 2571541, 2582547, 2597912, 2618943, 2647070, 2682576, 2725063, 2774630, 2831850, 2897089, 2970821, 3054371, 3149393, 3256605, 3375721, 3506642, 3650223, 3807939, 3981182, 4170707, 4376453, 4598384, 4837792, 5097021, 5377203, 5676718, 5992388, 6321352, 6660860, 7006675, 7352313, 7688955, 8005009, 8286678, 8520941]
61430H520941J77822J16713N3788q472o6850j18628j62598j97906k23296k38724
61420G852790k46394k48775k46284k38076k24338k06694j87102j67243j48288
61411E939596j30188j11915r3170p5057n8274m1838k4809q282N950J8038K9780
61400E449831M2010N3788O4141P3129Q0896Q6835R0202R1086R0457Q9565Q9171
61389F301111Q8914Q7558Q4284P9619P4786P0581O7300O5225O4347O3890O2899
61378G110514O1208N9115N6256N1640M5086L7903L1722K6914K2490J7248J0719
61367G530815L268m277j1091j6938k2492k8651l5087l9991m1974m1819m1384m0919
61355G209460l8924l4874l0479k7359k4951k1970j8622j5868j3599j1387j0207
$$ y = [8520941, 8698763, 8815476, 8869264, 8860792, 8793942, 8675314, 8512716, 8314810, 8091514, 7852790, 7606396, 7357621, 7111337, 6873261, 6648923, 6442229, 6255127, 6087884, 5939596, 5809408, 5697493, 5604323, 5529266, 5470992, 5429154, 5404345, 5396063, 5402013, 5420051, 5449831, 5491841, 5545629, 5609770, 5682899, 5763795, 5850630, 5940832, 6031918, 6122375, 6211940, 6301111, 6390025, 6477583, 6561867, 6641486, 6716272, 6786853, 6854153, 6919378, 6983725, 7047615, 7110514, 7171722, 7230837, 7287093, 7338733, 7383819, 7421722, 7453444, 7480358, 7502848, 7520096, 7530815, 7534083, 7529806, 7518715, 7501777, 7479285, 7450634, 7415547, 7375556, 7333582, 7291763, 7250379, 7209460, 7170536, 7135662, 7105183, 7077824, 7052873, 7030903, 7012281, 6996413, 6982814, 6971427, 6961220]
61344F961220j1315j3901j5947j7152j8932k1548k3455k3588k2234j9252j3659
61333F760237n470M196J5454K9944M7861O7029Q6105J06537J29800J54675J79170
61322G575538K03452K28756K54606K79404L02835L25523L46454L62812L72405
61313A0251785L74667L68967L53205L24731K82399K27892J65381R9546L3454l1460
61303A2450567r3546j50354k00343k43895k81693l13194l37645l55513l67691
61294A0106693l74191l74849l70548l62470l50871l35921l19059l01885k84126
61285G032773k64288k42330k20250j99667j80030j59757j38437j17312r7856q0194
61275E332652o3173m6069k9836j5939m217P028J8724L0119M0440M9978N8728O5498
$$ y = [6961220, 6949905, 6936004, 6920057, 6902905, 6883973, 6862425, 6838970, 6815382, 6793148, 6773896, 6760237, 6754767, 6758963, 6774417, 6804361, 6852222, 6919251, 7005356, 7111893, 7241693, 7396368, 7575538, 7778990, 8007746, 8262352, 8541756, 8844591, 9170114, 9516568, 9879380, 10251785, 10626452, 10995419, 11348624, 11673355, 11955754, 12183646, 12349027, 12448573, 12482027, 12450567, 12357021, 12206667, 12006324, 11762429, 11480736, 11167542, 10829897, 10474384, 10106693, 9732502, 9357653, 8987105, 8624635, 8273764, 7937843, 7618784, 7316899, 7032773, 6768485, 6526155, 6305905, 6106238, 5926208, 5766451, 5628014, 5510702, 5412846, 5332652, 5269479, 5223410, 5193574, 5177635, 5173418, 5180446, 5199170, 5229289, 5269729, 5319707, 5378435, 5443933]
61263E443933O9512P1770P3524P4412P3451P0940O8014O4874O0776N5307M8546
61252F175059M0627L2297K5202K0318J6618J2445P504K262l767j1402j9912k7614
61240F269637l4207m0939m8371n5467o1126o5340o8658p1529p4331p7014p8691
61229E593964p8539p7039p5326p3520p0835o7178o3276n9183n4009m7563m1063
61218D886433l5713l1596k8421k6377k5606k5555k5657k6097k7267k8782k9688
61207D575674k9520k8617k7238k4830k0662j4988q915k810M388J3570K3810L3533
61195D493395M2819N3036O4338P5434Q6116R7993J11728J25377J36754J45794
61185E432784J53190J58230J59624J57049J49968J36039J12917Q1007M2744O8
$$ y = [5443933, 5513445, 5585215, 5658739, 5733151, 5806602, 5877542, 5945556, 6010430, 6071206, 6126513, 6175059, 6215686, 6247983, 6273185, 6293503, 6310121, 6322566, 6330070, 6332332, 6328565, 6317163, 6297251, 6269637, 6235430, 6194491, 6146120, 6090653, 6029527, 5964187, 5895529, 5824000, 5749669, 5672655, 5593964, 5515425, 5438386, 5363060, 5289540, 5218705, 5151527, 5088251, 5029068, 4975059, 4927496, 4886433, 4850720, 4819124, 4790703, 4764326, 4738720, 4713165, 4687508, 4661411, 4634144, 4605362, 4575674, 4546154, 4517537, 4490299, 4465469, 4444807, 4429819, 4420904, 4418094, 4422482, 4436052, 4459862, 4493395, 4536214, 4589250, 4653588, 4729022, 4815138, 4913131, 5024859, 5150236, 5286990, 5432784, 5585974, 5744204, 5903828, 6060877, 6210845, 6346884, 6459801, 6540808, 6583552, 6583620]
61175F583620m5337r0160j30429j64187j91215k10575k20886k23043k20079k13888
61165D873821k04358j92216j80167j69966j60363j49319j36769j23892j11091
61156C445680r8284q6358p6779o9920o4664n9506n3528m6665l9465l2407k5428
61145B792676j8447j2113p148l072J396O569J1509J5539J8799K0942K0873J8557
61133B866080J5859J4391J3338J0646N979J286j579k851m232o941j0699j4385
61121B886892j7230j9337k1219k3138k4938k6287k6918k6823k6369k6160k6645
61110B621828k7993l0133l2594l4526l5512l6295l7887m0067m1742m2823m4404
61099B217852m6738m8416m8238m6647m4625m2438m0347l9160l8967l8671l7828
$$ y = [6583620, 6538283, 6448123, 6317694, 6153507, 5962292, 5751717, 5530831, 5307788, 5087709, 4873821, 4669463, 4477247, 4297080, 4127114, 3966751, 3817432, 3680663, 3556771, 3445680, 3347396, 3261038, 3184259, 3114339, 3049675, 2990169, 2936641, 2889976, 2850511, 2818104, 2792676, 2774229, 2762116, 2754968, 2751896, 2753292, 2759861, 2771370, 2786909, 2805708, 2826650, 2847523, 2866080, 2881939, 2896330, 2909668, 2920314, 2926293, 2927579, 2926000, 2923149, 2918917, 2911976, 2901277, 2886892, 2869662, 2850325, 2829106, 2805968, 2781030, 2754743, 2727825, 2701002, 2674633, 2648473, 2621828, 2593835, 2563702, 2531108, 2496582, 2461070, 2424775, 2386888, 2346821, 2305079, 2262256, 2217852, 2171114, 2122698, 2074460, 2027813, 1983188, 1940750, 1900403, 1861243, 1822276, 1783605, 1745777]
61088A745777l7609l8667l9536l8653l6596l4592l2363k9383k6818k5811k4929
61077A380820k1991j7613j4348j2849j1513r544p609n545k336J481L980M856N751
61064A293540P192P840P389P716R990J2802J4216J4015J3109J2392J2839J5008
61052A428048J7786J9189J8935J8496J8472J7916J6658J5962J6078J5360J2851
61041A615751R782P541N953M498L390K534J209m09j181j120j531k473k445j464
61027A640035j852m513p029p188o154o230p443q495r252j0178j0755j0565j0638
61014A539743j1857j3232j3559j3498j4181j5011j4749j3682j2870j2251j1200
61003A393653j0111r605r178q104o811n951n230m510m636n591n401k806M27J967
$$ y = [1745777, 1708168, 1669501, 1629965, 1591312, 1554716, 1520124, 1487761, 1458378, 1431560, 1405749, 1380820, 1358829, 1341216, 1326868, 1314019, 1302506, 1292962, 1285353, 1279808, 1277472, 1278953, 1282933, 1287789, 1293540, 1300732, 1308572, 1315961, 1323677, 1333667, 1346469, 1360685, 1374700, 1387809, 1400201, 1413040, 1428048, 1445834, 1465023, 1483958, 1502454, 1520926, 1538842, 1555500, 1571462, 1587540, 1602900, 1615751, 1625533, 1633074, 1639027, 1643525, 1646915, 1649449, 1650658, 1650249, 1649068, 1647948, 1646417, 1643944, 1641499, 1640035, 1638183, 1633670, 1626641, 1619453, 1613299, 1607069, 1599626, 1591131, 1581879, 1571701, 1560946, 1550381, 1539743, 1527886, 1514654, 1501095, 1487597, 1473416, 1458405, 1443656, 1429974, 1417104, 1404853, 1393653, 1383542, 1373937, 1364759, 1356655, 1349844, 1343893, 1338663, 1334153, 1329517, 1323926, 1318525, 1315719, 1316146, 1318113]
60989A318113K375L735O029P511P914Q670J0210J1454J1978J2709J4343J6601
60977A431642J8991K0969K1800K1527K1416K2254K3192K3809K5905L1099L7713
60966A700317M2452M4577M6067M8195N0470N2750N5867N9943O4102O8168P2848
60955B305756P8093Q2879Q6826R0696R5385J01553J09738J19532J29268J37867
60945C337593J46245J55542J65352J75424J87553K03408K21862K41234K62954
60936E097167K89969L22590L59184L99939M46515M99021N57316O24227P02696
60927I298624P90375Q82572R80800J092632J222793J371435J542351J744221J980335
60918B0906138K245859K536089K834276L067211L086694K745477K032686J132453
$$ y = [1318113, 1320488, 1324223, 1330252, 1337763, 1345677, 1354347, 1364557, 1376011, 1387989, 1400698, 1415041, 1431642, 1450633, 1471602, 1493402, 1514929, 1536345, 1558599, 1581791, 1605600, 1631505, 1662604, 1700317, 1742769, 1787346, 1833413, 1881608, 1932078, 1984828, 2040695, 2100638, 2164740, 2232908, 2305756, 2383849, 2466728, 2553554, 2644250, 2739635, 2841188, 2950926, 3070458, 3199726, 3337593, 3483838, 3639380, 3804732, 3980156, 4167709, 4371117, 4592979, 4834213, 5097167, 5387136, 5709726, 6068910, 6468849, 6915364, 7414385, 7971701, 8595928, 9298624, 10088999, 10971571, 11952371, 13045003, 14267796, 15639231, 17181582, 18925803, 20906138, 23151997, 25688086, 28522362, 31589573, 34676267, 37421744, 39454430, 40586883]
60910D0586883L22742j99551m01016l51510j35909J46250L31381K21290k83580
60901D0236980j080121j914847k550869k891444k971382k873660k670947k417614
60893B0866096k154870j906587j678601j469486j279864j111310r63008q33331
60885I469039p21906o28113n50028m86037m35131l94610l60152l29195l02043
60876E261824k78681k57055k35855k16644k01318j89112j77834j66856j57198
60867C381271j49589j43758j38929j33822j26989j18349j09802j03220r8250r3124
60857B165439q7087q0952p5544p0726o6039o1428n7172n3524n0474m7620m4416
60846A470457m0871l7577l4811l2091k9172k6858k5973k5859k4882k2367j9216
$$ y = [40586883, 40909625, 40710074, 40309058, 39957548, 39821639, 39967889, 40299270, 40520560, 40236980, 39156859, 37242012, 34691143, 31799699, 28828317, 25954657, 23283710, 20866096, 18711226, 16804639, 15126038, 13656552, 12376688, 11265378, 10302370, 9469039, 8747133, 8119020, 7568992, 7082955, 6647824, 6253214, 5893062, 5563867, 5261824, 4983143, 4726088, 4490233, 4273589, 4072271, 3883159, 3705325, 3538469, 3381271, 3231682, 3087924, 2948995, 2815173, 2688184, 2569835, 2460033, 2356813, 2258563, 2165439, 2078352, 1997400, 1921856, 1851130, 1785091, 1723663, 1666491, 1612967, 1562493, 1514873, 1470457, 1429586, 1392009, 1357198, 1325107, 1295935, 1269077, 1243104, 1217245, 1192363, 1169996, 1150780]
60835A150780j6613j4997j4374j4552j4633j3330j0502p668o173n378l689r89
60823A027882J105J370L37o54q00l6J317K636L405L861M665N702O016N312M505
60808A066623M272L953K749J142J17m07j231k455l454m028m521m985n146m997
60794A047632m573l511j855p55j119j895j196J048L249M920P323J0810J3386J3110
60780A086574J0634Q152O743N921N146M559M502N127O337P591Q129P803P353P463
60766A182034P990Q408Q561Q541Q458Q607R311J0242J0482R577P873N717L204
60753A289005J050N70K038L981M786M281L067J285j033l254m952o750r360j2210
60739A272504j4147j5127j6150j7681j9108j9612j8882j7076j4785j2889j1844
$$ y = [1150780, 1134167, 1119170, 1104796, 1090244, 1075611, 1062281, 1051779, 1044111, 1037938, 1032560, 1028871, 1027882, 1028987, 1030357, 1030694, 1030040, 1029240, 1029204, 1030521, 1033157, 1036562, 1040423, 1045088, 1050790, 1056806, 1062118, 1066623, 1070895, 1074848, 1077597, 1078739, 1078856, 1078449, 1077218, 1074763, 1071309, 1067281, 1062760, 1057775, 1052629, 1047632, 1043059, 1039548, 1037693, 1036938, 1035819, 1033924, 1032728, 1033776, 1037025, 1041945, 1049268, 1060078, 1073464, 1086574, 1097208, 1105360, 1112103, 1118024, 1123170, 1127729, 1132231, 1137358, 1143695, 1151286, 1159415, 1167218, 1174571, 1182034, 1190024, 1198432, 1206993, 1215534, 1223992, 1232599, 1241910, 1252152, 1262634, 1272211, 1280084, 1285801, 1289005, 1290055, 1290625, 1292663, 1296644, 1301430, 1305711, 1308778, 1310063, 1309030, 1305776, 1300824, 1294074, 1284714, 1272504, 1258357, 1243230, 1227080, 1209399, 1190291, 1170679, 1151797, 1134721, 1119936, 1107047, 1095203]
60728A095203j1254j0558r667q591p093n364m252m004l434j422J465L892N662
60715A040583P435R143J0188J0983J2588J4818J6208J6069J5291J4876J4986J5707
60703A198875J7350J9432K0567J9957J8102J5709J3071J0886J0319J1375J2398
60692A368041J2172J1484J1609J2147J1633R722P592O480O681P597P909O248K806
60679A482121k15q85o1l01k503n091o653p677r056j0268j0347r776j0030j1422
60665A397836j2623j2471j1481j1121j2000j3201j3371j2267j0994j0553j0404
60654A267350r101o328l681k947m211o192p857q816q574o746m247l037l914n262
60640A186437m921k890j317j763l306l699j959N99J858J218J75N63K450M170M331
$$ y = [1095203, 1083949, 1073391, 1063724, 1055133, 1048040, 1042676, 1038424, 1034420, 1030986, 1029564, 1031029, 1034921, 1040583, 1048018, 1057161, 1067349, 1078332, 1090920, 1105738, 1121946, 1138015, 1153306, 1168182, 1183168, 1198875, 1216225, 1235657, 1256224, 1276181, 1294283, 1309992, 1323063, 1333949, 1344268, 1355643, 1368041, 1380213, 1391697, 1403306, 1415453, 1427086, 1436808, 1444400, 1450880, 1457561, 1465158, 1473067, 1479315, 1482121, 1481906, 1481021, 1480960, 1480659, 1478156, 1473065, 1466412, 1458735, 1449679, 1439411, 1429064, 1419288, 1409258, 1397836, 1385213, 1372742, 1361261, 1350140, 1338140, 1324939, 1311568, 1299301, 1288307, 1277754, 1267350, 1258249, 1251921, 1248240, 1245293, 1241082, 1234890, 1227033, 1218217, 1209643, 1202897, 1198650, 1195613, 1191699, 1186437, 1181516, 1178626, 1177309, 1175546, 1172240, 1168541, 1166582, 1167181, 1169039, 1170257, 1170432, 1170995, 1173445, 1177615, 1181946]
60625A181946L238K092J360N06j022l135n452p816j0332j3065j5711j7480j7669
60612A097460j6539j5347j5051j5251j4816j3256j0985q519o198m542m046m407
60600I68503m592l977k872j792p33N07J728K333J821K26j535j943j95K576M091
60585I64146L251J114o47j532k022k337k280j871j373p40K52J383K127K466K996
60570I64933M155N723P238Q503R525J0398J1511J3420J6043J8228J8779J8058
60558A106514J7953J9828K2927K5427K6710K7695K8886K9329K8176K6279K5077
60547A384801K4285K2160J8008J3273R611O868L593j078o673j2068j6284j8824
60535A427672j9798j9738j9103j8069j6809j5555j4260j2562j0369q125o300m916
$$ y = [1181946, 1185184, 1187276, 1188636, 1189142, 1188120, 1184985, 1179533, 1171717, 1161385, 1148320, 1132609, 1115129, 1097460, 1080921, 1065574, 1050523, 1035272, 1020456, 1007200, 996215, 987696, 981498, 976956, 972910, 968503, 963911, 959934, 957062, 955270, 954537, 955044, 956772, 959105, 960926, 961152, 959617, 957674, 957479, 960055, 964146, 967397, 968511, 967864, 966332, 964310, 961973, 959693, 957822, 956449, 955709, 955961, 957344, 959471, 961937, 964933, 969088, 974811, 982049, 990552, 1000077, 1010475, 1021986, 1035406, 1051449, 1069677, 1088456, 1106514, 1124467, 1144295, 1167222, 1192649, 1219359, 1247054, 1275940, 1305269, 1333445, 1359724, 1384801, 1409086, 1431246, 1449254, 1462527, 1472138, 1479006, 1482599, 1481521, 1474848, 1462780, 1446496, 1427672, 1407874, 1388136, 1369033, 1350964, 1334155, 1318600, 1304340, 1291778, 1281409, 1273284, 1266984, 1262068]
60523A262068l827l128k952l163l473l634l380k554j531j178k045l725n178n587
60509A216713m830l398j922n72J048L147N134O270O701P148P809Q501R740J2353
60495A273842J5795J8221J8996J9857K2580K6441K9267L0254L0486L1130L2539
60484A549408L4830L8003M1390M4115M6309M8864N1830N3939N3910N1296M5778
60473B059672L6673K3942R090n631j8682k9524l7795m2819m4043m1747l7143l1664
60461A840329k5988j9902j3267o816j522K632O587J0941J5343J9384K3409K7869
60449A878999L2335L5929L8765M2436M8658N7672O8215P9008Q9980J02016J15757
60438B589770J30872J46356J61310J75613J89956K04998K20217K34033K45564
$$ y = [1262068, 1258241, 1255113, 1252161, 1248998, 1245525, 1241891, 1238511, 1235957, 1234426, 1233248, 1231203, 1227478, 1222300, 1216713, 1211883, 1208485, 1206563, 1205991, 1207039, 1210186, 1215320, 1221590, 1228291, 1235439, 1243248, 1251749, 1261489, 1273842, 1289637, 1307858, 1326854, 1346711, 1369291, 1395732, 1424999, 1455253, 1485739, 1516869, 1549408, 1584238, 1622241, 1663631, 1707746, 1754055, 1802919, 1854749, 1908688, 1962598, 2013894, 2059672, 2096345, 2120287, 2129377, 2123746, 2105064, 2075540, 2037745, 1994926, 1950883, 1909136, 1871993, 1840329, 1814341, 1794439, 1781172, 1774356, 1772834, 1775466, 1782053, 1792994, 1808337, 1827721, 1851130, 1878999, 1911334, 1947263, 1986028, 2028464, 2077122, 2134794, 2203009, 2282017, 2371997, 2474013, 2589770, 2720642, 2866998, 3028308, 3203921, 3393877, 3598875, 3819092, 4053125, 4298689]
60429D298689K55963K67222K79832K92384L03085L10023L09245K94215K58808
60420F869466K01126J24133L3564o3762j60198k47635l18660l68034l94092l99549
60410E276359l90186l71498l46471l16894k85737k56721k31713k09942j89893
60401B677304j70903j52898j35866j20149j06308r4380q3983p5273o8763o3795
60391A604986n8473n1796m5034m0152l7517l5931l4384l2896l1800l0943k9641
60380A176419k7214k3803k0596j8748j7907j6586j4175j1709j0288r694r385r763
60368I86551j1237j2758j2685j0927q946p687o721n483m123k815j346J28R33J051
60354I03935J542L031M505M526L212K140K462L846N169N672N364M909N079N918
$$ y = [4298689, 4554652, 4821874, 5101706, 5394090, 5697175, 6007198, 6316443, 6610658, 6869466, 7070592, 7194725, 7228289, 7164527, 7004329, 6756694, 6438034, 6070000, 5675908, 5276359, 4886173, 4514675, 4168204, 3851310, 3565573, 3308852, 3077139, 2867197, 2677304, 2506401, 2353503, 2217637, 2097488, 1991180, 1896800, 1812817, 1737544, 1668781, 1604986, 1546513, 1494717, 1449683, 1409531, 1372014, 1336083, 1301699, 1268803, 1237003, 1206060, 1176419, 1149205, 1125402, 1104806, 1086058, 1068151, 1051565, 1037390, 1025681, 1015393, 1005699, 996314, 986551, 975314, 962556, 949871, 938944, 929998, 922311, 915590, 910107, 905984, 903169, 901823, 901951, 902884, 903935, 905477, 908508, 913013, 917539, 920751, 922891, 925353, 929199, 934368, 940040, 945404, 950313, 955392, 961310]
60340I61310O571O323N680N803O879P739P271N753M454M222M800N330N291M890
60326A042316M534M030K738O96q66q67J50O92L75K11P09R46P8j257k013k323k931
60309A047218l582l322k198j338j212r10M41K390L787M074L613L169L520N048
60295A060698P338R283R974R444Q542Q181Q560Q891Q153O373M870M734N462N696
60281A166199M972L861K809J864J363J621J919J178j72m49O84J451O11n71k17
60266A187123J487K923L414L385K796J207p99j913j979k196l056l445k377o11
60252A185959K92j03q40q74n9R66J441J053J31o61r21p39m29j19L62J199K079
60235A188737K128Q11j086j984j264J42J244K211L489M555M747M710N645P288
$$ y = [961310, 967881, 974204, 979884, 985687, 992566, 1000305, 1007576, 1013329, 1017783, 1022005, 1026805, 1032135, 1037426, 1042316, 1046850, 1050880, 1053618, 1054314, 1053448, 1052581, 1052731, 1053423, 1053798, 1054009, 1054718, 1055664, 1055742, 1054485, 1052472, 1050149, 1047218, 1043636, 1040314, 1038116, 1036778, 1035566, 1034656, 1035097, 1037487, 1041274, 1045348, 1048961, 1052130, 1055650, 1060698, 1068036, 1077319, 1087293, 1096737, 1105279, 1113460, 1122020, 1130911, 1139064, 1145437, 1150307, 1155041, 1160503, 1166199, 1171171, 1175032, 1177841, 1179705, 1181068, 1182689, 1184608, 1185786, 1185614, 1185165, 1185849, 1187300, 1187911, 1187340, 1187123, 1188610, 1191533, 1194947, 1198332, 1201128, 1202335, 1201536, 1199623, 1197644, 1195448, 1192392, 1188947, 1186570, 1185959, 1186251, 1186148, 1185308, 1184434, 1184375, 1185341, 1186782, 1187835, 1187966, 1187305, 1186384, 1185645, 1185216, 1185097, 1185459, 1186658, 1188737, 1190865, 1191676, 1190590, 1188606, 1187342, 1187484, 1188728, 1190939, 1194428, 1198983, 1203730, 1208440, 1214085, 1221373]
60221A221373Q206Q265R206J1951J4726J5123J3317J1921J2830J5406J7877J9400
60209A379601K0215K0626K0770K1122K2356K4429K6410K7629K8638L0514L3425
60198A655735L6526L9315M2376M6511N1533N6488O0837O5129P0465P7363Q5089
60187B287367R2138R7778J03089J10013J19218J29434J39040J47644J55586J62605
60177C543912J67923J71593J74893J78957J83089J84701J81226J72378J60248
60168E118920J46855J31948J14112R3727P3328N4702L7154J9568K873j1098k2268
60157E759821l2103m0806m6240m6100m0225l0630j9862r410R58J2467K5738M0236
60145E573844N5470P1800Q9236J06303J21391J34781J47825J60344J70220J75570
$$ y = [1221373, 1229579, 1237844, 1247050, 1259001, 1273727, 1288850, 1302167, 1314088, 1326918, 1342324, 1360201, 1379601, 1399816, 1420442, 1441212, 1462334, 1484690, 1509119, 1535529, 1563158, 1591796, 1622310, 1655735, 1692261, 1731576, 1773952, 1820463, 1871996, 1928484, 1989321, 2054450, 2124915, 2202278, 2287367, 2379505, 2477283, 2580372, 2690385, 2809603, 2939037, 3078077, 3225721, 3381307, 3543912, 3711835, 3883428, 4058321, 4237278, 4420367, 4605068, 4786294, 4958672, 5118920, 5265775, 5397723, 5511835, 5605562, 5678890, 5733592, 5770746, 5790314, 5793187, 5782089, 5759821, 5727718, 5686912, 5640672, 5594572, 5554347, 5523717, 5503855, 5494445, 5495403, 5507870, 5533608, 5573844, 5629314, 5701114, 5790350, 5896653, 6018044, 6152825, 6300650, 6460994, 6631214, 6806784]
60135F806784J76026J71886J63537J51899J38016J21720J02024P9177N4914L0175
60125G996158M151k3458n0653p4915r5581j13025j26336j33670j34765j31570
60115G116336j25927j17733j05835q9975p1261n1232l0959j0997Q305K6768M4621
60104F592111O2379Q0045R6321J08970J16253J18000J15354J09606J01199Q9755
60094G589993P5195N8776M2541K7562J3539P07q818j2838j1588o910Q67J3368
60082G782394L1300N3027P6722J02269J29937J58813J88122K18802K52040K87071
60072I280497L22207L57427L93830M30725M65376M95960N22990N47115N67267
60063A3383394N81829N90108N91280N83120N63415N32230M91478M42625L85973
$$ y = [6806784, 6982810, 7154696, 7318233, 7470132, 7608148, 7729868, 7831892, 7911069, 7965983, 7996158, 8000309, 7976851, 7926198, 7851283, 7755702, 7642677, 7516341, 7382671, 7247906, 7116336, 6990409, 6872676, 6766841, 6676866, 6605605, 6554373, 6523414, 6512417, 6520722, 6547490, 6592111, 6654490, 6734535, 6830856, 6939826, 7056079, 7174079, 7289433, 7399039, 7500238, 7589993, 7665188, 7723964, 7766505, 7794067, 7807606, 7808313, 7799495, 7786657, 7775069, 7768159, 7769026, 7782394, 7813694, 7866721, 7943443, 8045712, 8175649, 8334462, 8522584, 8741386, 8993426, 9280497, 9602704, 9960131, 10353961, 10784686, 11250062, 11746022, 12269012, 12816127, 13383394, 13965223, 14555331, 15146611, 15729731, 16293146, 16825376, 17316854, 17759479, 18145452]
60054A8145452L21904K51336J74964R3458Q871p5476j57029k34915l08103l73789
60044A7846673m28681m70987m99935n14233n12938m97793m72951m41679m04470
60035A3603006l60901l12230k61354k11106j63322j18773p7108l7408K91L4321
60025A2095416O2753Q4749J00005J07659J06881R8112Q2676O1564L5754P230k1604
60014A2821195m9616p6967j03520j28478j51567j73251j93302k10440k23998k34766
60004A1275290k43424k49099k50507k47921k42859k35983k26244k12240j93834
59995I173179j72158j48571j23914r8564p2634m5927j8081J0595L8667O4751Q9205
59984H696548J13531J37450J57819J71618J79113J82453J81703J74447J59479
$$ y = [18145452, 18467356, 18718692, 18893656, 18987114, 18995985, 18920509, 18763480, 18528565, 18220462, 17846673, 17417992, 16947005, 16447070, 15932837, 15419899, 14922106, 14449155, 14007476, 13603006, 13242105, 12929875, 12668521, 12457415, 12294093, 12175320, 12098212, 12060804, 12061095, 12095416, 12158169, 12242918, 12342923, 12450582, 12557463, 12655575, 12738251, 12799815, 12835569, 12842799, 12821195, 12771579, 12694612, 12591092, 12462614, 12311047, 12137796, 11944494, 11734054, 11510056, 11275290, 11031866, 10782767, 10532260, 10284339, 10041480, 9805497, 9579253, 9367013, 9173179, 9001021, 8852450, 8728536, 8629972, 8557338, 8511411, 8493330, 8503925, 8542592, 8607343, 8696548, 8810079, 8947529, 9105348, 9276966, 9456079, 9638532, 9820235, 9994682, 10154161]
59975A0154161J38883J15512R0001O1359K9358n005m0542p6033j09753j40015
59965A0217926j66072j87675k04082k14413k18730k17824k11994k00924j84841
59956H411371j64920j42362j17853r2169o6553m1701j6853R375L7229O5403R2406
59945G973373J17811J42049J65462J87921K09005K27890K43216K53537K57939
59936I778203K55817K46369K29183K05408J77265J45892J10595P0910K8674j2985
59926A1235331n2200q8963j23446j54721j81141k01163k13753k18629k16251k07167
59916I577897j91595j70194j44910j18178r1174o3553l4917n989K1852M7731P1819
59905H898789R4825J16949J37309J54726J68908J80070J87494J89735J86811J80770
$$ y = [10154161, 10293044, 10408556, 10498557, 10559916, 10589274, 10584269, 10543727, 10467694, 10357941, 10217926, 10051854, 9864179, 9660097, 9445684, 9226954, 9009130, 8797136, 8596212, 8411371, 8246451, 8104089, 7986236, 7894067, 7827514, 7785813, 7768960, 7778335, 7815564, 7880967, 7973373, 8091184, 8233233, 8398695, 8586616, 8795621, 9023511, 9266727, 9520264, 9778203, 10034020, 10280389, 10509572, 10714980, 10892245, 11038137, 11148732, 11219642, 11248316, 11235331, 11183131, 11094168, 10970722, 10816001, 10634860, 10433697, 10219944, 10001315, 9785064, 9577897, 9386302, 9216108, 9071198, 8953020, 8861846, 8798293, 8763376, 8757387, 8779239, 8826970, 8898789, 8993614, 9110563, 9247872, 9402598, 9571506, 9751576, 9939070, 10128805, 10315616, 10496386]
59895A0496386J73243J63793J51851J38810J26594J15349J04600R5627R0374Q8634
59885A1745261Q8940R2006J00702J16300J37299J62473J92680K28592K68622L10362
59875A3443237L52609L94924M36430M75801N11380N40807N61723N73000N73571
59866A7863482N59779N26161M69811L92439K97568J87980O7347n7702j79212k90947
59856A9836706l88908m70260n33155n76762o00671o05287n93323n69242n36346
59847A4962752m95919m49792m01329l52417l01775k48267j94035j42263r3503
59838A2283452m6579j681L9962P8438J14489J47167J74430J95399K09618K14668
59828A3409363K07225J86557J54701J13202O2010J913o4167j32857k01422k66710
$$ y = [10496386, 10669629, 10833422, 10985273, 11124083, 11250677, 11366026, 11470626, 11566253, 11656627, 11745261, 11834201, 11926207, 12026909, 12143209, 12280508, 12442981, 12635661, 12864253, 13132875, 13443237, 13795846, 14190770, 14627200, 15103001, 15614381, 16155188, 16716911, 17289911, 17863482, 18423261, 18949422, 19419233, 19811672, 20109240, 20297220, 20364567, 20306865, 20127653, 19836706, 19447798, 18977538, 18444383, 17867621, 17266950, 16661663, 16068340, 15499098, 14962752, 14466833, 14017041, 13615712, 13263295, 12961520, 12713253, 12519218, 12376955, 12283452, 12236873, 12235192, 12275154, 12353592, 12468081, 12615248, 12789678, 12985077, 13194695, 13409363, 13616588, 13803145, 13957846, 14071048, 14133058, 14134971, 14070804, 13937947, 13736525, 13469815]
59818A3469815l24846l73024m10444m37036m52412m56800m51957m40468m24479
59809I698349m05166l82787l57342l29694l01699k74514k47535k20086j93413
59800F986113j69572j48892j30228j13328r9008q7184p6736o7725o1843n9826
59790E971771n9976o0044n9317n8016n5812n2039m6802m1050l5904l2322l0976
59779E439513l1985l5009l9732m5962n3221o0536o6705p0662p1930p0983o8598
59768D824190o4599n7993m8914l9486l1833k5996k0718j5371r884l649L949J2380
59756D522076K0725K9032L7582M5519N1891N7424O3460O9628P4646P8953Q4069
59745E135005Q9283R1527Q9268Q4302P8800P2610O4664N5394M6428L9020L3846
$$ y = [13469815, 13144969, 12771945, 12361501, 11924465, 11472053, 11015253, 10563296, 10122828, 9698349, 9293183, 8910396, 8553054, 8223360, 7921661, 7647147, 7399612, 7179526, 6986113, 6816541, 6667649, 6537421, 6424093, 6325085, 6237901, 6161165, 6093440, 6031597, 5971771, 5911795, 5851751, 5792434, 5734418, 5678606, 5626567, 5579765, 5538715, 5502811, 5470489, 5439513, 5407528, 5372519, 5332787, 5286825, 5233604, 5173068, 5106363, 5035701, 4963771, 4892788, 4824190, 4759591, 4701598, 4652684, 4613198, 4581365, 4555369, 4534651, 4519280, 4509396, 4505747, 4509696, 4522076, 4542801, 4571833, 4609415, 4654934, 4706825, 4764249, 4827709, 4897337, 4971983, 5050936, 5135005, 5224288, 5315815, 5405083, 5489385, 5568185, 5640795, 5705459, 5760853, 5807281, 5846301, 5880147]
59734E880147L1286L1062L2567L6190M3209N3708O6016P9131R4406J13616J36327
59723F597665J60440J84599K08985K34240K60874K89412L20130L52574L85973
59714H994892M19946M54159M87056N14928N32009N31363N06106M50611L61975
59705A3253045K42614J02879l9939j67892k69459l41288l84795m02992m00143
59696A1592030l81538l51960l14924k73572k30897j88558j46824j06239o8003
59687I529515l2251K430L6718O9375R9493J28614J59107J91310K23749K55565
59677A0663625K87379L20234L54943L92181M31994M73379N15385N58565O04516
59668A4602201O54018P06318P60132Q14697Q69867R25666R81552J035699J085215
$$ y = [5880147, 5911433, 5942495, 5975062, 6011252, 6054461, 6108169, 6174185, 6253316, 6347722, 6461338, 6597665, 6758105, 6942704, 7151689, 7385929, 7646803, 7936215, 8256345, 8608919, 8994892, 9414838, 9868997, 10356053, 10870981, 11402990, 11934353, 12440459, 12891070, 13253045, 13495659, 13598538, 13558599, 13390707, 13121248, 12779960, 12395165, 11992173, 11592030, 11210492, 10858532, 10543608, 10270036, 10039139, 9850581, 9703757, 9597518, 9529515, 9497264, 9499694, 9536412, 9605787, 9705280, 9833894, 9993001, 10184311, 10408060, 10663625, 10951004, 11271238, 11626181, 12018362, 12450356, 12923735, 13439120, 13997685, 14602201, 15256219, 15962537, 16722669, 17537366, 18407233, 19332899, 20314451, 21350150, 22435365]
59659B2435365J127452J160722J183241J192118J184652J160867J124227J079795
59651C1648439J032219R85400R43253R09833Q88354Q79749Q81908Q90260Q99375
59642C9958790R04375R01136Q85478Q52588P97886P19153O18125M99898L70734
59633D6508163K36774J04514j8777j26209k12649k74643l09859l17564k99300
59624D5290450k58050j96844j18696k7163P4365J83917L00479M22397N47159O72465
59614D6890479P96300R15747J026597J124250J203954J259982J285187J271361
59606E5773857J209669J091791R12733O73723L82563N2186l00089o53187r85196
59597E8158050j277621j517461j696936j813683j871431j878449j844255j778050
$$ y = [22435365, 23562817, 24723539, 25906780, 27098898, 28283550, 29444417, 30568644, 31648439, 32680658, 33666058, 34609311, 35519144, 36407498, 37287247, 38169155, 39059415, 39958790, 40863165, 41764301, 42649779, 43502367, 44300253, 45019406, 45637531, 46137429, 46508163, 46744937, 46849451, 46830674, 46704465, 46491816, 46217173, 45907314, 45589750, 45290450, 45032400, 44835556, 44716860, 44689697, 44764062, 44947979, 45248458, 45670855, 46218014, 46890479, 47686779, 48602526, 49629123, 50753373, 51957327, 53217309, 54502496, 55773857, 56983526, 58075317, 58988050, 59661773, 60044336, 60096522, 59796433, 59143246, 58158050, 56880429, 55362968, 53666032, 51852349, 49980918, 48102469, 46258214, 44480164]
59589D4480164j689188j586927j479438j375072j284693j220205j189309j192340
59581C3462992j223627j273390j327975j372079j394218j390312j361839j312447
59573B2807105j247180j172394j093639j013844r34591q57856p85210p16696o52140
59564A4333555n92682n39481m91798m47944m07302l70005l35454l02838k72664
59555A0573387k46161k23440k03473j85681j70423j58203j49375j44276j42805
59546H949550j44157j47628j52961j59295j64805j68509j71361j74232j75733
59537G490869j73607j67642j59579j50633j40720j29903j18896j08006r6858q5298
59527F159727p3555o1453m8695l5926k4514j4943o229K921J2961K3380L3071M0948
$$ y = [44480164, 42790976, 41204049, 39724611, 38349539, 37064846, 35844641, 34655332, 33462992, 32239365, 30965975, 29638000, 28265921, 26871703, 25481391, 24119552, 22807105, 21559925, 20387531, 19293892, 18280048, 17345457, 16487601, 15702391, 14985695, 14333555, 13740873, 13201392, 12709594, 12261650, 11854348, 11484343, 11148889, 10846051, 10573387, 10327226, 10103786, 9900313, 9714632, 9544209, 9386006, 9236631, 9092355, 8949550, 8805393, 8657765, 8504804, 8345509, 8180704, 8012195, 7840834, 7666602, 7490869, 7317262, 7149620, 6990041, 6839408, 6698688, 6568785, 6449889, 6341883, 6245025, 6159727, 6086172, 6024719, 5976024, 5940098, 5915584, 5900641, 5894412, 5897333, 5910294, 5933674, 5966745, 6007693]
59515F007693M6866N1773N6508O0863O4454O7940P2354P7752Q3545Q9857R7435
59504F777040J06383J16154J26799J39187J53653J69300J84980K00561K17094
59495H191151K36011K57873K81556L05024L27318L49208L71267L92173M10015
59486A1121596M24686M37450M48185M54566M54349M47340M34661M17113L95073
59477A5035019L69132L39664L05982K67063K23723J79529J38823J03705P3483
59468A7036123M7017K4854Q458j719o309n452J617J5404L5652O1893R3154J26745
59456A7437437J58664J85644K05661K16049K12776J92661J55376J02506L5888
59447A8902662m2091j27713k16840l05990l91513m68609n32681n81374o14399
$$ y = [6007693, 6054559, 6106332, 6162840, 6223703, 6288157, 6356097, 6428451, 6506203, 6589748, 6679605, 6777040, 6883423, 6999577, 7126376, 7265563, 7419216, 7588516, 7773496, 7974057, 8191151, 8427162, 8685035, 8966591, 9271615, 9598933, 9948141, 10319408, 10711581, 11121596, 11546282, 11983732, 12431917, 12886483, 13340832, 13788172, 14222833, 14639946, 15035019, 15404151, 15743815, 16049797, 16316860, 16540583, 16720112, 16858935, 16962640, 17036123, 17083140, 17107994, 17116452, 17114733, 17108424, 17102972, 17104589, 17119993, 17155645, 17217538, 17310692, 17437437, 17596101, 17781745, 17987406, 18203455, 18416231, 18608892, 18764268, 18866774, 18902662, 18860571, 18732858, 18516018, 18210028, 17818515, 17349906, 16817225, 16235851, 15621452]
59438A5621452o31932o34341o23150o01044n70866n34983m95173m52552m08091
59429A0669320l63556l21130k81507k43445k06004j70174j37146j06030p4795
59420H765533m2832j1189J9430M9490P9545J09454J38713J66965J94323K21409
59410I690841K48419K73774K94797L10423L22092L30772L34313L29129L13665
59401A2448225K88672K54702K11000J56794R2627K0795n4521j28162j96356k57965
59391A2835811l12714l59052l94872m19528m33876m39088m36740m29174m18085
59382I192682m03225l83920l61317l37804l14822k92775k72230k53386k34897
59373F338306k15223j94976j76216j59598j43921j28194j12548r7324q3005p0686
$$ y = [15621452, 14989520, 14355179, 13732029, 13130985, 12560119, 12025136, 11529963, 11077411, 10669320, 10305764, 9984634, 9703127, 9459682, 9253678, 9083504, 8946358, 8840328, 8765533, 8722701, 8711512, 8730942, 8780432, 8859977, 8969431, 9108144, 9275109, 9469432, 9690841, 9939260, 10213034, 10507831, 10818254, 11140346, 11471118, 11805431, 12134560, 12448225, 12736897, 12991599, 13202599, 13359393, 13452020, 13472815, 13418294, 13290132, 13093776, 12835811, 12523097, 12164045, 11769173, 11349645, 10915769, 10476681, 10039941, 9610767, 9192682, 8789457, 8405537, 8044220, 7706416, 7391594, 7098819, 6826589, 6573203, 6338306, 6123083, 5928107, 5751891, 5592293, 5448372, 5320178, 5207630, 5110306, 5027301, 4956615]
59363D956615o0788n1525m0605k8365j7244q235N1Q596J6543K3262K9900L7770
59351D865975M6356N3558N7057N5511M9840M3585M0579M1894M6142N2477O1664
59340E414638P4259Q9606J06742J24306J39388J48851J52808J55159J59913J68631
59330F734301J81840K00630K25383K54600K86330L19720L54363L89675M26065
59321I372907M65182N07685N52119N97348O44614O95373P47945P98097Q42335
59312A5223605Q79061R06864R23429R26364R14172Q86488Q44361P90404P27940
59303B3022688O59932N89096N18485M50925L87681L28176K70972K14546J57339
59294B6599840R7678L4076l4464j08335j87328k70650l56721m42708n24415n97487
$$ y = [4956615, 4895827, 4844302, 4803697, 4775332, 4758088, 4749853, 4749904, 4758500, 4775043, 4798305, 4828205, 4865975, 4912331, 4965889, 5022946, 5078457, 5128297, 5171882, 5212461, 5254355, 5300497, 5352974, 5414638, 5488897, 5578503, 5685245, 5809551, 5948939, 6097790, 6250598, 6405757, 6565670, 6734301, 6916141, 7116771, 7342154, 7596754, 7883084, 8202804, 8557167, 8946842, 9372907, 9838089, 10345774, 10897893, 11495241, 12139855, 12835228, 13583173, 14381270, 15223605, 16102666, 17009530, 17932959, 18859323, 19773495, 20659983, 21504344, 22294748, 23022688, 23682620, 24271716, 24790201, 25241126, 25628807, 25956983, 26227955, 26442501, 26599840, 26697518, 26731594, 26697130, 26588795, 26401467, 26130817, 25774096, 25331388, 24806973, 24209486]
59284B4209486o59320p09924p50986p84194q10188q28525q38429q39703q32899
59275A7155318q18618p97151p69145p36133o99759o60798o19645n77457n35885
59266A0940727m95802m56985m19092l82300l47000l13464k81869k52362k25077
59257G766776k00198j77660j56649j36140j16239r8062q1784o5948m9535l3513
59247F651048j9128n785P846K1651L4736M7564O1377P6013R0159J03511J16736
59236G185728J29423J40272J49441J58620J68238J76440J81636J84498J86627
59227H660923J88364J88655J86226J80493J72244J63667J56851J52131J48511
59218A0198065J45314J42342J38920J34221J28220J20825J10507R5653P7047N7042
$$ y = [24209486, 23550166, 22840242, 22089256, 21305062, 20494874, 19666349, 18827920, 17988217, 17155318, 16336700, 15539549, 14770404, 14034271, 13334512, 12673714, 12054069, 11476612, 10940727, 10444925, 9987940, 9568848, 9186548, 8839548, 8526084, 8244215, 7991853, 7766776, 7566578, 7388918, 7232269, 7096129, 6979890, 6881828, 6800044, 6734096, 6684561, 6651048, 6631920, 6626135, 6633981, 6655632, 6690368, 6737932, 6799309, 6875322, 6965481, 7068992, 7185728, 7315151, 7455423, 7604864, 7763484, 7931722, 8108162, 8289798, 8474296, 8660923, 8849287, 9037942, 9224168, 9404661, 9576905, 9740572, 9897423, 10049554, 10198065, 10343379, 10485721, 10624641, 10758862, 10887082, 11007907, 11118414, 11214067, 11291114, 11348156]
59208A1348156L6259J3082j3485m2392p2090j01351j28366j51219j69721j84759
59198A0534114j95447j99215j95412j86471j74728j60426j43698j25867j07306
59189I045544q6487o3057l9725j9009J91K0340M1128N9937P5641Q9487J02484
59178I226474J14042J23434J31009J37534J43271J48080J52011J55859J61374
59169A0493088J70422J83575J99871K18180K38313K60811K86376L15463L47315
59160A2713414L79340M08468M33219M53058M65632M66254M50683M17152L65484
59151A6552704K96011K10192J10929J563j14235k31242l43081m44668n33053o05519
59141A4899601o58868o91580p05213p02758o87072o61426o29509n93589n54143
$$ y = [11348156, 11384415, 11397497, 11384012, 11341620, 11269530, 11168179, 11039813, 10888594, 10718873, 10534114, 10338667, 10139452, 9944040, 9757569, 9582841, 9422415, 9278717, 9152850, 9045544, 8959057, 8896000, 8856275, 8837266, 8837457, 8857797, 8898925, 8958862, 9034503, 9123990, 9226474, 9340516, 9463950, 9594959, 9732493, 9875764, 10023844, 10175855, 10331714, 10493088, 10663510, 10847085, 11046956, 11265136, 11503449, 11764260, 12050636, 12366099, 12713414, 13092754, 13501222, 13934441, 14387499, 14853131, 15319385, 15770068, 16187220, 16552704, 16848715, 17058907, 17169836, 17171399, 17057164, 16825922, 16482841, 16038173, 15505120, 14899601, 14240733, 13549153, 12843940, 12141182, 11454110, 10792684, 10163175, 9569586, 9015443]
59132I015443n12251m70685m31579l94823l59920l27721k98869k72368k47251
59123E699976k24203k04007j85805j68520j52671j39194j27618j16874j06669
59114D274415r6832q6694p6508o7977o1768n6002m8817m0864l3594k6727j9503
59103C659129j2789p499k237M850J2718J8716K2702K7260L3992M1939M9813N7526
59091C906120O5086P1780P7120Q1556Q5885R0767R6671J03499J10571J17598J24979
59080D931632J32496J38808J43274J47120J51434J55221J56931J56724J55441
59071F269081J52389J46233J37331J27225J16459J04773R2880Q1960P1897O2016
59061G362244N3208M7271M4408M3547M4998N0459O0125P1890Q3987R6740J11168
$$ y = [9015443, 8503192, 8032507, 7600928, 7206105, 6846185, 6518464, 6219595, 5947227, 5699976, 5475773, 5271766, 5085961, 4917441, 4764770, 4625576, 4497958, 4381084, 4274415, 4177583, 4090889, 4014381, 3946404, 3884636, 3828634, 3779817, 3738953, 3705359, 3678632, 3659129, 3646340, 3638841, 3636604, 3641454, 3654172, 3672888, 3695590, 3722850, 3756842, 3798781, 3848594, 3906120, 3971206, 4042986, 4120106, 4201662, 4287547, 4378314, 4474985, 4578484, 4689055, 4806653, 4931632, 5064128, 5202936, 5346210, 5493330, 5644764, 5799985, 5956916, 6113640, 6269081, 6421470, 6567703, 6705034, 6832259, 6948718, 7053491, 7146371, 7228331, 7300228, 7362244, 7415452, 7462723, 7507131, 7550678, 7595676, 7646135, 7706260, 7778150, 7862137, 7958877, 8070045]
59050H070045J27421J45178J64264J84171K03867K22415K38978K52142K60164
59041I868645K62057K57498K45707K25248J95061J55117J06452N1472o035o2067
59031A1299155j13584j58315j94321k20720k38102k47243k48225k41841k30907
59022I405897k18761k07105j96425j87479j80889j76198j73177j73242j77608
59013G715013j84681j91457j97117k03133k09976k15878k19102k19565k17850
59004E856254k14350k09745k04750j99016j91522j82314j72711j63740j55547
58995D162559j48186j41559j34747j26875j18650j11503j05328r8787r1877q6215
58985B998832q2387p8887p4433o9749o5934o2426n7790n1860m6068m1945l9799
$$ y = [8070045, 8197466, 8342644, 8506908, 8691079, 8894946, 9117361, 9356339, 9608481, 9868645, 10130702, 10388200, 10633907, 10859155, 11054216, 11209333, 11315785, 11367257, 11361222, 11299155, 11185571, 11027256, 10832935, 10612215, 10374113, 10126870, 9878645, 9636804, 9405897, 9187136, 8980031, 8783606, 8596127, 8415238, 8239040, 8065863, 7892621, 7715013, 7530332, 7338875, 7141758, 6938625, 6728649, 6512771, 6293669, 6074104, 5856254, 5641904, 5432159, 5227409, 5028393, 4836871, 4654557, 4481846, 4318106, 4162559, 4014373, 3872814, 3738067, 3611192, 3492542, 3381039, 3275711, 3176924, 3085047, 2998832, 2916445, 2837558, 2763125, 2693376, 2627442, 2565016, 2507226, 2455366, 2409298, 2367353, 2327554]
58974B327554l8630l6994l4113l0291k6161k2015j8081j4835j2391j0158p776
58963B076109n787m571l390j509M83J513J526J027j23j932l133k443o25M29L98
58948B057972O61J790K620K186J213J229K920N512P248O883N309N017P072R673
58934B117305J0834J1319J3127J6058J8034J8436J8880K0511K2529K3804K4454
58923B315291K5313K6806K8613K9717K9229K7922K8082L0635L3333L3506L1727
58912B640174L0919L2578L5778L9280M2288M3697M3059M2133M3148M5590M7218
58901C085862M8042N0475N5220N9967O3141O6111P0306P4479P6779P7865Q0130
58890C808377Q4818R1335R8620J05906J12711J19091J25817J33665J42826J53050
$$ y = [2327554, 2288924, 2251930, 2217817, 2187526, 2161365, 2139350, 2121269, 2106434, 2094043, 2083885, 2076109, 2070322, 2065751, 2062361, 2060852, 2061335, 2062848, 2064374, 2065401, 2065278, 2063346, 2060213, 2057770, 2057145, 2057574, 2057972, 2058633, 2060423, 2063043, 2065229, 2066442, 2067671, 2070591, 2076103, 2083351, 2090234, 2095543, 2100560, 2107632, 2117305, 2128139, 2139458, 2152585, 2168643, 2186677, 2205113, 2223993, 2244504, 2267033, 2290837, 2315291, 2340604, 2367410, 2396023, 2425740, 2454969, 2482891, 2510973, 2541608, 2574941, 2608447, 2640174, 2671093, 2703671, 2739449, 2778729, 2821017, 2864714, 2907773, 2949906, 2993054, 3038644, 3085862, 3133904, 3184379, 3239599, 3299566, 3362707, 3428818, 3499124, 3573603, 3650382, 3728247, 3808377, 3893195, 3984530, 4083150, 4189056, 4301767, 4420858, 4546675, 4680340, 4823166, 4976216]
58880D976216J63974J75219J86739J98980K12153K25773K39599K54593K71884
58871F905130K91278L11808L33274L56173L80767M07400M37035M70071N05247
58862A0398183N41323N79047O19785O63084P07558P53364Q01407Q50572Q98332
58853A6812655R43888R88072J029901J065697J091938J106579J106907J088448
58845B5234085J046988R80074Q86119P63962O14336M40688K48380M4462j61828
58836C0097266l60262n42221p01596q34144r38054j014684j066576j094714j099691
58827B2445324j085076j056912j019722r75315r25479q73035q19731p65658p11614
58818A4212782o59891o12194n68611n28966m93047m59567m27295l97209l71048
$$ y = [4976216, 5140190, 5315409, 5502148, 5701128, 5913281, 6139054, 6378653, 6633246, 6905130, 7196408, 7508216, 7841490, 8197663, 8578430, 8985830, 9422865, 9892936, 10398183, 10939506, 11518553, 12138338, 12801422, 13508980, 14262344, 15063751, 15914323, 16812655, 17756543, 18744615, 19774516, 20840213, 21932151, 23038730, 24145637, 25234085, 26281073, 27261147, 28147266, 28911228, 29525564, 29966252, 30214632, 30259094, 30097266, 29737004, 29194783, 28493187, 27659043, 26720989, 25706305, 24639729, 23545015, 22445324, 21360248, 20303336, 19283614, 18308299, 17382820, 16509785, 15690054, 14924396, 14212782, 13552891, 12940697, 12372086, 11843120, 11350073, 10890506, 10463211, 10066002, 9694954]
58809I694954l47795l24670l01635k81361k64197k46809k27158k07269j89562
58800G304498j73685j58717j45331j33561j21291j07347r3677q2243p1940o0853
58790F155853m9368l8571k7485j4544n30J2351K3368L3473M3660N4757O7636Q2017
58778F342617R6147J08976J21598J35383J50099J65025J80507J97165K14891K33680
58768G946088K53994K75450K96924L18821L43254L70970M00367M30668M63472
58759A1100008M99596N37049N74341O13227O55855P01300P47576P94888Q43870
58750A7067710Q92215R36245R74757J008220J034784J049812J049013J029498
58742B5042254R88058R20838Q25227P00818N49059L73837J82050j8031k18986
$$ y = [9694954, 9347159, 9022489, 8720854, 8439493, 8175296, 7928487, 7701329, 7494060, 7304498, 7130813, 6972096, 6826765, 6693204, 6571913, 6464566, 6370889, 6288646, 6216706, 6155853, 6106485, 6067914, 6040429, 6025885, 6025355, 6037706, 6061074, 6094547, 6138207, 6192964, 6260600, 6342617, 6438764, 6547740, 6669338, 6804721, 6954820, 7119845, 7300352, 7497517, 7712408, 7946088, 8200082, 8475532, 8772456, 9091277, 9434531, 9805501, 10205868, 10636536, 11100008, 11599604, 12136653, 12710994, 13324221, 13980076, 14681376, 15428952, 16223840, 17067710, 17959925, 18896170, 19870927, 20879147, 21913931, 22963743, 24012756, 25042254, 26030312, 26951150, 27776377, 28477195, 29026254, 29400091, 29582141, 29564110, 29345124]
58733B9345124m13718n93828p50771q79124r77883j048866j094817j118426j121832
58724B1345859j107013j077140j036791r90109r39458q86445q33052p80897p30461
58715A2964493o82081o36635n94445n54778n17466m83638m53777m26346l99635
58706H215692l73817l49925l28066l07847k89372k72452k56027k39542k23848
58697E574796k09547j95766j81852j68893j58067j48650j39114j29239j19663
58688D124005j10460j01501r3357q6479q0390p4714o9975o6428o3231n9769n6515
58677C261186n3609n0138m5906m2359m0520l9566l8638l8270l8723l8762l7790
58666B796905l7313l8452l9726l9350l8238l8450m0016m1552m2943m5009m7147
$$ y = [29345124, 28931406, 28337578, 27586807, 26707683, 25729800, 24680934, 23586117, 22467691, 21345859, 20238846, 19161706, 18124915, 17134806, 16195348, 15308903, 14475851, 13694954, 12964493, 12282412, 11645777, 11051332, 10496554, 9979088, 9495450, 9041673, 8615327, 8215692, 7841875, 7491950, 7163884, 6856037, 6566665, 6294213, 6038186, 5798644, 5574796, 5365249, 5169483, 4987631, 4818738, 4660671, 4512021, 4372907, 4243668, 4124005, 4013545, 3912044, 3818687, 3732208, 3651818, 3577104, 3507129, 3440701, 3377470, 3317701, 3261186, 3207577, 3157439, 3111533, 3069174, 3028654, 2989088, 2950450, 2912180, 2873457, 2834695, 2796905, 2759592, 2721140, 2681414, 2642064, 2603826, 2565376, 2525360, 2483808, 2440865, 2395856, 2348709]
58655B348709m7593m5947m3738m2506m2414m2501m1542l9088l6167l4161l2817
58644A900235l0770k8227k7161k8163k9199k8503k6709k5116k3928k3316k3926
58633A605217k5138k5061k3534k2578k2669k1495j8112j5078j4257j3604j0990
58622A392701q198p817q624p578m559j695L67K265L506L526L791N755P948P961
58608A389349O168M587L479K037R47J124J248k59k004j640J24Q33M14N56J098
58593A408061P76P40L387P980J1184J2002J2772J5128J8183K0948K3495K5482
58581A560138K6375K7405L0623L5776M0546M3904M6827M9834N2542N5674O0777
58570B030421O7607P4239Q0084Q6486R4144J02205J10266J19130J29253J40169
$$ y = [2348709, 2301116, 2255169, 2211431, 2168925, 2126511, 2084010, 2042468, 2003380, 1967213, 1933052, 1900235, 1869465, 1841238, 1814077, 1785914, 1756715, 1728212, 1701503, 1676387, 1652459, 1629143, 1605217, 1580079, 1555018, 1531484, 1508906, 1486237, 1464742, 1446630, 1431552, 1417295, 1403691, 1392701, 1384503, 1376686, 1368062, 1360484, 1355925, 1354230, 1354597, 1356862, 1360368, 1363894, 1367685, 1373440, 1381388, 1389349, 1395517, 1400104, 1403583, 1405620, 1406567, 1407691, 1408939, 1408680, 1406676, 1405036, 1405160, 1405993, 1406407, 1406963, 1408061, 1408837, 1409577, 1412964, 1420944, 1432128, 1444130, 1456902, 1472030, 1490213, 1511161, 1534656, 1560138, 1586513, 1613918, 1644541, 1680317, 1720863, 1764767, 1811594, 1861428, 1913970, 1969644, 2030421, 2098028, 2172267, 2252351, 2338837, 2432981, 2535186, 2645452, 2764582, 2893835, 3034004]
58560C034004J51797J64719J79151J94786K11369K28177K43778K57808K71895
58551D937484K87024L00995L10375L13846L11563L02368K84078K55629K16760
58542G520122J66684J05758L7798l1481r7728j58017k09207k48991k77572k96054
58532F511312l04286l02659k94509k83811k71534k56796k40329k23895k07477
58523D126016j90184j72918j57326j43079j28928j15308j03149r1561p9754o9596
58513B874213o3051n8543n3376m8199m5365m4432m3236m2035m2288m2547m0176
58502B350965l6303l4473l4954l4823l3403l2910l3870l4433l4378l5478l7518
58491A968422l8212l7369l7136l7782l7276l5322l3790l2875l0880k8118k6939
$$ y = [3034004, 3185801, 3350520, 3529671, 3724457, 3935826, 4164003, 4407781, 4665589, 4937484, 5224508, 5525503, 5835878, 6149724, 6461287, 6763655, 7047733, 7303362, 7520122, 7686806, 7792564, 7830362, 7798881, 7701153, 7543136, 7333929, 7084938, 6807366, 6511312, 6207026, 5904367, 5609858, 5326047, 5054513, 4797717, 4557388, 4333493, 4126016, 3935832, 3762914, 3605588, 3462509, 3333581, 3218273, 3115124, 3023563, 2943809, 2874213, 2811162, 2752619, 2699243, 2651044, 2605679, 2561247, 2518011, 2475976, 2433688, 2391141, 2350965, 2314662, 2280189, 2245235, 2210412, 2177009, 2144099, 2110229, 2075796, 2041418, 2005940, 1968422, 1930210, 1892841, 1855705, 1817923, 1780647, 1745325, 1711535, 1678660, 1647780, 1619662, 1592723]
58480A592723k7372k6804k4557k2845k2649k2471k1654k1073k0210j7505j4024
58469A351559j2674j3218j2340r296p257q058r731j0296j0128r601q126o552o712
58456A227570p801o904l828j472p14Q32M011O296O118N115M643L782K035N10q22
58441A239371l480p127r280r378r562j0701j1316j1064j1437j2293j1698r976
58429A122059r672j0731j0122p218n102n293n679n085n320p068q113p424o882
58416A028350p221o457m082k640l184l331j718m47j097k175k533l593o061p899
58402I75912p553o024m338k188j87J28m43P21L454M675L619K871L405L403K868
58387I80323M280P389Q653P501P656J0394J1967J0144P849P645P660N902L702
$$ y = [1592723, 1565351, 1538547, 1513990, 1491145, 1468496, 1446025, 1424371, 1403298, 1383088, 1365583, 1351559, 1338885, 1325667, 1313327, 1304031, 1296774, 1288716, 1278985, 1268689, 1258561, 1248960, 1240834, 1234282, 1227570, 1219769, 1212865, 1209037, 1207565, 1206851, 1207683, 1211694, 1217990, 1224108, 1229223, 1233866, 1237648, 1239683, 1240193, 1239371, 1235891, 1228764, 1219484, 1210106, 1200544, 1189843, 1178527, 1167463, 1156026, 1143733, 1132035, 1122059, 1112387, 1101656, 1091534, 1084316, 1079214, 1073921, 1068242, 1063157, 1057837, 1050769, 1042656, 1035232, 1028350, 1021129, 1014672, 1010590, 1007950, 1004766, 1001435, 999717, 999270, 998173, 995998, 993465, 989872, 983811, 975912, 968359, 962335, 957997, 955809, 955622, 955750, 955307, 956028, 959482, 964157, 967776, 970647, 974052, 977455, 980323, 984603, 991992, 1000645, 1008146, 1015802, 1026196, 1038163, 1048307, 1056156, 1063801, 1071461, 1077363, 1081065]
58374A081065K096n31m395o591o203o454r070j1157j0472r014q535p376m772l460
58360I95131m712n449l486j195p56n00Q48J127n91j040J796M813N051M437N574
58345A001048P163P470Q118J0491J2269J1369R708R491R492Q218P084P297P354
58332A116572O457O379P394O899M710M690Q211J1253J1218J1171J3683J6001J5344
58319A239982J3779J3581J2800R702O710N819M918K586J438K728L062O62o58J755
58305A318864M419M127L610N693P591O415M886N939P006N370L953N853Q182P365
58291A399273N620O055O285L307K04J412N229P177P125P393P608O900P286R725
58277A480599J0884Q697O619P699R426R184R343J1802J3481J2619J3328J7973
$$ y = [1081065, 1083161, 1082630, 1078235, 1071644, 1065441, 1058987, 1049917, 1038760, 1028288, 1019274, 1010739, 1003363, 998591, 995131, 990419, 984970, 981484, 980289, 979533, 979033, 979881, 981008, 980417, 979377, 981173, 985986, 991037, 995474, 1001048, 1008211, 1015681, 1023799, 1034290, 1046559, 1057928, 1067636, 1077127, 1086619, 1094837, 1101921, 1109218, 1116572, 1123029, 1129408, 1136802, 1143701, 1148411, 1153101, 1161312, 1172565, 1183783, 1194954, 1208637, 1224638, 1239982, 1253761, 1267342, 1280142, 1289844, 1296554, 1302373, 1307291, 1309877, 1311315, 1314043, 1317105, 1317767, 1317109, 1318864, 1323283, 1327410, 1331020, 1336713, 1344304, 1350719, 1355605, 1361544, 1368550, 1373920, 1377873, 1383726, 1391908, 1399273, 1404893, 1410948, 1417233, 1420540, 1420744, 1422156, 1427385, 1434562, 1441687, 1449080, 1456688, 1463588, 1470874, 1480599, 1491483, 1500180, 1506799, 1514498, 1523924, 1533108, 1542451, 1554253, 1567734, 1580353, 1593681, 1611654]
58265A611654K1488J9690J6924J8556K2064K2651K1692K2308K2488K0094J8857
58254A838466K1944K5295K4697K3537K6093K9251K8601K6506K6515K6273K3814
58243B120992K3690K8595L2291K9840K7085L0368L4673L2830K8959L0989L6480
58232B456792L7997L6716L8533M2008M2210M1601M5290N0177N0477M9140N2240
58221B943181N7106N7866N7486O2115O8533O9827O8638P2047P7995P9673P8773
58210C693240Q1482Q5829Q6051Q5171R0157R8818J04274J07861J14853J22489
58200D670225J25361J27374J35179J45342J51326J56874J68488J81582J88980
58191F050731J95912K10835K28839K40625K50414K67488K87559L01002L12173
$$ y = [1611654, 1633142, 1652832, 1669756, 1688312, 1710376, 1733027, 1754719, 1777027, 1799515, 1819609, 1838466, 1860410, 1885705, 1910402, 1933939, 1960032, 1989283, 2017884, 2044390, 2070905, 2097178, 2120992, 2144682, 2173277, 2205568, 2235408, 2262493, 2292861, 2327534, 2360364, 2389323, 2420312, 2456792, 2494789, 2531505, 2570038, 2612046, 2654256, 2695857, 2741147, 2791324, 2841801, 2890941, 2943181, 3000287, 3058153, 3115639, 3177754, 3246287, 3316114, 3384752, 3456799, 3534794, 3614467, 3693240, 3774722, 3860551, 3946602, 4031773, 4121930, 4220748, 4325022, 4432883, 4547736, 4670225, 4795586, 4922960, 5058139, 5203481, 5354807, 5511681, 5680169, 5861751, 6050731, 6246643, 6457478, 6686317, 6926942, 7177356, 7444844, 7732403, 8033405, 8345578]
58182H345578L31343L54627L71732L86350M08466M33968M53329M72844N04590
58173A2062827N42803N73954O03014O44998O97610P47896P98844Q62379R32755
58164A8467080R94791J052087J118876J191290J256736J323704J410477J512228
58156B8327269J613062J722220J862524K031389K211107K408033K640548K898976
58148D5715128L163552L453300L809044M238228M728230N300194N987705O773660
58140H3169041P618827Q546978R628025J0882277J2277698J3805596J5461331
58133A61389773J7169474J8865189K0672263K2885177K5768911K9462630L3877255
58126C30090672L8172942M0169174L6905050K6688634J0929198o309836k0819228
$$ y = [8345578, 8676921, 9031548, 9403280, 9789630, 10198096, 10632064, 11085393, 11558237, 12062827, 12605630, 13179584, 13782598, 14427596, 15125206, 15873102, 16671946, 17534325, 18467080, 19461871, 20513958, 21632834, 22824124, 24080860, 25404564, 26815041, 28327269, 29940331, 31662551, 33525075, 35556464, 37767571, 40175604, 42816152, 45715128, 48878680, 52331980, 56141024, 60379252, 65107482, 70407676, 76395381, 83169041, 90787868, 99334846, 108962871, 119845148, 132122846, 145928442, 161389773, 178559247, 197424436, 218096699, 240981876, 266750787, 296213417, 330090672, 368263614, 408432788, 445337838, 472026472, 482955670, 476645834, 455826606]
58119D55826606l0446516l5290469l6513502l5346538l2819842k9730724k6550442
58112B29128573k3454901k0519572j7827768j5415566j3245348j1279829r515198
58105A17870391p929527o474769n144842l991688l048376k287115j688484j323360
58097H5982230j328962j790698k632753l611303m434559m925881n085887n008727
58089E7163460m772956m426587m025946l628560l255117k898798k566870k279599
58081B9309027k036312j818240j622010j458924j324789j201857j088919r99912
58073A7758064r33371q71420q09044p57413p17344o75494o28867n88849n58269
58064A1217993n26728m91140m59763m33650m04287l71850l46653l30604l15389
$$ y = [455826606, 425380090, 390089621, 353576119, 318229581, 285409739, 255679015, 229128573, 205673672, 185154100, 167326332, 151910766, 138665418, 127385589, 117870391, 109940864, 103466095, 98321253, 94329565, 91281189, 88994074, 87305590, 85982230, 84653268, 82862570, 80229817, 76618514, 72183955, 67258074, 62172187, 57163460, 52390504, 47963917, 43937971, 40309411, 37054294, 34155496, 31588626, 29309027, 27272715, 25454475, 23832465, 22373541, 21048752, 19846895, 18757976, 17758064, 16824693, 15953273, 15144229, 14386816, 13669472, 12993978, 12365111, 11776262, 11217993, 10691265, 10200125, 9740362, 9306712, 8902425, 8530575, 8183922, 7853318, 7537929]
58055G537929l00194k92636k90811k82886k66620k51992k42629k31690k17862
58046E160609k08276k03244j94623j81770j73256j70425j64931j54956j48238
58037C560890j46270j40900j29852j20821j16564j10162r8974q9586q4940p9443
58027B443378p0917o4994o3788o1862n7106n4297n4581n2529m6891m3369m3704
58016A829340m2714l8907l7368l9289l9218l5540l3281l3767l1973k6894k4125
58005A446264k5250k4851k1063j8850j9730j8493j3448j0098j1011j1570r342
57994A262558q259r993j0329p817p062r787j1384r824r333j1685j2510r949q413
57981A136213r908j0001o408l547m466n938n534n922q263q740n776l594m842o505
$$ y = [7537929, 7237735, 6945099, 6654288, 6371402, 6104782, 5852790, 5610161, 5378471, 5160609, 4952333, 4749089, 4554466, 4372696, 4199440, 4029015, 3864084, 3709128, 3560890, 3414620, 3273720, 3143868, 3023047, 2906483, 2796321, 2697347, 2607761, 2522821, 2443378, 2372461, 2307467, 2243679, 2181817, 2124711, 2070414, 2015833, 1963304, 1916413, 1873044, 1829340, 1786626, 1747719, 1710351, 1671062, 1631844, 1596304, 1563023, 1529256, 1497283, 1470389, 1446264, 1421014, 1396163, 1375100, 1356250, 1336520, 1318027, 1304579, 1294481, 1283470, 1271900, 1262558, 1254299, 1244306, 1233977, 1226160, 1219098, 1209311, 1197927, 1188103, 1178770, 1167085, 1154575, 1144626, 1136213, 1126305, 1116304, 1109896, 1106349, 1101883, 1095945, 1090411, 1084489, 1076226, 1067486, 1061710, 1058116, 1053274, 1046769]
57967A046769o528p477j0177j0849q220o479p739q490o996o981j0336j3148j2732
57954I30617j1720j1597r456m966l216o337r321q568p519r148j0070p350m547
57941H26802n258o610m758j501J3R63L083M149K463J133K759M398K765J79L39
57926H30919K143K558J843J448L54k154l742l023k585m215n159l120q87j626l542
57911H09212l670l242m746p046p863q022q974r237p374n534n898o535m833k226
57897G24012j527k208k262k297l907o071o729o029n132l877k124j018o96M61K325
57882F82921K259K3o23J944L876K119j79J132M377N078K892Q43k06j809m265o384
57866F93998p802q580q125o827o601p624p145l815l05Q32O81Q49L59j295j638
$$ y = [1046769, 1040241, 1032764, 1022587, 1011738, 1003518, 997039, 989300, 980810, 973814, 966833, 956497, 943349, 930617, 918897, 907300, 897844, 892878, 889662, 883325, 874004, 865436, 857917, 848769, 838699, 831349, 826802, 821544, 814934, 810176, 808675, 808688, 809651, 812734, 816883, 819346, 820479, 823238, 827636, 830401, 830580, 830919, 833062, 835620, 837463, 838911, 839265, 837111, 833369, 830346, 827761, 823546, 818387, 815267, 814380, 812754, 809212, 805542, 802300, 797554, 790508, 782645, 774623, 765649, 756412, 749038, 743504, 737606, 731071, 726238, 724012, 722485, 720277, 718015, 715718, 711811, 705740, 699011, 692982, 687850, 683973, 681849, 680831, 680135, 680596, 682921, 685180, 685203, 684580, 686524, 690400, 692519, 692340, 693472, 697849, 702927, 705819, 706662, 706456, 704647, 700382, 693998, 686196, 677616, 669491, 662664, 656063, 648439, 641294, 637479, 637174, 638006, 638687, 639536, 639895, 638600, 636962]
57851F36962Q27L523M095M397O453Q025O425L579K782L140J849m53j211q18j407
57836F78168k546k375j568k107l513m005l938m664n561n613o023p777q764p096
57822F12618n087n755p422o329l005j183j561j451j9P14J46J65J650L321M308
57807E91110M948N028L984K707K689L743M728N706P173Q299Q258P905P685N681
57793F69644O70m523o156m725l682m284n166n864p143q529q929r076j0250j1348
57779E80639j0556q990r078j0060q921n611l531m528o626p305o246m405k763k328
57765D89691l402m782n283n470o219o805o456o354p564q425o945m385l339l500
57751D10762k775j523j876l519l922k558j317q15J92J826K917L831N984Q385Q079
$$ y = [636962, 637789, 641312, 645407, 649804, 656257, 664282, 670707, 674286, 677068, 680208, 682057, 681604, 680393, 679575, 678168, 675622, 673247, 671679, 669572, 666059, 662054, 658116, 653452, 647891, 642278, 636255, 628478, 619714, 612618, 607531, 601776, 594354, 588025, 585020, 583837, 582276, 580825, 580806, 581520, 581666, 581831, 583481, 586802, 591110, 596058, 601086, 605070, 607777, 610466, 614209, 618937, 624643, 631816, 640115, 648373, 656278, 663963, 669644, 670314, 665791, 659635, 654910, 651228, 646944, 641778, 635914, 628771, 620242, 611313, 602237, 591987, 580639, 570083, 561093, 552015, 541955, 533034, 527423, 523892, 519364, 512738, 505433, 499187, 494782, 492019, 489691, 486289, 481507, 476224, 470754, 464535, 457730, 451274, 444920, 437356, 428931, 421986, 417601, 414262, 410762, 407987, 406464, 404588, 401069, 397147, 394589, 393272, 392457, 392649, 394475, 397392, 401223, 407207, 415592, 423671]
57736D23671M540N36j716k337j696K06K011J927R04J689M334N928N293M450M583
57721D54323M188K535J492K127K534J024j122k071k234k656k730j761j014j902
57707D52733l357l248j666p18j384k288j778j4J442J649J402K124L869N199N311
57692D59276N278O314P804Q312P752P156O861O494O157O119N889M978M042L806
57678E46238L692L157L386N509Q034Q508P200O470O842O526N011M260N636Q056
57664F28525J0103J1780J3263J3835J3171J2275J2284J3404J5462J8330K1368
57653G83800K3635K4944K5746K6001K5388K4509K4622K6208K8933L2623L6872
57642A083281M0321M2019M3143M5637M9614N3790N7899O2523O7264P1560P6896
$$ y = [423671, 428211, 428747, 427031, 424694, 422998, 423204, 425215, 427142, 428046, 429735, 434069, 439997, 445290, 449740, 454323, 458511, 461046, 462538, 464665, 467199, 468223, 467101, 465030, 462796, 460140, 457410, 455649, 454635, 452733, 449376, 446128, 444462, 443744, 442360, 440072, 438294, 438280, 439722, 441371, 442773, 444897, 448766, 453965, 459276, 464554, 470868, 478672, 486984, 494736, 501892, 508753, 515247, 521404, 527523, 533412, 538390, 542432, 546238, 549930, 553087, 556473, 561982, 570016, 578524, 585724, 592194, 599036, 605562, 610573, 614833, 620469, 628525, 638628, 650408, 663671, 677506, 690677, 702952, 715236, 728640, 744102, 762432, 783800, 807435, 832379, 858125, 884126, 909514, 934023, 958645, 984853, 1013786, 1046409, 1083281, 1123602, 1165621, 1208764, 1254401, 1304015, 1357805, 1415704, 1478227, 1545491, 1617051, 1693947]
57631A693947Q5418R6333J06499J14941J23986J35318J47722J59781J72303J86769
57621C023017K03164K20458K37495K52606K64122K72114K77824K80655K77504
57612E308959K65862K45648K17258J80091J34455Q3161K9456k5461q1566j37446
57602F220417j89529k33112k63836k79683k82491k76602k65381k49894k30911
57593C948978k10379j90192j70947j52723j35834j20210j05230r0806p7603o5901
57583B629153n5501m6784m0093l3910k5698j5262n278K412R115J6781K5139L2769
57571B492843L9569M6537N4206O2650P2249Q3211R4983J07012J19289J31553J42980
57560C447082J53430J63967J75251J86337J95708K02407K05339K02547J92199
$$ y = [1693947, 1779365, 1875698, 1982197, 2097138, 2221124, 2356442, 2504164, 2663945, 2836248, 3023017, 3226181, 3446639, 3684134, 3936740, 4200862, 4472976, 4750800, 5031455, 5308959, 5574821, 5820469, 6037727, 6217818, 6352273, 6435434, 6464890, 6439429, 6357863, 6220417, 6030888, 5797776, 5533940, 5254257, 4971766, 4695164, 4429783, 4179889, 3948978, 3738599, 3548407, 3377460, 3224737, 3088903, 2968693, 2863463, 2772657, 2695054, 2629153, 2573652, 2526868, 2486775, 2452865, 2427167, 2411905, 2406627, 2409039, 2418154, 2434935, 2460074, 2492843, 2532412, 2578949, 2633155, 2695805, 2768054, 2851265, 2946248, 3053260, 3172549, 3304102, 3447082, 3600512, 3764479, 3939730, 4126067, 4321775, 4524182, 4729521, 4932068, 5124267]
57551E124267J73587J46619J11329O8741K1354k7934p6543j21471j59247j87755
57541E072947k07479k20156k26975k28561k25728k19242k09636j97874j85537
57532C151759j73646j61979j50083j38273j27173j16929j07404r8580r0439q3012
57522A904241p6579p1135o5808n9826n3926m9574m6805m4205m0973l7503l3778
57511A324129k9057k3647j9370j7461j7225j7188j6361j4231j0995q126p028o880
57499A136560n577k917p35M17K078M692O513P039Q581J2429J6097J6987J6708
57486A218872J8768K3498K8217L1459L4007L6364L8140M0032M3687M9118N4506
57475A616668N9135O4564P2002Q0186Q7059R2431R7871J04523J12093J19850J27730
$$ y = [5124267, 5297854, 5444473, 5555802, 5624543, 5645897, 5617963, 5541420, 5419949, 5260702, 5072947, 4865468, 4645312, 4418337, 4189776, 3964048, 3744806, 3535170, 3337296, 3151759, 2978113, 2816134, 2666051, 2527778, 2400605, 2283676, 2176272, 2077692, 1987253, 1904241, 1827662, 1756527, 1690719, 1630893, 1576967, 1527393, 1480588, 1436383, 1395410, 1357907, 1324129, 1295072, 1271425, 1252055, 1234594, 1217369, 1200181, 1183820, 1169589, 1158594, 1150468, 1143440, 1136560, 1130983, 1128066, 1127331, 1127748, 1129826, 1134518, 1141031, 1148070, 1156651, 1169080, 1185177, 1202164, 1218872, 1237640, 1261138, 1289355, 1320814, 1354821, 1391185, 1429325, 1469357, 1513044, 1562162, 1616668, 1675803, 1740367, 1812369, 1892555, 1979614, 2072045, 2169916, 2274439, 2386532, 2506382, 2634112]
57464B634112J36001J44175J50946J55506J58192J59050J56264J47177J30694
57455C972117J07586P8693M4587P193l0071o4538r5211j21047j40180j52021j58452
57444C448656j61635j61912j58825j52689j44016j32900j20394j08853r9321r0109
57434B118002p9777o9854o2396n6285m8722l9595l1528k5864k1196j6110j0907
57423A655768o090j169M276R869J5421K1339K7584L3359L8276M2833M7548N2650
57411A941664N8664O6075P4238Q1732Q8104R4326J01433J09532J18114J26277
57401B860159J32684J36456J38094J38228J35374J26275J08780Q3425N2078J6545
57391C928098k1039n7923r1852j21686j46360j64268j74586j78509j78260j75200
$$ y = [2634112, 2770113, 2914288, 3065234, 3220740, 3378932, 3537982, 3694246, 3841423, 3972117, 4079703, 4158396, 4202983, 4210176, 4180105, 4115567, 4020356, 3899309, 3759129, 3607108, 3448656, 3287021, 3125109, 2966284, 2813595, 2669579, 2536679, 2416285, 2307432, 2208111, 2118002, 2038225, 1968371, 1905975, 1849690, 1800968, 1761373, 1729845, 1703981, 1682785, 1666675, 1655768, 1649678, 1648509, 1652785, 1662654, 1678075, 1699414, 1726998, 1760357, 1798633, 1841466, 1889014, 1941664, 2000328, 2066403, 2140641, 2222373, 2310477, 2404803, 2506236, 2615768, 2733882, 2860159, 2992843, 3129299, 3267393, 3405621, 3540995, 3667270, 3776050, 3859475, 3911553, 3928098, 3907059, 3849136, 3757284, 3635598, 3489238, 3324970, 3150384, 2971875, 2793615, 2618415]
57381B618415j69520j61399j51630j41134j30477j20042j10322j01705r3946q6234
57371A352006p8236p0900o5463o1612n7617n2660m7939m4571m1657l7763l3460
57360G60128l0508k8940k6929k3751k1014k0176k0437j9987j8350j6590j5734
57349E17712j5696j5432j3926j1489r933j0629j2500j3205j2307j1734j2625j3436
57337C64800j2325r912q195p711p389o658o052n818n445m802m598n360o731p975
57323B65829q507p870o053m011l032l236l424k702j516o80k09K55M08l25j696
57308B23231k773l207l552m223m751m464l415k247j421r30o09m23m85r89j949
57293A87793k833k808j714n96o92j878k678j909Q0K066L274L696L512K861K128
$$ y = [2618415, 2448895, 2287496, 2135866, 1994732, 1864255, 1744213, 1633891, 1532186, 1438240, 1352006, 1273770, 1202870, 1137407, 1075795, 1018178, 965518, 917579, 873008, 831351, 793588, 760128, 729620, 700680, 673751, 650000, 628986, 608810, 588373, 568386, 550036, 533446, 517712, 502016, 486584, 472658, 461169, 451236, 440607, 428107, 414902, 402595, 390861, 378236, 364800, 352475, 342563, 334368, 326657, 319268, 312610, 306558, 300740, 295295, 290493, 285895, 280535, 273804, 265829, 257322, 249452, 243399, 239388, 236356, 233120, 229696, 226994, 225478, 224798, 224589, 224844, 225252, 224927, 223231, 220458, 217251, 213699, 209476, 204725, 200261, 196846, 194599, 193178, 192248, 191639, 191216, 190731, 189742, 187793, 184960, 182152, 180438, 179842, 179150, 177272, 174594, 172685, 172765, 174831, 178105, 181801, 185313, 188174, 190302]
57278A90302J904K450L393M156M534M799N340O218O956O872N768M331L625M112
57264B54760N292O369P054P546P913P819P006N825N027N010N400N579N564O157
57250C42321Q026J0723J2937J3829J3827J3824J3882J3233J1657J0152R998J1486
57238D85895J3968J6695J9064K0392K0261J9246J8707J9639K1987K5093K8269
57227G09216L0863L2416L3155L4016L5732L8043M0081M1460M2718M4666M7254
57216A129620M9212M9080M6707M3273L9559L4805K7944J9403J0689K487n654j3742
57204A433383k0799k6122l0006l2707l3736l2787l0461k7529k4281k1131j8872
57193A134952j7672j6585j4818j2793j1255j0073q642o878n175l804k845k115
$$ y = [190302, 192206, 194656, 198049, 202205, 206739, 211538, 216878, 223096, 230052, 236924, 242692, 247023, 250648, 254760, 260052, 266421, 273475, 281021, 288934, 296753, 303759, 309584, 314611, 319621, 325021, 330600, 336164, 342321, 350347, 361070, 374007, 387836, 401663, 415487, 429369, 442602, 454259, 464411, 474409, 485895, 499863, 516558, 535622, 556014, 576275, 595521, 614228, 633867, 655854, 680947, 709216, 740079, 772495, 805650, 839666, 875398, 913441, 953522, 994982, 1037700, 1082366, 1129620, 1178832, 1227912, 1274619, 1317892, 1357451, 1392256, 1420200, 1439603, 1450292, 1452779, 1447125, 1433383, 1412584, 1386462, 1356456, 1323749, 1290013, 1257226, 1226765, 1199236, 1174955, 1153824, 1134952, 1117280, 1100695, 1085877, 1073084, 1061829, 1051756, 1043114, 1036236, 1031061, 1027257, 1024412, 1022297]
57181A022297q28J792N067P111O977N747M950N080O175Q426J1278J3356J4362
57168A111790J5763J8440K1067K2101K1969K1766K1335K0404K0302K2362K5663
57157A342962K8453L0864L3959L7128L9003M0311M3106M7342N0852N2589N3441
57146A800010N3753N2789N0927M9775M9448M8265M5884M4276M4386M4232M1833
57135B325578L8205L5766L5182L5412L5695L5867L5305L3106K9234K4627K0195
57124B684172J6195J2518R376P553P685Q971R364P812N685M851M993M169J625
57111B784969j384l475m403m465l902k931j440J176M959Q599J0710J1256J0669
57098B810338Q470M190j213o564j2362j9753k8344l6786m4770n2675o0143o6904
$$ y = [1022297, 1021469, 1023261, 1028328, 1035439, 1042416, 1048163, 1053113, 1058193, 1064368, 1072794, 1084072, 1097428, 1111790, 1127553, 1145993, 1167060, 1189161, 1211130, 1232896, 1254231, 1274635, 1294937, 1317299, 1342962, 1371415, 1402279, 1436238, 1473366, 1512369, 1552680, 1595786, 1643128, 1693980, 1746569, 1800010, 1853763, 1906552, 1957479, 2007254, 2056702, 2104967, 2150851, 2195127, 2239513, 2283745, 2325578, 2363783, 2399549, 2434731, 2470143, 2505838, 2541705, 2577010, 2610116, 2639350, 2663977, 2684172, 2700367, 2712885, 2722261, 2729814, 2737499, 2746470, 2755834, 2763646, 2769331, 2774182, 2779175, 2783344, 2784969, 2783585, 2780110, 2775707, 2771242, 2767340, 2764409, 2762969, 2764145, 2769104, 2777703, 2788413, 2799669, 2810338, 2818808, 2822998, 2821785, 2815221, 2802859, 2783106, 2754762, 2717976, 2673206, 2620531, 2560388, 2493484]
57086B493484p4128q2674r0955r6937j01468j07171j14766j23120j32229j43363
57076A426673j56683j71446j88231k08319k31212B15534f4736l07296l36249l66655
57066a074936l99616m36575m77079n20482n68555o23504o84824p51156q23558
57057f360285r03650r90479j082978j183630j296001j421121j560495j719854
57049a6518493j905185k118017k359506k635459k951692l309005l710183m168397
57041c9675937m701865n325505o055896o916697p925515r076909j0346656j1707938
57033a01732918j3139418j4634713j6212761j7882051j9556817k1051479k2255294
57026b26465451k3335690k4672003k6481620k8492849l0005812l0259947k8753188
$$ y = [2493484, 2419356, 2336682, 2245727, 2148790, 2047322, 1940151, 1825385, 1702265, 1570036, 1426673, 1269990, 1098544, 910313, 701994, 470782, 215534, -64736, -372032, -708281, -1074936, -1474552, -1911127, -2388206, -2908688, -3477243, -4100747, -4785571, -5536727, -6360285, -7263935, -8254414, -9337392, -10521022, -11817023, -13238144, -14798639, -16518493, -18423678, -20541695, -22901201, -25536660, -28488352, -31797357, -35507540, -39675937, -44377802, -49703307, -55759203, -62675900, -70601415, -79678324, -90024980, -101732918, -114872336, -129507049, -145719810, -163601861, -183158678, -204210157, -226465451, -249801141, -274473144, -300954764, -329447613, -359453425, -389713372, -418466560]
57019d18466560k5335115k0179106j3737664o635783N17416P274442J3347476
57012d63214894J8527506K2655219K5656790K7566663K8505440K8643555K8167673
57005b83492048K7244267K5995486K4506715K2847593K1076990J9239973J7379077
56998a25201947J5547684J3800422J2172467J0677997R324517Q116993P051312
56991d8510555O116657N305147M610563M019272L512034L074580K698731K374954
56983a6798617K092802J848237J641963J470183J323848J196612J086245R88640
56975e150087Q97984Q13293P37813O71148O08218N46873c84096E8920M03798L72169
56965H34887L47778L28094L09325K90775K74256K59079K42151K23183K05188J89130
$$ y = [-418466560, -443801675, -463980781, -477718445, -484354228, -483836812, -476562370, -463214894, -444687388, -422032169, -396375379, -368808716, -340303276, -311659721, -283492048, -256247781, -230252295, -205745580, -182897987, -161820997, -142581024, -125201947, -109654263, -95853841, -83681374, -73003377, -63678860, -55561867, -48510555, -42393898, -37088751, -32478188, -28458916, -24946882, -21872302, -19173571, -16798617, -14705815, -12857578, -11215615, -9745432, -8421584, -7224972, -6138727, -5150087, -4252103, -3438810, -2700997, -2029849, -1421631, -874758, -384096, 58920, 462718, 834887, 1182665, 1510759, 1820084, 2110859, 2385115, 2644194, 2886345, 3109528, 3314716, 3503846]
56955C503846J72602J54524J37011J21410J06274R0486P5359O2858N4444N2207
56945D531021N7838O8856P7052P1309M2380j1734q1676j49729k01276k34047k54819
56934C915175k69390k78835k83144k83352k80095k73693k65449k55887k42740
56925A482590k23961k01831j80746j62216j45656j32494j24865j20887G4075c3992
56914a33519r1153q1592p0601n9608m8720l6983k5518j6604r802k902L536O923
56902e66543P935J0484J5788K0767K3171K4163K4789K3885K0714J6123R993J191
56890c67540q773j5602j7282j6239j5326j4612j3264j1459r080n275m49L723P004
56877d84174J0805J5315J9226K2683K7317L2871L7033L9033L9833L8239L1016
$$ y = [3503846, 3676448, 3830972, 3967983, 4089393, 4195667, 4286153, 4361512, 4424370, 4478814, 4531021, 4588859, 4657715, 4734767, 4806076, 4848456, 4836722, 4755046, 4605317, 4404041, 4169994, 3915175, 3645785, 3366950, 3083806, 2800454, 2520359, 2246666, 1981217, 1725330, 1482590, 1258629, 1056798, 876052, 713836, 568180, 435686, 310821, 189934, 74075, -33992, -133519, -224672, -306264, -376865, -436473, -485193, -522176, -547694, -564298, -574100, -577002, -573466, -566543, -558608, -548124, -532336, -511569, -488398, -464235, -439446, -415561, -394847, -378724, -368731, -367540, -376313, -391915, -409197, -425436, -440762, -455374, -468638, -480097, -489177, -494452, -494901, -491178, -484174, -473369, -458054, -438828, -416145, -388828, -355957, -318924, -279891, -240058, -201819, -170803]
56866a70803J8305N086m543j1223j6844k0771k1806k0907j9405j6956j3296j0012
56854c03175q502p985p108n850m507k601l2K323M026N411O189N638M468M090L903
56839c03712K099p22j932j277j364k952l481j556P62J661K086K843K721J428R82
56824c02414J907J329k624p409r608r203p923n946k871M31L532P897J4166K0108
56810b98628K3601K5571K7709K9554L0180L0681L2445L4859b6857A3626M5423
56799E9049M9549M9814M5811L8456K7586J3679N7r720j5555j9434k1712k1351
56787A96229j8473j4060q122n92P034J3187J8432K4091K9812L4515L8587M3071
56775C63711M7800N2226N6602O0247N9931N2407L7808J8917j505k0881l6051m4878
$$ y = [-170803, -152498, -147412, -151955, -163178, -180022, -200793, -222599, -243506, -262911, -279867, -293163, -303175, -311677, -319662, -326770, -332620, -337127, -339728, -339760, -337437, -333411, -328000, -321811, -316173, -311705, -307615, -303712, -301613, -302335, -304267, -305544, -306908, -309860, -313341, -314897, -314135, -312474, -310388, -307545, -304824, -303396, -302414, -300507, -299178, -301802, -309211, -318819, -328022, -335945, -341891, -344762, -344331, -340799, -332902, -318736, -298628, -275027, -249456, -221747, -192193, -162013, -131332, -98887, -64028, -26857, 13626, 59049, 108598, 158412, 204223, 242679, 270265, 283944, 284001, 274281, 258726, 239292, 217580, 196229, 177756, 163696, 155574, 154982, 162016, 175203, 193635, 217726, 247538, 282053, 320640, 363711, 411511, 463737, 520339, 580586, 640517, 692924, 730732, 749649, 748144, 727263, 691212, 646334]
56763F46334m7904m6842m2739l6778l0880k5633j9653j2702p002l338J235Q913
56751C83011J7048K2103K5306L0445L7698M3595M5645M3035L4190J8206j437j8687
56739F80158l0664l8591m3675m5598m4747m2261l7940l1365k4787k1195j9602
56728B99733j6143j0093m861k402n05L143P659J1312J4079J6031J5559J1079L097
56715C47688o427j5418k2076k5667k7276k8227k7932k5268k1527j9200j8059j5599
56703I5012j1598q820q391p946n709l360k912l431l004j884j505j835j719q47
56689C2051J97J129K015K727L124L155K519J158M2J11M99m91k515l309k053n53
56673C9806m01j028j457j915k564k444j136m8n95k145k932k236p14O56J226R49
$$ y = [646334, 598430, 551588, 508849, 472071, 441191, 415558, 395905, 383203, 376201, 372863, 374098, 383011, 400059, 422162, 447468, 477913, 515611, 559206, 604851, 647886, 682076, 700282, 698845, 680158, 649494, 610903, 567228, 521630, 476883, 434622, 396682, 365317, 340530, 319335, 299733, 283590, 273497, 268636, 266234, 265729, 268872, 276531, 287843, 301922, 317953, 333512, 344591, 347688, 341261, 325843, 303767, 278100, 250824, 222597, 194665, 169397, 147870, 128670, 110611, 95012, 83414, 74594, 66203, 58257, 52548, 49188, 46276, 42845, 39841, 37957, 36452, 34617, 32898, 32051, 32248, 33377, 35392, 38119, 41243, 44398, 46917, 48075, 48117, 48228, 48727, 48236, 45721, 42412, 40359, 39806, 39405, 38377, 36920, 35005, 32441, 29997, 28861, 28813, 28218, 26073, 23141, 20905, 20191, 20847, 22073, 23022]
56657B3022M33J91j76j098j779j176K7L00j00N70K427L487K817J934K148K661
56641C5688K286J238Q4j196k165j686Q8J326J228J313K751M315M465L717L285
56626E6737K867J682L03l55p78j817k923l248l422m332n016l908j630l36m50k23
56610C3151J327K984L506L480L991M630M076K147J78o90p43q65j071n81O46J375
56594E7541N87j025j881j562j132j469k177k370j828j141j076j928l095l517k853
56579C1074j899j381j013l99j10p23j445j090Q9R82J606K843M334M481K797Q02
56563D0948J10Q48K112K863K226K12j750k162j318p22q23p40m9P44J498K545L489
56546E0031L504K918K827L142K746J679J295K007K713K721K574K660K724K885
$$ y = [23022, 23455, 23646, 23470, 22372, 20593, 19417, 19444, 19744, 19644, 20214, 22641, 26128, 28945, 30879, 33027, 35688, 37974, 39212, 39296, 38100, 35935, 34249, 34337, 35663, 36891, 38204, 40955, 45270, 49735, 53452, 56737, 59604, 61286, 61589, 61234, 60456, 58639, 55716, 52468, 49046, 44714, 39698, 35790, 34160, 33824, 33374, 33151, 34478, 37462, 40968, 44448, 48439, 53069, 57145, 59292, 59470, 58780, 58037, 57172, 56101, 55520, 56166, 57541, 58128, 57103, 55222, 53660, 52528, 51059, 48882, 46512, 44684, 43543, 42467, 40539, 37444, 33927, 31074, 29175, 27794, 26781, 26382, 26272, 25549, 24104, 23014, 23103, 24085, 25691, 28534, 32868, 37349, 40146, 40948, 41058, 41906, 44018, 46881, 49107, 49319, 47569, 45407, 44089, 43367, 42544, 41804, 41755, 42499, 43997, 46542, 50031, 53535, 56453, 59280, 62422, 65168, 66847, 68142, 70149, 72862, 75583, 78157, 80817, 83541, 86426]
56532H6426L407L445K042K59L8R40O34j138j980q29L33q9r38o18N71J790L038
56515I7331M001L761K895L473N729P184O322M677L808L134K505L819P582J0517
56501A66738R605O451M739N109N522N214N210N800O311O775P596Q152P724O965
56487B57911O595N792L808J864J240P97j156l633m348l448l155m153m967m709
56473B48438m056l659l541l972n021n608m882l980m428n382m743k622j181j279
56459A94084j695j796k496m033n135n099m853n030m682k886m86Q17L79r93k012
56444A54084j931r97j17J42R9K43N51R53J753K832L184K130M67m85l91K76J269
56427A64062K475L402L641L408K992K322J501J030R54P77O14J310K928M494N623
$$ y = [86426, 89833, 93278, 95320, 95579, 95617, 96557, 97191, 96053, 94073, 93244, 93577, 93488, 92550, 91932, 92503, 94293, 97331, 101332, 105093, 107988, 111461, 117190, 124374, 130696, 135373, 139181, 142315, 144820, 148639, 156221, 166738, 176343, 182794, 187533, 192642, 198164, 203378, 208588, 214388, 220699, 227474, 235070, 243222, 250946, 257911, 264506, 270298, 274106, 275970, 277210, 278007, 276851, 273218, 268870, 265422, 262267, 258114, 253147, 248438, 244382, 240723, 237182, 233210, 228189, 222581, 217699, 213719, 209291, 203909, 199166, 196544, 195363, 194084, 192389, 190593, 188097, 184064, 178929, 173830, 168977, 163947, 159265, 156379, 155893, 156710, 157089, 156096, 154084, 152153, 151156, 151039, 151181, 151280, 151523, 152074, 153027, 154780, 157612, 160796, 162926, 163393, 162908, 162517, 162793, 164062, 166537, 169939, 173580, 176988, 179980, 182302, 183803, 184833, 185787, 186564, 187178, 188488, 191416, 195910, 201533]
56412B01533O805P613O748M643L777N193O899P138O931P662Q541Q445Q108Q257
56398B98293P923O822P061R660J1750J0482P631O743P472O694M012J960J357M84
56384C88344j251k508k999l819m705m184k746k686m378n790n934n953o353o187
56370C28851n466n479o140n816m461m082n280o106n329m248m090m078l376k779
56356B62121k967l009j966o32m21j555l201m394m484l708l408m436n384m089q46
56341B17621J610J560j9j379j863j497n16K66K2p76q85j32O02J189K401M185N321
56324B27710N055L891K722K163K452L047K891K032J988L384M590M149K982K431
56310B71487K016J305J900M616O565M586K21k371k256j649j016J268M666O263
$$ y = [201533, 208338, 215951, 222699, 227342, 231119, 236312, 243211, 250349, 257280, 264942, 273483, 281928, 290036, 298293, 306216, 313038, 320099, 329759, 341509, 351991, 359622, 366365, 373837, 380531, 384543, 386503, 387860, 388344, 387093, 384585, 381586, 377767, 373062, 368878, 366132, 363446, 359068, 353278, 347344, 341391, 335038, 328851, 323385, 317906, 311766, 305950, 301489, 297407, 292127, 286021, 280692, 276444, 272354, 268276, 264900, 262121, 259154, 256145, 254179, 253547, 253126, 251571, 248370, 243976, 239492, 235784, 232376, 227940, 222556, 218467, 217621, 219231, 220791, 220772, 219393, 217530, 216033, 215517, 215783, 215805, 215029, 214144, 214012, 214614, 215803, 218204, 222389, 227710, 232765, 236656, 239378, 241541, 243993, 247040, 249931, 251963, 253951, 257335, 261925, 266074, 269056, 271487, 273503, 274808, 276708, 281324, 287889, 292475, 292696, 290325, 288069, 286420, 285404, 286672, 291338, 297601]
56296B97601N184L493K377J117K1N94K385L288L327M444O300O278M185K861L347
56281C46802L631L056L669N867O945N643M254M450M753M086M024N397O189N133
56267D13899M281N622P970R437J0288J1216J1311R913Q326P847Q096Q552R569
56254E26327J0817J1136J0865J1644J3155J3141J1443J0650J1726J2676J2518
56243F56098J2655J2957J0918O568L909M998O671N816L887L288L241K584L008
56230G36598N864Q867R652R843J1971J4996J6522J7169J9157K2422K5468K8341
56218I26870L1640L4295L5306L6155L8827M2936M7123N1561N6815O2083O6749
56207A430360P1850P7993Q4003Q9387R5778J04024J12627J21035J31379J44602
$$ y = [297601, 302785, 306278, 308655, 309772, 309793, 310387, 312772, 316060, 319387, 323831, 330131, 336409, 340594, 343455, 346802, 350433, 353489, 357158, 363025, 369970, 375613, 379867, 384317, 389070, 393156, 397180, 402577, 408766, 413899, 418180, 423802, 431772, 441209, 451497, 462713, 474024, 483937, 492263, 500110, 508206, 516758, 526327, 537144, 548280, 559145, 570789, 583944, 597085, 608528, 619178, 630904, 643580, 656098, 668753, 681710, 692628, 699196, 703105, 708103, 714774, 720590, 724477, 727765, 731006, 733590, 736598, 742462, 751329, 760981, 770824, 782795, 797791, 814313, 831482, 850639, 873061, 898529, 926870, 958510, 992805, 1028111, 1064266, 1103093, 1146029, 1193152, 1244713, 1301528, 1363611, 1430360, 1502210, 1580203, 1664206, 1753593, 1849371, 1953395, 2066022, 2187057, 2318436, 2463038]
56197B463038J57945J69056J79479J91252K03023K12600K20513K27931K33675
56188D258512K36258K36202K33488K25666K11394J92694J70771J43316J09535
56179F017836P4004M1200R628k3855n7072q5033j06870j24996j39508j48785j54228
56168E302321j59023j63122j64118j62325j60602j59798j58463j56356j54418
56159C864096j52104j48527j45288j44478j44801j43220j39334j34710j29269
56150B582365j22163j14852j09347j04485r7803r0067q4068p9902p5295o9685
56140A634698o4330n9249n3741m8889m6018m3628l9527l4862l2385l1719l0134
56129A150216k7021k3958k1236j8003j4925j3181j1698q776n438l928l914l426
$$ y = [2463038, 2620983, 2790039, 2969518, 3160770, 3363793, 3576393, 3796906, 4024837, 4258512, 4494770, 4730972, 4964460, 5190126, 5401520, 5594214, 5764985, 5908301, 6017836, 6091840, 6133040, 6142668, 6118813, 6061741, 5976708, 5869838, 5744842, 5605334, 5456549, 5302321, 5143298, 4980176, 4816058, 4653733, 4493131, 4333333, 4174870, 4018514, 3864096, 3711992, 3563465, 3418177, 3273699, 3128898, 2985678, 2846344, 2711634, 2582365, 2460202, 2345350, 2236003, 2131518, 2033715, 1943648, 1859580, 1779678, 1704383, 1634698, 1570368, 1511119, 1457378, 1408489, 1362471, 1318843, 1279316, 1244454, 1212069, 1180350, 1150216, 1123195, 1099237, 1078001, 1059998, 1045073, 1031892, 1020194, 1011418, 1005980, 1002052, 998138, 994712]
56117I94712k197r77Q76L757N650N121M449O098Q289Q223P498R558J3644J6196
56103A080897J6943J8621K1547K3189K2494K0512J7421J2983R036P753Q312Q695
56091A268403R206J0775J1847J0920J0052J1753J4744J6971K0149K6525L3812
56080A445157L8625M2377M8432N5902O2161O8953P9603R2118J01632J08072J14804
56069B257836J21015J22075J16834J08327R8118Q6000P4433O6985O2781N7865
56059C172269N0915M2391L0171J2566o075j9467k7755l5436m2997m7899n2090
56048C076593o0443p2460q3006r0581r7520j02885j03001r8472r3089q6540p5955
56037B112641o3782n5709n1218m4622l5196k7781k3516j8764j3392j1182j1531
$$ y = [994712, 992515, 991538, 992414, 996171, 1001821, 1006942, 1011391, 1017489, 1025778, 1034001, 1041499, 1051057, 1064701, 1080897, 1097840, 1116461, 1138008, 1161197, 1183691, 1204203, 1221624, 1234607, 1243643, 1251396, 1259708, 1268403, 1277609, 1288384, 1300231, 1311151, 1321203, 1332956, 1347700, 1364671, 1384820, 1411345, 1445157, 1483782, 1526159, 1574591, 1630493, 1692654, 1761607, 1841210, 1933328, 2034960, 2143032, 2257836, 2378851, 2500926, 2617760, 2726087, 2824205, 2910205, 2984638, 3051623, 3114404, 3172269, 3223184, 3265575, 3295746, 3308312, 3302237, 3282770, 3255015, 3219579, 3176582, 3128683, 3076593, 3016150, 2943690, 2860684, 2770103, 2672583, 2569698, 2466697, 2368225, 2275136, 2188596, 2112641, 2048859, 1993150, 1941932, 1897310, 1862114, 1834333, 1810817, 1792053, 1778661, 1767479, 1755948]
56026A755948r573n285l699n438n812l955l793n069k841K767N759M929O057J1428
56012A741423J6140J7166J7496J9026J9632J9342K1300K4857K5656K3880K4070
56001A969988K6110K5305K2163K2462K6655K9022K8479K9955L3808L4648L2431
55990B281026L3758L9803M3865M3389M3672M7088M9460M9763N2525N7862O0104
55979B802315N8871O0444O5753O8615O8163P0804P7266Q0415P8957Q0251Q6172
55968C598026Q9550Q8389R0122R7589J04268J07585J13385J22874J29151J31028
55958D671967J36207J46474J54313J58305J66475J80105J90455J96210K07185
55949F207696K25527K40917K49970K62254K80898K96391L06376L21775L45534
$$ y = [1755948, 1746375, 1741090, 1737391, 1731953, 1726141, 1722186, 1718393, 1713324, 1710483, 1713250, 1719009, 1723938, 1729995, 1741423, 1757563, 1774729, 1792225, 1811251, 1830883, 1850225, 1871525, 1896382, 1922038, 1945918, 1969988, 1996098, 2021403, 2043566, 2066028, 2092683, 2121705, 2150184, 2180139, 2213947, 2248595, 2281026, 2314784, 2354587, 2398452, 2441841, 2485513, 2532601, 2582061, 2631824, 2684349, 2742211, 2802315, 2861186, 2921630, 2987383, 3055998, 3124161, 3194965, 3272231, 3352646, 3431603, 3511854, 3598026, 3687576, 3775965, 3866087, 3963676, 4067944, 4175529, 4288914, 4411788, 4540939, 4671967, 4808174, 4954648, 5108961, 5267266, 5433741, 5613846, 5804301, 6000511, 6207696, 6433223, 6674140, 6924110, 7186364, 7467262, 7763653, 8070029, 8391804, 8737338]
55940H737338L65700L77999L94393M20095M43729M60487M83086N18424N55419
55931A2756670N87622O25613O75057P25455P73031Q30526R01211R68369J024604
55922A9868158J085676J160701J236361J306385J387682J489798J598395J707531
55914C0840687J837320K000174K182194K377721K606595K875762L163485L466873
55906E1350811L824778M267689M789224N393631O118345O975034P924861Q952605
55898I9596978J0104874J1409929J2828242J4337690J5996039J7862738J9949146
55891B02085636K2314802K5094083K8319722L1830591L5411416L8686226M0479694
55884D24222170L8524510L0632682J6742849l01661j6337426k8344651l5535923
$$ y = [8737338, 9103038, 9481037, 9875430, 10295525, 10739254, 11199741, 11682827, 12201251, 12756670, 13344292, 13969905, 14644962, 15370417, 16143448, 16973974, 17875185, 18843554, 19868158, 20953834, 22114535, 23350896, 24657281, 26044963, 27534761, 29133156, 30840687, 32678007, 34678181, 36860375, 39238096, 41844691, 44720453, 47883938, 51350811, 55175589, 59443278, 64232502, 69626133, 75744478, 82719512, 90644373, 99596978, 109701852, 121111781, 133940023, 148277713, 164273752, 182136490, 202085636, 224400438, 249494521, 277814243, 309644834, 345056250, 383742476, 424222170, 462746680, 493379362, 510122211, 509820550, 493483124, 465138473, 429602550]
55877D29602550l8651648l8826213l7087017l4300604l1091113k7781552k4526842
55870A97337561k1465257j8700651j6245110j4075543j2199772j0615228r264072
55863I4771928q088771p087859o271007n602824n034149m548858m139918l776254
55855E0222288l432429l119960k854899k622652k404226k207412k041952j891198
55847B9647560j737475j590870j465988j353991j243364j145006j070779j008106
55839A9031981r40875q76148q26465p84392p37834o93180o60355o30725n91832
55830A2290175n49852n16781m88850m57086m26264m04573l86817l65476l46409
55821H348067l36441l27405l09437k88728k75850k67332k54675k40689k31361
$$ y = [429602550, 390950902, 352124689, 315037672, 280737068, 249645955, 221864403, 197337561, 175872304, 157171653, 140926543, 126851000, 114651228, 104036000, 94771928, 86683157, 79595298, 73324291, 67721467, 62687318, 58138460, 53998542, 50222288, 46789859, 43669899, 40815000, 38192348, 35788122, 33580710, 31538758, 29647560, 27910085, 26319215, 24853227, 23499236, 22255872, 21110866, 20040087, 19031981, 18091106, 17214958, 16388493, 15604101, 14866267, 14173087, 13512732, 12882007, 12290175, 11740323, 11223542, 10734692, 10277606, 9851342, 9446769, 9059952, 8694476, 8348067, 8011626, 7684221, 7374784, 7086056, 6810206, 6542874, 6288199, 6047510, 5816149]
55812E816149k21938k06448j90964j82697j75900j63216j50900j47827j48933
55803D227326j44404j36457j32276j29237j21992j16063j19225j26331j27058
55794C074283j22302j19170j16244j07696r6313q9018q4392p6996o8934o5204
55784B128014o2856n6587m9756m8187m8257m2974l4948l1573l1851k9609k5489
55773A665927k4394k4856k2111j8310j8974k2447k2951k1022k1336k3499k4160
55762A421867k4712k7883l0573k9019k6848k8821l1110k7609k1493k0131k2392
55751A131276k1649j8115j7380j9062j7679j3231j0890j1202r942o886n960p314
55739I71966p336n798n525o132n215m314o621j0480j1973j1976j3747j5779j4296
$$ y = [5816149, 5594211, 5387763, 5196799, 5014102, 4838202, 4674986, 4524086, 4376259, 4227326, 4082922, 3946465, 3814189, 3684952, 3562960, 3446897, 3327672, 3201341, 3074283, 2951981, 2832811, 2716567, 2608871, 2512558, 2423540, 2339148, 2262152, 2193218, 2128014, 2065158, 2008571, 1958815, 1910628, 1862371, 1819397, 1784449, 1752876, 1721025, 1691416, 1665927, 1641533, 1616677, 1594566, 1576256, 1557282, 1534835, 1511884, 1490862, 1469526, 1446027, 1421867, 1397155, 1369272, 1338699, 1309680, 1282832, 1254011, 1222901, 1195292, 1173799, 1153668, 1131276, 1109627, 1091512, 1074132, 1055070, 1037391, 1024160, 1013270, 1002068, 992126, 985240, 979280, 971966, 964630, 958832, 953307, 947175, 941960, 937646, 931025, 920545, 908572, 896596, 882849, 867070, 852774]
55726H52774j0777r762j1094j1313j0570j1218j1711q994m981l891n256o206p998
55713G39003j3209j8998k0453j8466j7328j6982j4796j2290j2518j3282j0532
55702E70149o244n294o938p269p416j0886j4959j3828q751o206p052o340l136
55689D65830j481j787k12K993L053n34k770j845j618m242p247r090j1013j2484
55675D17553j1080p763o218o481n194k277j132k183k555k205l856o716o910m516
55661C48467l573m773m861l560m177o634o945m598l570m704m035l02K520K141
55647C01396J076R40k05k531k525J038M428M626K882Q53j839m368m074j096R66
55632C01567P00P11K352L416K714K239L082L673L631M761O810O858M509L108M080
$$ y = [852774, 841997, 832235, 821141, 809828, 799258, 788040, 776329, 767335, 762354, 758463, 753207, 747001, 739003, 725794, 706796, 686343, 667877, 650549, 633567, 618771, 606481, 593963, 580681, 570149, 563905, 558611, 551673, 544404, 536988, 526102, 511143, 497315, 488564, 482358, 475306, 468966, 465830, 464349, 462562, 462350, 465343, 468396, 467862, 465092, 463247, 461629, 457387, 450140, 441050, 430037, 417553, 406473, 398710, 392492, 386011, 380817, 378540, 377408, 375225, 372670, 370465, 366609, 359893, 352983, 348467, 344894, 340121, 335260, 331700, 327523, 320889, 313944, 309346, 305776, 301072, 297037, 296735, 299255, 301396, 302472, 303412, 303207, 300676, 298151, 299189, 303617, 308243, 311125, 311978, 310139, 305771, 301697, 300601, 301567, 302267, 302978, 305330, 308746, 311460, 313699, 316781, 320454, 324085, 328846, 335656, 342514, 347023, 350131, 354211]
55617C54211M663K970P40o98k761n923p850p279o022n485m789l615l112k909j247
55602C10894R78O56k072l439k207j296j847r73K412M710L407J194J226K288J783
55587C17714J07j031j757k738l286k999l024l861m337m154m740o365p291p084
55573B65154p702r936j1724j1466j0098q769p369o339o826p908p002m095k246
55560A63674k787l399k289q26o09j217k213m229o615p044m782j629J105L458M378
55545A34976K227j492k895j298m0q04j290K4J123L65r26j707l216n591o222l791
55529A09443p00N77M51p2j316k869k919j437p51j553j805q85q43k077j970J86
55513I1460J216p00k991l285k889l118k363J27J555p2k329k428j539j803k231
$$ y = [354211, 358874, 361844, 362584, 361886, 359125, 353202, 345352, 338073, 332051, 326566, 321777, 318162, 315050, 312141, 310894, 311872, 312528, 310456, 307017, 304810, 303514, 301667, 300694, 303106, 307816, 311223, 312417, 313643, 315931, 317714, 317821, 316790, 315033, 312295, 309009, 306010, 302986, 299125, 294788, 290634, 285894, 279529, 272238, 265154, 257452, 247516, 235792, 224326, 214228, 205459, 198090, 191751, 184925, 177017, 170015, 165920, 163674, 160887, 157488, 155199, 154373, 153764, 152547, 150334, 146105, 139490, 132446, 127664, 126035, 127140, 130598, 134976, 137203, 135711, 132816, 131518, 131478, 130674, 129384, 129408, 130531, 130896, 129970, 128263, 125047, 119456, 113234, 109443, 108743, 109320, 109771, 109699, 108383, 105514, 102595, 101158, 100407, 98854, 97049, 96164, 95321, 93244, 91274, 91460, 92676, 91976, 88985, 85700, 82811, 79693, 77330, 77457, 79012, 78940, 76611, 74183, 72644, 70841, 68610]
55498F8610j020Q18J484J518J937J901R47Q61K387K998R58j273r11O49N36r52
55482H1448j730j688j678j000Q81K152J320P8N18J635J636J455K634L855L095
55467I4611J458J326K221J964O45Q2M50M98J96L24M25k17n77N72K091J969M07
55450A08445q05j035r09q00j033k200l634l311j020M16q93k992l409k948l464
55435H0408m222l627k554k743l459l004k028k193k865k406j478j833k881k661
55421D2454j354p13p77k78L87l11j886k176o75R86J569J055m89k553l362j888
55405B9989m2l46k045k182j54J609J508O62M40L99m60j854k483j532K45Q70p59
55388B3865k952k775k4K231J891M85J37L26l81j309r99M6L45m6j13O5j43m74n68
$$ y = [68610, 67590, 68408, 69892, 71410, 73347, 75248, 76195, 77056, 79443, 82441, 83399, 82126, 81215, 81864, 82400, 81448, 79718, 78030, 76352, 75352, 76233, 78385, 79705, 79783, 80301, 81936, 83572, 85027, 87661, 91516, 94611, 96069, 97395, 99616, 101580, 102225, 102307, 102757, 103255, 103451, 103775, 104200, 103983, 103406, 103978, 106069, 108038, 108445, 107640, 106605, 105696, 104896, 103863, 101663, 98029, 94718, 93698, 94114, 93221, 90229, 86820, 83872, 80408, 76186, 72559, 70005, 67262, 63803, 60799, 58771, 56578, 53713, 51307, 49829, 47996, 45115, 42454, 41100, 40387, 39610, 39332, 39719, 39408, 37522, 35346, 34671, 35657, 37226, 38281, 37792, 35239, 31877, 29989, 29947, 29601, 27556, 25374, 25220, 26829, 28337, 28999, 29439, 29838, 29378, 27524, 25041, 23509, 23754, 24624, 23865, 20913, 18138, 18114, 20345, 22236, 22721, 22858, 23184, 22803, 21494, 20495, 20541, 20886, 20840, 20727, 20792, 20649, 20175, 19607]
55369A9607r42j543j125K11P1k414m149k251J401K992K258J637J514K46j875k593
55353A3045j516n70n28q0J382K758L293L286K613Q16j273j939p54J179K863L683
55337B8258K814L09j911k076j019o78j087r57l86n17j087p48L97Q16p2j425k544
55320A8087l204k966j871j104j363j581q78l40q12o90J398L402K554J03l05J675
55304A2105K756J333m54n39L60P70N75O2j083k795m100m159A979m90J809K200
55288E498K12j816j342R48K234J489J63n56r28j283j525A254i55j720K5a123A74
55270C75q6J68B05f54m37K72l25j640j683l85O00P91R88J091N77d02A143K519
55252C662J465j29N71K711K668j51k514k671k394C04b503j219K95O37Q48d86F14
$$ y = [19607, 18665, 17122, 15997, 16208, 16279, 13865, 9716, 7465, 8866, 11858, 14116, 15753, 17267, 17513, 15638, 13045, 11529, 10959, 10431, 10351, 11733, 14491, 17784, 21070, 23683, 24499, 23226, 21287, 20533, 21712, 24575, 28258, 31072, 31381, 29470, 27394, 26375, 25697, 24610, 23653, 23267, 22750, 21663, 20915, 21312, 22128, 22056, 20631, 18087, 14883, 11917, 10046, 8942, 7579, 5998, 5120, 4780, 3968, 3278, 4676, 8078, 10632, 10735, 10430, 12105, 14861, 16194, 15740, 15201, 15561, 16331, 16906, 16968, 15885, 13090, 8990, 4831, 1979, 1489, 3298, 5498, 5710, 3894, 2552, 3500, 5734, 7223, 7386, 6830, 5902, 4619, 3094, 1254, -955, -2675, -2650, -1123, 174, 375, 289, 457, 205, -654, -1091, -819, -1144, -2784, -4467, -4852, -4252, -3461, -2473, -1382, -805, -402, 1143, 3662, 5127, 4998, 5569, 8280, 10948, 10797, 8283, 5612, 3218, 304, -2503, -3722, -3427, -2790, -1942, -486, 614]
55234g2j925j053R00A53K972L078K208O70j56Q0J31n78j052p69n46o68l50L64
55216E537M07Q2J085L270M013K015o17j463o71M70J649K720K820J852J165J378
55200B5712J165m73k389l027k504j681o55O16J419J180K56r21k311l370l177k126
55184G714j830k726a60k456q25M54J144e95A40L60J025J860J033j044j644K84
55168B014K382K293N98r52j913B093E95N38J955J468L84N58J594J772P77k21m98
55151H922l33r6J7j86n63n83j29L27P09J454K419K762K257J495N31j083k635k477
55133A2808o36O41m1j356j517p72l20k13J58O19P04P12J057J262P53J3r8L85P13
55114A4872N12M9k09QM39L60m28r40k48R33J169M69J3j9n69j638j986j101J59
$$ y = [-72, -1997, -3050, -2150, 153, 3125, 6203, 8411, 9081, 8925, 9005, 9136, 8558, 7506, 6737, 6191, 5523, 5173, 5537, 5944, 6026, 7111, 10381, 14394, 16409, 15792, 14329, 13658, 14128, 15777, 18497, 21317, 23169, 24334, 25712, 26877, 26404, 24015, 20988, 18484, 16803, 16148, 16764, 18183, 19363, 19619, 18698, 16387, 13017, 9840, 7714, 5884, 3158, -160, -2616, -3441, -2987, -1843, -595, 140, 500, 1525, 3385, 4418, 3374, 1730, 2014, 4396, 6689, 7287, 6335, 4422, 2093, 595, 1133, 3088, 4556, 4940, 5498, 7092, 8864, 9641, 9420, 8922, 8589, 8493, 8510, 8324, 7761, 7178, 7049, 7376, 8085, 9539, 11958, 14720, 16977, 18472, 19003, 17920, 15285, 12808, 12172, 12813, 12772, 11416, 9899, 9127, 8807, 8594, 8752, 9371, 10075, 10787, 11844, 13106, 13859, 13872, 13774, 14159, 14872, 15384, 15433, 15224, 15232, 15671, 16031, 15603, 14663, 14415, 15348, 16517, 16986, 16999, 16980, 16411, 14773, 12787, 11686, 11845]
55095A1845J072J555J197k97j695j427k64m86k123k642r49J023J625J723K293
55080A2450K351R56q02j460j127m36O41J609J006j288l030k427m69R29J426J486
55064A1815Q02p19j807j312J92J526K374K636J744k2j084o53J11J49O1M81O53
55047A6947J45J07J221K080J463N87J109K329K560J962J830K078J740J252J967
55032C9377L579M129K621J16j775k299j561k36O55M56n63j607j935j019R31K550
55016D3419K496J310P80J236J054o27k461k870j837P5K688N141N646L592O79j148
55000E9173j665j662j770k565m142m959l173K69K149J443O08J285J680K5k168
54985D4528k594j590p26j47L17m04k418l144o99K679L456J586l13j172j805k164
$$ y = [11845, 12917, 14472, 15669, 15372, 13677, 12250, 11986, 11500, 9377, 6735, 5786, 6809, 8434, 10157, 12450, 14801, 15757, 14955, 13495, 12368, 11932, 12573, 14182, 15188, 13900, 10870, 8443, 7974, 8903, 10329, 11815, 12617, 11898, 10091, 8779, 8971, 10497, 12871, 15507, 17251, 17229, 16145, 15492, 15603, 15752, 15813, 16294, 16947, 17092, 17199, 18420, 20500, 21963, 22550, 23659, 25988, 28548, 30510, 32340, 34418, 36158, 37410, 39377, 42956, 47085, 49706, 49822, 48047, 45748, 44187, 43951, 44606, 45062, 44499, 42892, 40957, 39938, 40869, 43419, 45915, 47225, 48005, 49241, 50295, 49668, 47207, 44337, 42500, 42575, 45263, 50404, 56050, 59642, 60321, 59173, 57508, 55846, 54076, 51511, 47369, 42410, 39237, 39506, 41655, 43098, 43706, 44991, 46671, 46696, 44528, 41934, 40344, 39618, 39471, 39788, 39384, 36966, 33822, 33123, 35802, 39258, 40844, 40531, 39359, 37554, 35390]
54969C5390j420j51L11J60L96N11n67j984j967o77L29Q94J934L053L047K390K572
54952D4221L317K958J465N52R06J591K132K886L351K487Q12J09Q13J591J500P59
54936G1450m77k156l224k509p20K20j85p90r77j120j067k63O47L71p54r64K04
54919E7686J264J040m6j260k380l090k972k328j764j067L12J925K954L671M627
54904E8572M972L489R32o69q60q45r03R6K283M110M515M094L765L799M353N383
54888I7086N929N115L960M484O908R437J0932J1951J2913J3110J2050J0169P634
54875B11678M003m12m244o660q079q999r297r021q700q595q474q210p740o724
54861A20526n289m588n334o293n734l895k348j448l61P33P03k43m09Q94K574L687
$$ y = [35390, 33970, 33819, 34130, 34290, 34686, 35197, 34630, 32646, 30679, 30002, 30331, 31225, 33159, 36212, 39259, 41649, 44221, 47538, 50496, 51961, 52513, 53419, 55010, 57142, 60028, 63379, 65866, 66678, 66787, 67600, 69191, 70691, 71450, 70973, 68817, 65593, 63084, 62364, 62584, 62399, 61609, 60632, 59512, 58445, 58182, 58829, 59200, 58446, 57482, 57686, 58950, 59990, 59944, 58684, 56304, 53214, 50242, 47914, 46150, 45083, 45395, 47320, 50274, 53945, 58572, 63544, 67033, 67965, 67296, 66436, 65591, 64688, 64784, 67067, 71177, 75692, 79786, 83551, 87350, 91703, 97086, 103015, 108130, 112090, 116574, 123482, 132919, 143851, 155802, 168715, 181825, 193875, 204044, 211678, 215681, 215269, 211025, 204365, 196286, 187287, 177990, 168969, 160269, 151674, 143200, 134990, 127250, 120526, 115237, 110649, 105315, 99022, 93288, 89393, 87045, 85597, 85236, 85969, 86672, 86429, 86020, 86914, 89488, 93175]
54845I3175M448N123N576O180P481Q800Q879P902P208P026O413N431N140N205
54831A83987L774L67l202n557p269q866r362q075o265n595o098o741p057p246
54817A06795p396p368o888n518l282j247n31p73p20j71n4p06j434j749j613o81
54801F6664J138K559K130M58n54n80r36j938k359j797j196p41L81J613R63j723
54785F4082l795l370j797j307k018k734l016k992k344r74K67N61J30l63n33q5
54769C9712R35J489O57n07k6J792K291L39j868j865R4K277L827M585M142K559
54753F0433R39K54N88J892L966N309M121J246j38J187K815K557J523J548K049
54738I0289J819J918L956O895Q331Q021P639P713P426O976P754R973J2127J2986
$$ y = [93175, 97623, 102746, 108322, 114502, 121983, 130783, 139662, 147564, 154772, 161798, 168211, 173642, 178782, 183987, 187761, 188128, 184926, 179369, 172100, 163234, 153872, 145797, 139532, 133937, 127839, 121098, 114041, 106795, 99399, 92031, 85143, 79625, 76343, 75096, 74565, 73792, 73072, 72901, 72847, 72141, 70707, 68958, 67345, 66664, 67802, 70361, 72491, 72949, 72395, 71815, 70879, 68941, 66582, 64785, 63589, 62848, 63229, 64842, 65805, 64082, 60287, 56917, 55120, 53813, 51795, 49061, 46045, 43053, 40709, 39735, 40002, 40563, 40693, 40330, 39797, 39712, 40647, 42136, 42793, 42286, 42260, 44052, 46343, 46682, 44814, 42949, 43043, 45320, 49147, 53732, 57874, 60433, 61372, 61626, 62214, 64106, 68072, 73381, 77502, 78748, 78610, 79797, 82612, 85169, 86692, 88240, 90289, 92108, 94026, 97982, 104877, 113208, 121229, 128868, 136581, 144007, 150983, 158737, 168710, 180837, 193823]
54724A93823J2524J0963Q491N880L986K597R77p81k212l845o447r103r862q472
54710A98519o751n993n498m349l072k563k432j665m04Q0q12k110k410j374K49
54695A59415J671K658L253L607M187N360O528O514N494N532Q046J1541J3404J3352
54681B50562J3307J3961J3716J1486Q605O734N510L470K86l175o203q511r821
54668B99927j0215j0530j1499j2797j3573j3557j3184j2764j2017j0387p774n142
54656A66488l911m227m424l170j523j421k641l141k375k077l274m568m354k942
54642A22440j378K42K042L215L022K036J289R32O56N97R84J551J920J902J114
54627A42564o50k266j886O38L171L799K788J474N94L89R79J699J406K28k92O10
$$ y = [193823, 206347, 217310, 225801, 231681, 235667, 238264, 239241, 238460, 236248, 232403, 225956, 216853, 206991, 198519, 191768, 185775, 180277, 175928, 172856, 170293, 167861, 166196, 165792, 165872, 165060, 162950, 160540, 159166, 159415, 161086, 163744, 166997, 170604, 174791, 180151, 186679, 193193, 198687, 204219, 212265, 223806, 237210, 250562, 263869, 277830, 291546, 303032, 311637, 318371, 323881, 327351, 327637, 324462, 318259, 309748, 299927, 289712, 279182, 267683, 254886, 241313, 227756, 214572, 201808, 189791, 179404, 171630, 166488, 162577, 158350, 153926, 150756, 149233, 147812, 145171, 142030, 139655, 137578, 134304, 129736, 125382, 122440, 121062, 121304, 123346, 126561, 129583, 131619, 132908, 133840, 134496, 135093, 136077, 137628, 139548, 141450, 142564, 141914, 139648, 137762, 138400, 141571, 145370, 148158, 149632, 150226, 150615, 151594, 153293, 154699, 154927, 154635, 155245]
54611A55245J994L099M304N443N204L513K494L494N076N649O105P697R111Q379
54597B26807O438N836O542N926K934l27j637j267p95q68r32k75J202K812L514
54582B55910K953J834J048Q51J298K557M264N497O080O875Q117Q706Q146P794
54568C21930R000J1127J2785J3689J3928J2643R288N095J494j999o435j0959j3714
54555C77872j4509j4490j3872j2244j0547j0311j1077j0846r066p016n343l547
54543B55004k049k062k971k352K59K011N47k752m940n329n376n960o659p151p567
54528B02653p651o933n768n077n011m885m541m774n933o916o341m323k399j652
54514A30449j664j585j537k313l990n569n973m904k868r91n46j778l154k730n29
$$ y = [155245, 157239, 160338, 164642, 170085, 175289, 178802, 181296, 184790, 189866, 195515, 201620, 209317, 218428, 226807, 233245, 239081, 245623, 251549, 254483, 254156, 252519, 251252, 250457, 249589, 248657, 248382, 249584, 252396, 255910, 258863, 260697, 261745, 262596, 263894, 266451, 270715, 276212, 282292, 289167, 297284, 305990, 314136, 321930, 330930, 342057, 354842, 368531, 382459, 395102, 404390, 409485, 410979, 408980, 402545, 391586, 377872, 363363, 348873, 335001, 322757, 312210, 301899, 290822, 279976, 270910, 263894, 258551, 255004, 252955, 250893, 247922, 245570, 245829, 247840, 248387, 245635, 240695, 235366, 229990, 224030, 217371, 210220, 202653, 195002, 188069, 182301, 177224, 172213, 167328, 162787, 158013, 152080, 145164, 138823, 134500, 132101, 130449, 128785, 127200, 125663, 123350, 119360, 113791, 107818, 102914, 100046, 99055, 98509, 96731, 93577, 90847, 90318]
54499I0318J311J083o18j879j597k18R73R50j59j020n12Q72J769J860J951K295
54483I7379K224J606J200J192Q32j7n13m08m95q32l25J119J826Q95l5J048L830
54466A10526O371P329O554M707L317L827N565O125M679L218L379M070L765L042
54452A76474K904K384J79k804m821n920o948p234n828l945l656m781n511n346
54438A25147n050m430k803j133j150k556l583l960m731n426m264j452M91L04m12
54423H4992O0J240J723J102j08j162j230j14R98O95p10j650j522j011m90K50Q66
54406H3929P16K12L50J014J376J556K162K463J161j198k551k128r48K83J644K302
54390I2343Q66k023l707k871j131n77j348k318k637k063r51j98j44K56J761L002
$$ y = [90318, 91629, 92712, 92094, 90215, 88618, 88400, 89373, 90323, 90164, 89144, 88632, 89504, 91273, 93133, 95084, 97379, 99603, 101209, 102409, 103601, 104433, 104416, 103903, 103495, 103000, 102168, 101843, 102962, 104788, 105683, 105648, 106696, 110526, 116897, 124226, 130780, 135487, 138804, 142631, 148196, 154321, 159000, 162218, 165597, 169667, 173432, 176474, 179378, 181762, 181941, 179137, 174316, 168396, 161448, 154214, 148386, 144441, 140785, 136004, 130493, 125147, 120097, 115667, 112864, 111731, 110581, 108025, 104442, 100482, 95751, 90325, 86061, 84609, 85100, 85404, 84992, 85052, 86292, 88015, 89117, 89009, 87847, 86617, 86503, 87501, 88196, 87486, 85836, 84314, 83303, 82813, 83063, 83929, 84645, 84857, 85207, 86221, 87597, 89153, 91315, 93778, 94939, 93741, 91190, 89062, 88114, 88397, 90041, 92343, 93209, 91186, 87479, 84608, 83477, 82900, 81552, 79234, 76597, 74534, 73583, 73385, 73241, 73497, 75258, 78260]
54374G8260K168J08o13M91J529J593J698K070J475m3n61N65J480R13k6l06p31
54357I0070j843k349j313J78J001J793L080L714K920K116K746L849L698K524J787
54342A13971J863K300L275M873N963N511M502M847O874R244J0789J1273J0892
54329A96177J0026Q944P185M177J039J52J779K826O60l157m990l936k409k470
54315B16003l779n097n906o201o061n852n958o161n979n465m988m494l784l170
54301A43108k963k704j783n75J5j13k66j72k05m54l50N27J830K755K728J904J207
54284A44489J537K692L453L117K457K668L867N236O288P271Q366R079Q658O847
54270B16025M167J515n27j895k663k800k599k819l867n159n989o602p619q675
$$ y = [78260, 80428, 80536, 79923, 80414, 81943, 83536, 85234, 87304, 88779, 88736, 88175, 88740, 90220, 91133, 91107, 90801, 90070, 88227, 85878, 84565, 84743, 85744, 87537, 90617, 94331, 97251, 99367, 102113, 105962, 109660, 112184, 113971, 115834, 118134, 121409, 126282, 132245, 137756, 142258, 147105, 153979, 163223, 174012, 185285, 196177, 206203, 215147, 222332, 226509, 227548, 227700, 229479, 232305, 232965, 229808, 224818, 220882, 218473, 216003, 212224, 207127, 201221, 195020, 188959, 183107, 177149, 170988, 165009, 159544, 154556, 150062, 146278, 143108, 140145, 137441, 135658, 135083, 135098, 134985, 134719, 134547, 134342, 133888, 133538, 134065, 135895, 138650, 141378, 143282, 144489, 146026, 148718, 152171, 155288, 157745, 160413, 164280, 169516, 175804, 183075, 191441, 200520, 209178, 216025, 220192, 221707, 221180, 219285, 216622, 213822, 211223, 208404, 204537, 199378, 193389, 186787, 179168, 170493]
54256A70493q662p337n748m977n189n798n922m853k919j524j536k080j973j637
54242A10338k136l031k967k170k210l277l719k768j675j621k216k788l342l560
54228G2858k610p99K08k02o00J36J029P34l55j010j045j013r62o27j48K78P96
54211F6668J350J456R77K81o04j857k771k186k97J383K099K328K001L43k058l113
54195F6000k033j83J400L048M152K807o91k716j013J811J991j66j533j080n28
54180G1266j000j788k120j814o51J017J632L87q76J39K689L826K395K8j477j692
54164G1961o92J155K531K239J060Q19J654K026J381P65N82j64j846l185l141k232
54148G4913j262j02J275J796O13j261j868o76Q19R82j43j222j386r20k82N96J448
$$ y = [170493, 161831, 154494, 148746, 143769, 138580, 132782, 126860, 122007, 119088, 117564, 116028, 113948, 111975, 110338, 108202, 105171, 102204, 100034, 97824, 94547, 90828, 88060, 86385, 84764, 82548, 79760, 76418, 72858, 70248, 69449, 69657, 69455, 68855, 68991, 70020, 70754, 70399, 69389, 68344, 67331, 66369, 65742, 65594, 65872, 66668, 68018, 69474, 70451, 70732, 70128, 68271, 65500, 63314, 63017, 64400, 66499, 68827, 70828, 71171, 69113, 66000, 63967, 63784, 65184, 68232, 72384, 75191, 74500, 71784, 70771, 72582, 74573, 74407, 72874, 71794, 71266, 70266, 68478, 66358, 64544, 63893, 64910, 66542, 66929, 66053, 66192, 68881, 72707, 75102, 75130, 73653, 71961, 71269, 72424, 74955, 77194, 78254, 79073, 80727, 82753, 84134, 84899, 85481, 85317, 83471, 80286, 77145, 74913, 73651, 73549, 74824, 76620, 77233, 75972, 74104, 73428, 74247, 75229, 75086, 73864, 72478, 71558, 71276, 71872, 73320]
54131G3320J055j132l380l393j554m56r79j175K07J477Q15p73j282p61l87O3J434
54114F3099K912K987K020J511J330J53j591j829j53J299R61k24p15n60p19j438
54098F9043k189k399j619J64J932K132L94j756k283o13J896L128K031l75j975
54083F7511j772p67l43n45n86k73n6j14k99n78p89n26J25K31p84k114k476j570
54065E4275l5J375J998J432J81o42q28j269k125k104n24J358K162K246K505K677
54049F2682K232J640J309N57p79j189K64J928J740K55n91n37o05p32k61J22n52
54032F7483j348p93L04K6j228j324j5Q48N86L45N00K16k35L60J435R66q82j480
54014F5764O0J297L52j231j154L63J613J968J791J279Q52J485L263M630M167K322
$$ y = [73320, 74375, 73243, 69863, 66470, 64916, 64460, 63481, 62306, 62513, 63990, 64805, 64032, 62750, 61989, 61602, 61665, 63099, 66011, 68998, 71018, 72529, 73859, 74012, 72421, 70592, 70439, 71738, 72699, 72475, 71760, 71200, 70481, 69043, 66854, 64455, 62836, 63000, 64932, 67064, 67458, 65702, 63419, 62806, 64702, 67830, 69861, 69486, 67511, 65739, 64972, 64629, 64084, 63498, 63225, 63169, 63055, 62756, 62178, 61389, 60863, 60988, 61219, 60435, 58321, 55845, 54275, 54240, 55615, 57613, 59045, 59226, 58584, 57756, 56487, 54362, 52258, 51734, 53092, 55254, 57500, 60005, 62682, 64914, 66554, 67863, 68420, 67641, 66452, 66716, 68644, 70384, 70639, 70048, 69511, 68906, 68174, 67913, 68035, 67483, 66135, 65342, 65646, 65672, 64444, 63120, 63105, 63953, 64539, 64884, 65384, 65600, 65365, 65725, 67160, 68126, 67244, 65764, 65824, 67121, 67473, 66242, 65088, 65451, 67064, 69032, 70823, 72102, 72954, 74439, 77702, 82332, 86499, 88821]
53998H8821N63k52r7N91R85N18j20K35J328J742J234J143K072K901K772K479K992
53981A09907M023M805N178N242N006M855N133N222M404L671M644O617O931N078
53967A80716L943N755Q876J0291R406P693O084M622L635L452L554L322K955K773
53953B57077K456K018K311L432L709J784j225l012k855j796p93j62k50j159j994
53938B59541j736q18p41k119l985n135n366n281n381n644n669n261m719m453m401
53923A98832m282m156m137l845k962k129k244k970l102k371j562p70Q39L068M088
53908A72297K794M57q67p25j65j32q02j748j995o76J648L028K223K19j045q03
53892A73708L18J677L313N389P455Q414P420N052L213L209M333N035M962M770
$$ y = [88821, 89384, 89132, 89035, 89626, 90611, 91129, 91009, 91244, 92572, 94314, 95548, 96691, 98763, 101664, 104436, 106915, 109907, 113930, 118735, 123913, 129155, 134161, 139016, 144149, 149371, 153775, 157446, 162090, 168707, 175638, 180716, 184659, 190414, 199290, 209581, 218987, 226680, 232764, 237386, 241021, 244473, 248027, 251349, 254304, 257077, 259533, 261551, 263862, 267294, 271003, 272787, 271562, 268550, 265695, 263899, 263106, 262944, 262694, 261535, 259541, 257805, 256987, 256246, 254127, 250142, 245007, 239641, 234360, 228979, 223335, 217666, 212405, 207686, 203233, 198832, 194550, 190394, 186257, 182412, 179450, 177321, 175077, 172107, 169005, 166634, 165072, 164302, 165141, 168209, 172297, 175091, 175548, 174681, 173956, 173791, 173659, 172857, 171109, 169114, 168438, 170086, 173114, 175337, 175556, 174511, 173708, 174026, 175703, 179016, 184405, 191860, 200274, 207694, 212746, 215959, 219168, 223501, 228536, 233498, 238268]
53878B38268M493L644K642K407K553J786L31J39K057M566O003O443O532O060M811
53863B92735L576L229L569L889L842L204J830M28L54K037M319N862O351O154N808
53848C47187N937O564O531M910K841K326L299L764K888J764R25m07k027k356j396
53833C82750j441l478n296m882l612l972n899p462p838p660p425p268p407p620
53819C01490p173o292o231o942o504m170k151k606m623o016o482o931p181o567
53805B21621n778n935o686o977o775o380n150k752n37Q7l34o93j361k961m397
53790A64992m320l431l065k688j211K52l82k743m416m306l224j693L10J724J144
53775A36943p71j891j582j047q31k54O92J086Q32O50K67j244l322m104l062j439
$$ y = [238268, 242761, 246405, 249047, 251454, 254007, 255793, 256124, 256263, 258320, 262886, 268889, 275332, 281864, 287924, 292735, 296311, 299540, 303109, 306998, 310840, 314044, 315874, 316302, 316656, 318693, 323012, 328874, 335225, 341379, 347187, 353124, 359688, 366219, 371129, 373970, 376296, 379595, 383359, 386247, 388011, 388936, 388529, 386502, 384146, 382750, 381309, 377831, 372535, 367653, 364041, 360069, 354170, 346708, 338870, 331210, 323785, 316517, 309110, 301490, 294317, 288025, 281794, 274852, 268348, 264178, 262027, 259421, 254798, 248782, 242300, 235369, 228188, 221621, 215843, 209908, 203222, 196245, 189470, 183090, 177940, 175188, 174651, 174738, 174404, 173711, 172350, 169389, 164992, 160672, 157241, 154176, 151488, 150277, 150529, 150147, 147404, 142988, 138682, 135458, 133765, 134075, 135799, 136943, 136172, 134281, 132699, 131652, 130821, 130567, 131259, 132345, 133177, 133827, 134094, 132850, 129528, 125424, 122362, 120923]
53759A20923n8J343K558K849K674L349M607M621K874R72J40NL50J810L944M800
53743A57761L744K864M106O421P242N793L595K373K628L915N522O853P473O973
53729B27263N182K970J983K599K907J263q35n19J993L197J135j863k488p05R28
53714B45010R19O8m95r04j989l875n501n572m061k580k783m517o060o007m401
53699A97252k230n41O6j59m16m44r45k330l684l863k979j877p65N10J556K058
53683A81209K587L515L829K565O81k32l72r68j774j498k98M79R51K529N046O474
53667B04723O001N079M824M600L902L437L430K763R15j016k105k819l606l896
53653B26232l401k756k151r75M17M78j058k381k268j646j345l72J924L874L635
$$ y = [120923, 120865, 122208, 124766, 127615, 130289, 133638, 138245, 142866, 145740, 146712, 146852, 146857, 147207, 149017, 152961, 157761, 161505, 164369, 168475, 174896, 182138, 187931, 191526, 193899, 196527, 200442, 205964, 212817, 220290, 227263, 232445, 235415, 237398, 239997, 242904, 244167, 243332, 242813, 244806, 248003, 249138, 247275, 244787, 244082, 245010, 245929, 245997, 245502, 244598, 242609, 238734, 233233, 227661, 223600, 221020, 218237, 213720, 207660, 201653, 197252, 195022, 194481, 194547, 194388, 193972, 193528, 192583, 190253, 186569, 182706, 179727, 177850, 177085, 177595, 179151, 181209, 183796, 187311, 191140, 193705, 194386, 194154, 193782, 192814, 191040, 189542, 189244, 189723, 190674, 193203, 198249, 204723, 210724, 215803, 220627, 225227, 229129, 232566, 235996, 238759, 239674, 238658, 236553, 233734, 230128, 226232, 222831, 220075, 217924, 216949, 217366, 217844, 216786, 214405, 212137, 210491, 209146, 208774, 210698, 214572, 218207]
53638B18207J905O91O23J237K666M929O477N660L238J545J388J486Q69J76M00
53623B51497J605L166M358M620L946L036K619K716L017L508M184M615M350L439
53609C00676K093N05n44J51K616M825M470J373k533n291o346o243n731n240m888
53594B79893m765m992n226m719l528l104m404n837m791j220K061K965K090P49
53580B45172p89k126k016l96P47J62n85L55K064K452J728J878L289M263L660K106
53564B61964O31j73K84K058L753L781K612K244L347M535M730M566M838M997M062
53549C08229K234P92Q51K521M808O246O127N249M949N548O339O824P076O915N828
53534C80536L912K210J743K598M026M925M392K464L42n86L8J551L082L881L534
$$ y = [218207, 220112, 220803, 221426, 222663, 225329, 230258, 236735, 242395, 245633, 247178, 248566, 250052, 250921, 251097, 251497, 253102, 256268, 260626, 265246, 269192, 272228, 274847, 277563, 280580, 284088, 288272, 292887, 297237, 300676, 302769, 303274, 302730, 302881, 305497, 310322, 314792, 316165, 313632, 308341, 301995, 295752, 290021, 284781, 279893, 275128, 270136, 264910, 260191, 256663, 253559, 249155, 243318, 238527, 237307, 239368, 242333, 244423, 245172, 244383, 242257, 240241, 239845, 240592, 240754, 240169, 240524, 242588, 245040, 246768, 248646, 251935, 256198, 259858, 261964, 262595, 262422, 262706, 264764, 268517, 272298, 274910, 277154, 280501, 285036, 289766, 294332, 299170, 304167, 308229, 310463, 311255, 312106, 314627, 319435, 325681, 331808, 337057, 342006, 347554, 353893, 360717, 367793, 374708, 380536, 384448, 386658, 388401, 390999, 395025, 399950, 404342, 406806, 407148, 406562, 406600, 408151, 411233, 415114, 418648]
53519D18648K579K412L563M528L431N74j925k855k840k613j885l97J277K603L658
53504D30758M304L863K356J081J168K260L356M054M252L535K060J278K433M593
53490D71351N647N160M840N825P004O887O060O488Q726J1061J1549J0106Q306
53477E69010P676Q480R850J0716J0720J0347J0154J0145J0154J0561J1868J3653
53465F93334J4775J4825J4495J4244J3649J2670J2446J3738J5464J6191J6437
53454H52268J7866K0446K2198K2017K1034K0618K0564K0195K0000K0854K2490
53443A080550K3978K5269K7180K9916L2543L3946L3874L3027L2470L2796L3695
53432A419244L4454L4855L5133L5185L4533L3185L1741L0502K9415K9134L0768
$$ y = [418648, 421227, 423639, 427202, 431730, 435161, 435735, 433810, 430955, 428115, 425502, 423617, 423220, 424497, 427100, 430758, 435062, 438925, 441281, 442362, 443530, 445790, 449146, 453200, 457452, 460987, 463047, 464325, 466758, 471351, 476998, 482158, 486998, 492823, 499827, 506714, 512774, 519262, 527988, 539049, 550598, 560704, 569010, 576686, 585166, 595016, 605732, 616452, 626799, 636953, 647098, 657252, 667813, 679681, 693334, 708109, 722934, 737429, 751673, 765322, 777992, 790438, 804176, 819640, 835831, 852268, 870134, 890580, 912778, 934795, 955829, 976447, 997011, 1017206, 1037206, 1058060, 1080550, 1104528, 1129797, 1156977, 1186893, 1219436, 1253382, 1287256, 1320283, 1352753, 1385549, 1419244, 1453698, 1488553, 1523686, 1558871, 1593404, 1626589, 1658330, 1688832, 1718247, 1747381, 1778149]
53421A778149L3823L5690L4506L1692L0209L0815L1556L0872K9520K8913K8796
53410B124541K7693K5181K2729K1953K2596K2651K0539J6692J2753R632P086M724
53398B338770K386n03m689r716j3846j5999j6987j8052j9160j9639j9702k0114
53386B182749k0935k1667k2354k3399k4502k5039k5390k6655k8792l0181k9628
53375A904207k7962k6975k7357k8253k8585k8006k6631k4498k1778j9105j7070
53364A627987j5279j2621q912n679m506m937n014l744j922m34R46K633M348N885
53350A578751P754J0277J2892J5171J7614K0525K2990K4160K4707K5837K7398
53339A788076K8368K8834K9995L2318L5077L7723M0473M3323M5731M7620M9590
$$ y = [1778149, 1811972, 1847662, 1882168, 1913860, 1944069, 1974884, 2006440, 2037312, 2066832, 2095745, 2124541, 2152234, 2177415, 2200144, 2222097, 2244693, 2267344, 2287883, 2304575, 2317328, 2326960, 2334046, 2338770, 2341156, 2340653, 2335964, 2326248, 2312402, 2296403, 2279416, 2261364, 2242204, 2222565, 2202863, 2182749, 2161814, 2140147, 2117793, 2094394, 2069892, 2044853, 2019463, 1992808, 1964016, 1933835, 1904207, 1876245, 1849270, 1821913, 1793660, 1765075, 1737069, 1710438, 1685940, 1664162, 1645057, 1627987, 1612708, 1600087, 1591175, 1585496, 1580990, 1576053, 1571039, 1567295, 1565373, 1564939, 1565885, 1568518, 1572866, 1578751, 1586505, 1596782, 1609674, 1624845, 1642459, 1662984, 1685974, 1710134, 1734841, 1760678, 1788076, 1816444, 1845278, 1875273, 1907591, 1942668, 1980391, 2020864, 2064187, 2109918, 2157538, 2207128]
53328B207128N1791N3528N4560N5751N7761N9846O0775O0500O0066O0089O0046
53317B841841N9180N7453N5361N3248N1203M9466M8291M7194M4816M0231L4223
53306C382507K8692K4667K1459J7772J3069P582J673m389j0411j6361k2175k7419
53294C416666l1723l5588m0033m5089m9499n2227n3539n4167n4378n4452n5079
53283B890892n6312n6939n5905n3825n2144n1289n0582m9542m8252m6743m4946
53272B324413m3015m1105l9161l7475l6748l6871l6427l4451l1841k9827k7911
53261A929581k4866k1153j8424j6843j4959j2403j0812j1401j3176j4401j4588
53250A756555j4159j3272j1986j0858j0312r806q355n728k687k27J180J815K385
$$ y = [2207128, 2258919, 2312447, 2367007, 2422758, 2480519, 2540365, 2601140, 2661640, 2721706, 2781795, 2841841, 2901021, 2958474, 3013835, 3067083, 3118286, 3167752, 3216043, 3263237, 3308053, 3348284, 3382507, 3411199, 3435866, 3457325, 3475097, 3488166, 3495748, 3497421, 3493032, 3482621, 3466260, 3444085, 3416666, 3384943, 3349355, 3309322, 3264233, 3214734, 3162507, 3108968, 3054801, 3000423, 2945971, 2890892, 2834580, 2777641, 2721736, 2667911, 2615767, 2564478, 2513896, 2464354, 2416102, 2369359, 2324413, 2281398, 2240293, 2201132, 2163657, 2126909, 2090038, 2053611, 2019160, 1987319, 1957492, 1929581, 1904715, 1883562, 1865138, 1848295, 1833336, 1820933, 1810121, 1798720, 1785544, 1771143, 1756555, 1742396, 1729124, 1717138, 1706280, 1695968, 1686162, 1677807, 1672079, 1669392, 1669165, 1670345, 1672160, 1674545]
53237A674545L330M475N588P001R098J1511J3590J5441J7641K0010K1725K2725
53225A826680K4021K6287K8991L1227L2615L3165L3055L2827L3008L3181L2265
53214B167322L0020K7506K5739K4660K3741K2633K0764J7351J2595Q030M828K451
53202B387640k36l201n611p469r713j2847j6396j9766k2793k5336k7113k8194
53190B208965k9086l0150l1285l2315l3160l3554l3123l2061l1191l0867l0187
53179A861986k8036k4866k2745k3219k5513k7173k6352k3154j9102j5885j4489
53168A611452j4799j5613j5453j3789j1456r785r472j0151j0594r427o337k848
53156A481728j144j690k630k044l06N25q52l792o571p722o863m997l971m852o886
$$ y = [1674545, 1677875, 1682350, 1687938, 1694939, 1704037, 1715548, 1729138, 1744579, 1762220, 1782230, 1803955, 1826680, 1850701, 1876988, 1905979, 1937206, 1969821, 2002986, 2036041, 2068868, 2101876, 2135057, 2167322, 2197342, 2224848, 2250587, 2275247, 2298988, 2321621, 2342385, 2359736, 2372331, 2380361, 2385189, 2387640, 2387404, 2384203, 2378592, 2371123, 2361410, 2348563, 2332167, 2312401, 2289608, 2264272, 2237159, 2208965, 2179879, 2149729, 2118444, 2086129, 2052969, 2019415, 1986292, 1954231, 1923040, 1892173, 1861986, 1833950, 1809084, 1786339, 1763120, 1737607, 1710434, 1684082, 1660928, 1641826, 1625941, 1611452, 1596653, 1581040, 1565587, 1551798, 1540342, 1530557, 1521085, 1510934, 1500340, 1490913, 1484576, 1481728, 1480584, 1478894, 1476264, 1474220, 1473914, 1474439, 1473587, 1469795, 1463224, 1455502, 1448639, 1443642, 1439671, 1434819, 1427933]
53141A427933q593r582j0542j1632j1960j0953r398q663r289j0723j2147j3204
53129A301247j4074j5078j6275j7476j8479j9091j8964j7899j6481j5876j6622
53118A114932j8034j9109j9573j9709j9787k0149k1192k2563k2984k1675j9576
53107H90581j8275j8116j8103j7352j5864j4209j3350j4282j6834j9120j9271
53096G05805j7576j5922j5317j5253j5194j5281j5311j4453j2585j0851j0292
53085E47770j0652j0970j0676r669q079o431n518n652o395p176p739p923p565
53072D43325o863o298o011n797n707o086o820p170o592n349m191l657l648l375
53058C65761k165o14m02k199m389m948m065l586m208m724m123k836j630o12J62
$$ y = [1427933, 1419340, 1409758, 1399216, 1387584, 1375624, 1364671, 1355273, 1346610, 1337321, 1326598, 1314451, 1301247, 1287173, 1272095, 1255820, 1238344, 1219865, 1200774, 1181810, 1163911, 1147430, 1131554, 1114932, 1096898, 1077789, 1058216, 1038507, 1018720, 998571, 977379, 954816, 931832, 910157, 890581, 872306, 854190, 836087, 818735, 802871, 788662, 775312, 761030, 744196, 725076, 705805, 688229, 672307, 656990, 641737, 626543, 611262, 595951, 581498, 568913, 558062, 547770, 537118, 526148, 515472, 505803, 497724, 491293, 485775, 480123, 473728, 466552, 458813, 450890, 443325, 436462, 430164, 424153, 418356, 412649, 406563, 399743, 392573, 385981, 380632, 376441, 372784, 369136, 365761, 363596, 362982, 362580, 360381, 355992, 351044, 346979, 343393, 339185, 334461, 330338, 327502, 325872, 325260, 325422]
53043C25422L69J65K25N85N84L25Q67K430L753L971L919M584N534N915O028O551
53027C71227P068O649N387M050K675P34j485k987l675m694o821r267j0487r839
53013C48535q085o563n933n755n223m333l896m312m879m762m305m622o036p526
52999B72305p853o808n042l128j247J78K75j273l280l971k980j601p84N2J397
52984B36240K000L35k825m954m881l842l237k922k217j267n02R9L94l32k165l615
52968B06309l066q37J010R12p15k203k335j356m36k04p4P00J615J386k87k173
52952A98246k917k252p68O84J195L27j103j540m44J193K272K704K781K356J361
52937B04095L94Q3L47P16R33Q33K12p48j352j124l11N31R65P26j5l79K98J283
$$ y = [325422, 325791, 325956, 326181, 326766, 327350, 327675, 328542, 330972, 334725, 338696, 342615, 347199, 352733, 358648, 364676, 371227, 378295, 384944, 390331, 394381, 397056, 397790, 396305, 393318, 389643, 384949, 378128, 368861, 358374, 348535, 340450, 333887, 327954, 322199, 316976, 312643, 308747, 304435, 299556, 294794, 290489, 285867, 279831, 272305, 264452, 257644, 252602, 249474, 248227, 248405, 248680, 247407, 244127, 240156, 237176, 235575, 234791, 234843, 236240, 238240, 238575, 235750, 230796, 225915, 222073, 218836, 215914, 213697, 212430, 211928, 212027, 212421, 212089, 209924, 206309, 203243, 202406, 203416, 204328, 203613, 201410, 199075, 197719, 197283, 197079, 197005, 197705, 199320, 200706, 200419, 198246, 195329, 193077, 192309, 192993, 194188, 194515, 193412, 191872, 191428, 192621, 194893, 197597, 200378, 202734, 204095, 204489, 204572, 204919, 205635, 206568, 207401, 207613, 206865, 205513, 204389, 204078, 204609, 205574, 206300, 206285, 205906, 206204, 207487]
52919B07487J215K16r1R37J872J384K06p1Q31K096L195L824L238J213o63k52K447
52902B29084N091N751M901M166L911L015R48q67m93J973M319M913M556M838N747
52887B81853O293O760Q325J0531J1250R726P743P010P023O612N987N845N670M447
52873C85075K382M94r19k260l564m580n509o687p755p956p063n545m169l682m251
52858C24011m950m638l605l293m077m675m307l804l716l025j067P63R28M7m08
52843B84184o43j773l431m101l515k824k605k280j381k4J638L203L662K568J056
52828B73734L70P6p38j371o22O20K97j430k049l24K108L266K977J823o9k224l324
52811B73120k736j322%J302K488K527R65q95j476q36k7N54J043R93q0j315j017
$$ y = [207487, 208702, 208918, 208827, 209764, 211636, 213020, 213226, 213155, 213986, 216082, 219277, 223101, 226339, 227552, 226889, 226637, 229084, 234175, 239926, 244827, 248993, 252904, 255919, 256867, 256000, 255507, 257480, 261799, 266712, 271268, 276106, 281853, 288146, 294906, 303231, 313762, 325012, 334738, 342481, 349491, 356514, 363126, 369113, 374958, 380628, 385075, 387457, 387951, 387032, 384772, 381208, 376628, 371119, 364432, 356677, 348721, 341658, 336113, 331944, 328262, 324011, 319061, 314423, 310818, 307525, 303448, 298773, 294466, 290662, 286946, 283921, 282854, 283617, 284545, 284592, 284184, 283541, 281768, 278337, 274236, 270721, 267897, 265292, 263012, 261631, 261607, 263245, 266448, 270110, 272678, 273734, 274104, 274180, 273442, 272071, 271449, 272069, 272366, 270936, 268887, 268563, 270671, 273937, 276914, 278737, 278668, 276444, 273120, 270384, 269062, 269062, 270364, 272852, 275379, 276344, 275449, 273973, 273137, 273110, 273664, 274707, 275700, 275620, 274305, 273288]
52794B73288J096L154L281J880J104K132L653L506J424o11p38P72K244K627K193
52779C01005J823K260L664N171N396M083K743K764L380K828J139K94J366L032
52765C40948L463K603J748J668K067K519K971L345L256K516J638J346J492J056
52751C72636m34j893k013j299j607l513n489o114n842n738n847n842o175p232
52737C13598q240q244p448o466n169l633l140m486o179o228n098m758n313m932
52723B34264l099j534j507k282k839l222l443k862j588r73j661k463k070q37M2
52708B03926K18J86L21O30R02O92l32j845l251m475n496n421l485r63l39k114
52692A79154l978l820k239j282j898l454m674m377k256L52J356K02j598k548k624
$$ y = [273288, 274384, 277538, 280819, 282699, 283803, 285935, 289588, 293094, 294518, 293907, 293169, 293941, 296185, 298812, 301005, 302828, 305088, 308752, 313923, 319319, 323402, 326145, 328909, 332289, 335117, 336256, 336550, 337916, 340948, 344411, 347014, 348762, 350430, 352497, 355016, 357987, 361332, 364588, 367104, 368742, 370088, 371580, 372636, 372202, 370309, 368296, 366997, 365390, 361877, 356388, 350274, 344432, 338694, 332847, 327005, 320830, 313598, 305358, 297114, 289666, 283200, 278031, 274398, 271258, 266772, 260593, 254365, 249267, 244509, 239196, 234264, 231165, 229631, 228124, 225842, 223003, 219781, 216338, 213476, 211888, 210915, 209254, 206791, 204721, 203884, 203926, 204144, 204330, 204651, 205281, 206183, 206875, 206543, 204698, 201447, 196972, 191476, 186055, 182570, 181607, 181268, 179154, 175176, 171356, 169117, 167835, 165937, 162483, 157809, 153432, 151176, 151528, 152884, 153086, 151488, 148940, 146316]
52677A46316k264j412l50j01q80j342m79O80M88r65k092j870p09K77J33j284k850
52660A31296k991j559j57l9o08p67p18j268k112k151j129J03P84Q75N99Q6n33
52643A19711j158j674j776j213l58J52M54J301K625L314K847K037J673J536J390
52628A30861J642K184J934O57KJ280L314M070L536L241L629L819L646L974M879
52613A72668N318N024N153O359P475O945M773K257L36j068k248k975k729j580
52599B05708m39k01q32j759k966m827o816p589o792n592m692l239q84M45j178
52584A58347m415n819m201j859j126j660j975j937k331l012l005k135j327j216
52570A22329j265o24O46J562J400N64Rj35q33k728m847n434l874j264R87K350
$$ y = [146316, 144052, 142640, 142290, 142189, 141309, 139967, 139488, 140168, 140656, 139691, 137599, 135729, 135020, 135297, 135430, 134146, 131296, 128305, 126746, 126589, 126550, 125942, 125175, 124457, 123189, 121077, 118926, 117797, 117900, 118684, 119559, 120158, 120244, 119711, 118553, 116879, 115103, 113890, 113532, 113684, 114138, 115439, 118064, 121378, 124225, 126262, 127935, 129471, 130861, 132503, 134687, 136621, 137278, 137280, 138560, 141874, 145944, 149480, 152721, 156350, 160169, 163815, 167789, 172668, 177986, 183010, 188163, 194522, 201997, 208942, 213715, 215972, 216308, 215240, 212992, 210017, 207288, 205708, 205269, 205068, 204236, 202477, 199511, 194684, 187868, 180279, 173487, 167895, 163203, 159964, 159080, 159525, 158347, 153932, 148113, 143912, 142053, 140927, 139267, 137292, 135355, 133024, 130012, 127007, 124872, 123545, 122329, 121064, 120440, 121086, 122648, 124048, 124612, 124621, 124486, 123653, 120925, 116078, 110644, 106770, 105506, 106493, 108843]
52554A08843K924K792K199J891K459L370L258J517p38j684p33Q65J392L17j501
52539A27171k756k601j120M93O39j062l049l416k021k33J021J793J942J047k39
52524A17609l29J099K494K903L526N418P043O084K925L13l43l69j283k564k731
52509A41795j397N95K301L173L042K184J121L3j300k683l183k020M37K833L865
52494A50796L166J450j6m14kL92M39N87J319K544L737M303L726J876n50k220k208
52477A68925q64N98J331J551J979K825L549L663L427L436L649L312K010L90m40
52462A99341n9R23J509J207L68k13j05M15P72P02K06o86j690k126j687j083j126
52445A96668j368o98P30J457R13K87N81R87L40r02j356p71k3M90J075J516J031
$$ y = [108843, 111767, 114559, 116758, 118649, 121108, 124478, 127736, 129253, 128515, 126831, 126098, 126963, 128355, 128672, 127171, 124415, 121814, 120694, 121187, 121826, 120764, 117715, 114299, 112278, 112045, 113066, 114859, 116801, 117848, 117609, 117280, 118379, 120873, 123776, 127302, 132720, 139763, 145847, 148772, 149085, 148742, 148373, 147090, 144526, 141795, 140398, 140993, 143294, 146467, 149509, 151693, 152814, 152847, 151547, 148864, 145681, 143661, 144098, 146931, 150796, 153962, 155412, 155396, 154982, 154980, 155372, 155811, 156398, 157717, 160261, 163998, 168301, 172027, 173903, 173353, 171133, 168925, 168061, 168659, 169990, 171541, 173520, 176345, 179894, 183557, 186984, 190420, 194069, 197381, 199391, 199781, 199341, 199282, 200205, 201714, 202921, 203289, 203076, 202971, 203386, 204158, 204860, 205066, 204380, 202690, 200564, 198877, 197794, 196668, 195300, 194602, 195332, 196789, 197702, 197989, 198570, 199557, 199897, 198995, 197639, 196868, 196845, 197335, 198410, 199926, 200957]
52428B00957k73j090n41O46J151O44k0R3J124K408L092K905K312J848J439O34
52412B17329n72j601j929j543p01L49J340J940J975J573R59L05j58l4R07K168
52396B22307K685J959Q73P21J452J695Q67K67J141K626K827J479L5o29r40j079
52380B38286m92N60Q12J31K50K156M149L956J769k80r81q73o71k96N52J848L257
52363B54133M109L709K268J022O74M36n44j613j640q72m28l84J20J158J853J936
52347B65937K037K259J876Q53M24J501L326M384M037K900J985J880K400K797K574
52332C01170K034J834K124K490K607K516K347K258K464L010L549L669L234K223
52318C37529P63m93o89mK54o73j891k212j672q41M68K416L779K975L12k184l082
$$ y = [200957, 200684, 199594, 199053, 199699, 200850, 201494, 201474, 201567, 202691, 205099, 208191, 211096, 213408, 215256, 216695, 217329, 216757, 215156, 213227, 211684, 210983, 211332, 212672, 214612, 216587, 218160, 219119, 219424, 219266, 219232, 220139, 222307, 224992, 226951, 227824, 228545, 229997, 231692, 232559, 232826, 233967, 236593, 239420, 240899, 240934, 240305, 239365, 238286, 237794, 238354, 239166, 239297, 239547, 241703, 245852, 249808, 251577, 251297, 250316, 249443, 248772, 248476, 249028, 250876, 254133, 258242, 261951, 264219, 265241, 265915, 266351, 265807, 264194, 262554, 261682, 261254, 260870, 260990, 262148, 264001, 265937, 267974, 270233, 272109, 272962, 273386, 274887, 278213, 282597, 286634, 289534, 291519, 293399, 295799, 298596, 301170, 303204, 305038, 307162, 309652, 312259, 314775, 317122, 319380, 321844, 324854, 328403, 332072, 335306, 337529, 338292, 337799, 337110, 337106, 337360, 336687, 334796, 332584, 330912, 330071, 330539, 332955, 336734, 339709, 340021, 337837, 334755]
52301C34755k560j293J80J066P60j4L23K126L998M512L594K065P99N45J527K955
52285C55338L801M192N081O481P193O549N351M599M350M258M290M394M265L982
52271D24124M068M500M455L533K542K567L775N597P380Q559Q877Q818R178R869
52257E07842R885Q897Q030Q493J0076J1694J2827J3752J4805J6074J7506J8747
52245F58628J9207J8813J8437J9068K0683K2370K3494K4295K5374K6763K7711
52234I04843K7450K6232K5275K5394K5920K5580K4306K3414K3845K4874K5023
52223A182156K3900K2633K2492K3255K3281K1339J8235J5895J4725J2974R424
52212A390309N705M486N821O968N830L146Q00n95j609k545l044k715j456M36K025
$$ y = [334755, 332195, 330902, 331082, 332148, 332908, 332894, 333217, 335343, 339341, 343853, 347447, 349512, 350311, 350856, 352383, 355338, 359139, 363331, 368412, 374893, 382086, 388635, 393986, 398585, 402935, 407193, 411483, 415877, 420142, 424124, 428192, 432692, 437147, 440680, 443222, 445789, 449564, 455161, 462541, 471100, 479977, 488795, 497973, 507842, 517727, 526624, 534654, 543147, 553223, 564917, 577744, 591496, 606301, 622375, 639881, 658628, 677835, 696648, 715085, 734153, 754836, 777206, 800700, 824995, 850369, 877132, 904843, 932293, 958525, 983800, 1009194, 1035114, 1060694, 1085000, 1108414, 1132259, 1157133, 1182156, 1206056, 1228689, 1251181, 1274436, 1297717, 1319056, 1337291, 1353186, 1367911, 1380885, 1390309, 1396014, 1400500, 1406321, 1413289, 1419119, 1422265, 1423065, 1422470, 1420861, 1418316, 1415272, 1412557, 1411101, 1411537, 1413562]
52197A413562K243J165K96R70K783M277M939N782P851J0718J2939J3808J4104
52184A495437J4905J6057J6575J6390J6731J8345K0255K1059K0805K0595K0746
52173A697900K0459J9210J7490J5901J4307J2133R240O401M851M854M691K077
52161A829514k862p168q516q059q540j0708j3320j5827j8869k2351k5095k6555
52149A661644k7124k6752k5095k3101k2381k2625k1736j9145j6830j6124j5623
52138A425108j3628j0852r067q454q021p622p803q278q092p067n908n067m407
52125A320842l838l473l403l675m268m856n177n676o805p632o547l847k036k619
52111A256990m057m223l444l487m560n344n470n936o994p384o239m444l462l594
$$ y = [1413562, 1415805, 1416970, 1417266, 1418236, 1421019, 1425296, 1430235, 1436017, 1443868, 1454586, 1467525, 1481333, 1495437, 1510342, 1526399, 1542974, 1559364, 1576095, 1594440, 1614695, 1635754, 1656559, 1677154, 1697900, 1718359, 1737569, 1755059, 1770960, 1785267, 1797400, 1806640, 1813041, 1817892, 1822746, 1827437, 1829514, 1826652, 1819484, 1810968, 1802909, 1794369, 1783661, 1770341, 1754514, 1735645, 1713294, 1688199, 1661644, 1634520, 1607768, 1582673, 1559572, 1537191, 1514566, 1492830, 1473685, 1456855, 1440731, 1425108, 1411480, 1400628, 1391561, 1383107, 1375086, 1367464, 1359661, 1351383, 1343291, 1336224, 1330316, 1325249, 1320842, 1317004, 1313531, 1310128, 1306453, 1302185, 1297329, 1292152, 1286476, 1279671, 1272039, 1265492, 1261645, 1259609, 1256990, 1252933, 1248710, 1245266, 1241779, 1237219, 1231875, 1226405, 1220469, 1213475, 1206091, 1199852, 1195408, 1191946, 1188352]
52097A188352m079m328m446m601m455l570k352k000l022m260m105k488p09M48
52083A144385J167J236j47k666m535m737m225l968l199r48J811L127K505J010
52069A130816l43r94k59J876L734L306P57j667k340j615m30J151L445O137Q379
52054A151953R524R514Q917Q834J0359J3776J8072K1273K1641J9322J6844J7058
52042A327087K0153K3480K4855K5011K6000K8161K9991L0441K9963K9367K8871
52031A623380K8386K7866K7153K6201K5467K5393K5427K4263K1220J7036J3168
52020A884960J0594R102P570N013J648j275k936l820m952o754q980j1248j3182
52007A865740j4511j5445j6436j7195j6700j4706j2506j1328j0673r245p114n775
$$ y = [1188352, 1184273, 1179945, 1175499, 1170898, 1166443, 1162873, 1160521, 1158521, 1155499, 1151239, 1147134, 1144646, 1143937, 1144385, 1145552, 1146788, 1146641, 1143975, 1139440, 1134703, 1130478, 1126510, 1123311, 1122363, 1124174, 1127301, 1129806, 1130816, 1130473, 1129479, 1129220, 1131096, 1134830, 1138136, 1138893, 1137226, 1134886, 1133271, 1132841, 1133992, 1137437, 1143574, 1151953, 1161477, 1170991, 1179908, 1188742, 1199101, 1212877, 1230949, 1252222, 1273863, 1293185, 1310029, 1327087, 1347240, 1370720, 1395575, 1420586, 1446586, 1474747, 1504738, 1535179, 1565142, 1594509, 1623380, 1651766, 1679632, 1706785, 1732986, 1758453, 1783846, 1809273, 1833536, 1854756, 1871792, 1884960, 1895554, 1904656, 1912226, 1917239, 1918887, 1917612, 1914676, 1910856, 1905904, 1899150, 1890170, 1878922, 1865740, 1851229, 1835784, 1819348, 1802153, 1785453, 1770747, 1758241, 1746913, 1736240, 1726995, 1719881, 1714106]
51995A714106o012o654n781k768J054L683M392M349N033O343P086P102P617R251
51981A748801J0961J1659J1617J1464J0975R945R114R045Q950P858O108M402K354
51968A863253n92l536n197o010p438r523j0961j1554j2738j5311j8220k0123k0847
51955A721203k0907k0697k0680k1343k2492k3387k4022k5261k7363k9122k9259
51944A456670k8043k6962k7070k8128k9136k9413k9121k8848k8819k8800k8746
51933A143584k9044k9788l0452l0624l0445k9821k8012k4880k1884k0760k1541
51922H46333k2820k3592k3836k3580k2563k0888j9067j7401j6004j5208j5144
51911F26230j5071j4055j2290j0899j0503j0709j0965j1069j0885j0255r256q011
$$ y = [1714106, 1708094, 1701440, 1695659, 1692891, 1693945, 1697628, 1702020, 1706369, 1711402, 1717745, 1724831, 1731933, 1739550, 1748801, 1759762, 1771421, 1783038, 1794502, 1805477, 1815422, 1824536, 1833581, 1842531, 1850389, 1856497, 1860899, 1863253, 1862661, 1859125, 1853928, 1847918, 1840480, 1830957, 1819996, 1808442, 1795704, 1780393, 1762173, 1742050, 1721203, 1700296, 1679599, 1658919, 1637576, 1615084, 1591697, 1567675, 1542414, 1515051, 1485929, 1456670, 1428627, 1401665, 1374595, 1346467, 1317331, 1287918, 1258797, 1229949, 1201130, 1172330, 1143584, 1114540, 1084752, 1054300, 1023676, 993231, 963410, 935398, 910518, 888634, 867874, 846333, 823513, 799921, 776085, 752505, 729942, 709054, 689987, 672586, 656582, 641374, 626230, 611159, 597104, 584814, 573915, 563412, 552703, 541738, 530669, 519784, 509529, 500273, 492262]
51899D92262o419m680l651l913m782n142m976n102n585n460m208k650k051k793
51885D30850m004m313l172j647j372k540l701l919l914m326m301l155k202l004
51871C85280m672m939l503k275k336k688k308j609j312j374j697k555l774m439
51857C45799l982k738j275q4P9j314l492m898n063m970n350n698n327m394l502
51842B93791k985k800k520j523J11J105L77j315k173j586m66L80Q47O89m06j779
51826B79747k271j869j654j924j826r93j83K5m2l9m3N1M29N85j16j087j103j37
51808B67550P72J303J841J920P25q59r03N55J485J296J728L402M150K308n03j681
51792B85089r58L96K008M078N774N940M688K920J065m87p84M72K046K777L036
$$ y = [492262, 485843, 481163, 477512, 473599, 468817, 463675, 458699, 453597, 448012, 442552, 438344, 435694, 433643, 430850, 426846, 422533, 419361, 417714, 416342, 413802, 410101, 406182, 402268, 397942, 393641, 390486, 388284, 385280, 380608, 375669, 372166, 369891, 367555, 364867, 362559, 360950, 359638, 358264, 356567, 354012, 350238, 345799, 341817, 339079, 337804, 337720, 337799, 336485, 332993, 328095, 323032, 318062, 312712, 307014, 301687, 297293, 293791, 290806, 288006, 285486, 283963, 284074, 285179, 285556, 284241, 282068, 280482, 280016, 280396, 281243, 281932, 281526, 279747, 277476, 275607, 273953, 272029, 270203, 269210, 269027, 269052, 269010, 268971, 268928, 268979, 269408, 269993, 269877, 268790, 267687, 267550, 268322, 269625, 271466, 273386, 274111, 273252, 272349, 272904, 274389, 275685, 277413, 280815, 284965, 287273, 286770, 285089, 284131, 284527, 286535, 290613, 296387, 302327, 307015, 309935, 311000, 310513, 309729, 310201, 312247, 315024, 318060]
51777C18060L314K674K69k607l769k844j132M39J587J671K80j466j908j039k55
51762C13274k04m00o98j540k652l037k442j693j294p77L22J747K869L071J919
51747C08465j19j362m55J717K786J711j76j160j081q50r61j194j251r83k03J106
51731C05990K426K936K246Q19m44r18n65L31J326J767J153q1o73o9O78L44o00
51714C16666o83K57Q70M86J02O79J638J793R19k61q96m15J186L040L987L734K891
51697C35993J952J140J068K274M051N053N168N337N552M889L725L755N156N963
51683C91076N221M556N332O425O466O207O717P070O003M378L693L555L022L291
51669D63012O327J1446J5738J7570J7541J6457J4618J2848J1994J1452J0012P924
$$ y = [318060, 321374, 324048, 324317, 321710, 317941, 315097, 313965, 314404, 315991, 317662, 317942, 316476, 314568, 313529, 313274, 313070, 312670, 311972, 310432, 307780, 304743, 302301, 300608, 299314, 298537, 298859, 300606, 303475, 306546, 308465, 308346, 306984, 306529, 308246, 311032, 312743, 312567, 311407, 310326, 309476, 308515, 307321, 306070, 305087, 304884, 305990, 308416, 311352, 313598, 314417, 313973, 313055, 312490, 312821, 314147, 315914, 317067, 316986, 316313, 316244, 316922, 317266, 316666, 315983, 316240, 317110, 317596, 317698, 318377, 320015, 321808, 322727, 322466, 321570, 321155, 322341, 325381, 329368, 333102, 335993, 337945, 339085, 340153, 342427, 346478, 351531, 356699, 362036, 367588, 372477, 376202, 379957, 385113, 391076, 396297, 400853, 406185, 412610, 419076, 425283, 432000, 439070, 445073, 449451, 453144, 456699, 459721, 463012, 469339, 480785, 496523, 514093, 531634, 548091, 562709, 575557, 587551, 599003, 609015, 616939]
51657F16939O263M851K898J260J416K478J886o19k450k189j453j811k300j470
51643F25699J7N00l91j876l273l934l089r52Q56J110N00M57J313K300K753K518
51627F24508J821J370J905L150L927L767L518L829M026L238J767N13l15j116k105
51612F53803l313m776o113o409n275l583k465k016j538o17O06J864K828L083K687
51597F28766K451L026L932M003K798J048j85m41j30k24j679m657q200j0933j2143
51582F07432j2033j1100r766q717q999j0961j3196j3503j1301q446o922o561o083
51569D79844n698o795r057j0043q533o401n777n910m775k697k013l484n231n483
51555C97947m529l472k710k348k748l697m018k974j477j087k182l734m637m613
$$ y = [616939, 623202, 628053, 630951, 632211, 633627, 636105, 637991, 637372, 634922, 632733, 631280, 629469, 627169, 625699, 625716, 626216, 625825, 623949, 620676, 616742, 613653, 612701, 613557, 614667, 615167, 615624, 616937, 619237, 621990, 624508, 626329, 627699, 629604, 632754, 636681, 640448, 643966, 647795, 651821, 655059, 656826, 657339, 657024, 655908, 653803, 650490, 645714, 639601, 633192, 627917, 624334, 621869, 619853, 618315, 617698, 618304, 620168, 622996, 626079, 628766, 631217, 634243, 638175, 642178, 644976, 646024, 645839, 645398, 645268, 645044, 643365, 638708, 630508, 619575, 607432, 595399, 584299, 574533, 565816, 556817, 545856, 532660, 519157, 507856, 499410, 492488, 485927, 479844, 474146, 467351, 458294, 448251, 439718, 433317, 427540, 421630, 416855, 414158, 412145, 408661, 403430, 397947, 393418, 389946, 387236, 384888, 382140, 378443, 374425, 371451, 369974, 368887, 366705, 362971, 358334, 353721]
51541C53721l941k786j111P91K036J773Q7k063l743m367l326m30L030M893M503
51526C49067L447L166L140K450J814K398L640M104L865M210N382O482P307Q339
51512D08811R071Q285O225M665M522M954N029M581L325R09j762l025k794k831
51498D49965m176n976p266q005p802n720k412n28j542l667m287l135j549Q1K287
51483C96268M711O072N809M628L608L443M278N623O794P764Q853R380P956M704
51469D79891J841R60R79P0j461j919j075n47j368k673k998j991n79K1n49j309
51453D67293r37M67J245L94r29r43L68J505J714J748K371L165L175K128O43m69
51437D82938q49o60k37J02n9j092k662l679l608l401m224n589n958m987l795l123
$$ y = [353721, 349780, 346994, 345883, 346674, 348710, 350483, 350570, 348507, 344764, 340397, 337071, 336641, 339671, 344564, 349067, 352514, 355680, 358820, 361270, 363084, 365482, 369122, 373226, 377091, 381301, 386683, 393165, 400472, 408811, 417882, 426167, 432392, 437057, 441579, 446533, 451562, 456143, 459468, 460377, 458615, 455590, 452796, 449965, 445789, 439813, 432547, 424542, 416740, 411020, 408608, 408080, 406538, 402871, 398584, 395449, 393900, 393981, 396268, 400979, 407051, 412860, 417488, 421096, 424539, 428817, 434440, 441234, 448998, 457851, 467231, 475187, 479891, 481732, 482692, 483671, 483741, 482280, 480361, 479286, 478739, 477371, 474698, 471700, 469709, 469130, 469151, 468602, 467293, 466356, 466823, 468068, 468462, 467533, 466590, 466958, 468463, 470177, 471925, 474296, 477461, 480636, 482764, 483407, 482938, 482089, 481429, 481192, 481294, 481235, 480143, 477481, 473802, 470194, 466793, 462569, 456980, 451022, 446035, 442240, 439117]
51421D39117k687k456k857l324k437k31J342J163M98Q28J788K507L269M338M660
51406D45518L578K616L618O063Q075R246J0460J1635J1772J0982J0475J0578J0427
51393E55043R661Q851Q230P456O713O711P485Q261Q374P428N035J681p80j011
51379F39138r6P0l70J9Q86L51j575k460j109O49Q99K65K89J038J873L064M882
51362F47813O186N702M049K953K928L105K894K473J870Q15n04j544k332l383m824
51347F68201o393q193j0455j2530j3063j1565r153p345o580o271n794n006m187
51334E61666l898m690o381p746p462n559l417k075j161J0R05M44r75j482k44J306
51318E19241J502Q03Q82K043K979K799J823K61k309n582p876q000p094p558j0272
$$ y = [439117, 436430, 433974, 431117, 427793, 425356, 425125, 426467, 427630, 428128, 428956, 430744, 433251, 436520, 440858, 445518, 449096, 451712, 455330, 461393, 469468, 478714, 489174, 500809, 512581, 523563, 534038, 544616, 555043, 564704, 573555, 581785, 589241, 595954, 602665, 610150, 618411, 626785, 634213, 639248, 640929, 640149, 639138, 639042, 639112, 638742, 638761, 639647, 639998, 638423, 635963, 634854, 635503, 636402, 636667, 636956, 637994, 639867, 642931, 647813, 653999, 659701, 663750, 666703, 669631, 672736, 675630, 678103, 679973, 680788, 680284, 678740, 676408, 673025, 668201, 661808, 653615, 643160, 630630, 617567, 606002, 596849, 589504, 582924, 576653, 570859, 565853, 561666, 557768, 553078, 546697, 538951, 531489, 525930, 522513, 520438, 519277, 519287, 520192, 520636, 519661, 518179, 517935, 519241, 520743, 521546, 522428, 524471, 527450, 530249, 532072, 532333, 530024, 524442, 516566, 508566, 501472, 493914, 483642]
51303D83642j3673j5615j5518j4424j3332j2143j0425q651p926q485r284r398
51291C44768r044q700q042o721n457n161n380m944l894l368l617l680l322l628
51277B69810m942n671m216j131J601K674J950j23k463l423k308m89J64l60n23
51262B50550L13J128J002L97J69L67N74P16R10R70O33M4l90l60L28J697L285M287
51244B66620M496M763N868P178P113N244L206L127N315P987R105Q136N954L618
51230C47730J719N72L25N82L36j167l529n540o429o437o133n616m893m631n729
51215C01160p980r825r933q618p224o403n671m639l776l648l940l828l067k266
51201B20342k161k875l786l910k666o28O91J74j732l494l973l166j668m5J133
$$ y = [483642, 469969, 454354, 438836, 424412, 411080, 398937, 388512, 379861, 371935, 363450, 354166, 344768, 335724, 327024, 318982, 312261, 306804, 301643, 296263, 291319, 287425, 284057, 280440, 276760, 273438, 269810, 264868, 259197, 254981, 253850, 255451, 258125, 260075, 259952, 257489, 254066, 251758, 251269, 251433, 251073, 250550, 250863, 251991, 252993, 253390, 253559, 253926, 254500, 255216, 256126, 257096, 257729, 257773, 257383, 257023, 257351, 259048, 262333, 266620, 271116, 275879, 281747, 288925, 296038, 301282, 304488, 307615, 312930, 320917, 330022, 338158, 344112, 347730, 349449, 350021, 350346, 350928, 351264, 350097, 346568, 341028, 334599, 328162, 322029, 316413, 311520, 306889, 301160, 293180, 283355, 273422, 264804, 257580, 251177, 245506, 240867, 237091, 233443, 229503, 225675, 222608, 220342, 218181, 215306, 211520, 207610, 204944, 204316, 205007, 205181, 203449, 199955, 195982, 192816, 191148, 191103, 192236]
51186A92236J309M34p54j335r91p3R41J613J474L47r64r80Q64L155L762K281N37
51169B03856K99J221J668R96ko33j106j603j611q34L0Q7n44r73o47K32J102J428
51151B02966J016L34J93P47J224J024M94O0n98j650k127j037Q40J677J022K20
51135B06405K94P49Q78Q42P41j04j897l387l297k153j492j649j649j037n56q07
51119A91881j391j674j518r14K09J338J404J81j069j110l73j81o89p10M70K031
51103A87885K712K165Q39p01j839j802l52J625K743K407J205J04m91q57j365j861
51087A92417j704o50M70N10n44j548j780j747k016k168j743j342j658k033j411
51072A73053l14k50j202j355J67J887K087J047J71l8P9O39K033L714M350L311
$$ y = [192236, 193545, 193979, 193225, 191890, 190899, 190826, 191767, 193380, 194854, 195201, 194237, 193257, 194121, 197276, 201038, 203319, 203856, 204155, 205376, 207044, 208040, 208038, 207405, 206299, 204696, 203085, 202251, 202281, 202368, 201824, 200851, 200204, 200436, 201538, 202966, 203982, 204316, 204509, 205256, 206480, 207504, 207998, 208058, 207460, 205810, 203683, 202646, 203486, 205163, 206185, 206405, 206699, 207448, 208326, 209168, 209909, 209805, 207908, 204521, 201224, 199071, 197579, 195930, 194281, 193244, 192688, 191881, 190490, 188816, 187298, 186384, 186593, 187931, 189335, 189516, 188447, 187337, 186964, 186783, 186094, 185384, 185854, 187885, 190597, 192762, 193601, 192900, 191061, 189259, 188907, 190532, 193275, 195682, 196887, 196991, 196500, 195643, 194278, 192417, 190713, 190063, 190533, 191043, 190499, 188951, 187171, 185424, 183408, 181240, 179497, 178155, 176497, 174464, 173053, 172739, 172489, 171287, 169932, 170099, 171986, 174073, 175120, 175291, 175253, 175332, 175971, 178004, 181718, 186068, 189379]
51056A89379J370q5j57R37J903J440j70r60N28L321N113M868L580K614K336K401
51040B18418K434K091J159k3p23p69q72j690k811l033j695N55K339K800K223J492
51024B21895J158J121R96M75l78r36m36Q53J422L82r17m37J505K386J060o70r12
51007B28567l43m99r08l7J729K382J360L34N92J360J325M15o29j331j461p75N05
50990B32586J519J618J037M62M13J113K293L014K352N46j054j322j89J713L473
50975B49574M053L086J740J781L359M723M624M014M512N964O555N072K220j74
50961C01103p14O10K415K972J711k53j430j479j028l43R12K498L161K191Q32J090
50945C14248L090M745M566L727M247N906O627N716M921N718P259Q066Q351R212
$$ y = [189379, 190749, 190664, 190507, 191444, 193347, 194787, 194617, 193657, 194185, 197506, 202619, 207487, 211067, 213681, 216017, 218418, 220852, 222943, 224102, 224079, 223356, 222587, 221715, 220025, 217214, 214181, 212486, 213041, 215380, 218180, 220403, 221895, 223053, 224174, 225170, 225645, 225267, 224331, 223895, 224748, 226170, 226552, 225635, 225198, 226703, 229089, 230149, 229479, 228567, 228224, 227725, 226817, 226780, 228509, 230891, 232251, 232585, 233177, 234537, 235862, 236277, 235648, 234317, 232856, 232081, 232586, 234105, 235723, 236760, 237222, 237635, 238748, 241041, 244055, 246407, 246953, 245899, 244577, 244388, 246101, 249574, 253627, 256713, 258453, 260234, 263593, 268316, 272940, 276954, 281466, 287430, 293985, 299057, 301277, 301103, 300389, 300999, 303414, 306386, 308097, 307844, 306414, 304935, 303907, 303564, 304476, 306974, 310135, 312326, 313158, 314248, 317338, 322083, 326649, 330376, 334623, 340529, 347156, 352872, 357793, 363511, 370770, 378836, 387187, 396399]
50931C96399J0636J1829J2882J4394J5880J6156J5320J4888J5885J7971K0437
50920E62677K2791K4471K5275K6133K8228L1254L3971L6411L9939M4904M9945
50909I25999N4138N8145O2584O6898P0747P4888P9514Q3190Q4822Q5508Q6930
$$ y = [396399, 407035, 418864, 431746, 446140, 462020, 478176, 493496, 508384, 524269, 542240, 562677, 585468, 609939, 635214, 661347, 689575, 720829, 754800, 791211, 831150, 876054, 925999, 980137, 1038282, 1100866, 1167764, 1238511, 1313399, 1392913, 1476103, 1560925, 1646433, 1733363]
$$ [...]
##END NTUPLES=NMR SPECTRUM
##END=
