
##TITLE=AC1190_Casanare-monterrey_5898400_eepF6ckwz3
##JCAMPDX= 6.0         $$ Bruker NMR JCAMP-DX V2.0
##DATA TYPE= NMR SPECTRUM
##DATA CLASS= NTUPLES
##ORIGIN= BRUKER
##OWNER= Administrator
$$ 1.72 TOPSPIN		Version 2.1
$$ 2012-04-03 17:22:13.031 -0500  Administrator@TOPSPIN
$$ Compression mode = diff/dup
##.OBSERVE FREQUENCY= 400.13188235
##.OBSERVE NUCLEUS= ^1H
##.ACQUISITION MODE= SIMULTANEOUS (DQD)
##.ACQUISITION SCHEME= undefined
##.AVERAGES= 8
##.DIGITISER RES= 22
##SPECTROMETER/DATA SYSTEM= spect
##.PULSE SEQUENCE= zg30
##.SOLVENT NAME= COFFEE_meoh
##.SHIFT REFERENCE= INTERNAL, COFFEE_meoh, 1, 14.98061
##AUDIT TRAIL= $$ (NUMBER, WHEN, WHO, WHERE, PROCESS, VERSION, WHAT)
$$ ##TITLE= Audit trail, TOPSPIN		Version 2.1
$$ ##JCAMPDX= 5.01
$$ ##ORIGIN= Bruker BioSpin GmbH
$$ ##OWNER= Administrator
$$ $$ C:\Bruker\TOPSPIN/data/COFFEE/nmr/AC1190_Casanare-monterrey_5898400_eepF6ckwz3/10/pdata/1/auditp.txt
$$ ##AUDIT TRAIL=  $$ (NUMBER, WHEN, WHO, WHERE, PROCESS, VERSION, WHAT)
(   1,<2012-04-03 17:22:05.968 -0500>,<Administrator>,<TOPSPIN>,<go>,<TOPSPIN 2.1>,
      <created by zg
	started at 2012-04-03 17:20:59.421 -0500,
	POWCHK enabled, PULCHK disabled,
       configuration hash MD5:
       1A 1E CE 29 27 FD 77 03 67 4E F0 E3 C4 B2 CB 90
       data hash MD5: 64K
       1A 23 D1 F9 D7 70 7B 78 73 0B 2C 89 99 21 17 16>)
(   2,<2012-04-03 17:22:08.609 -0500>,<Administrator>,<TOPSPIN>,<proc1d>,<TOPSPIN 2.1>,
      <Start of raw data processing
       efp LB = 0 FT_mod = 6 PKNL = 1 PHC0 = 0 PHC1 = 0 SI = 32K 
       data hash MD5: 32K
       6D 3A C7 20 BF 46 0D 1C AF 80 4E 5F BC C2 C0 FD>)
(   3,<2012-04-03 17:22:09.031 -0500>,<Administrator>,<TOPSPIN>,<proc1d>,<TOPSPIN 2.1>,
      <pk PHC0 = 213.8818 PHC1 = 0 
       data hash MD5: 32K
       E7 32 60 D7 3A B9 65 19 80 61 33 DD 23 6F B1 7B>)
(   4,<2012-04-03 17:22:09.125 -0500>,<Administrator>,<TOPSPIN>,<proc1d>,<TOPSPIN 2.1>,
      <abs ABSG = 1 
       data hash MD5: 32K
       C1 27 C9 5E 6D 68 CA 27 C4 FA 23 4F 7D 97 1C 6D>)
(   5,<2012-04-03 17:22:09.156 -0500>,<Administrator>,<TOPSPIN>,<proc1d>,<TOPSPIN 2.1>,
      <abs ABSG = 2 
       data hash MD5: 32K
       7E 17 E0 49 94 C8 66 B4 4E E0 5D 79 04 DD 60 EC>)
(   6,<2012-04-03 17:22:09.171 -0500>,<Administrator>,<TOPSPIN>,<proc1d>,<TOPSPIN 2.1>,
      <abs ABSG = 3 
       data hash MD5: 32K
       27 35 A6 FF B9 FD FC 53 44 69 E1 96 3C 06 88 41>)
(   7,<2012-04-03 17:22:09.218 -0500>,<Administrator>,<TOPSPIN>,<proc1d>,<TOPSPIN 2.1>,
      <abs ABSG = 4 
       data hash MD5: 32K
       34 A8 FB ED C1 6E 7B 50 78 65 4C 8E 63 B8 DA C4>)
(   8,<2012-04-03 17:22:09.234 -0500>,<Administrator>,<TOPSPIN>,<proc1d>,<TOPSPIN 2.1>,
      <abs ABSG = 5 
       data hash MD5: 32K
       60 B1 AE D2 49 C0 47 04 68 6C 23 33 CA 1E F7 2D>)
$$ ##END=
$$ 
$$ $$ hash MD5
$$ $$ 85 6B D8 A9 55 CC E6 17 F4 B4 C5 78 5A 45 53 F5
##$RELAX= 
##$RELAX= 
##$RELAX= 
##$RELAX= 
##$RELAX= 
##$RELAX= 
##$RELAX= 
$$ Bruker specific parameters
$$ [...]
##$TP= (0..7)
150 150 150 150 150 150 150 150
##$TP07= 0
##$TPNAME0= <>
##$TPNAME1= <>
##$TPNAME2= <>
##$TPNAME3= <>
##$TPNAME4= <>
##$TPNAME5= <>
##$TPNAME6= <>
##$TPNAME7= <>
##$TPOAL= (0..7)
0.5 0.5 0.5 0.5 0.5 0.5 0.5 0.5
##$TPOFFS= (0..7)
0 0 0 0 0 0 0 0
##$TUNHIN= 0
##$TUNHOUT= 0
##$TUNXOUT= 0
##$USERA1= <user>
##$USERA2= <user>
##$USERA3= <user>
##$USERA4= <user>
##$USERA5= <user>
##$V9= 5
##$VALIST= <valist>
##$VCLIST= <CCCCCCCCCCCCCCC>
##$VD= 0
##$VDLIST= <DDDDDDDDDDDDDDD>
##$VPLIST= <PPPPPPPPPPPPPPP>
##$VTLIST= <TTTTTTTTTTTTTTT>
##$WBST= 2048
##$WBSW= 25
##$XGAIN= (0..3)
0 0 0 0
##$XL= 0
##$YL= 0
##$YMAX_a= 536175
##$YMIN_a= -648039
##$ZGOPTNS= <>
##$ZL1= 120
##$ZL2= 120
##$ZL3= 120
##$ZL4= 120
##$ABSF1= 14.98061
##$ABSF2= -5.57192
##$ABSG= 5
##$ABSL= 3
##$ALPHA= 0
##$AQORDER= 0
##$ASSFAC= 0
##$ASSFACI= 0
##$ASSFACX= 0
##$ASSWID= 0
##$AUNMP= <proc_prof1d_extract_pilot.lims>
##$AXLEFT= 0
##$AXNAME= <>
##$AXNUC= <1H>
##$AXRIGHT= 0
##$AXTYPE= 0
##$AXUNIT= <>
##$AZFE= 0.1
##$AZFW= 0.1
##$BCFW= 0
##$BC_mod= 0
##$BYTORDP= 0
##$COROFFS= 0
##$CY= 15
##$DATMOD= 1
##$DC= 0
##$DFILT= <>
##$DTYPP= 0
##$F1P= 0
##$F2P= 0
##$FCOR= 0.5
##$FTSIZE= 32768
##$FT_mod= 6
##$GAMMA= 0
##$GB= 0
##$INTBC= 1
##$INTSCL= 1
##$ISEN= 128
##$LB= 0
##$LEV0= 0
##$LPBIN= 0
##$MAXI= 10000
##$MC2= 0
##$MEAN= 0
##$ME_mod= 0
##$MI= 0
##$NCOEF= 0
##$NC_proc= -8
##$NLEV= 6
##$NOISF1= 0
##$NOISF2= 0
##$NSP= 0
##$NTH_PI= 0
##$NZP= 0
##$OFFSET= 14.98061
##$PC= 1
##$PHC0= 213.8818
##$PHC1= 0
##$PH_mod= 1
##$PKNL= yes
##$PPARMOD= 0
##$PPDIAG= 0
##$PPIPTYP= 0
##$PPMPNUM= 2147483647
##$PPRESOL= 1
##$PSCAL= 4
##$PSIGN= 0
##$PYNMP= <proc.py>
##$REVERSE= no
##$SF= 400.13
##$SI= 32768
##$SIGF1= 0
##$SIGF2= 0
##$SINO= 400
##$SIOLD= 32768
##$SPECTYP= <>
##$SREGLST= <1H.CDCl3>
##$SSB= 0
##$STSI= 32768
##$STSR= 0
##$SW_p= 8223.68421052632
##$SYMM= 0
##$S_DEV= 0
##$TDeff= 65536
##$TDoff= 0
##$TI= <>
##$TILT= no
##$TM1= 0
##$TM2= 0
##$TOPLEV= 0
##$USERP1= <user>
##$USERP2= <user>
##$USERP3= <user>
##$USERP4= <user>
##$USERP5= <user>
##$WDW= 1
##$XDIM= 32768
##$YMAX_p= 464735832
##$YMIN_p= -766571
##$CURPLOT= <Network HP LaserJet P1505>
##$CURPRIN= <$Network HP LaserJet P1505>
##$DFORMAT= <normdp>
##$LAYOUT= <+/1D_H.xwp>
##$LFORMAT= <normlp>
##$PFORMAT= <normpl>
##$SURQMSG= 1
$$ End of Bruker specific parameters
$$ ---------------------------------
##NTUPLES= NMR SPECTRUM
##VAR_NAME=  FREQUENCY,     SPECTRUM/REAL,   SPECTRUM/IMAG
##SYMBOL=    X,             R,               I
##VAR_TYPE=  INDEPENDENT,   DEPENDENT,       DEPENDENT
##VAR_FORM=  AFFN,          ASDF,            ASDF
##VAR_DIM=   32768,         32768,           32768
##UNITS=     HZ,            ARBITRARY UNITS, ARBITRARY UNITS
##FACTOR=    0.250966925370066, 1,           1
##FIRST=     8223.43324360095, -40982,       -55218
##LAST=      0,             129027,          -20025
##MIN=       0,             -766571,         0
##MAX=       8223.43324360095, 464735832,    0
$$ Real data points
##PAGE= N=1
##DATA TABLE= (X++(R..R)), XYDATA
$$ [...]
23793 86954 96069 227368 32942 34609 -267519 68135 9758 -362749 -164051 42811 -126258
23781 -112654 -205284 164616 17500 -79661 64811 107024 149252 -19878 221399 -27618 31893
23769 241379 -13897 166905 -10677 -6073 -74062 -246788 -106821 238705 49785 266367 -2472
23757 -16326 -85884 -143802 94326 -215888 -186970 -144254 129973 132788 -170476 -25812 -172797
23746 -172797 27346 -159021 126352 -146365 -195190 -24148 217909 159006 -58620 46305 -68442
23734 -114411 -321678 33680 10744 329959 -188489 45422 -67801 -14001 -123403 43043 185612
23723 185612 211815 -308535 -39632 24596 11226 21779 180432 -201482 104441 -302679
23712 -129093 -97883 -147806 126868 -5149 -65369 21404 -32951 137329 -419319 210597 -70350
23700 -334783 -47769 9940 54525 -167636 68362 -85890 147611 40391 -39770 -482000 207383
23688 -140087 -87062 -133088 -70942 -80426 -211354 67277 -137738 -168012 123599 183613 5429
23676 -55969 -39213 14209 61319 -149503 289741 -52746 151096 -195683 150249 -81813 -93630
23665 -93630 80716 167706 -158598 -206755 61148 -59159 79839 -48371 362024 -141613 152970
23653 242468 10603 399143 -53627 377346 -55829 23271 27020 -31527 -159956 -128109 -56214
23641 -141225 -311715 34496 -149320 -5445 14491 115807 -154416 -25358 12629 -53445 -274735
23630 -274735 19194 180842 185903 44938 238147 -131755 -152007 319705 161168 -130861
23619 -79470 -312279 -49021 -84146 -126056 -131232 208223 -265550 -154854 -257659 202220 -62099
23607 -102147 21894 24512 -108227 -47052 495 -22137 -91783 282801 51371 117476 -272908
23595 -146881 -99224 -9264 -1849 -203695 -201677 -38824 -160625 -114066 -227534 1667 199447
23584 199447 133113 55993 -102550 358647 228532 239515 152144 -106307 -215821 -70734
23573 96192 -23842 123896 -34937 191774 428858 43576 80685 63828 452192 46422 -183492
23561 -145835 200957 -229987 -123648 -169334 72736 -397161 -294442 -197511 -68016 -180276
23551 -180276 -24797 -266948 111227 -229862 -17230 -491888 -111858 -162331 183316 -136231
23540 -72375 58568 127196 -11596 169366 47035 -264808 -213801 268343 -75313 -205686 86667
23528 -43784 248321 -269953 107794 -35206 -162072 83515 61060 294343 388158 71507 325785
23517 325785 -12107 157573 -499152 72033 142777 -199242 -186696 -164475 215181 -136197
23506 -46690 152990 141200 76879 393499 5966 -129797 39860 118014 -47064 -12093 -192391
23495 -192391 48246 422262 -6275 -107530 -186992 -262797 -16329 74513 -271481 -33702 166318
23483 181084 64407 -148228 -12374 36203 242288 164066 -151744 -73534 -19243 75334 -57214
23471 -81753 -40540 230881 -143065 49167 -229398 -171356 -337034 -143835 -185893 71984 -219905
23459 -286718 8161 -140370 205241 -18399 -371088 -117395 -130662 198150 91629 241183
23449 241183 -110538 -147828 -16257 -70968 53459 -155604 133906 -20389 -149447 -156354 255941
23437 136805 246766 -30527 131888 10102 206587 -274606 -234206 48403 60052 -5473 -131542
23426 -131542 -168289 -73766 -98627 -99732 -199857 -165092 210937 266242 59486 -72888 260000
23414 -53054 -261578 -295202 64946 -259906 -82118 67340 73985 150388 -16328 103235 51212
23402 84798 201671 -34590 65042 -40105 -28090 -18600 -102062 -300885 -47668 -142735 -263142
23391 -263142 -204952 162089 -320206 -92326 241089 -72877 -27326 6269 -13382 38640 -370292
23379 56588 -46421 -95106 -214478 -26849 344585 -16849 176233 -192621 -187308 -40716 -181751
23368 -181751 -68924 50838 -61622 -55237 -47522 176956 460428 -254785 -63377 39839 209949
23357 209949 -95201 -127894 -89514 27048 -229377 63849 918 458121 67761 240064 -119355
23345 -59012 14462 292575 92804 -286978 -169025 -181957 295165 -16770 656 -29578 33704
23333 211954 144204 -117842 78719 227129 37086 -32772 -232750 -194534 -144832 -308057 -18365
23321 -205718 -18402 67722 238284 191697 -109763 -289934 -176948 -188527 -202885 -110304 83279
23309 216648 107713 149259 -263581 -108078 -141311 -64930 -278868 142525 -123197 -258128
23299 -258128 -83629 -52451 -24046 -19986 123943 -108693 52948 79246 -301839 183634 124742
23288 124742 -214140 146655 -148031 67276 176116 127689 149280 116629 99219 -220368
23277 220447 37312 92257 -247789 153494 -66996 115185 353714 241639 185163 53625
23266 -67432 -248390 -9881 2732 16737 298882 85140 6980 -93560 -28235 53464 17485 -12206
23253 -196685 -335609 -39546 -295388 -28802 504082 -55527 -149079 -117396 -73270 77340 62162
23242 62162 -242778 -7120 -310136 -236836 -13180 12975 258843 -169267 -55589 -72908 -133726
23231 -133726 -285320 -160104 135740 -182537 136736 25818 151513 -267775 -230243 295686
23220 341183 -30248 14031 -286614 -137198 71578 227657 74442 -81211 -419877 -172486
23209 -19808 -47041 18745 134879 -42814 -145336 -228815 -364179 -29901 -127999 -204538 263192
23197 -106909 -46591 -60420 -196323 67915 44104 -123333 110457 -239476 237026 28892
23186 -46102 -434302 290323 -222280 56756 210979 119805 154429 -38400 27855 -38740 -183671
23175 -183671 -359311 -141702 59211 -56056 -11598 60519 -59197 -54559 -223302 132134 -205465
23163 -162254 -117598 434168 -50752 115590 -108713 29519 -106809 -265379 -297214 198774
23152 167008 -74414 -125837 302992 -22011 175592 -53775 48544 -140325 59008 147546 -6066
23140 -291994 -98628 -113057 21609 -68495 -31313 62445 -71879 20609 -144125 39330 -97718
23128 -158645 -124080 -2405 -18405 -335966 -175960 -371369 -1973 218051 78505 -293557 107724
23116 5772 124591 369582 20255 2293 180157 -158365 94178 -145769 36453 153791 -13980
23104 -35295 53885 -91031 194273 -6054 -204466 -62038 -363809 -209794 8889 282089 174242
23093 174242 -82854 67789 -155547 -268317 -164173 190130 -330058 390274 160128 -31863
23082 42732 121212 -147451 -67727 -163343 -134090 130999 -246266 -118767 106175 194607 -174741
23070 120664 208560 50611 -96307 -7439 42704 136448 154263 162162 91983 224385 30400 24123
23058 24123 -32406 35437 -16745 -171001 13554 -265442 -75885 77256 178260 -76251 -192930
23047 -192930 54228 37733 275360 -135099 -121688 250222 275957 -33178 21273 -14142 151738
23035 38463 26711 167393 -158568 164239 94466 22935 305323 253712 -111315 -10656 125923
23023 -333378 256549 105097 49776 -56732 -30011 152737 259178 228819 177720 271439 29598
23011 215842 37126 -185860 174986 -160704 -95095 44758 258560 -45696 -116268 -254702
23001 -254702 -129802 73793 146200 -193394 -48356 220041 -163733 -177231 -173744 142217 -80856
22989 63336 -26529 -4248 247460 -28897 -127616 -380863 99138 164469 264551 -200427 93429
22977 279114 -115573 36095 -8290 -19798 -66347 -282198 -38401 -117504 -142830 -105349 1839
22965 62552 -100903 250374 -178598 -99970 16754 -25999 -220772 -174904 82751 -153600 43137
22953 -36658 -74191 -99912 -74556 21049 -183781 126221 30965 -214885 -60048 -154894 -3271
22941 -156174 -8372 -184096 -99133 -416045 -338921 -174061 -167922 -148040 -56191 -90971 -121573
22930 -121573 -28371 -73676 62552 24065 66861 -299516 16440 -82311 -414213 -137159 143595
22918 -181351 -42991 -326200 -143675 -223937 53878 230234 75320 214382 -6611 -84636 108976
22906 86726 -263129 73223 122925 -77559 -203235 131869 -68636 -197076 -321961 45984 -72763
22894 -33268 -148155 -209925 -60085 -51743 291785 -261322 -42463 -6691 -239978 45403 22400
22882 -71207 -103683 -53226 78602 -66969 53859 -184223 -172192 -78321 230554 -377148 -104973
22870 484820 32753 124364 -30371 -312371 198930 -79273 3216 -101164 -178905 24184 -119099
22858 149453 115508 85291 -246775 -47286 -132586 234944 187304 64915 238556 52684 113535
22847 113535 -131960 -330369 -475429 -118448 -176013 -109152 -41007 204469 123609 13767
22836 -63929 279972 -148275 70762 92829 -154172 -95401 36370 -240244 131137 -17236 -139609
22825 -139609 138032 203265 99770 -123482 -32666 -110452 64356 -60824 145282 333265 10960
22813 -93024 -62840 -168394 -392256 -156969 -29908 -103722 -116708 -314777 -131762 121244
22802 84454 162222 -271157 107916 -192554 -82598 20807 -96910 -82860 -24040 -100061 -119863
22791 -119863 -190303 -7973 211615 25307 -157299 14020 -20210 -62036 -71085 53528 -199418
22779 -243823 -28160 -32394 109282 -11959 -40522 199644 -140254 20219 139627 -301664 -146966
22767 40316 161195 96320 214616 -232512 69867 80902 288643 -136890 48348 -92287 -86511
22756 -86511 85420 209893 -252935 -217093 -278568 174411 86248 13197 -93899 -159580 4153
22744 -81820 187277 -150925 135434 45087 41173 -221914 37714 -204935 -126655 -303068 178053
22732 -217330 -47796 -469886 332104 -167863 -92821 -226181 142610 -131811 -180489 -78763
22721 -77320 14810 -205396 -353042 226747 -194679 -42118 -195188 -167191 178650 -63435
22710 184557 -9264 -447809 -107238 -133957 22600 28579 -154519 -195810 -54035 87164 31315
22698 60159 182042 87077 -138109 -72578 -219622 -85563 331008 -162615 156080 378625
22688 378625 -58382 -72289 -24813 -3485 50910 81838 -230242 -100793 447295 -182080 -187320
22677 -187320 -82218 297957 157847 155294 -27708 139771 -43361 105315 132390 -127389 -126940
22666 -126940 -2767 -302580 -58404 -367953 15145 32261 -302060 157418 -236750 257368
22655 97385 -63411 -192610 247587 123342 -275622 257025 -131934 -142380 -70642 24971
22644 -160226 -67293 22191 -24114 49156 134685 -133248 -79802 102446 210941 -129623 -119930
22633 -119930 -249566 -82404 42761 61640 198540 -181974 -222973 -163272 147531 -157702
22622 -181166 -160723 184200 -368450 -321720 121546 23010 -114767 -15876 302135 101765
22611 -285994 108407 457600 -150835 -175734 258952 178803 -233292 -336186 15760 -125378
22600 -46900 -75459 -55098 35867 -199826 83458 -62058 53683 -247342 -34524 125406 -163774
22588 154133 -126197 -263770 -68990 120491 -16627 -61624 -6114 -134057 -39796 -327497 109654
22576 -139987 5527 -168974 -98426 33580 -13125 -287353 29928 -202646 -252547 179579 459177
22565 459177 14958 20153 -236759 -30423 -43913 -136542 49819 313804 -79095 77644 -38791
22553 11057 -70203 75498 -386911 -205797 -237427 213749 55653 140593 -115050 110242 -26511
22541 -69158 -128384 -227048 361328 21318 -87628 -161329 -37633 -251420 34232 88111 58508
22530 58508 -279576 79288 229372 -7056 96340 115111 251858 -113991 -42981 32777 -293272
22518 49637 -285164 -31626 -29734 91059 35283 185848 -178449 -138660 -2221 -23197 30504
22506 81461 -43289 -80169 -129043 188470 56737 76839 -129618 -38227 -17344 53065 -70632
22494 -253816 -145922 101282 25493 -129101 -29414 -37902 -344839 162078 -57680 -90884 -194739
22483 -194739 -58254 -61698 203471 21830 17064 -109648 -21017 107049 -277136 -42349 89165
22471 108952 -32369 31955 50404 -13197 -185693 -29356 -215751 -169495 -205817 -18267 55287
22459 4157 -3957 221100 135639 77038 168027 -40616 -192197 -114385 -252520 -276249 97860
22447 -33397 134420 -11763 -156371 152 2709 -99376 21296 -16027 52620 -101293 -76082 -187522
22435 -187522 -6686 -70417 -386113 -11275 122641 -208233 -450786 103505 -77056 237722
22424 -74542 -324989 -298511 51743 138316 -113805 -154921 243253 18820 223798 -109509 -191785
22413 -191785 -5748 -26931 -125002 153316 -168363 -184505 -261756 -102040 -67400 3664 -282181
22401 -111339 -110444 -98178 33240 274056 15444 -52265 23361 -14956 220014 -76060 -4229 -171064
22389 -171064 259117 -355188 -152455 -243 -191065 6946 63349 -87162 395573 142280 -41164
22377 262848 -56127 -427095 92997 354235 -92655 -81920 115731 -171013 -128004 81104 -257540
22365 201872 -83887 -153627 122228 99866 6490 171652 338264 -45728 -160454 65208 -72257
22353 -58444 110076 162316 118221 -214426 386418 60926 -153230 14447 209839 129555 -313190
22341 172833 13416 -21315 -567155 -33846 -337957 -448293 -230858 90486 147354 126806 274345
22330 274345 72108 -45250 -108393 -115351 -14385 -252541 -255062 -74558 -112826 319811 -111513
22318 131239 60091 18758 35320 -35429 -427748 -73617 11823 -17203 91356 -62673 -61543
22307 -61543 132350 -204678 -238553 -144027 -92909 -187422 -224047 -16313 -377173 354732 -58404
22295 -178280 146685 -45377 -2489 -55633 -331440 9491 -191048 85452 206864 350719 -105522
22283 55500 -161952 -200161 94223 -277282 60459 339861 13573 192286 -294049 24415 -232182
22271 -52282 -329604 120256 -168133 245989 37314 -223532 -126077 152362 298683 -69071
22260 -191610 -204294 19976 -144604 -52621 -127942 241079 46427 198526 -57633 -22927 370397
22248 51266 107347 207400 219967 -256529 52591 22960 -202118 -188938 -82453 -205310 175605
22236 104540 -98030 -275054 -239786 -10866 -124489 88092 45774 1764 -34866 -143474 -25229
22224 -52338 45103 -278727 245659 -319040 -98511 108701 -16869 -81506 -257947 -124183
22213 122845 -50049 -238091 31647 179985 -27902 -66505 27233 -28855 -122084 -290795 83248
22201 5528 62816 -32239 -160325 -70095 -187529 6652 -71709 -274998 204651 -311947 135001
22189 268252 -56086 -109568 -128839 -50404 -44200 -17816 26961 179511 -239405 -170235 -226192
22178 -226192 54729 -35219 -65525 -84914 -90444 -27206 -229775 57709 5368 28012 121031 -180103
22165 66761 317296 -305591 -128867 463804 -16537 -1734 -100152 314783 -142666 -61426 -62553
22154 -62553 -112044 122186 193037 -141114 -66885 -198382 46384 -71614 44778 -266250 -43253
22142 85197 224152 -127905 -188883 49916 197892 -273701 183560 -190305 -147487 93503
22131 -134415 -264367 319043 137256 7150 -19126 -9853 35122 18391 54551 -45804 172576
22119 127434 -241201 -146077 -186623 -26693 143744 1775 -69304 14436 -58984 30819 137535
22108 137535 -37066 -131929 72252 5569 5458 -129495 52760 -59734 -189 -383794 -238905 -294194
22096 -294194 255849 -34478 90783 -6772 -69817 -177715 -21513 -212582 -145583 -209194 -102712
22084 -296206 -101526 54175 -253842 -213423 147230 -133081 53458 172789 14609 -14449
22073 270135 -132958 82316 135640 -84977 -302683 348072 -59360 -33435 -275578 -225219 -184372
22062 -184372 -171486 71408 -123423 55257 -71116 -107299 -250834 113838 -137447 -285498
22052 -285498 269514 -81436 -121247 44109 -107788 79264 451429 61279 184968 360870
22042 360870 49373 -224745 174472 -195628 316054 -386639 -306960 -140209 124270 -943
22031 -161077 25492 158776 -331961 232099 323782 -265679 -63798 -14536 -250697 -124684
22020 -180492 147535 -418711 -33243 236258 -223312 56246 108466 81618 -59783 -194436
22010 -194436 195852 -18377 -226123 -48481 -97825 144013 -91386 -167717 -133495 62897 -156953
21998 -125268 104043 175608 46675 28097 -157941 108782 15319 85910 131436 104005 132425
21987 132425 -54264 -36006 -243509 -207244 -268919 -165969 -115711 -86620 -94494 -108433 449 -212471
21974 -314769 143473 -46816 -6980 40214 98272 184900 133522 -83104 199836 148558 10211
21962 134787 -88642 150647 17832 -179271 -32801 94985 -48768 -224497 349243 -257105
21951 101619 -16495 -260525 80309 135155 -140786 238308 -109329 158618 -177213 107154
21940 -115837 -239418 -77476 -87676 186506 -300219 -78530 -162679 -38380 -69739 231456 -285816
21928 -377794 -199002 -249396 -51722 -116843 -17739 -39452 121219 -365639 -66086 -248172 216708
21916 -53253 -183055 -15805 -168827 -131677 232593 264102 -8125 -30262 -88220 -65137 -76808
21905 -76808 -315888 100427 -86336 -99907 -270322 -129963 219753 62323 -87028 178086
21894 132661 -300952 -197663 -308248 42607 -119487 -206753 -151081 -100567 267703 -15708
21883 -54438 137397 -119039 -112332 193145 -72933 263808 183694 -201671 -19555 221001 123285
21872 123285 -61288 -136417 84478 -290204 -73869 -249699 -33940 -231197 -37045 133878 -440637
21860 -23082 -89038 -82396 -32539 247270 45399 109603 -322729 -16780 206963 -200079 484123
21848 -141170 -173950 6561 2079 -54178 23227 -28773 91526 -142016 -218019 88952 -84950 -305808
21836 -305808 35262 -187056 -329829 -39317 -87796 -167568 181667 -90536 309826 -176882
21825 -171622 -11923 -164990 -5201 161571 111950 7443 -165237 157943 -37419 15898 -158177
21813 -327121 -5499 -29841 136719 78465 197445 -54016 -143169 71406 51809 -489463 -124759
21801 -461834 243354 -137833 -105752 -41928 -32583 103669 24316 145606 399610 41247 -514981
21789 -46645 303521 -58175 158673 156738 -200167 -113347 3686 180652 142624 -61591 76907
21777 -87193 54959 63425 -209546 88221 36130 -138498 163340 -92412 75205 335490 221940
21766 221940 67484 507 -109728 145881 -171725 -202338 121944 -167477 4949 -142171 68902
21754 78426 45732 -91269 -199410 -77597 326291 -126150 -175335 144887 -130277 45432 -112093
21742 -198083 -30014 136366 146757 -161769 -117096 -201581 -111947 105906 119043 -64412 -192356
21731 -192356 66054 246056 -151897 138104 -39023 -214189 463967 -111699 -33635 -173162
21721 -173162 121177 41831 -147829 -215107 -187592 -51102 172087 160571 -128026 -38397 69658
21709 3929 -201038 -19367 289371 -256706 -263781 151371 -177422 -81804 -95741 48981 -14118
21697 -213665 -198273 -353131 -153593 -257796 292243 -26439 -352905 -83010 -318348 54324
21686 -190799 -82452 -150343 -194086 -19403 -227466 -52716 -87240 47712 85345 -183292 242517
21674 -172844 -128415 -140639 -115259 -77175 -67584 -214092 -101976 -167224 -58609 -151363 -21351
21662 -339304 121170 -467409 129631 -12121 169686 -150357 -188146 -62825 -95081 182021
21651 34558 -45441 -35658 -220201 134688 -116696 -180523 88411 -43579 82718 -38186 87360
21639 176748 19925 64284 212157 91449 -15903 -59548 49789 -148269 13075 -115771 260188
21627 11577 -21917 64195 -326087 -64199 -326817 102334 165970 -841 -1774 -168754 -230244 -138043
21615 -138043 -22290 -160670 163976 -156439 -107440 18931 -41371 183387 106324 -283781
21604 -151811 -222462 27587 -205770 -224166 -54315 128807 -72221 37702 19669 -175472 -310092
21593 -310092 -252928 34133 -74983 107982 163518 150488 -375573 149640 -98140 -120161 -129931
21582 -129931 -5798 -352289 291189 -137080 -133528 -95986 -23214 -187159 150684 -104763 320001
21570 -54829 -271075 -83532 -201760 6864 -197035 -29062 -126924 96250 158290 150154 264793
21559 264793 -128457 -118952 -21214 -57624 -190437 -3501 -49126 -399560 -160415 -23066 -3584
21547 -113449 -10825 200314 10573 -300342 -22310 -61354 -26779 13846 -409338 -159869 201531
21535 44167 -261345 360946 221193 -9793 -15145 78716 -49714 140876 148258 -126134 -102333
21524 -102333 -337831 -150292 -218288 -187282 122490 -111134 51595 -133841 232010 73054
21513 -29830 66191 -154571 -189256 185041 -12668 288951 142301 -263843 -304255 300158
21502 -210499 -161217 33941 -81699 -295959 896 -241029 3437 -44988 -302660 -159538 -208804
21491 -208804 -73860 43055 -269029 -56795 -137229 -110125 -3715 155677 129620 -311573 -258393
21480 -258393 -121690 -36270 236819 231644 142055 39389 4515 -77908 -69053 -330174 127722
21468 -156118 -163369 -22308 -54145 -32746 -27567 19258 -67494 -12835 -180734 50801 205270
21457 205270 106920 -188512 73608 260998 -107312 -92346 -633652 -31330 254342 148434
21447 148434 24232 52307 -8862 -190899 77977 -280193 -475131 -217533 -53935 -93117 -117142
21436 -117142 -284887 34102 2005 -267219 -79450 12513 90182 345229 98871 83971 21113
21424 244983 67876 315671 104484 306908 -15513 70251 29787 272337 63519 104345 142634
21413 142634 45126 184709 146077 -261565 -25230 -143977 -115482 -17892 188433 -5003 73535
21401 147847 -8142 -381437 -17646 24478 185253 -94468 -78564 200310 -145965 -142036 -172876
21390 -172876 -52949 -245159 -56164 -44753 -295290 -63873 -55809 -106532 -196118 200181 26415
21378 109577 199567 316000 396073 -345522 -218969 90374 -38123 181244 -258191 -330490
21368 -330490 83809 -304671 338299 5245 127264 -124496 -21333 -195860 56921 227902
21358 227902 -70707 -159160 -142171 -159332 -225235 -410502 184193 100543 118921 -248270 245721
21346 -410020 -297318 -44567 -209532 -24229 273355 -105860 75431 209277 -418090 240532
21335 -271619 245763 117396 75547 -130897 -247500 -157996 18253 -172064 -171175 -209333 -288098
21324 -288098 -238373 344997 188445 -104 127745 47322 -57357 -83817 -14653 -572540 54583
21312 2351 72811 54454 -156390 -144818 171372 72695 -194080 -4345 -94976 -302366 -145924
21300 260013 -33686 -9178 -77987 -163568 -106158 -64516 3813 131928 -271776 -199626 215910
21288 -171057 -128607 112206 -325537 -334547 -175581 -94982 28833 -170926 -246636 180037 -301870
21276 -86776 178916 -146322 39517 -385381 331885 145592 186853 126374 135635 -2069 -235291
21265 -235291 -60995 -170351 -81541 -64040 -56895 -4559 362883 -204727 9924 -356241 -154208
21253 -225080 -96066 -342390 -204804 -93372 43908 -111037 -28434 -162908 -251208 -219960 -13575
21241 442402 -149958 11365 -126541 -257480 -231453 -201868 83238 194715 103400 -182788
21230 -186605 82365 -239557 176203 -6947 -2496 123789 139625 46686 86401 248309 -144492
21218 261832 162100 240690 332021 -196433 33854 83875 -247150 99931 -124302 95732 -146045
21206 -234920 -209389 70902 202462 -365304 -181567 -78476 -100927 -38009 -218449 -47490 -94807
21195 -94807 297014 -395415 -108108 -153854 10167 -168433 -277401 28307 -152310 -54611
21184 136869 -73546 278454 -125019 -356032 3689 -85671 69038 -30783 166910 -161678 226238
21172 118955 -159699 -38607 46208 -317445 -182127 -253200 -77801 -156152 -10049 -19794 83509
21160 -203563 -230900 7219 -263083 -233414 -66225 -212623 -136270 32594 108586 -80673 142097
21148 -99409 -162520 -169300 8182 -23473 181270 123366 -40847 -281735 -151437 53787 -190864
21136 211989 105913 120727 -134377 -107617 -197647 -28918 -46968 -263243 25957 -10902 -147934
21125 -147934 44860 -212704 -200573 -298015 285299 -178850 207586 137494 -155819 -258103
21115 -258103 -135669 300663 -355464 25794 -239670 117730 -21366 -38490 -113072 25025
21104 -494587 -95915 82937 -75474 -374977 95059 140569 -288047 -262349 -178340 109051 -93814
21092 119436 10203 150535 89148 -209275 49350 -207144 -47965 150394 -93145 95206 -190332
21080 -158293 -238027 -187325 -257618 72285 -44881 -306651 205915 103868 184744 42448 -249073
21068 -42138 -125124 -153223 31868 45502 -139311 -110858 -80186 -88412 -99386 272220 -156740
21056 -98728 -190508 -138257 -168573 -52531 12296 -173162 51219 -228400 -185471 35761 -209893
21044 49221 148240 -132 217015 -184962 -90100 -186820 -67969 48630 -137891 -264670 21815
21032 295858 205935 -35264 128542 -216677 -221685 -120762 -46288 120676 -333797 144945
21021 38932 -266941 -369472 167525 -210585 -203399 -226071 -8295 -241713 -224007 105618 42516
21009 -180503 340181 116782 -181247 -192575 -292732 -24477 -38311 -248813 -38383 -248612
20999 -248612 237379 87525 381106 -47499 177740 343952 519 244967 438820 -37858 113042
20987 60953 168871 -82317 391012 355240 94815 72850 83539 -228476 22902 -152533 -39970
20975 -330445 416046 21765 -278929 199223 -109805 171473 14303 -175237 77440 84330
20965 84330 100759 276573 120178 -194085 58711 133013 -94713 -48111 95291 -90730 -181022
20954 -181022 -144225 -119562 -186697 274406 -104769 114594 -233199 291854 -84065 246173
20943 -146338 -95873 -81058 -57444 17243 59657 97487 119258 32273 -222131 -205527 250160
20931 -44071 153656 383481 70068 505393 -117797 51867 -205001 192066 -22969 -28671 158599
20919 -228043 106088 -341475 -72849 -92168 -107692 -80104 37857 -264203 -299762 -72433 211353
20907 120112 108003 126695 -116733 -215887 -404521 -176926 -113869 -167699 167464 -108576
20896 -69295 -113262 -294653 -164089 -297333 -237930 -19338 -26251 -118089 57536 143634 -24434
20884 -47762 134147 -237292 -176050 245676 -30398 -126865 -109349 -51409 -243299 -187816 -127406
20873 -127406 -323224 -88806 285780 99910 121498 -253861 -235168 -447769 -481615 -45281 3652
20861 71254 -351789 71104 -117738 20093 -307929 -213775 16503 93013 121838 -167143 -183266
20850 -183266 165362 -68465 -41740 -37017 148036 -28414 62846 -211593 -201438 76317 117539
20839 117539 36206 -153106 145874 5299 -202792 -268499 127236 142061 -17382 94837 229152
20828 229152 244934 -38806 -7928 -353234 36107 -218829 -132284 39650 -28914 -253952 -274242
20817 -274242 -88303 -54277 -91819 40830 105811 -7439 170442 -57889 -380439 -62067 -50599
20806 -50599 45401 196316 214220 -184489 210498 190445 140545 275795 -186530 43545 -73658
20794 110176 134030 104722 -45505 51790 35428 -125782 -326628 -295136 327804 125213 -110761
20782 -218478 -95650 -75799 -18512 -113182 115230 149157 -164266 49015 64974 -386023 -128353
20770 218451 -327290 -82642 1591 3287 -272426 28973 -235387 252658 -184055 -8539 38341
20758 -74290 -48330 -47885 -171820 191218 -75135 -378181 136713 -179273 -28308 -66826 -279945
20747 -279945 -10000 401989 -113812 100667 -243371 -51317 -190635 23494 -48698 -244869
20737 -244869 179440 -30956 -15015 22203 1067 -242134 63822 -85906 -236577 -522496 -197712
20725 -3868 184503 387072 375099 -21659 -182391 -514556 361879 -117155 -24311 -275913
20715 -275913 -77475 -87763 939 -22850 109208 -157742 -245943 -248585 -15748 -242154 -362293
20704 -362293 1198 -505924 47590 -465377 -352546 146718 325505 -176970 59024 -302653
20693 3841 -35801 -5656 -66935 -173197 -254082 -285482 -215723 358088 -13448 -124184 -137175
20682 -137175 74099 222151 58511 -207910 87730 -156650 -36432 59203 7450 -391989 -143336
20670 194395 -281481 -220094 241201 -118773 66778 375483 10098 393868 -99201 -249425
20660 -249425 18104 -181973 -132030 -183189 -139329 50478 124733 220247 -3997 -62458 -85116
20649 -85116 -312886 -76633 -134333 -249116 -138593 16365 147810 -33595 -219009 -168597 60970
20637 -70150 158674 -272218 181177 9804 -276708 -572611 54305 -5790 254471 -292404 -80797
20625 -74582 -129359 108701 185987 -54074 -439809 -66673 -6321 78891 -136521 27374 -591365
20613 267540 -85989 -175460 436912 -302568 112749 -370343 133990 57954 65307 -357801
20602 -57576 -51536 -38967 -364365 -472795 -448079 -151936 101924 237902 -42618 -42850 51291
20590 36930 -166027 69329 24880 -76493 -38579 325107 -157878 230188 22275 -192195 -23839
20578 36289 180765 4473 58551 16779 -295804 -78253 260324 -80875 -47621 370760 335663
20567 335663 -82613 -63587 -46367 -306064 -292840 121741 -255230 -88299 242993 -79520 -86387
20556 -86387 -13909 68865 -176062 -7313 -147195 -180420 -314884 -30611 -387311 -36151 -340078
20545 -340078 118579 -256754 -172917 29487 -59316 -173405 -130017 14275 112268 -502930 338769
20533 -165809 -344220 -66682 135177 -19614 7915 -309826 -360702 -148935 -248103 30158 -121798
20521 -22433 -238331 19239 -230522 753 -2846 -35547 279080 -250364 -372503 -12576 -54590
20510 -54590 -188263 -263713 39857 248383 -63036 -203203 -256872 -17644 -97159 -257403 50738
20498 -248782 3475 -320079 -450551 128379 27327 69721 -149812 2924 -120587 -178066 -17552
20486 144749 -103402 110678 -150122 -25256 -172350 161257 -46439 135464 116544 235782
20476 235782 -86405 -87099 -81257 -2089 -307240 -93908 -116415 -151255 68773 -73891 -24369 -107338
20464 -107338 130880 84659 -195237 -11051 11427 -269263 342881 -214548 -5160 -56137 162120
20452 80740 -111033 265937 10929 -142182 -141400 -158480 116861 256570 -22407 212130 91906
20440 -358225 -53327 163034 56009 151675 54817 -74195 74708 28378 157634 126688 -208894
20428 -264394 27165 -111683 84989 -367135 -50939 -74439 -57147 -300811 -214764 -136715 145106
20416 202568 -79921 -811 -136312 -264265 -74554 15741 -177428 -29424 -36126 -329460 360340
20404 -55952 -10809 -315457 22829 38463 311828 -266309 -18487 -254299 -337559 30812 -399123
20392 -52741 -130927 -190549 84068 -79068 -63398 129197 38320 -59595 -249966 -104278 -324778
20381 -324778 -23 -121434 -21416 -349475 24322 -26416 96777 -226116 -46798 -5513 -150305
20370 -150305 82020 -129602 60466 -68900 153465 -59239 -88615 190161 107869 -12192 210927
20358 -102180 -31298 -303205 230539 -229935 -196297 -154010 25201 -187831 -24535 17723 -219499
20346 -32996 -241063 -49553 -65031 -130887 -20746 -142284 -263598 124207 -325510 190604
20335 -131742 42907 143018 87432 287238 5995 341354 50182 31285 231985 126689 -247525
20323 -356791 -191993 -340104 -76402 -53098 -228535 -198525 69095 -76927 50476 -24840 -485082
20312 -485082 -282781 4223 -59507 -116840 -340703 -18835 207498 -117623 206040 -216786
20301 -272694 -53485 -74198 6791 10925 -115686 5836 -19633 -346398 -152281 68371 19059
20289 -203638 74533 -227308 -30465 -60745 61720 -259568 -257960 96949 221335 -100166 -325023
20278 -325023 -44209 -27600 8131 -102986 -272643 -154704 -347747 62639 121849 -47107 -379975
20267 -379975 -397386 -285147 -178335 -26158 -47948 -109496 -33368 -218657 -95187 33129 -382879
20255 106028 53376 -108865 -45666 -244094 -77236 -144460 187685 12569 -114001 68947 13981
20243 -167441 100894 -166965 6513 -27128 -680 64068 -314597 -179612 -98226 -63769 -169282
20232 -169282 -345968 -72169 102916 -290322 59653 79700 -55617 -264185 -204145 -113416 295988
20220 -71990 38103 -201824 -207007 -83653 177790 272122 117237 5816 -60466 -30081 -175509
20209 -175509 190005 327032 -326465 -226108 -131636 8618 -211341 -143708 -148657 135590 -160410
20197 -32645 -327192 -16972 112536 25758 -134290 -162595 162854 -237230 174143 -35752
20186 147058 -303024 -47994 -203573 -55461 -120537 -144872 -113733 -159438 104519 -95910 29667
20174 -119048 -3983 38601 -95670 43252 -59285 -28642 -158278 -73161 -393824 348757 -107771
20162 -279746 23500 -51519 -331093 -64869 -268940 291972 84572 -243444 -115392 333063
20151 263191 -231004 -203736 -286310 -17382 64397 270531 -288454 -133012 233204 54029
20140 311483 -258499 405987 -108418 132755 25285 219668 505378 22841 340346 193675
20130 193675 464225 351486 179259 131436 134324 292128 211590 355381 148144 280250
20120 280250 -172868 89087 131265 -107426 187939 -123985 -190553 30794 13705 -61104 46441
20108 292202 -396983 -195229 -185096 -220117 -131918 -163971 3082 -162495 357512 14455 53997
20097 53997 165359 -52170 -266427 191 -186294 132209 41651 -142408 -125429 -106867 -157484
20086 -157484 -106676 -32939 -197784 -229803 -10031 -82868 -293884 -263415 -261680 -156109 96497
20074 12931 51135 -211267 105235 395213 74313 -68465 98932 -154798 -186418 58374 -168804
20062 -132087 48954 -154433 42650 -113670 70148 117911 -200710 123057 -195775 -138772
20052 -138772 -252723 -112963 133092 282452 -323498 -79659 -68453 -19398 -300285 47337
20041 -107623 192563 -215489 -142840 -226091 -126368 194691 167616 -271580 15955 -99934 98513
20029 -448593 -235017 -99513 -204564 181171 -32046 -230755 20099 327120 216817 -191908
20018 -155696 1972 85688 -152055 82152 116550 13549 -19675 -177931 -235022 -124096 -5554
20006 84491 -145227 186795 294040 -101045 -62601 26811 38476 247834 -149016 28006
19995 -15997 -335402 -200344 5025 197489 -197683 -270140 147364 -139846 289239 95093
19984 11340 57340 32960 248515 -62671 -18693 -46261 -41506 -102092 40780 -226926 -62770
19972 -68545 316491 13969 -56817 95026 104151 12048 36059 -13304 -45531 -191928 15750
19960 -50275 -189479 158834 -106366 -72788 39257 -95822 303712 -163669 376756 114405
19949 -150518 -256004 -238850 -174063 -80232 43578 105040 129953 118296 -242073 156796 195728
19938 195728 268840 540635 -127855 218586 -41032 -72242 4558 38686 -91051 332171 104521
19926 96096 -190019 5578 42861 -265584 -279595 -201354 116478 -189746 -77159 242022 -63453
19914 83394 -88119 -267320 -557392 -193168 -254474 -2187 -289177 74292 151647 -70014 -54271
19903 -54271 -309991 -40556 -384103 -117108 -71937 -206786 96981 -9344 77960 -100584 5757
19891 27075 -37584 -335782 84993 -113204 -78600 57705 -3018 -230704 -148626 -57742 -164026
19880 -164026 -28186 34381 349701 -26896 249041 2329 -63585 39618 -168204 67613 71683
19869 71683 -68907 -157189 -203458 -86026 343330 -132738 -41927 -225861 167471 -285520 55245
19857 360045 33440 282403 -212355 103230 127468 -122799 -53531 -92236 -380455 -63493
19846 -157578 -25611 -323880 -176503 -82087 279764 -36953 -124400 -150782 -151391 -176024 159294
19834 -176580 221587 -244577 -327981 -94494 -306949 -529075 -31800 16670 2619 139058 131512
19823 131512 -8079 -104651 13938 284323 -4313 104316 -208403 -234111 -295325 -15906 -69256
19812 -69256 -265301 -24852 -421271 148954 -230228 -52133 -158879 76803 -14476 144276
19801 -147947 278784 -126249 -98367 -64303 49046 235284 53409 -331196 -515802 30822
19790 362908 73196 -167580 229646 -331934 -340275 -40657 -132401 -132178 56638 -148062 217092
19778 8121 -157716 -8178 179693 -248659 370258 -290837 -278263 -155931 -304272 219557
19767 -19686 -6038 71031 119110 -199658 1415 -86681 -298122 -568317 -90712 -430995 -153714
19755 105871 -363246 -247579 -102631 -222482 -323862 216375 -119885 395666 -26888 -291198
19745 -291198 22512 42880 50268 -96952 48825 280657 55004 271017 136136 -45886 52224
19733 49246 -250519 -413280 331334 94490 87585 126745 114984 231314 -30291 30112 187552
19722 187552 -31224 -440 112507 107235 247357 151914 98276 -18104 232896 626349 228021
19710 182864 112219 140550 15525 35415 276211 96850 -188709 19273 -75451 -56466 211984
19698 -134790 -30639 76061 -270085 226555 -302624 14699 268752 552201 -83212 197388
19687 -78409 -22143 105486 -165258 38157 275720 35012 121834 264137 -104832 283877
19676 116169 -151755 -4166 119210 210557 -94140 68046 -192940 108546 165133 28516 -284001
19664 -304727 -70824 -11155 62023 -143453 258746 -33151 -188274 -178156 -36982 -139770 -197764
19653 -197764 26662 9720 195684 -250289 -297739 182051 -233174 -162497 -189829 -28359 212176
19641 -17160 30787 339757 12533 -138220 -38330 -494827 -267152 -143770 -246910 -61962
19630 -23628 94716 198707 -67251 -89587 -245181 92769 -98173 -139901 29333 -285813 53960
19618 -249392 101268 -257449 -158672 -160578 -76341 -21939 162497 -63962 -447838 -87332 -122227
19607 -122227 -49407 -38959 148080 -73622 102827 177850 386695 -142658 -308443 -56478
19596 38275 42960 188512 145767 6038 -70553 -162992 -54505 28339 6509 -298410 -289285 -64740
19583 -342880 -233461 28898 -227320 -80053 156880 -17750 -247118 77741 -53743 -125531 -183503
19572 -183503 -169175 -202828 -93743 -228417 -175763 -561032 -7965 135433 -91882 4707 -131026
19560 180563 8880 -108768 120984 -137503 20911 36400 -225544 121086 -169479 -117003
19550 -117003 -102064 -342647 -162880 125466 26248 76501 100144 101205 75314 -212988 -113582
19539 -113582 -102350 -24 -285180 -64749 -105336 -7859 -97197 -168158 -23665 -61250 24295 1813
19526 -273230 46720 -76013 -176721 -88539 -553169 298953 -183630 169675 10256 39578
19516 39578 155376 80943 -359589 47757 -140265 137484 810 167375 -180693 814 -222099
19504 -47039 -55254 -307982 -147160 154943 -215413 -36298 -178896 -225423 -95442 -213737 -87989
19492 -183889 -464556 40681 -78618 -80901 -101868 -191865 -153379 217541 -77327 -33196 -6915
19480 137990 78797 -272417 50436 125443 -60126 -166148 -245793 -558410 34714 57539 43516
19469 43516 20334 120061 85269 118021 57577 43558 -212938 -270466 -54711 -350292 -247241
19458 -247241 -181685 -213836 -308128 -276856 -81811 -62641 2353 57617 -143101 -121335 -13098
19446 -118638 -43942 -78666 110172 -76368 160481 -65722 -200994 -151577 -148715 81868 -405231
19434 -162876 -29798 -148331 -28286 246635 -208524 19448 111860 -9825 -38706 -188121 31453
19422 140978 -319655 -14808 -195773 1648 -131998 -390241 -62003 32656 163865 -4813 -428161
19411 -428161 -206668 101120 -28205 103766 21827 -213447 -330385 -76653 -63155 28563
19400 194650 37192 -3898 378605 -106765 -74055 -197850 358394 -381374 -238522 -17143
19389 234029 -349825 -276325 -175460 33423 -106164 94829 -103968 384706 -113260 -9488
19378 28477 62260 -11792 -247114 -334824 -105808 -8813 44933 -107445 -271852 -208753 155322
19366 -126488 189167 200746 -280340 -134427 -302139 -37453 -72272 -189297 -119598 -339094
19356 -339094 -221789 56756 15607 -264633 -34812 -280099 -79240 -42832 -1646 11750 -158444
19344 -346674 -133777 -656602 -343022 -165116 37098 47206 -37937 168590 -389614 25653
19333 285795 -50261 -120589 -84682 2665 103947 56953 42671 -136488 -309218 168057 100200
19322 100200 -395815 189922 -24355 13427 -163802 -154700 -35656 130989 276905 -344229
19311 -76871 183385 96632 -334191 -292597 310579 -21049 -32767 -404847 -102984 -224017
19301 -224017 86487 -100490 -202584 -400634 -45190 -279134 -204520 46010 4790 -197998 -207999
19290 -207999 112335 -65083 -56837 -240526 145965 -45491 -190717 -249021 96822 -267826 -237289
19279 -237289 86156 -7094 138281 -131409 -191127 37751 31505 -170636 -67354 -230144 -18250
19267 -220852 -254272 -84044 -289281 63426 -13233 -88373 49307 -212539 -117750 1599 108330
19256 108330 395574 -164856 -97395 -52926 -172505 40699 -61729 6539 -195215 116690 -198435
19244 -193903 58973 -25798 151707 -32580 -153781 -151265 113208 -42707 118774 22637 -7561
19232 370319 -197427 -19515 -103651 -369132 -232979 4631 -173483 -7796 195583 88844 -236750
19220 93717 -87441 -210395 -255190 -390719 -280047 -50700 -135154 205138 -38066 -171791 -65662
19208 -379918 -292003 -131984 -149035 -110263 -329031 -120810 -430934 -16569 165731 146581
19198 146581 -345003 226500 -236577 -490964 26577 -116101 -327802 -248927 249041 -78878
19187 -184220 -6343 -259080 188168 -98701 9571 -116708 -291668 -196301 -113265 -158436 6811
19175 -11165 -331910 106808 262314 -219083 -263305 91731 48539 130466 -157748 186880
19164 30602 -13121 88398 -156612 -33117 -51829 -58585 -25457 46674 78423 -194813 -134620
19153 -134620 -16471 84073 87549 -159319 277933 78012 -138978 -272517 85240 -368282 -19156
19141 41946 60420 -122530 122357 17888 -125402 355311 -159510 242047 -43444 -36469 85721
19129 -52804 -295827 -28787 262562 -81328 81585 -44557 -125918 -311522 -49736 -224974 -472919
19118 -472919 -28298 -90626 -58440 40777 226241 244599 170216 91899 11292 -145216 118995
19106 -245559 -249126 -50835 -264818 105224 80066 -7989 -87321 -410155 -172559 -200798 -201747
19095 -201747 -271290 -451442 -203696 123412 154535 188208 -109884 30255 -154277 19715
19084 87199 123556 15279 -132980 19879 112231 -402212 56808 83016 184033 85187 3983
19072 -91314 -263577 161664 -26382 -208016 -38211 -83491 -350782 -118286 152016 27297
19061 -301717 -128360 -186082 -231916 -7870 206324 17731 -109685 -47980 -158004 71946 20602
19049 -213268 -152927 -88592 -121407 -31782 -237455 -142326 -158719 77040 -103745 -206357 -244623
19038 -244623 145031 -27555 172862 73088 -64178 -153841 -1795 54309 296218 207535 -16623
19026 -135577 65471 409389 -245611 136899 -153905 -130298 -221814 81329 129403 174790 10243
19014 22484 -5670 -44177 108027 30079 179146 365827 -244759 -152779 53857 43617 -77549
19002 147340 22096 53496 338316 -53452 119620 177668 -160522 34349 -70278 -18422 -186410
18991 -186410 -66362 68473 -280687 -191260 162904 -94652 -296327 -176608 -56071 45604 70662
18980 70662 29650 -279394 274612 -194149 86224 -69868 -179673 -10470 -134807 -185913 -166495
18969 -166495 -204067 -181685 -103050 -225238 -400186 -293763 106032 -52969 21865 166043
18959 166043 433159 26013 386089 -76707 232113 -91313 -277 238805 33137 -504696 -209247
18947 107450 -324595 -245 -112398 -412962 -89083 -106477 -91664 -117256 199582 -117506 -83211
18936 -83211 -189924 -61722 120362 -317328 -86305 120432 -121613 -104357 -942 -202316 -153146
18925 -153146 70211 105474 -203560 103106 14359 52045 -235128 480 61145 27430 -1187
18913 -160282 -101531 -18287 -102501 51786 -84098 23133 221787 124580 -431037 -1195 179615
18901 -36965 -78184 100276 208859 32434 68104 5781 185921 245083 144503 156673 29832
18889 315618 218576 -76605 -12504 85674 69919 240388 -94251 -63545 81062 -120486 -27979
18877 -68274 -27415 25212 -59958 147025 94278 193486 -314014 100062 86315 -252471 -276284
18866 -276284 -294852 -236229 183558 -3808 -227422 122744 -172802 -21160 119553 -67791 -86741
18855 -86741 -89802 31385 -195029 -414043 48674 -36865 -84162 -9738 -178843 -215719 -13617
18843 638114 -3121 -134916 -130366 -76233 -175511 -162749 7311 320055 -75663 137231 -47597
18831 26762 72384 84597 -285660 119265 130767 -225768 -156121 -169382 -486222 46974 13906
18819 -166657 120420 -242052 267880 115759 213214 -128122 -61325 -58736 101441 -272224
18808 -109067 181506 -26674 468289 -106556 -122127 -262479 -19272 77290 -215743 -108191
18798 -108191 57779 90737 6009 -25029 32108 -242206 -299492 455633 192984 -74277 -61098
18787 -61098 143511 50433 81803 -275142 -42887 -178773 -250794 -209864 19452 -57514 -413309
18776 -413309 5957 -102131 -232779 241983 96091 -84359 -79090 -160795 -74286 86269 187727
18765 187727 -76223 -236669 258072 -291971 1820 98726 37242 -6737 52348 27091 -26518
18753 12573 -381330 -102965 211236 -213979 349699 26837 -66813 -306696 103383 73437
18743 73437 -178149 -297314 19815 -4711 11516 81426 35535 -11785 311698 -61469 -188576
18732 -188576 148018 -31007 -97267 125856 -167289 -331752 -82191 62526 -172539 272290
18721 132763 64661 15249 128753 141635 -71599 -128082 -124016 -9238 -89701 57699 259960
18710 259960 -29331 37387 -120270 -33430 161296 25967 -99947 88351 -414347 -115048 -18036
18698 161012 -18180 -27600 -206108 66628 40114 -48842 106510 -147828 167925 -429510 -248650
18687 -248650 -77085 -48046 -256327 -5470 73392 -152371 256412 -67374 -176476 -342463 389217
18675 -135553 -236406 148843 115561 390704 -23632 251101 -413596 -91463 -279080 60224
18664 -124898 -61064 215287 51693 -298121 -175795 20853 98556 -189112 -202627 -55180 -121333
18653 -121333 -34850 -223714 -226803 -96943 73088 -73275 -71249 -192835 39322 -110837 -72763
18642 -72763 -230782 -220900 78554 -128295 -70077 140432 37216 142307 138988 -501611 128898
18630 -155195 -122496 -57288 -64170 -7743 -191156 79073 301224 226942 -138956 279957 -365604
18618 -226212 151525 -112101 -116387 50951 -93131 -84131 23462 181607 -205281 18932 61046
18607 61046 -43215 -258716 -186179 -31700 -400067 -307842 -274731 -539289 -137956 -22612 187478
18595 -120796 -352446 -49317 -161926 100387 -107613 -36526 199804 -38032 49216 -199169
18584 -402685 66626 -21371 10032 230514 -20123 -152925 229080 -229574 -86604 -54165 -76114
18573 -76114 187602 -65327 19323 -47036 126289 -106579 -42175 -70435 -11645 -32739 -288498
18562 -288498 -61275 118741 -9051 79706 189924 -67929 -216085 51762 6490 139422 -169069
18550 275953 -20782 90566 224421 -303606 11351 121224 8643 41224 -65506 91931 14472
18538 -256939 -32786 11401 -275691 -184376 178516 196310 -143363 63251 -78723 -195469 -22224
18526 -237202 89482 252420 41419 -70433 -291820 -320335 112332 -100898 -270861 -255741
18516 -255741 -134938 -367624 -266044 -56221 -161787 99853 -167172 -98623 -69081 -317 -82594
18505 -82594 -94079 133527 -165559 178015 104378 36896 96323 -125804 66510 -100472 -266470
18494 -266470 -258669 162036 22424 -21104 -137613 11167 9318 -256175 -183759 -9073 -95528
18483 -95528 -279925 -100887 -231608 -155329 67589 -147394 -86821 -125000 -172354 -173150 7889
18471 294989 146238 92906 21894 -143139 -107002 -208670 -7514 -77306 175215 -37128 -5036
18459 162693 112727 25679 -83222 -7167 -174664 101972 21293 -150416 118525 289442 190583
18448 190583 -182888 186814 111637 74563 167345 63064 -22643 -29176 214379 -61767 -214441
18437 -214441 57659 28880 204709 -267784 170328 -249057 -117213 203670 -46644 -173587
18427 -173587 2085 -120616 86189 16252 -157333 -182982 -337322 176563 70661 58627 147612
18416 147612 -469825 9062 208959 10800 -398768 -50358 -154382 -13139 -229576 -198216 7615
18404 -93633 -242965 183409 -88213 -41364 -379015 119280 105542 -173087 201043 -33812
18393 173609 -151331 -203567 67525 -335784 315079 25176 -41561 -147784 75713 -169856
18382 -31298 -311227 131622 201942 -44124 137170 -252995 -25998 -54288 -57084 -229493 32898
18370 -233574 199457 128936 -334219 -85994 77684 -123722 170589 -87910 -100250 -234 78692
18358 -383761 -230049 -239066 97565 -243472 173125 -312357 -18982 34092 225744 179419 175591
18347 175591 -198329 80401 -144952 -723 -118303 82536 -94254 -67875 320908 -418319 23465
18335 -56941 -339883 -94801 13772 67797 -44147 -41304 9227 -4691 195080 -201670 -190593 104938
18322 -44663 199187 231652 -170419 20375 -154798 -157059 142297 69703 -88770 225418 122506
18311 122506 141085 -184082 -11629 -64591 251209 59084 -125149 106609 -208239 -150475
18301 -150475 -31059 -13600 -34709 29101 -56618 -293265 48954 -86695 18301 -340230 81413
18289 368345 -115453 -37152 -42406 -331079 -11831 -239999 -12589 -35776 -137601 -34641 99087
18277 25377 -330288 -321552 -155380 139771 -188417 -106848 -101593 -170001 -29011 61645 124868
18266 124868 162109 -141983 -313884 -66454 38359 38614 -154176 33624 -375992 506364 -345385
18254 -189063 -117655 111025 78646 -54661 86403 -79121 83673 -206912 241984 -539622 -118553
18242 73920 -303353 157314 326954 -88806 -101611 -138657 24063 26213 135652 -372067 1101
18230 17092 -265697 -108730 -28622 4281 134965 83506 75845 109170 -281820 -175007 -30769
18218 -287785 -20812 -123094 -336561 -32336 -128509 75299 -80652 142802 121368 -151115 -32945
18206 31286 -188665 -100701 -39629 49150 37221 -243212 8965 89039 201237 330508 -358681
18194 766 -97530 -99913 -13451 249382 -34144 -143145 165921 224064 -303799 -235702 70484
18182 -91157 201759 -317603 85313 216958 152658 59300 -136993 -31556 71644 -166289 77662
18170 -171042 38049 -20270 201492 35637 -121171 -67316 -111595 82320 -170277 112395 -28468
18158 104098 -18893 -29648 168568 -202821 54255 36752 160662 146201 1819 -108337 49821
18146 122843 91143 -357669 -300139 -196950 36162 123417 189799 -177453 21178 -216654 21825
18134 190344 58680 -293706 -55771 -31672 -226200 -189460 409316 272631 -8168 -77927 -127536
18123 -127536 4135 300841 112994 68925 -348389 18617 -335179 -45240 -23384 -216264 -22368
18111 -292302 -149926 206414 -132750 98492 149291 -33985 -111913 -231661 -114240 76321
18100 225791 -267107 109776 269875 117733 -254579 13805 156425 -127886 206255 -96688
18089 265029 -128056 20287 53795 -38090 -224306 -201556 125716 -121950 -66425 -188091
18079 -188091 175163 -425083 -80265 167787 7039 -50558 -249628 121064 -340363 219851
18068 96263 -6185 104016 117301 -223267 284392 -146357 106313 104145 89194 -64250 463890
18056 11201 -65151 -30402 246569 -158705 -188915 64474 -484164 -173723 -161382 -82819 121674
18044 -56159 -269864 -162966 121265 -32391 17876 256603 10685 -1509 -313593 69990 156582
18033 156582 200207 -187270 -160785 -22867 166912 122625 76265 370873 207457 160061 -225113
18021 -120828 181598 36324 202447 -25695 159091 62059 89829 35881 -57195 173341 -56737
18009 -79897 94751 -112678 25592 1842 220013 -298485 -146846 348975 -30033 70452 -107536
17997 -305922 -164176 -106393 -152067 -8895 -15064 187333 -58460 -96353 -111004 146123 -101967
17985 274680 203360 121541 292333 154166 -349981 382778 -237690 120192 28021 228482
17975 228482 143793 -82442 193033 179705 -30179 -48337 -2152 -137364 171566 -10841 -94761
17964 -94761 -273829 -246441 -11835 -11286 161635 -46189 -33186 74910 -194956 -184009 159475
17952 275675 78509 146524 110540 81809 9687 -87594 104132 180587 -146192 151676 9530
17940 213960 -225225 406239 107080 104395 232790 49125 55551 105241 23439 -177896 185952
17928 -197243 -173146 254683 45016 -97160 -4979 68384 -197201 87308 -79851 134370 733
17916 -20932 6956 -111157 -389658 220831 267291 -24472 -39494 -118129 193680 -137332 -366999
17905 -366999 137680 72961 73489 -79139 136179 -129999 95771 255987 -320495 114271 35705
17893 27644 191417 -86694 101777 -74695 -248652 58250 163227 53576 119133 217396 -214830
17881 -121778 -248772 98780 -46327 336413 -35486 266854 276594 -189105 74611 192034 -130915
17869 -268716 176240 -42880 -7450 -150217 -339714 -81684 45687 -230643 403163 120855
17858 12825 148907 -34107 -41001 139359 -163174 -215060 69950 -26139 130252 -57605 -109028
17847 -109028 267324 200322 221270 -30899 -223864 267425 87022 -255579 -14919 234972
17836 -44807 -106407 135756 256122 46273 89653 90351 201726 1931 274346 -35003 -366446
17825 -366446 106157 225099 43641 293404 -24931 118657 -49021 -20027 -147723 -102690
17815 -102690 -153006 -117873 261977 211604 184062 218488 11135 175445 395184 40200 -64480
17803 -11051 -183906 23737 18356 -22736 77082 -123799 -354418 38419 -43050 38927 220666
17792 220666 279160 -150482 376530 -32566 16161 -110677 -14886 -223841 -59447 66752 12165
17780 348955 108408 -79539 -140254 277585 189496 -297818 118128 26979 67848 165439 86470
17769 86470 -34754 -228494 -169800 172604 117632 -63609 409070 -172725 -109991 68439 -96092
17757 -93236 70995 89657 -96022 -134829 -458183 -49368 -49590 40577 182821 -21618 170563
17745 125266 -138987 121242 -120326 -29505 148299 -238858 -125453 -166823 -229716 -144823
17735 -144823 214978 69459 154531 357307 -52109 -222696 22915 72879 135630 95877 12914
17723 245759 -5721 177379 -61880 39512 123112 42359 -21518 61904 37249 -31507 -136649
17712 -136649 130127 180030 236753 216384 85312 47133 125353 180728 -117432 -63527 236712
17700 -98288 25321 -103011 -56430 1789 112512 166857 202831 -273152 -204661 77937 169496
17689 169496 156194 -143206 134078 -35439 84818 -204471 178111 -19318 -100185 294416
17678 -34956 -140425 484219 227807 -73138 223224 227427 -108813 206385 186807 -4031 -84730
17667 -84730 6028 95275 239884 174290 82785 68501 394217 176727 298085 -174528 302403
17655 -70196 365403 417073 -172407 180641 205357 313229 154837 215763 266150 -77637 21506
17643 -32726 145891 119894 -38956 182764 241759 361190 19925 223150 304464 228541 312660
17632 312660 -177432 502065 296041 225430 202482 209602 -10471 121026 69928 -75418 124111
17620 151773 268449 -285544 108710 15190 -5815 141017 -250987 35579 396204 54388
17609 -157400 234081 421493 203792 -70293 384906 265283 130864 -105529 267160 302275
17599 302275 64308 -31078 232110 165227 242290 -31700 92198 92604 -46666 216982 -11608
17587 54997 69868 -30270 243981 -26001 263512 -96891 131293 17166 -228511 -20427 146032
17575 -41297 -58476 182808 308925 40735 260407 234468 -69043 6912 274765 -39939 -97996
17564 -97996 40145 -119962 186334 251829 -120641 140771 296831 -206325 34356 -111768
17553 154918 195276 56186 87579 92503 214881 12062 -148670 294595 462769 46024 -11884
17541 77201 255316 30590 -134807 350434 334000 141880 276758 145935 106040 -3089 -78474
17530 -78474 257603 429413 177514 -126760 -226405 318703 344041 235144 386393 -92158
17519 357067 194305 101992 160546 -197203 381509 187115 458298 533348 347076 772910
17509 772910 728561 512028 998793 599527 1003475 449187 565585 532255 385069 -32770
17498 274304 322126 268297 446540 591413 793288 801965 1040813 967989 782140 856662 237810
17486 365543 493986 604977 258674 553945 233345 329205 237683 -6122 -18341 361014
17475 296355 241572 215121 -22410 224117 225174 185312 343071 148016 488183 387016 -139875
17463 313942 446283 352460 214376 15473 -21137 140000 233120 30357 140123 107485 -49388
17451 165617 447024 172324 -57092 225541 178012 261566 266509 99566 313604 296325 37820
17439 342822 740835 123498 240432 494943 468100 263723 78245 5753 379406 227876
17429 227876 46450 205139 323416 306167 391768 355221 233262 297414 411335 187605
17418 23350 536692 250417 169873 73662 183563 172224 263888 591432 407933 162537
17407 550495 91718 473284 211310 362637 391103 314516 382320 392534 574934 -17362 144515
17395 54629 335263 426677 36661 113705 461719 154714 55889 268170 104464 72260 292234
17384 292234 537416 -9923 405564 239714 83465 47750 205788 275587 162993 -101762
17373 166406 467746 -140742 57905 467737 165623 520259 207202 201031 241075 95656
17362 590174 287177 -74631 -450 225757 406558 73952 338966 252826 -22707 175949 211875
17351 211875 407848 231472 268603 247825 -135694 336380 209423 173562 187718 516758
17341 516758 -40581 220945 280976 358672 177697 255695 189162 90184 123794 -63004 201256
17329 346815 279302 121733 346169 489670 363231 126540 93678 374470 41809 270444
17319 270444 263921 -21028 179765 66802 253636 530013 321882 327439 139155 248345 -61592
17307 219574 644117 -49034 341085 47049 25847 215258 126312 274207 222504 575032
17297 575032 563462 489867 62087 233822 267597 115191 311858 458248 256959 445605
17287 445605 134467 198931 37840 512443 114606 85329 195267 227418 -3197 461969 415296
17276 415296 202921 556259 109577 316727 254175 105308 -110007 448874 259725 115255
17265 129718 281364 468574 315729 420647 231844 315207 63836 482872 201615 513390
17255 513390 -7155 391114 515614 628373 409032 317006 199659 -153077 229559 460050
17245 460050 564503 272354 533148 233354 205345 375583 619604 135721 134108 742553
17235 742553 -110703 211408 177272 478357 323263 537634 359124 94270 308639 323655
17225 323655 381029 163084 288233 477645 448023 361997 307595 271413 352846 -33055 92009
17213 99717 490524 174904 445445 407831 145740 230905 365879 372389 206841 134047 796660
17202 796660 305300 344775 156133 395941 528321 158273 321772 425227 561694 389015
17192 389015 456794 129925 391826 265646 414954 334578 225609 307778 126764 133765
17182 133765 455882 79528 715816 -175306 450792 386787 415907 246314 537998 259094
17171 310472 455617 450219 87769 347710 182180 201022 210310 262625 375468 366324 346338
17160 346338 224861 448569 515433 634307 777763 594996 503252 490753 174274 386611
17150 386611 424274 462418 218572 468285 469771 366081 333744 459192 410509 263097 450897
17139 450897 541782 325076 204879 283369 441912 699242 422400 465567 158748 530912
17129 530912 483783 388512 388852 360019 331938 342228 145434 88714 558775 543402 637183
17118 637183 281928 793799 260129 424282 390214 472059 647629 357806 238145 405318
17108 405318 685732 846885 392995 342822 652632 782340 518124 458807 757672 352297
17097 416762 307920 594450 569653 544999 498159 580176 523849 283248 762876 678934 727521
17086 727521 581880 679448 808607 622097 525491 429000 841242 522092 525190 525315 434071
17075 434071 684646 526405 790466 408137 628985 459168 502206 131650 797540 479254
17065 479254 626188 463959 582629 523527 587120 520608 715982 758728 461169 304385
17055 304385 576522 781274 981257 860072 942076 667947 651350 699110 536192 834679
17045 834679 595382 617446 540647 658295 661606 676734 790812 740145 666001 512093 746744
17034 746744 609455 644611 658341 794643 972169 849720 582627 668920 533153 762716
17024 762716 824786 955013 1096047 390091 858448 808423 781360 548968 774387 893431
17014 893431 700330 776252 925254 978558 553063 909737 924707 666501 825550 1171860
17004 1171860 803158 849590 804624 979341 1011197 882577 1332416 972897 1021199 715830
16994 715830 891654 959692 1118502 1116405 792680 991341 1107143 890966 1130368 970330
16984 970330 959354 1080580 1192826 1087107 789604 1083347 871218 1079343 1086797 819414
16974 819414 1107767 1069519 1160117 1168134 1002446 1186841 1276171 1068811 1169998 1041415
16964 1041415 1319388 1135832 1083067 1145717 1041956 1268023 1494651 1458667 1322412 1271053
16954 1271053 1253789 908038 1460067 1523050 1497116 1225640 1341310 1279234 1285879 1545178
16944 1545178 1150282 1403890 1663160 1535039 981473 1277533 1632215 1323755 1559207
16935 1559207 1454543 1509882 1625124 1401066 1761432 1459410 1538504 1715395 1437493 1353882
16925 1353882 1528225 2034432 1429031 1742576 1595494 1743807 1357551 1479306 1894015
16916 1894015 1613823 1546345 1957533 1907009 1920080 1892424 2056723 1861246 1853777 1725980
16906 1725980 1773595 1951151 1819609 1865314 1981474 2255578 2298579 2102641 2501453 1907032
16896 1907032 2031931 2427229 2170438 2382676 2039977 2038444 2216073 2156020 2482873 2147633
16886 2147633 2349206 2689379 2438957 2180552 2454135 2625800 2657352 2560546 2508264 2381172
16876 2381172 2409979 2811818 2795856 2442593 2951427 2928142 2932731 2714423 3133959 2918755
16866 2918755 3172003 2953681 2871723 3181582 3128548 3070772 3186198 3234783 3242901 3114998
16856 3114998 3318056 3162328 3328690 3556961 3725218 3511710 3658946 3521173 3803449
16847 3803449 3813717 3800932 3921476 3723613 3850815 4151884 4149016 4172617 4019279 4262824
16837 4262824 4153094 4274259 4426687 4298700 4771984 4767766 4557773 4794989 4700988 5170936
16827 5170936 4949454 5152006 5074741 5264513 5536625 5408410 5396494 5875691 5716203 5652045
16817 5652045 6209025 6004720 6347888 6463362 6526270 6481911 6699382 6856209 6891424 6878373
16807 6878373 6873826 7184698 7583221 7513949 7386833 7624463 8031027 8238857 8218490 8519671
16797 8519671 8623863 8682538 8941240 9228768 9741087 9618986 9910894 10175362 10244831 10626207
16787 10626207 10509628 10922460 11107044 11423246 11545320 12071923 12698616 12572387 13019580
16778 13019580 13069223 13753534 13998203 14287904 14702858 14776018 15556532 15581802 16835886 16704827
16768 16704827 17159790 17754391 18464112 18787799 19468716 20039019 20509454 20964326 22023087
16759 22023087 22584728 23197176 24152911 24845819 25710181 26692089 27531694 28551540 29840852
16750 29840852 30613240 31752254 33096282 34208268 35250541 36680971 38003027 39336662
16742 39336662 41189856 42817216 44678998 46516028 48687656 50447626 53039724 54868681
16734 54868681 57467288 60024833 62635884 65549318 68037257 71684598 74744204 77915352
16726 77915352 81479021 84977746 88786850 92732758 96657801 100694594 104766017 109221755
16718 109221755 113455699 117358648 121472677 125637517 129508829 133631698 137033086 139853041
16710 139853041 142746379 145214994 147092782 148523863 149940166 149983978 149972136 149473909 148383826
16701 148383826 146438993 144323235 141346940 138480538 135032616 131671258 127807836 123858733
16693 123858733 119247765 115432274 110912424 107190428 102987793 98597738 94288358 90498308
16685 90498308 86602698 82827523 79323308 75905680 72463103 69342721 66278737 63525302
16677 63525302 60595722 58156278 55702567 53075418 50542184 48766125 46950991 44861568
16669 44861568 42818567 41270937 39114704 38032645 36537360 35309396 34187078 32863288
16661 32863288 31285630 30724571 29238028 28172635 27213813 26324909 25112736 24850865 23541540
16652 23541540 22815280 22106461 21522491 20909494 20147368 19444345 19100311 18001426 18134197
16643 18134197 17294533 16608216 16368533 15855934 15319114 15096585 14684329 14471791 13651660
16634 13651660 13574024 13145355 12915722 12623557 12037422 11761901 11509599 11377310 11093408
16625 11093408 10499881 10548855 10476898 10252110 9892556 9605935 9446085 9094679 9221649 8466854
16615 8466854 8589001 8501489 8120999 7994861 8167299 7732023 7770759 7201101 7301502 7285365
16605 7285365 6962724 6652037 6530146 6758920 6431685 6347646 6438978 6330565 5993539 5907680
16595 5907680 6040287 5993336 5836115 5156017 5375268 5325037 5420960 5234285 4817223 4899543
16585 4899543 5038649 4708452 4611202 4738256 4613961 4477712 4863781 4363909 4455452 4245900
16575 4245900 4114200 4277525 4214043 3786980 4177247 3966146 3757408 3759995 3757534 3886109
16565 3886109 3694683 3583447 3581445 3625105 3181254 3278626 3325161 3502654 3324482 3278694
16555 3278694 3314279 3036116 3012975 3197462 2922968 2871621 3104716 2652148 3108615 2968090
16545 2968090 2699700 2584647 2733700 2636475 2689423 2725762 2592310 2497475 2263170 2573424
16535 2573424 2450872 2672044 2422437 2427031 2408811 2312564 2237286 2519513 2202234 2380166
16525 2380166 2509543 2438177 2132113 2012764 1824207 2136265 1984350 1982796 2450421 1775162
16515 1775162 1803431 2243358 2045558 1721361 1756384 1837277 1540473 1714770 1921533 1623973
16505 1623973 1744862 1774678 1552083 1552912 1456703 1905599 1808815 1698113 1751751 1647684 1593046
16494 1593046 1752271 1358136 1315375 1662445 1605181 1632809 1564586 1393830 1851725 1283374
16484 1283374 1875276 1488203 1562336 1592617 1803947 1463012 1379067 1232039 1350029 1384619
16474 1384619 1607103 1429259 1337172 1239214 1024570 1181452 1435150 1408786 1445448 1258064
16464 1258064 1416357 1120641 1140889 1415014 1270173 1128820 1276424 1128069 1060342 1264819
16454 1264819 1066094 1059543 1169166 1183755 1213997 1067954 902228 1263991 1073906 1381640
16444 1381640 1203057 1016673 1199077 1092576 1044488 902264 1145442 1093569 1025807 920810
16434 920810 952353 1181238 774016 573823 871196 1194798 707520 1128801 981229 1078178
16424 1078178 907436 832334 1107578 947602 700165 790649 939241 922211 1017653 870085
16414 870085 935310 1050890 910958 1075365 586028 910306 680299 801664 735256 797028
16404 797028 926870 895319 572991 862710 1322424 953043 1027731 1085588 663596 759641
16394 759641 954475 460973 683377 478548 779992 810931 967954 664631 1071654 480588
16383 901596 550376 588230 750783 737179 600768 818229 670995 545670 716335 680660
16373 680660 712717 681147 751751 759045 699978 610860 982775 468870 509414 795273 925891
16362 925891 657058 460242 652001 538895 904332 366770 367036 702796 899253 637555
16352 637555 530441 848647 651987 475909 758034 513507 759926 424585 711387 860721
16342 860721 691737 807807 648291 659495 413553 717833 610914 399110 541582 640967
16332 640967 488947 339258 882743 547757 635212 781817 539893 398244 462616 327884
16322 327884 409830 282802 288898 611440 752856 411469 649464 723163 667318 572002 514428
16311 514428 711622 574257 491276 295629 367001 380985 528553 536220 460971 308693 421935
16300 421935 452639 427040 88463 350137 381596 141555 613460 431865 637330 517961
16290 517961 246966 294382 345534 478016 698984 44629 310548 659584 385781 544641
16280 544641 463118 80197 449052 559390 653078 235385 216492 560107 392200 573388
16270 573388 246395 313042 304105 609048 369785 618905 521230 338101 346753 178103 258446
16259 258446 -45019 406531 271521 552619 509786 524358 288825 386231 454725 414781 105982
16247 525170 413942 472676 189490 344658 443218 108680 184736 18728 188524 541798
16237 541798 303830 370970 237621 390872 363972 449244 318725 488051 344689 134919
16226 361645 514859 395987 599906 386030 322551 217359 521623 296754 330550 541965
16216 541965 287856 395437 105848 398499 409195 201311 -14353 197329 381130 235513
16206 235513 164876 -18689 78983 -24647 -12883 306149 291013 336165 417107 487036 364604
16195 364604 701297 328490 609996 171204 347229 615407 659419 128703 440964 9058
16184 279967 338977 356068 119398 290723 466753 203862 77580 293200 -6954 68306 181493
16173 181493 369207 219163 86356 160259 264949 512052 347687 24594 -52837 112336
16162 295431 120190 365271 377264 -137631 -121618 531012 320427 393867 260811 198233
16152 198233 404011 -102566 21070 229676 282824 335789 485968 -25330 221483 233393
16142 233393 403875 -40240 265503 101747 91591 482359 47603 259137 578581 207302
16131 505341 500213 -61385 110077 322663 333663 226050 326744 379380 224793 72986 322748
16120 322748 -92770 455266 160169 51385 22777 139062 -83414 133878 -52844 153698
16109 55502 70812 -43670 -4708 244908 57629 317410 215196 9521 204549 205036 99910 178452
16097 178452 253138 13149 484053 -196996 -130575 196892 -195614 101352 139766 156408
16087 156408 207634 -223234 131851 45554 150669 53809 82161 -29492 210263 55324 147295
16076 147295 -86866 409604 52603 160658 30550 133307 625 201617 226654 -61873 4081
16064 177351 234299 10298 15149 100637 28356 -47835 25780 249048 147870 121178 178685
16053 178685 -13562 311413 18720 23213 -300220 373242 82247 44452 180616 160267 -57826
16041 179557 25444 -60036 229314 -166545 -137158 58916 113630 -118710 115316 -10860 49650
16029 -51709 -260686 218013 250759 -201753 -99747 -283168 -126646 143371 -231964 270312
16018 67998 86184 13991 -228343 -168128 -8083 -93036 -190190 -183748 178062 -116944 -19122
16006 -141773 256311 5633 34487 -140469 -119396 16904 -66121 64744 -42327 29691 -105193
15994 33437 22818 27789 4588 141287 -156359 -42140 -110299 -117266 164812 -286056 261027
15982 162735 110353 209834 143630 -23883 233847 280659 229416 92423 311088 80779 524286
15971 524286 456749 421354 662458 718533 627218 441778 663836 148229 421096 258092
15961 258092 164034 -59949 56625 373302 1043 273947 4628 -82869 -24519 -265576 -97294
15949 -193940 -131135 -16980 -32657 -181199 -28855 208741 267881 -148644 -308502 -175551
15939 -175551 144362 -234005 78758 44958 165866 126424 -351209 -137439 153686 -47767
15928 -304827 -14486 -67092 -11238 -250099 323981 -318324 -263302 104880 114098 -210617 26720
15916 209372 -233848 65697 -129310 -118216 141987 137739 8181 -29352 -109423 -133275 -179613
15905 -179613 -381163 107929 259612 -299779 301619 153220 -231650 -215794 23251 -203399
15894 28293 361017 152697 -158365 230439 -319080 258574 -44604 -247190 151949 187323
15884 187323 298228 69570 -32372 137763 185387 9252 -252347 163400 -145691 84924 -236718
15872 36008 307194 -90657 -112057 -190059 103914 -225368 -185576 -36485 233034 -220841 -75325
15860 -180320 189415 18058 201134 180719 24631 -123163 302145 -68722 56109 -86118 260365
15848 -76262 -255934 157258 48291 151495 -75904 -109220 -196980 -112402 82033 137234 103124
15837 103124 336876 -83562 -115050 308650 -94929 -3504 51135 -421288 -108916 -197750 244129
15825 85492 -86820 -65346 123576 148778 -166830 183201 25696 -62432 -195983 14828 -448408
15813 98594 -34795 -234550 247928 -123005 -58910 -33603 68990 -32077 -221123 20826 78653
15802 78653 -121844 -39067 -119899 142184 -209919 -50736 -36189 -178576 77496 -85168 -95592
15791 -95592 286903 175182 -81710 182736 145865 -119477 -34173 -775 163125 953 60742
15780 60742 -405292 -118408 87979 202479 92389 -170603 -295344 -25177 -50573 -55114 -176137
15769 -176137 65343 -196321 -41335 -304304 -569301 51004 -72585 84395 55682 -152674 -104461
15758 -104461 -87936 -365118 -454504 22394 285462 -199146 -218925 51033 248049 -53745 68544
15746 220155 100637 29282 -87529 -133386 -45708 4568 37201 126009 26929 159947 -93989
15734 -142265 383736 134614 -78556 -91740 -135157 86296 221293 -23668 -28038 39603 43186
15723 43186 -259369 -126493 219592 407176 -25646 233316 -188262 239272 -95361 129297
15712 -174836 307336 -29344 -42870 -119445 36974 18676 71910 -14193 78080 -100996 119509
15700 -112018 -347505 -415896 -222964 1379 96237 52787 51709 -55316 -120567 -256414 -11861
15688 -146345 -72849 180220 -24391 125870 254039 233769 -10229 -8926 66370 -22201 -34582
15677 -34582 67280 -12301 86596 256797 108896 535046 58627 -173599 -286020 35821 -236593
15665 -2264 -85643 79484 178735 -179389 67549 -136731 -318674 -426341 154702 -400650 252499
15653 187884 -46580 156792 -260728 -167988 -94847 59715 -170502 -202232 96147 -15902 142114
15641 153670 -29749 173870 -190882 -105029 -124383 -178806 -40360 21708 -326873 124626 -102699
15629 402771 155136 -87145 11136 157167 -127266 168782 -86832 -317148 32620 -162105
15618 -228470 -80539 2435 337737 64120 -89806 -48588 286445 175011 -1577 11512 456829
15607 456829 -227704 239304 218844 -195837 -3757 70376 -88669 -42360 141264 66592 -47058
15595 -2710 50477 -25631 75842 -162108 -107391 -168985 243482 360927 -262411 44484 213642
15584 213642 -166898 -132365 395822 -156124 404934 -196995 185252 44724 -29265 -395201
15574 -395201 -79485 104211 110903 202813 -30986 67387 -162346 -115617 14211 -65319 142959
15562 90790 -66285 32265 -12365 -160549 -53812 -109422 -287748 43179 210306 -295189 102193
15550 118991 -176782 -144481 -66684 304834 -408876 -187761 23359 13392 -31524 -142099 137920
15538 122726 79549 -28378 115160 170501 -290869 -249524 312248 -138413 -4938 6304 -154993
15526 315665 1560 -336691 54806 -240312 -90400 -138997 -95843 17275 -170528 -72565 13329
15514 257598 -54393 510 85070 -104141 324459 -73268 65447 211937 -85637 298290 117585
15502 50815 -311194 -148963 66216 90596 465721 471879 316677 313241 164850 -120858 117696
15490 -157216 253486 127690 -261598 -204263 210436 163907 -204083 -39608 -10158 149077
15479 -109618 56535 171821 174728 -188931 -79474 123795 108358 -199667 94376 -103504 -375754
15468 -375754 190895 -59165 158100 75050 37996 106531 206777 149634 274094 113670
15457 301818 670744 389804 596861 11664 331811 492918 -192483 93960 -227608 28290
15446 -176068 237737 -248414 -62189 163561 342460 -340532 204061 335885 -113125 131701
15435 -109266 138686 93001 155629 -148965 33119 75004 245403 279901 181165 667152 807910
15424 807910 957926 506658 1027424 176804 436637 -32881 -104728 298285 280342 207021
15414 207021 296699 127220 92790 107856 153843 139218 -15133 -12284 -222756 -29629 211071
15402 74735 -31626 132789 -231085 75634 162547 -105131 80035 -6117 322422 121423 -143349
15390 -253247 72152 -325957 119932 86955 -41638 123408 7273 -3731 -435759 36544 4258
15378 154462 -74295 -12059 -88862 -229359 -228730 39192 146616 175786 56244 48861 32320 251276
15366 251276 328051 -200799 -280164 -170539 229610 -136992 358926 293475 65649 151519
15356 151519 154486 179111 -73319 423649 11623 138305 109023 -139700 133394 -98666 166355
15344 146608 279122 32886 108987 597564 247020 145313 225102 -28913 -129588 341764
15333 -16010 540571 411006 157067 -115395 -67918 200992 245687 411847 464719 -26936
15322 -54316 247716 222735 254314 -58078 138914 522160 128728 73182 172984 87869 331371
15311 331371 148270 284282 105621 46936 19688 327390 -29680 72520 -47702 117482
15300 -184885 173101 -211639 188946 20586 49412 7306 70493 132747 6175 -30529 292964
15288 471318 72636 175884 57514 7305 110001 -187084 -33534 264138 273901 76098 64966
15277 64966 27230 218789 -116375 -202879 -81740 101022 378262 -305369 -29258 72339 112312
15266 112312 -51156 -127338 157487 -77674 -196811 -115464 -364194 119 -140648 -244536 -174344
15255 -174344 -67601 114897 -111376 167431 -241853 -166679 -203090 116421 -246927 -163136
15245 -163136 -58590 -171710 3387 194540 68493 55711 -47533 -79812 90429 110389 166942
15234 166942 230577 444009 577871 312760 1018166 1330737 1330199 1278113 948608 494719
15224 494719 504625 361446 41288 78227 159661 185230 508928 -90929 182282 149645 -135257
15212 -159112 589882 -29789 -145271 -71982 117194 -61493 -93094 176162 211394 -112174
15201 -42486 53866 155851 -2293 27332 -79289 -255253 46429 150277 -5797 -126012 150646
15189 302763 27240 169323 28815 -121992 20804 141926 13135 124647 10218 82555 502357
15178 502357 30155 -57056 -29708 52637 615 323083 -117465 343383 163090 131397 -260925
15166 376881 160878 143883 99195 -109616 186256 275877 573112 -5466 448847 189857
15155 27639 -106427 51661 297850 278822 -106627 37121 -46702 -146963 48644 -42754 177703
15143 230276 208233 -35718 631581 -27082 -1982 284430 -111650 340693 -168189 -135326 218442
15131 -68181 -83613 367037 -24451 129112 46024 -106261 -102664 143097 78295 -189142 -23404
15119 179286 187935 102131 -166182 156375 -8543 334363 219295 -222279 -189575 147095 -51116
15107 -23978 -94279 -85648 150269 161333 230623 356824 -10620 316542 77517 -36319 227722
15095 189607 275529 -49335 18013 540603 297905 25247 454615 508398 152652 18048 116213
15084 116213 -37122 -84508 129262 177735 285974 276485 289068 53806 156235 314058 153509
15072 34987 -16291 369983 -80116 302797 115663 100088 -186290 210829 243551 441913
15062 441913 329357 365967 89407 334825 1124 42416 111620 445074 213844 63052 102396
15051 102396 40032 64363 118644 38508 229626 104734 173639 461587 364983 441045 600292
15040 600292 106159 294565 679131 203616 425637 -149255 405179 554814 130656 127937
15030 127937 506228 455329 620684 199936 143414 -221457 315600 214379 482738 123725
15019 133980 198199 628843 280401 495032 331972 511539 767826 751075 817059 386201
15008 183799 424625 450350 583131 576082 494647 386611 406293 576866 284642 266674 422894
14997 422894 708805 166582 112474 651693 523334 282700 644742 383925 116980 242773
14987 242773 350001 415285 89525 784059 472077 495815 470212 450804 375735 476024 483292
14976 483292 393750 551469 382583 272629 656326 362498 460160 526352 798349 377257
14965 590330 759822 650796 665032 581771 568132 635564 609537 299573 418872 481707 714975
14954 714975 605824 659291 49803 336289 175291 606322 404514 306780 381434 342435
14944 342435 277780 252035 476567 381127 387063 443021 386997 330416 445640 198880 559378
14933 559378 676140 468491 616151 542226 174070 327100 561105 465617 684518 416620
14923 416620 638722 102221 583831 287142 291298 377513 873257 447679 257993 752551
14913 752551 1037528 1249547 1372213 1531523 1468500 1531553 1555383 1418960 1290579 1447865
14903 1447865 1316742 1419790 1668405 2076259 2025302 1764491 1538120 1145211 1017405 1002280
14893 1002280 760038 497472 383641 505820 689928 166116 286685 635598 414403
14884 414403 547235 505394 561270 535729 748648 447489 358925 476736 -28991 433338
14873 399062 643336 511575 413374 629866 932419 630515 796231 919032 611470 691740
14863 691740 687687 670700 821611 939677 639185 1117575 533783 758715 523918 933298
14853 933298 495917 374082 626909 705056 463776 732666 739259 580229 845433 534870
14843 534870 494906 508356 760498 401079 580110 354927 730351 297067 400593 661662
14833 661662 300719 780349 369513 461189 671678 812285 619883 726667 1011243 1022588
14823 1022588 1193595 1029234 1200532 1360845 827428 972323 873541 726841 875492 578672
14813 578672 615726 311524 297398 789665 484188 640048 819121 673906 514617 903419
14803 903419 406624 944178 493963 656091 737185 812082 993795 1052442 748868 733231
14793 733231 819568 963641 663682 726222 803969 1010306 810758 716542 948180 810375
14783 810375 267700 1077057 764987 506714 582527 221975 629340 687287 232504 624703
14773 624703 481804 868728 769242 641263 669588 844998 940235 594537 340132 471802
14763 471802 859219 522632 655294 743874 869316 858373 954154 555090 513933 920738
14753 920738 771602 694487 470288 515456 630418 743616 503178 759520 577378 710650
14743 710650 605387 579181 502957 748697 628755 691549 533253 678056 607146 843914
14733 843914 545566 760439 854953 619666 659114 602611 779831 897206 851702 979615
14723 979615 450750 803512 802876 751154 1043781 929487 1063968 1106356 871414 1153064
14713 1153064 930486 741145 1127102 1682707 1639416 1565344 1409983 1671282 1589456 1233997
14703 1233997 1328973 1061158 1183538 1073838 650956 924670 972486 916573 941708 987798
14693 987798 1130272 689424 717730 1327503 1092796 1191135 1344377 1434777 1413247 1791114
14683 1791114 1492537 1721472 1915913 1572296 1573899 1390623 1033723 1132536 529146 1020681
14673 1020681 1331954 1222659 1038745 1029407 790249 828164 1193378 724298 803341 547174
14663 547174 977017 996124 903632 989597 897490 771680 884267 1003432 1290047 1035001
14653 1035001 1102578 1001169 1178720 1363815 987474 1092779 1115563 1007937 1196496 1417164
14643 1417164 1033304 962477 1120081 1319960 1090436 1226407 1063202 1328969 1380710 1410283
14633 1410283 1411718 1413083 1451441 1223455 1430349 1399849 1309938 947262 1164628 1636909 1420842
14622 1420842 1655566 1111163 1220259 1357776 1080784 1049532 1488072 1535802 1520070 1205759
14612 1205759 1568144 1355583 1491582 1270794 1372557 1429144 1470294 1289751 1614420 1719459
14602 1719459 1095323 1610169 1455906 1632127 1116428 1564859 1631079 1729976 1573613 1856948
14592 1856948 1630784 1741226 1596419 1450594 1815773 1716915 1786448 1817437 1869525 1668348
14582 1668348 1708989 1462635 1729951 1735091 1435389 2200926 1720349 1970554 1661651 2060602
14572 2060602 1732014 2031658 1768339 1798402 1821518 1959908 2121488 1706144 2037711 1944570
14562 1944570 2278131 2090841 1891642 2100042 2309411 2294875 2081764 2128723 2080955 2349230
14552 2349230 2620597 2220767 2405276 2369670 2410804 2938193 2748708 2784454 2999712 3537379
14542 3537379 3518098 3573723 4189346 4229690 4660413 5793073 5866319 7431998 9886081 13420503
14532 13420503 19459982 28931751 32966555 20163179 12653898 8060992 6017855 6330139
14524 6330139 4426980 3490230 3338981 2932100 2853959 2515185 2586807 2485753 2397531 2122938
14514 2122938 2366967 2533418 2670821 2481184 2499037 2610691 2454353 2437932 2482540 2514395
14504 2514395 2580360 2529105 2913445 2499873 2861932 2588134 2783052 2717817 3068189 2706672
14494 2706672 2637163 2922688 3181147 2885929 3273987 3199367 3408452 2972585 3380997 3142791
14484 3142791 3469852 3310412 3383683 3442962 3639466 3450746 3445069 3360746 3497436 3785552
14474 3785552 3599900 3725827 3788219 3628287 3830261 3661387 3717068 3946886 3942314 3611365
14464 3611365 4093016 3876545 4401758 4325674 4212228 4658060 4174749 4257021 4222996 4460348
14454 4460348 4571294 4546908 4797386 4380256 4845003 4620027 4858964 5168895 4829877 4615231
14444 4615231 4983511 5041832 5154263 5323653 5106150 5371371 5264893 5389171 5749583 5323265
14434 5323265 5634099 5645985 5792720 5636904 5958554 6185600 6270244 6230784 6153249 6624717
14424 6624717 6408657 6499407 6526012 6671706 6687508 6783684 6803911 7141112 6959207 7343635
14414 7343635 7344095 7606807 7520442 7638929 7580193 7797259 7974812 8151059 8270477 8302237
14404 8302237 8531890 8590101 8732765 8831985 9239188 9258314 9274765 9654224 9279718 9753213
14394 9753213 9676646 9721430 10354349 10030691 10502644 10215698 10691734 11020067 10976253 11675443
14384 11675443 11431905 11479479 11617412 11811542 12060055 12001646 12411539 12480560 12928871 12756206
14374 12756206 13274562 13330117 13580714 14071418 13984100 14329921 14438649 14854616 15316175 15517192
14364 15517192 15916067 16354692 16690263 17007041 17081784 17270530 17528192 18176909 18165090 18747513
14354 18747513 19213574 19451943 19827151 20022689 21008129 21156207 22150985 22255489 22694614
14345 22694614 23254586 23545005 24149255 24641281 25079605 25733567 26409238 26968589 27710578
14336 27710578 28478068 29057677 29700025 30834362 31593624 32051876 32861664 33832474 34752588
14327 34752588 35701536 36588050 37395437 38831825 39643003 40935849 41913257 43128909 44469510
14318 44469510 45883531 47583736 49063552 50585676 52075538 53721318 55377935 57548580
14310 57548580 59476734 61373304 63421602 65851224 68205655 71029249 73352268 76089029
14302 76089029 79210598 82072351 85013461 88225007 91350169 95091080 99124631 103486213
14294 103486213 108090207 112579117 117526331 122912535 128328079 134439258 140432118 146852307
14286 146852307 154156450 161893005 169454553 177341141 186210009 195392547 205308765 215654039
14278 215654039 226362243 237892408 249899028 262644616 275840577 289354928 303218103
14271 303218103 317583218 332302461 346513727 360703140 374742043 388229032 400614914
14264 400614914 412128423 422682174 432577065 441016984 448275942 454860960 459945443 461829690
14256 461829690 463310289 464735832 463658606 456690484 450426736 444115185 433798270 422428523
14248 422428523 410060074 397667066 384781745 371745087 358451113 344143379 330371772
14241 330371772 316119412 303003270 289926164 276954302 264610153 253684720 242419210
14234 242419210 231365110 219815335 208472543 197860653 187872125 178886206 170276367
14227 170276367 162108154 154090074 146852883 140390516 134160960 128632323 122674623 117619487
14219 117619487 112249533 107358825 103458648 99335567 95545929 91532998 88299564 84467228
14211 84467228 81443981 78493580 75595834 72907462 70427503 67634198 65596548 63326590
14203 63326590 61044260 59075270 57104947 55569982 54125440 52392868 50711591 48986651
14195 48986651 47714206 46110890 45255951 43996565 42889414 41711793 40545136 39564502
14187 39564502 38360197 37319756 36488734 35344256 34498991 33786481 32735897 31887085 30994282
14178 30994282 30463652 29753934 28802417 28170689 27775913 27083262 26262446 26010220 25187180
14169 25187180 24459973 23818012 23529883 22819122 22099556 21877601 21566517 21095389 20603044
14160 20603044 20087947 19689796 19524254 19045828 18940296 18206300 18290266 17532344 17514799 16880300
14150 16880300 16841618 16256681 16165492 15586519 15174074 15196804 14930275 14838756 14443022 14339282
14140 14339282 14275056 13848367 13778205 13195132 13093359 12920663 12370605 12764772 12314548 11677422
14130 11677422 11681997 11820509 11497577 11360513 11434183 10977372 10860855 10921538 10360446 10489486
14120 10489486 9943152 10111825 9801492 9734904 9386651 9390209 9452022 9110133 9032761 9024271
14110 9024271 9205489 8407857 8827794 8764996 8730217 8283576 8061810 8277151 7837040 7784008
14100 7784008 8035102 7564166 7864645 7617071 7180525 7213555 6961896 7071436 6955633 6924262
14090 6924262 7135708 6763729 6451521 6919368 6559964 6679448 5999418 6561522 6035680
14081 6035680 6026312 6046320 6281187 6068486 5885428 5705241 5735984 5834300 5497169 5563871
14071 5563871 5634097 5643769 5771916 5405271 5103377 4925854 5105471 5407998 5025321 4565425
14061 4565425 4893210 5028685 4829574 4993215 4559972 4722899 4807776 4746600 4460879 4207985
14051 4207985 4505092 4277309 4384662 4357958 4246248 4381013 4594814 4432653 4233846 4463506
14041 4463506 3990176 4490248 4029284 4092749 4043552 3972666 3872770 3991695 3934346 3477260
14031 3477260 3603850 3530923 3635034 3630845 3549464 3674534 3220760 3467045 3608957 3272113
14021 3272113 3669508 3174583 3263603 3469272 3502475 3464889 3355943 3185010 3132794 2859806
14011 2859806 3068477 3253809 3449337 3149747 3063408 2727195 2879065 2801164 3035774 2576800
14001 2576800 2788031 2790729 2467392 2754824 2834211 2887613 2628143 2697926 2638349 2499504
13991 2499504 2678071 2391400 2592026 2862791 2321568 2562918 2542635 2763366 2484152 2618576
13981 2618576 2622468 2705438 2669777 3306518 3206301 3764548 4524440 6346061 9439794 14214610
13971 14214610 24214099 33696830 23923384 16031833 10861250 7892409 6453597 5504771
13963 5504771 4714864 4157087 3869391 3758856 3408781 3246505 3376848 2666309 3057647
13954 3057647 2768949 2385298 2781815 2736610 2527571 2281925 2257119 2018678 2494502 2155679
13944 2155679 2082206 2392922 2360415 2242547 2086583 2100098 2075839 2206263 2355704 2043806
13934 2043806 2247030 1869537 2108182 1768394 2222535 2001690 1787710 2272495 2122088
13925 2122088 1999131 1869864 1993989 1958276 1855941 1877554 1922479 1653743 1963556 1875758
13915 1875758 2007921 1656711 1721374 1483313 1660725 1680796 1739395 1507730 2010733 1738262
13905 1738262 1658049 1736910 1828854 1815994 1367488 1556619 1870424 1599756 1691318 1850850
13895 1850850 1510166 1501413 1558717 1664385 1783133 1538163 1559475 1400922 1740790 1667461
13885 1667461 1599070 1366389 1418027 1433641 1487968 1450985 1209860 1428635 1359616 1467036
13875 1467036 1307218 1207287 1589678 1344574 1266523 1058687 1256075 1053937 1249721 1375347
13865 1375347 1214633 1403699 1415290 1379048 1446275 1154235 1509026 1159317 1148811 1248035
13855 1248035 1095280 1377331 1053001 1352040 1303695 1255439 1277265 1096022 1512881 1140821
13845 1140821 1129848 984329 1130950 1499907 1135281 1102805 986672 1138802 1150763 854003
13835 854003 1250977 941423 927299 868616 1043558 1096293 1041924 1130686 1289100 1018499
13825 1018499 991623 1100827 1072601 1494908 1141802 1036706 1036022 838442 761506 941313
13815 941313 1297534 1271279 700269 788317 1250872 1107525 806694 851602 950341 950199 870466
13804 870466 907386 627726 806480 1070067 914878 969284 866226 1001109 543256 962616
13794 962616 707787 881714 928898 581563 885757 1025177 947676 1093333 936732 831525
13784 831525 478112 758511 851694 732238 692003 789882 665468 1006906 1161267 756085
13774 756085 806266 762426 901422 777391 604165 749857 899796 664714 979650 855798
13764 855798 908086 892254 731868 1050427 831246 830600 544279 754321 822916 657255 821222
13753 821222 957446 1104725 706006 614949 641177 916208 573924 355011 931090 625416
13743 625416 933448 568305 647836 504010 865001 896176 742585 970178 582733 644477
13733 644477 1002220 813900 552067 802120 758385 708165 645418 463144 434154 661705
13723 661705 611312 266432 696349 843927 598992 729042 490770 613447 572389 709495
13713 709495 598085 644748 613298 850552 645812 524860 859773 680670 634773 551091
13703 551091 331401 451238 484105 788938 740291 324796 680843 828015 449266 601014
13693 601014 522941 334378 500786 600984 639857 426226 449193 674870 461757 704839
13683 704839 528587 624614 595720 359907 363663 683260 600834 655178 798518 536869 557836
13672 557836 525627 432863 448408 327113 737490 417375 432924 591425 674390 637018 534053
13661 534053 421961 680811 548697 598886 411897 174831 566306 465236 451013 618253
13651 618253 354668 247214 491293 637953 329468 557550 518699 248040 279095 127526
13640 418280 393215 963584 531221 201965 652691 353634 645643 440439 408824 387846
13630 387846 751887 567999 158563 577295 125956 423285 445772 479815 494196 171932
13619 532023 564790 452769 331389 584002 555361 489890 347604 321475 452944 259798
13609 259798 547472 366540 341838 501287 619011 353632 387517 163230 629635 230770
13598 325381 101934 597405 654064 358880 894561 242311 170237 388007 363541 391710
13588 391710 397964 290989 528354 173917 416163 715948 427605 319180 231325 476355
13578 476355 515738 428229 468157 431622 385050 248030 461352 378064 386457 264428 614842
13567 614842 390937 491784 527641 319979 252431 227006 -20212 577077 535300 302213
13557 302213 545678 510280 735833 271741 667483 692739 402998 649304 600948 507269
13547 507269 544886 47709 484749 364323 284793 523233 158745 283762 -9558 269073
13536 210415 480806 7243 557200 435606 399357 445921 599533 277167 334928 502726
13526 502726 397381 614728 380534 266094 243482 110868 234768 309430 484672 656243
13516 656243 406321 20335 280191 205238 98539 454635 350646 142544 639233 506847
13506 506847 162075 175319 170793 564684 432245 526518 219731 476056 380713 636069
13496 636069 296922 355626 488700 862055 -132764 200658 302689 554788 69415 52390
13486 52390 759977 327086 288559 285206 -56017 511759 306622 367284 323162 185881 189868
13475 189868 322579 -277574 421663 104457 -207949 122108 324174 252353 263152 313476
13465 313476 28688 336968 -78066 373781 118879 351687 148616 255508 307729 372877
13455 372877 5978 361350 56111 600984 500782 322861 323750 270472 335094 393749 180721
13443 237108 138286 231236 155089 300794 252037 87635 221415 176407 23174 611569 114539
13431 486003 431228 373516 45527 499528 364326 526067 392624 297938 159850 436136
13421 436136 24807 -63864 209683 236992 386185 124690 384468 70668 358487 142173
13410 293362 87057 431712 101246 170110 119957 268706 273375 339208 382424 265817 378815
13399 378815 190178 -169541 351350 148413 257593 425549 370340 291486 -28935 -185440
13389 -185440 69013 298888 116222 151844 -51984 89772 568451 -155367 636453 -24312
13378 317858 -75736 400681 101097 54596 -41197 515040 147211 298882 108598 79672
13368 79672 164389 121550 11297 215023 201986 168250 157961 -65793 134815 201288 373151
13357 373151 227277 125063 424781 -174861 198238 228541 477543 339532 97945 106813
13347 106813 482107 175999 589765 150899 326399 333163 248491 302826 414696 103179
13336 128824 508314 134533 267781 225720 535747 300990 249079 429299 92578 520834
13326 520834 217780 144135 441195 206452 348038 161704 420287 326293 26075 -61788
13315 74038 -34307 59598 255479 -164070 -160168 207837 146091 184599 184308 -22907 329225
13303 164826 149831 377838 61000 359294 143881 -111425 59164 581286 196928 424293
13293 424293 8294 150995 347635 279293 119286 96227 184335 -1887 268502 -3988 400279
13281 144157 423818 51330 179833 133619 -169315 472862 -171184 -152398 -17965 -18646 173117
13269 369248 390298 163309 99389 -227419 115262 -75694 342201 364028 555258 -69445
13258 -12334 94435 321959 199482 201516 386448 242334 101783 55609 419680 -29921 -14144
13246 76019 163680 -46834 397263 626015 420754 587657 118447 -30816 -46369 2966 -33926
13234 -68419 474834 90474 190587 470208 112993 526756 107302 232612 318373 93402
13223 188263 92345 1411 135950 55071 -91246 45065 25182 350967 136293 280448 4425
13211 228395 255368 313165 401165 -9804 246559 44119 227738 17974 -53885 2446 -109254
13199 273527 254922 134552 -172563 -2740 158828 108706 96869 336263 389307 579279 345190
13188 345190 80687 195899 54179 -189549 57058 -154209 97156 190249 236514 21604 -177676
13176 16181 204053 588452 26745 169104 126319 204522 190107 189499 464721 235978 229626
13165 229626 87328 190513 262146 233506 424427 -173778 -105468 111526 12859 -24055 486055
13153 -232444 74462 11927 549671 139186 216913 -60898 -178428 118774 36989 79089 25596
13141 -2105 97626 86357 64537 -305910 -214391 220706 326115 8030 -33567 -137815 99071
13129 248319 387831 162694 61426 199419 227 369444 -53546 -82050 204717 -337277 -79651
13117 -101628 114123 66178 30726 -121196 148107 46664 163789 344359 196053 209516
13107 209516 -275926 213746 -4480 120101 -6024 -53613 26597 250 -50187 111375 135776
13096 135776 -132523 -85577 105571 179504 -50493 -78078 308131 -107961 -14982 39943 28544
13085 28544 -98442 148843 -51893 152856 117027 349564 211631 265996 34390 431962 33912
13073 160141 349558 -172936 -79235 370825 143185 168125 215722 -86992 151434 294678
13063 294678 204625 24519 139969 195055 38897 -232100 -127362 230440 109271 -35596
13052 391507 -77539 281831 146102 -185283 189877 530723 -9194 -59617 -230754 -48556
13041 274907 171959 1855 -59595 142240 127171 190036 193913 168243 28278 -155202 97747
13029 -314081 19483 317489 71897 -28901 -25092 180648 10627 293662 -523931 157767 -52064
13017 11472 -201982 47172 -198174 133427 120804 184434 236956 154396 148479 195034 106566
13006 106566 120872 -330570 86688 95197 319909 -12296 37222 288263 280135 41365 429613
12995 429613 -54564 163634 203191 228691 -152860 82606 277212 4042 52222 455594 -3308
12983 297140 89466 162135 220565 57681 249920 -392724 162416 188024 125094 180146 112669
12972 112669 346154 454821 -65734 279727 -105139 191383 114366 232526 92183 143592
12962 143592 -131497 58955 -77796 145558 181577 2598 59080 251775 107650 278724 -72266
12950 -88251 -249682 -253974 199385 143800 -64185 -148751 -84528 71230 -116528 100865 92427
12939 92427 43799 -239100 256341 14516 160981 172457 47499 -5841 92583 -50450 43189
12927 113081 281544 -57396 -26772 43080 116427 -290026 228869 283045 74640 66933 17409
12915 221359 -188285 -199653 162168 -377227 -48650 278577 -79523 10123 -111469 -192573
12905 -192573 86576 455062 -130902 146765 -136252 295310 -61603 269841 313768 -247143
12894 -114961 20268 428397 -100678 -30439 -95133 -147988 215932 330137 -20800 345735
12883 116172 285528 183698 4799 -265797 208955 141460 -388974 41117 19151 -10017 -86114
12872 -86114 72557 30947 306702 48959 -157831 878 365929 72813 121496 239834 -346145
12860 -165841 76051 -261115 -134843 -130926 -128530 -267455 196303 -33342 -326537 -1387 622709
12848 9701 -157243 -11447 7354 -6686 282986 -193097 -39586 -33317 -89366 50691 -86736 -60761
12836 -60761 -159979 -80632 -136026 28871 -52213 63095 40717 -61113 -76632 -106930 -147620 37273
12823 410303 40422 144462 125622 -354134 -128995 311785 -81098 96736 73869 -189252
12812 -106426 140971 -168324 164118 -118322 9778 122104 32809 -54503 251404 165828
12802 165828 158972 313441 -48369 254553 365874 -24016 8171 -96561 198746 29644 133163
12791 133163 104974 -95210 102430 154357 310239 -75144 -223754 -153750 349143 -15456 -90295
12780 -90295 37730 27803 151927 148962 416580 -56608 92694 82569 315426 -313237 19758
12768 -348269 -162234 157028 -21471 92215 -49529 243293 -361936 -6833 -214945 -124324 -275006
12757 -275006 141080 125950 201994 -204111 127703 182436 40521 -91439 -169095 235386 -195945
12745 272948 82418 184693 -80353 -94991 97269 -98175 -226137 168814 25540 357283 -328912
12733 -77500 131780 184168 -89798 60150 -51465 376055 458817 -9010 394674 198739 -99905
12721 284780 49389 95376 80523 -19852 148934 107370 371747 181095 5432 -50691 -98558
12710 -98558 55249 -177093 163965 322992 444947 -192411 62266 -4101 269548 -58913 45827
12698 -285951 79456 -25529 264997 102725 273347 103463 -87585 15849 92497 337946
12688 337946 -60049 398667 51690 108897 236001 -10155 55436 62056 -728 105005 -77195
12676 247110 64282 -96787 53479 -64246 -231536 -264164 12290 -36733 252336 80535 348775
12665 348775 10251 166972 225030 153538 -1284 305476 338429 42846 98177 -37937 21300
12653 -153973 192227 -51093 -182057 147932 67199 143272 -217501 25240 81011 12031 97399
12642 97399 -13307 276320 96057 45187 37216 45161 -301772 152819 -95572 316779 202433
12631 202433 62383 5637 -205808 3861 -91178 -103130 -323216 53590 -45396 606321 204283
12619 262381 286812 162328 -100786 162350 -3413 281874 64726 150440 5614 372554 -126725
12607 126966 -16576 74416 231397 214614 -345 151841 -196002 -330298 131274 -6733 112822
12595 -34047 65500 -68285 252898 51346 149621 -122080 200712 -79945 125128 -51172 280025
12583 48648 219893 234667 -237128 131974 -6405 266507 35887 -43127 -187561 -227508 74680
12571 8810 53730 34087 7399 -7792 76795 49291 -36819 -224826 -89714 -24691 328251 120362
12558 10536 28952 240306 -221438 461221 -244484 13900 49431 -31688 32159 -290379 -141057
12546 106529 111701 -5682 -192248 159259 -71126 40471 -39312 89964 -3889 65011 117408 48872
12533 152318 136853 219413 -116470 129071 -183726 -74579 -87705 -237125 -45258 -277272
12523 -277272 4377 -186653 144686 17918 147632 -85878 368648 -193970 230241 108654
12512 -199391 28097 83506 49816 151659 -202263 -39340 -116637 -206546 -162245 -151766 -65979
12500 -163333 301460 -122847 14084 350653 -138294 103965 20666 -68824 62047 -99133
12489 -79104 22215 -161760 -189508 18611 -81292 60385 66287 31235 -172021 58654 66273 257453
12477 257453 -129457 188853 -44398 -122504 -87811 54524 246780 -192333 -143389 -86267 115707
12465 109391 70198 -158650 274389 196204 -196678 47888 191115 143733 -75080 -41126 -16277
12453 148712 -8658 11973 -191270 -103115 174041 -164579 -164212 -42063 68211 58567 280654
12442 280654 94944 -96633 127642 -295648 -418394 -153234 8387 4207 88695 374829 26420
12430 182645 -230232 271203 -169294 173800 -8822 -70754 -199621 -95131 228819 -4454 -50278
12419 -50278 -58964 302103 281369 261212 229601 42760 15333 166871 157736 96834 436651
12408 436651 -181591 -119979 244738 -345075 -289003 -311304 -52902 33453 -17825 54778 -252208
12396 -368695 -326779 -58997 -297647 -69276 81403 230840 -33356 147606 -4920 191824 -207267
12384 -97781 -14445 72718 152767 310350 296903 120989 -95848 34039 30841 -58261 198772
12372 183248 193772 73028 -106689 74178 -97228 13749 -54377 8535 -201451 113588 13745
12360 -48960 277851 322171 37122 228403 136918 -141007 197626 -307794 254941 -252693
12349 111131 -111235 -211260 84306 -232781 -97488 214901 -275509 260311 -120948 195999
12338 139945 90695 -100208 114205 -146704 -91124 224431 -1886 99728 5983 157654 5990
12326 -127634 225390 8078 -153544 -87322 171865 160139 21299 -35735 124167 -129045 420489
12314 -140466 51598 28366 340011 28587 106160 178264 290750 354173 -127670 72462 -251027
12302 5438 -217729 89307 -215186 374579 362232 -62392 178110 -273205 -64203 -38849 60719
12290 450650 -164333 103964 78357 168623 -17995 67836 356242 307696 -35228 93067 -183605
12278 -145965 209544 -396658 -16885 138735 -111528 -58850 -6063 195935 428158 201045
12267 395049 -9911 8177 461054 378737 285997 210809 -37507 -54449 316699 382830 -72340
12255 12458 89128 47661 -58243 211997 98149 468532 56854 306149 43855 26259 142716
12244 142716 -32448 27716 162994 -67532 -2348 14367 240807 -221661 98878 233992 -44752
12232 52190 23530 39308 117310 -147062 37724 143899 48287 -200202 284586 21640 146649
12221 146649 -207713 114428 144481 42824 99143 -87329 -426966 353382 33745 177697
12211 177697 -25446 175971 -258808 154312 89874 118165 120515 61679 54775 240113 303102
12200 303102 -97950 25315 248528 53358 404451 130894 107837 31714 -40442 -102764 43050
12188 84366 722830 186606 215917 107210 431250 32540 -60686 293968 -191164 -201705
12178 -201705 87172 -4737 200551 -58403 63125 146345 378224 188693 288146 -176104 -282619
12167 -282619 145304 181426 206697 -90806 117001 -149328 173924 -210966 151338 -52994
12156 108890 427451 86967 315559 47940 520039 424900 24995 320242 262803 141395
12146 141395 434852 -103907 82093 242490 176450 -7591 100671 291988 -113910 273897
12135 -121890 73911 286897 -92325 -49306 285890 189380 -245139 -40828 113491 -93851 377577
12123 -227904 139571 -104759 213545 60863 131599 -45561 -45158 -46260 -134496 -67307 263208
12111 250511 151220 95379 15039 117347 -55784 64878 144020 146126 -92350 21637 13702 -276548
12098 173045 331900 -106995 -66692 142341 51064 162240 102968 -156126 -104313 -12966
12087 -164387 -126699 6313 123597 -181210 -205717 129109 201532 282366 -32051 -169212 -30454
12075 -9552 86971 66071 157403 52538 -69879 142332 64891 383099 -154561 -152268 32505
12063 11219 -37294 56649 11069 19456 -26929 237873 -265614 679706 28989 295817 -30594
12051 -95029 50104 -90171 177913 100449 111056 -266765 -9428 93997 -63600 108481 -151202
12039 106288 -61374 -61496 -271262 -32804 108236 248762 185594 127544 -136035 -213977 -96995
12027 -11277 178356 291495 -65985 -2100 -169264 86264 19718 315759 -36430 141685 -48236
12015 239151 98370 -7260 47427 47154 -15960 226149 -264415 229305 -48568 253823 -68716
12003 60775 327194 121660 -278993 19210 145555 240378 442224 119197 25885 19003 13358
11992 13358 24847 97851 -394645 -159054 -181086 -16088 255847 189309 -37444 -12005 207487
11980 -207418 16286 -106603 45017 116475 209148 -132549 88283 -112339 39719 -41371 186166
11968 -76479 12479 -128804 135698 417276 -231074 245742 209957 -111232 154657 13283
11957 -237934 140224 171782 -284841 -96878 -125319 272347 -194385 -215481 390391 34341
11946 -245441 149093 -110072 92664 172788 44484 -262992 -215128 49864 190790 -35279 -118381
11935 -118381 -24089 90375 -62738 57911 265243 -52342 -202241 90954 147943 -141021 92056
11923 -70254 30287 39941 101765 332207 -183393 13864 216614 -170802 -62020 -45041 80707
11911 118944 -20169 245291 184348 -160619 -24184 -61997 -173722 -91746 76486 -12792 -167909
11900 -167909 -184044 131699 61497 -3364 -39128 -203429 -57201 -144305 -65944 -118882 -62299
11889 -62299 -52278 -324262 -254039 139897 -179026 -141720 -314235 -114693 204380 -91384
11878 -170 -138890 -87357 188743 62749 9273 6597 88321 -132647 -36695 133912 183905 -64608
11865 75678 159998 -197623 38533 343143 -320077 -91734 203575 -236820 124632 239739
11855 239739 -45672 -77261 88711 -195379 6528 -200454 149393 88264 -173739 53703 -74642
11843 -177664 -34185 -10983 30186 -203178 -58590 -179230 62720 -93026 4168 -273862 161022
11831 -78360 -234379 -178970 195770 125716 -233562 -192834 -283996 -41403 -13917 -55429 -236627
11820 -236627 -299162 -112085 -83668 2312 42671 -360492 -362048 -44889 233176 181800 48758
11808 53151 116360 -85548 297441 -438240 -388362 -221237 -224184 -310522 -498410 226164 -6370
11796 -501917 -81173 46872 170270 51963 -173175 63354 -200517 -310278 -31031 -56730 472635
11784 -97427 -298340 111332 32377 -425854 -96545 103986 -51767 282213 18937 -62933 118911
11772 370932 16905 -21062 84045 -217759 -244485 -27293 209297 87023 -59752 47998 -107811
11760 -151057 -204582 76996 -94343 -136972 -204723 -251123 19501 14994 -146108 61928 224599
11749 224599 8312 215861 26004 -142876 -5134 95427 -352171 20774 -34057 -112416 58969
11737 14615 -257242 -159592 -48301 203074 -93003 72620 208224 -55823 -111881 -224374 57324
11725 56727 -116712 -92257 -174692 45261 -73145 67466 -28611 -179695 -325484 86227 -155943
11713 -32773 461 114083 122022 -170205 252979 197282 -164098 -44097 175105 -37348 70944
11701 -97129 -98929 298229 24637 -301043 -9542 -146686 -61528 -117906 20583 202990 59645
11689 -205728 209523 -345749 5037 -357186 192944 -398705 -55626 346424 99093 196824
11679 196824 16393 118556 229650 139158 -123235 -98883 278108 -129935 140259 117559
11669 117559 62320 53228 83260 73405 -304890 -184504 129589 -171295 259208 313034 -130585
11657 -80586 126003 114903 -12447 -56493 37476 478599 -134173 228728 91695 110277 228976
11646 228976 207801 -77957 -92893 138877 204560 162150 99406 80530 3328 35256 99304
11635 99304 180449 -58349 83434 229557 46907 88337 -4252 -30520 246583 -11725 25690
11623 -215674 -213886 29982 -206934 -5481 4311 -101601 208964 -210648 153149 -63 164691
11611 -90425 -32296 -248957 -11079 303359 45260 -101172 -182124 224333 135954 189335 -127282
11599 237722 -75519 151529 136350 -47265 -422 -231802 76141 -83397 -276996 9575 73792
11588 73792 -489483 54857 6406 17068 307223 265049 267414 18590 21921 -185278 -198715 -105607
11576 -105607 228286 137474 301388 -12109 -110454 -84959 244365 333734 80294 -135658 231833
11564 307263 293033 420920 -75284 142764 2356 106724 144340 -389486 60592 109772 358620
11553 358620 -114303 168871 150229 156810 54691 -89008 161046 47830 23201 100800 226327
11542 226327 -215580 -3667 30380 230813 241395 24209 -306330 -55479 1104 133879 20749
11530 40845 121941 -290068 9485 -232781 346122 -4191 -305762 101885 -42836 -152465 -57577
11518 360176 -13517 149291 29362 -112972 -84930 -235983 230795 161607 -26594 -76699 59096
11506 8954 183469 -70088 168172 246148 -69691 -110986 234703 52796 210908 135005 123736
11495 123736 281042 -166279 200287 300013 496301 83070 85504 118859 263810 -76953 113824
11483 211592 235779 -101837 4943 52338 145157 59139 52409 81739 -140089 200109 2809
11471 -120280 24788 29149 568644 -47448 11081 30786 200243 370891 335060 -200534 138090
11459 -39424 180087 -82785 40009 141510 418354 47376 283541 351609 16636 -132930 85851
11447 22135 94811 291671 -41768 184199 35523 -151336 -86829 -198174 -35810 143522 -61777
11435 -213210 211641 91305 -56632 -45363 -64721 274833 16774 148887 1475 234147 -7530
11423 -98471 -294922 260651 187091 -320765 209867 -46541 82684 -14558 17078 -16135 -167837
11412 -167837 271487 -4411 -68508 -65429 265153 116957 -197315 -202509 163783 -84765 -153630
11401 -153630 116303 -291426 66019 -183821 -175440 48598 66242 142340 145558 90229 -158339
11389 361287 -28735 54953 93819 69614 -129372 240940 -76612 -20477 -221686 -265827 286793
11377 297977 -32666 98829 -325424 86382 -142049 17741 -148255 31374 -133095 -188330 -122784
11366 -122784 -224185 3530 -132748 430527 17062 85856 -34247 90704 27024 82788 80135
11355 80135 -138114 46542 -57332 6504 -74636 209229 -333120 -199366 186269 -46653 -20047
11343 -229659 282826 -141865 84485 -193940 396797 112289 -63494 -293596 -173363 342853
11332 -232078 54071 -66794 99007 53348 -334488 -148979 -133641 -331351 86116 53653 -163763
11320 115444 -20923 -103293 -107278 -161673 -19321 142263 -125795 -36314 173055 203204 312149
11309 312149 77681 -148473 -430940 -191284 -92133 26039 -119729 -18648 5653 -4285 -426079
11298 -426079 -269865 -189461 -175906 -21901 122170 113929 85562 -18816 -241122 -26712 -157004
11287 -157004 157760 51566 67755 42293 -243010 -24288 172018 -360447 64614 12917 -392795
11275 -69679 -267941 216404 110232 156386 146833 -225567 117665 81787 234166 -127601
11264 -129210 -25304 -245710 206881 41258 -74277 94234 -196702 -15409 -179750 -90181 -230344
11253 -230344 -41664 -10623 -78488 9114 -34128 -214887 4788 -198982 -334826 -77278 101322
11241 -143846 -124507 -25717 -56544 60186 -248481 217453 241801 -248116 -13741 -243043 -224426
11230 -224426 115503 11675 -20295 -38814 -6180 353376 -7037 54897 158157 147364 114544
11219 114544 109266 -97537 -5251 -89032 175929 -116177 152921 -84599 -180264 -224680 -292817
11208 -292817 102961 -26751 -98111 155369 -117885 6862 -302550 150416 164872 -447816
11197 -163172 -57436 31507 31610 -67220 -783 95332 26843 -275186 -331246 84215 -69948 -191200
11185 -191200 -317550 -119542 105052 -104812 -346968 121686 39075 -560596 -143901 58217
11174 5991 -59898 -77054 -78194 3294 -65071 4272 169068 -104605 -98696 192001 -155755 206771
11161 -84469 -167311 -165531 -74895 -296007 -83724 -34371 -286653 -33580 145778 -5771 73444
11149 -119411 -33920 -70078 -260906 -2021 -36807 123844 -264764 264142 124006 -267916
11138 103860 -148608 -34924 127421 -15788 -71185 -213210 -73114 -8215 200939 174862 -122416
11126 32049 13592 214068 -235141 31854 -223895 -131887 -216390 9547 88646 76361 101823
11115 101823 58705 45413 -175632 -296282 -41857 110133 66742 179231 -151742 -3396 108318
11103 118441 353493 -119256 -112690 48982 -34449 33634 43451 138349 465 -4343 1924 315984
11091 315984 281076 407931 -34352 250409 25501 232789 117159 210231 114786 -93406 -86028
11080 -86028 178400 -170779 287349 78148 344675 -36370 -16479 -84804 221383 2303 108208
11069 108208 23124 251763 261099 313886 269456 140441 297323 317194 -81579 308631 225116
11058 225116 47010 356397 179523 141932 69970 221304 298135 507524 189777 415925
11048 415925 207217 132398 476026 491314 -17278 469217 576618 425695 453825 483879
11038 483879 380567 432522 518297 592564 448396 518538 132343 619804 202192 485959
11028 485959 761557 470955 541169 857908 368977 468275 176954 845978 564200 389879
11018 389879 686778 516282 363623 414471 461675 966849 269386 540005 595341 689027
11008 689027 365731 575096 631256 638967 428825 174470 457213 448082 84469 438510 413461
10997 413461 500566 373394 420565 601407 560340 372872 334726 609363 331347 636180
10987 636180 403845 184920 583184 723152 206152 112656 349715 673920 580251 592822
10977 592822 496582 449055 397709 670815 442744 199376 701197 747534 794971 497195
10967 497195 717221 683857 838093 760037 1023749 835768 1051782 1428647 1159594 1027207
10957 1027207 1655073 1555381 2036587 1851582 1916045 1810998 1817534 1603372 1684701 1501198
10947 1501198 1545979 1505500 1411391 1137602 1376691 837889 1320757 1366186 1278649 1045735
10937 1045735 875776 1466691 977606 1039221 1202308 1079116 570514 545942 374508 448366
10927 448366 33086 381349 410992 47247 -168169 273103 -17199 518443 18705 195219
10917 195219 200505 24102 365172 147828 -38468 -33637 11531 -30472 334953 45845 78826
10906 78826 77502 -63935 -208447 -238009 -56024 193418 150930 -12029 -225565 61573 -75149
10894 -116713 204252 -435500 60990 12961 -60543 -188367 -7007 -136716 -92607 369128 2777
10882 -82637 -168990 251169 289288 -16562 212767 213928 -299487 -109617 153950 -26034 168357
10870 47263 -2155 -229445 162470 -236047 -83301 202624 -124456 53093 -36276 74 -26292
10858 248449 -120546 -143283 24208 2837 -39656 35949 201294 309626 31460 -42645 370680
10846 -316871 -105575 7275 179701 18293 -106120 -282149 60568 -70273 387826 -286193
10835 -12010 31817 78762 -23156 -176062 -4579 -24998 -115 254114 -65991 24151 -9032 20590
10822 -249597 340815 12442 -83680 49703 -132034 -237561 185940 -68167 273962 -74792
10811 10963 -24303 -97601 -145716 63489 -12132 -268306 -323322 -150828 -314595 -267994 383341
10799 165073 139218 100125 -354529 40813 -111689 -89642 -224056 57589 -246649 122096
10788 -87892 -146241 -22175 19409 -287479 -117525 -104056 153398 -220424 -96274 -177243 -346935
10777 -346935 -180539 -148661 92880 -121804 -338924 -10589 -22311 145990 -127396 -210491
10767 -210491 -111262 -221306 374026 -178892 279646 31647 140589 -348188 54951 -43918
10756 171541 -231880 34581 -2708 112319 239598 -77557 326040 -113024 -183907 -58648 -147206
10745 -147206 -155464 46354 59297 115180 -14745 124344 -359398 -32638 -131160 91838 135195
10734 135195 -175017 -332839 -373582 152715 38082 -285121 354952 -148346 -132578 -98078
10724 -98078 71498 69492 -76428 -15973 89276 133483 -439285 -88338 -93874 -70499 -118818 93376
10711 23121 -148133 30965 226715 -212681 99975 106949 79906 -193397 201854 -125396 -115364
10700 -115364 37974 1768 -58152 -155489 -169104 -92732 -7182 -176533 -18032 28515 -151700
10688 -157616 -320293 -203687 -27627 51188 174585 -92619 302732 -28034 -52710 -243175
10678 -243175 145600 -62579 311682 122936 -126270 41325 128899 96039 103277 57385 357
10666 17531 40327 -71560 -233567 -435329 -85653 -113350 305819 -81572 100839 -439689 -245977
10655 -245977 192521 -195221 126915 25812 -116891 13316 117407 -16653 104820 -78403
10644 -405241 127448 -191468 -766571 -315315 -93281 -35214 -145938 -509802 130 -271730
10633 -126163 -109385 12392 152655 -69942 -50741 -228436 242092 -135964 68052 -23499 -14034
10622 -14034 50384 -350579 93014 -474130 -127300 82742 -246308 -175982 -247544 -197480 -49578
10610 -67726 -217211 -173143 288406 115211 138521 190453 114505 -74387 -90498 -45314 236522
10598 -206956 -211187 -155511 -239060 -292508 -136361 -126397 115869 -78552 -68335 91255 -207722
10586 25025 -263440 -324479 171271 -48155 -100439 101096 94551 -190418 218960 33494 -82871
10574 119686 -195835 221661 -173077 -232965 -6766 -140508 -112109 49408 4831 24611 -291495
10562 139009 -132040 57668 -56645 -34058 -95983 -242183 -324019 10338 -142549 159763 -301104
10550 -84675 -369890 -228606 5050 55787 184262 -44459 52009 50694 -189119 44276 96167
10539 96167 -1184 -90306 290335 -336836 -293045 -314404 -437303 3207 353227 189021 55894
10527 293360 31723 -85934 -28066 21578 104298 99374 41748 -398705 109542 -207361 -54214
10515 -3065 -98321 127729 -42700 -256587 111044 -67559 -128970 -148678 -235421 -174056 174554
10503 -257165 -109632 11604 20535 -94196 108801 337886 -6303 -191753 -79216 -15772 -89023
10492 -89023 -5711 -186496 38378 -77236 -46575 -23074 69050 33705 -51275 -80993 124035
10480 -164543 -18662 -83740 638 24630 3964 -229597 -341873 52347 67359 -216739 -352268
10469 -352268 137031 89185 153867 213956 381516 293512 470104 287892 384499 212689
10459 212689 381329 508779 172388 354251 -149632 212987 283310 69544 -1660 199173
10448 84130 -146820 94967 -92018 -237513 -262446 58103 -83482 37943 145572 -140604 103034
10436 400320 62607 -332636 -221493 -352607 142125 -4512 125666 -197840 16548 122 -8786
10424 32883 247938 -142810 -102138 152832 180109 236303 -9295 234858 -249131 -126805 -354618
10413 -354618 -210102 -106549 215309 -16010 35315 -274318 37008 38370 224114 -2202 12560
10401 -341827 -305468 112906 181520 -108900 -32697 -160965 -34954 2234 -171547 43726 -308612
10389 202387 -399242 -52634 -102219 134919 -81297 -44380 57532 -72420 -116651 316881 44029
10377 -121087 -24889 -75133 -82164 124969 189959 -1522 106354 220182 -207448 377239 251370
10366 251370 -119343 140278 134186 -163919 368672 44876 145544 187898 -22585 63701 179114
10355 179114 286801 235489 194139 438066 -26751 543911 108301 -34652 457064 102589
10344 -19232 282359 82239 219987 337997 404265 91122 160634 86386 254525 262496 328508
10333 328508 312332 274699 245135 100645 261141 476620 209545 438116 348248 572718
10323 572718 257348 170557 300655 342914 -6211 26614 24104 16619 -82785 -114843 -22795 91607
10310 290179 -145766 -169667 155722 223924 -163890 -67487 2307 81154 -128743 199527 139680
10299 139680 357193 114212 212089 96133 83644 -262842 297850 174831 -75709 -249060
10289 -249060 -42940 9596 -69548 -143409 -46749 -129668 -143673 -258318 101875 3941 224820
10278 224820 -495897 -100481 -182843 -158656 -145378 -149539 -55207 28006 -610785 -77249 -239949
10267 -239949 -277951 218259 121803 15570 -307332 288832 136273 4172 91424 -8030 31798
10255 -67411 3893 -26751 24650 -43513 -303018 266257 -29625 -26409 -12697 226258 -132938
10243 -127542 -84818 -438549 195197 287403 263203 -182443 400998 207739 77238 -241236
10232 -14419 -92225 94581 -12818 -84701 -95411 -368374 -120791 -3162 85446 -19156 93042
10220 -21817 15367 -328068 38267 104291 -205940 58794 51962 -216067 -49830 57600 -142918
10208 -173370 179931 -153118 -350057 -247283 -214179 -118159 -350929 78528 80417 -117954
10197 20725 189704 -85485 -56281 183029 41502 -120586 -13635 -98887 -42382 116257 154198
10186 154198 5765 -509899 -90007 186158 -95588 26077 -261068 -102461 -238031 -177445 123319
10174 -208390 -135059 105979 -253328 69410 -110564 -166450 62448 -141972 -406078 165475
10163 -302973 -23773 51111 120453 152570 -74013 57061 -147610 -10958 386927 -15217 -203236
10152 -203236 -159068 177481 48532 24264 -85977 -115984 -240845 125607 -104006 399178
10141 -269752 -279648 -181769 -275077 -178312 122986 189759 -214559 -30898 47716 -286481 -23871
10129 -82463 135585 10383 3884 117788 -86077 -38895 -9792 -146502 35472 226651 -256026
10117 203239 270528 -160407 -54283 76676 32585 54169 -254096 -413707 -213192 99029 -36041
10105 173050 -295948 -59496 109383 -101057 -26832 295545 -7441 -172957 105101 69015
10095 69015 57654 123902 -221413 79736 -66557 -453151 -192862 18803 14305 -223074 214119
10083 -229413 201513 -19529 -236142 -142849 81970 -220432 26194 -21693 108371 -176774
10072 -420887 -110092 29358 -102125 721 179572 -147750 -126661 -196071 -356870 -187112 33341
10060 91902 200122 65534 160543 289529 -73951 -69424 -28221 -150691 36692 -168502 -81734
10048 -82050 105764 -185438 -220935 102886 156486 -315681 -73584 -18175 -199491 -110968 34978
10036 -14471 -262948 137437 -44027 -64387 64861 -52985 -187358 177095 -308822 201318
10025 -95200 -165146 131131 -382432 -120834 -6006 -3615 -125645 365490 198472 -73110 -39822
10014 -39822 10182 -405330 -156717 -240196 -152722 6190 200734 106069 -226365 300431 -108905
10002 -427392 -250381 -189822 -1992 -44402 148271 -370823 -39368 -369647 118638 -215590
9991 79036 -6916 -350869 -270402 -215394 111837 -25197 20968 25530 -108011 -532785 -267703
9980 -267703 -149222 -84945 193072 301254 -294082 -23743 232579 -27645 36973 72561 59393
9969 59393 -431475 -20796 209928 165782 -176702 23854 -85493 11848 -22902 -120384 136244
9957 -105463 -170522 26637 -177888 -110465 -375453 7561 169236 -143592 19425 -114497 27931
9945 -40736 4737 42249 11340 -45850 140624 250047 -151031 254790 181454 58672 145851
9934 145851 29597 -146537 -120093 -43687 100285 -63876 -25437 -35174 23896 98369 -189284
9922 -112598 -110175 -108258 3073 -99371 36517 -122166 19796 -212122 -299516 130358 292660
9911 292660 -313212 -280111 -261265 -322824 27164 88976 -113010 33353 158808 -85564 148553
9899 -217523 118140 -18478 66850 -421513 108209 -193228 -229786 -26872 -325167 -91210 -298353
9888 -298353 -355116 -23043 -202082 -2630 -174614 -182310 -314304 -226597 109609 -273826 -56047
9876 -112373 -218394 -142720 172945 -122592 142130 96657 -172300 125676 -176138 -449907
9866 -449907 241578 257323 140816 -281267 97231 73050 -379030 133892 282090 180654
9856 180654 -101884 13547 -74616 -163368 11985 194358 13799 -17464 -52379 -25894 28782
9844 4613 81737 74183 -10960 -107721 157268 -70034 93556 -64568 -70965 -98997 -118849 171951
9831 116146 -100204 -464046 -96504 -340649 105560 186 -201220 -425836 -141107 -186065 333937
9819 -238206 -4203 61811 15000 -156873 30821 10671 121570 -312167 -114937 -156649 -154973
9808 -154973 -132258 -221625 -155027 -20223 -165766 94255 415540 -56692 120308 161693 133219
9797 133219 -407939 -336156 -71369 -253612 302497 -77069 68513 -67413 -124198 226218 -131715
9785 65475 -43639 1305 -209743 -6737 -253375 -374648 -22152 -261662 -179632 47060 284069
9774 284069 -156710 15199 59600 -348649 56821 -2153 88044 51860 -89934 15313 -268404
9762 44537 -356266 325100 141924 237244 212767 284904 74326 -218582 39827 -95290 -212291
9751 -212291 187642 102891 -131601 -22371 -186240 -79697 73698 -16187 -265287 -65750 -19073
9739 -89906 137779 180826 -187247 -44168 -224748 129743 44890 -155568 -290582 -58904 -163737
9728 -163737 -166673 -85081 -292904 -171213 -16678 -61271 37799 -197476 -390764 4608 88470
9717 88470 116669 -16544 -175261 -250493 229609 -16275 -76512 -84466 -68495 17582 149366
9706 149366 -107833 -235187 195512 -38858 -317761 58438 -157439 110640 -230229 56804
9695 -52369 -52299 -236939 -203373 -88917 -178803 -234226 -105778 -128475 -143776 -115799 -5958 37648
9682 -407751 -138426 -8854 -169511 17153 -148449 10454 -183823 -164816 -34947 46597 107967
9671 107967 -141916 -194059 -220793 -357622 -103939 -231382 35464 -119715 -464906 202359
9660 -78869 144963 186228 22114 -110616 -991 -226294 -235918 66954 -26748 -297576 93731 116332
9648 116332 50722 288352 -364458 -257394 -195625 -132087 43009 -30680 1792 -75168 54428
9636 176111 -257969 -88542 145713 325351 -33926 -212254 178070 201124 -46380 213889
9625 -27419 -11045 45321 315033 -97211 12719 129828 -103210 256872 -19689 -57328 -286688
9614 -286688 -104227 -29727 15455 49370 -93882 33499 -127203 -44089 131421 -170602 -255298
9603 -255298 -280743 -151901 -47556 -24403 -56154 -85888 129126 -105827 94166 -685 -36421
9592 -36421 -171299 128968 -111323 -387302 -485757 -118973 26080 -55736 62513 -317656 10462
9580 -336282 89897 -363386 189342 20800 -50119 -7661 -44378 -23577 -232981 119202 114993
9569 114993 -216869 -104008 -141772 5678 138617 -54488 -140130 128691 236533 46690 -254845
9557 -99051 -26895 132913 159191 -144349 -16426 -447907 111987 75933 -121062 -174116 -218792
9546 -218792 8069 -23308 -321419 -291351 -111555 -148284 -193193 40304 90213 -74815 129712
9534 -19796 -186301 40271 224233 -38232 133115 -143219 223933 152570 14019 -159473 -135450
9523 -135450 -126483 -32410 174432 84619 -77116 6512 91404 378 -315431 -173295 82837 70824
9511 70824 -11436 -124071 77119 -324887 137167 94341 -52240 -168529 209368 -222308 -299218
9500 -299218 256824 -196102 -53970 -56105 38518 245856 -244612 -76789 35187 121411 49594
9488 441833 -300810 -33744 11943 301547 -362259 99932 -163256 -311569 -156447 -63686
9477 -58147 -336114 -194895 -139480 -116873 -275005 -135722 246722 -121799 -47466 180773
9466 -108142 157570 -123295 94693 -283178 362387 -67286 -20831 -360670 -315735 249759
9455 -148547 -442339 9667 -290126 -511641 69167 192160 126351 424156 118162 -339215
9444 -168051 -43743 -298436 -136540 -109709 51451 186823 -145522 -164083 -141335 -111952 -255594
9433 -255594 286276 -236355 23808 111642 -124413 -62958 -155720 -69975 -2328 53855 -324616
9421 -372702 -135230 -151899 -131444 -76987 -161879 -56138 2431 -23379 -198017 -460409 -99065
9409 -76580 136589 -78784 -246968 29598 -56917 -7392 -52056 -159633 -486251 -44959 -179843
9398 -179843 163301 -207253 11281 88738 -336076 -107227 -69118 -328712 -127617 -274968
9388 -274968 -53249 -47039 -194174 46243 162057 -285901 -356773 -3003 -115166 169257 -332531
9376 -203834 79991 150961 -17630 144294 8673 6693 -191421 -94946 -230830 -188860 267219
9364 -84597 -329806 -22280 -51471 -126684 54720 -148050 281181 15081 -244349 9601 274488
9353 274488 -294195 157912 -58743 193620 77057 -183645 183642 -454043 13012 -251563
9342 -11476 221122 -170784 56545 -186168 -150787 -105340 -49134 181980 -149922 122927 150688
9331 150688 -117160 -159243 227039 -111108 215958 265924 14793 161269 -223702 -225056 -142530
9320 -142530 69499 -31349 -215386 -333118 -154057 -192431 -66271 298154 -25 109686 112033
9309 112033 -202163 144925 -160135 335468 -489095 -155413 -15445 -39480 155726 -281902
9298 230989 -188915 -73142 -193401 -49591 -20163 110172 -216809 -131563 -182122 244776 -429784
9286 129521 53521 -94003 123426 158801 -64175 -63509 54650 -123832 73591 213829 -205804
9274 189262 61325 -201065 135313 -221570 79269 -269736 -14016 123068 -77706 -61053 -190910
9263 -190910 -333820 -173441 -28830 171340 -50273 -263492 -113307 -56676 114845 236256
9253 236256 -239533 -218664 -85999 81258 51045 112199 -11521 -106984 62879 -145668 -536733
9242 -536733 416808 -86715 -127349 -8207 -191304 -212511 41334 90717 -532849 -51781 -54362
9231 -54362 65008 -70366 -174884 83065 20350 -194913 -170046 -153366 181607 -89968 -174700
9220 -174700 -96592 -254118 -57431 237095 -80362 65502 -135633 -357927 -55717 -182744 -171314
9209 -171314 246799 -227333 43981 -453294 -65847 -127106 -74858 -199035 21883 -57660 157865
9197 54669 -210371 -209829 19567 19913 -81347 87610 -453 -122007 34916 -394162 16035 -174604
9184 225453 -68587 -75979 299426 -77065 -265172 -37031 275613 -77979 -62316 -212166 -111993
9173 -111993 -32937 -105873 -26865 412943 -239273 -67061 -90306 178029 -39545 31094 -53414
9161 94596 222332 35124 -18593 199656 -34982 -272845 -64499 30890 -16418 -143206 -343885
9150 -343885 64315 142207 -98196 -33172 -118870 -164821 293773 4170 -59481 89930 -40586 -19069
9137 303394 -166414 124656 -78048 -15130 -1176 -43622 -80289 -64516 -134460 329692 -111713
9125 -85625 63950 -76375 108005 -340698 -211220 120487 -60440 -73921 -196737 -43699 -195657
9114 -195657 -75827 -44815 89350 -520048 177599 -79142 -29474 267378 -125074 -160240 -173280
9103 -173280 53401 119525 -65613 -173358 -303696 169372 -27651 182051 7612 -44748 85113
9091 -34013 151866 -178051 122842 -195778 -91646 -144774 -279581 -3231 -84499 19672 -158085
9079 15200 -60469 63740 -166199 -242560 -126157 358163 -220426 143088 -274056 -245328 -115675
9067 -96149 -13140 -46295 233899 -46928 122157 -281523 174416 171066 -23581 43726 -124710
9055 -83715 -8563 106008 3503 -139936 -89825 -157883 -177584 102779 -39231 -119531 -102885 341589
9042 -323465 61819 -69114 104129 -160228 36465 121276 -40828 -166927 -68251 -39928 -233216
9031 -233216 -138744 236188 -406829 -340176 -71901 145677 -11568 -216728 -193674 77499 197139
9020 197139 -266291 -578544 98151 45637 -233659 -235246 -132848 -295975 -113788 270842
9009 -165519 -259884 -459215 -228260 27168 -83339 -86441 -140551 -307874 -242538 -407409 -198934
8997 -99177 -299406 -160936 161488 -223726 161097 -296784 155812 144518 -380244 100815
8986 -24986 219758 -230288 -66484 -165943 238118 -64598 -131393 -78430 -107648 323830 11136
8974 5234 -179950 6782 -25324 -240922 -41900 -73757 -4447 216962 100062 -188282 255758
8962 90717 -196517 -237653 -204186 245287 -20004 -143271 93233 16022 -96341 64491 -339209
8950 395246 153029 -127573 111213 -143162 -286013 -85983 171316 -120112 90640 39750
8939 4260 297391 138086 -115831 -18340 284153 -134649 -363320 181510 85219 -235733
8928 143159 -154498 -110023 1657 87354 -12491 -48259 354451 36075 201830 -135449 -126612
8917 -126612 -110750 -88662 235987 -25989 -85787 -51280 66974 -40156 576930 497594 683999
8906 683999 1341876 1929228 4410255 8360181 3343785 1755162 1096466 572924 471450
8897 471450 284689 130975 214289 123784 108084 73167 405927 143850 -12239 172558 -169147
8885 101948 -129778 -175627 -12045 -349791 308722 -220951 -205516 -73657 83185 97287 -95941
8873 -186408 4788 -64197 148895 -359270 -69515 211204 -178102 -552613 231155 -78601 -14698
8861 -315255 144802 -253880 -191860 -10780 -121017 237717 -283189 -281865 -145295 -366118
8851 -366118 -117524 -233857 -295196 -105211 8433 41536 273578 -97895 263787 -292659 -138904
8839 150352 -197771 75468 -10776 53372 -195056 -85411 350293 42156 -95187 83864 -217256
8827 -38471 -208227 -305909 -64686 -262259 -305495 -26516 194028 -114790 231021 35021 -316848
8815 -56809 -34292 -149838 -125689 -197638 -128561 112299 601 -201713 -91817 88244 -125755
8803 -91261 222844 -208903 -55213 -8547 -24733 -134930 297400 -17793 172791 119425 -91021
8791 113718 -75355 -29971 -104114 328452 -58043 202158 -289798 99720 -119147 -209954 -315477
8780 -315477 -146968 -126062 -49929 -89940 172158 120652 54000 -44680 29075 116366 -96157
8768 -109069 5924 122800 -234014 209571 21784 -179125 62889 -278234 -147667 -65303 -20225
8756 -216386 325522 -56853 -113230 -218441 -269974 13645 307107 81157 304544 67915 -388620
8744 160580 -118807 168715 -97131 -344567 213132 -144084 -152200 -65113 223856 110739
8733 68492 -118501 147049 -116228 -25373 -40482 28316 168763 -19940 -41330 35268 -333474
8721 131558 -12538 -97923 -70735 100689 34209 -31876 -129418 -2461 -434120 103603 -70442
8709 88353 -4316 -111915 -188641 19380 -227060 -256014 -46227 -144643 334008 -70102 267135
8697 -159758 134595 -414907 -62363 71607 206501 -42688 76693 -332312 182303 -69017 71730
8685 24668 -99583 -193168 65906 -204312 -214256 10287 95442 -126019 181577 -32794 -226239
8674 -226239 49130 -238893 187411 -56990 121104 -172016 78658 -50601 177773 4003 93366
8663 93366 215576 -161645 -140093 -66514 -349823 -68695 -80024 -403956 22569 -237394 -155756
8652 -155756 -108183 157975 -302353 -58133 -175593 -163262 -402071 314801 279206 -113676
8641 -254911 -93722 77025 -135439 67339 198 -86144 -91226 -9324 -70509 -253197 -169927 29815
8628 195387 28990 -65608 96001 -126638 242006 -133684 -93249 125810 91434 -120874 80520
8616 245370 185130 -63978 -48147 -212514 -66092 -483578 -163982 -274577 -43605 151144 -298026
8604 -119563 135336 185345 49281 173960 -203743 14890 -223832 -29901 -167659 162850
8593 -421561 82479 15091 -26338 -250066 -112666 -29625 29521 -182441 -70254 201040 -95229
8581 -17680 80906 240437 312615 -264443 -211652 -122220 -174382 -243957 -51910 -186842 -169941
8570 -169941 464682 -9260 51998 99886 -168023 62859 13295 -392075 -163698 46030 -183286
8558 -220029 67479 -139841 8681 207467 70235 90579 147164 -16577 79932 -472022 -2522
8546 14578 -19398 -172213 -97190 -159630 179623 13228 -29893 -469447 -237676 35176 -118779
8534 160689 -122920 -236713 226517 -4706 -167260 -119274 -103123 -264991 26489 28411 258248
8523 258248 -1008 -123874 -246824 94045 -153636 311585 -406167 -136585 126112 132402 -216237
8511 -90148 -108065 104952 84648 -396619 234993 40731 -132917 -468250 13674 -322604 -96408
8499 333873 -76804 -51364 -174333 206264 413220 -176461 160974 -114249 157928 -77764
8488 89242 69205 1147 -36850 57836 -83528 28290 50542 220168 112153 -2045 -176605 -203750
8476 -203750 -35755 -92984 -108322 -218229 198011 -76853 -231531 -9512 -82864 -362368 28752
8464 84231 -59676 115712 192725 36225 -83530 -141869 -72902 -186868 -218644 57652 2178 -46507
8451 -109863 -421129 -95011 -181139 283433 -231043 -272644 -77623 -128681 -175380 68380 -128572
8439 131061 -115629 -73915 93608 -83001 -39985 -77415 -16894 -376656 -85574 26720 -114978
8427 -240348 15942 89946 34950 -164227 77560 -53182 -204133 7345 17468 14771 -5548 -193740
8415 -193740 -141204 19293 -13564 10240 10032 -15567 -7934 -475114 -110234 -336325 -103762
8403 74696 -166805 -227402 -181636 -80153 -268380 152180 87849 -56405 -330824 220748 182827
8392 182827 -89813 -7041 -84789 -127154 -122903 -21098 -258124 37537 -221259 -151141 33119 -182388
8379 147000 -197031 -148274 44239 -113768 -307 -82589 -11825 -176011 -273257 -105746 149793
8367 -55047 216094 -81708 274112 108309 38267 123046 -1378 10612 -49382 159159 -37882
8355 -131110 -52388 -154613 -130013 -46325 181751 86738 -165335 97391 -190384 -38406 -8592
8343 25260 22452 -231466 -60250 -157816 -177819 -125227 -207183 -273382 41476 353073 68100 5074
8330 -122939 -283688 -183519 296229 74373 -212104 -55691 229383 -78714 -116360 -197812 -27029
8318 -83081 -134448 -78293 -14535 -266537 -4609 -217799 -125351 -5420 -45248 126376 112035 -490
8305 96085 -151318 -187624 -164305 -98779 61765 -45510 -125819 -210106 310523 -236601 -198725
8294 -198725 22828 -51573 -270702 115848 -60720 -42061 -151892 199541 3664 -404957 -230768
8283 -230768 364915 -160973 -103195 366125 -128995 -103448 -156887 155195 61242 -163522
8272 33452 195478 -56954 169571 -55255 205405 -549834 -289862 126542 -296995 -260355
8262 -260355 -212245 343272 -118126 -330942 -106875 68066 -135199 -84605 113531 -153180
8251 257352 -147465 -165542 394487 -7728 -150697 2846 207685 -85809 -83448 -55422 -46281 -217121
8239 -217121 -76850 9000 -308901 237344 116515 87953 -75672 -37655 -335602 -177266 -48720
8227 118914 -382909 186682 -10102 -56785 63755 76909 -185356 -26168 -38936 -354989 18694
8215 -106377 216592 210600 233348 -196675 -294278 -32161 -185265 -277681 -198645 166430 -47877
8203 55783 25683 35068 -338426 -166737 -96518 456841 34907 262966 -319329 -10557 -79562
8192 -79562 -72021 83586 82128 56567 -129810 -141122 191362 -317791 126569 -41257 6074 -70960
8179 -17103 -428453 47923 306401 -80007 108762 -237891 51708 244897 32829 -141142 100266
8167 125400 -333554 198944 -211508 163928 -71462 -129582 -207272 -38519 -85512 -136114 -56921
8155 -39200 -274486 -15085 -157483 117611 -210881 -219728 -42000 378239 154940 -103313 -14457
8143 501 -183347 -82445 29877 224154 -133540 -275362 -73085 -29844 67274 -143354 204082
8131 60920 -410846 148002 -2259 51524 -101586 -225685 38899 25966 -60287 18802 -45382
8119 -273447 -188976 -145549 38517 420041 -160437 218348 77551 107685 63577 137266 -9448
8107 190923 202965 -308240 -59934 -60530 -190984 -104956 -191880 -11033 113890 -167679 -477950
8096 -477950 -211546 -67478 -166260 -32106 185321 -37034 -208990 -213427 -152113 -55844 163135
8084 52931 -2627 -370376 124089 -82705 -310983 236879 -47415 -120984 -82702 215425 59460
8072 -261882 -239685 -143205 137032 -362403 -501468 26046 -135827 -13144 -60552 -178741 151102
8060 -72018 -71058 -289 -355035 -272943 -135579 300569 -286944 182912 -170922 -155274 -125276
8049 -125276 28338 -264883 -73152 267536 -143803 13199 -343408 104555 -28885 60351 -85325
8037 224120 -107981 149370 -401515 -10869 -130397 -66587 -32159 31833 139909 -172916
8026 -90738 82834 -180027 -196873 36610 14344 -45682 -174519 -227317 -63167 274112 -61189
8014 -44281 -115622 273017 -67664 174283 -190336 -191488 -256523 -183840 93964 -129071 -98623
8003 -98623 49936 -109298 76974 -409279 37850 251654 6994 -134265 452674 -22925 -339006
7992 -339006 164860 -191330 -361693 -236783 -365022 275297 385516 -209288 -123130 -146819
7982 -146819 -415552 -35831 -382580 -151677 -16056 -27893 -38555 197178 -29932 97203 69859
7971 69859 -95372 19482 -272861 299047 -27368 74230 119972 -111674 109040 97952 -148642
7959 243604 171047 54774 -41475 -73249 14634 89780 45301 -248833 96027 -54107 -81089
7948 -81089 -278366 83573 -141388 149895 -365501 53223 118150 26962 -41358 -266969 -22413
7936 -16557 160118 363732 -72758 -54998 -14553 -10601 -98335 138438 66141 -261718 35027
7924 -244941 -444193 -45318 -226866 -93531 -2168 130372 95830 -160639 303855 -3572 55741
7912 -68537 71144 95177 13163 19479 -89642 187074 -154389 -175535 -218689 49059 228450
7901 228450 128704 -41468 -131603 -28256 1981 -214348 -46383 109717 -130929 -998 -47214 -102201
7889 -102201 -208082 -277709 42402 -95390 -122740 -289529 -138791 79843 -58949 -128180 -193574
7878 -193574 -159672 161282 -231635 128720 -61819 -53081 -99477 -62322 -160187 -265726 215307
7866 -2107 23362 -371502 243091 -271109 -31919 378619 -175659 -142729 391758 -99685 -98756
7855 -98756 -29817 257341 -126401 -258846 154838 -626499 93920 -117425 -149924 133876
7844 -237246 -279896 251654 -174696 -44662 165849 -147060 188877 211171 -261586 -124656
7833 -265814 352170 27683 -89734 -26729 -214074 132409 -73464 75509 141011 -212600 -80068
7821 -82395 -171773 -46568 -141977 -69194 -149476 25833 -62000 56351 89094 236028 -63357 201917
7808 -53874 -111616 -222246 31709 11635 135618 -603118 26015 -243931 -239176 -302441 -319715
7797 -319715 -68178 -69343 -133682 223246 26289 154246 -95267 137739 97134 -219489 -184539
7786 -184539 238266 -172488 25593 268791 -406480 -172109 -32055 35944 133404 -338582
7775 75836 -124884 300899 245042 -77905 6777 -201523 -84339 -36755 -177653 47373 -76004
7763 -190773 -126557 -168571 -62310 -85638 -82585 -146905 -98790 221540 -17874 -49866 -229545
7752 -229545 -42762 94591 -425000 -17542 -137649 -70860 -94521 -6109 -93631 -177819 -140125
7741 -140125 264543 182877 -15180 -8243 -169115 -24427 -199853 -219313 78971 89044 -338464
7729 341807 -312082 -403736 370375 -61073 -163489 9747 246310 -184894 247634 -8596 53080
7717 -238191 -292486 -145 -28549 66952 -121782 4172 14807 43027 -82325 92572 -17886 26565
7704 -181873 -91990 83729 -20331 -32233 -6064 45533 190325 -281401 -74528 153809 -124981
7692 -143272 48283 -22171 1616 -92083 -192561 -35529 -150475 -324414 -15143 -402869 -289281
7681 -289281 -144861 -210032 95635 69661 93400 57565 144344 218335 149169 -26118 115727
7669 383171 -275896 164284 -203919 -25464 -124767 32533 -70149 -22494 103757 -236724 -380112
7658 -380112 111509 -34331 -294333 -90718 -71377 -33661 -114071 -146045 -110637 275944 110872
7646 -62052 -190268 50528 -37301 17784 466501 93742 -369 -99983 44757 -387668 135663
7634 -305499 90484 175555 -120783 -20658 -101266 -30444 -77528 -115991 -355341 -130741 -9193
7622 -53536 -342931 101874 -102578 96094 -17642 -176109 203769 -276591 -40434 129511
7611 -351900 -103076 95332 -101274 142723 -118457 15145 42631 -26236 228431 -77302 261268
7599 301498 64993 -114735 80746 119217 7811 -42245 -120985 231844 -17469 -97694 -217403
7588 -217403 -48870 -149169 -94105 -90994 -41901 335416 -86471 -154800 -62357 -125473 -294894
7577 -294894 -68534 -109804 -8937 -155426 -177360 -93206 -325739 -195352 106262 -204590 -75700
7565 -13204 12211 198537 -397696 -124560 32140 -29765 340431 255293 18971 -44272 -102118
7554 -102118 21084 -244562 369728 -25569 -141589 -95164 -76833 -2401 -142310 299856 242311
7543 242311 67886 -63900 123487 -79567 -108138 -38242 -292919 97804 -23061 21948 -165258
7531 -262277 54223 250349 32198 133190 87038 -142854 -321368 -9319 161226 -197886 -52071
7519 250567 -315589 -177358 -80447 -261608 -88615 -301167 -183750 -211047 125480 -227785
7508 -99012 137655 -236355 -126791 -347695 -358217 129746 -111505 -29620 -105837 -345205
7498 -345205 -140720 -29687 52445 -149645 256947 -47835 85677 -110503 -212491 384797
7487 213052 -194064 -229889 86369 -28274 126875 -85990 160973 247702 -141630 -4362 -57666
7476 -57666 115313 -217372 148082 -195370 149179 -212710 -19335 -9558 -150700 -92363 -95768
7465 -95768 -99696 -34396 39439 -149043 60042 -124249 7760 -58366 248651 12234 32350 2525
7452 34217 -84850 -192003 -143916 -470 84960 -39932 15595 124574 -131678 98085 -84885 227914
7439 51221 -241105 -19493 15263 -224706 -175442 -168715 -349695 231053 271019 114302 -119758
7427 -59373 40235 -61644 -89815 -101717 93027 -17760 196078 124635 192612 222102 13253 48820
7415 48820 84369 -132713 -201995 196411 -180475 -18373 142858 95449 -20306 -103905 -109037
7404 -109037 158069 122965 21627 1221 -408367 -89324 -278548 -265115 -597606 57183 185387
7393 185387 107958 34707 46893 216640 -207457 53557 -35353 -22288 106304 -11556 92692
7381 124002 95661 -137592 -103267 159579 -75245 -148043 211605 75308 -150219 292154 83698
7369 -215662 -286039 -138121 -174698 -126734 71247 6598 69842 -73745 -149116 -12253 -133920
7358 -133920 -49357 143188 56244 211735 -149813 -31971 20005 95886 -235046 -91223 -119445
7347 -119445 150467 258096 139180 -80486 -108583 -131419 -103933 132467 -48853 -225869 119747
7335 258956 -112053 110660 -202210 315530 -192749 218655 -220721 61926 -192174 -166623
7325 -166623 -23994 184739 -33646 9758 158502 -231171 209262 -55202 82785 -152073 -42583
7313 -174004 -16301 6131 -107924 217426 187305 44220 -26601 140923 44963 167951 -299800
7301 -12042 -142806 -141646 -2765 -69293 -83575 -48425 68501 91504 23987 -100861 268572 -158011
7288 -81289 288739 68559 -108680 163669 47298 151418 -163095 -57339 32252 -315476 -66967
7276 215774 -77743 -83641 -260719 -64589 41155 -116567 -5261 -137823 -51969 -90189 -132404
7265 -132404 177548 -66681 89468 -120948 -314280 93812 -66460 -97906 -71216 -69871 -150766
7254 -150766 -230367 -140393 10432 317321 123627 223829 -73408 302347 -254858 -381694
7244 -381694 4450 277317 432968 -221414 96837 17783 -256593 -369 201557 -11332 151296
7232 4418 -96314 -14357 -54202 228036 -187101 -184303 148014 -388101 7218 -351327 -70986
7220 -95769 -51885 267381 -14189 142191 143584 -115491 -340514 86234 17456 -11884 143195
7208 173837 192105 -105819 -24103 -112128 -37492 -282171 132671 50752 9158 158413 13701
7196 -238837 -185510 26170 -379475 -25924 83715 -54975 -149894 -52167 -277964 -35721 -85995
7185 -85995 -313898 314939 -189780 120885 -81358 30089 -169021 -153511 -150500 -294231 -100307
7173 -141164 -117714 66897 335847 -140331 122648 -157953 -156041 102892 -38260 -92303 -49161
7162 -49161 132535 122328 135374 -43233 -123811 149354 39560 285872 -29331 98281 -98026
7150 -204301 -42891 -6452 340677 -7620 -32478 -61426 339006 -81389 -151220 77043 -82543 -57234
7138 -57234 -248430 -333615 -32938 -197724 -130016 43464 415643 4297 -41535 27270 355762
7127 355762 189351 -27100 -77989 -72272 -290925 52237 9793 177230 -65608 -150691 -200167
7116 -200167 92749 -146930 -299730 237569 -64160 174983 65032 -20382 -65 -36057 388694
7104 57102 -196245 214780 -88218 -143250 -114503 -283403 103718 -244429 -359583 -229921
7094 -229921 35918 277814 -190021 -25834 260517 -270134 261212 379308 214653 -260200
7083 65878 -244359 -174849 66482 -82344 -170073 138790 117404 3479 56396 -305608 -139189
7071 -36624 -165188 29997 40068 -324099 -174543 160023 -137390 -224063 -256897 -13260 -134104
7060 -134104 15002 18586 104442 -260577 42543 -232238 -57010 50599 -88939 -137069 67719
7048 103736 172010 -127592 -297742 -284033 -331365 78492 20649 -50418 4396 29013 -44971
7036 -238855 -134484 120002 -100771 109626 -136910 -79986 164464 -62832 -134978 -282457
7026 -282457 -63518 248705 4583 337087 -343540 100143 206769 126979 316993 60623 131277
7015 131277 -75948 238342 -82440 90617 -3891 -132603 266838 -78509 118610 66064 -104739
7003 -55146 48055 191405 68636 129370 -72334 -341022 372190 -193750 27334 97304 -120369
6991 -227702 76005 -173444 119103 66753 -547141 52740 -267533 268400 39976 216591
6981 216591 18306 -121522 24184 28251 209781 60653 551100 -17150 226746 104675 -63179
6969 -69603 134935 159255 -43083 -68609 192419 -168277 17792 118563 317933 123564 -34322
6957 75150 -445211 88857 -91043 136062 -123548 -135801 -201909 -177997 170766 2894 27043
6946 27043 -133699 -89915 -142587 85696 -195770 -210865 -268608 -32368 -176964 -47733 -128682
6935 -128682 -314466 26958 166130 26342 -201812 27816 77050 -395329 16177 -192575 167369
6923 82660 -89836 75535 302174 174305 -131674 -182190 384754 123739 -105115 246669
6912 3013 -178772 -466064 -187965 -40030 -64247 -153217 -60879 170302 -55559 -308895 -218669
6901 -218669 -129090 376714 -105268 63212 236300 -7970 142587 83343 -129645 36705 255861
6890 255861 -405166 -284860 -205568 -115552 -110817 178923 -199791 -365208 -39773 -398507 2782
6878 -194877 -241460 -134208 -80532 -169622 -90799 -9049 284101 -421650 -10194 -86773 46549
6866 -210087 51016 40676 159233 -323793 -184762 -42980 -308434 -74654 -152143 -51046 -188305
6855 -188305 -226445 -84017 -8338 134277 -147007 -15980 252291 132127 -152987 117731 -379948
6843 -52942 125235 -264996 70122 46571 -94503 -195503 116815 172509 -124980 65167 36778
6832 36778 -211682 9909 143452 -18311 23109 197231 -194988 -109366 23818 -333480 149374
6820 16072 20185 235753 103142 -477491 86214 477375 347908 189496 -124160 47226 40447
6809 40447 -46321 97705 124553 -41348 38437 521 -224163 176779 -95647 167989 -293864
6797 32540 -76260 306865 167013 -323150 -15664 107327 86386 344563 -378047 -64730 50547
6785 205066 -254468 -120811 -36345 -199132 54851 -42620 -56844 -116786 119680 -23652 -112316
6774 -112316 38527 246710 -350917 -269293 -381563 259565 -15131 252540 -138620 -33978
6763 -15857 50711 -33288 -219503 -248051 -83627 -191492 -144779 15545 147776 118776 -299971
6751 -205922 60472 -152944 -240414 144289 28277 -376129 303671 -277503 -109395 30309
6740 5623 252623 118969 101290 118864 291155 -83208 -28445 32019 -186224 -32103 1300
6728 -306905 270970 -257410 264404 -197560 -44842 274417 -110274 -25417 99381 172924
6718 172924 -345125 111229 -105500 -246690 224929 9278 134770 116427 -28931 255058
6707 26707 -206276 -288637 210093 -94051 371984 -177794 -184748 -6591 -121935 -151525 -22173
6695 -274500 64801 -606087 115953 -101541 -157961 -105347 -196524 144966 -228963 -299232 260980
6683 -195983 -49478 -191976 104921 175815 123346 122677 -129535 -59889 246637 73636 116276
6672 116276 52092 133237 -11242 -252917 261824 108556 52110 59878 282950 -177429 -86825
6660 244689 125320 321480 16526 -139984 275341 -324718 220489 -20369 24265 -36247
6649 94393 115981 -28929 -183432 -16725 -90837 -27697 223741 7409 22010 -135332 39090
6637 -68770 12517 48277 -175878 -1207 -114444 -3638 61795 -22357 -25902 -118800 145650 42093
6624 -217706 359638 35790 288663 -86353 -370560 179469 140156 -191159 -10982 84483 62324
6613 62324 85415 -253376 -128439 26150 -98595 274209 -25606 -218990 -36692 148876 132622
6602 132622 -50575 174937 87737 200217 50716 245838 109620 309333 -195886 -306050
6592 -306050 -106995 30534 268973 213144 -133254 241806 245257 -234156 -192562 -61868 -244515
6581 -244515 330929 1178 103779 -15188 -222445 -139509 -147887 -79523 80171 -11102 -219816
6570 -219816 157449 53416 -56883 208309 281520 57439 26280 -139879 -72850 -136418 -315169
6559 -315169 111097 151899 -31740 -54238 25562 -42959 -156053 -146851 3626 -147916 209379
6547 170912 265670 -190179 133368 -86295 3817 107442 -98301 -220075 -188675 97494 153127
6536 153127 -148831 -290444 -94067 -178845 -68109 -69744 -319375 110840 28301 -100007 -268474
6525 -268474 -283019 -57719 108259 -100133 -81035 192673 189362 15224 125522 102198 -48605
6513 -25212 54331 69310 16591 -28281 30110 17021 -104747 109146 -239103 290618 151132
6502 151132 145667 -95330 192118 -39025 -69599 32047 -53457 -335309 119955 -30003 -77840
6491 -77840 -7293 -285705 43930 -32434 -299932 158975 70844 84055 -9005 524887 141231
6479 -106115 -231340 -7281 -157692 -72343 27280 -384358 53864 -7656 -69774 177868 -117851
6467 -13335 -102482 -139811 43760 -18700 -19108 -241725 178908 87944 -129977 455496 -83993
6455 -64106 175790 306445 -49030 -239602 -104296 -252423 201590 -56997 -277766 65488
6444 -209093 80698 244709 -106401 40810 38384 193979 -115727 2012 -126402 -131841 243658
6432 100879 -113586 -380945 22014 154570 -45718 158242 -55872 -130592 8367 97805 100993
6421 100993 -1964 6425 -118741 127266 -21164 -117870 -80689 -129322 -282363 962 -211147 -39120
6408 -172137 -196725 -64816 126507 19283 -125268 251339 -258339 37783 -34563 88512 -46356
6396 -345926 -43737 128791 421824 2052 123293 435946 -60517 -86196 -95244 -305824 -73742
6384 -158344 -110370 133719 -68840 -108416 76125 -157273 -118304 -163117 -41193 -29795 -104364
6373 -104364 293125 -172130 227279 68095 90217 -112667 -137543 81852 -14033 2512 -52431
6361 147445 8915 259922 -68095 212676 -16161 113224 54182 306216 41231 60609 -175263
6349 -156898 55028 -205388 -215995 373069 -304078 -181867 265332 -300359 -5273 238803
6338 -73549 389911 -68468 -126294 -130442 -188424 187374 22763 -68990 -165654 184247 233725
6327 233725 -244954 -146771 -633 4662 -306447 99639 198226 104618 102354 -6200 -159412 -281671
6315 -281671 -66811 -40752 -155420 -67302 148115 75097 -114944 -355040 211612 136323 63628
6303 -167336 67247 86933 325219 196833 211981 -76427 265368 122346 -156524 -339629
6293 -339629 -177599 -175882 112814 66824 279933 94879 -234512 170415 -188644 56871 -32389
6281 54717 167676 -9716 107683 -194631 67624 -61076 44236 -34635 134975 87234 55252
6270 55252 -120336 136144 186651 -144395 -9770 118774 238913 -9469 75334 128597 -118246
6258 17566 -105597 -150221 13954 -23212 124040 62739 -147038 -24527 -314151 -118965 199843
6246 -52097 -119235 -294459 -37287 -222624 -19816 -16516 468159 120586 42426 -153224 110646
6234 30375 -83562 125906 -40347 -73066 25918 7747 -151016 251992 146228 -39611 5498
6222 -282378 265009 101806 108266 -50328 -103554 308977 16595 -2885 -64566 109453 196866
6211 196866 65501 -89844 -240204 -180680 -63180 -104834 -220534 -64260 152720 -37948 256695
6199 59542 -176216 -57606 -144695 207354 -65016 -64153 -59005 -167203 381059 140505 -2809 212783
6186 -62451 -18060 18128 -156760 -15931 -47318 -97821 -32755 -349797 312623 -219435 24863
6174 -479904 127888 204325 98022 41418 -231926 70735 36721 44903 -43994 303874 91674
6162 -252086 325349 269098 -47693 101194 -66054 -62948 -285420 -123283 -224442 150529 201245
6151 201245 -18881 -381279 -84555 -131163 47385 185450 -18740 -83420 125600 -203711 -13021
6139 147633 -269882 328208 -66077 -68364 -223390 -278724 379469 -148301 -72984 33282 229446
6128 229446 68629 -422208 -88460 -34445 4895 -50311 195341 201106 -212233 -244789 -86591
6116 52809 -23297 -87650 -218619 38746 148377 -238534 21264 140647 11696 1723 270629
6105 270629 -100292 70806 55840 102018 -157753 -329448 167401 -270099 -40189 -389029
6095 -389029 -215496 -271414 -50898 105355 150572 32837 -277801 55442 -102370 9691 -69048
6083 -80554 95753 194126 101849 241915 268014 -94341 153662 317648 54344 -61242 -106149
6072 -106149 -153879 334691 -68373 11300 233444 262485 -17773 99569 -49273 113178 105638
6061 105638 -54972 32211 -150137 320125 -73716 3893 252461 254685 -26340 -151603 121467
6049 96602 244640 -18294 73277 166017 -55766 -2504 180552 -272663 -251180 73943 160750
6038 160750 132982 -7796 -134092 -13686 224790 -122582 -4183 -67636 -182154 -34463 38231
6026 -218424 -164404 -83619 -181297 -19453 -44368 176016 -125900 321357 123098 -271543 -194593
6015 -194593 10352 -109036 -38606 -133128 -18005 77339 -46795 -178996 -293645 -75088 23612
6003 -27277 19474 22137 88575 -184268 151084 -121658 -217271 -30594 -210858 -145700 -95425
5992 -95425 -156361 115582 -52562 -99196 -103478 -70473 58413 117158 -50054 426222 -354380
5980 -158994 -278857 56870 377964 -186183 162710 -36751 -326833 37753 183144 -40761
5969 31700 259355 142786 53656 84322 90798 -59529 -25573 -310351 274975 111701 -195222
5957 172396 6278 -235185 -180432 87373 9506 131489 -335480 19210 153264 373731 -256801
5945 -181126 123900 21630 174723 42265 119402 -149378 -336710 -8979 54758 261257 -54819
5933 84881 106623 255551 40175 31433 -266588 11329 72967 -73290 -72904 -14308 -92339 98986
5920 359374 141004 267292 -42758 303 -129695 -70925 -152850 -43375 28599 -207851 144014
5908 171208 288230 50162 -41715 203398 125952 -12685 106098 -54724 209576 90028 -148593
5896 -215356 -286662 -11524 269352 -224645 219103 -162168 -341194 -49889 142674 216035
5886 216035 -62109 -202730 138896 -295635 -40470 -19869 -221241 -207248 223230 -245454
5875 4627 96778 74217 -50814 -193454 -398072 177225 70454 52563 214106 27508 246796
5864 246796 160637 -313422 -166243 -36031 -119470 171708 14396 -104881 270611 -199248
5853 216111 143334 483163 -101548 -193631 -284749 83540 353748 227684 -22349 32086 144902
5842 144902 401952 -31525 -62431 20491 -49757 -37157 -204796 29654 54737 344971 -104416
5830 -9063 -459454 -284502 10 -5953 23839 -292966 170594 77576 70307 96749 -73222 7989
5817 199565 -187102 239195 127240 222281 -128979 369719 295106 -96158 -152119 -111374 92475
5805 100113 -134295 -251853 56861 -15843 -112850 49599 -164191 -92666 111965 166332 -131278
5793 161822 82666 -74523 -114744 -114632 -330334 236703 -52206 229415 -303722 -185483 -44386
5781 -81768 -47089 209876 -84123 -29491 155747 46669 -39337 -172248 -56169 -132767 -81309
5770 -81309 65186 -58427 19944 -105293 -30711 -62009 58817 -112274 20956 20924 -21716 -252622
5758 -252622 -126452 249046 706 146843 3961 -31046 -142702 -118286 12441 10989 45302 -74409
5745 -89657 59880 -62551 13054 71230 -134971 -205689 -36082 37431 -160746 -32426 -95367
5734 -95367 17920 14591 -66273 -112242 -55365 -42595 156530 -192570 122451 126911 -227021
5722 40651 7458 309414 66530 -289577 245497 -35320 74375 -122219 1395 71195 43364
5711 43364 154830 35342 113300 -165419 109025 177790 25992 39075 235875 -80580 204251
5699 -29453 -137294 33156 64329 58154 -68425 -3659 -238100 61848 -113477 121587 -211118
5687 -103105 -4895 -48627 -132473 19567 116197 406487 -81063 -147218 254395 -79972 47575
5675 -101067 13918 -189469 -176522 -237014 83774 44686 9383 179047 98406 9478 -283711
5663 -107282 -287095 21788 -12649 -259068 -252785 -129258 240857 -118850 -266102 114856
5652 -22943 -330258 -56531 -227814 -88141 -139237 -9100 -56861 18259 347518 90128 -91307
5640 -53719 -26940 -196575 -304233 77873 -12426 -14568 -69036 -116166 -207419 -65035 -17428 109478
5627 -124214 153738 -87897 -147362 216512 -45432 67570 -90872 -93095 -399475 -300546 -161641
5616 -161641 -5978 28220 -66846 10401 -244741 70080 166534 -113736 6616 106837 -119144
5604 159782 -150630 -140356 259751 196893 -177639 154663 116836 26429 -202778 64152 -197523
5592 -107433 69747 8431 111068 -13956 -173444 -165460 -76543 -59362 189556 -81713 22589
5580 -18455 -75698 375311 478052 387725 -233182 -107881 504117 159166 -214281 56272
5569 -154131 351634 26279 -37792 -196737 323570 -251346 32737 -93518 -169570 -140058 400319
5557 -276822 -62805 -300485 32408 89989 -224342 -25644 228248 130950 187507 -20742 74187
5545 -101109 -148223 169623 114924 267480 -52552 410709 309602 88722 -54503 92830 447846
5534 447846 -37960 13026 305730 243453 1330 -2956 71420 192057 -23513 133967 -83281
5522 -57543 -167417 -11289 194014 48368 -47570 178814 -151869 122406 11385 87223 -29639
5510 -33936 -76634 136351 354772 -72517 -17149 54256 -3248 95435 -157895 -54434 -53839 262664
5497 -343069 -80827 -313702 -86551 -268206 -43801 -25710 -84250 124115 379237 286692 -97823
5485 -110299 104554 76302 -97863 -17672 -180429 230720 164091 529389 412686 -414784
5474 -183319 8245 -34288 392020 -60345 -77599 139539 -180147 -6893 179457 230976 -523060
5462 112045 65519 164471 -214220 89838 104559 182219 -549456 95914 -222104 200930 -184261
5450 76827 380988 -34168 -344258 46205 50621 -38836 -15238 -51177 -134895 -110394 26099 -287147
5437 213159 -154488 159113 172564 96132 216104 -37425 169309 -266293 -187305 26624 -102503
5425 371393 -243513 -136969 32182 -38731 -70246 200489 -211899 254795 -94585 1396 -9369
5413 339325 183760 243106 -99158 128401 85435 -3120 220121 -152146 16253 -331982 -233164
5402 -233164 -218462 -269990 434130 -127526 51401 265021 -78036 -48872 -203016 -104184 -184033
5391 -184033 -29093 -269471 -171982 83946 -11145 -151991 -146808 326250 48858 196951 33698
5379 -134470 -202451 -106286 -209430 178293 -183122 186030 -23597 -196317 -52860 -48342 31427
5367 89632 -7763 -177217 49953 -208403 -19593 -248281 88379 -211346 31056 181221 430868
5356 430868 406326 -41955 32443 53572 -191791 223320 130817 -67934 -385703 185742 106868
5345 106868 313519 228522 -178146 -54571 -316236 272289 340859 -314206 -55251 -13223 53206
5333 256464 21303 -188478 91188 40798 53205 2534 -101725 -110392 179247 -376660 -107584
5321 56995 -12793 273868 115372 -126807 27135 -72741 72937 -42761 -261576 46520 110233
5310 110233 104755 128307 38949 123709 232098 -206941 -56967 247659 -106315 102923 119342
5299 119342 115910 469229 172739 178019 177923 50686 184773 13662 -190773 -186998 34121 20360
5287 20360 36398 -70810 53865 109136 128725 27179 43293 119148 -200520 431215 111027
5275 -13942 -62101 26110 42560 -245916 -258538 314886 -141393 80524 168656 132327 -70595
5263 -139256 86816 -80875 132665 235338 -86128 -125468 -116647 -47676 173159 -465811 -206477
5251 -175291 243699 -191387 -187063 -36734 -255984 18775 36408 -329213 110574 -67046 -157046
5240 -157046 294913 -103279 86740 -101801 -257660 19969 -151131 -83138 -117326 -39078 91565
5228 -37887 300041 -263037 -67129 189288 59133 -151787 -7193 260935 291180 250958 -122975
5216 -329030 377661 -156946 165790 -165187 -160042 -8002 65067 -173790 -402138 -338638 20758
5204 86425 250111 192285 336568 208600 -15906 64157 -72333 175393 -10888 350975 -30779
5192 -70461 -358689 81230 -97967 -106564 77853 295479 -195118 282889 21544 322805 43828
5180 71952 228829 78616 219358 -157687 -90863 -191122 -116451 503633 200552 103752 262457
5169 262457 -25103 336014 254550 251430 77855 -2097 130068 -19749 -137956 55545 -119952
5157 -34455 119029 175665 -117102 -385802 -246847 74995 154659 -226899 -46382 95860 267501
5146 267501 -73974 -114139 138284 76643 -197100 386783 229047 -431070 -18866 180582
5135 -25357 -38080 9380 62477 43761 4759 -145710 -66252 245965 236462 -170836 -198533 -356712
5123 -356712 -207071 -282004 168656 14150 -124530 160593 -87502 -211899 -331622 58988
5112 -41586 136425 -317277 503524 -362047 39020 159663 461767 77255 43641 -59927 263835
5100 -41549 -63179 -86471 130299 14044 205 236855 -218753 -93489 -314589 -291221 240794
5088 76842 -131917 -17159 107486 341234 97711 114680 -204937 -99051 -35607 -116538 -15062
5076 230650 102472 -120570 296978 -115410 -88639 76775 -120510 165404 -17228 -102616
5066 -102616 31814 89470 -76667 63306 294333 -201157 270248 60122 -8390 120292 188754
5055 188754 -134677 -15772 76862 -91280 381640 284538 89291 81528 -47328 119309 -296333
5043 -83536 281623 7712 2611 -60521 199635 83317 245728 -93022 42476 -76539 68296 -256254
5030 -175215 243453 -77430 248372 -60220 14113 38970 -283245 -108574 -118197 55136 253293
5019 253293 -12217 15322 148608 194718 55083 71029 79920 -45720 184338 -45728 131884
5007 -37287 -75279 83376 -397668 -160536 -152641 -183912 -55373 -64925 -187104 -159301 -108514 -245893
4995 -245893 -97093 -48387 -78082 -97515 142648 277238 -26165 -186105 -253276 -153064 102019
4983 -61733 38350 113179 -526513 51527 182397 -31518 -162770 15777 304195 347334 -27472
4971 11467 65672 94870 116181 160137 -122764 53454 -120611 -93379 2343 249538 89802
4959 340603 -216413 -206438 111409 -52544 99255 46784 33829 55353 -79380 59154 -72603
4947 -16260 107244 -290665 89042 -273816 -418668 -110602 -84005 177401 462322 156798
4936 15295 2994 125817 48910 -174581 32055 -68933 -174006 140219 -140403 -120655 -92542
4925 -92542 -20819 -44814 103415 -237381 -179292 -24434 -279470 -73932 3492 153290 200978
4914 200978 31275 151533 94635 -449106 -195657 92562 8815 -334437 -198835 62971 153735
4903 153735 -5831 176176 -460389 -18764 121968 145125 15852 -26729 -42924 -109429 30728
4891 394229 17478 208307 80531 30202 117673 179501 111186 -119682 35235 197357 131513
4880 131513 -25777 -320855 60178 274884 170800 109313 -205556 -281862 -85470 -176175 273297
4868 8326 -55261 -8055 61685 -132904 28316 -49679 -87405 154885 -51319 -63377 285006 286779
4856 286779 -113345 -139820 -152608 10208 -91013 -184941 -111766 -1009 -9536 -93688 -234568 -75600
4843 -236147 127953 54236 -5349 -69685 -284362 13424 116492 213634 -4481 -19864 72998
4831 -285416 85290 -67103 181948 27241 -168128 -60521 -9882 -25752 39267 220684 56533
4819 -151782 46851 -373441 217628 -151404 -219973 -259660 -49696 35327 -29828 -156346 -13427
4807 166480 -97730 -147270 150216 -132940 139504 436152 -13464 -206138 138206 -132247
4796 -162623 3102 26766 146545 122705 170296 40282 -97425 167564 -114951 -110809 85408
4784 -23658 111120 -201135 -67189 10813 82021 145777 -26087 238255 -109349 -210440 -269964
4773 -269964 224104 203575 -155461 -9469 18938 -67883 -320440 381642 168462 -125821 175142
4761 -194908 -117747 -273302 -139270 224783 53516 131159 228776 123492 149400 -205758 75424
4749 -51867 -234441 118538 -29931 127629 212951 -134649 116617 -51984 -27144 -214090 130408
4737 118317 106393 141738 -291478 -45895 133310 -388169 -132139 14294 185141 94702 -318249
4725 60744 -125670 338638 138201 -14050 67095 63545 -142484 432049 -212088 198184 -11199
4713 18551 -211917 -40124 84147 -163782 -53506 -486170 -61600 -86380 -1030 94977 -118859
4701 239378 208660 -233601 263333 34289 155182 249624 195767 -83019 -35819 210233 -238122
4689 319352 209330 107706 534887 -52372 159078 -174508 22351 -78789 157271 -85265
4678 119908 501206 295343 155301 402287 213125 153193 283684 85682 -334393 -59890
4667 339787 -6690 -198591 142183 253768 71203 178366 109244 92062 -75748 -269049 1350
4655 -75491 185459 -119549 69236 -162712 -81875 -34097 163875 323181 -455083 -313810
4645 -313810 102250 -132385 -81803 34202 164343 140649 -132657 117279 -46481 156298
4634 232254 428411 178077 55246 -172702 -198294 -120091 372859 -332564 173724 242542
4624 242542 -235432 -40401 174155 116410 -159568 -25400 104515 -108515 232700 -287785
4613 -72599 -308019 -106157 -35686 94948 294215 184113 31551 -182414 -289292 113204
4602 -31062 -60383 -20684 -86956 -181507 114907 -247162 -113555 -194857 -223959 128258 89447
4591 89447 80875 64337 206538 -84948 -138139 -96870 -140668 -290167 214923 -110866 -181955
4580 -181955 -125949 14099 108231 261863 -112234 29848 211334 -132788 10088 152944 21880
4568 119261 -118801 116938 144610 -18740 118904 -238182 181377 34447 220270 373182
4558 373182 -108756 -39103 7000 -418845 -169005 -82300 230492 29917 -76728 -96689 19744
4546 214818 -117937 155609 223104 -231866 -96016 21256 310382 -138442 465850 219653
4535 -9417 216209 144974 18599 129411 159194 -85977 -149840 229102 10001 -123943 -18423
4523 -38815 -120766 -30348 -67250 -94804 -154988 83109 71005 159203 -93141 215048 11448 -150446
4510 -79137 -169144 -566652 117423 272478 281749 149548 199372 226307 -423784 -112533 98907
4498 -16017 107527 -222431 367686 -97996 23070 245495 -69211 -348362 42925 245838 102133
4486 -295313 279523 -126438 73736 -62930 52726 -17085 131984 -163500 354726 -421236
$$ [...]
##END NTUPLES=NMR SPECTRUM
##END=
