
##TITLE=AC1190_Casanare-monterrey_5898400_eepF6ckwz3
##JCAMPDX= 6.0         $$ Bruker NMR JCAMP-DX V2.0
##DATA TYPE= NMR SPECTRUM
##DATA CLASS= NTUPLES
##ORIGIN= BRUKER
##OWNER= Administrator
$$ 1.72 TOPSPIN		Version 2.1
$$ 2012-04-03 17:35:50.328 -0500  Administrator@TOPSPIN
$$ Compression mode = diff/dup
##.OBSERVE FREQUENCY= 400.13188235
##.OBSERVE NUCLEUS= ^1H
##.ACQUISITION MODE= SIMULTANEOUS (DQD)
##.ACQUISITION SCHEME= undefined
##.AVERAGES= 64
##.DIGITISER RES= 22
##SPECTROMETER/DATA SYSTEM= spect
##.PULSE SEQUENCE= noesygpps1d.comp
##.SOLVENT NAME= COFFEE_meoh
##.SHIFT REFERENCE= INTERNAL, COFFEE_meoh, 1, 14.96822
##AUDIT TRAIL= $$ (NUMBER, WHEN, WHO, WHERE, PROCESS, VERSION, WHAT)
$$ ##TITLE= Audit trail, TOPSPIN		Version 2.1
$$ ##JCAMPDX= 5.01
$$ ##ORIGIN= Bruker BioSpin GmbH
$$ ##OWNER= Administrator
$$ $$ C:\Bruker\TOPSPIN/data/COFFEE/nmr/AC1190_Casanare-monterrey_5898400_eepF6ckwz3/12/pdata/1/auditp.txt
$$ ##AUDIT TRAIL=  $$ (NUMBER, WHEN, WHO, WHERE, PROCESS, VERSION, WHAT)
(   1,<2012-04-03 17:35:45.562 -0500>,<Administrator>,<TOPSPIN>,<go>,<TOPSPIN 2.1>,
      <created by zg
	started at 2012-04-03 17:24:13.937 -0500,
	POWCHK enabled, PULCHK disabled,
       configuration hash MD5:
       1A 1E CE 29 27 FD 77 03 67 4E F0 E3 C4 B2 CB 90
       data hash MD5: 64K
       19 33 82 96 13 55 DF 00 02 8F 9B 8F DB 9B 0C 14>)
(   2,<2012-04-03 17:35:48.375 -0500>,<Administrator>,<TOPSPIN>,<proc1d>,<TOPSPIN 2.1>,
      <Start of raw data processing
       efp LB = 0.3 FT_mod = 6 PKNL = 1 PHC0 = 0 PHC1 = 0 SI = 128K 
       data hash MD5: 128K
       E6 F6 F5 BA E3 DD FE 3F 31 60 0D E4 59 E0 FB 41>)
(   3,<2012-04-03 17:35:49.593 -0500>,<Administrator>,<TOPSPIN>,<proc1d>,<TOPSPIN 2.1>,
      <pk PHC0 = 35.2771 PHC1 = 0 
       data hash MD5: 128K
       75 CD 9F 5B CD F6 E0 E6 39 87 59 8B 92 A9 B8 5A>)
(   4,<2012-04-03 17:35:49.828 -0500>,<Administrator>,<TOPSPIN>,<proc1d>,<TOPSPIN 2.1>,
      <abs ABSG = 1 
       data hash MD5: 128K
       60 F5 24 1A 4A 9A 11 DB FA 2D FC 3B BC AD F9 90>)
(   5,<2012-04-03 17:35:49.906 -0500>,<Administrator>,<TOPSPIN>,<proc1d>,<TOPSPIN 2.1>,
      <abs ABSG = 2 
       data hash MD5: 128K
       54 C5 FC F5 0E 99 4D 8B C4 86 9C 6E B0 35 84 D1>)
(   6,<2012-04-03 17:35:50.125 -0500>,<Administrator>,<TOPSPIN>,<proc1d>,<TOPSPIN 2.1>,
      <abs ABSG = 3 
       data hash MD5: 128K
       02 E0 B3 C5 BC 31 4D 6B B1 1C EE BC E9 28 46 B7>)
(   7,<2012-04-03 17:35:50.187 -0500>,<Administrator>,<TOPSPIN>,<proc1d>,<TOPSPIN 2.1>,
      <abs ABSG = 4 
       data hash MD5: 128K
       57 A8 69 51 5C 18 C5 F2 6A 5E 1B 8A D3 9B F9 F9>)
(   8,<2012-04-03 17:35:50.234 -0500>,<Administrator>,<TOPSPIN>,<proc1d>,<TOPSPIN 2.1>,
      <abs ABSG = 5 
       data hash MD5: 128K
       D6 5D 21 53 F3 FC F3 B4 D3 8D A7 2F 80 FE AA 3D>)
$$ ##END=
$$ 
$$ $$ hash MD5
$$ $$ 26 A5 78 C3 86 D7 34 CC A6 92 83 05 C1 E0 1E 22
##$RELAX= 
##$RELAX= 
##$RELAX= 
##$RELAX= 
##$RELAX= 
##$RELAX= 
##$RELAX= 
##$RELAX= 
$$ [...]
##$TP07= 0
##$TPNAME0= <>
##$TPNAME1= <>
##$TPNAME2= <>
##$TPNAME3= <>
##$TPNAME4= <>
##$TPNAME5= <>
##$TPNAME6= <>
##$TPNAME7= <>
##$TPOAL= (0..7)
0.5 0.5 0.5 0.5 0.5 0.5 0.5 0.5
##$TPOFFS= (0..7)
0 0 0 0 0 0 0 0
##$TUNHIN= 0
##$TUNHOUT= 0
##$TUNXOUT= 0
##$USERA1= <user>
##$USERA2= <user>
##$USERA3= <user>
##$USERA4= <user>
##$USERA5= <user>
##$V9= 5
##$VALIST= <valist>
##$VCLIST= <CCCCCCCCCCCCCCC>
##$VD= 0
##$VDLIST= <DDDDDDDDDDDDDDD>
##$VPLIST= <PPPPPPPPPPPPPPP>
##$VTLIST= <TTTTTTTTTTTTTTT>
##$WBST= 2048
##$WBSW= 25
##$XGAIN= (0..3)
0 0 0 0
##$XL= 0
##$YL= 0
##$YMAX_a= 12601842
##$YMIN_a= -5833327
##$ZGOPTNS= <>
##$ZL1= 120
##$ZL2= 120
##$ZL3= 120
##$ZL4= 120
##$ABSF1= 14.96822
##$ABSF2= -5.584311
##$ABSG= 5
##$ABSL= 3
##$ALPHA= 0
##$AQORDER= 0
##$ASSFAC= 0
##$ASSFACI= 0
##$ASSFACX= 0
##$ASSWID= 0
##$AUNMP= <proc_prof1d_extract.lims>
##$AXLEFT= 0
##$AXNAME= <>
##$AXNUC= <1H>
##$AXRIGHT= 0
##$AXTYPE= 0
##$AXUNIT= <>
##$AZFE= 0.1
##$AZFW= 0.1
##$BCFW= 0
##$BC_mod= 0
##$BYTORDP= 0
##$COROFFS= 0
##$CY= 15
##$DATMOD= 1
##$DC= 0
##$DFILT= <>
##$DTYPP= 0
##$F1P= 0
##$F2P= 0
##$FCOR= 0.5
##$FTSIZE= 131072
##$FT_mod= 6
##$GAMMA= 0
##$GB= 0
##$INTBC= 1
##$INTSCL= 1
##$ISEN= 128
##$LB= 0.3
##$LEV0= 0
##$LPBIN= 0
##$MAXI= 10000
##$MC2= 0
##$MEAN= 0
##$ME_mod= 0
##$MI= 0
##$NCOEF= 0
##$NC_proc= -3
##$NLEV= 6
##$NOISF1= 0
##$NOISF2= 0
##$NSP= 0
##$NTH_PI= 0
##$NZP= 0
##$OFFSET= 14.96822
##$PC= 1
##$PHC0= 35.2771
##$PHC1= 0
##$PH_mod= 1
##$PKNL= yes
##$PPARMOD= 0
##$PPDIAG= 0
##$PPIPTYP= 0
##$PPMPNUM= 2147483647
##$PPRESOL= 1
##$PSCAL= 4
##$PSIGN= 0
##$PYNMP= <proc.py>
##$REVERSE= no
##$SF= 400.130004958188
##$SI= 131072
##$SIGF1= 0
##$SIGF2= 0
##$SINO= 400
##$SIOLD= 131072
##$SPECTYP= <>
##$SREGLST= <1H.CDCl3>
##$SSB= 0
##$STSI= 131072
##$STSR= 0
##$SW_p= 8223.68421052632
##$SYMM= 0
##$S_DEV= 0
##$TDeff= 65536
##$TDoff= 0
##$TI= <>
##$TILT= no
##$TM1= 0
##$TM2= 0
##$TOPLEV= 0
##$USERP1= <user>
##$USERP2= <user>
##$USERP3= <user>
##$USERP4= <user>
##$USERP5= <user>
##$WDW= 1
##$XDIM= 131072
##$YMAX_p= 483238030
##$YMIN_p= -361318494
##$CURPLOT= <Network HP LaserJet P1505>
##$CURPRIN= <$Network HP LaserJet P1505>
##$DFORMAT= <normdp>
##$LAYOUT= <+/1D_H.xwp>
##$LFORMAT= <normlp>
##$PFORMAT= <normpl>
##$SURQMSG= 1
$$ End of Bruker specific parameters
$$ ---------------------------------
##NTUPLES= NMR SPECTRUM
##VAR_NAME=  FREQUENCY,     SPECTRUM/REAL,   SPECTRUM/IMAG
##SYMBOL=    X,             R,               I
##VAR_TYPE=  INDEPENDENT,   DEPENDENT,       DEPENDENT
##VAR_FORM=  AFFN,          ASDF,            ASDF
##VAR_DIM=   131072,        131072,          131072
##UNITS=     HZ,            ARBITRARY UNITS, ARBITRARY UNITS
##FACTOR=    0.0627417313425165, 1,          1
##FIRST=     8223.62146879498, 1593,         -95890
##LAST=      0,             4901,            -96652
##MIN=       0,             -361318494,      0
##MAX=       8223.62146879498, 483238030,    0
$$ Real data points
##PAGE= N=1
##DATA TABLE= (X++(R..R)), XYDATA
$$ [...]
62961D044782n1473o6948q1991r3856j01523j06115j08254j07153j02973r7926
$$ 4044782 3993309 3926361 3844370 3750514 3648991 3542876 3434622 3327469 3224496 3126570
62951C126570r3752q9510q3258p4816o5566n6481m7728l9603l2392k5757j9418
$$ 3126570 3032818 2943308 2860050 2785234 2719668 2663187 2615459 2575856 2543464 2517707 2498289
62940B498289j3970r861o080j241M298Q754J1291J2810J4332J5870J7152J8287
$$ 2498289 2484319 2474458 2468378 2467137 2471435 2480189 2491480 2504290 2518622 2534492 2551644 2569931
62928B569931J9187J9105J7313J3838R283M358m04m990j0021j6043k2655k8962
$$ 2569931 2589118 2608223 2625536 2639374 2648657 2653015 2652611 2647621 2637600 2621557 2598902 2569940
62916B569940l4892m1353m8778n6124o1738o4967o6553o7569o8231o7848o5917
$$ 2569940 2535048 2493695 2444917 2388793 2327055 2262088 2195535 2127966 2059735 1991887 1925970
62905A925970o3067o0542n8778n6874n3689m9124m4106l9725l6582l4524l2717
$$ 1925970 1862903 1802361 1743583 1686709 1633020 1583896 1539790 1500065 1463483 1428959 1396242
62894A396242l0415k7882k6011k4973k3949k2481k1072j9927j8275j5785j3700
$$ 1396242 1365827 1337945 1311934 1286961 1263012 1240531 1219459 1199532 1181257 1165472 1151772
62883A151772j3357j4271j4852j4426j3423j2114j0550r283q874q863q466q062
$$ 1151772 1138415 1124144 1109292 1094866 1081443 1069329 1058779 1049496 1040622 1031759 1023293 1015231
62871A015231q626r935j0751j0702j0584j0687j0325r213q023p207o570o232o597
$$ 1015231 1006605 996670 985919 975217 964633 953946 943621 934408 926385 919178 912608 906376 899779
62858H99779p020o024l591j773k053l265l268j765k68J24k83o74o69l79j83m20
$$ 899779 892759 886735 883144 881371 879318 876053 872785 871020 870752 870876 870593 869919 869250 868871 868688 868268
62842H68268r67j219p22L98J710K777L151K637J778J464J833K130J820J178O37
$$ 868268 867301 866082 865360 865758 867468 870245 873396 876033 877811 879275 881108 883238 885058 886236 886873
62827H86873K34j15m97j341k951m480m468k844j354j319k004k060j512j340j837
$$ 886873 887107 886992 886495 885154 882203 877723 873255 870411 869057 867738 865734 863674 862162 860822 858985
62812H58985k534l148l518l130j844p54j212l113n117o329o822o748o044n025
$$ 858985 856451 853303 849785 846655 844811 844057 842845 839732 834615 828286 821464 814716 808672 803647
62798H03647m264l750l084k445k440k881k893k430k596l800m687l858j924q10
$$ 803647 799383 795633 792549 790104 787664 784783 781890 779460 776864 773064 768377 764519 762595 761785
62784G61785j217j907j569m40M03O38Q27J213J307Q76O43J416K896M036M447M723
$$ 761785 760568 758661 757092 756652 757055 757693 758520 759733 761040 761916 762559 763975 766871 770907 775354 780077
62768G80077N246N461M689L192J909J553K252L735N335O322O666P135Q084Q618
$$ 780077 785323 790784 795473 798665 800574 802127 804379 808114 813449 819771 826437 833572 841656 850274
62754H50274P753O034N005N179N646N839O555Q488J0762J1902J1849J2051J3536
$$ 850274 858027 864061 869066 874245 879891 885730 892285 900773 911535 923437 935286 947337 960873
62741I60873J5786J7625J8598J9195K0181K2037K4733K7812L0828L3875L7332
$$ 960873 976659 994284 1012882 1032077 1052258 1074295 1099028 1126840 1157668 1191543 1228875
62730A228875M0981M3887M5706M7705N1568N7272O3032O7737P2474P8892Q6631
$$ 1228875 1269856 1313743 1359449 1407154 1458722 1515994 1579026 1646763 1719237 1798129 1884760
62719A884760R3584R8737J03604J10275J18703J26550J31549J33359J33231J32376
$$ 1884760 1978344 2077081 2180685 2290960 2409663 2536213 2667762 2801121 2934352 3066728
62709C066728J30869J27750J21768J12098R8646Q1833O2157M0073J6403p299k9237
$$ 3066728 3197597 3325347 3447115 3559213 3657859 3739692 3801849 3841922 3858325 3851026 3821789
62698C821789m8557o5911q2464r8387j12534j23546j30904j34937j36341j35809
$$ 3821789 3773232 3707321 3624857 3526470 3413936 3290390 3159486 3024549 2888208 2752399
62688B752399j33721j29967j24481j17998j11751j06187j00637r4622q8612q2960
$$ 2752399 2618678 2488711 2364230 2246232 2134481 2028294 1927657 1833035 1744423 1661463
62678A661463p6898o9679o2164n6011n1536m7544m3351l9614l6889l4565l1863
$$ 1661463 1584565 1514886 1452722 1396711 1345175 1297631 1254280 1214666 1177777 1143212 1111349
62667A111349k8878k5964k2860j9332j5997j3585j1805r835p704o241n640n048
$$ 1111349 1082471 1056507 1033647 1014315 998318 984733 972928 963093 955389 949148 943508 938460
62655I38460l833k421j352m0K758P314J2292J5937J7599J8088J8850K0953K4529
$$ 938460 934627 932206 930854 930814 933572 940886 953178 969115 986714 1004802 1023652 1044605 1069134
62642A069134K8766L2530L5291L7451L9675M2231M5188M8816N3042N6926N9502
$$ 1069134 1097900 1130430 1165721 1203172 1242847 1285078 1330266 1379082 1432124 1489050 1548552
62631A548552O1005O2256O3005O2110N9478N6276N2628M6822L7894K7485J7675
$$ 1548552 1609557 1671813 1734818 1796928 1856406 1912682 1965310 2012132 2050026 2077511 2095186
62620B095186Q177k544j4307k5416l5302m4734n3506n9943o3138o4043o4027o3791
$$ 2095186 2103363 2100819 2086512 2061096 2025794 1981060 1927554 1867611 1804473 1740430 1676403 1612612
62608A612612o3834o4311o4118o1786n7756n4087n1481m8409m3943l9540l6800
$$ 1612612 1548778 1484467 1420349 1358563 1300807 1246720 1195239 1146830 1102887 1063347 1026547
62597A026547l5096l2801k9743k6950k4970k3600k2562k1383j9432j6953j5191
$$ 1026547 991451 958650 928907 901957 876987 853387 830825 809442 790010 773057 757866
62586G57866j4640j4222j3086j1953j1533j0980r341p396o478o397o171n886o059
$$ 757866 743226 729004 715918 703965 692432 681452 672111 664715 658237 651840 645669 639783 633724
62573F33724o026m881l557l798n298n706l679l15K506L753L280J750O78J181K610
$$ 633724 627698 622817 619260 615462 610164 604458 600779 600464 602970 606723 610003 611753 612431 613612 616222
62558F16222L656M499O311Q746R940R309Q615R503J1503J3151J3890J4131J4449
$$ 616222 619878 624377 630688 639434 649374 658683 667298 676801 688304 701455 715345 729476 743925
62545G43925J5383J7207J9504K1705K4083K7254L0771L3578L5905L9091M3271
$$ 743925 759308 776515 796019 817724 841807 869061 899832 933410 969315 1008406 1051677
62534A051677M6994M9707N2833N7444O2383O5925O7905O8966O8892O7078O3742
$$ 1051677 1098671 1148378 1201211 1258655 1321038 1386963 1454868 1523834 1592726 1659804 1723546
62523A723546N9413N3818M6457L7628K7901J7208N511o322j7307k7375l6662m4542
$$ 1723546 1782959 1836777 1883234 1920862 1948763 1965971 1971482 1965160 1947853 1920478 1883816 1839274
62511A839274n0513n5311n9760o3076o3738o1800n9015n6815n5219n3596n1366
$$ 1839274 1788761 1733450 1673690 1610614 1546876 1485076 1426061 1369246 1314027 1260431 1209065
62500A209065m8076m3806l9438l5660l2047k8144k4953k3860k4308k4109k2239
$$ 1209065 1160989 1117183 1077745 1042085 1010038 981894 956941 933081 908773 884664 862425
62489H62425j9820j8100j6972j6095j5877j6406j6504j5048j2542j0442r369q846
$$ 862425 842605 824505 807533 791438 775561 759155 742651 727603 715061 704619 695250 686404
62477F86404q280p467o376n103l949l028k175j460j259j322m39K096N180O977
$$ 686404 678124 670657 664281 659178 655229 652201 650026 648566 647307 645985 645546 647642 652822 659799
62463F59799P119O878P304Q235R354J1149J4091J7482J9950K1026K1621K2963
$$ 659799 666918 673796 681100 689335 698689 709838 723929 741411 761361 782387 804008 826971
62451H26971K5396K8328L0989L3039L4539L5565L5932L5354L3755L1277K8005
$$ 826971 852367 880695 911684 944723 979262 1014827 1050759 1086113 1119868 1151145 1179150
62440A179150K3928J9251J4439R641M353j801q058j3003j6308j9248k2961k6818
$$ 1179150 1203078 1222329 1236768 1246409 1250762 1248961 1240903 1227900 1211592 1192344 1169383 1142565
62428A142565k9330l0167l0179k9663k8051k5634k4061k4111k4215k2471j9338
$$ 1142565 1113235 1083068 1052889 1023226 995175 969541 945480 921369 897154 874683 855345
62417H55345j6855j5615j4319j2256j0409r434q204n474k023J89L68n64j392j466
$$ 855345 838490 822875 808556 796300 785891 776457 768253 762779 760756 760945 761313 760749 759357 757891
62403G57891m68J592M004N756O539O822O969O822O277N700N662O599Q632J1260
$$ 757891 757423 759015 763019 768775 775314 782136 789105 795927 802204 807904 813566 820165 828797 840057
62389H40057J3259J3567J2415J1146J0753J1021J1128J0656R807Q944Q116O829
$$ 840057 853316 866883 879298 890444 901197 912218 923346 934002 943809 952753 960869 967698
62377I67698M448J152j857l769n466q505j2761j6315j8009j8849k0106k1129k0349
$$ 967698 972146 973298 971441 967672 962206 953701 940940 924625 906616 887767 867661 846532 826183
62364H26183j7908j5832j5488j6009j5688j4091j2169j0590q793o028k987j546
$$ 826183 808275 792443 776955 760946 745258 731167 718998 708408 699615 693587 690600 689054
62352F89054k419l697k839N7K263K118J214J928M067N544N615N601O484P635Q204
$$ 689054 686635 682938 680099 680156 682419 684537 685751 687679 691746 697290 702905 708506 714990 722625 730829
62337G30829Q410Q761R164R375R458R258Q303O783N806O001O602O529N749M871
$$ 730829 739239 748000 757164 766539 775997 785255 793558 800341 806147 812148 818750 825279 831028 835899
62323H35899M107L419L143L570M165M161L818M348O465R522J2303J4336J6297
$$ 835899 840006 843425 846568 850138 854303 858464 862282 866630 873095 882617 894920 909256 925553
62310I25553J9159K2952K6500K8783L0466L3455L8791M5527N1925N7107O1237
$$ 925553 944712 967664 994164 1022947 1053413 1086868 1125659 1171186 1223111 1280218 1341455
62299A341455O4838O8459P2349P5833P7598P7177P5530P3459P0108O4025N5074
$$ 1341455 1406293 1474752 1547101 1622934 1700532 1777709 1853239 1926698 1996806 2060831 2115905
62288B115905M4399L2944K1214J0102O01p430j5110k3087l1199l9386m7582n4593
$$ 2115905 2160304 2193248 2214462 2224564 2225165 2217735 2202625 2179538 2148339 2108953 2061371 2006778
62276B006778n8724o0050o0649o1680o1594n8584n3713m9917m8306m7170m4780
$$ 2006778 1948054 1888004 1827355 1765675 1704081 1645497 1591784 1541867 1493561 1446391 1401611
62265A401611m1629l9298l8254l7670l6772l5482l4015l2561l1261k9868k7542
$$ 1401611 1359982 1320684 1282430 1244760 1207988 1172506 1138491 1105930 1074669 1044801 1017259
62254A017259k3703j9182j5768j4114j2746r869n845k979k728l877m021k241K28
$$ 1017259 993556 974374 958606 944492 931746 921877 916032 913053 910325 906448 902427 900186 900414
62241I00414J691J742J263J164J342Q88o80k474k924j608J06O26m1n91j98Q77
$$ 900414 902105 903847 905110 906274 907616 908504 907824 905350 902426 900818 900924 901550 901509 900918 900720 901597
62225I01597K273M082O053P242P123O570O956Q594J0734J2796J4835J6796J8259
$$ 901597 903870 907952 914005 921247 928370 934940 941896 950490 961224 974020 988855 1005651 1023910
62212A023910J9255K0572K2840K5702K8494L1146L3892L6483L8590M0735M3878
$$ 1023910 1043165 1063737 1086577 1112279 1140773 1171919 1205811 1242294 1280884 1321619 1365497
62201A365497M7976N1950N5363N9188O4313P0057P4895P8043P9439P8732P5327
$$ 1365497 1413473 1465423 1520786 1579974 1644287 1714344 1789239 1867282 1946721 2025453 2100780
62190B100780O9370O1729N2926M2726L0911J7876M531q024j8930k8316l7357m6914
$$ 2100780 2170150 2231879 2284805 2327531 2358442 2376318 2380849 2372825 2353895 2325579 2288222 2241308
62178B241308n6294o3972o9145p1803p1929o9847o6988o4748o2572n8700n2867
$$ 2241308 2185014 2121042 2051897 1980094 1908165 1838318 1771330 1706582 1644010 1585310 1532443
62167A532443m6745m1555l6924l2520k8859k5769k1970j7345j3833j2634j2009
$$ 1532443 1485698 1444143 1407219 1374699 1345840 1320071 1298101 1280756 1266923 1254289 1242280
62156A242280r573n547j965K92J882L143L717L668L483L307L366M477O677Q187
$$ 1242280 1232707 1227160 1225195 1225487 1227369 1230512 1234229 1237897 1241380 1244687 1248053 1252530 1259207 1267394
62142A267394P492N759N309O240O707O234O355P711Q895Q846Q524R239J0885J2761
$$ 1267394 1274886 1280645 1285954 1292194 1298901 1305135 1311490 1319201 1328096 1336942 1345466 1354705 1365590 1378351
62128A378351J4821J7146J9183K0419K1141K1986K3224K4724K6036K6615K6752
$$ 1378351 1393172 1410318 1429501 1449920 1471061 1493047 1516271 1540995 1567031 1593646 1620398
62117A620398K7886L0801L3956L5187L4849L5415L8089M1851M6005N1172N7056
$$ 1620398 1648284 1679085 1713041 1748228 1783077 1818492 1856581 1898432 1944437 1995609 2052665
62106B052665O1646O3996O5681O8022O9687O8745O5387O0695N4180M4839L3770
$$ 2052665 2114311 2178307 2243988 2312010 2381697 2450442 2515829 2576524 2630704 2675543 2709313
62095B709313K3562J5435Q778L005k025p026j2755j8350k2036k3652k4977k7029
$$ 2709313 2732875 2748310 2757088 2760093 2758068 2751042 2738287 2719937 2697901 2674249 2649272 2622243
62083B622243k8534k7778k4905k1497j8612j5981j2904r271n597k379L61K616
$$ 2622243 2593709 2565931 2541026 2519529 2500917 2484936 2472032 2462761 2457164 2454785 2455146 2457762
62071B457762L830L452K215K003L867O777Q991J0137J1301J3509J6819K0537K3635
$$ 2457762 2461592 2465044 2467259 2469262 2473129 2479906 2488897 2499034 2510335 2523844 2540663 2561200 2584835
62058B584835K5348K6009K6954K8898L0934L1781L1673L2062L3737L6261L9070
$$ 2584835 2610183 2636192 2663146 2692044 2722978 2754759 2786432 2818494 2852231 2888492 2927562
62047B927562M2104M5096M7201M7829M7622M8116N0261N3057N3952N1273M6397
$$ 2927562 2969666 3014762 3061963 3109792 3157414 3205530 3255791 3308848 3362800 3414073 3460470
62036C460470M2672M1964M3167M4542M6083M8394N0441N0273M7604M4035M0874
$$ 3460470 3503142 3545106 3588273 3632815 3678898 3727292 3777733 3828006 3875610 3919645 3960519
62025C960519L8365L7118L8442M2397M6868M9672N0913N2238N4333N6240N7144
$$ 3960519 3998884 4036002 4074444 4116841 4163709 4213381 4264294 4316532 4370865 4427105 4484249
62014D484249N7815N9700O2956O6185O8242O9674P1723P4410P6556P7723P8799
$$ 4484249 4542064 4601764 4664720 4730905 4799147 4868821 4940544 5014954 5091510 5169233 5248032
62003E248032Q0232Q0917P9690P6836P2971O7329N8751M7962L7288K8077J9909
$$ 5248032 5328264 5409181 5488871 5565707 5638678 5706007 5764758 5812720 5850008 5878085 5897994
61992E897994J2443O461K336j323o498j3776k2064k9727l5443l8526l9262l8825
$$ 5897994 5910437 5916898 5919234 5917911 5911413 5897637 5875573 5845846 5810403 5771877 5732615 5693790
61980E693790l8269l7560l5877l2867k9195k5826k3064k0665j8745j8014j8717
$$ 5693790 5655521 5617961 5582084 5549217 5520022 5494196 5471132 5450467 5431722 5413708 5394991
61969E394991j9702j9383j7611j5786j4919j4458j3561j2698j2968j4308j5309
$$ 5394991 5375289 5355906 5338295 5322509 5307590 5293132 5279571 5266873 5253905 5239597 5224288
61958E224288j4791j2961j1061j0337j1133j2551j3185j2580j1702j1723j2802
$$ 5224288 5209497 5196536 5185475 5175138 5164005 5151454 5138269 5125689 5113987 5102264 5089462
61947E089462j4476j6480j8529j9960k0401k0423k0744k1280k1648k1989k2299
$$ 5089462 5074986 5058506 5039977 5020017 4999616 4979193 4958449 4937169 4915521 4893532 4871233
61936D871233k1862k0565k0183k2598k6930l0166l0914l0887l2258l4910l7227
$$ 4871233 4849371 4828806 4808623 4786025 4759095 4728929 4698015 4667128 4634870 4599960 4562733
61925D562733l8453l9169l9972m0579m0253l8756l6868l5795l5857l6073l5506
$$ 4562733 4524280 4485111 4445139 4404560 4364307 4325551 4288683 4252888 4217031 4180958 4145452
61914D145452l4523l3901l3252l1666k9624k8752k9406l0021k9374k8094k7225
$$ 4145452 4110929 4077028 4043776 4012110 3982486 3953734 3924328 3894307 3864933 3836839 3809614
61903C809614k6511k5203k3651k2813k2633k2086k0734j9264j8342j7631j6378
$$ 3809614 3783103 3757900 3734249 3711436 3688803 3666717 3645983 3626719 3608377 3590746 3574368
61892C574368j4654j3492j3516j3741j2365r000n369l168j955j50K411M347N189
$$ 3574368 3559714 3546222 3532706 3518965 3506600 3497600 3492231 3489063 3487108 3486958 3489369 3493716 3498905
61879C498905O346R085J2700J5642J7754K0490K5068L1006L6512M0369M3426M7914
$$ 3498905 3505251 3514336 3527036 3542678 3560432 3580922 3605990 3636996 3673508 3713877 3757303 3805217
61867C805217N4775O2282O8188P2763P8382Q6273R5258J04103J13448J24527J37222
$$ 3805217 3859992 3922274 3990462 4063225 4141607 4227880 4323138 4427241 4540689 4665216 4802438
61856D802438J50478J63870J77918J93364K10857K30771K52763K76118L01059
$$ 4802438 4952916 5116786 5294704 5488068 5698925 5929696 6182459 6458577 6759636
61847F759636L29017L61085L96934M35813M77618N22182N68237O14083O58703
$$ 6759636 7088653 7449738 7846672 8282485 8760103 9282285 9850522 10464605 11123308
61838A1123308P01404P40729P74225P98517Q08749P98580P61822O93924N92062
$$ 11123308 11824712 12565441 13339666 14138183 14946932 15745512 16507334 17201258 17793320
61829A7793320M55726K89426J04421q4140k62761m22334n56829o61894p35915
$$ 17793320 18249046 18538472 18642893 18558753 18295992 17873658 17316829 16654935 15919020
61820A5919020p81394q03685q07945p97253p73473p39353o99021o56035o11442
$$ 15919020 15137626 14333941 13525996 12728743 11955270 11215917 10516896 9860861 9249419
61811I249419n64980n18172m74674m36767m02962l70414l38669l09378k83082
$$ 9249419 8684439 8166267 7691593 7254826 6851864 6481450 6142781 5833403 5550321
61802E550321k58594k35419k14721j97157j81470j66153j51271j37730j25774
$$ 5550321 5291727 5056308 4841587 4644430 4462960 4296807 4145536 4007806 3882032
61793C882032j15136j05823r7696q9935q1914p4190o7654o2115n6598n0797m5229
$$ 3882032 3766896 3661073 3563377 3473442 3391528 3317338 3249684 3187569 3130971 3080174 3034945
61782C034945m0201l5614l1823k9492k8227k6333k2654j8024j4151j1487q967
$$ 3034945 2994744 2959130 2927307 2897815 2869588 2843255 2820601 2802577 2788426 2776939 2767972
61771B767972n702k113Q32K893M732O977R475J1453J2351J2515J2944J4356J6626
$$ 2767972 2762270 2760157 2760989 2763882 2768614 2775591 2785066 2796519 2808870 2821385 2834329 2848685 2865311
61758B865311J9310K2337K5899K9936L4254L8875M3635M7666N0258N2275N5705
$$ 2865311 2884621 2906958 2932857 2962793 2997047 3035922 3079557 3127223 3177481 3229756 3285461
61747C285461O1354O7946P3942P9356Q5113R1625R8964J07573J17493J27520J36475
$$ 3285461 3346815 3414761 3488703 3568059 3653172 3744797 3843761 3951334 4068827 4196347 4332822
61736D332822J45061J55017J66520J77936J88503J99757K13737K30741K49567
$$ 4332822 4477883 4632900 4799420 4977356 5165859 5365616 5579353 5810094 6059661
61727F059661K69198K89500L10939L34320L60476L89727M21729M56193M93517
$$ 6059661 6328859 6618359 6929298 7263618 7624094 8013821 8435550 8891743 9385260
61718I385260N34721N80977O33193O91470P54901Q22313Q93275R67938J045909
$$ 9385260 9919981 10500958 11134151 11825621 12580522 13402835 14296110 15264048 16309957
61709A6309957J125619J204632J279882J347545J402978J440267J451221J425196
$$ 16309957 17435576 18640208 19920090 21267635 22670613 24110880 25562101 26987297
61701B6987297J351122J220348J028595P77852M78857J51105j82125m99866p85109
$$ 26987297 28338419 29558767 30587362 31365214 31844071 31995176 31813051 31313185 30528076
61692C0528076j023799j206943j334628j414529j454690j459609j433842j385604
$$ 30528076 29504277 28297334 26962706 25548177 24093487 22633878 21200036 19814432
61684A9814432j323776j253194j175632j093942j012411r33786q58640p87563
$$ 19814432 18490656 17237462 16061830 14967888 13955477 13021691 12163051 11375488
61676A1375488p21790o61660o06372n55357n08540m65448m25650l89919l59343
$$ 11375488 10653698 9992038 9385666 8830309 8321769 7856321 7430671 7040752 6681409
61667F681409l33107l08627k84094k59911k37640k18580k03125j90394j78616
$$ 6681409 6348302 6039675 5755581 5495670 5258030 5039450 4836325 4645931 4467315
61658D467315j66744j55326j44946j34782j24132j14320j07061j01524r5363q8334
$$ 4467315 4300571 4145245 4000299 3865517 3741385 3627065 3520004 3418480 3323117 3234783
61648C234783q2345p7854p2992o7048o2079n9621n7999n4878n0819m8179m7560
$$ 3234783 3152438 3074584 3001592 2934544 2872465 2812844 2754845 2699967 2649148 2600969 2553409
61637B553409m7400m6553m5312m3875m1641l8555l5943l5118l5781l6436l6188
$$ 2553409 2506009 2459456 2414144 2370269 2328628 2290073 2254130 2219012 2183231 2146795 2110607
61626B110607l5479l4963l4250l2456k9843k7946k7560k7396k5713k2738k0412
$$ 2110607 2075128 2040165 2005915 1973459 1943616 1915670 1888110 1860714 1835001 1812263 1791851
61615A791851j9842k0118j9705j8051j5667j3502j2503j2998j4390j5848j7116
$$ 1791851 1772009 1751891 1732186 1714135 1698468 1684966 1672463 1659465 1645075 1629227 1612111
61604A612111j8031j7842j6202j4459j4452j6018j7132j6563j4858j2617r646
$$ 1612111 1594080 1576238 1560036 1545577 1531125 1515107 1497975 1481412 1466554 1453937 1444291
61593A444291o448m612m692n090m206k475j223p25n57p43j321j728j810k430l817
$$ 1444291 1437843 1433231 1428539 1423449 1419243 1416768 1415545 1414820 1414263 1413520 1412199 1410471 1408661 1406231 1402414
61578A402414m345k563L30J753R52o23j800k759l731m304m368m462m830n059m923
$$ 1402414 1398069 1395506 1395836 1397589 1398541 1397918 1396118 1393359 1389628 1385324 1380956 1376494 1371664 1366605 1361682
61563A361682m655m388m177m440n300n599l989j125N61k81k464m173n120o051
$$ 1361682 1357027 1352639 1348462 1344022 1338722 1333123 1329134 1328009 1328570 1328289 1325825 1321652 1316532 1310481
61549A310481p185q141q628q317o596l501m88O80j78j572k058j461n24K1J4n1
$$ 1310481 1303296 1295155 1286527 1278210 1271614 1268113 1267625 1268305 1268127 1266555 1264497 1263036 1262512 1262533 1262547 1262496
61533A262496O05K205M018N072N203M977M865N134O452R586J4018J7629J8673
$$ 1262496 1263101 1265306 1269324 1274396 1279599 1284576 1289441 1294575 1301027 1310613 1324631 1342260 1360933
61520A360933J7797J7280J8326K0039K1312K2741K5678K9908L3488L5144L5845
$$ 1360933 1378730 1396010 1414336 1434375 1455687 1478428 1504106 1534014 1567502 1602646 1638491
61509A638491L7457M0483M3898M6800M9142N0740N0651M8439M5561M4361M5360
$$ 1638491 1675948 1716431 1760329 1807129 1856271 1907011 1957662 2006101 2051662 2096023 2141383
61498B141383M6435M5288M2240L9596L8500L7607L5344L2212K9877K8663K7376
$$ 2141383 2187818 2233106 2275346 2314942 2353442 2391049 2426393 2458605 2488482 2517145 2544521
61487B544521K5296K2867K0239J6655J1928P306L819Q26k714o238q350r126j0016
$$ 2544521 2569817 2592684 2612923 2629578 2641506 2648812 2652631 2653457 2650743 2644505 2636155 2627029 2617013
61474B617013j1394j1759r943o775l825j459Q94L436O103R503J4477K0768K7148
$$ 2617013 2605619 2593860 2583917 2577142 2573317 2571858 2572752 2576188 2582291 2591794 2606271 2627039 2654187
61461B654187L3034L9093M5901N2881N9228O5275P2246Q0856R0767J01400J12746
$$ 2654187 2687221 2726314 2772215 2825096 2884324 2949599 3021845 3102701 3193468 3294868 3407614
61450C407614J25122J38473J52211J65900J80032J95810K13796K32754K50430
$$ 3407614 3532736 3671209 3823420 3989320 4169352 4365162 4578958 4811712 5062142
61441E062142K65750K79719K93608L06686L16438L20626L18033L07291K86387
$$ 5062142 5327892 5607611 5901219 6207905 6524343 6844969 7163002 7470293 7756680
61432G756680K54248K12209J63184J09905N4667N8n1203r7135j36393j67589j89752
$$ 7756680 8010928 8223137 8386321 8496226 8550893 8550951 8499748 8402613 8266220 8098631 7908879
61421G908879k03735k11973k16340k16830k12850k04872j94021j80636j64388
$$ 7908879 7705144 7493171 7276831 7060001 6847151 6642279 6448258 6267622 6103234
61412F103234j45830j26831j09080r2707p6730o0532m4557k9621j5944k968R897
$$ 6103234 5957404 5830573 5721493 5628786 5552056 5491524 5446967 5417346 5401402 5398434 5408331
61401E408331K2478L4008M4171N3600O2928P1527P7883Q1495Q3798Q6566Q9760
$$ 5408331 5430809 5464817 5508988 5562588 5625516 5697043 5774926 5856421 5940219 6026785 6116545
61390F116545R1650R1067Q8802Q6466Q4561Q2259P8758P4271O9723O5932O3099
$$ 6116545 6208195 6299262 6388064 6474530 6559091 6641350 6720108 6794379 6864102 6930034 6993133
61379F993133O0726N7974N4467N0709M7320M3913L9287L2961K5968J9704J4477
$$ 6993133 7053859 7111833 7166300 7217009 7264329 7308242 7347529 7380490 7406458 7426162 7440639
61368G440639R621M761J76m021q366j3213j7852k1086k2751k4158k6560k9460
$$ 7440639 7450260 7455021 7455197 7451176 7442810 7429597 7411745 7390659 7367908 7343750 7317190 7287730
61356G287730l1095l0675k9490k9288l0007k9900k7784k4561k2339k2484k4519
$$ 7287730 7256635 7225960 7196470 7167182 7137175 7107275 7079491 7054930 7032591 7010107 6985588
61345F985588k6634k7356k7032k7348k9001l0443k9781k7317k4803k2510j8779
$$ 6985588 6958954 6931598 6904566 6877218 6848217 6817774 6787993 6760676 6735873 6713363 6694584
61334F694584j2560m472N333J8275L4893N3022P0223Q7009J05652J26619J48283
$$ 6694584 6682024 6677552 6682885 6701160 6736053 6789075 6859298 6946307 7051959 7178578 7326861
61323G326861J69792J92031K15544K39394K62587K85007L06168L24259L37206
$$ 7326861 7496653 7688684 7904228 8143622 8406209 8691216 8997384 9321643 9658849
61314I658849L43847L43471L35007L17142K88825K49739K01125J46217Q8742L0802
$$ 9658849 10002696 10346167 10681174 10998316 11287141 11536880 11738005 11884222 11972964 12003766
61304A2003766k6788q2232j32540j76221k14603k49361k79928l04549l22833l35695
$$ 12003766 11976978 11894746 11762206 11585985 11371382 11122021 10842093 10537544 10214711 9879016
61294I879016l43399l45326l41789l34647l25597l14610l00637k83457k64485
$$ 9879016 9535617 9190291 8848502 8513855 8188258 7873648 7573011 7289554 7025069
61285G025069k45777k28258k11004j92514j72732j53386j35921j19688j02898
$$ 7025069 6779292 6551034 6340030 6147516 5974784 5821398 5685477 5565789 5462891
61276E462891q5135o7954n2840l9416k6346j3480j920Q077J8048K9225M0220M8329
$$ 5462891 5377756 5309802 5256962 5217546 5191200 5177720 5175800 5183877 5201925 5231150 5271370 5319699
61264E319699N3114N7080O2276O7621P0723P1008O9571O6876O2573N7221N2190
$$ 5319699 5372813 5429893 5492169 5559790 5630513 5701521 5771092 5837968 5900541 5957762 6009952
61253F009952M7597M2069L5070K7937K2072J7355J2988Q615L872j932q830j5794
$$ 6009952 6057549 6099618 6134688 6162625 6184697 6202052 6215040 6223655 6227527 6225595 6216765 6200971
61241F200971k2185k8689l5964m3216m9203n4014n8820o4166o9288p3012p4769
$$ 6200971 6178786 6150097 6114133 6070917 6021714 5967700 5908880 5844714 5775426 5702414 5627645
61230E627645p4979p4701p4568p3989p1890o8260o4217o0518n7058n3851n1166
$$ 5627645 5552666 5477965 5403397 5329408 5257518 5189258 5125041 5064523 5007465 4953614 4902448
61219D902448m8404m4410l9540l5870l4561l4449l4271l4543l5832l6813l5985
$$ 4902448 4854044 4809634 4770094 4734224 4699663 4665214 4630943 4596400 4560568 4523755 4487770
61208D487770l4088l2817l1968k9966k6512k2454j7377r719M03J0587J8941K5959
$$ 4487770 4453682 4420865 4388897 4358931 4332419 4309965 4292588 4282869 4283272 4293859 4312800 4338759
61196D338759L3121M1157N0197O0345P1325Q2484R3517J04499J15063J24528J32730
$$ 4338759 4371880 4413037 4463234 4523579 4594904 4677388 4770905 4875404 4990467 5114995 5247725
61185E247725J39664J44277J44901J40934J32648J19265R8917P1072L7573O98
$$ 5247725 5387389 5531666 5676567 5817501 5950149 6069414 6168331 6239403 6276976 6277674
61175F277674l8263p7696j14505j45571j69512j86102j95166j97340j95020j90982
$$ 6277674 6239411 6161715 6047210 5901639 5732127 5546025 5350859 5153519 4958499 4767517
61165D767517j86152j79669j70805j59995j48400j37311j27703j19461j11329
$$ 4767517 4581365 4401696 4230891 4070896 3922496 3785185 3657482 3538021 3426692
61156C426692j02245r2468q2850p3566o4489n6167m9340m3696l8359l3359k9386
$$ 3426692 3324447 3231979 3149129 3075563 3011074 2954907 2905567 2861871 2823512 2790153 2760767
61145B760767k5981k1338j4560p183j689J011K055L202N544R153J3087J5705J5654
$$ 2760767 2734786 2713448 2698888 2691705 2690016 2691027 2693082 2696284 2701828 2710981 2724068 2739773 2755427
61132B755427J2897Q684M441P71k583o155j0140j4088j7146j8940k0294k2649
$$ 2755427 2768324 2777008 2781449 2782220 2779637 2773482 2763342 2749254 2732108 2713168 2692874 2670225
61120B670225k6433l0262l2300l2326l1998l2872l4680l5886l5545l4236l3314
$$ 2670225 2643792 2613530 2581230 2548904 2516906 2484034 2449354 2413468 2377923 2343687 2310373
61109B310373l3713l5359l7389l8821l9312l9273l9274l9456l9731m0236m1101
$$ 2310373 2276660 2241301 2203912 2165091 2125779 2086506 2047232 2007776 1968045 1927809 1886708
61098A886708m1953m2073m1107l9292l7025l4655l2567l0964k9431k7267k4543
$$ 1886708 1844755 1802682 1761575 1722283 1685258 1650603 1618036 1587072 1557641 1530374 1505831
61087A505831k2363k1757k2582k3865k4975k5976k6952k7371k6433k3931k0658
$$ 1505831 1483468 1461711 1439129 1415264 1390289 1364313 1337361 1309990 1283557 1259626 1238968
61076A238968j7767j5655j3650j0990p882n260l559k317j008K69J307K501M435
$$ 1238968 1221201 1205546 1191896 1180906 1173024 1167764 1164205 1161888 1160880 1161149 1162456 1164957 1169392
61063A169392O897Q928R891J0131J0430J1129J1978J2642J3024J3123J2861J2226
$$ 1169392 1176289 1185217 1195108 1205239 1215669 1226798 1238776 1251418 1264442 1277565 1290426 1302652
61051A302652J1553J1306J1472J1330J0187Q271O543N621N297N176N133M787L162
$$ 1302652 1314205 1325511 1336983 1348313 1358500 1366771 1373314 1378935 1384232 1389408 1394541 1399328 1402490
61038A402490k04m092o540p066p108q021r644j1191j2538j3599j3361j1008p750
$$ 1402490 1402286 1398194 1391654 1384588 1377480 1369459 1359815 1348624 1336086 1322487 1309126 1298118 1290368
61025A290368o112p125r250j0394r939q486o724n310m875n262n355m497l582l789
$$ 1290368 1284256 1277131 1267881 1257487 1247548 1239062 1232338 1227028 1222153 1216891 1211536 1207039 1203457 1199668
61011A199668m688m643k997r56q9n10q03M11K857M639M173K036K24l58m97n46
$$ 1199668 1194980 1190337 1187340 1186384 1186295 1185785 1184982 1185393 1188250 1192889 1197062 1199098 1199322 1198964 1198467 1197921
60995A197921O72L784P000Q049P188O573P158Q019Q641R990J2831J6376J9197
$$ 1197921 1198593 1202377 1209377 1217426 1224614 1231187 1238345 1246364 1255005 1264995 1277826 1294202 1313399
60982A313399K0666K1155K1489K2304K3393K3974K4164K5428K8660L2670L5918
$$ 1313399 1334065 1355220 1376709 1399013 1422406 1446380 1470544 1495972 1524632 1557302 1593220
60971A593220L8771M2312M5779M7547M8260N0511N5248O0806O5725P0328P5127
$$ 1593220 1631991 1674303 1720082 1767629 1815889 1866400 1921648 1982454 2048179 2118507 2193634
60960B193634P9988Q5359R2158R9863J06866J13193J20592J29468J38265J46456
$$ 2193634 2273622 2358981 2451139 2551002 2657868 2771061 2891653 3021121 3159386 3305842
60950C305842J55316J64955J73642J81370J91124K04978K21782K40244K61333
$$ 3305842 3461158 3626113 3799755 3981125 4172249 4377227 4599009 4839253 5100586
60941E100586K85823L12526L41052L73502M11660M55987N09166N76208O58030
$$ 5100586 5386409 5698935 6039987 6413489 6825149 7281136 7790302 8366510 9024540
60932I024540P49526Q47687R56911J082108J222677J379723J562976J781835K035541
$$ 9024540 9774066 10621753 11578664 12660772 13883449 15263172 16826148 18607983 20643524
60923B0643524K321351K637375K944786L121733K997163K482609J683829Q59012
$$ 20643524 22964875 25602250 28547036 31668769 34665932 37148541 38832370 39691382
60915C9691382K47488o2889j16458J0293K43276M58150M63367J04061n99958j440744
$$ 39691382 39938870 39875981 39759523 39769816 40013092 40471242 40934609 41038670 40438712 38997968
60905C8997968k162165k616435k802369k795356k672683k491033k290229k091268
$$ 38997968 36835803 34219368 31416999 28621643 25948960 23457927 21167698 19076430
60897A9076430j896446j702899j514382j337260j172943j021151q85719p70906
$$ 19076430 17179984 15477085 13962703 12625443 11452500 10431349 9545630 8774724
60889H774724o75163n93718n24414m66662m17709l74820l38576l09616k84418
$$ 8774724 8099561 7505843 6981429 6514767 6097058 5722238 5383662 5074046 4789628
60880D789628k58727k33066k10491j90950j72517j56409j45710j39817j34778
$$ 4789628 4530901 4297835 4087344 3896394 3723877 3567468 3421758 3281941 3147163
60871C147163j28693j22642j16625j09065j00556r4000r0177q6581q1430p5778
$$ 3147163 3018470 2895828 2779203 2670138 2569582 2475582 2385405 2298824 2217394 2141616
60861B141616p0961o6728o2761n9541n6925n3928n0530m7814m6079m4618m3381
$$ 2141616 2070655 2003927 1941166 1881625 1824700 1770772 1720242 1672428 1626349 1581731 1538350
60850A538350m2769m1869l9233l5468l2691l1269k9526k6898k4770k3645k2148
$$ 1538350 1495581 1453712 1414479 1379011 1346320 1315051 1285525 1258627 1233857 1210212 1188064
60839A188064j9707j7855j7663j7969j7443j6490j5734j4279j1187p579n550n500
$$ 1188064 1168357 1150502 1132839 1114870 1097427 1080937 1065203 1050924 1039737 1032158 1026608 1021108
60827A021108n778m828k877j346r42p07N76K302K489Q69j35J208L075K617J75
$$ 1021108 1015330 1010502 1007625 1006279 1005337 1004630 1005206 1007508 1009997 1010866 1010731 1011939 1015014 1017631 1017806
60812A017806j492j514j688l011m197m188l806m049m683n208n599n543m583l320
$$ 1017806 1016314 1014800 1013112 1010101 1005904 1001716 997910 993861 989178 983970 978371 972828 968245 964925
60798I64925k782k314j24L702O851Q036Q455R280R985J0182J0939J2719J4002
$$ 964925 962143 959829 959705 963407 970258 978294 986749 996029 1006014 1016196 1027135 1039854 1053856
60785A053856J3572J2481J2178J2194J1483J0638J0898J1831J1840J0339Q064
$$ 1053856 1067428 1079909 1092087 1104281 1115764 1126402 1137300 1149131 1160971 1171310 1179374
60774A179374N855M397M351N361N720M331K374J600J819J559N44k48n67j041j439
$$ 1179374 1185229 1189626 1193977 1199338 1205058 1209389 1211763 1213363 1215182 1216741 1217285 1217037 1216470 1215429 1213990
60759A213990o57J174K260J548K82J13P22L96j402l331m141m309n070o393o960
$$ 1213990 1213333 1214507 1216767 1218315 1218597 1218710 1219432 1219828 1218426 1215095 1210954 1206645 1201575 1195182 1188222
60744A188222o188n292n800p716r838j1282j1821j1288r831q451q023p869o619
$$ 1188222 1182034 1176742 1170942 1163226 1153388 1142106 1130285 1118997 1109166 1100715 1092692 1084823 1078204
60731A078204m471l098l020k620o16J884K865K079J188J656L406N239O148O357
$$ 1078204 1073733 1070635 1067615 1064995 1064379 1066263 1069128 1071207 1072395 1074051 1077457 1082696 1088844 1095201
60717A095201P181R404J1967J3155J3039J3389J4994J6621J7227J7599J8613J9297
$$ 1095201 1102382 1111786 1123753 1136908 1149947 1163336 1178330 1194951 1212178 1229777 1248390 1267687
60705A267687J8270J6207J5270J6297J7950J8574J7804J6235J4406J2371R900
$$ 1267687 1285957 1302164 1317434 1333731 1351681 1370255 1388059 1404294 1418700 1431071 1440971
60694A440971P058M567L119K277R14r82k023j582j056j843l144l280k526k881
$$ 1440971 1448029 1452596 1455715 1457992 1458906 1457924 1455901 1454319 1453263 1451420 1448276 1444996 1442470 1439589
60680A439589n118p692q949r017q948r068r121r275j0080j1395j2164j1530r910
$$ 1439589 1434471 1426779 1417830 1408813 1399865 1390797 1381676 1372401 1362321 1350926 1338762 1327232 1317322
60667A317322q645q603r359r890r624q532o652m225k121j159r65l03J223K699
$$ 1317322 1308677 1300074 1290715 1280825 1271201 1262669 1256017 1251792 1249671 1248512 1247547 1247244 1248467 1251166
60653A251166L296L263L149L027L116M135O207Q099Q466P428O179N351M562L219
$$ 1251166 1254462 1257725 1260874 1263901 1267017 1271152 1277359 1285458 1293924 1301352 1307531 1312882 1317444 1320663
60639A320663J143j319l387m361m449m613n350o214o920p910r238r885r173q097
$$ 1320663 1321806 1320487 1317100 1312739 1308290 1303677 1298327 1292113 1285193 1277283 1268045 1258160 1248987 1240890
60625A240890q056q931r591r831j0439j1552j2338j2445j2580j3294j4098j4167
$$ 1240890 1232834 1223903 1214312 1204481 1194042 1182490 1170152 1157707 1145127 1131833 1117735 1103568
60613A103568j3320j2005j0798j0079r756r220p880n819l695k091j176p43l07
$$ 1103568 1090248 1078243 1067445 1057366 1047610 1038390 1030510 1024691 1020996 1018905 1017729 1016986 1016679
60600A016679N82J840K977L935N262P025Q342Q649Q713R566J0890J1508J1096
$$ 1016679 1017261 1019101 1022078 1026013 1031275 1038300 1046642 1055291 1064004 1073570 1084460 1095968 1107064
60587A107064J0379R853R349Q790Q391P993O985N194L279K153K385L884N654O196
$$ 1107064 1117443 1127296 1136645 1145435 1153826 1161819 1168804 1173998 1177277 1179430 1181815 1185699 1191353 1197549
60573A197549M943L139K502L254M188M475M428M604N193O357Q132R917J0891J1172
$$ 1197549 1202492 1205631 1208133 1211387 1215575 1220050 1224478 1229082 1234275 1240632 1248764 1258681 1269572 1280744
60559A280744J1622J2412J2747J2275J1873J2489J3976J5438J6080J5379J3205
$$ 1280744 1292366 1304778 1317525 1329800 1341673 1354162 1368138 1383576 1399656 1415035 1428240
60548A428240J0305Q021O912O083M279J187k715o925j0901j3755j4807j4468j4019
$$ 1428240 1438545 1446566 1453478 1459561 1463840 1465027 1462312 1455387 1444486 1430731 1415924 1401456 1387437
60535A387437j4375j5184j5211j3599j0941q961q849r882j0186q845o703m998
$$ 1387437 1373062 1357878 1342667 1329068 1318127 1309166 1300317 1290435 1280249 1271404 1264701 1259703
60523A259703l790k264k9K349L924M146L262K208J902K374K835K699K175J750
$$ 1259703 1255913 1253649 1253620 1255969 1259893 1264039 1267301 1269509 1271411 1273785 1276620 1279319 1281494 1283244
60509A283244J563J657K233L152L688L568L866N853Q962J0953J0536Q948Q302
$$ 1283244 1284807 1286464 1288697 1291849 1295537 1299105 1302971 1308824 1317786 1328739 1339275 1348223 1356525
60496A356525R022R887J0140J0419J1387J2561J3131J3255J3796J5124J6826J8386
$$ 1356525 1365547 1375434 1385574 1395993 1407380 1419941 1433072 1446327 1460123 1475247 1492073 1510459
60484A510459J9524K0082K0257K0863K2662K5453K8407L1184L3868L5900L6145
$$ 1510459 1529983 1550065 1570322 1591185 1613847 1639300 1667707 1698891 1732759 1768659 1804804
60473A804804L4263L0959K6402J9617J0204k80r714j7396k3512k7418k8002k5704
$$ 1804804 1839067 1870026 1896428 1916045 1926249 1925969 1916255 1898859 1875347 1847929 1819927 1794223
60461A794223k2668k0443j8479j5430j1088o490k499J039M780Q721J1864J3291
$$ 1794223 1771555 1751112 1732633 1717203 1706115 1699625 1697126 1698165 1702945 1711666 1723530 1736821
60449A736821J3602J4649J7561K1641K5747K9968L4994M0605M6080N1766N8694
$$ 1736821 1750423 1765072 1782633 1804274 1830021 1859989 1894983 1935588 1981668 2033434 2092128
60438B092128O6568P3803P9976Q6770R5696J05874J15059J22097J27681J33475
$$ 2092128 2158696 2232499 2312475 2399245 2494941 2600815 2715874 2837971 2965652 3099127
60428C099127J41321J52456J66531J81914J97998K16539K39451K65514K90439
$$ 3099127 3240448 3392904 3559435 3741349 3939347 4155886 4395337 4660851 4951290
60419D951290L09812L20388L18411K98893K58282J97468J21229L5375n4340j41179
$$ 4951290 5261102 5581490 5899901 6198794 6457076 6654544 6775773 6811148 6756808 6615629
60409F615629k17480k77185l18078l41254l49172l44806l31788l13785k93231
$$ 6615629 6398149 6120964 5802886 5461632 5112460 4767654 4435866 4122081 3828850
60400C828850k71158k48276k25524k03457j82159j62268j45255j31805j20461
$$ 3828850 3557692 3309416 3083892 2880435 2698276 2536008 2390753 2258948 2138487
60391B138487j08904r6482q4680p5056o7623o1318n5277m9274m3510l8473l4609
$$ 2138487 2029583 1933101 1848421 1773365 1705742 1644424 1589147 1539873 1496363 1457890 1423281
60380A423281l1721k9049k6213k3738k2241k1375k0066j7761j5029j2971j2268
$$ 1423281 1391560 1362511 1336298 1312560 1290319 1268944 1248878 1231117 1216088 1203117 1190849
60369A190849j2636j3022j2460j1114j0317j1156j3000j4065j3465j2075j0969
$$ 1190849 1178213 1165191 1152731 1141617 1131300 1120144 1107144 1093079 1079614 1067539 1056570
60358A056570r766p398m157j756j100j096l21R92J550R61J7o20q34k34J725M360
$$ 1056570 1046804 1039406 1035249 1033493 1032393 1031297 1030976 1031968 1033518 1034479 1034496 1033876 1033042 1032808 1034533 1038893
60342A038893N753M910L132K500L572N321O697P422P553P266P009P167P537P589
$$ 1038893 1044646 1049556 1052688 1055188 1058760 1064081 1070778 1078200 1085753 1093019 1100028 1107195 1114732 1122321
60328A122321P161O466N698N066M957N430N826N453M505L636K865J698J62j089
$$ 1122321 1129482 1135948 1141646 1146712 1151669 1157099 1162925 1168378 1172883 1176519 1179384 1181082 1181244 1180155
60314A180155j762k257k837l188l015k518j983j413p60o7P48J789K708K930K617
$$ 1180155 1178393 1176136 1173299 1170111 1167096 1164578 1162595 1161182 1160422 1160355 1161103 1162892 1165600 1168530 1171147
60299A171147K800M119N848O670O273N656N970P410R295J0953J2286J3531J4778
$$ 1171147 1173947 1178066 1183914 1190584 1196857 1202513 1208483 1215893 1225188 1236141 1248427 1261958 1276736
60286A276736J5932J6994J7912J8165J7120J5068J3367J2968J3273J3093J2334
$$ 1276736 1292668 1309662 1327574 1345739 1362859 1377927 1391294 1404262 1417535 1430628 1442962
60275A442962J1900J2212J2808J3461J4629J6422J7970J8330J7573J6395J4982
$$ 1442962 1454862 1467074 1479882 1493343 1507972 1524394 1542364 1560694 1578267 1594662 1609644
60264A609644J2665Q603K630m292j0461j4681j7253j9327k1250k2175k1542k0179
$$ 1609644 1622309 1630912 1633542 1629250 1618789 1604108 1586855 1567528 1546278 1524103 1502561 1482382
60252A482382j9327j9014j8141j6031j3240j0772q995p571o157m916m326m518
$$ 1482382 1463055 1444041 1425900 1409869 1396629 1385857 1376862 1369291 1363134 1358218 1353892 1349374
60240A349374m838m288k616r21p35k321m137m301k563m57N55O04P52J343J691
$$ 1349374 1344536 1340248 1337632 1336711 1335976 1333655 1329518 1325217 1322654 1322197 1322752 1323356 1324108 1325451 1327142
60225A327142J284N13J42O83K420N234Q111R708R971J0456J2297J4520J5356J4735
$$ 1327142 1328426 1328939 1329081 1329764 1332184 1337418 1345529 1355237 1365208 1375664 1387961 1402481 1417837 1432572
60211A432572J4363J5474J7544J9260J9835J9297J8364J8218J9596K1735K3012
$$ 1432572 1446935 1462409 1479953 1499213 1519048 1538345 1556709 1574927 1594523 1616258 1639270
60200A639270K2960K2959K4411K6909K8791K9293K9445L0926L4361L8880M3098
$$ 1639270 1662230 1685189 1709600 1736509 1765300 1794593 1824038 1854964 1889325 1928205 1971303
60189A971303M6465M9593N3358N7926O2928O8358P4836Q2858R1990J01072J09185
$$ 1971303 2017768 2067361 2120719 2178645 2241573 2309931 2384767 2467625 2559615 2660687 2769872
60178B769872J16433J23711J31716J40328J49144J58125J67121J75017J80400
$$ 2769872 2886305 3010016 3141732 3282060 3431204 3589329 3756450 3931467 4111867
60169D111867J83045J83770J82610J78443J70875J60999J49435J35100J17364
$$ 4111867 4294912 4478682 4661292 4839735 5010610 5171609 5321044 5456144 5573508
60160E573508R8050P9491O1555M2673K3168N273r977k3491l5474m4239m8384m8432
$$ 5573508 5671558 5751049 5812604 5855277 5878445 5883718 5873741 5850250 5814776 5770537 5722153 5673721
60148E673721m5547m0136l2443k2983j1658K113J7674L3114M7806O3306Q0622
$$ 5673721 5628174 5588038 5555595 5532612 5520954 5523067 5540741 5573855 5621661 5684967 5765589
60137E765589R8124J13652J27384J40915J54285J65551J72817J75399J73535J67908
$$ 5765589 5863713 5977365 6104749 6245664 6399949 6565500 6738317 6913716 7087251 7255159
60127G255159J59041J46237J28057J04808P9469N4695L0031L800k3172m7992o9390
$$ 7255159 7414200 7560437 7688494 7793302 7872771 7927466 7957497 7961297 7938125 7890133 7820743
60116G820743q8477j05617j18875j26353j28305j25895j19536j09594r7419q4129
$$ 7820743 7732266 7626649 7507774 7381421 7253116 7127221 7007685 6898091 6800672 6716543
60106F716543o9194n1520l1561j1073Q923K8722M8388O6656Q1883R3442J01800
$$ 6716543 6647349 6595829 6564268 6553195 6562118 6590840 6639228 6705884 6787767 6881209 6983009
60095F983009J07437J10136J09147J03931R4795Q3027P0247N7414M4504L1439
$$ 6983009 7090446 7200582 7309729 7413660 7508455 7591482 7661729 7719143 7763647 7795086
60085G795086J9200R578L707J342K025O344J5295K8667M5092O3846Q5449J10119
$$ 7795086 7814286 7823864 7827571 7828913 7830938 7837282 7852577 7881244 7926336 7990182 8075631 8185750
60073H185750J36626J63587J91048K19722K49148K78112L06813L37163L70222
$$ 8185750 8322376 8485963 8677011 8896733 9145881 9423993 9730806 10067969 10438191
60064A0438191M04372M36927M66842M94620N19847N40226N53517N59273N57698
$$ 10438191 10842563 11279490 11746332 12240952 12760799 13301025 13854542 14413815 14971513
60055A4971513N47614N27098M96007M56288M09249L53977K89646K18171J42983
$$ 14971513 15519127 16046225 16542232 16998520 17407769 17761746 18051392 18269563 18412546
60046A8412546O5716j4081r5817j76142k50854l17243l74038m20182m54602m76523
$$ 18412546 18478262 18464181 18368364 18192222 17941368 17624125 17250087 16829905 16375303 15898780
60036A5898780m85466m81628m66661m43254m13417l77903l37625k94424k49803
$$ 15898780 15413314 14931686 14465025 14021771 13608354 13230451 12892826 12598402 12348599
60027A2348599k04155j58327j14681p5162l9202n326K5569N0312O6903P6289Q0271
$$ 12348599 12144444 11986117 11871436 11796274 11757072 11751746 11777315 11827627 11894530 11970819 12051090
60016A2051090P9014P1387N7086L7707J5909o305k8726n2340p7363j02343j25761
$$ 12051090 12130104 12201491 12258577 12296284 12312193 12305888 12277162 12224822 12147459 12045116 11919355
60005A1919355j47836j69612j90458k07996k20840k30133k37599k42990k44434
$$ 11919355 11771519 11601907 11411449 11203453 10982613 10752480 10514881 10271891 10027457
59996A0027457k40794k32818k22082k09436j94694j77426j57798j36511j13952
$$ 10027457 9786663 9553845 9331763 9122327 8927633 8750207 8592409 8455898 8341946
59987H341946q9812o3912l7118j0735J4909M0408O5684Q9433J10706J30141J48536
$$ 8341946 8252134 8188222 8151104 8140369 8155278 8195686 8261370 8350803 8461509 8591650 8740186
59976H740186J64633J75586J79744J77974J71712J60664J43365J19647R1476O1134
$$ 8740186 8904819 9080405 9260149 9438123 9609835 9770499 9913864 10033511 10124987 10186121
59966A0186121K9390m099l9110p4167j07323j36974j62043j81884j96247k05137
$$ 10186121 10215511 10211412 10172302 10098135 9990812 9853838 9691795 9509911 9313664 9108527
59956I108527k08579k06746k00213j89802j76050j58946j38311j14473q8698o2785
$$ 9108527 8899948 8693202 8492989 8303187 8127137 7968191 7829880 7715407 7626709 7563924
59946G563924l7783j3056J2729L9547O5743R0379J14778J40712J67659J93175
$$ 7563924 7526141 7513085 7525814 7565361 7631104 7721483 7836261 7976973 8144632 8337807
59936H337807K15564K34700K50367K61359K66390K64562K54709K35994K09658
$$ 8337807 8553371 8788071 9038438 9299797 9566187 9830749 10085458 10321452 10531110
59927A0531110J78726J45043J07994O7048K4218j7366n6305r2977j27344j58013
$$ 10531110 10709836 10854879 10962873 11029921 11054139 11036773 10980468 10887491 10760147 10602134
59917A0602134j83120k01115k11003k12874k08071j98051j83239j63543j39509
$$ 10602134 10419014 10217899 10006896 9794022 9585951 9387900 9204661 9041118 8901609
59908H901609j12374q3319n3289k3199O129L3843N8897Q0822J00831J20778J40421
$$ 8901609 8789235 8705916 8652627 8629428 8635557 8669400 8728297 8809119 8909950 9030728 9171149
59897I171149J57225J69620J78734J85668J88933J86777J80554J73192J65073
$$ 9171149 9328374 9497994 9676728 9862396 10051329 10238106 10418660 10591852 10756925
59888A0756925J54156J40045J25340J12549J01920R2954Q6155Q2391Q2121Q6004
$$ 10756925 10911081 11051126 11176466 11289015 11390935 11483889 11570044 11652435 11734556 11820560
59878A1820560R4991J09205J27938J51233J80078K14346K51972K90998L31178
$$ 11820560 11915551 12024756 12152694 12303927 12484005 12698351 12950323 13241321 13572499
59869A3572499L72678M14194M53234M87341N14071N30667N34788N25150N00718
$$ 13572499 13945177 14359371 14812605 15299946 15814017 16344684 16879472 17404622 17905340
59860A7905340M59888M01390L25891K36189J36090K9628p8757j83750k79429l60797
$$ 17905340 18365228 18766618 19092509 19328698 19464788 19494416 19415659 19231909 18952480 18591683
59850A8591683m25732m75003n09609n28788n31842n21277n02011m77158m46302
$$ 18591683 18165951 17690948 17181339 16652551 16120709 15599432 15097421 14620263 14173961
59841A4173961m08506l65132l18786k71137k23162j76129j30729q6234m2044N42
$$ 14173961 13765455 13400323 13081537 12810400 12587238 12411109 12280380 12194146 12152102 12152644
59831A2152644L9673P5355J08762J39249J63760J79573J86365J85007J75301J55656
$$ 12152644 12192317 12267672 12376434 12515683 12679443 12859016 13045381 13230388 13405689 13561345
59821A3561345J24612Q2252L0395k8145r0376j53289k13596k68022l14417l52410
$$ 13561345 13685957 13768209 13798604 13770459 13680083 13526794 13313198 13045176 12730759 12378349
59811A2378349l82621m05261m19651m24921m21177m10307l95414l78752l60072
$$ 12378349 11995728 11590467 11170816 10745895 10324718 9914411 9518997 9140245 8780173
59802H780173l37832l12114k85330k59629k34929k10386j86518j64314j43199
$$ 8780173 8442341 8130227 7844897 7585268 7350339 7139953 6953435 6789121 6645922
59793F645922j21892j01164q3728p0935o1302n3127m7043m4571m5119m6066m5664
$$ 6645922 6524030 6422866 6339138 6268203 6206901 6153774 6106731 6062160 6017041 5970975 5925311
59782E925311m4458m3615m3055m1875l9819l7581l6069l6055l8223m2624m7999
$$ 5925311 5880853 5837238 5794183 5752308 5712489 5674908 5638839 5602784 5564561 5521937 5473938
59771E473938n2642n6310o0593o6600p2763p5940p4691p0505o5577o0256n3496
$$ 5473938 5421296 5364986 5304393 5237793 5165030 5089090 5014399 4943894 4878317 4818061 4764565
59760D764565m5250l7340l1668k8249k5416k1627j6520j0385l313M738J3567K2954
$$ 4764565 4719315 4681975 4650307 4622058 4596642 4575015 4558495 4548110 4544797 4549535 4563102 4586056
59748D586056L3064M4059N5319O5652P4352Q1561Q7610R2571R6525R9350J00008
$$ 4586056 4619120 4663179 4718498 4784150 4858502 4940063 5027673 5120244 5216769 5316119 5416127
59737E416127R7049R0476Q2311P4605O7573O0491N3578M7949M4219M2440M3075
$$ 5416127 5513176 5603652 5685963 5760568 5828141 5888632 5942210 5990159 6034378 6076818 6119893
59726F119893M6802N3425O2161P2855Q5897J01032J17578J35789J56654J80057
$$ 6119893 6166695 6220120 6282281 6355136 6441033 6542065 6659643 6795432 6952086 7132143
59716G132143K04552K29447K55908K85258L17227L50622L84852M19700M54158
$$ 7132143 7336695 7566142 7822050 8107308 8424535 8775157 9160009 9579709 10033867
59707A0033867M86107N12548N29050N28942N04107M47776L58043K40318J07072
$$ 10033867 10519974 11032522 11561572 12090514 12594621 13042397 13400440 13640758 13747830
59698A3747830k5704j43526k37009l02751l42346l60359l61671l49693l26880
$$ 13747830 13722126 13578600 13341591 13038840 12696494 12336135 11974464 11624771 11297891
59689A1297891k96296k61446k24485j85774j45716j06097o8977l4887k672K9347
$$ 11297891 11001595 10740149 10515664 10329890 10184174 10078077 10009100 9974213 9971541 10000888
59679A0000888O2242R5897J29143J60894J91403K22072K54079K87646L22363L57495
$$ 10000888 10063130 10159027 10288170 10449064 10640467 10862539 11116618 11404264 11726627 12084122
59669A2084122L92371M27525M65184N07312N53266O00868O49593P00927P55368
$$ 12084122 12476493 12904018 13369202 13876514 14429780 15030648 15680241 16381168 17136536
59660A7136536Q11161Q66737R22280R77719J030963J079529J122283J157883J182912
$$ 17136536 17947697 18814434 19736714 20714433 21745396 22824925 23947208 25105091 26288003
59651B6288003J193535J188425J168719J136203J093454J045050R96644R52692
$$ 26288003 27481538 28669963 29838682 30974885 32068339 33113389 34110033 35062725
59643C5062725R15837Q87507Q67286Q52142Q37985Q21872Q01411P72736P31158
$$ 35062725 35978562 36866069 37733355 38585497 39423482 40245354 41046765 41819501 42550659
59634D2550659O74054O01838N16362M20128L17011K11837J08683J1022p6327j47281
$$ 42550659 43224713 43826551 44342913 44763041 45080052 45291889 45400572 45411594 45335267 45187986
59624D5187986j97583k26788k36574k28250k02580j60764j04261l4125M8584J41930
$$ 45187986 44990403 44763615 44527041 44298791 44096211 43935447 43831186 43797061 43845645 43987575
59614D3987575K43180L49591M58892N69308O79253P86484Q87318R76910J050250
$$ 43987575 44230755 44580346 45039238 45608546 46287799 47074283 47961601 48938511 49988761
59605D9988761J102378J127658J119632J071906R79135Q37793O47460M12249J40992
$$ 49988761 51091139 52218797 53338429 54410335 55389470 56227263 56874723 57286972 57427964
59596E7427964j53656m55952p48190j013710j240686j423169j558869j647201
$$ 57427964 57274308 56818356 56070166 55056456 53815770 52392601 50833732 49186531
59588D9186531j689962j692396j661990j606164j531653j445628j356285j272222
$$ 49186531 47496569 45804173 44142183 42536019 41004366 39558738 38202453 36930231
59580C6930231j201680j152225j129862j136793j168922j215383j261717j295130
$$ 36930231 35728551 34576326 33446464 32309671 31140749 29925366 28663649 27368519
59572B7368519j308241j299110j269323j222723j164618j099924j031338r59983
$$ 27368519 26060278 24761168 23491845 22269122 21104504 20004580 18973242 18013259
59564A8013259q87705q17487p51453o89745o31903n78094n28304m81600m37331
$$ 18013259 17125554 16308067 15556614 14866869 14234966 13656872 13128568 12646968 12209637
59555A2209637l96230l59284l26189k96002k68598k44293k22575k02661j85071
$$ 12209637 11813407 11454123 11127934 10831932 10563334 10319041 10096466 9893805 9708734
59546I708734j71214j61432j54686j50315j48654j49594j51791j53989j56024
$$ 9708734 9537520 9376088 9221402 9071087 8922433 8772839 8621048 8467059 8311035
59537H311035j57875j58818j58368j57182j55878j53573j48688j40898j31290
$$ 8311035 8153160 7994342 7835974 7678792 7522914 7369341 7220653 7079755 6948465
59528F948465j20855j09823r8348q6773p5189o3643n2790m3359l4790k5415j4477
$$ 6948465 6827610 6717787 6619439 6532666 6457477 6393834 6341044 6297685 6262895 6237480 6223003
59517F223003l139O866J4921K1518K7412L3325L9809M6731N3313N9168O4773P0480
$$ 6223003 6219864 6226730 6241651 6263169 6290581 6323906 6363715 6410446 6463759 6522927 6587700 6658180
59505F658180P5771Q0164Q4365Q9811R7317J06702J17277J28269J39214J50504
$$ 6658180 6733951 6814115 6898480 6988291 7085608 7192310 7309587 7437856 7577070 7727574
59495G727574J63145J77501J92937K09042K26294K44912K64053K83128L02764
$$ 7727574 7890719 8068220 8261157 8470199 8696493 8941405 9205458 9488586 9791350
59486I791350L23236L42946L59996L74428L87060L96767M01156L99774L94600
$$ 9791350 10114586 10457532 10817528 11191956 11579016 11975783 12376939 12776713 13171313
59477A3171313L87007L76071L59982L37218L06239K66554K21267J76513J36812
$$ 13171313 13558320 13934391 14294373 14631591 14937830 15204384 15425651 15602164 15738976
59468A5738976J01970O9402L7978Q506j7998m0738n8553p0406p6144p5922o9366
$$ 15738976 15840946 15910348 15948326 15956832 15938834 15898096 15839543 15769137 15692993 15617071 15547705
59457A5547705n5979l5748q871K4236O2054J01995J41957J80864K17040K47133
$$ 15547705 15491726 15455978 15447107 15471343 15533397 15635392 15777349 15958213 16175253 16422386
59447A6422386K67501K75653K69697K47806K09401J55936Q9619J2461p2436j60117
$$ 16422386 16689887 16965540 17235237 17483043 17692444 17848380 17937999 17950460 17878024 17717907
59437A7717907k45648l25739l97389m56547n00148n28477n43671n46683n37629
$$ 17717907 17472259 17146520 16749131 16292584 15792436 15263959 14720288 14173605 13635976
59428A3635976n18272m91851m60557m25077l86649l47439l08689k70083k31411
$$ 13635976 13117704 12625853 12165296 11740219 11353570 11006131 10697442 10427359 10195948
59419A0195948j93464j56873j21367q6591n2717j9924J1955M3124P3782J04213
$$ 10195948 10002484 9845611 9724244 9637653 9584936 9565012 9576967 9620091 9693873 9798086
59409I798086J34137J62332J87824K11067K32768K51910K66263K74624K77129
$$ 9798086 9932223 10094555 10282379 10493446 10726214 10978124 11244387 11519011 11796140
59400A1796140K73297K61317K39705K08597J68952J21513O7111P465n4724j16301
$$ 11796140 12069437 12330754 12570459 12779056 12948008 13069521 13136632 13144097 13089373 12973072
59390A2973072j74507k27725k75333l16578l50174l75310l92269m01423m02776
$$ 12973072 12798565 12570840 12295507 11978929 11628755 11253445 10861176 10459753 10056977
59381A0056977l97339l87772l76250l62577l45881l27139l08221k89211k68874
$$ 10056977 9659638 9271866 8895616 8533039 8187158 7860019 7551798 7262587 6993713
59372F993713k47453k26943k08547j91690j75654j60410j45634j30638j15527
$$ 6993713 6746260 6519317 6310770 6119080 5943426 5783016 5637382 5506744 5391217
59363E391217j01083q7394p4048o1526n0809m1533l2214k2364j2786l834M959
$$ 5391217 5290134 5202740 5128692 5067166 5016357 4974824 4942610 4920246 4907460 4903626 4908585
59352D908585J3581K1701K9751L7600M2292M0025L1190K1002J4344J2221J3867
$$ 4908585 4922166 4943867 4973618 5011218 5053510 5093535 5124725 5145727 5160071 5172292 5186159
59341E186159J9240K7839L7812M8427O1100P5557Q7017R0539Q7418Q4444Q6949
$$ 5186159 5205399 5233238 5271050 5319477 5380577 5456134 5543151 5633690 5721108 5805552 5892501
59330E892501R4851J05409J17330J31157J47341J65462J84993K06052K28980K53405
$$ 5892501 5987352 6092761 6210091 6341248 6488589 6654051 6839044 7045096 7274076 7527481
59320G527481K78283L03455L30633L61695L96173M31908M68366N07511N50758
$$ 7527481 7805764 8109219 8439852 8801547 9197720 9629628 10097994 10605505 11156263
59311A1156263N96906O44107O91992P40198P86306Q27262Q61803Q89376R07261
$$ 11156263 11753169 12397276 13089268 13829466 14615772 15443034 16304837 17194213 18101474
59302A8101474R11231Q99369Q73572Q37022P91778P39285O81695O21575N60908
$$ 18101474 19012705 19912074 20785646 21622668 22414446 23153731 23835426 24457001 25017909
59293B5017909N00950M42463L85302L28102K68870K05950J38152O4120j7839j08779
$$ 25017909 25518859 25961322 26346624 26674726 26943596 27149546 27287698 27351818 27333979 27225200
59283B7225200k07798l11912m17303n20471o18037p06165p81160q40611q83610
$$ 27225200 27017402 26705490 26288187 25767716 25149679 24443514 23662354 22821743 21938133
59274B1938133r10156r21110r18396r04288q80448q48333q10026p67447p20994
$$ 21938133 21027977 20106867 19188471 18284183 17403735 16555402 15745376 14977929 14256935
59265A4256935o70567o18200n67969n22486m80653m39739l98772l59062l22230
$$ 14256935 13586368 12968168 12400199 11877713 11397060 10957321 10558549 10199487 9877257
59256I877257k88771k58177k29673k02816j77544j53698j30989j09945r2133p8183
$$ 9877257 9588486 9330309 9100636 8897820 8720276 8566578 8435589 8325644 8233511 8155328
59246H155328o6101n3188l9537k7755j9111j1900m228L535R960J4531J7302J8136
$$ 8155328 8089227 8036039 7996502 7968747 7949636 7937736 7933508 7937043 7947003 7961534 7978836 7996972
59234G996972J7471J6646J6491J6688J7275J9242K2717K6165K8807L2297L8518
$$ 7996972 8014443 8031089 8047580 8064268 8081543 8100785 8123502 8149667 8178474 8210771 8249289
59223H249289M7059N6440O6408P7128Q7173R4580R9586J04474J10915J18833J27441
$$ 8249289 8296348 8352788 8419196 8496324 8583497 8678077 8777663 8882137 8993052 9111885 9239326
59212I239326J35789J42515J46570J48146J47596J43549J33548J16708R4677O9738
$$ 9239326 9375115 9517630 9664200 9812346 9959942 10103491 10237039 10353747 10448424 10518162
59202A0518162M2980J4663j4409m2418o7443q8647j06500j21490j32982j40042
$$ 10518162 10561142 10575805 10561396 10518978 10451535 10362888 10256388 10134898 10001916 9861874
59192I861874j43117j43692j42332j38500j32478j25741j18897j11154j02739
$$ 9861874 9718757 9575065 9432733 9294233 9161755 9036014 8917117 8805963 8703224
59183H703224r5832r1743q8835q4916q0090p5491p0624o4247n6840m9891m3188
$$ 8703224 8607392 8515649 8426814 8341898 8261808 8186317 8115693 8051446 7994606 7944715 7901527
59172G901527l4993k4571j2706K64J5154L2574N2137P3026R4514J16393J39823
$$ 7901527 7866534 7841963 7829257 7829521 7844675 7877249 7929386 8002412 8096926 8213319 8353142
59161H353142J66965J98517K32336K65806K98865L33326L69875M07138M42869
$$ 8353142 8520107 8718624 8950960 9216766 9515631 9848957 10218832 10625970 11068839
59152A1068839M74497M99195N15068N21675N18052N01144M67872M17809L52017
$$ 11068839 11543336 12042531 12557599 13079274 13597326 14098470 14566342 14984151 15336168
59143A5336168K70732J74863O9083l9568j46216k48959l45276m30414m99926n51833
$$ 15336168 15606900 15781763 15850846 15811278 15665062 15416103 15070827 14640413 14140487 13588654
59133A3588654n86093o04020o08424o02155n86175n60941n29453m96262m63134
$$ 13588654 13002561 12398541 11790117 11187962 10601787 10040846 9511393 9015131 8551997
59124H551997m28586l92473l58001l27684k99970k72091k44231k18758j96694
$$ 8551997 8123411 7730938 7372937 7045253 6745283 6473192 6228961 6010203 5813509
59115E813509j77249j59836j44434j30257j15991j01407q7641p5666o5313n5765
$$ 5813509 5636260 5476424 5331990 5201733 5085742 4984335 4896694 4821028 4755715 4699950
59105D699950m6476l7576k9600k2621j5757q050J72P575J3548J8814K4186K9615
$$ 4699950 4653474 4615898 4586298 4563677 4547920 4539870 4540042 4547617 4561165 4579979 4604165 4633780
59093D633780L4827L9940M5043M9788N3855N7215N9800O1452O2326O2713O2503
$$ 4633780 4668607 4708547 4753590 4803378 4857233 4914448 4974248 5035700 5098026 5160739 5223242
59082E223242O1449N9726N7407N3658M7605L9940L2493K6185K0481J4839R493
$$ 5223242 5284691 5344417 5401824 5455482 5503087 5543027 5575520 5601705 5622186 5637025 5646518
59071E646518M689L31l445o348q596j0357j0730q657m688l84M041R804J7197K5043
$$ 5646518 5651207 5651538 5648093 5641745 5633149 5622792 5612062 5603405 5598717 5598333 5602374 5612178 5629375 5654418
59057E654418L2806M1412N1387O1872P2129Q2309R2192J01006J09396J19505J31945
$$ 5654418 5687224 5728636 5780023 5841895 5914024 5996333 6088525 6189531 6298927 6418432 6550377
59046F550377J44539J55567J66501J79641J94328K07776K19023K29916K42133
$$ 6550377 6694916 6850483 7016984 7196625 7390953 7598729 7817752 8047668 8289801
59037H289801K54766K65198K71449K73209K70950K64148K50571K27927J96172
$$ 8289801 8544567 8809765 9081214 9354423 9625373 9889521 10140092 10368019 10564191
59028A0564191J57280J12589O1774N036n4866j13806j68678k17783k59861k93951
$$ 10564191 10721471 10834060 10895834 10900870 10846004 10732198 10563520 10345737 10085876 9791925
59018I791925l19853l37924l48715l53216l52819l48464l40393l29039l15390
$$ 9791925 9472072 9134148 8785433 8432217 8079398 7730934 7390541 7061502 6746112
59009F746112l00123k83411k66076k49817k35490k22135k08567j95029j82426
$$ 6746112 6445989 6162578 5896502 5646685 5411195 5189060 4980493 4785464 4603038
59000D603038j70742j59251j47660j36306j25799j16929j10099j04292r7724r0279
$$ 4603038 4432296 4273045 4125385 3989079 3863280 3746351 3636252 3531960 3434236 3343957
58990C343957q4053q0492p8117p4428o9051o3540n8919n5035n1759m9111m6379
$$ 3343957 3259904 3179412 3101295 3026867 2957816 2894276 2835357 2780322 2728563 2679452 2633073
58979B633073m2737l8839l6459l6268l7052l7340l6717l5335l3075k9867k6257
$$ 2633073 2590336 2551497 2515038 2478770 2441718 2404378 2367661 2332326 2299251 2269384 2243127
58968B243127k3081k0719j8957j7432j6044j4850j3674j2088r985p875o168m470
$$ 2243127 2220046 2199327 2180370 2162938 2146894 2132044 2118370 2106282 2096297 2088422 2082254 2077784
58956B077784k300k36O11K05l92o00o91m03J243M139O596P611Q289R882J1560
$$ 2077784 2075484 2075248 2075859 2076064 2075672 2075072 2074381 2073978 2075221 2079360 2085956 2093567 2101856 2111738 2123298
58941B123298J1580R872Q058P343P677Q596R657J0253J0030R437R167R348R951
$$ 2123298 2134878 2144750 2152808 2160151 2167828 2176424 2186081 2196334 2206364 2215801 2224968 2234316 2244267
58928B244267J1411J3916J6616J8515J9807K1282K2802K3533K3523K3846K5076
$$ 2244267 2255678 2269594 2286210 2304725 2324532 2345814 2368616 2392149 2415672 2439518 2464594
58917B464594K6509K7121K6628K5569K4949K5727K7959L0466L1922L2143L1885
$$ 2464594 2491103 2518224 2544852 2570421 2595370 2621097 2649056 2679522 2711444 2743587 2775472
58906B775472L1621L1355L1340L2136L3715L5281L6222L6735L7427L8632M0418
$$ 2775472 2807093 2838448 2869788 2901924 2935639 2970920 3007142 3043877 3081304 3119936 3160354
58895C160354M2867M6091M9880N3545N6405N8680O1626O6210P1827P6943Q1012
$$ 3160354 3203221 3249312 3299192 3352737 3409142 3467822 3529448 3595658 3667485 3744428 3825440
58884C825440Q4904Q9415R4333R9282J04497J10179J15955J21679J27920J35079
$$ 3825440 3910344 3999759 4094092 4193374 4297871 4408050 4524005 4645684 4773604 4908683
58874D908683J42746J50626J59345J69513J80638J91887K03372K15878K29804
$$ 4908683 5051429 5202055 5361400 5530913 5711551 5903438 6106810 6322688 6552492
58865F552492K45064K61507K78744K96260L14441L34774L57946L82444M06330
$$ 6552492 6797556 7059063 7337807 7634067 7948508 8283282 8641228 9023672 9430002
58856I430002M30078M56409M87306N22138N58721N95295O31502O68217P06542
$$ 9430002 9860080 10316489 10803795 11325933 11884654 12479949 13111451 13779668 14486210
58847A4486210P46473P86566Q25266Q62123Q97030R28617R54137R70630R75463
$$ 14486210 15232683 16019249 16844515 17706638 18603668 19532285 20486422 21457052 22432515
58838B2432515R66115R40398Q96678Q33106P46963O36288N02715L52057J91746
$$ 22432515 23398630 24339028 25235706 26068812 26815775 27452063 27954778 28306835 28498581
58829B8498581K7887j35330k94174m43840n78363o92351p83190q51449q98923
$$ 28498581 28526468 28391138 28096964 27653124 27074761 26382410 25599220 24747771 23848848
58820B3848848r26940r37175r33101r19013q97326q68142q31819p90869p48571
$$ 23848848 22921908 21984733 21051632 20132619 19235293 18367151 17535332 16744463 15995892
58811A5995892p06604o65082o24384n85736n49969n16764m85523m56167m28512
$$ 15995892 15289288 14624206 13999822 13414086 12864117 12347353 11861830 11405663 10977151
58802A0977151m01756l75614l51455l30874l12983k94616k73781k51847k31529
$$ 10977151 10575395 10199781 9848326 9517452 9204469 8909853 8636072 8384225 8152696
58793H152696k13770j97638j82249j67276j52281j37048j22288j08622r5258q1188
$$ 8152696 7938926 7741288 7559039 7391763 7239482 7102434 6980146 6871524 6776266 6695078
58783F695078o7239n5099m4480l3220k0404p427M530J6120K8169M0290N2083O4142
$$ 6695078 6627839 6572740 6528260 6495040 6474636 6467209 6471739 6487859 6516028 6556318 6608401 6672543
58771F672543P6800Q9163J00626J12182J25109J39326J53925J68534J83280J98292
$$ 6672543 6749343 6838506 6939132 7051314 7176423 7315749 7469674 7638208 7821488 8019780
58761H019780K14017K31284K50475K71373K93933L18104L42859L67130L92011
$$ 8019780 8233797 8465081 8715556 8986929 9280862 9598966 9941825 10308955 10700966
58752A0700966M20049M51716M84740N17889N53177N92613O34809O76834P17921
$$ 10700966 11121015 11572731 12057471 12575360 13128537 13721150 14355959 15032793 15750714
58743A5750714P59179Q00597Q40191Q75409R03807R23193R32428R30975R16218
$$ 15750714 16509893 17310490 18150681 19026090 19929897 20853090 21785518 22716493 23632711
58734B3632711Q82524Q24826P42343O37406N12131L68467K10542M4633j23011
$$ 23632711 24515235 25340061 26082404 26719810 27231941 27600408 27810950 27855583 27732572
58725B7732572k86666m40309n78343o97116p94510q68979r20745r53077r70147
$$ 27732572 27445906 27005597 26427254 25730138 24935628 24066649 23145904 22192827 21222680
58716B1222680r73830r64260r42968r13437q78765q40594q00262p59173p18019
$$ 21222680 20248850 19284590 18341622 17428185 16549420 15708826 14908564 14149391 13431372
58707A3431372o77020o36989n98942n62931n28387m95169m63204m31951m01690
$$ 13431372 12754352 12117363 11518421 10955490 10427103 9931934 9468730 9036779 8635089
58698H635089l74260l50842l29773l08558k87354k68373k52375k37933k23840
$$ 8635089 8260829 7909987 7580214 7271656 6984302 6715929 6463554 6225621 6001781
58689F001781k10138j96975j84456j73390j64139j55033j44082j32174j22208
$$ 6001781 5791643 5594668 5410212 5236822 5072683 4917650 4773568 4641394 4519186
58680D519186j15010j08473j01024r3620q7618q2821p8426p4219o9981o5257o0387
$$ 4519186 4404176 4295703 4194679 4101059 4013441 3930620 3852194 3777975 3707994 3642737 3582350
58669C582350n6520n3971n1723m8973m5975m3201m0864l9509l9774m1267m2710
$$ 3582350 3525830 3471859 3420136 3371163 3325188 3281987 3241123 3201614 3161840 3120573 3077863
58658C077863m3387m3585m3819m4592m6507m9424n2030n3505n4836n6881n8070
$$ 3077863 3034476 2990891 2947072 2902480 2855973 2806549 2754519 2701014 2646178 2589297 2531227
58647B531227n6255n2236m9072m8012m7472m6014m3910m1526l8588l5602l3839
$$ 2531227 2474972 2422736 2373664 2325652 2278180 2232166 2188256 2146730 2108142 2072540 2038701
58636B038701l3377l2978l2261l1935l1699l0211k7657k6160k6876k8629k9984
$$ 2038701 2005324 1972346 1940085 1908150 1876451 1846240 1818583 1792423 1765547 1736918 1706934
58625A706934l0635l0249k8210k5264k3244k2263k0380j6949j3966j2858j2122
$$ 1706934 1676299 1646050 1617840 1592576 1569332 1547069 1526689 1509740 1495774 1482916 1470794
58614A470794r811o343l248p58J581L345M064M541N708O980P195O474N831N543
$$ 1470794 1460983 1454640 1451392 1450634 1452215 1455560 1459624 1464165 1469873 1476853 1484048 1490522 1496353 1501896
58600A501896N003L775J880n80l446o403r100j0895j0791q661o323n784o345n220
$$ 1501896 1506899 1510674 1512554 1511974 1508528 1502125 1493025 1482130 1471339 1462678 1456355 1450571 1444226 1439006
58586A439006j462K623M840O007Q262J1849J5158J7062J8009J9176K1364K4384
$$ 1439006 1437544 1440167 1445007 1451014 1459276 1471125 1486283 1503345 1521354 1540530 1561894 1586278
58574A586278K7139K8801L0040L2362L6187M0517M4492M8171N1700N5052N8748
$$ 1586278 1613417 1642218 1672258 1704620 1740807 1781324 1825816 1873987 1925687 1980739 2039487
58563B039487O3602O9507P5521Q1231Q6933R2649R8322J04706J12452J20670J28306
$$ 2039487 2103089 2172596 2248117 2329348 2416281 2508930 2607252 2711958 2824410 2945080 3073386
58552C073386J36671J48248J62784J77141J89550K01524K14648K27910K39686
$$ 3073386 3210057 3358305 3521089 3698230 3887780 4089304 4303952 4531862 4771548
58543D771548K50320K60818K70126K75307K73840K64834K48638K25792J95928
$$ 4771548 5021868 5282686 5552812 5828119 6101959 6366793 6615431 6841223 7037151
58534G037151J57771J11211N9015N266m7531r8180j44418j83176k13198k35183
$$ 7037151 7194922 7306133 7365148 7370414 7322883 7224703 7080285 6897109 6683911 6448728
58524F448728k49392k55513k54924k50377k43028k32344k19131k05689j92408
$$ 6448728 6199336 5943823 5688899 5438522 5195494 4963150 4744019 4538330 4345922
58515D345922j77487j60995j46108j34800j25238j15082j04710r5534q7672q1170
$$ 4345922 4168435 4007440 3861332 3726532 3601294 3486212 3381502 3285968 3198296 3117126
58505C117126p7142p5651p4513p1949o8687o5907o3158n9857n6778n4370n1656
$$ 3117126 3039984 2964333 2889820 2817871 2749184 2683277 2620119 2560262 2503484 2449114 2397458
58494B397458m8374m6185m5970m5928m4097m1017l8292l6342l5145l5236l6394
$$ 2397458 2349084 2302899 2256929 2211001 2166904 2125887 2087595 2051253 2016108 1980872 1944478
58483A944478l7079l6573l5819l5121l3376l0742k9305k9499k8810k5943k3274
$$ 1944478 1907399 1870826 1835007 1799886 1766510 1735768 1706463 1676964 1648154 1622211 1598937
58472A598937k2965k3485k2588k0917j9929j8863j6823j5364j5819j6282j4631
$$ 1598937 1575972 1552487 1529899 1508982 1489053 1470190 1453367 1438003 1422184 1405902 1391271
58461A391271j2469j2496j3702j2970j0139p901p536q098r024j0394j1237j0522
$$ 1391271 1378802 1366306 1352604 1339634 1329495 1321594 1314058 1305960 1296936 1286542 1275305 1264783
58449A264783r285r042q918p059m095k380k457k986l543m707n932o017n406n525
$$ 1264783 1255498 1246456 1237538 1230479 1226384 1224004 1221547 1218561 1215018 1210311 1204379 1198362 1192956 1187431
58435A187431o294o523o217o151n803m197k292k034l358m429m553m680n172n142
$$ 1187431 1181137 1174614 1168397 1162246 1156443 1152246 1149954 1147920 1144562 1140133 1135580 1130900 1125728 1120586
58421A120586m018k308r58r53k662m638m507k244p29j577k783k434k136l881n965
$$ 1120586 1116568 1114260 1113302 1112349 1109687 1105049 1100542 1098298 1097569 1095992 1093209 1090775 1088639 1084758 1078793
58406A078793n538l446k784l967m873m916n308n889n283l919l583m082l416j163
$$ 1078793 1073255 1069809 1067025 1063058 1058185 1053269 1047961 1042072 1036789 1032870 1029287 1025205 1021789 1020626
58392A020626J068K373L134L271K562K283L833O102O783N756M609L622K043N90
$$ 1020626 1021694 1024067 1027201 1030472 1033034 1035317 1039150 1045252 1052035 1057791 1062400 1066022 1068065 1068655
58378A068655N59J069K44j334j604q63j192k338j960j51%k790n883o541n174l646
$$ 1068655 1069214 1070283 1070527 1069193 1067589 1066726 1065534 1063196 1061236 1061085 1061085 1058295 1052412 1045871 1040697 1037051
58362A037051k672k082j889j925j661r79l15K5j6k74K20K655O231Q122P158N731
$$ 1037051 1034379 1032297 1030408 1028483 1026822 1025843 1025528 1025553 1025537 1025263 1025483 1028138 1034369 1042491 1049649 1055380
58346A055380O230P628P907P723Q766J0292J0448R612R326R313Q695Q629J0454
$$ 1055380 1061610 1069238 1077145 1084868 1093634 1103926 1114374 1123986 1133312 1142625 1151320 1159949 1170403
58333A170403J2554J2557J1322J1353J2444J2568J1739J1378J1028R518Q098Q481
$$ 1170403 1182957 1195514 1206836 1218189 1230633 1243201 1254940 1266318 1277346 1286864 1294962 1303443
58321A303443R036P156M117L190L898L056P06K1J585K677K388K619L724L848L080
$$ 1303443 1312479 1319635 1323752 1326942 1330840 1333896 1334602 1334623 1336208 1338885 1341273 1343892 1347616 1351464 1354544
58306A354544L813O184P420O463N413N653O324P125Q973J1417J2889J3690J5333
$$ 1354544 1358357 1364541 1371961 1378424 1383837 1389490 1395814 1402939 1411912 1423329 1436218 1449908 1465241
58293A465241J7082J6892J5438J5256J6075J5320J2926J1304J0614Q721N922M953
$$ 1465241 1482323 1499215 1514653 1529909 1545984 1561304 1574230 1585534 1596148 1604869 1610791 1615744
58281A615744N987O228N004M724O204P480P851Q874J0847J2364J3492J5338J6730
$$ 1615744 1621731 1627959 1632963 1637687 1643891 1651371 1659222 1668096 1678943 1691307 1704799 1720137 1736867
58268A736867J5871J4772J6939K1068K2465K0734K0149K2133K3506K2987K3238
$$ 1736867 1752738 1767510 1784449 1805517 1827982 1848716 1868865 1890998 1914504 1937491 1960729
58257A960729K5079K5689K4231K3658K5067K5637K4133K3333K5011K7183K8159
$$ 1960729 1985808 2011497 2035728 2059386 2084453 2110090 2134223 2157556 2182567 2209750 2237909
58246B237909K8875K9673K9276K8242K8954L1200L2214L1753L2332L4070L4500
$$ 2237909 2266784 2296457 2325733 2353975 2382929 2414129 2446343 2478096 2510428 2544498 2578998
58235B578998L3930L5398L8677M0050L8812L8290L9786M1255M2601M6095N0915
$$ 2578998 2612928 2648326 2687003 2727053 2765865 2804155 2843941 2885196 2927797 2973892 3024807
58224C024807N3515N4022N5982N9409O0947O1215O4572P0878P5185P6661P9883
$$ 3024807 3078322 3132344 3188326 3247735 3308682 3369897 3434469 3505347 3580532 3657193 3737076
58213C737076Q5982R0529R1944R3962R8015J01160J03422J08962J17885J25104
$$ 3737076 3823058 3913587 4005531 4099493 4197508 4298668 4402090 4511052 4628937 4754041
58203D754041J29174J34162J40984J45649J47931J52863J61552J69603J76449
$$ 4754041 4883215 5017377 5158361 5304010 5451941 5604804 5766356 5935959 6112408
58194F112408J86796K00786K12716K21700K33529K49829K65889K81146L00458
$$ 6112408 6299204 6499990 6712706 6934406 7167935 7417764 7683653 7964799 8265257
58185H265257L22773L40701L54035L71124L93894M14754M31889M53435M81957
$$ 8265257 8588030 8928731 9282766 9653890 10047784 10462538 10894427 11347862 11829819
58176A1829819N09200N31577N56772N89325O23992O59146P02011P54382Q08131
$$ 11829819 12339019 12870596 13427368 14016693 14640685 15299831 16001842 16756224 17564355
58167A7564355Q61083R21855R92534J062944J129041J199947J279659J360043
$$ 17564355 18425438 19347293 20339827 21402771 22531812 23731759 25011418 26371461
58159B6371461J440042J532789J644687J766672J895376K042494K213232K396523
$$ 26371461 27811503 29344292 30988979 32755651 34651027 36693521 38906753 41303276
58151D1303276K586827K793705L020458L258501L514234L814709M174284M584077
$$ 41303276 43890103 46683808 49704266 52962767 56477001 60291710 64465994 69050071
58143F9050071N047192N593150O243995P001089P879541Q914601J0116180J1462409
$$ 69050071 74097263 79690413 85934408 92935497 100815038 109729639 119845819 131308228
58135A31308228J2957387J4641199J6518247J8539834K0695019K3060601K5739026
$$ 131308228 144265615 158906814 175425061 193964895 214659914 237720515 263459541
58128B63459541K8813803L2294048L5764446L7846307L6297517K9307752J7120068
$$ 263459541 292273344 324567392 360331838 398178145 434475662 463783414 480903482
58121D80903482K334548j1565012k2105637k8582143l1549491l2005951l0921071
$$ 480903482 483238030 471673018 449567381 420985238 389435747 357429796 326508725
58114C26508725k9045143k6826460k4462785k2046256j9635474j7238637j4839144
$$ 326508725 297463582 270637122 246174337 224128081 204492607 187253970 172414826
58107A72414826j2463478j0181662q082994o343432n271273n116742n766580o719031
$$ 172414826 159951348 149769686 141686692 135343260 130071987 124955245 119188665 112469634
58099A12469634p433082p670020p497642p081026o552769o010008n512738n064350
$$ 112469634 105036552 97366532 89868890 82787864 76235095 70225087 64712349 59647999
58091E9647999m639408m232512l855191l504178l168249k854496k577331k331753
$$ 59647999 55008591 50776079 46920888 43416710 40248461 37393965 34816634 32484881
58083C2484881k103549j895360j718523j569222j435123j316141j218013j134456
$$ 32484881 30381332 28485972 26767449 25198227 23763104 22446963 21228950 20094494
58075B0094494j055082r82278r22346q68585q10508p51689p01984o59713o17138
$$ 20094494 19039412 18057134 17134788 16266203 15455695 14704006 14002022 13342309 12725171
58066A2725171n75931n41965n11758m78663m46046m20752l99939l77446l56541
$$ 12725171 12149240 11607275 11095517 10616854 10170808 9750056 9350117 8972671 8616130
58057H616130l43303l33531l19241l02557k90738k82666k72245k60308k51411
$$ 8616130 8272827 7939296 7620055 7317498 7026760 6744094 6471849 6211541 5960130
58048E960130k43273k30816k16818k07776k02692j95859j87115j79927j72936
$$ 5960130 5716857 5486041 5269223 5061447 4858755 4662896 4475781 4295854 4122918
58039D122918j62726j51556j43737j37703j29744j21615j16479j11426j02272
$$ 4122918 3960192 3808636 3664899 3527196 3397452 3275837 3159358 3047932 2945660
58030B945660r1848q5448q1861p6750p0991o7782o5420o0844n6621n6531n7884
$$ 2945660 2853812 2768364 2686503 2609753 2538762 2470980 2405560 2344716 2288095 2231564 2173680
58019B173680n5878n1991n0387m9716m6481m2951m3502m6025m5046m0898l8091
$$ 2173680 2117802 2065811 2015424 1965708 1919227 1876276 1832774 1786749 1741703 1700805 1662714
58008A662714l6947l4377l0758k8771k7373k3848j9872j8892j9499j7882j4780
$$ 1662714 1625767 1591390 1560632 1531861 1504488 1480640 1460768 1441876 1422377 1404495 1389715
57997A389715j3721j4445j4344j4085j5652j7110j5516j2821j2736j4169j3875
$$ 1389715 1375994 1361549 1347205 1333120 1317468 1300358 1284842 1272021 1259285 1245116 1231241
57986A231241j2811j3484j3795j0443o023n555q003q309o180n562o841o780n351
$$ 1231241 1218430 1204946 1191151 1180708 1174685 1169130 1161127 1152818 1146638 1141076 1134235 1127455 1122104
57973A122104n673p642q175p387q294j0682j1312r931r408j0137r820q382p943
$$ 1122104 1116431 1108789 1100614 1093227 1084933 1074251 1062939 1053008 1043600 1033463 1023643 1015261 1007318
57960A007318q384p953p345q161q639o295l444m191p117p128l830j759k742m193
$$ 1007318 998934 990981 983636 975475 966836 960541 957097 952906 945789 938661 934831 933072 930330 926137
57946I26137m931o553q776r234q397r117j1054j0985q879q023q655p253l127l6
$$ 926137 921206 914653 905877 896643 888246 879129 868075 857090 848211 840188 831533 824280 821153 821117
57932H21117Lo60l72q94l257n246m933l228j521k6P34N0q58r8J372Q48j557l001
$$ 821117 821120 820460 820088 819194 815937 810691 805758 802530 801009 800983 801717 801767 800909 800811 802183 803031 801474 798473
57914G98473k512j688j133o7O15r16l662m841m536n069o077n017k520k103l945
$$ 798473 795961 794273 793140 793073 793688 792772 789110 784269 779733 774664 768587 763570 761050 758947 755002
57899G55002m120j306P87o15l378m540m446m655m991m783m423m177l606l045l335
$$ 755002 750882 749576 750363 749748 746370 741830 737384 732729 727738 722955 718532 714355 710749 707704 704369
57884G04369l850l210j960j709j925q14J055J605J411K919N567N976L444R24O9
$$ 704369 700519 697309 695349 693640 691715 690901 691956 693561 694972 697891 703458 709434 712878 713802 713871
57869G13871n12j407j312o58j876m808o192n190n114p879j0840j1095r273p012
$$ 713871 713359 711952 710640 709982 708106 703298 697106 691916 686802 678923 668083 656988 647715 640703
57855F40703m306j457l35j463k666k479k045k185j647L3J069O56O77K340L911
$$ 640703 636397 634940 634605 633142 630476 627997 625952 623767 622120 622153 623222 623878 624555 626895 630806
57840F30806L712K695K141J401j52j229o78O05J300J383J092K35o50o55o36k361
$$ 630806 634518 637213 639354 640755 640603 639374 638696 639301 640601 641984 643076 643311 642661 642006 641370 639009
57824F39009m998n564l710k700m392o587o976o450o545o560n394l849l118l021
$$ 639009 634011 628447 624737 622037 617645 611058 604082 597632 591087 584527 579133 575284 572166 569145
57810E69145l204l825l942j769K184M833M676L643L653M250M805O064P823Q147
$$ 569145 565941 562116 558174 556405 558589 563422 568098 571741 575394 579644 584449 590513 598336 606483
57796F06483O478M781M120L168J554J230K678L204J117j603l114m673p348r175
$$ 606483 612961 617742 621862 625030 626584 627814 630492 633696 634813 633210 630096 625423 618075 608900
57782F08900q614p717q668r917r048p074o447p019p113o759o754o346m949m292
$$ 608900 600286 592569 583901 573984 564936 557862 551415 544396 537283 530524 523770 517424 512475 508183
57768E08183n803p542o898m748l820m317m320l396k714k553k608l744o670r660
$$ 508183 502380 494838 487940 483192 479372 475055 470735 467339 464625 462072 459464 455720 449050 439390
57754D39390j0242q539o572n151l827k983l419m451m729m307l935l203j530L7
$$ 439390 429148 420609 414037 408886 405059 402076 398657 394206 389477 385170 381235 378032 376502 376539
57740C76539M7j104k129k944l860l959k537j032j174k233k356j445l81J303M203
$$ 376539 376586 375482 373353 370409 366549 362590 360053 359021 357847 355614 353258 351813 351432 352735 356938
57725C56938O613O436M875N161P726R595Q772O622N388N451N591M433J346k703
$$ 356938 363551 369987 374862 380023 387749 397344 406116 412738 418126 423577 429168 433601 434947 432244
57711D32244n345n148l440k537k806l018k859l166l962m178l299j911p31j52k23
$$ 432244 426899 421751 418311 415774 412968 409950 407091 403925 399963 395785 392486 390575 389844 389692 389469
57696C89469k05J068L244M077K388J91J79K251M360N740P229R179J1062J2491
$$ 389469 389264 390332 393576 397653 400041 400232 400411 402662 407022 412762 419991 429170 440232 452723
57682D52723J2980J1550Q421O103O760R236J0683J0214Q953P420N331L344K582
$$ 452723 465703 477253 485674 491777 498537 507773 518456 528670 537623 545043 550374 553718 556300
57669E56300K733K744K971M505O749P835P146N651M111K935L062M973P364Q872
$$ 556300 559033 561777 564748 569253 576002 583837 590983 596634 600745 603680 606742 611715 619079 627951
57655F27951J0304J2979J5819J6759J6224J6314J7011J6476J4953J5022J7454
$$ 627951 638255 651234 667053 683812 700036 716350 733361 749837 764790 779812 797266
57644G97266K0078K1548K3232K6227K9251L0999L2346L4516L6934L8478L9579
$$ 797266 817344 838892 862124 888351 917602 948601 980947 1015463 1052397 1090875 1130454
57633A130454M1555M4713M8266N1502N4377N7477O1726O7475P3776P9415Q4559
$$ 1130454 1172009 1216722 1264988 1316490 1370867 1428344 1490070 1557545 1631321 1710736 1795295
57622A795295R0562R8405J08305J20314J33907J47525J60058J72541J86796K02814
$$ 1795295 1885857 1984262 2092567 2212881 2346788 2494313 2654371 2826912 3013708 3216522
57612C216522K19228K35859K53558K71514K86876K97094L00459K93895K72699
$$ 3216522 3435750 3671609 3925167 4196681 4483557 4780651 5081110 5375005 5647704
57603E647704K33765J78305J11352M0151k7217q4378j29384j64119j90797k10226
$$ 5647704 5881469 6059774 6171126 6211277 6184060 6099682 5970298 5806179 5615382 5405156
57593E405156k23179k31044k34264k31896k23743k11672j98103j84339j70817
$$ 5405156 5181977 4950933 4716669 4484773 4261030 4049358 3851255 3666916 3496099
57584C496099j57666j44506j30829j17100j04414r2883q1595p0318n9893n0817
$$ 3496099 3338433 3193927 3063098 2945998 2841584 2748701 2667106 2596788 2536895 2486078
57574B486078m2721l5327k8422k0971j2099l101L583P846J2508J9705K8431L6489
$$ 2486078 2443357 2408030 2379608 2358637 2346538 2343437 2347020 2354866 2367374 2387079 2415510 2451999
57562B451999M3205M9347N5797O3293P2275Q2171R1871J01366J11812J23612J35820
$$ 2451999 2495204 2544551 2600348 2663641 2735916 2818087 2909958 3011324 3123136 3246748 3382568
57551C382568J47632J58936J68928J75926J79211J79411J76292J67826J52344
$$ 3382568 3530200 3689136 3858064 4033990 4213201 4392612 4568904 4736730 4889074
57542D889074J30102J01906O7878K8822j2546n3032r0670j24251j52339j73982
$$ 4889074 5019176 5121082 5188960 5217782 5205236 5152204 5061534 4937283 4784944 4610962
57532D610962j89419j99270k03858k03948k00953j95604j87554j77054j65829
$$ 4610962 4421543 4222273 4018415 3814467 3613514 3417910 3230356 3053302 2887473
57523B887473j55346j45366j35107j24771j14972j05779r7292r0155q4395p8726
$$ 2887473 2732127 2586761 2451654 2326883 2211911 2106132 2008840 1918685 1834290 1755564
57513A755564p2074o5050n8968n4156n0113m6588m3565m0766l7979l5298l2501
$$ 1755564 1683490 1618440 1559472 1505316 1455203 1408615 1365050 1324284 1286305 1251007 1218506
57502A218506k9035k5181k2226k0788j9787j7887j5068j2056r192o699n118m422
$$ 1218506 1189471 1164290 1142064 1121276 1101489 1083602 1068534 1056478 1047286 1040587 1035469 1031047
57490A031047l433j067K390N924Q959J1170J2102J2025J2479J4950J9247K3844
$$ 1031047 1027614 1026547 1028937 1034861 1043820 1054990 1067092 1079117 1091596 1106546 1125793 1149637
57478A149637K7325K9007K8997K8550K9712L3558L9007M3947M7278M9477N1782
$$ 1149637 1176962 1205969 1234966 1263516 1293228 1326786 1365793 1409740 1457018 1506495 1558277
57467A558277N5337O0541O6570P1945P6134Q0240Q5730R2869J00677J07997J14284
$$ 1558277 1613614 1674155 1740725 1812670 1888804 1969044 2054774 2147643 2248320 2356317 2470601
57456B470601J19912J25704J31789J36897J39364J38553J34373J25841J11547
$$ 2470601 2590513 2716217 2848006 2984903 3124267 3262820 3397193 3523034 3634581
57447C634581R1574O7469M0254J0171k1248n0750p6012r7210j15065j28767j37069
$$ 3634581 3726155 3793624 3833878 3844049 3822801 3772051 3696039 3598829 3483764 3354997 3217928
57436C217928j40334j40178j37806j33640j27881j20609j11887j02376r3191q4760
$$ 3217928 3077594 2937416 2799610 2665970 2538089 2417480 2305593 2203217 2110026 2025266
57426B025266p6709o9097o2500n6562m9886m2058l4385k7904k2124j6458j1350
$$ 2025266 1948557 1879460 1816960 1760398 1710512 1668454 1634069 1606165 1584041 1567583 1556233
57415A556233o984k412K893Q075J2727J8009K4545L0694L4743L7662M1796M7752
$$ 1556233 1549249 1546837 1549730 1557805 1570532 1588541 1613086 1643780 1678523 1716185 1757981 1805733
57403A805733N4321O0689O7104P3849Q1122Q9317R8107J05935J11813J16818J22205
$$ 1805733 1860054 1920743 1987847 2061696 2142818 2232135 2330242 2436177 2547990 2664808 2787013
57392B787013J26781J27924J24654J17951J08214R4233P4755M9817K0572j1065
$$ 2787013 2913794 3041718 3166372 3284323 3392537 3486770 3561525 3611342 3631914 3620849
57382C620849m2655p2091r8178j19919j36111j46634j53116j57087j58269j55979
$$ 3620849 3578194 3506103 3407925 3288006 3151895 3005261 2852145 2695058 2536789 2380810
57372B380810j51172j45387j38593j30079j20705j12153j04331r5842q6873p9283
$$ 2380810 2229638 2084251 1945658 1815579 1694874 1582721 1478390 1382548 1295675 1216392
57362A216392p3571o8093o1896n6257n2389m9426m5848m1713l8215l5796l3701
$$ 1216392 1142821 1074728 1012832 956575 904186 854760 808912 767199 728984 693188 659487
57351F59487l1056k7820k4900k3414k3401k3378k1830j8993j6421j5015j4553
$$ 659487 628431 600611 575711 552297 528896 505518 483688 464695 448274 433259 418706
57340D18706j4852j5985j7182j7006j5199j3280j2716j3243j3521j2744j1247
$$ 418706 403854 387869 370687 353681 338482 325202 312486 299243 285722 272978 261731
57329B61731j0038r978j0895j1509j0811r374q472q174p538o650o882q586r945
$$ 261731 251693 241715 230820 219311 208500 199126 190654 182480 174942 168292 161410 152824 142879
57316A42879r088o447m085l300l780m531m734m010k704j775j729j808q74R49K228
$$ 142879 133791 127344 123259 119959 116179 111648 106914 102904 100200 98425 96696 94888 94014 94963 97191
57301I7191K030J165J120K089K824K446J702J934L261M519M781M162L178K183
$$ 97191 99221 100386 101506 103595 106419 108865 110567 112501 115762 120281 125062 129224 132402 134585
57287A34585J569J641K084K224K169K692L753M256L771L335L723M083L480K656
$$ 134585 136154 137795 139879 142103 144272 146964 150717 154973 158744 162079 165802 169885 173365 176021
57273A76021K911M013M719M813N063N566N738N711O124O548N741L757K270K355
$$ 176021 178932 182945 187664 192477 197540 203106 208844 214555 220679 227227 232968 236725 238995 241350
57259B41350L242L809L998M142M009L451L206M108N914P603Q611R194R821J0521
$$ 241350 244592 248401 252399 256541 260550 264001 267207 271315 277229 284832 293443 302637 312458 322979
57245C22979J0841J0374R557R758J1960J5320J7748J8155J7604J7934J9784K2337
$$ 322979 333820 344194 353751 363509 375469 390789 408537 426692 444296 462230 482014 504351
57233E04351K4545K6117K7455K9063L1128L3502L5982L8481M0901M3126M5276
$$ 504351 528896 555013 582468 611531 642659 676161 712143 750624 791525 834651 879927
57222H79927M7663N0231N2249N3086N3138N3451N4349N4868N3771N0896M7192
$$ 879927 927590 977821 1030070 1083156 1136294 1189745 1244094 1298962 1352733 1403629 1450821
57211A450821M3509L9652L4876K9028K2743J6411R788K942l143p776j1619j5538
$$ 1450821 1494330 1533982 1568858 1597886 1620629 1637040 1646828 1649770 1646627 1638851 1627232 1611694
57199A611694j9056k1271k2739k4511k5680k4205k0516j7847j7858j8272j6391
$$ 1611694 1592638 1571367 1548628 1524117 1498437 1474232 1453716 1435869 1418011 1399739 1383348
57188A383348j2874r902p299l117K716P970J1364J4082J7662K1878K5218K6535
$$ 1383348 1370474 1360572 1353273 1350156 1352872 1360842 1372206 1386288 1403950 1425828 1451046 1477581
57176A477581K5960K4799K4436K4876K4811K3510K1656J9749J7076J3518J0962
$$ 1477581 1503541 1528340 1552776 1577652 1602463 1625973 1647629 1667378 1684454 1697972 1708934
57165A708934J1142J3104J4738J6112J9142K4461L0821L7324M3977M9999N3875
$$ 1708934 1720076 1733180 1747918 1764030 1783172 1807633 1838454 1875778 1919755 1969754 2023629
57154B023629N5536N6614N7919N8351N6951N4402N1716M8854M5539M2381M0318
$$ 2023629 2079165 2135779 2193698 2252049 2309000 2363402 2415118 2463972 2509511 2551892 2592210
57143B592210L9650M0099M1269M2771M4484M6589M8683M9274M7379M4260M2172
$$ 2592210 2631860 2671959 2713228 2755999 2800483 2847072 2895755 2945029 2992408 3036668 3078840
57132C078840M1407M0168L7439L4266L1759K9522K6835K4024K1649J9317J6294
$$ 3078840 3120247 3160415 3197854 3232120 3263879 3293401 3320236 3344260 3365909 3385226 3401520
57121C401520J2639R071O110L850K017Qk500m725n219l501p84J374K641L904N935
$$ 3401520 3414159 3423230 3429340 3433190 3435207 3435215 3432715 3427990 3422771 3419270 3418486 3419860 3422501 3426405 3432340
57106C432340Q352R944J0020R293Q909Q740P585N117K351l19m023r362j4944j9405
$$ 3432340 3440692 3450636 3460656 3469949 3478858 3487598 3495183 3500300 3502651 3502332 3498309 3488947 3474003 3454598
57092C454598k3612k9109l5372m0654m4846m9510n5341o1360o6491p0317p2602
$$ 3454598 3430986 3401877 3366505 3325851 3281005 3231495 3176154 3114794 3048303 2977986 2905384
57081B905384p3764p5661q0383q8312r8612j11037j25743j41902j58205j74464
$$ 2905384 2831620 2755959 2675576 2587264 2488652 2377615 2251872 2109970 1951765 1777301
57071A777301j91254k08507k26067k44918k66041k88803C9408b98233l66980m01109
$$ 1777301 1586047 1377540 1151473 906555 640514 351711 39408 -298233 -665213 -1066322
57061a066322m40158m85613n39281o01040o70030p47231q34112r29596j031347
$$ -1066322 -1506480 -1992093 -2531374 -3132414 -3802444 -4549675 -5383787 -6313383 -7344730
57052g344730j139667j257286j386061j527206j684291j862483k064786k292359
$$ -7344730 -8484397 -9741683 -11127744 -12654950 -14339241 -16201724 -18266510 -20558869
57044b0558869k548588k839776l171761l549108l977837m466429n024765n664649
$$ -20558869 -23107457 -25947233 -29118994 -32668102 -36645939 -41112368 -46137133 -51801782
57036e1801782o399586p239772q186995r235412j0373119j1579933j2830464j4104352
$$ -51801782 -58201368 -65441140 -73628135 -82863547 -93236666 -104816599 -117647063 -131751415
57028a31751415j5380028j6601877j7668808j8498251j9120804j9675566k0251830
$$ -131751415 -147131443 -163733320 -181402128 -199900379 -219021183 -238696749 -258948579
57021b58948579k0701663k0611902j9486205j7004248j3181544q353797l030556
$$ -258948579 -279650242 -300262144 -319748349 -336752597 -349934141 -358287938 -361318494
57014c61318494K279477P181462J1417185J4838074J7386452J9096380K0081134
$$ -361318494 -359039017 -351857555 -340440370 -325602296 -308215844 -289119464 -269038330
57007b69038330K0489803K0458836K0090050J9454914J8606107J7586722J6437323
$$ -269038330 -248548527 -228089691 -207999641 -188544727 -169938620 -152351898 -135914575
57000a35914575J5199093J3912020J2613091J1337233J0116461Q975028P926441
$$ -135914575 -120715482 -106803462 -94190371 -82853138 -72736677 -63761649 -55835208
56993e5835208O976182O125413N371368M707602M126719L622157L186619K810769
$$ -55835208 -48859026 -42733613 -37362245 -32654643 -28527924 -24905767 -21719148 -18908379
56985a8908379K484943K201103J952681J734409J542922J375819J229517J099714
$$ -18908379 -16423436 -14222333 -12269652 -10535243 -8992321 -7616502 -6386985 -5287271
56977e287271R84092Q82467P94010P16475O48361N89239a35237C54606M45551
$$ -5287271 -4303179 -3420712 -2626702 -1910227 -1261866 -672627 -135237 354606 800157
56968H00157M05963L71430L39378L07459K76340K48105K23641K02743J84959J69137
$$ 800157 1206120 1577550 1916928 2224387 2500727 2748832 2972473 3175216 3360175 3529312
56958C529312J53648J38244J24589J14315J07542J03380J00644R8378R7128R8144
$$ 3529312 3682960 3821204 3945793 4060108 4167650 4271030 4371674 4470052 4567180 4665324
56948D665324R8232Q6658N2375m021o8929j27541j73813k08356k32114k46035
$$ 4665324 4763556 4850214 4902589 4898568 4829639 4702098 4528285 4319929 4087815 3841780
56938C841780k53429k58037k60824k61142k59285k55227k46970k33446k17531
$$ 3841780 3588351 3330314 3069490 2808348 2549063 2293836 2046866 1813420 1595889
56929A595889k02988j89645j74902j59106j45639j35781j26848j16287j04942
$$ 1595889 1392901 1203256 1028354 869248 723609 587828 460980 344693 239751
56920B39751r5220E6596b5507p6496p0502o4267n8452n3399m8436m2513l5277
$$ 239751 144531 56596 -25507 -102003 -172505 -236772 -295224 -348623 -397059 -439572 -474849
56909d74849k7089j8521j0507m089R77O515J3555K0450K4851K6973K9142L2381
$$ -474849 -501938 -520459 -530966 -535055 -534078 -527563 -514008 -493558 -468707 -441734 -412592 -380211
56897c80211L5288L6407L5844L3914K9870K3163J5165Q405M305K393J584J497
$$ -380211 -344923 -308516 -272672 -238758 -208888 -185725 -170560 -162155 -157850 -155457 -153873 -152376
56885a52376K263L585M716N474O623Q759J1253J2949J3767J4744J6550J8786a1974
$$ -152376 -150113 -146528 -141812 -136338 -129715 -120956 -109703 -96754 -82987 -68243 -51693 -32907 -11974
56871A1051K5113K6726K7220K5925K1933J4736N581k808q435j1463j3110j3993
$$ 11051 36164 62890 90110 116035 137968 152704 158285 155477 147042 135579 122469 108476
56859A08476j4102j3584j2748j1726j0701j0086r983r856F608i27n498l416j831
$$ 108476 94374 80790 68042 56316 45615 35529 25546 15690 6608 -927 -6425 -9841 -11672
56846a1672j034o49r3O12J147J815L180a882C684N307N354O862R528J2201J3918
$$ -11672 -12706 -13355 -13448 -12836 -11689 -9874 -6694 -1882 3684 8991 14345 21207 30735 42936 56854
56831E6854J4339J4111J4794J7295K0411K2088K2015K1437K0507J7759J2633O532
$$ 56854 71193 85304 100098 117393 137804 159892 181907 203344 223851 241610 254243 260775
56819B60775P18m821r486j1276r469o411m826m497l363q11J980M305O743R850
$$ 260775 261493 256672 247186 235910 226441 220030 215204 210707 207344 206533 208513 212818 219561 229411
56805B29411J3410J7039K0627K4328K8568L3556L8234M0436L8787L3795K6549
$$ 229411 242821 259860 280487 304815 333383 366939 405173 445609 484396 518191 544740
56794E44740J7373O566m421j3563j9375k1006j8458j3636r750q335p591m813L97
$$ 544740 562113 568679 564258 550695 531320 510314 491856 478220 468470 460135 452544 447731 448128
56781D48128O482J2418J8286K4154K9937L6012M2644M9078N4117N7032N6850N1677
$$ 448128 454610 467028 485314 509468 539405 575417 618061 667139 721256 778288 835138 886815
56769H86815M0277K4064O236j0592k4875l5052l9878l9936l7476l4389l1153k7621
$$ 886815 927092 951156 957392 946800 921925 886873 846995 807059 769583 735194 704041 676420
56757F76420k3780j9682j5416j1206o965j927M616J2341K0041K6371L0239L1192
$$ 676420 652640 632958 617542 606336 599371 597444 602060 614401 634442 660813 691052 722244
56745G22244K9799K6802K1519J2338m44j3608k3941l0970l5663l7941l7232l4366
$$ 722244 752043 778845 800364 812702 812258 798650 774709 743739 708076 670135 632903 598537
56733E98537l0903k7209k2914j8682j5557j3091r997o299k917L95M594R054J2100
$$ 598537 567634 540425 517511 498829 483272 470181 460184 453885 450968 451363 455957 465011 477111
56720D77111J3817J5808J7595J5797Q318k429j1871j7599k0228k1191k1321k1076
$$ 477111 490928 506736 524331 540128 548446 546017 534146 516547 496319 475128 453807 432731
56708D32731k0762k0374j9761j8913j7806j6322j4454j2345j0119q053o736o403
$$ 432731 411969 391595 371834 352921 335115 318793 304339 291994 281875 273822 267086 260683
56696B60683o308n530m338l819m189m429l813k786k037j604j285j132j063o57
$$ 260683 254375 248845 244507 240688 236499 232070 228257 225471 223434 221830 220545 219413 218350 217693
56682B17693J86R25J199J358J852K491K772K588K183J698J157P81Q80J369J630
$$ 217693 217879 218804 220003 221361 223213 225704 228476 231064 233247 234945 236102 236883 237763 239132 240762
56667B40762J116P2o36o58n94r14q87L38J972K239R80L2M30Q44k13k082l176l282
$$ 240762 241878 241950 241314 240656 240062 239148 238261 238599 240571 242810 243790 243822 244252 245096 244883 242801 239625 236343
56649B36343l066k474j364q04j704k815k305q34p78k377l131j452J305L131L723
$$ 236343 233277 230803 229439 228635 226931 224116 221811 220977 220199 217822 214691 213239 214544 217675 221398
56634B21398L577K657J272P64J898L582M328M074L539K764J552N39M87J013J146
$$ 221398 224975 227632 228904 229668 231566 235148 239476 243550 247089 249853 251405 251944 252431 253444 254590
56619B54590P17J25p47k178l463l509k527j950k306k442j373JO3j236k224j691
$$ 254590 255307 255432 254685 252507 249044 245535 243008 241058 238752 236310 234937 234938 235001 233765 231541 229850
56603B29850k77N05L7j089k039k362j889p82K74M08n85k024l068l358l089k844
$$ 229850 229573 230078 230115 229026 226987 224625 222736 221954 222228 222636 222051 220027 216959 213601 210512 207668
56587B07668l258m255m734l784k078j182j469j738j211m69q0L48R18O21j089k971
$$ 207668 204410 200155 195421 191637 189559 188377 186908 185170 183959 183490 183410 183758 184676 185297 184208 181237
56571A81237l632l519l865m362l535j019K010M450N949O188M987L213K277K567
$$ 181237 177605 174086 170221 165859 162324 161305 163315 167765 173714 179902 184889 188102 190379 192946
56557A92946L319L988M629M950M330L032K318K833L758L854K791J253K97O05J801
$$ 192946 196265 200253 204882 209832 214162 217194 219512 222345 226103 229957 232748 234001 234298 234903 236704
56542B36704K519J789J88r07r75n98l91m89q28j120p65K97J057O01m78q06m6R60
$$ 236704 239223 241012 241200 240293 239318 238720 238329 237840 237012 235892 235127 235424 236481 237082 236604 235798 235752 236712
56524B36712J540J660J368Q79Q62J581K101J477L57J05Q35J685K580L956N105
$$ 236712 238252 239912 241280 242159 243021 244602 246703 248180 248537 248642 249477 251162 253742 257698 262803
56509B62803M707L172K553L748N414O040N551M504L337K873L909N705O337N249
$$ 262803 267510 270682 273235 276983 282397 288437 293988 298492 301829 304702 308611 314316 320653 325902
56495C25902M017L981M642N129N647O412O594N593M310L884M011L663K704J658
$$ 325902 329919 333900 338542 343671 349318 355730 362324 367917 372227 376111 380122 383785 386489 388147
56481C88147M99j188l131m407m510l816l169l254m039m740m765m619m989n163
$$ 388147 388646 387458 384327 379920 375410 371594 368425 365171 361132 356392 351627 347008 342019 336856
56467C36856l746j220q2j568l759m148k943k272k958l835l925l621l453l155k477
$$ 336856 333110 331890 331808 330240 326481 322333 319390 317118 314160 310325 306400 302779 299326 296171 293694
56452B93694j976k156k462j911n53M73N20L19Q21J627J457mj765l123m401n592
$$ 293694 291718 289562 287100 285189 284636 285109 285629 285948 286769 288396 289853 289849 288084 284961 280560 274968
56436B74968n507l413o53P28M59n1N2L30L88O90J770L438M838M867L021M48n78
$$ 274968 269461 266048 265395 266123 266582 266531 266583 266913 267301 267991 269761 273199 278037 282904 285925 286373 285795
56419B85795Q48L095M292M712N466O065N391M244M490O045P073P032P010P081
$$ 285795 286643 289738 294030 298742 304208 310273 315664 319908 324398 330443 337516 344548 351558 358639
56405C58639O109M555M600O557P884P001N620N777O878P498Q017R314J0423R693
$$ 358639 364748 369303 373903 380460 388344 395345 400965 406742 413620 421118 429135 438449 448872 458565
56391D58565P418N366M306L566K393N30j961m359n464n075m389m084l249j398
$$ 458565 465983 471349 475655 479221 481614 482144 480183 475824 470360 465285 460896 456812 453563 452165
56377D52165j79j365m158o218o711o543o179n178l884l697n157p031p846p464
$$ 452165 451986 450621 446463 440245 433534 426991 420812 415634 411750 408053 402896 395865 388019 380555
56363C80555o701o072n444m584l596k739j957q38P14K014K278J666R71M26m10
$$ 380555 373854 367782 362338 357754 354158 351419 349462 348624 349338 351352 353630 355296 356267 356693 356283
56348C56283j559k283k178j826k071l090m288m642l464j410l46j279k918l348
$$ 356283 354724 352441 350263 348437 346366 343276 338988 334346 330882 329472 329126 327847 324929 321581
56334C21581k564j908j664j099m89p16r61O39L530M627K629R7q7J789L756N059
$$ 321581 319017 317109 315445 314346 313857 313141 312180 312819 316349 320976 323605 323702 323615 325404 329160 334219
56318C34219N835N713M661L979M543N044L725J082p83r42l10M7P7L89J425K844
$$ 334219 340054 345767 350428 354407 358950 363994 367719 368801 368018 367076 366766 366813 366890 367279 368704 371548
56302C71548L528K975K497L692N785O303M783L598M322N540N495M670M183L579
$$ 371548 375076 378051 380548 384240 390025 396328 401111 404709 409031 414571 420066 424736 428919 432498
56288D32498K241J225J715K955L668M198N419O694O911O462O342O278N528M610
$$ 432498 434739 435964 437679 440634 444302 448500 453919 460613 467524 473986 480328 486606 492134 496744
56274D96744M311M037K977J993K376L528L944L722M096N117N860O413P598Q975
$$ 496744 501055 505092 508069 510062 512438 515966 519910 523632 527728 532845 538705 545118 552716 561691
56260E61691R192Q244P513P624P896P968Q336R127R754J0023J0490J1602J3273
$$ 561691 570883 579127 586640 594264 602160 610128 618464 627591 637345 647368 657858 669460 682733
56247F82733J5204J6817J7240J6218J4674J3662J3234J3041J3231J3911J4512
$$ 682733 697937 714754 731994 748212 762886 776548 789782 802823 816054 829965 844477
56236H44477J4612J4644J4914J4893J4413J4409J5305J5795J4607J2578J1596
$$ 844477 859089 873733 888647 903540 917953 932362 947667 963462 978069 990647 1002243
56225A002243J2256J3787J5472J6974J8021J9018K1135K4750K8660L1741L4354
$$ 1002243 1014499 1028286 1043758 1060732 1078753 1097771 1118906 1143656 1172316 1204057 1238411
56214A238411L7239M0345M3720M7991N2759N6358N8718O2563O9903P8943Q6566
$$ 1238411 1275650 1315995 1359715 1407706 1460465 1516823 1575541 1638104 1708007 1786950 1873516
56203A873516R2491R8828J06742J15733J25206J34840J44316J54293J66379J80497
$$ 1873516 1966007 2064835 2171577 2287310 2412516 2547356 2691672 2845965 3012344 3192841
56193C192841J94011K05362K16585K29708K42473K50758K53836K53979K51638
$$ 3192841 3386852 3592214 3808799 4038507 4280980 4531738 4785574 5039553 5291191
56184E291191K44359K30225K09673J84091J54978J24200R2757N9747K4677r987
$$ 5291191 5535550 5765775 5975448 6159539 6314517 6438717 6531474 6591221 6615898 6605911
56174F605911m0854o7389r1128j12142j29043j41946j52471j61117j67167j70845
$$ 6605911 6565057 6497668 6406540 6294398 6165355 6023409 5870938 5709821 5542654 5371809
56164E371809j73075j73614j72034j69982j69695j70746j70940j69866j68595
$$ 5371809 5198734 5025120 4853086 4683104 4513409 4342663 4171723 4001857 3833262
56155C833262j66541j62020j55830j50772j47372j43232j37060j30164j23463
$$ 3833262 3666721 3504701 3348871 3198099 3050727 2907495 2770435 2640271 2516808
56146B516808j16115j07986j00597r4624q8841q2480p6350p0825o4938n8446n2685
$$ 2516808 2400693 2292707 2192110 2097486 2008645 1926165 1849815 1778990 1714052 1655606 1602921
56135A602921m8514m5082m1435l7768l4546l1749k9367k7463k5578k3320k1175
$$ 1602921 1554407 1509325 1467890 1430122 1395576 1363827 1334460 1306997 1281419 1258099 1236924
56124A236924j9618j7964j5517j2987j1131r136o210l435j843k00K680M951M388
$$ 1236924 1217306 1199342 1183825 1170838 1159707 1150571 1144361 1140926 1139083 1138883 1141563 1146514 1150902
56111A150902K700L528O971R992J1632J3703J6416J7654J7171J7487J9651K1630
$$ 1150902 1153602 1157130 1164101 1174093 1185725 1199428 1215844 1233498 1250669 1268156 1287807 1309437
56099A309437K2098K2514K4175K6074K7012K7241K6982K5629K3495K2237K2735
$$ 1309437 1331535 1354049 1378224 1404298 1431310 1458551 1485533 1511162 1534657 1556894 1579629
56088A579629K4157K5485K6219K5905K4931K5255K8043L1329L2832L4169L8993
$$ 1579629 1603786 1629271 1655490 1681395 1706326 1731581 1759624 1790953 1823785 1857954 1896947
56077A896947M7625N7137O6378P7000Q9380J01395J11755J20942J28374J32045
$$ 1896947 1944572 2001709 2068087 2145087 2234467 2335862 2447617 2568559 2696933 2828978
56067B828978J31486J28015J21845J12462J01940R4122Q9760Q5548P8256O6708
$$ 2828978 2960464 3088479 3210324 3322786 3424726 3518848 3608608 3694156 3772412 3839120
56057C839120N0153K8839O442j2079k5705l7064m7241n5117o1764p0667q2728
$$ 3839120 3889273 3918112 3924554 3912475 3886770 3849706 3802465 3747348 3685584 3614917 3532189
56046C532189r5230j06381j16570j24662j27709j25394j20493j14165j05110r4036
$$ 3532189 3436959 3330578 3214008 3089346 2961637 2836243 2715750 2601585 2496475 2402439
56036B402439q4098p5963o7072n6794m7616m0343l3022k5588k0392j7028j2079
$$ 2402439 2318341 2242378 2175306 2118512 2070896 2030553 1997531 1971943 1951551 1934523 1922444
56025A922444n451j402j381j440J180M125N004N082N532M961L231K954M791N938
$$ 1922444 1916993 1915591 1914210 1912770 1913950 1918075 1923079 1928161 1933693 1938654 1941885 1944839 1949630 1955568
56011A955568N322N515P452Q609Q461J0218J4672J7965J8258J8985K2455K5743
$$ 1955568 1960890 1966405 1973857 1982466 1990927 2001145 2015817 2033782 2052040 2071025 2093480 2119223
55999B119223K6226K5864K6727K7412K7191K8490L2030L4580L4666L5296L7998
$$ 2119223 2145449 2171313 2198040 2225452 2252643 2281133 2313163 2347743 2382409 2417705 2455703
55988B455703L9776L9286M0177M4653M9297N1094N2152N4781N7381N8783O1103
$$ 2455703 2495479 2534765 2574942 2619595 2668892 2719986 2772138 2826919 2884300 2943083 3004186
55977C004186O4780O6572O6044O7763P3336P7838P8254P8815Q3419Q9358R3430
$$ 3004186 3068966 3135538 3201582 3269345 3342681 3420519 3498773 3577588 3661007 3750365 3843795
55966C843795R7730J04351J10645J14821J20080J28321J35996J40933J46671J55339
$$ 3843795 3941525 4045876 4156521 4271342 4391422 4519743 4655739 4796672 4943343 5098682
55956E098682J63302J68640J75559J86355J96821K04942K15905K32653K49940
$$ 5098682 5261984 5430624 5606183 5792538 5989359 6194301 6410206 6642859 6892799
55947F892799K63897K78831K97921L16184L29773L43245L60147L75922L88093
$$ 6892799 7156696 7435527 7733448 8049632 8379405 8722650 9082797 9458719 9846812
55938I846812M03738M27981M54530M76939M99744N28850N60576N90536O23964
$$ 9846812 10250550 10678531 11133061 11610000 12109744 12638594 13199170 13789706 14413670
55929A4413670O66598P14391P62620Q15675Q77353R41631J003834J070351J146114
$$ 14413670 15080268 15794659 16557279 17372954 18250307 19191938 20195772 21266123 22412237
55920B2412237J224118J299307J380777J477458J584604J697813J826776J980165
$$ 22412237 23636355 24935662 26316439 27793897 29378501 31076314 32903090 34883255
55912C4883255K150658K329912K523671K736909K961672L197630L466476L786548
$$ 34883255 37033913 39363825 41887496 44624405 47586077 50783707 54250183 58036731
55904E8036731M152909M563780N045006N624990O309469P106362Q046085R145179
$$ 58036731 62189640 66753420 71798426 77423416 83732885 90839247 98885332 108030511
55896A08030511J0381822J1746845J3287952J5063808J7095472J9410905K2078215
$$ 108030511 118412333 130159178 143447130 158510938 175606410 195017315 217095530
55889B17095530K5114506K8401916L1734663L4764799L6630879L5721324L0327587
$$ 217095530 242210036 270611952 302346615 337111414 373742293 409463617 439791204
55882D39791204K0027784O496665p245962j8533542k6184619l0385556l1939488
$$ 439791204 459818988 466315653 459069691 440536149 414351530 383965974 352026486
55875C52026486l1710064l0418789k8566652k6417856k4098940k1719543j9387600
$$ 352026486 320316422 289897633 261330981 234913125 210814185 189094642 169707042
55868A69707042j7169239j5102473j3234489j1602626j0196458q977079p921194
$$ 169707042 152537803 137435330 124200841 112598215 102401757 93424678 85503484
55861H5503484p017986o241892n562188m969012m463010m029430l645959l305913
$$ 85503484 78485498 72243606 66681418 61712406 57249396 53219966 49574007 46268094
55853D6268094l011554k754070k520579k311881k133868j979179j834941j700853
$$ 46268094 43256540 40502470 37981891 35670010 33536142 31556963 29722022 28021169
55845B8021169j582917j476841j373591j274559j186378j107180j031639r62538
$$ 28021169 26438252 24961411 23587820 22313261 21126883 20019703 18988064 18025526
55837A8025526r03839q49301p91519p35557o90280o52477o12882n72153n37564
$$ 18025526 17121687 16272386 15480867 14745310 14055030 13402553 12789671 12217518 11679954
55828A1679954n08787m79978m51750m28753m08937l86738l63554l44289l27069
$$ 11679954 11171167 10691189 10239439 9810686 9401749 9015011 8651457 8307168 7980099
55819G980099l06947k86278k70928k59474k46374k32652k23232k16561k07159
$$ 7980099 7673152 7386874 7115946 6856472 6610098 6377446 6154214 5937653 5730494
55810E730494j95937j87948j82101j73101j61963j54836j52545j50631j48853
$$ 5730494 5534557 5346609 5164508 4991407 4829444 4674608 4522063 4371432 4222579
55801D222579j51220j56630j58284j53314j45511j37998j30024j21514j14299
$$ 4222579 4071359 3914729 3756445 3603131 3457620 3319622 3189598 3068084 2953785
55792B953785j08092j00593r1875q3979p6932o9772o4240o2352o1744n8668n4173
$$ 2953785 2845693 2745100 2653225 2569246 2492314 2422542 2358302 2295950 2234206 2175538 2121365
55781B121365n1968n1671m9759m6003m3212m1536l8548l4311l1172k9067k5974
$$ 2121365 2069397 2017726 1967967 1921964 1878752 1837216 1798668 1764357 1733185 1704118 1678144
55770A678144k2294k0072j8623j5656j1956j0221j0123r114p480q012j1117j4473
$$ 1678144 1655850 1635778 1617155 1601499 1589543 1579322 1569199 1560085 1552605 1544593 1533476 1519003
55758A519003j7000j9298k1016k1550k2309k4682k7095k7755k8426l1300l4136
$$ 1519003 1502003 1482705 1461689 1440139 1417830 1393148 1366053 1338298 1309872 1278572 1244436
55747A244436l3303k9991k8389k8873k8043k4693k0790j7199j3290j0303j0404
$$ 1244436 1211133 1181142 1152753 1123880 1095837 1071144 1050354 1033155 1019865 1009562 999158
55736I99158j2497j3317j2415j2003j2261j1152q644o938o555o064n513o302p858
$$ 999158 986661 973344 960929 948926 936665 925513 916869 909931 903376 897312 891799 885497 877639
55723H77639q141p287p168p588o519l924k021k059l835p559j2841j6869j7168
$$ 877639 869498 862211 855043 847455 840936 837012 834991 832932 829097 821538 808697 791828 774660
55710G74660j5408j4933j5667j5174j3525j2870j3089j2163j0310r538r696r154
$$ 774660 759252 744319 728652 713478 699953 687083 673994 661831 651521 641983 632287 623133
55698F23133q676j0172j2273j1809r365q603j0280j1680j1890j2644j3631j2101
$$ 623133 614457 604285 592012 580203 570838 562235 551955 540275 528385 515741 502110 490009
55686D90009p990m734l854l219j784j505l221m873n315n909o863o052l156j135
$$ 490009 482019 477285 473431 470212 468428 466923 463702 458829 453514 447605 440742 434690 431534 430399
55672D30399j666k575j755l46p3n06r94k444n084o936o519n052m323m344m488
$$ 430399 428733 426158 424403 424057 423984 423478 422484 420040 414956 408020 401501 396449 392126 387782 383294
55657C83294m968n819o227n896n381m573k840r90p58j900k258j190j96K60J580
$$ 383294 378326 372507 366280 360384 355003 350430 347590 346600 345842 343942 341684 340494 340298 340558 342138
55642C42138L806M561K465r20l612n247n751m799l557m136o083o222l336j57P44
$$ 342138 345944 350505 352970 352050 348438 343191 337440 332641 329084 324948 318865 312643 309307 309150 309894
55627C09894L58P01J513J662J629K494L951N202O305P287P423O760O724P896Q667
$$ 309894 310252 310953 312466 314128 315757 318251 322202 327404 333709 340996 348419 355179 361903 369799 378466
55612C78466P427M626J626r93k977l924m340n552p508q425p566o605p034q020
$$ 378466 385893 390519 392145 391152 388175 384251 379911 374359 366851 358426 350860 344255 337221 329201
55598C29201q059p177o199n280m415m001l768k526n6K063K468J575M02p00j398
$$ 329201 321142 313965 307766 302486 298071 294070 290302 287776 287720 289783 292251 293826 294228 293528 292130
55583B92130j154m63p22j998k580j676p24j040j970k578l392n035o619o933o096
$$ 292130 290976 290513 289791 287793 285213 283537 282813 281773 279803 277225 273833 268798 262179 255246 249150
55568B49150m915l705k748k615l201l605l688m362n618n962m666k965k020j432
$$ 249150 244235 240530 237782 235167 231966 228361 224673 220311 214693 208731 204065 201100 199080 197648
55554A97648p55q39k306m135n026m934m324l291k296k244k860k632j233k38m25
$$ 197648 196893 196054 193748 189613 184587 179653 175329 172038 169742 167498 164638 162006 160773 160535 160110
55539A60110l19J129K437J869J35j049j544k047k085q23R56J640R28l20j639k841
$$ 160110 159791 160920 163357 165226 165361 164312 162768 160721 158636 157813 158769 160409 161337 161017 159378 156537
55523A56537l050j520Q79K392K399J802J593J856J939J225O2j02J635M002M881
$$ 156537 153487 151967 152846 155238 157637 159439 161032 162888 164827 166052 166114 166012 167647 171649 176530
55508A76530M157L501L444K860J759J859L344L760J607j315k994m136n989p617
$$ 176530 180687 184188 187632 190492 192251 194110 197454 201214 202821 201506 198512 194376 188387 180770
55494A80770p968q506j0695j2498j0847o700m124m569n425m528k949k378k317
$$ 180770 172802 164296 153601 141103 130256 123556 119432 114863 109438 104910 101961 99583 97266
55481I7266j426P2Q48M62k49l44K84R31Q31J8o76p10m24k06L67J815L629M498
$$ 97266 95840 95912 96760 97222 96973 96629 96913 97844 98675 98693 98017 97307 96883 96677 97044 98859 102488 106986
55463A06986L482P67k204l320j637J112K063P73l18M34J616J379N06Q87K308K952
$$ 106986 110468 111235 109031 105711 104074 105186 107249 108022 107704 108138 109754 111133 111639 112526 114834 117786
55447A17786K275J391R55N15l08j397k591l391k780p30R19N77p70j062k18J44
$$ 117786 120061 121452 122407 122922 122614 121217 118626 115235 112455 111725 112644 113221 112451 111389 111171 111315
55431A11315n84j664k949m844o460o155m282l186l875m690m080k759k037j792
$$ 111315 110731 109067 106118 101274 94814 88659 84377 81191 77316 72626 68546 65787 63750 61958
55417F1958j458j632l036m649m533k312L58J830J985J651J364J207J285J789K509
$$ 61958 60500 58868 55832 51183 46650 44338 44696 46526 48511 50162 51526 52733 54018 55807 58316
55402E8316K762K117R89J64j87n76j267j777j504m42Q35J579J200k17j641k003
$$ 58316 61078 63195 64184 64348 64161 63585 62318 60541 59037 58595 59430 61009 62209 61992 60351 58348
55386E8348j513j360j962k277j254P42K269K096J61k103k581p18J290R50j098
$$ 58348 56835 55475 53513 51236 49982 50724 52993 55089 55250 53147 50566 49848 51138 52088 50990
55371E0990j952p58K85j52l79J083K654K322J022P83J123J35j881k758j925q46
$$ 50990 49038 48280 48565 48413 48034 49117 51771 54093 55115 55898 57021 57156 55275 52517 50592 49746
55355D9746k42N56J514J742J476J852K526J960L68k27N53O03j005k045n16K163
$$ 49746 49504 50060 51574 53316 54792 56644 59170 61130 61498 61271 61824 62427 61422 59377 58861 61024
55339F1024L244K383J176K15j189k803l237k070o55l00o96p13m5N09K31n14n59
$$ 61024 64268 66651 67827 68042 66853 64050 60813 58743 58088 57788 57092 56379 56334 56843 57074 56560 56001
55322E6001O77K280K648J196j002k413k477j800j284j307j502j164l8J336K166
$$ 56001 56678 58958 61606 62802 61800 59387 56910 55110 53826 52519 51017 49853 49815 51151 53317
55307E3317K188J553K98j502l148l647k848j700j156j166j045m63K79O97O60M85
$$ 53317 55505 57058 57356 55854 52706 49059 46211 44511 43355 42189 41144 40681 40960 41657 42317 42802
55291D2802N44O69J48j348k904l019j362M63N35j196k817k773j590o75p4J263
$$ 42802 43346 44015 44163 42815 39911 36892 35530 35993 36528 35332 32515 29742 28152 27477 27403 28666
55275B8666L013L080N63k279k765j379p29j521j943r62K15N83Q27J448J448L06
$$ 28666 31679 34759 35322 33043 30278 28899 28170 26649 24706 23744 23959 24542 25369 26817 28265 28571
55259B8571o33k61M73M51M56J498K458J590n38j739j171K88J894L260L345J514
$$ 28571 27938 27677 28150 28601 29057 30555 33013 34603 34065 32326 31155 31443 33337 36597 39942 41456
55243D1456o66r04N69J264N7j476j680q17K7L41p3j204k092j421N46J911J595
$$ 41456 40790 39886 40455 41719 41776 40300 38620 37803 37830 38171 38098 36894 34802 33381 33927 35838 37433
55226C7433O18L34O29N90N2l58j26O79J437J390N64Q1P56J714J529L85l43m47
$$ 37433 38051 38385 39014 39604 39656 39298 39172 39851 41288 42678 43242 43323 44079 45793 47322 47707 47364 46917
55208D6917j070k319k667j393O1K17l39j83O64R22rj358j914j072P19K081J733
$$ 46917 45847 43528 40861 39468 39529 39746 39407 39224 39888 40810 40801 39443 37529 36457 37176 39257 40990
55191D0990j20j755j583L50K569L416K271O0j450j452r08r04q69L61K214K799
$$ 40990 40870 39115 37532 37882 40451 43867 46138 46198 44748 43296 42388 41484 40615 40976 43190 45989
55175D5989J646K71k94q01j934k849k575j577q51m44J63R80J733K388K736K182
$$ 45989 47635 47906 47612 46811 44877 42028 39453 37876 37025 36581 36744 37724 39457 41845 44581 46763
55159D6763P61m38o22k93k49l46j05K24R9l53n86m65j55K77N93L66k39l24M61
$$ 46763 47524 47086 46464 46171 45922 45576 45471 45695 45794 45441 44855 44390 44235 44512 45105 45471 45232 44908 45369
55140D5369J238J225R59J357K156K361J779J117P68M05l03j211j958k226j891
$$ 45369 46607 47832 48791 50148 52304 54665 56444 57561 58329 58734 58431 57220 55262 53036 51145
55125E1145j248q55q29o49k4N26L82k84q01q65o89o14q83j478j942j835j499j657
$$ 51145 49897 49042 48213 47564 47540 48066 48448 48164 47363 46498 45809 45195 44312 42834 40892 39057 37558 35901
55107C5901k071j451N99K452K115l46k773l091j052J871L735L619K240J007M35
$$ 35901 33830 32379 32978 35430 37545 37199 34426 31335 30283 32154 35889 39508 41748 42755 43190
55092D3190L7l54k26L72M00o20j599j397n18l07j006j622j291nJ623K542J878
$$ 43190 43227 42873 42647 43019 43419 42799 41200 39803 39285 38978 37972 36350 35059 35054 36677 39219 41097
55075D1097K09m90P61K344K144O19R8J235K166J487L48M88J552J633j21k607m136
$$ 41097 41306 40816 41577 43921 46065 46684 46782 48017 50183 51670 52018 52506 54058 55691 55570 52963 48827
55058D8827l819j771J059L137L240J656J13M4J092J801J616J618K894M871N803
$$ 48827 45008 43237 44296 47433 50673 52329 52442 52486 53578 55379 56995 58613 61507 66378 72181
55043G2181M733K423M10l34J45R92J182L46q81j729k219k620k377o71J885L353
$$ 72181 76914 79337 79747 79413 79558 80550 81732 82078 81197 79468 77249 74629 72252 71581 73466 76819
55027G6819K726J136K67N33J376K308K830K192L81j231j255PJ124J486J610J797
$$ 76819 79545 80681 80948 81481 82857 85165 87995 90187 90568 89337 88082 88089 89213 90699 92309 94106
55011I4106J542N00q94j941k387k396k217j909j187K74K065K991K290O39n96r24
$$ 94106 95648 96148 95254 93313 90926 88530 86313 84404 83217 83491 85556 88547 90837 91476 90880 89956
54995H9956r18j182j661j983j831j089j01M09P9n22n83j08K37O3n13j300k049
$$ 89956 89038 87856 86195 84212 82381 81292 81191 81600 81679 81157 80574 80466 80703 80766 80253 78953 76904
54978G6904k188j392k94J66M4J91O58M12r81k347k369j388p34p03k16J349K995
$$ 76904 74716 73324 73030 73196 73240 73431 74089 74501 73520 71173 68804 67416 66682 65979 65763 67112 70107
54961G0107L317K282J140P63Q62Q21O58P02R14J045J125J215R39j3j043j081j9
$$ 70107 73424 75706 76846 77609 78471 79292 79950 80652 81566 82611 83736 84951 85890 85877 84834 83753 83734
54944H3734J031J137O08M02R17J746K209J891R72J67n7j88r66k068k371j738j508
$$ 83734 84765 85902 86510 86912 87829 89575 91784 93675 94647 94814 94757 94569 93603 91535 89164 87426 85918
54927H5918k524l632l053p01J782K915K489J126l12r45m26N08O17m54j709j866
$$ 85918 83394 79762 76709 76008 77790 80705 83194 84320 84008 83063 82637 83145 83762 83308 81599 79733
54911G9733o93Q31J511J040J42l82n34p45q89l21J057K457L119L063K665K134
$$ 79733 79040 79871 81382 82422 82564 82182 81648 80903 80014 79693 80750 83207 86326 89389 92054 94188
54895I4188J559R96K90m88m55J269L943N505N035L854L565M151M832N643O869
$$ 94188 95747 96743 97033 96545 96090 97359 101302 106807 111842 115696 119261 123412 128244 133887 140756
54880A40756P803P548O639O578P852R558J0700J1016J0596R614Q268O325L210
$$ 140756 148559 156107 162746 169324 177176 186734 197434 208450 219046 228660 236928 243253 246463
54867B46463p93m117n731o714q705j1322j2574j1625r623p863o714o400p206q327
$$ 246463 245670 241553 235822 229108 220403 209081 196507 184882 175259 167396 160682 154282 147076 138749
54853A38749p983n473k129K43J171J289J223J171R84L15o73p90J001L764N198
$$ 138749 130766 125293 123164 123407 124578 125867 127090 128261 129245 129560 128887 128097 129098 132862 138060
54838A38060M463L281L599N259O753P351P445P528P800Q355Q802Q098N639K304
$$ 138060 142523 145804 149403 154662 161415 168766 176211 183739 191539 199894 208696 216794 222433 224737
54824B24737m47k311m153o344p999q172p173o265o302p130q095q828r370r826
$$ 224737 224290 221979 217826 211482 203483 195311 188138 181873 175571 168441 160346 151518 142148 132322
54810A32322j0062r666q163n496k625j220j972l344k989p70Q56J03j591j567M18
$$ 132322 122260 112594 104431 98935 96310 95090 93118 89774 86785 86015 86871 86974 85383 83816 84234
54795H4234K246K588K168J794J175K65N1Q88J356P7k227l634l395k282j101n9
$$ 84234 86480 89068 91236 93030 94205 94470 94521 95409 96765 96842 94615 90981 87586 85304 84203 84144
54779H4144N79L82n53j485j791j414o03K58O58K53p36j715k212k083j465q55q41
$$ 84144 84723 85105 84552 83067 81276 79862 79259 79517 80175 80428 79692 77977 75765 73682 72217 71362 70521
54762G0521j319j306m7J872L059K822J614J85j017j563r61P39K715M131M836N019
$$ 70521 69202 67896 67849 69721 72780 75602 77216 77401 76384 74821 73860 74599 77314 81445 86281 91300
54746I1300M453K693O9k016k226o83J091J699J211Q89J711L355M579M446L258
$$ 91300 95753 98446 98515 96499 94273 93590 94681 96380 97591 98480 100191 103546 108125 112571 115829
54731A15829K325K818M617O478P365P461P638Q249Q863R069R047R153R377R455
$$ 115829 118154 120972 125589 132067 139432 146893 154531 162780 171643 180712 189759 198912 208289 217744
54717B17744R306R057Q745Q033O349L445l7k806m085m421n057o510q074q637p695
$$ 217744 227050 236107 244852 252885 259234 262679 262642 259836 255751 251330 246273 239763 231689 223052 215357
54702B15357n693l754k955l403l978l446j807j00J014J791K523K971L090L535
$$ 215357 209664 205910 202955 199552 195574 192128 190321 190221 191235 193026 195549 198520 201610 205145
54688B05145M844O518P539P568P129O861P169Q390J0595J3075J4660J4985J5018
$$ 205145 209989 216507 224046 231614 238743 245604 252773 261163 271758 284833 299493 314478 329496
54675C29496J5904J7265J7154J3918Q027J821k580m961o706r095j2040j4344j5088
$$ 329496 345400 362665 379819 393737 401764 403585 401005 396044 389338 380243 368203 353859 338771
54662C38771j4695j4519j5204j5682j4421j1655r540r639j0933j1088r268o704
$$ 338771 324076 309557 294353 278671 264250 252595 243055 233416 222483 211395 202127 195423
54650A95423m841l931l591l677m066m273l856k908j795p38P0K61l28j304k040
$$ 195423 190582 186651 183060 179383 175317 171044 167188 164280 162485 161747 161817 162078 161750 160446 158406
54635A58406k227j929j322o89m40p25j070p40L77J412J343K38n32L01K273L401
$$ 158406 156179 154250 152928 152239 151799 151074 150004 149264 149641 151053 152396 152634 152102 152403 154676 158077
54619A58077K330k3j376n16J586L077L265L076L644M795N273M502L562L797M857
$$ 158077 160407 160384 159008 158492 160078 163155 166420 169496 173140 177935 183208 187710 191272 195069 199926
54604A99926N101L959K685K372K419J870J180J346K081K242J721J421J521J304
$$ 199926 205027 208986 211671 214043 216462 218332 219512 220858 222939 225181 226902 228323 229844 231148
54590B31148P93J034K270L153K479P78m31k56J145L016M352M560M275M890O893
$$ 231148 231941 232975 235245 238398 240877 241655 241224 240968 242113 245129 249481 254041 258316 263206 270099
54575B70099R210J0622J1153J1603J2423J3532J4744J5897J6877J7677J8054J7167
$$ 270099 279309 289931 301084 312687 325110 338642 353386 369283 386160 403837 421891 439058
54563D39058J4378J0457O959M211J117k786o407q917j0992j3178j4463j3913j2684
$$ 439058 453436 463893 470852 475063 476180 473394 466987 458070 447078 433900 419437 405524 392840
54550C92840j2560j3236j2884j1119r558r266r443r124q601q466q557q687r377
$$ 392840 380280 367044 354160 343041 333483 324217 314774 305650 297049 288583 280026 271339 261962
54537B61962j0768j1646j0719q417o489n906o141o358o349o085n223l698k255
$$ 261962 251194 239548 228829 220412 213923 208017 201876 195518 189169 183084 177861 174163 171908
54524A71908j714j903j905j376j045j688l021l999l980l289k649k457k616k766
$$ 171908 170194 168291 166386 165010 163965 162277 159256 155257 151277 147988 145339 142882 140266 137500
54510A37500k657k396k356k706l110l101k719k458k609k855k645j839r23n15o48
$$ 137500 134843 132447 130091 127385 124275 121174 118455 115997 113388 110533 107888 106049 105126 104611 103963
54495A03963o21P0Q76P56k06n52O70K386K594Q02j363j863j30K511L920K974P98
$$ 103963 103342 103412 104288 105044 104838 104286 104956 107342 109936 110738 109375 107512 107382 109893 113813 116787 117585
54478A17585k11R50K844L647L336K861K230R71j49L05K216M033N067O055P287
$$ 117585 117374 118324 121168 124815 128151 131012 133242 134213 134064 134369 136585 140618 145685 151740 159027
54463A59027Q022Q158Q701R841J0243R069P208N678M256K732J870J919J483n69
$$ 159027 167049 175207 183908 193749 203992 213061 220269 225947 230203 232935 234805 236724 238207 237638
54449B37638l120m225l743l141l281l811m377n172o353p697q607q176n985l358
$$ 237638 234518 230293 226550 223409 220128 216317 211940 206768 200415 192718 184111 175935 169950 166592
54435A66592k606m154n611m801k574j250j425j947k203k509k697k171j251r67
$$ 166592 163986 159832 154221 149420 146846 145596 144171 142224 140021 137512 134815 132644 131393 130426
54421A30426j537k248k663k809k518j773j293j535j641o69P65J484J708K303K823
$$ 130426 128889 126641 123978 121169 118651 116878 115585 114050 112409 111740 112505 113989 115697 118000 120823
54406A20823K257J200J009J215K07j501j508N80K197J697N65N64J038P55L11O45
$$ 120823 123080 124280 125289 126504 126711 125210 123702 124282 126479 128176 128741 129305 130343 131098 131409 132054
54390A32054Q27n37k723l707k885j324J16J250J579N49j327k742k992k250r01
$$ 132054 132881 132344 129621 125914 123029 121705 121821 123071 124650 125199 123872 121130 118138 115888 114987
54375A14987M22O89m39j707j602l38O39P28O07P04N87O0k38K68J278J952J558
$$ 114987 115409 116098 115659 113952 112350 112012 112651 113379 113986 114690 115277 115337 115099 115367 116645 118597 120155
54358A20155%j738j935J27L008M602M634M474M651M133K460J005J153K363L239
$$ 120155 120155 118417 116482 116609 119617 124219 128853 133327 137978 142111 144571 145576 146729 149092 152331
54343A52331L684M588N840O129M856L106K255K496L215M104N224O267O411N023
$$ 152331 156015 160603 166443 172572 177428 180534 182789 185285 188500 192604 197828 204095 210506 215529
54329B15529K321o01k335k131o42M72q0k191m677o264o196m545k438j483k219
$$ 215529 217850 217249 214914 212783 212141 212613 212533 210342 205665 199401 193205 188660 186222 184739 182520
54314A82520l392l480k593k038k251k490k543l179m378m601k864m72O43M08J29
$$ 182520 179128 175648 173055 171017 168766 166276 163733 160554 156176 151575 148711 148239 148882 149290 149419
54299A49419K23n9q57j235n60Q09K273L305L138J470l82m90J200K705K780K384
$$ 149419 149642 149583 148726 147491 146931 147740 150013 153318 156456 157926 157544 157054 158254 160959 163739 166123
54283A66123K735L451L755M122N172N870M647J962P2J78J232J780J690J449Q98
$$ 166123 168858 172309 176064 180186 185358 191228 195875 197837 197909 198087 199319 201099 202789 204238 205136
54268B05136n24k744m944o289o450n736m889m445m170l527k744k739l732m729
$$ 205136 204612 201868 196924 190635 184185 178449 173560 169115 164945 161418 158674 155935 152203 147474
54254A47474m904m766n041n127l923j875p12r23j023L8J178Q90m97j604k180k862
$$ 147474 142570 137804 132763 127636 123713 121838 121126 120203 119180 119218 120396 121286 120789 119185 117005 114143
54238A14143l369k692j026J92L12Rm22j512k940l242k077j130j654k632k547j454
$$ 114143 110774 108082 107056 107248 107560 107569 107147 105635 102695 99453 97376 96246 94592 91960 89413 87959
54222H7959L6K147M494M850J838k088l073q56J144O73j028j958j874j287k02R30
$$ 87959 87995 90142 94636 99486 101324 99236 96163 95307 96451 97124 96096 94138 92264 90977 90775 91705
54206I1705Q76m77j367m70J243K063J750J067K83n75q29M5J307J762J289O48J85
$$ 91705 92581 92104 90737 90267 91510 93573 95323 96390 96673 96098 95269 95314 96621 98383 99672 100320 100505
54189A00505k70n61k11P56J577J358j70k164k936j457J167K620K031P33J00j78
$$ 100505 100235 99674 99463 100219 101796 103154 102984 100820 97884 96427 97594 100214 102245 102978 103078 102900
54173A02900q94j656j474l47P94J198O78m39j114j59K115L762L479K180J283O40
$$ 102900 102006 100350 98876 98529 99323 100521 101199 100760 99646 99487 101602 105364 108843 111023 112306 112946
54157A12946n23j499q97Q61J706P26p00r57j34N51L68m93j401j830j676j262q29
$$ 112946 112423 110924 110027 110888 112594 113320 112620 111663 111529 112080 112448 111955 110554 108724 107048 105786 104957
54140A04957k42N01P79j8j598k977l351k465o16J234J903J236L84K76M54J26m35
$$ 104957 104715 105216 105995 105977 104379 101402 98051 95586 94970 96204 98107 99343 99727 100003 100457 100583 100148
54123A00148n18k36j1N20J683K448J561k26q25L28J589J553O25k44q72j357j490
$$ 100148 99630 99394 99383 99903 101586 104034 105595 105369 104544 104872 106461 108014 108639 108395 107523 106166 104676
54106A04676j332j336j403q29K59N96m31j775k280k247k529k959k766j946j076
$$ 104676 103344 102008 100605 99776 100035 100631 100200 98425 96145 93898 91369 88410 85644 83698 82622
54091H2622k49P07J271O70o58j157q7J353J379l29k395l323k799j432J39J521
$$ 82622 82373 83080 84351 85021 84363 83206 83119 84472 85851 85522 83127 79804 77005 75573 75712 77233
54075G7233K182J634J42j239j736j492q87J46J584K709K924K698K659K242M56
$$ 77233 79415 81049 81191 79952 78216 76724 75837 75983 77567 80276 83200 85898 88557 90799 91255
54060I1255k080l362k561j040l26k88nO33J137J436J684J604R84L44L38P16O62
$$ 91255 89175 85813 83252 82212 81886 81598 81593 82226 83363 84799 86483 88087 89071 89415 89753 90469 91131
54043I1131o5r95j668j789r93P31K433K867J844M16l86l41L33J409K415K641J870
$$ 91131 91066 90071 88403 86614 85621 86352 88785 91652 93496 93912 93526 93185 93518 94927 97342 99983 101853
54026A01853Q28M48R06J603J978J897J411N23n58j335j486j292j282j520j552
$$ 101853 102681 103129 104035 105638 107616 109513 110924 111447 110889 109554 108068 106776 105494 103974 102422
54011A02422j093l17O16J753K728K560P65j550k458j171J243L037L270K240J055
$$ 102422 101329 101012 101628 103381 106109 108669 109434 107884 105426 104255 105498 108535 111805 114045 115100
53996A15100Q47J843L118L663L603L715L973L610K690K370L051L453K451R51P92
$$ 115100 115947 117790 120908 124571 128174 131889 135862 139472 142162 144532 147583 151036 153487 154438 155230
53981A55230K323M301N803O943P720P583O607N962O461P381P535O966O672O989
$$ 155230 157553 161854 167657 174600 182320 189903 196510 202472 208933 216314 223849 230815 237487 244476
53967B44476P128O444N376M864N298O248O840O168L977J319OQ07K414K897J944
$$ 244476 251604 258048 263424 268288 273586 279834 286674 292842 296819 298138 298144 298951 301365 304262 306206
53952C06206Q07K22n08j999l508m026l762l622l652l187k280j948k770m136n069
$$ 306206 307013 307235 306727 304728 301220 297194 293432 289810 286158 282971 280691 278743 275973 271837 266768
53937B66768n211m923m815n201n535m754k792j287j664k955k974j600r70j999
$$ 266768 261557 256634 251819 246618 241083 236329 233537 232250 230586 227631 224657 223057 222087 220088
53923B20088k705j227J170J842M00j300k133k642l193l152k301j463j213j167
$$ 220088 217383 216156 217326 219168 219568 218268 216135 213493 210300 207148 204847 203384 202171 201004
53909B01004j027j151j527j376m20M07L07k57n80r01j533j666l53J706K721K087
$$ 201004 199977 198826 197299 195923 195503 195910 196217 195960 195380 194479 192946 191280 190927 192633 195354 197441
53893A97441R19L45L87O82J142J496J208N06N36J802L091K888J377J54K95J588
$$ 197441 198360 198705 199092 199774 200916 202412 203620 204126 204662 206464 209555 212443 213820 213974 214269 215857
53877B15857L450N521P218P639O581N071M355M669N345N832O045N835M751K714
$$ 215857 219307 224828 232046 239685 246266 251337 255692 260361 265706 271538 277583 283418 288169 290883
53863B90883O79L9J101K457K523J637J872M305P313Q369P088N451N175O014O785
$$ 290883 291562 291601 292702 295159 297682 299319 301191 305496 312809 321178 328266 333717 338892 344906 351691
53848C51691O956O719O420O424O881P189O372M470K709J797J038j80j068p67o3
$$ 351691 358647 365366 371786 378210 385091 392280 398652 403122 405831 407628 408666 408486 407418 406651 406588
53833D06588m44j934l375m390n454o256n767m303l789n266p565r141r927j0319
$$ 406588 406144 404210 400835 396445 390991 384735 378968 374665 370876 365610 358045 348904 338977 328658
53819C28658r707p548n177m788o587q323q033o260n027n343o343o588n643m308
$$ 328658 318951 311403 306226 301438 294851 286528 278495 272235 267208 261865 255522 248934 243291 238983
53805B38983l642l977m815n465n669n643n696n786n518m679l712l265l235k759
$$ 238983 235341 231364 226549 221084 215415 209772 204076 198290 192772 188093 184381 181116 177881 175122
53791A75122j543o24j105k473l079k175o59K20N9p71j510j169N96K473K416J04
$$ 175122 173579 172955 171850 169377 166298 164123 163464 163684 163743 162972 161462 160293 160889 163362 165778 165882
53775A65882k452l411l134k918k789j943o42j9j00M32K106L543L185J291m29p71
$$ 165882 163430 160019 156885 153967 151178 149235 148593 148574 148474 148906 151012 154555 157740 159031 158602 157831
53759A57831L7R61J264J093J285K449M066M749L753J956J047J734L148L903L498
$$ 157831 157868 158829 160093 161186 162471 164920 168986 173735 177488 179444 180491 182225 185373 189276 192774
53744A92774K611K335L221M868O211O427N701N057N230N843O017N569N121M988
$$ 192774 195385 197720 200941 205809 212020 218447 224148 229205 234435 240278 246295 251864 256985 261973
53730B61973M685L821K897K618K841K866K570K484K840L141K837J917P70j00k80
$$ 261973 266658 270479 273376 275994 278835 281701 284271 286755 289595 292736 295573 297490 298260 298160 297880
53715B97880J60M43j49j319k161k460k828l488l762l154k145j448j163j155j623
$$ 297880 298040 298483 298334 297015 294854 292394 289566 286078 282316 279162 277017 275569 274406 273251 271628
53700B71628k593l359l134k079j048n29l79m28o74r23q30m84n29j430k773l612
$$ 271628 269035 265676 262542 260463 259415 258886 258507 258079 257405 256482 255652 255168 254639 253209 250436 246824
53684B46824l522l125l295l882l760k403r02p46j946l117l249k496j452o28p00
$$ 246824 243302 240177 236882 233000 229240 226837 225935 225189 223243 220126 216877 214381 212929 212301 211601
53669B11601j979l408l298j612k68n55j376j048K81J269J465J437J405J268J561
$$ 211601 209622 206214 202916 201304 201036 200481 199105 198057 198338 199607 201072 202509 203914 205182 206743
53654B06743K950M726N222L931K170J384J711K469L101L314K995K423K071K006
$$ 206743 209693 214419 219641 223572 225742 227126 228837 231306 234407 237721 240716 243139 245210 247216
53640B47216J967K002K399K854K576J516Q36J618L446M765M493L002J634J341
$$ 247216 249183 251185 253584 256438 259014 260530 261366 262984 266430 271195 275688 278690 280324 281665
53626B81665J818K002J443R32J458K833L809L495K157O43m86j184j567j630j307
$$ 281665 283483 285485 286928 287860 289318 292151 295960 299455 301612 302255 301769 300585 299018 297388 296081
53611B96081q00o64j258k162k600k466k291k132j369J0Q80M09p65j530j711j666
$$ 296081 295281 294617 293359 291197 288597 286131 283840 281708 280339 280349 281229 281638 280873 279343 277632 275966
53595B75966j317n94q4j25L3Q79J280%j959k504j548r81j489j588k31J538K450
$$ 275966 274649 274055 273971 273846 273879 274758 276038 276038 274079 271575 270027 269046 267557 265969 265738 267276 269726
53578B69726K736L067L177K679J951J369P03J52O10J998K744K056J391K248L771
$$ 269726 272462 275529 278706 281385 283336 284705 285408 285560 286170 288168 290912 292968 294359 296607 300378
53563C00378M263L932M174M883M697L608L138L744M095L477L121M227O015O797
$$ 300378 304641 308573 312747 317630 322327 325935 329073 332817 336912 340389 343510 347737 353752 360549
53549C60549O096M855M215M737O116P134O518M506K966L307M877O082O421O486
$$ 360549 366645 371500 375715 380452 386568 393702 400220 404726 407692 410999 415876 421958 428379 434865
53535D34865O488N999N067M441M346M054L179K654L487M944M999K789n6j064M02
$$ 434865 441353 447352 452419 456860 461206 465260 468439 471093 474580 479524 484523 487312 487256 486192 486594
53520D86594K581L303K074P8j472k507l617m794n176m116k078j46J122J870K199
$$ 486594 489175 492478 494552 494630 493158 490651 487034 482240 477064 472948 470870 470724 471846 473716 475915
53505D75915J958J278O30N7q73k008k289j140N89J821K661L572L900K777J028
$$ 475915 477873 479151 479781 479838 478965 476957 474668 473528 474117 475938 478599 482171 486071 488848 489876
53490D89876N36J647K889L410L849M283L462J355M63K683O206P655O530N257N302
$$ 489876 490412 492059 494948 498358 502207 506490 509952 511307 511770 514453 520659 528314 534844 540101 545403
53475E45403N695N610N974P505Q990R019Q255Q533J0275J2007J2301J1284J0314
$$ 545403 551098 556708 562682 570187 579177 588196 596451 604984 615259 627266 639567 650851 661165
53462F61165J0742J2942J6051J8662K0003K0299K0009J9345J8764J9186K0992
$$ 661165 671907 684849 700900 719562 739565 759864 779873 799218 817982 837168 858160
53451H58160K3258K4625K4756K4413K4394K5040K6464K8476L0342L1314L1549
$$ 858160 881418 906043 930799 955212 979606 1004646 1031110 1059586 1089928 1121242 1152791
53440A152791L1823L2374L2689L2586L2671L3394L4323L4878L5112L5153L4561
$$ 1152791 1184614 1216988 1249677 1282263 1314934 1348328 1382651 1417529 1452641 1487794 1522355
53429A522355L3088L1694L1673L2761L3145L1727K9490K8123K8015K8348K8640
$$ 1522355 1555443 1587137 1618810 1651571 1684716 1716443 1745933 1774056 1802071 1830419 1859059
53418A859059K9133K9767K9737K8544K6890K5968K6092K6444K6174K5313K4423
$$ 1859059 1888192 1917959 1947696 1976240 2003130 2029098 2055190 2081634 2107808 2133121 2157544
53407B157544K3601K2204J9587J5786J1339O832K908L45o50j170k811n828q843
$$ 2157544 2181145 2203349 2222936 2238722 2250061 2256893 2259801 2260146 2259496 2258326 2255515 2249687 2240844
53394B240844j0773j2263j4497j7244j9195j9924k0408k1538k3113k4541k5622
$$ 2240844 2230071 2217808 2203311 2186067 2166872 2146948 2126540 2105002 2081889 2057348 2031726
53383B031726k6237k6081k5282k4704k5052k6001k6608k6208k4586k1774j8292
$$ 2031726 2005489 1979408 1954126 1929422 1904370 1878369 1851761 1825553 1800967 1779193 1760901
53372A760901j5188j3185j1940j0636r123p877o950n630l415q55R61J643J958
$$ 1760901 1745713 1732528 1720588 1709952 1700829 1692952 1686002 1680372 1676957 1676102 1677063 1678706 1680664
53359A680664K969M861O816Q150R208J0772J2741J4196J4918J6093J8905K2927
$$ 1680664 1683633 1688494 1695310 1703460 1712668 1723440 1736181 1750377 1765295 1781388 1800293 1823220
53347A823220K6564K8894L0360L1726L3148L4534L6211L8666M1717M4421M5992
$$ 1823220 1849784 1878678 1909038 1940764 1973912 2008446 2044657 2083323 2125040 2169461 2215453
53336B215453M6658M7470M9270N1975N4872N7376N9309O0703O1807O3186O5285
$$ 2215453 2262111 2309581 2358851 2410826 2465698 2523074 2582383 2643086 2704893 2768079 2833364
53325B833364O7723O9514P0198P0328P0527P0557O9737O7981O5851O3821O1986
$$ 2833364 2901087 2970601 3040799 3111127 3181654 3252211 3321948 3389929 3455780 3519601 3581587
53314C581587O0370N8965N7371N4842N0770M5014L7794K9794K2301J6574J2614
$$ 3581587 3641957 3700922 3758293 3813135 3863905 3908919 3946713 3976507 3998808 4015382 4027996
53303D027996Q889L700l206j0657j7511k3747l0007l6484m2612m7698n1489n4167
$$ 4027996 4036885 4040585 4037379 4026722 4009211 3985464 3955457 3918973 3876361 3828663 3777174 3723007
53291C723007n6112n7829n9703o1666o3292o4317o4870o5052o4817o4302o3743
$$ 3723007 3666895 3609066 3549363 3487697 3424405 3360088 3295218 3230166 3165349 3101047 3037304
53280C037304o2720o0301n6597n3394n2219n2341n1905n0656m9901m9759m8251
$$ 3037304 2974584 2914283 2857686 2804292 2752073 2699732 2647827 2597171 2547270 2497511 2449260
53269B449260m4013l8464l4219l2142l1060k9666k7634k5304k3284k2187k2070
$$ 2449260 2405247 2366783 2332564 2300422 2269362 2239696 2212062 2186758 2163474 2141287 2119217
53258B119217k2165k1705k0650j9290j7721j6279j5755j6280j6557j5209j2619
$$ 2119217 2097052 2075347 2054697 2035407 2017686 2001407 1985652 1969372 1952815 1937606 1924987
53247A924987j0455r558r255q654p604o314m830l181j473K89K013L293L861M240
$$ 1924987 1914532 1904974 1895719 1887065 1879461 1873147 1868317 1865136 1863663 1863952 1865965 1869258 1873119 1877359
53233A877359N386P720J0878J4192J7020J8913K0113K1583K3908K6428K8096K8830
$$ 1877359 1882745 1890465 1901343 1915535 1932555 1951468 1971581 1993164 2017072 2043500 2071596 2100426
53221B100426K9149K8943K7698K5828K4604K4553K4811K4216K2398J9602J6322
$$ 2100426 2129575 2158518 2186216 2212044 2236648 2261201 2286012 2310228 2332626 2352228 2368550
53210B368550J3101J0107O862L055o36l341n381p811j0761j3376j5378j7419j9822
$$ 2368550 2381651 2391758 2398620 2401675 2401039 2397698 2392317 2384506 2373745 2360369 2344991 2327572 2307750
53197B307750k2254k4766k7696l0355l1403l1071l1363l3191l4962l5180l4886
$$ 2307750 2285496 2260730 2233034 2202679 2171276 2140205 2108842 2075651 2040689 2005509 1970623
53186A970623l5981l8145l9205l8088l5791l3704l2430l2110l2624l3167l2664
$$ 1970623 1934642 1896497 1857292 1819204 1783413 1749709 1717279 1685169 1652545 1619378 1586714
53175A586714l0904k8690k6898k5806k5245k4780k3903k2512k1031j9759j8390
$$ 1586714 1555810 1527120 1500222 1474416 1449171 1424391 1400488 1377976 1356945 1337186 1318796
53164A318796j6648j4928j3840j3560j3956j4651j4608j2721r675q068r387j1862
$$ 1318796 1302148 1287220 1273380 1259820 1245864 1231213 1216605 1203884 1194209 1186141 1176754 1164892
53152A164892j2760j2065j2021j3583j5385j6223j6519j6808j6635j5676j4612
$$ 1164892 1152132 1140067 1128046 1114463 1099078 1082855 1066336 1049528 1032893 1017217 1002605
53141A002605j4145j4297j5071j6463j7420j6414j3782j1895j2131j3241j3814
$$ 1002605 988460 974163 959092 942629 925209 908795 895013 883118 870987 857746 843932
53130H43932j4440j5850j6707j5566j3868j4208j6127j6386j3659j0324q890q914
$$ 843932 829492 813642 796935 781369 767501 753293 737166 720780 707121 696797 687907 678993
53118F78993q738q304q624r703j0680j1254j1529j0972r009o458n159n964p952
$$ 678993 670255 661951 653327 643624 632944 621690 610161 599189 590180 583722 578563 572599 564647
53105E64647r514r625q266o462n672o341p105o312m254k887l248m222m348l858
$$ 564647 555133 545508 537242 530780 525108 518767 511662 505350 501096 498209 494961 490739 486391 482533
53091D82533m048n207o130n740m481l757m272n257n535m998m605m869n029m174
$$ 482533 478485 473278 467148 461408 456927 453170 448898 443641 438106 433108 428503 423634 418605 414431
53077D14431k574j227m96j13k26j264k796l672l588l355l341k796j477o20j347
$$ 414431 411857 410630 410134 410021 409795 408531 405735 402063 398475 395120 391779 388983 387506 386886 385539
53062C85539k923l727l385k884k964l408l687l514k951k569l042m048m330l603
$$ 385539 382616 378889 375504 372620 369656 366248 362561 359047 356096 353527 350485 346437 342107 338504
53048C38504l363m537n318l392K18J842j02l128m207l325k476k670l368l841l678
$$ 338504 335141 330604 325286 321894 322112 323954 323852 320724 316517 313192 310716 308046 304678 300837 297159
53033B97159k571p56O49P32p4o14l85K85R27J155P14n3k53M28J157J160P96P88
$$ 297159 294588 293832 294481 295213 295139 294525 294140 294425 295352 296507 297221 297168 296915 297343 298500 299660 300456 301244
53015C01244J025J102J339K205L146L241K740K707L289L511K902K187K075K374
$$ 301244 302269 303371 304710 306915 310061 313302 316042 318749 322038 325549 328451 330638 332713 335087
53001C35087K517K156R91j053l143l911l092k078k375l958n646o422n947m301
$$ 335087 337604 339760 340751 339698 336555 332644 329552 327474 325099 321141 315495 309073 303126 298825
52987B98825k072m43n01k265m694o628p499p354o498n303m121l283l057l398l781
$$ 298825 296753 296310 295809 293544 288850 282222 274723 267369 260871 255568 251447 248164 245107 241709 237928
52972B37928l536k583j671j649k570l713m401m581m507m128l151j680m45m3j53
$$ 237928 234392 231809 230138 228489 225919 222206 217805 213224 208717 204589 201438 199758 199313 199270 199117
52957A99117J20J053J912J837Q24l51r23p43l75o30j693k685k589j600r56j260
$$ 199117 199237 200290 202202 204039 204863 204512 203589 202846 202471 201841 200148 197463 194874 193274 192318 191058
52941A91058j798j781j411j075m51O15J231N83n05o37j02n68k301l330k022O39
$$ 191058 189260 187479 186068 184993 184542 185157 186388 186971 186466 185829 185727 185159 182858 179528 177506 178145
52925A78145K278J873L98o87p13J09J101J536J196N96M93J143K043K299J325n01
$$ 178145 180423 182296 182694 182007 181294 181403 182504 184040 185236 185832 186325 187468 189511 191810 193135 192634
52909A92634j885j765m23Q90J433J500J419Q50m88j922k281j080J063L040M072
$$ 192634 190749 188984 188561 189451 190884 192384 193803 194653 194165 192243 189962 188882 189945 192985 197057
52894A97057M117L640K902J690L0j149r04K81R53Q35J295L083M799M704L218K240
$$ 197057 201174 204814 207716 209406 209436 208287 207383 207664 208617 209452 210747 213830 218629 223333 226551 228791
52878B28791K402K557J976J540K162L201L416K769K331K677L277L554L667L994
$$ 228791 231193 233750 235726 237266 239428 242629 246045 248814 251145 253822 257099 260653 264320 268314
52864B68314M387M540M788N858P661Q921Q395O233L770K190J893K801M476N767
$$ 268314 272701 277241 282029 287887 295548 304469 312864 319097 322867 325057 326950 329751 334227 339994
52850C39994N285K841p1j836k419k927l817m380m002l072k314j795j123k86K70
$$ 339994 345279 348120 348049 346213 343794 340867 337050 332670 328668 325596 323282 321487 320364 320078 320348
52835C20348K83n6m90r51j398j750k150k954m212n362n768n376m503l290j849
$$ 320348 320631 320575 320085 319134 317736 315986 313836 310882 306670 301308 295540 290164 285661 282371 280522
52820B80522p49n62q84o35M16J318J508J657K207K122M18j816k434j075O25J562
$$ 280522 279773 279211 278327 277692 278108 279426 280934 282591 284798 286920 287338 285522 283088 282013 282638 284200
52804B84200K182K704K141J28j850k275j668j525j992k028j297n58l00k66l05
$$ 284200 286382 289086 291227 291355 289505 287230 285562 284037 282045 280017 278720 278162 277862 277596 277291
52789B77291o23j064r28K53K322M709O459O400M275J538R7K03N63M08K92O46Q45
$$ 277291 276668 275604 274676 274929 277251 281960 288419 294819 299094 300632 300729 300932 301495 301903 302195 302841 303686
52772C03686L30l56m51j33r7m52p71p80m26L10J099J175K92o70p40k62m32j587
$$ 303686 304016 303660 303209 303076 302979 302527 301756 300976 300550 300860 301959 303134 303426 302756 302016 301754 301322 299735
52754B99735k799l180k807k147j351m87J26L51N55J072J611J685J282P08J06k87
$$ 299735 296936 293756 290949 288802 287451 286964 287090 287441 287996 289068 290679 292364 293646 294354 294460 294173
52738B94173L69K697N567O422L968O8k043j258N34J056R9j032j571j894k472l156
$$ 294173 294542 297239 302806 309228 313196 313264 311221 309963 310497 311553 311652 310620 309049 307155 304683 301527
52722C01527l647l953m239m567m914n141m914m072l217l363m653n799n443l876
$$ 301527 297880 293927 289688 285121 280207 275066 270152 266080 262863 259500 254847 249048 243605 239729
52708B39729k758k991l583l125j852j367k342l511l363k142j319j560k150k277
$$ 239729 236971 233980 230397 227272 225420 224053 221711 218200 214837 212695 211376 209816 207666 205389
52694B05389j928j351n22L81O83j19j740l451m627m757l666k078j191j146p25
$$ 205389 203461 202110 201588 201969 202652 202533 200793 197342 192715 187958 184292 182214 181023 179877 179152
52679A79152P24J936J354n97k171k792l385m255m365l144j625j000j001o31K22
$$ 179152 179876 181812 183166 182569 180398 177606 174221 169966 165601 162457 160832 159832 158831 158200 158422
52664A58422P89N89j82j083j645j460o60m9k15q35j350j997l238m399l936j422
$$ 158422 159211 159800 159618 158535 156890 155430 154770 154721 154506 153671 152321 150324 147086 142687 138751 137329
52648A37329J434K367Q62j521k924k772j667l87N90Q83J85j364l023l865l313
$$ 137329 138763 141130 141992 140471 137547 134775 133108 132721 133311 134194 134379 133015 129992 126127 122814
52633A22814j385J120K782K469N65j168j298q4J173J648J476J228J506K584L787
$$ 122814 121429 122549 125331 127800 128365 127197 125899 125815 126988 128636 130112 131340 132846 135430 139217
52618A39217L688J878N0K17K099L535L424K774K608K459J593M30k39l81j62P22
$$ 139217 142905 144783 144833 145050 147149 150684 154108 156882 159490 161949 163542 163972 163733 163352 163190 163912
52602A63912K097K679J584q3m85N34J513J537J099Q39P22O99J177K378L879N092
$$ 163912 166009 168688 170272 170189 169704 170238 171751 173288 174387 175226 175948 176647 177824 180202 184081 189173
52586A89173N771N888N420M387K899J230k5l65k01o36j916k800k246r97l91l11
$$ 189173 194944 200832 206252 210639 213538 214768 214743 214378 214177 213541 211625 208825 206579 205582 205191 204880
52570B04880K13R14M92j065k188k082j712j860j854j099m15o72j260j273j250
$$ 204880 205093 206007 206499 205434 203246 201164 199452 197592 195738 194639 194224 193552 192292 191019 189769
52555A89769k287l960m558l224q16J204J847P94j360l219l740l224k481j533j25
$$ 189769 187482 183522 178964 175740 174924 176128 177975 178769 177409 174190 170450 167226 164745 163212 163087
52540A63087R70O74m64n93Q22K164K078J348J467K372K800K216J213M49J07J68
$$ 163087 164057 164731 164267 163674 164496 166660 168738 170086 171553 173925 176725 178941 180154 180603 180710 180878
52524A80878K97k19j459k108q51J565K906K293J216J244J961K026J332R49J365
$$ 180878 181175 180956 179497 177389 176538 178103 181009 183302 184518 185762 187723 189749 191081 192030 193395
52509A93395J941K051J819J621J558J556J474J012j5j253k112k364k068j063O82
$$ 193395 195336 197387 199206 200827 202385 203941 205415 206427 206412 205159 203047 200683 198615 197552 198234
52494A98234K334K680J651N95O68J625K485K708K250J206R3j18J004K562L174
$$ 198234 200568 203248 204899 205494 206162 207787 210272 212980 215230 216436 216529 216411 217415 219977 223151
52479B23151K389Q28o50j367r04N08J806K007J196K76J9P51K413M230M853L704
$$ 223151 225540 226368 225718 224351 223447 223955 225761 227768 228964 229240 229259 230010 232423 236653 241506 245210
52463B45210J869Q53P84P32K98j58n51j012j084k96O05M97j45J44J063N06j950
$$ 245210 247079 247932 248716 249448 249746 249588 249037 248025 246941 246645 247250 247747 247602 247746 248809 249315 247365
52446B47365l617k282M93J535L99n62Q2J220J393P78L31K39Lo48j416j706j085
$$ 247365 243748 241466 241959 243494 243893 243331 243413 244633 246026 246804 247135 247374 247377 246729 245313 243607 242522
52429B42522J42R34O60J86J046L366N314N007K615K48k20R36J644M72j523k006
$$ 242522 242664 243598 244258 244444 245490 248856 254170 259177 261792 262040 261820 262756 264400 264872 263349 261343
52413B61343m42J229J426J166K149L661L308O56j841k034n33P59J211J404J513
$$ 261343 260901 262130 263556 264722 266871 270532 273840 274496 272655 270621 270088 270847 272058 273462 274975
52398B74975J131L70n1J58M64K55n83j743k654k587j232O71J776J490O16L34Q65
$$ 274975 276106 276476 276425 276583 277047 277302 276719 274976 272322 269735 268503 269174 270950 272440 273056 273390 274255
52381B74255J486J778K109K721K871J650n25k070k009r56n5L57N26L83m18j712
$$ 274255 275741 277519 279628 282349 285220 286870 286345 284275 282266 281310 281255 281612 282138 282521 282103 280391
52365B80391k741k885k197j359j148j587j525J67K767M047K984J103L43O21P31
$$ 280391 277650 274765 272568 271209 270061 268474 266949 267116 269883 273930 276914 278017 278360 278981 279712
52350B79712N43P08R33M70j16L54J363J272K55L52J995K969J882M11M70J088L82
$$ 279712 280255 280963 281896 282366 282250 282604 283967 285239 285494 285846 287841 290810 292692 293103 293573 294661 295043
52333B95043q92l82J878L104J694n91j078O08K681L616L463L090K939K738K264
$$ 295043 294151 293769 295647 298751 300445 299854 298776 299384 302065 305681 309144 312234 315173 317911 320175
52318C20175J885J945J961J236K15J13R54J328P19N63J841L001K074j60j095k0
$$ 320175 322060 324005 325966 327202 327417 327530 328484 329812 330531 331094 332935 335936 338010 337850 336755 336735
52302C36735J263J494J574K507L512L337K221J372J184R64K02n87l71J289L566
$$ 336735 337998 339492 341066 343573 347085 350422 352643 354015 355199 356163 356365 355778 355407 356696 360262
52287C60262M961M916M491M883N710N729M963M851O047P308P046N041K233k51
$$ 360262 365223 370139 374630 379513 385223 390952 395915 400766 406813 414121 421167 426208 428441 428190
$$ [...]
##END NTUPLES=NMR SPECTRUM
##END=
