
##TITLE=AC1192_Venezuela-rubio_5898970_KtoYcdMkwf
##JCAMPDX= 6.0         $$ Bruker NMR JCAMP-DX V2.0
##DATA TYPE= NMR SPECTRUM
##DATA CLASS= NTUPLES
##ORIGIN= BRUKER
##OWNER= Administrator
$$ 1.72 TOPSPIN		Version 2.1
$$ 2012-04-10 10:21:43.171 -0500  Administrator@TOPSPIN
$$ Compression mode = diff/dup
##.OBSERVE FREQUENCY= 400.13188235
##.OBSERVE NUCLEUS= ^1H
##.ACQUISITION MODE= SIMULTANEOUS (DQD)
##.ACQUISITION SCHEME= undefined
##.AVERAGES= 8
##.DIGITISER RES= 22
##SPECTROMETER/DATA SYSTEM= spect
##.PULSE SEQUENCE= zg30
##.SOLVENT NAME= COFFEE_meoh
##.SHIFT REFERENCE= INTERNAL, COFFEE_meoh, 1, 14.98061
##AUDIT TRAIL= $$ (NUMBER, WHEN, WHO, WHERE, PROCESS, VERSION, WHAT)
$$ ##TITLE= Audit trail, TOPSPIN		Version 2.1
$$ ##JCAMPDX= 5.01
$$ ##ORIGIN= Bruker BioSpin GmbH
$$ ##OWNER= Administrator
$$ $$ C:\Bruker\TOPSPIN/data/COFFEE/nmr/AC1192_Venezuela-rubio_5898970_KtoYcdMkwf/10/pdata/1/auditp.txt
$$ ##AUDIT TRAIL=  $$ (NUMBER, WHEN, WHO, WHERE, PROCESS, VERSION, WHAT)
(   1,<2012-04-04 20:21:01.765 -0500>,<Administrator>,<TOPSPIN>,<go>,<TOPSPIN 2.1>,
      <created by zg
	started at 2012-04-04 20:19:54.828 -0500,
	POWCHK enabled, PULCHK disabled,
       configuration hash MD5:
       1A 1E CE 29 27 FD 77 03 67 4E F0 E3 C4 B2 CB 90
       data hash MD5: 64K
       FE 09 E9 4B 79 10 24 44 03 34 AB 6F 2C 12 BA 1E>)
(   2,<2012-04-04 20:21:04.375 -0500>,<Administrator>,<TOPSPIN>,<proc1d>,<TOPSPIN 2.1>,
      <Start of raw data processing
       efp LB = 0 FT_mod = 6 PKNL = 1 PHC0 = 0 PHC1 = 0 SI = 32K 
       data hash MD5: 32K
       F1 11 EE 88 F9 2E 0F BB 18 E6 30 D1 5B 81 A3 EF>)
(   3,<2012-04-04 20:21:04.796 -0500>,<Administrator>,<TOPSPIN>,<proc1d>,<TOPSPIN 2.1>,
      <pk PHC0 = 210.7288 PHC1 = 0 
       data hash MD5: 32K
       E1 88 64 B5 C6 82 5B 83 D5 AF 76 75 4F 91 31 7D>)
(   4,<2012-04-04 20:21:04.890 -0500>,<Administrator>,<TOPSPIN>,<proc1d>,<TOPSPIN 2.1>,
      <abs ABSG = 1 
       data hash MD5: 32K
       0F E1 29 2C 45 71 BF 81 23 4D B6 EC D4 30 4F 14>)
(   5,<2012-04-04 20:21:04.906 -0500>,<Administrator>,<TOPSPIN>,<proc1d>,<TOPSPIN 2.1>,
      <abs ABSG = 2 
       data hash MD5: 32K
       A3 59 48 2E A4 56 63 80 71 E0 84 34 A0 CF FA 2A>)
(   6,<2012-04-04 20:21:04.937 -0500>,<Administrator>,<TOPSPIN>,<proc1d>,<TOPSPIN 2.1>,
      <abs ABSG = 3 
       data hash MD5: 32K
       F9 84 64 23 66 B0 66 DC A5 CA CC 54 50 F2 F8 36>)
(   7,<2012-04-04 20:21:04.968 -0500>,<Administrator>,<TOPSPIN>,<proc1d>,<TOPSPIN 2.1>,
      <abs ABSG = 4 
       data hash MD5: 32K
       00 7E B1 79 BD D1 04 E9 7C DC D2 F9 A6 81 15 8B>)
(   8,<2012-04-04 20:21:05.000 -0500>,<Administrator>,<TOPSPIN>,<proc1d>,<TOPSPIN 2.1>,
      <abs ABSG = 5 
       data hash MD5: 32K
       CE 50 53 05 9F DA BA C3 E6 BC EA FC 73 C9 7A F6>)
(   9,<2012-04-04 20:21:08.609 -0500>,<Administrator>,<TOPSPIN>,<audit>,<TOPSPIN 2.1>,
      <user comment:
       ICON-NMR User ID: COFFEE
       data hash MD5: 32K
       CE 50 53 05 9F DA BA C3 E6 BC EA FC 73 C9 7A F6>)
$$ [...]
150 150 150 150 150 150 150 150
##$TP07= 0
##$TPNAME0= <>
##$TPNAME1= <>
##$TPNAME2= <>
##$TPNAME3= <>
##$TPNAME4= <>
##$TPNAME5= <>
##$TPNAME6= <>
##$TPNAME7= <>
##$TPOAL= (0..7)
0.5 0.5 0.5 0.5 0.5 0.5 0.5 0.5
##$TPOFFS= (0..7)
0 0 0 0 0 0 0 0
##$TUNHIN= 0
##$TUNHOUT= 0
##$TUNXOUT= 0
##$USERA1= <user>
##$USERA2= <user>
##$USERA3= <user>
##$USERA4= <user>
##$USERA5= <user>
##$V9= 5
##$VALIST= <valist>
##$VCLIST= <CCCCCCCCCCCCCCC>
##$VD= 0
##$VDLIST= <DDDDDDDDDDDDDDD>
##$VPLIST= <PPPPPPPPPPPPPPP>
##$VTLIST= <TTTTTTTTTTTTTTT>
##$WBST= 2048
##$WBSW= 25
##$XGAIN= (0..3)
0 0 0 0
##$XL= 0
##$YL= 0
##$YMAX_a= 536904
##$YMIN_a= -664510
##$ZGOPTNS= <>
##$ZL1= 120
##$ZL2= 120
##$ZL3= 120
##$ZL4= 120
##$ABSF1= 14.98061
##$ABSF2= -5.57192
##$ABSG= 5
##$ABSL= 3
##$ALPHA= 0
##$AQORDER= 0
##$ASSFAC= 0
##$ASSFACI= 0
##$ASSFACX= 0
##$ASSWID= 0
##$AUNMP= <proc_prof1d_extract_pilot.lims>
##$AXLEFT= 0
##$AXNAME= <>
##$AXNUC= <1H>
##$AXRIGHT= 0
##$AXTYPE= 0
##$AXUNIT= <>
##$AZFE= 0.1
##$AZFW= 0.1
##$BCFW= 0
##$BC_mod= 0
##$BYTORDP= 0
##$COROFFS= 0
##$CY= 15
##$DATMOD= 1
##$DC= 0
##$DFILT= <>
##$DTYPP= 0
##$F1P= 0
##$F2P= 0
##$FCOR= 0.5
##$FTSIZE= 32768
##$FT_mod= 6
##$GAMMA= 0
##$GB= 0
##$INTBC= 1
##$INTSCL= 1
##$ISEN= 128
##$LB= 0
##$LEV0= 0
##$LPBIN= 0
##$MAXI= 10000
##$MC2= 0
##$MEAN= 0
##$ME_mod= 0
##$MI= 0
##$NCOEF= 0
##$NC_proc= -8
##$NLEV= 6
##$NOISF1= 0
##$NOISF2= 0
##$NSP= 0
##$NTH_PI= 0
##$NZP= 0
##$OFFSET= 14.98061
##$PC= 1
##$PHC0= 210.7288
##$PHC1= 0
##$PH_mod= 1
##$PKNL= yes
##$PPARMOD= 0
##$PPDIAG= 0
##$PPIPTYP= 0
##$PPMPNUM= 2147483647
##$PPRESOL= 1
##$PSCAL= 4
##$PSIGN= 0
##$PYNMP= <proc.py>
##$REVERSE= no
##$SF= 400.13
##$SI= 32768
##$SIGF1= 0
##$SIGF2= 0
##$SINO= 400
##$SIOLD= 32768
##$SPECTYP= <>
##$SREGLST= <1H.CDCl3>
##$SSB= 0
##$STSI= 32768
##$STSR= 0
##$SW_p= 8223.68421052632
##$SYMM= 0
##$S_DEV= 0
##$TDeff= 65536
##$TDoff= 0
##$TI= <>
##$TILT= no
##$TM1= 0
##$TM2= 0
##$TOPLEV= 0
##$USERP1= <user>
##$USERP2= <user>
##$USERP3= <user>
##$USERP4= <user>
##$USERP5= <user>
##$WDW= 1
##$XDIM= 32768
##$YMAX_p= 467554231
##$YMIN_p= -742480
##$CURPLOT= <Network HP LaserJet P1505>
##$CURPRIN= <$Network HP LaserJet P1505>
##$DFORMAT= <normdp>
##$LAYOUT= <+/1D_H.xwp>
##$LFORMAT= <normlp>
##$PFORMAT= <normpl>
##$SURQMSG= 1
$$ End of Bruker specific parameters
$$ ---------------------------------
##NTUPLES= NMR SPECTRUM
##VAR_NAME=  FREQUENCY,     SPECTRUM/REAL,   SPECTRUM/IMAG
##SYMBOL=    X,             R,               I
##VAR_TYPE=  INDEPENDENT,   DEPENDENT,       DEPENDENT
##VAR_FORM=  AFFN,          ASDF,            ASDF
##VAR_DIM=   32768,         32768,           32768
##UNITS=     HZ,            ARBITRARY UNITS, ARBITRARY UNITS
##FACTOR=    0.250966925370066, 1,           1
##FIRST=     8223.43324360095, 97980,        -270618
##LAST=      0,             81283,           -46615
##MIN=       0,             -742480,         0
##MAX=       8223.43324360095, 467554231,    0
$$ Real data points
##PAGE= N=1
##DATA TABLE= (X++(R..R)), XYDATA
$$ [...]
19471b59511b9401m8422j14142c1564a4051k8089A76836c38355a22869b623A07636
$$ -259511 -29401 -77823 -191965 -31564 -14051 -42140 176836 -338355 -122869 -2623 107636
19459A37457a36320j49086h7805F1659a9472j77231A8240f293k26445h2512N076
$$ 137457 -136320 -285406 -87805 61659 -19472 -196703 18240 -6293 -232738 -82512 -77436
19448g7436n9852j5387d9063k85530c8913E2525J61100c38273I4370a835j94742
$$ -77436 -137288 -152675 -49063 -334593 -38913 52525 213625 -338273 94370 -1835 -196577
19437a96577B01112b78719A52310J24535A00705a23057m5862A15532a54339B04481
$$ -196577 201112 -278719 152310 276845 100705 -123057 -168919 115532 -154339 204481
19426b13070R2477A03543a55096D4619a54971A64005J85275c5108j39870M7709
$$ -213070 -120593 103543 -155096 44619 -154971 164005 349280 -35108 -174978 -127269
19416a27269q669A0057d444k58244D8816c54572C5861N9721d04523c9341p3416
$$ -127269 -135938 10057 -4444 -262688 48816 -354572 35861 95582 -404523 -39341 -112757
19405a12757I2069b17576A83487b68523a9156j69487M6845E8434L5303a61522
$$ -112757 92069 -217576 183487 -268523 -19156 -188643 -141798 58434 93737 -161522
19394D70K7691a89299J26A47452F3485b09448F7283a7998k2812k04105K0381d8603
$$ 470 28161 -189299 -189173 147452 63485 -209448 67283 -17998 -40810 -244915 -224534 -48603
19381b05739R2375J0895B03477b31596f6370a6138A00992b10948I2053P7976g7402
$$ -205739 -113364 -102469 203477 -231596 -66370 -16138 100992 -210948 92053 170029 -77402
19369b44389c4773l7778P71k75944a54067o9338b525k71105B0355a42837r5002
$$ -244389 -34773 -72551 -71780 -347724 -154067 -223405 -2525 -273630 20355 -142837 -237839
19358b37839R8799c0958o3032A80805b40115a06501k927L6762J7219Q549C6396
$$ -237839 -139040 -30958 -93990 180805 -240115 -106501 -109428 -72666 -55447 -46898 36396
19346a51222e8996A45163a56565l9348O7725M3842p2427k45325a81401k45539
$$ -151222 -58996 145163 -156565 -195913 -128188 -84346 -156773 -402098 -181401 -426940
19336d26940J86964k9429d685j49469j12358a17303a9639j01962o2340j0008N4641
$$ -426940 -239976 -269405 -4685 -154154 -266512 -117303 -19639 -121601 -183941 -193949 -139308
19325a39308m0742h2427q8278N6174j22955E7370i6407m0612O3452I4816f2371
$$ -139308 -180050 -82427 -170705 -114531 -237486 57370 -96407 -137019 -73567 94816 -62371
19313I8729c0179o256j30071A8885a18564j61800j04019A01377J97457H7859j919
$$ 98729 -30179 -36435 -166506 18885 -118564 -280364 -384383 101377 298834 87859 85940
19302H5940k0183L981a3740o2772H1375a78984C3852a38383A18461l0729A6476
$$ 85940 65757 69738 -13740 -76512 81375 -178984 33852 -138383 118461 87732 16476
19290a96873c1795j85491l3804E8573J41451q3334d91638d6066F8229c3780j28713
$$ -196873 -31795 -217286 -251090 58573 200024 116690 -491638 -46066 68229 -33780 -162493
19279a62493l6298i1047M2120i516I8347a89738J1623f492j71573r2276J0144
$$ -162493 -198791 -91047 -48927 -9516 98347 -189738 -178115 -6492 -178065 -270341 -260197
19268b60197A50260J07470a9336A96138R6014b25524k4430a1772j11067p5919
$$ -260197 150260 257730 -19336 196138 292152 -225524 -249954 -11772 -122839 -198758
19258a98758f3848k12706M7080A42739a59697F5653b80821b6784j69163j28951
$$ -198758 -63848 -276554 -229474 142739 -159697 65653 -280821 -26784 -195947 -324898
19248c24898q8791f6052j41764R8196I35a39965p6721B83160a35730j49822h2595
$$ -324898 -413689 -66052 -207816 -109620 935 -139965 -216686 283160 -135730 -285552 -82595
19236b34487b4644l58729L215a9731B34473n747a02253n5565A52562C979N8811
$$ -234487 -24644 -383373 -380158 -19731 234473 228726 -102253 -157818 152562 3979 62790
19225F2790a1841j45265A1092b98536B15182a3966C3974J04408j4528b98030A11628
$$ 62790 -11841 -157106 11092 -298536 215182 -13966 33974 138382 123854 -298030 111628
19213a84973H8698i1107D7842c34859I1333J344g7203b3784A3078B455d1434r6582
$$ -184973 88698 -91107 47842 -334859 91333 92677 -77203 -23784 13078 2455 -41434 -138016
19201a38016k28501d5146B1450e1658o7656j59151e0697m9703k48209C19134d1739
$$ -138016 -366517 -45146 21450 -51658 -119314 -278465 -50697 -100400 -348609 319134 -41739
19189a74429l5108N4493B2802d0949J7911A31677i549I7943d64811K12961E724
$$ -174429 -209537 -155044 22802 -40949 -23038 131677 -9549 97943 -464811 -251850 5724
19177b21597h2558j0495j02390a556k8240n12085a10015K4100D5275K08315K2653
$$ -221597 -82558 -93053 -195443 -1556 -29796 -541881 -110015 -85915 45275 253590 276243
19166B76243H6790a83866I0218a68440A09714b60104e0675C61960c21166A11046
$$ 276243 86790 -183866 90218 -168440 109714 -260104 -50675 361960 -321166 111046
19155H9828a46072k04378A8460b05603O5669B58669b11537j5708g0639D9303M1264
$$ 89828 -146072 -350450 18460 -205603 -139934 258669 -211537 -227245 -70639 49303 90567
19144I0567B9089g5446A23452j6027m588B8685K01561b52576J14709A67836o8769
$$ 90567 29089 -75446 123452 107425 102837 28685 230246 -252576 -137867 167836 99067
19133I9067A2953J4936b94462J16508Q7392j61468C8886M0799b76225J23240L8689
$$ 99067 12953 27889 -294462 -177954 -90562 -252030 38886 79685 -276225 -152985 -114296
19122a14296l9446N5590j643r3277p3338K6222k433a17984b8403j28428C24317
$$ -114296 -153742 -98152 -99795 -193072 -266410 -240188 -242621 -117984 -28403 -156831 324317
19110a46125p5086f2888j64115A28878K02724h3874K7083A10245c18758H074R5025
$$ -146125 -221211 -62888 -227003 128878 331602 -83874 -56791 110245 -318758 8074 103099
19099A03099a9325F6460L29017a75445F032a29997B69459b24765A34731n1570
$$ 103099 -19325 66460 395477 -175445 6032 -129997 269459 -224765 134731 83161
19089H3161c20664J42866c5954m3883A30233a16671B1797N7673K6070e7856F1977
$$ 83161 -320664 -177798 -35954 -79837 130233 -116671 21797 79470 105540 -57856 61977
19077A2115i6357A69056a02825o7578O0306D42201j94859l871c04130R4029e9695
$$ 12115 -96357 169056 -102825 -170403 -110097 442201 247342 243471 -304130 -210101 -59695
19065G0649g3601l2514O13k91609A50964a84928M1212d6168F6278J99708a00055
$$ 70649 -73601 -106115 -105502 -397111 150964 -184928 -143716 -46168 66278 265986 -100055
19053b3236q9861p5665D2477a02673B41301H459a19002p5082f4677j71515o4912
$$ -23236 -113097 -188762 42477 -102673 241301 8459 -119002 -194084 -64677 -236192 -301104
19042c01104E8154e0493k01291H2722a18941d4454j95568e9061j64533f6455p4135
$$ -301104 58154 -50493 -251784 82722 -118941 -44454 -240022 -59061 -223594 -66455 -140590
19031a40590B9675a72147A02098b15823B7025B208J64063e0770A11335a84500
$$ -140590 29675 -172147 102098 -215823 27025 2208 166271 -50770 111335 -184500
19020B6744M9231b88385B11658d7167a3373k20091C3582K15618E6875c37746B23076
$$ 26744 75975 -288385 211658 -47167 -13373 -233464 33582 249200 56875 -337746 223076
19008a0262j22296b9653j36881d4655m5498l00085I6452d24961A8485g7278b8150
$$ -10262 -132558 -29653 -166534 -44655 -90153 -390238 96452 -424961 18485 -77278 -28150
18996d61274f9621A149a6143L234H1112a36406K4454j74074J27250A5663a2689
$$ -461274 -69621 1149 -16143 -12909 81112 -136406 -111952 -286026 -158776 15663 -12689
18984A094b59097i9446I634b60669a1411A173d3136m8567k27338Q6330p0591a45692
$$ 1094 -259097 -99446 9634 -260669 -11411 1173 -43136 -91703 -319041 -232711 -303302 -145692
18971a51213A0401J95508a33091j10889P6032I0741m0733P7835J78154B50M3568
$$ -151213 10401 205909 -133091 -243980 -167948 90741 50008 127843 305997 250 43818
18960D3818J74455J00925K50187o3370G8266K69575e3896A26389c7147H8146d0563
$$ 43818 218273 319198 569385 506015 78266 347841 -53896 126389 -37147 88146 -40563
18948b96145A27027a65991j2386I1564b04659C49526a75032G7089c5237B77972
$$ -296145 127027 -165991 -178377 91564 -204659 349526 -175032 77089 -35237 277972
18937E6608j008a20296j22105A87752c9722l85152A6687K56793j0404E618R7870
$$ 56608 55600 -120296 -242401 187752 -39722 -424874 16687 273480 263076 5618 103488
18926A03488Q9806D4971J8105b43050A09525K36657c25888a46868D7439g0640
$$ 103488 193294 44971 63076 -243050 109525 346182 -325888 -146868 47439 -70640
18915A23883b51928P6395B15487p3382A5955P2106j5978K86660a69801P3968E6689
$$ 123883 -251928 -175533 215487 142105 15955 88061 72083 358743 -169801 -95833 56689
18903a00086L1016P417B42701q4809a76596D14536H8388O5060K5906N8586G3340
$$ -100086 -69070 -61653 242701 157892 -176596 414536 88388 153448 179354 237940 73340
18891B50804F8853b4356C2190A2026O1172a22947A22379a1218k53435A83305a37662
$$ 250804 68853 -24356 32190 12026 73198 -122947 122379 -11218 -264653 183305 -137662
18879F6229b1420A9674L6508J69761j05646P9833d0282m2643A4022d61203a02193
$$ 66229 -21420 19674 56182 225943 120297 200130 -40282 -82925 14022 -461203 -102193
18867G4518a88494H2372i5039k0919a6017j27722B6840a96444j7340F5050a07319
$$ 74518 -188494 82372 -95039 -115958 -16017 -143739 26840 -196444 -213784 65050 -107319
18855A8391b57284I6927C5774O9069R6051b47565J15096G0528a53377A28124e8174
$$ 18391 -257284 96927 35774 104843 200894 -247565 -132469 70528 -153377 128124 -58174
18843a66934A34564d55A86646D1150L0100e0438b3659k7599A26005b18921A06402
$$ -166934 134564 -455 186646 41150 71250 -50438 -23659 -51258 126005 -218921 106402
18831b74962g1553B00718c9488j15355a3242A2903b31297e6865D067h4575C01754
$$ -274962 -71553 200718 -39488 -154843 -13242 12903 -231297 -56865 4067 -84575 301754
18819c56705J11982B13169a02999A85523a24971H6446d40879h899k69485b0440
$$ -356705 -244723 213169 -102999 185523 -124971 86446 -440879 -8899 -278384 -20440
18808a57059G4399b78625h1835F272a7387C89214a23733k1230p1741Q9743j22255
$$ -157059 74399 -278625 -81835 6272 -17387 389214 -123733 -144963 -216704 -126961 -249216
18797b49216R1799G9485M41456a5643B19997J9973a04821C4527a26837r9468l492
$$ -249216 -157417 79485 520941 -15643 219997 239970 -104821 34527 -126837 -226305 -229797
18786b29797E881K8749J42740J23258a65045d5958l89645A89580R1621j19560
$$ -229797 5881 34630 177370 300628 -165045 -45958 -435603 189580 281201 161641
18776A61641d047l73032G0P9637K41920b52803q21F4578R8841c99310a88891A13018
$$ 161641 -4047 -377079 70 79707 321627 -252803 -253624 64578 163419 -399310 -188891 113018
18763a65906K8699B39851a43506e7548C30918a21444k79740a03391q1409f4327
$$ -165906 -137207 239851 -143506 -57548 330918 -121444 -401184 -103391 -184800 -64327
18752C0782M9413A7572D6J51669O889a34771G7803k6106j2472b68356j15195g8676
$$ 30782 80195 17572 46 151715 158604 -134771 77803 51697 39225 -268356 -383551 -78676
18739a21931L6171A00542b29648O1770j07555A59254b35081g8797j52817j96865
$$ -121931 -85760 100542 -229648 -167878 -275433 159254 -235081 -78797 -231614 -428479
18729d28479A5702d63418f2902d960k10142b2220n5228m74919a82352o3743a08892
$$ -428479 15702 -463418 -62902 -4960 -215102 -22220 -77448 -552367 -182352 -246095 -108892
18717A54034f8332h026j41339A39960a22757r6115B9371c17590C84146m9912b13770
$$ 154034 -68332 -8026 -149365 139960 -122757 -218872 29371 -317590 384146 334234 -213770
18705a49728c8814C59900f2145p4013A14129e7164j3847G1895c2455l586k18201
$$ -149728 -38814 359900 -62145 -136158 114129 -57164 -71011 71895 -32455 -36041 -254242
18694b54242g3222m87994a93406h4768A10966l8271O4359d53720a10094H3746
$$ -254242 -73222 -561216 -193406 -84768 110966 72695 137054 -453720 -110094 83746
18683d6885j01432F6412b39942p2263a4263I3394b16753j18086A84155p030c41939
$$ -46885 -148317 66412 -239942 -312205 -14263 93394 -216753 -334839 184155 177125 -341939
18671a85913Q6934m4602B70811b65516a2490r1811C1198c73909J75362o9279c3505
$$ -185913 -98979 -143581 270811 -265516 -12490 -104301 31198 -373909 -198547 -267826 -33505
18659c96731J44513G1758f6882l1358A01957m2654C179K02357b98257K5182g4732
$$ -396731 -252218 71758 -66882 -98240 101957 59303 3179 205536 -298257 -273075 -74732
18647A0443a9485j23897C2474b78054Q7071h7842I3981a77785J6128A11503b09694
$$ 10443 -19485 -143382 32474 -278054 -190983 -87842 93981 -177785 -161657 111503 -209694
18635e69437A12062f3417p3773k65920J1615J22538l68370e869j20453a2722p0540
$$ -569437 112062 -63417 -137190 -403110 -391495 -268957 -637327 -5869 -126322 -12722 -83262
18624h3262A00364b11254n0335P5884A8757J88981a54702A71899a51649p9966
$$ -83262 100364 -211254 -261589 -185705 18757 207738 -154702 171899 -151649 -231615
18614b31615g1898B0993L77922I0489i8918B07633F5922a36872E4624a52959j41876
$$ -231615 -71898 20993 398915 90489 -98918 207633 65922 -136872 54624 -152959 -294835
18603b94835J31529P3508B4329Q8130C4038f8066I8865a18147b9800G5474c37153
$$ -294835 -163306 -89798 24329 112459 34038 -68066 98865 -118147 -29800 75474 -337153
18591A52079c40524d9510A11554a46129A28444C3647c18430E8958j5129a06292
$$ 152079 -340524 -49510 111554 -146129 128444 33647 -318430 58958 43829 -106292
18580A7395K23763g8231p1880F0789K50125h6719j24558A7964e8430k13185R367
$$ 17395 241158 -78231 -150111 60789 310914 -86719 -211277 17964 -58430 -271615 -262248
18569b62248A87184d9170j45970G9170b26844J08479C8094b998E9751K62928h8760
$$ -262248 187184 -49170 -195140 79170 -226844 -118365 38094 -2998 59751 322679 -88760
18557a15192j56491a7647n5546k73012C32747C7731c1564E7740c90179a76088
$$ -115192 -271683 -17647 -73193 -346205 332747 37731 -31564 57740 -390179 -176088
18546a75055C88251b18852i8611j52433g6616p7122E3788J66932Cb65428a16465
$$ -175055 388251 -218852 -98611 -251044 -76616 -153738 53788 220720 3 -265428 -116465
18534b07521A26878i1440m01133B44231P4006b57804d619k36188G0118N95b05064
$$ -207521 126878 -91440 -492573 244231 318237 -257804 -4619 -240807 70118 70713 -205064
18522B26144g8785a2162C6092a59184A13125m2026L0719a24792G9760a56973H755
$$ 226144 -78785 -12162 36092 -159184 113125 71099 101818 -124792 79760 -156973 8755
18510c49886d8040l14343a68525j2875j32902B066a97192h6848J6997E0589a56615
$$ -349886 -48040 -362383 -168525 -181400 -314302 2066 -197192 -86848 -69851 50589 -156615
18498c23982O7956o1351i6552H7947O0722B8602f6103g114A08835d60563a98054
$$ -323982 -256026 -317377 -96552 87947 148669 28602 -66103 -7114 108835 -460563 -198054
18486a54084o8812N2210E7824j308B0500c14381C4203J8982b08411O1071P0343
$$ -154084 -222896 -170686 57824 56516 20500 -314381 34203 53185 -208411 -147340 -76997
18475g6997j00545h2381C2991a29130A03686l7432b22136c1380B32292c35558
$$ -76997 -177542 -82381 32991 -129130 103686 66254 -222136 -31380 232292 -335558
18464b55776C39106a2701B08393c9595Q910B6940J7429d5111r4616J9975A70244
$$ -255776 339106 -12701 208393 -39595 -30685 26940 44369 -45111 -139727 -119752 170244
18452A0932b47743J00419j80867A72723a70103c509l9242j29737f4273D0648P4246
$$ 10932 -247743 -147324 -328191 172723 -170103 -3509 -42751 -172488 -64273 40648 114894
18441A14894J75140b09574l6203i4029B2927e28752a24434j72547A49614a87277
$$ 114894 290034 -209574 -245777 -94029 22927 -528752 -124434 -296981 149614 -187277
18430b16517d9607A91345f6313K6884C937a49996f710B81660a84910a1611p2889
$$ -216517 -49607 191345 -66313 -39429 3937 -149996 -6710 281660 -184910 -11611 -84500
18419h4500o494j72182B2191d1184m2199C2377J25129a50786C5000f9748j156
$$ -84500 -90994 -263176 22191 -41184 -83383 32377 157506 -150786 35000 -69748 -70904
18408g0904c1580m0516L742G5705L5403c2606A3824F609b63004A65905E9083d08965
$$ -70904 -31580 -72096 -68354 75705 111108 -32606 13824 6609 -263004 165905 59083 -408965
18395f9455A89786a08516H1805d57467A44078a06397B1886a24390j87487B583
$$ -69455 189786 -108516 81805 -457467 144078 -106397 21886 -124390 -311877 2583
18384g4821D8404a96390j60719A44401K36433I75P6577N452d8902F9004j0562
$$ -74821 48404 -196390 -357109 144401 380834 975 77552 83004 -48902 69004 58442
18373E8442K5145K22683F3624L48061a00060j11763C39091a16606L9557j58046
$$ 58442 83587 306270 63624 411685 -100060 -211823 339091 -116606 -77049 -235095
18363b35095M0843E0693a67860h2719A34141j6573K03940a50897A94950f7529
$$ -235095 -194252 50693 -167860 -82719 134141 117568 321508 -150897 194950 -67529
18352a08842H1097d8820l81614A57251c7582o1094r1302j18680f4239B36568f684
$$ -108842 81097 -48820 -430434 157251 -37582 -98676 -189978 -308658 -64239 236568 -6684
18340A86093a08740o4733b3159k55410B42686b79914J14252d9474A88455b24257
$$ 186093 -108740 -173473 -23159 -278569 242686 -279914 -165662 -49474 188455 -224257
18329B26430a37313l2988B5101K00265p5733f5997L1330C2063a65686K275B1591
$$ 226430 -137313 -170301 25101 225366 149633 -65997 -34667 32063 -165686 -163411 21591
18317a85385Q1468H4038h5972a102n8270j27256j7396c1733j22121o9011D6780
$$ -185385 -103917 84038 -85972 -1102 -59372 -186628 -204024 -31733 -153854 -222865 46780
18305a78090O4962A00659a87019e8011H8110a73608d5796J9604j41907p7326A85840
$$ -178090 -113128 100659 -187019 -58011 88110 -173608 -45796 -26192 -168099 -245425 185840
18293c132F313b5625p2213B90874C4806J88868j05607h2313K0003o5259E7276
$$ -3132 6313 -25625 -97838 290874 34806 223674 118067 -82313 -62310 -127569 57276
18281i3743j03319g3827k06230J19211q397A66016f5754j6717C8792J3442J33149
$$ -93743 -197062 -73827 -280057 -160846 -169243 166016 -65754 -82471 38792 52234 185383
18270A85383b20630D6723L9150a66351m3861e3908A84263c03713A28419a69874
$$ 185383 -220630 46723 85873 -166351 -210212 -53908 184263 -303713 128419 -169874
18259a11463l4875J285e4986G9187c53277B44158c17402Q6201A15424b73801a01613
$$ -111463 -146338 -145053 -54986 79187 -353277 244158 -317402 -231201 115424 -273801 -101613
18247b54613J7039Q073i3545j9658A24427c65102A86539c9887k1109j38411j5409
$$ -254613 -237574 -229501 -93545 -113203 124427 -365102 186539 -39887 -60996 -199407 -214816
18236b14816F5838a63933A09648J58463a31618D10907h5656A98428K65461a98785
$$ -214816 65838 -163933 109648 268111 -131618 410907 -85656 198428 463889 -198785
18225c11954A09671P4352r0536J35543c31706a24656D2041M1217a23528O555k30359
$$ -311954 109671 184023 93487 229030 -331706 -124656 42041 83258 -123528 -116973 -347332
18214c47332A59651Q796a27136K2197E8614Q7293D1090j5777O6364f2953K0158
$$ -347332 159651 168447 -127136 -104939 58614 145907 41090 25313 91677 -62953 -42795
18203d2795B26657F7930f9658A32896a35071B408J33413a94418A04259Q4292A2205
$$ -42795 226657 67930 -69658 132896 -135071 2408 135821 -194418 104259 188551 12205
18191a04081F3720a18963F7619E909J10276A8278Q7071a39150f3603o9809B16856
$$ -104081 63720 -118963 67619 5909 116185 18278 105349 -139150 -63603 -133412 216856
18179A12884K97262e4114B12547a90666b8939r0236Q9F1353M09559b81661B50258
$$ 112884 410146 -54114 212547 -190666 -28939 -119175 -119086 61353 470912 -281661 250258
18167A6067M31006a57622D9040J71913A467J9862a49451A79340a98486B83876
$$ 16067 447073 -157622 49040 220953 1467 21329 -149451 179340 -198486 283876
18156a19384k08809a29219d1408j6258o3867A70759a61972f0994H9461a55809
$$ -119384 -328193 -129219 -41408 -57666 -121533 170759 -161972 -60994 89461 -155809
18145e20321K17659c6627C8378L31702j62957d7445f550m4214r3127A5103k516
$$ -520321 -302662 -36627 38378 370080 207123 -47445 -6550 -50764 -143891 15103 12587
18134A2587J09581J31822p7489a20391B0143a19017k1312m0988F5521k9094a06063
$$ 12587 122168 253990 176501 -120391 20143 -119017 -140329 -181317 65521 36427 -106063
18122B13775C3527i537A64713C6397O1443m4644a35368r8030j0858R2261B34723
$$ 213775 33527 -9537 164713 36397 97840 53196 -135368 -233398 -244256 -151995 234723
18110f3194q8273H9285R0716a05780A29078d7166j15246e1395B3262a15015B1287
$$ -63194 -151467 89285 180001 -105780 129078 -47166 -162412 -51395 23262 -115015 21287
18098c00520F1277J51835H1479N7702J16469a45281A68232b6167f830B33573b8127
$$ -300520 61277 213112 81479 139181 255650 -145281 168232 -26167 -6830 233573 -28127
18086a42904F9714b20853j34756A04882e3482l57206J78564e5265k955L466o3861
$$ -142904 69714 -220853 -355609 104882 -53482 -410688 -232124 -55265 -58220 -54754 -118615
18075a18615M8233B09729h5239A30291E9040b34165A21322b36788C34969b36418
$$ -118615 -70382 209729 -85239 130291 59040 -234165 121322 -236788 334969 -236418
18064a14665A77649c4453P30B15912B7344a91012r279B46127c8397A86399f4251
$$ -114665 177649 -34453 -33723 215912 27344 -191012 -200291 246127 -38397 186399 -64251
18052h8819H29c04580P5425C34010i5556o1151P1882D27370b30101e261j77509
$$ -88819 829 -304580 -229155 334010 -95556 -156707 -84825 427370 -230101 -5261 -182770
18041a82770A69599p3976b72201a8836K197F015b12646I334J23384a52285J7971
$$ -182770 169599 95623 -272201 -18836 -16639 6015 -212646 9334 132718 -152285 -134314
18030a34314M4026j16743D8564A5252K4438b40660J4195A82921b71846J18447
$$ -134314 -90288 -207031 48564 15252 39690 -240660 -226465 182921 -271846 -153399
18020a53399B4128d95507a12834a5082A9603a78210J2732k0181A56808n1875J42841
$$ -153399 24128 -495507 -112834 -15082 19603 -178210 -165478 -185659 156808 104933 247774
18009B47774E4222j3785q230A1256K10619j01961m5380a164o7108B55405J06G1462
$$ 247774 54222 40437 32207 11256 221875 119914 74534 -1164 -68272 255405 255511 71462
17996b90511q0624A2547h2730B31658j00335b45524B21953a9038A4148J83900
$$ -290511 -371135 12547 -82730 231658 131323 -245524 221953 -19038 14148 198048
17986A98048M1290a71276g1379L1714k04882g0147A68890c76798j73857g8536
$$ 198048 239338 -171276 -71379 -39665 -244547 -70147 168890 -376798 -550655 -78536
17975A25148o0061J00268c9514C12188d487k6587k7559A86693M8207J61822j71801
$$ 125148 65087 165355 -39514 312188 -4487 -31074 -58633 186693 234900 396722 224921
17964B24921a79798B72049a66307j919C10125A18927f8194k37957b3787B31224
$$ 224921 -179798 272049 -166307 -168226 310125 118927 -68194 -306151 -23787 231224
17953c79866C31704A36886a29475A32492K1464e78027b80924A41389a85083A12661
$$ -379866 331704 136886 -129475 132492 153956 -578027 -280924 141389 -185083 112661
17942C11597C2668J10629a13073k19467I256J35298n3756Q1728j7780p751a72052
$$ 311597 32668 143297 -113073 -332540 9256 144554 90798 172526 154746 146995 -172052
17930B32666j04728b3340k50378G5180B1802a62088E480c75352I7282d4387A7724
$$ 232666 127938 -23340 -273718 75180 21802 -162088 5480 -375352 97282 -44387 17724
17918a23034A21579a2637q6116j19892J05993A22093D6387K7474l6280Q7878k3994
$$ -123034 121579 -12637 -98753 -218645 -112652 122093 46387 73861 37581 125459 101465
17907A01465j9208J51209j0499h3097A08913J03156i1945J2422K8061Q791k65505
$$ 101465 82257 233466 222967 -83097 108913 212069 -91945 -79523 -51462 -42671 -308176
17896c08176h7036A41957h5766j54600e7802A10383J90352d085j0031A91066h2144
$$ -308176 -87036 141957 -85766 -240366 -57802 110383 300735 -4085 -14116 191066 -82144
17884b53689A37970A6473c22274C09583c4033h006A26964d6839B50656h0839A53459
$$ -253689 137970 16473 -322274 309583 -34033 -8006 126964 -46839 250656 -80839 153459
17872A39101J358i0036A22226j4718a22929A68275a63804F3055f8401K6440H5793
$$ 139101 140459 -90036 122226 107508 -122929 168275 -163804 63055 -68401 -41961 85793
17860i0324D28666b6717A04631g129n7785A99318q7110M8936G7358a75433A74988
$$ -90324 428666 -26717 104631 -7129 -64914 199318 112208 161144 77358 -175433 174988
17848b30801l6488D3788A0587a48894M2560K3839k2826C6167c6579B04249b72727
$$ -230801 -267289 43788 10587 -148894 -106334 -82495 -105321 36167 -36579 204249 -272727
17836I7974a96742P4522A26307J05069i486B88577b6001a339B5987d2374H7368
$$ 97974 -196742 -122220 126307 231376 -9486 288577 -26001 -1339 25987 -42374 87368
17824C6143M4561b2649A40366N40B5444i1127C9954J16691E4318a42814a6807
$$ 36143 80704 -22649 140366 140906 25444 -91127 39954 156645 54318 -142814 -16807
17812g6361A04527P5586J56065d06076A13306R0806E1888A1797R2667J5832Q9470
$$ -76361 104527 180113 336178 -406076 113306 204112 51888 11797 104464 120296 209766
17801B09766r5149g2883g546A42840e386A91925F1684K40974j11186m5145c15265
$$ 209766 114617 -72883 -7546 142840 -5386 191925 61684 302658 191472 146327 -315265
17789A15814b61648P810A17845J11403o1937J22177q7778J17501g4566m18852
$$ 115814 -261648 -253838 117845 229248 167311 289488 201710 319211 -74566 -493418
17779d93418B69652b301B0205N9636d8703j48283L6019D6344i8736b3996C9051
$$ -493418 269652 -2301 20205 79841 -48703 -196986 -160967 46344 -98736 -23996 39051
17767B92083Q4384A76098n2880J41121A4432b46553G3484R7809M1782d0297A92377
$$ 292083 376467 176098 123218 264339 14432 -246553 73484 171293 213075 -40297 192377
17755A88601H1327K52871C2982J13876N0036G1711b1015C0394a60095d8226A26009
$$ 188601 81327 334198 32982 146858 196894 71711 -21015 30394 -160095 -48226 126009
17743b06395a1227j99719A10981D5228N3931h9603j409r8116A77829e7729C03198
$$ -206395 -11227 -210946 110981 45228 99159 -89603 -91012 -189128 177829 -57729 303198
17731a22798N6675A79295c4909q6704g555j62264A3283K73776m7897p9088F4091
$$ -122798 -66123 179295 -34909 -121613 -7555 -169819 13283 287059 239162 160074 64091
17719B4157a02419d5910A12288O4870b62426A44506c168C27869a5164E3151J73465
$$ 24157 -102419 -45910 112288 177158 -262426 144506 -3168 327869 -15164 53151 226616
17708B26616h2342B07271F6468C279J52493F0001b40468A75043D6353K27742j05857
$$ 226616 -82342 207271 66468 3279 155772 60001 -240468 175043 46353 274095 168238
17697A68238b47548B65764m7743h2632A90920O288o4035C3949J14136j9706l3655
$$ 168238 -247548 265764 218021 -82632 190920 197208 133173 33949 148085 128379 94724
17686I4724P3921J34709a24333A49183a38422B52787d128A24292a07762B02970
$$ 94724 168645 303354 -124333 149183 -138422 252787 -4128 124292 -107762 202970
17675b40401A3393N8370J00011a2076n3880A23792g496q1132A8667K2269b68266
$$ -240401 13393 71763 171774 -12076 -65956 123792 -7496 -88628 18667 40936 -268266
17663e0855A55254d3524E5718l006K71734B0580q882P4307f5492b002l3823B69737
$$ -50855 155254 -43524 55718 52712 324446 20580 11698 86005 -65492 -2002 -35825 269737
17650A7425J02449C8647N4559K40162M3613g3162C53509A68759f7760I104K52844
$$ 17425 119874 38647 93206 333368 376981 -73162 353509 168759 -67760 9104 261948
17639B61948o3519a84236j89646G9013a19822A31026B8820K02369k6390l2029
$$ 261948 198429 -184236 -373882 79013 -119822 131026 28820 231189 204799 172770
17629A72770F5120J02376b99226B05188a73974A63356J14116k0099L61f2087B37291
$$ 172770 65120 167496 -299226 205188 -173974 163356 277472 257373 257734 -62087 237291
17617A15604D2659Q1287K6601Q9155f8635l0025k9717k93700f5365D1898g3774
$$ 115604 42659 123946 150547 239702 -68635 -98660 -128377 -422077 -65365 41898 -73774
17605E2924M8534J8953K37563G3565B2026b93700E4370h2951A544J73253M13203
$$ 52924 101458 120411 357974 73565 22026 -293700 54370 -82951 1544 174797 588000
17594E88000A80229b1133A45522j5924b988B72613G0841J12260f5807b5842k4446
$$ 588000 180229 -21133 145522 129598 -2988 272613 70841 183101 -65807 -25842 -50288
17583e0288B05673h3111B53092C2787J82027m1815a10308M4939A26426c89020
$$ -50288 205673 -83111 253092 32787 214814 172999 -110308 -65369 126426 -389020
17572A70079p6939k6341R5732d385A18658A0629N6216J11213i6684A4297K2960
$$ 170079 93140 66799 162531 -4385 118658 10629 66845 178058 -96684 14297 37257
17561C7257a22122A48407L5044M015C6082K61172I5473J26372J49115Q7117a9813
$$ 37257 -122122 148407 183451 187466 36082 297254 95473 221845 370960 458077 -19813
17549a17307m3061J6251B9117q619a01267B47525d4206B00531o4826J06899M013
$$ -117307 -160368 -144117 29117 20498 -101267 247525 -44206 200531 135705 242604 246617
17538B46617f167B06710a48384A91947C4179L43833A16880K31062j49601p0959
$$ 246617 -6167 206710 -148384 191947 34179 378012 116880 347942 198341 127382
17528A27382A6167L2976M20986B0947L25877d7402C20560Q4896A26501M34675
$$ 127382 16167 49143 470129 20947 346824 -47402 320560 405456 126501 561176
17518E61176I4697L47835b9295D59742j92017Q1571K03720k45175L71404j85864
$$ 561176 94697 442532 -29295 459742 267725 349296 553016 307841 679245 493381
17508D93381L48463M860j31643B74840J91472j2966l2214P3023K32502k49349
$$ 493381 841844 846704 715061 274840 466312 453346 421132 494155 726657 477308
17498D77308J00847k03271j59986N44166j00902J53581l64495K17226m9132B72245
$$ 477308 578155 374884 214898 759064 658162 811743 447248 664474 615342 272245
17487A67363M84484A84430L14516j20683j87228M6786I8427O2278J45598L57228
$$ 167363 651847 184430 498946 378263 191035 237821 98427 160705 306303 663531
17477F63531B54580q650L26691A31738P7742f2040D99440n674k19887a5664C11315
$$ 663531 254580 245930 572621 131738 209480 -62040 499440 493766 273879 -15664 311315
17465C66208A75826L9186P9331A12083R3366Q4648j0323J85479A74677J25091
$$ 366208 175826 215012 294343 112083 205449 290097 279774 465253 174677 299768
17455B99768J54159A00000K67236M54414C75393A10829K69916j39198P7828o5695
$$ 299768 453927 100000 367236 821650 375393 110829 380745 241547 319375 253680
17445B53680L4199R8290C1737N68416H2829J03039Q0934A06781P3126N8067J46030
$$ 253680 287879 386169 31737 600153 82829 185868 266802 106781 179907 237974 384004
17434C84004q4990J4348M3877P4581L6568B33276K49063J511A94729L19434B31081
$$ 384004 299014 313362 357239 431820 468388 233276 482339 483850 194729 514163 231081
17422C86220m2935m6700K8904K92692k51450J64592k51860J35436J54134J10684
$$ 386220 343285 296585 325489 618181 366731 531323 279463 414899 569033 679717
17412F79717k65870n118P3089H4800M36586r0626m4245m2214I7788K02338J48570
$$ 679717 413847 408729 481818 84800 521386 430760 386515 344301 97788 300126 448696
17401D48696j41864a45242C06189G7142M70222n4044B5611J85133J69870A49131
$$ 448696 306832 -145242 306189 77142 547364 493320 25611 210744 380614 149131
17390A1195J90507J29957j15440H1203L86040j65469G4920J34951o2235h6915
$$ 11195 201702 331659 216219 81203 467243 301774 74920 209871 147636 -86915
17379A40338j8259J79676j07417p588J45142P3559J01504A61500L1639R2311j13300
$$ 140338 122079 301755 194338 186750 331892 405451 506955 161500 193139 285450 172150
17368A72150l5502N19622I1253J32801O8529j114H9120J97214O093j36026J46063
$$ 172150 136648 656270 91253 224054 292583 291469 89120 286334 292427 156401 302464
17357C02464l762o4183K128N0689a63460D24345H3213J1347J60033J52898i4842
$$ 302464 298702 234519 236647 287336 -163460 424345 83213 94560 254593 407491 -94842
17345B49551J78738H8000N48979G5736e328B59079j04949b4619A77028K83359
$$ 249551 428289 88000 636979 75736 -5328 259079 154130 -24619 177028 460387
17335D60387I3261K21961J50391j93808M2111o9020Q0476j05049J07039E8433
$$ 460387 93261 315222 465613 271805 313916 244896 325372 220323 327362 58433
17324E34750I8046J99797L4420G5160g1268B74183J90275A40154K74020B06059
$$ 534750 98046 297843 332263 75160 -71268 274183 464458 140154 414174 206059
17313B88006j23237K01562H7249M73873A40063J10000a58059A82180F1487K98737
$$ 288006 164769 366331 87249 561122 140063 250063 -158059 182180 61487 360224
17303C60224H1195J67085E4597R6549J97352C2320f3412C64758A59563J2013L45176
$$ 360224 81195 248280 54597 151146 348498 32320 -63412 364758 159563 171576 516752
17292E16752J70967B38696D9438J5611J71115J58414K52645k86131C5407O2724
$$ 516752 687719 238696 49438 65049 236164 394578 647223 361092 35407 98131
17282I8131J23453k8895J83526o4847l3859K42407B25814L98831p2153k06076
$$ 98131 221584 192689 376215 311368 277509 519916 225814 624645 552492 346416
17272C46416L0061J54109k35966A11483K83125A64669o7896K97849A64829R9439
$$ 346416 376477 530586 294620 111483 394608 164669 96773 394622 164829 264268
17262B64268q4037j898O3949l303j05607J35637J6687r0525N32302B30548l893
$$ 264268 180231 178333 242282 238979 133372 269009 285696 195171 727473 230548 226655
17251B26655L18174j67381j6567P1666D6019N70043j94939A25041O2010K70053
$$ 226655 544829 377448 360881 432547 46019 616062 421123 125041 187051 457104
17241D57104B17079Q0271D0479K95511A37760l3296L00269j04605q4901K21767
$$ 457104 217079 297350 40479 335990 137760 104464 404733 300128 215227 436994
17231D36994j30132J02965J05717l0626k06877K52225B27565i2638H8427J35857
$$ 436994 306862 409827 515544 484918 278041 530266 227565 -92638 88427 224284
17221B24284j4969N34409A3032N01065B09411I0843L06389P1355B33929K33705
$$ 224284 209315 743724 13032 514097 209411 90843 397232 468587 233929 467634
17211D67634J2117O4246F5941J70169Q1466K28830k40055j40908N05420j88039
$$ 467634 479751 543997 65941 236110 317576 546406 306351 165443 670863 482824
17201D82824B25665J47167J3577M95695m37864o177j3800F9913L00029j17492
$$ 482824 225665 372832 386409 882104 444240 438063 424263 69913 369942 252450
17191B52450K19653P4602k16248J8968M5409Q2982n1664r6275L92790j71820B75293
$$ 252450 472103 546705 330457 349425 394834 477816 426152 329877 722667 550847 275293
17179B4914K41353L19706B03763L70151j19971k3303J75465j64387A80522K56322
$$ 24914 266267 585973 203763 573914 453943 430640 606105 441718 180522 436844
17169D36844J38604k36060R0911A71989K10996M0570k0796K89684I7481N10848
$$ 436844 575448 339388 430299 171989 382985 423555 402759 692443 97481 608329
17159F08329k0911k1556q377K40309B94997J23411J31965j33733R9830q5781M01082
$$ 608329 587418 565862 557485 797794 294997 418408 550373 416640 516470 430689 831771
17148H31771l84463P8459L54368l12947J7560K6954k41373l6826J58167J10286
$$ 831771 447308 525767 880135 567188 584748 611702 370329 333503 491670 601956
17138F01956k45784J26762J03209j66403J51743O3835n5220L0742B26435j1328
$$ 601956 356172 482934 586143 419740 571483 635318 580098 610840 226435 215107
17128B15107M97146k33601j23201O1290A42127P982M05981l6481o7907R7952K08905
$$ 215107 712253 478652 355451 416741 142127 150109 556090 519609 451702 549654 758559
17117G58559j06561J87749C11294K2815K33083j78404p8763L3450J18819K41708
$$ 758559 651998 839747 311294 334109 567192 388788 310025 343475 462294 704002
17107G04002k45484L49387B00596M62608J47432k21013K56757L8054k77066M1484
$$ 704002 458518 807905 200596 663204 810636 589623 846380 884434 607368 648852
17097F48852K6240j58940J47998k2256R99r812j36860J48885p6924K59787o8115
$$ 648852 675092 516152 664150 641894 642893 633081 496221 645106 568182 827969 759854
17086G59854j26959j27151J68962k30654N30674m75026L33964m137k86465j93899
$$ 759854 632895 505744 674706 444052 974726 499700 833664 829527 543062 349163
17076C49163J54087K85240k95558J37202l10209L54790L058J07662k18888M60302
$$ 349163 503250 788490 492932 630134 319925 674715 677773 785435 566547 1026849
17066A026849m60796j2891J12598J24950j63572q4622K27701l58333J21270K08543
$$ 1026849 566053 553162 665760 790710 627138 542516 770217 411884 533154 741697
17056G41697N7821R0729j14111n7245K7602l08172L71102k6245J794M7081j22901
$$ 741697 799518 890247 776136 718891 746493 438321 809423 783178 784972 832053 709152
17045G09152K89576k25110j48594J61512K47065j54097j2771N6658n4856l45697
$$ 709152 998728 773618 625024 786536 1033601 879504 866733 923391 868535 522838
17035E22838O20062l47736P7068K4179O865j23485O20963n85647L56051l34800
$$ 522838 1142900 795164 872232 896411 903276 779791 1400754 815107 1171158 836358
17025H36358J13546q1l47213J96797K54891R3296l09468K65960n12847L74814
$$ 836358 949904 949823 602610 799407 1054298 1147594 838126 1104086 591239 966053
17015I66053L290K4605j57682K27202k6093J50653q955k27959j93496K32244n0298
$$ 966053 969343 993948 836266 1063468 1037375 1188028 1179073 951114 757618 989862 939564
17004I39564K7645N02724n32682J39874j27257K87055r7783l07551J66752N2919
$$ 939564 967209 1469933 937251 1077125 949868 1236923 1139140 831589 998341 1051260
16994A051260j37627Q8034M58677l55176m3688J66151j9190k62331M428J02777
$$ 1051260 913633 1001667 1460344 1105168 1061480 1227631 1208441 946110 950538 1053315
16984A053315k0977j2932J56370Q3706K87922j17334r6796l99476N35328k26778
$$ 1053315 1032338 1019406 1175776 1259482 1547404 1430070 1333274 933798 1469126 1242348
16974A242348P6012J05977J93734l49528J3802k66043K9837L50166J39390J37638
$$ 1242348 1318360 1424337 1618071 1268543 1282345 1016302 1046139 1396305 1535695 1673333
16964A673333o35212L39440r9196R7809r0214L46579m88094K17234J29614o8567
$$ 1673333 1038121 1377561 1278365 1376174 1285960 1632539 1144445 1361679 1491293 1422726
16954A422726L78229n07684M10502o1691k14480K14788k98210K98297j71091L36765
$$ 1422726 1800955 1293271 1703773 1642082 1427602 1642390 1344180 1642477 1471386 1808151
16944A808151r5518k02837j36127J81404K74880k19572J5069J79836K18456j45514
$$ 1808151 1712633 1509796 1373669 1555073 1829953 1610381 1625450 1805286 2023742 1878228
16934A878228k52467K28232k93665K23149K26422J59942l27752q2681J91491l73581
$$ 1878228 1625761 1853993 1560328 1783477 2009899 2169841 1842089 1759408 1950899 1577318
16924A577318L42851K94232l22912j33954L02234j43385j14108L8741K92570j76304
$$ 1577318 1920169 2214401 1891489 1757535 2059769 1916384 1802276 1841017 2133587 1957283
16914A957283J12130K29479j11627r6550J01845j00746q0671L0679K87991k74530
$$ 1957283 2069413 2298892 2187265 2090715 2192560 2091814 2011143 2041822 2329813 2055283
16904B055283R6871J63468k92933K43657L13941k0121j15329j7278J95418k37207
$$ 2055283 2152154 2315622 2022689 2266346 2580287 2560166 2444837 2427559 2622977 2385770
16894B385770L92424l51424O3544M1422r589l4768K17328k7634p7794L88701k29638
$$ 2385770 2778194 2426770 2490314 2531736 2522147 2487379 2704707 2677073 2599279 2987980 2758342
16883B758342M18991o67084M60131j59330K71227k16520L99887l33837O8669k0843
$$ 2758342 3177333 2510249 2970380 2811050 3082277 2865757 3265644 2931807 3000476 2979633
16873B979633K09542Q1791J46637k1920j21317k26319M70603L46560o74943L97934
$$ 2979633 3189175 3270966 3417603 3395683 3274366 3048047 3518650 3865210 3190267 3588201
16863C588201R1789j83171J63465o4003J41628J00407k98756J58960K38101K04756
$$ 3588201 3679990 3496819 3660284 3596281 3737909 3838316 3539560 3698520 3936621 4141377
16853D141377m3031J51313J54756k35565j68432K82350J59271j70805J75051M1574
$$ 4141377 4098346 4249659 4404415 4168850 4000418 4282768 4442039 4271234 4446285 4487859
16843D487859N11K28908J10148N4930J77277l04658O6648L65028m3280M18492
$$ 4487859 4488370 4717278 4827426 4882356 5059633 4754975 4821623 5186651 5143371 5561863
16833E561863j51313L86911m56092M65230j03674L78545J55472j80375K87369
$$ 5561863 5410550 5797461 5341369 5806599 5702925 6081470 6236942 6056567 6343936
16824F343936l34153O74564m60161J75470J8375O34923j27071J52931K07977j6592
$$ 6343936 6009783 6684347 6224186 6399656 6418031 7052954 6925883 7078814 7286791 7270199
16814G270199J61959L46551j57608K63469m5357M96502m64264P02311P0960K54444
$$ 7270199 7432158 7778709 7621101 7884570 7839213 8335715 7871451 8573762 8644722 8899166
16804H899166J83484p2730L14744K24891R730M61686l061L89622k17271P48733
$$ 8899166 9082650 9009920 9324664 9549555 9559285 10020971 10017910 10407532 10190261 10938994
16794A0938994k7477N06348P8174J55867J15948L39242L01255M85458Q4208M53219
$$ 10938994 10911517 11417865 11496039 11651906 11767854 12107096 12408351 12893809 12978017 13431236
16784A3431236K42349K39375K84477N08679J78337N76614M13652K97815L57929
$$ 13431236 13673585 13912960 14197437 14706116 14884453 15461067 15874719 16172534 16530463
16775A6530463N05731M66343M03668L49863P34387M23940M67937O06497O55364
$$ 16530463 17036194 17502537 17906205 18256068 18990455 19414395 19882332 20488829 21144193
16766B1144193O33433N70676P66178M02973J007970P24443R22228P98708N82403
$$ 21144193 21777626 22348302 23114480 23517453 24525423 25249866 26172094 26970802 27553205
16757B7553205Q66409J124776R51599P50012J279922J129172J416951J188561
$$ 27553205 28419614 29544390 30495989 31246001 32525923 33655095 35072046 36260607
16749C6260607J063480J639812J184124J272716K147571J174198J649662J745579
$$ 36260607 37324087 38963899 40148023 41420739 43568310 44742508 46392170 48137749
16741D8137749K130517J975733K056218K433977J521801K651542K489318K149466
$$ 48137749 50268266 52243999 54300217 56734194 58255995 60907537 63396855 65546321
16733F5546321K655294K679881L132885K912691K825851L495454K487297L558267
$$ 65546321 68201615 70881496 74014381 76927072 79752923 83248377 85735674 89293941
16725H9293941L350494L176076L657216L126949L339197L615084L048468L229216
$$ 89293941 92644435 95820511 99477727 102604676 105943873 109558957 112607425 115836641
16717A15836641L189791K876738K464871K722121K058605K102388J360638J284249
$$ 115836641 119026432 121903170 124368041 127090162 129148767 131251155 132611793 133896042
16709A33896042Q95287L04517J28658j17106r83366n98472j819481j603800k356597
$$ 133896042 134791329 135095846 135224504 135107398 134124032 133525560 131706079 130102279 127745682
16700A27745682k357389k330445k754188l046328k975688l602960l298415l374121
$$ 127745682 125388293 123057848 120303660 117257332 114281644 110678684 107380269 104006148
16692A04006148l280234l633318l075788l486619l231949l038608l325841l292773
$$ 104006148 100725914 97092596 94016808 90530189 87298240 84259632 80933791 77641018
16684G7641018k714074k799441k577737l143421k485128k453516k316173k320487
$$ 77641018 74926944 72127503 69549766 66406345 63921217 61467701 59151528 56831041
16676E6831041k263258j975121j815721k212968j273293k264125j578509j413500
$$ 56831041 54567783 52592662 50776941 48563973 47290680 45026555 43448046 42034546
16668D2034546j459604j941379q88371j568274j330997j283846r65789r77441
$$ 42034546 40574942 38633563 37745192 36176918 34845921 33562075 32596286 31618845
16660C1618845j259412j039267r31787p85530r57099p61385q26512q49146p27036
$$ 31618845 30359433 29320166 28388379 27602849 26645750 25884365 25057853 24208707 23481671
16651B3481671p04230p94140n76391r17129k17021p27571m68016l54385n58162
$$ 23481671 22777441 21983301 21406910 20489781 20272760 19545189 19077173 18722788 18164626
16642A8164626n75690k92116m46128m75595m12704n78790m23338l45747n47847
$$ 18164626 17588936 17296820 16850692 16375097 15962393 15383603 14960265 14614518 14066671
16633A4066671m97802l06555J94438o33800L1494l29451j03167p77492l9804j19143
$$ 14066671 13568869 13262314 13456752 12822952 12854446 12524995 12421828 11644336 11604532 11485389
16623A1485389o80235j02929j87567J7018l34483j64414l81588Q2854k22645o96583
$$ 11485389 10805154 10702225 10514658 10531676 10197193 10032779 9651191 9734045 9511400 8814817
16613H814817K0778q6747k11870j46341k3458k09065k52468j38054j92543j98940
$$ 8814817 8835595 8748848 8536978 8390637 8367179 8158114 7905646 7767592 7575049 7376109
16603G376109k45171K65390j42448k94771k10084L68143p09863M292K16641k23844
$$ 7376109 7130938 7396328 7253880 6959109 6749025 7117168 6407305 6411597 6628238 6404394
16593F404394n51590O4310q314n3730J00074k00597j25193n6761k04663J74299
$$ 6404394 5852804 5917114 5908800 5855070 5955144 5754547 5629354 5572593 5367930 5542229
16583E542229m31076j68739K8435J41906l3859k49093p2822J47668k96916L9347
$$ 5542229 5111153 4942414 4970849 5112755 5078896 4829803 4756981 4904649 4607733 4647080
16573D647080j53177L2018k8634n44061J27394j29997O7452J25059j63687l80990
$$ 4647080 4493903 4525921 4497287 3953226 4080620 3950623 4018075 4143134 3979447 3598457
16563C598457K33357L8643n9913m52983N30095N0912q7186m02209J15004L67691
$$ 3598457 3831814 3870457 3810544 3357561 3887656 3938568 3851382 3449173 3564177 3931868
16553C931868n87614L72972k84973l26818p6236L78098j71511K18717j06140N2972
$$ 3931868 3344254 3717226 3432253 3105435 3029199 3407297 3235786 3454503 3348363 3401335
16543C401335m12068K16657k76365j86763K65846n352O0685m78318K40492l13810
$$ 3401335 2989267 3205924 2929559 2742796 3008642 3003290 3063975 2585657 2826149 2512339
16533B512339K37248P0038k23408R1329k90871J50068j38711L4806j82166J97335
$$ 2512339 2749587 2819625 2596217 2687546 2396675 2546743 2408032 2442838 2260672 2458007
16523B458007J36618m45971j51958L28895J12632k3781L472L4414l49822N9694
$$ 2458007 2594625 2148654 1996696 2325591 2438223 2414442 2417914 2452328 2102506 2162200
16513B162200L19869k27543k88035N71140m10301q009q5690j6170K31375m29817
$$ 2162200 2482069 2254526 1966491 2537631 2127330 2119321 2033631 2017461 2248836 1819019
16503A819019L72045j69029p81k16818K09468J10828j28064p9991K08605j92553
$$ 1819019 2191064 2022035 2021254 1804436 2013904 2124732 1996668 1916677 2125282 1932729
16493A932729k29574j79000L42392M5830j6094k3297l925j88324K87423l33316
$$ 1932729 1703155 1524155 1866547 1912377 1896283 1872986 1869061 1680737 1968160 1634844
16483A634844L55713n61431L73017j33109l7457r5290k61876M71532k76537M5964
$$ 1634844 1990557 1429126 1802143 1669034 1631577 1536287 1274411 1745943 1469406 1515370
16473A515370p8483Q6879o6243J92653j90629L16199k87759j94905L83878k05156
$$ 1515370 1436887 1523766 1457523 1650176 1459547 1775746 1487987 1293082 1676960 1471804
16463A471804l34267L42166J6992j36672J09460J56216l13390k27565K07361j36458
$$ 1471804 1137537 1479703 1496695 1360023 1469483 1625699 1312309 1084744 1292105 1155647
16453A155647J27478n7404L4342Q4574j42786K78826n69409N88323m79694L50650
$$ 1155647 1283125 1225721 1260063 1344637 1201851 1480677 911268 1499591 1019897 1370547
16443A370547j45125L17049N4668l11053o1023j17934R4571Q9444r1120j7574
$$ 1370547 1225422 1542471 1597139 1286086 1225063 1107129 1201700 1291144 1200024 1182450
16433A182450K20482r1182j38102n19730M61585l3930P0399J65786n40758L12125
$$ 1182450 1402932 1311750 1173648 653918 1115503 1081573 1151972 1317758 777000 1089125
16423A089125m575j17475J68349k804j13971K66383n8083l86447k94644N15117
$$ 1089125 1084550 967075 1135424 1132620 1018649 1285032 1226949 840502 545858 1060975
16413A060975q1350k9582O2208M09653m91258M0618O7533J16177j03527j59950
$$ 1060975 979625 950043 1012251 1421904 930646 971264 1038797 1154974 1051447 891497
16403H91497L9378J60632j77709Q1190l44002J72128j4268K76063k91983k35471
$$ 891497 930875 1091507 913798 994988 650986 823114 808846 1084909 792926 557455
16393E57455N95072l75742J96734O0114j73921J0707O3871j47185K0754J70468
$$ 557455 1152527 776785 973519 1033633 859712 870419 934290 787105 807859 978327
16383I78327j35786l4527k62640K67627k58787Q5531K73566l27174K27050P4968
$$ 978327 842541 808014 545374 813001 554214 639745 913311 586137 813187 888155
16373H88155J89703D77488J76920R262K0630L4792r0685K61832J39090k79705
$$ 888155 1077858 477488 654408 663670 684300 719092 628407 890239 1029329 749624
16363G49624j3917p6805J70050j69477m4099J09969L7458J02934j67164N2407
$$ 749624 735707 658902 828952 659475 615376 725345 762803 865737 698573 750980
16353G50980k49142J74209r751J87521k49952J60441N7331K6750j01713n9671
$$ 750980 501838 676047 666296 853817 603865 764306 821637 848387 746674 687003
16343F87003M4619l08096N01996k36318k57212J77047K4975J38317k35181A56483
$$ 687003 731622 423526 925522 689204 431992 609039 634014 772331 537150 156483
16332C58386L49639k16357K326J00585L41774k97124k49246L55200J39209l8340
$$ 358386 708025 491668 493994 594579 936353 639229 389983 745183 884392 846052
16322H46052k98007j6638k60384L74282j47284L6244J20279B83925K28600j4013
$$ 846052 548045 531407 271023 645305 498021 534265 654544 283925 512525 498512
16312D98512K05251J0503j55333o1591N8703L03920k01745k60860m410K81828
$$ 498512 703763 714266 558933 497342 556045 859965 658220 397360 392950 674778
16302F74778J37365j34015C07388M13560k35251j15435m8168N26404k68341j47506
$$ 674778 812143 678128 307388 720948 485697 370262 322094 848498 580157 432651
16292D32651j15656M5529L2008J27212J6552j4388K49690l57844O0937R6004L26980
$$ 432651 316995 362524 394532 521744 538296 523908 773598 415754 476691 572695 899675
16281H99675l79932J47640B40458p7612J85124G4992L72316Q6256j93701L51664
$$ 899675 519743 667383 240458 162846 347970 74992 447308 533564 339863 691527
16271F91527n7636k95745m1893N04660j34964j01853j20034j39308J41023r1280
$$ 691527 633891 338146 296253 800913 665949 564096 444062 304754 445777 354497
16261C54497O713A60156L42038J55633j38679l2664q0773j80566R8942L8824j9260
$$ 354497 361210 160156 502194 657827 519148 486484 405711 225145 324087 362911 343651
16250C43651J27968l032K52294A53293J29022L59368B67105J30479k5469A41854
$$ 343651 471619 468587 720881 153293 282315 641683 267105 397584 372115 141854
16239C99288l4420J20180J23077B18877P3755E5007K39598F1658N01743B45150
$$ 399288 364868 485048 608125 218877 292632 55007 294605 61658 563401 245150
16228A56613K14623O3912j23143A21911M64691l6831B1440O00636C8499K12007
$$ 156613 371236 435148 312005 121911 586602 549771 21440 622076 38499 250506
16218B50506O5899l4924J26323j65803K10067j83242M84617C52118n849K07682
$$ 250506 316405 281481 407804 242001 452068 268826 753443 352118 346269 553951
16208E53951p6237j7291J2492B30966O1834m4006J54257j81339J16343J52374
$$ 553951 477714 460423 472915 230966 292800 248794 403051 221712 338055 490429
16198D90429B22029m5754K10829J82208i7927C35188A10607L68650J55980H9183
$$ 490429 222029 176275 387104 569312 -97927 335188 110607 479257 635237 89183
16187B41192l5636l6800K53595O0713A46320K97393D4470L51621j50578r6466
$$ 241192 205556 168756 422351 483064 146320 443713 44470 396091 245513 149047
16177A49047R2544a33965C91330K16791H4585P7489a76060A16391K78896j37748
$$ 149047 241591 -133965 391330 608121 84585 162074 -176060 116391 395287 257539
16167B57539q7140J61072P916j34045J81694p4900a6437A71596k903q913J1401
$$ 257539 170399 331471 339387 205342 387036 312136 -16437 171596 168693 159780 171181
16156A71181a64260B8855L61400E5655K12307I2137K03850J47939D7695e6092
$$ 171181 -164260 28855 390255 55655 267962 92137 295987 443926 47695 -56092
16145C23788G0432K58447B1148L88606b7596B43968q5774K39732E8868k5211a7776
$$ 323788 70432 328879 21148 409754 -27596 243968 158194 397926 58868 33657 -17776
16133A86540j0548Q3148r5079J03586r8875b0652m679A77427q5049L7557J76028
$$ 186540 175992 259140 164061 267647 168772 -20652 -25331 177427 92378 129935 305963
16122C05963D0518K69350r4018K9978l0027b57113E3848K62071A19534P4369b0248
$$ 305963 40518 309868 215850 245828 215801 -257113 53848 315919 119534 193903 -20248
16110C18701G4588L09552a69899C60872a44631E00740A32459F1992Q0766d0704
$$ 318701 74588 384140 -169899 360872 -144631 500740 132459 61992 142758 -40704
16099C9896K11428n4642a78587B3184J1421K44145G0096M8702Q9749J5527O872
$$ 39896 251324 196682 -178587 23184 34605 278750 70096 118798 208547 224074 230946
16088B30946j10370h8319B33262j11929J71960i280F6777M04626k00957L2768
$$ 230946 120576 -88319 233262 121333 293293 -9280 66777 471403 270446 303214
16078C03214M8288J2002A81486P4401J69525j52568b5214j9188j7440E04474A49908
$$ 303214 351502 363504 181486 255887 425412 272844 -25214 -44402 -61842 504474 149908
16066b09272J3262h4909E26762I2155J40611A00735L28631A65195n2380J41450
$$ -209272 -196010 -84909 526762 92155 232766 100735 429366 165195 112815 254265
16056B54265A21751l0853I710J66372a5018C09468H1301I677g9277A44014N7683
$$ 254265 121751 90898 9710 176082 -15018 309468 81301 9677 -79277 144014 201697
16045B01697O5291B6054b09238B69710a4629A5067K52356e4907C59090N0917a56219
$$ 201697 266988 26054 -209238 269710 -14629 15067 267423 -54907 359090 410007 -156219
16033a9199A32249L2622J59739H0397K0113L03132A49857K11244A33778R655M0382
$$ -19199 132249 164871 324610 80397 100510 403642 149857 361101 133778 143433 183815
16022A83815J57494b13472A6235a40501A81936d76052a74812C27177D5018K99224
$$ 183815 341309 -213472 16235 -140501 181936 -476052 -174812 327177 45018 344242
16012C44242e7294m7614k52825B9508Q7891l1657P4660b82973A59584D1766J42425
$$ 344242 -57294 -104908 -357733 29508 117399 85742 160402 -282973 159584 41766 184191
16001A84191e2825I126L11059A9368J58302P5944J39571e3792D22502o2402a43626
$$ 184191 -52825 9126 320185 19368 177670 253614 393185 -53792 422502 360100 -143626
15989a04645B66590a95287A24844f3963p4705A73536C3645O2718i595l9807A95760
$$ -104645 266590 -195287 124844 -63963 -138668 173536 33645 96363 -9595 -49402 195760
15977A26994K367f1690D70629j43834P1727L9953J95366J99044k07849O57011
$$ 126994 129361 -61690 470629 326795 398522 438475 633841 832885 625036 1282047
15967A282047o35946m8134j1863A97277K25453k4849c4577A29042j8169b30784
$$ 1282047 646101 597967 586104 197277 422730 397881 -34577 129042 110873 -230784
15956A63926j2953L0994e365C42863a89458B37007a11903A07232N4961I472a75356
$$ 163926 150973 181967 -5365 342863 -189458 237007 -111903 107232 162193 9472 -175356
15944A94363c21603B31542e8210o8271A31479a783m3375B49272a10726j04902
$$ 194363 -321603 231542 -58210 -126481 131479 -1783 -45158 249272 -110726 -215628
15934b15628A73381c40876B09730a61115l62214B03447i0901A08390J80885b42267
$$ -215628 173381 -340876 209730 -161115 -523329 203447 -90901 108390 289275 -242267
15923a0167B9726d1367p2871j8511n1452e6928o0144B41887d8257m0078C3604
$$ -10167 29726 -41367 -114238 -132749 -184201 -56928 -117072 241887 -48257 -88335 33604
15911E11657B01846B0136b80094i7824B4083a38378b6414n111C38622a86308c1802
$$ 511657 201846 20136 -280094 -97824 24083 -138378 -26414 -31525 338622 -186308 -31802
15899i9234A19576i0229j70148c4517j751G1772b85374c1772m3481j34749H0875
$$ -99234 119576 -90229 -260377 -34517 -36268 71772 -285374 -31772 -75253 -210002 80875
15887h4995j13812p1912P7771h3525b4654j24450d3109F8104J4274k9088b59073
$$ -84995 -198807 -270719 -192948 -83525 -24654 -149104 -43109 68104 82378 53290 -259073
15875a40677b6273A63822F4220N5875e9869K5042A02661Q663C4272c65816A41795
$$ -140677 -26273 163822 64220 120095 -59869 -34827 102661 111324 34272 -365816 141795
15863B98882G3851L26277A02750f7977j44811p7413i4998d5312A77376a2235j92977
$$ 298882 73851 400128 102750 -67977 -212788 -290201 -94998 -45312 177376 -12235 -205212
15852b05212b1656k21677i1572q7565C18696b59j05069o4737A5678J99468a04528
$$ -205212 -21656 -243333 -91572 -179137 318696 -259 -105328 -170065 15678 215146 -104528
15840c3833C1281c72817H0523R8397C1655K48189b05428A8920a979G9379f7026
$$ -33833 31281 -372817 80523 178920 31655 279844 -205428 18920 -1979 79379 -67026
15828a67183A86856c5196C21544A11607J8036R9274e5536k5968E4736c88136J48203
$$ -167183 186856 -35196 321544 111607 129643 228917 -55536 -81504 54736 -388136 -239933
15817b39933F9014B5805J3888a25037o7176I7839a57172g0661G406b54319C5580
$$ -239933 69014 25805 39693 -125037 -192213 97839 -157172 -70661 7406 -254319 35580
15805h0187o7013j37505Q3549A02545J80237c43708A38275D7874q852a09036j7473
$$ -80187 -147200 -284705 -201156 102545 282782 -343708 138275 47874 39022 -109036 -126509
15794a26509A83618c0170j50331B11140j04429f6544A73328L4425K7703a31657
$$ -126509 183618 -30170 -180501 211140 106711 -66544 173328 207753 235456 -131657
15783A6767Q9524O0747d0582j3840A93252b09427c1017j59442A20402L0726b25970
$$ 16767 106291 167038 -40582 -54422 193252 -209427 -31017 -190459 120402 151128 -225970
15771F1032J07474J52097A03765e2099k49830H2319c0577I9094A7168a83747B50577
$$ 61032 168506 320603 103765 -52099 -301929 82319 -30577 99094 17168 -183747 250577
15759c12607H1369M96087b1503A43178j8311e4726j4696j56302B63388C7066a94257
$$ -312607 81369 577456 -21503 143178 124867 -54726 -69422 -225724 263388 37066 -194257
15747d8557Q926B09681j03618i5085b4856I6809N0921j76G0069e3053j36092N7220
$$ -48557 -39631 209681 106063 -95085 -24856 96809 147730 147554 70069 -53053 -189145 -131925
15735a31925j16701M5649c2553A17740E4307a1976r8531N282n081j28397d4033
$$ -131925 -248626 -202977 -32553 117740 54307 -11976 -110507 -105225 -110306 -238703 -44033
15723A69953D9416c22570g999q0886E9625m065B4597K54999F6585J63550D8522
$$ 169953 49416 -322570 -7999 -88885 59625 55560 24597 279596 66585 230135 48522
15711a93545e7740k82069J39713G5842e8359B25504c6407j21688O2204A70933
$$ -193545 -57740 -339809 -200096 75842 -58359 225504 -36407 -158095 -95891 170933
15700g2486m16269b43311I5673g1930j25263r288e6184R645B75486A11013a12519
$$ -72486 -488755 -243311 95673 -71930 -197193 -206481 -56184 -46539 275486 111013 -112519
15688a22703k8427C33647d1875A55848a00293b258o093B55685c54438a34468B8660
$$ -122703 -151130 333647 -41875 155848 -100293 -2258 -8351 255685 -354438 -134468 28660
15676A16651O0713i985B58472a16044L3967G2062K5974P4460q1277c70758i6156
$$ 116651 177364 -9985 258472 -116044 -82077 72062 98036 172496 91219 -370758 -96156
15664a7800B05245k263I5072c47743C86974A21484B9625D123K48862a47407I2239
$$ -17800 205245 202982 95072 -347743 386974 121484 29625 4123 252985 -147407 92239
15652C75134a91193i961A30494b4226A58767a98373n8391l3413H8066b13204B05776
$$ 375134 -191193 -9961 130494 -24226 158767 -198373 -256764 -290177 88066 -213204 205776
15640A35594M9981i5282A04292a2893r0812e428m235j97469C08335k8941A02379
$$ 135594 185575 -95282 104292 -12893 -103705 -5428 -9663 -207132 308335 279394 102379
15628a82091A62639G6281J33746g0599G7447J00792b8460n6121j02928B04044
$$ -182091 162639 76281 210027 -70599 77447 178239 -28460 -84581 -187509 204044
15617B6466e9289j21638P6068j12063J6780b9623A04714e4473C43387C5295i1975
$$ 26466 -59289 -180927 -104859 -216922 -200142 -29623 104714 -54473 343387 35295 -91975
15605b69499J33696j60370p2384B82742a93199o3559A89869p6308k7483J35981
$$ -269499 -135803 -296173 -368557 282742 -193199 -256758 189869 113561 86078 222059
15595B22059D0100L82034c43324a57858D6978a2961I6569a09235A43235o6816
$$ 222059 40100 422134 -343324 -157858 46978 -12961 96569 -109235 143235 76419
15585G6419J45265l5976a6602k82665C09259F6132b29455B5773J94387I8203c90182
$$ 76419 221684 185708 -16602 -299267 309259 66132 -229455 25773 220160 98203 -390182
15573g5462A47117J26609G8451J32314E6166L08896c71463J77661H9477J0111
$$ -75462 147117 273726 78451 210765 56166 365062 -371463 -193802 89477 99588
15563I9588D2747a44057d1216B77864H1611N1997O8952a58599a1360l1423j58081
$$ 99588 42747 -144057 -41216 277864 81611 133608 202560 -158599 -11360 -42783 -200864
15552b00864B68319p0151R7571a36785c2317k2688l04503G8736c06401b901k75607
$$ -200864 268319 198168 295739 -136785 -32317 -55005 -359508 78736 -306401 -2901 -278508
15541b78508o5396J03836C5174a36706n2492l9808a6239A07774a11818j35855
$$ -278508 -343904 -240068 35174 -136706 -189198 -229006 -16239 107774 -111818 -247673
15531b47673H1675e3629a4395A3457L6882d3269A70139a62627C30542j08643B1077
$$ -247673 81675 -53629 -14395 13457 50339 -43269 170139 -162627 330542 221899 21077
15519A53012P2209e6944A29712K0307a08073r5148A92621o0819a5819D30453g1352
$$ 153012 225221 -56944 129712 150019 -108073 -203221 192621 131802 -15819 430453 -71352
15507B29486r4329J86446A21425C9228J09796B6702R4707c09958d6007o949B25562
$$ 229486 135157 321603 121425 39228 149024 26702 121409 -309958 -46007 -52956 225562
15495A25639a5456C8345L6668k3802K52006i9350J9432E9656R3378A4559M28813
$$ 125639 -15456 38345 75013 51211 303217 -99350 -79918 59656 153034 14559 443372
15484D43372A70676J87649i690k8880C32602A25187B6957N710K72443a14486f655
$$ 443372 170676 358325 -9690 -38570 332602 125187 26957 32667 305110 -114486 -6655
15472b47162A04934J49442d1827D7655P1035c5729A50541A4683K77430i9463A45739
$$ -247162 104934 254376 -41827 47655 118690 -35729 150541 14683 292113 -99463 145739
15460a7568D11957n6160M40403B95765J12483A34749P7809m4704g3386l5484C66525
$$ -17568 411957 355797 796200 295765 408248 134749 212558 167854 -73386 -108870 366525
15448A66585D1956a25337E5694i9166j17855d4153m2496A88330k6591a7344k34673
$$ 166585 41956 -125337 55694 -99166 -217021 -44153 -86649 188330 161739 -17344 -252017
15437b52017a07903I1392f5793k17600G9219J38768g6799D5302J30863J74912
$$ -252017 -107903 91392 -65793 -283393 79219 217987 -76799 45302 176165 351077
15427C51077A54111N58558Q2311J94132l02059k39844o326G7528L54283g7127
$$ 351077 154111 712669 794980 989112 687053 447209 440883 77528 431811 -77127
15416e9842k80763R7105b6236k8110B71224r0158G1309J55851g27k21453j32820
$$ -59842 -340605 -243500 -26236 -54346 271224 181066 71309 227160 -727 -222180 -355000
15405c55000B25104a5795A5964e1297j61658k14667F6441Q1339c10399O0851j5008
$$ -355000 225104 -15795 15964 -51297 -212955 -427622 66441 147780 -310399 -249548 -264556
15394b64556B3767L38459e9709D9020j6934a07832B96698M2601A44533e2050k17360
$$ -264556 23767 362226 -59709 49020 32086 -107832 296698 339299 144533 -52050 -269410
15383b69410D03207A92345G5825a15395j44358g8775F1459d36971a31220B17761
$$ -269410 403207 192345 75825 -115395 -259753 -78775 61459 -436971 -131220 217761
15372i5208K1336l0365A09236K8692K59057i5438G800J81948h8115A85623K24533
$$ -95208 -73872 -104237 109236 137928 396985 -95438 7800 189748 -88115 185623 410156
15361D10156g4049B96568E2565R0493K3909L13825A65666Q5247j11061f9558A61231
$$ 410156 -74049 296568 52565 143058 166967 480792 165666 250913 139852 -69558 161231
15349B96955B4692M3185L2475c8265A39532K14664G6872K47064i1080C22176A29245
$$ 296955 24692 67877 100352 -38265 139532 354196 76872 323936 -91080 322176 129245
15337C89747A13735K54217I620K90870j4317d5622m6594B85287k0023k4477F8475
$$ 389747 113735 367952 9620 300490 286173 -45622 -92216 285287 265264 240787 68475
15325C24578a49909I6601J50923q075A4994J47734K50361J0815n6911A76051a70827
$$ 324578 -149909 96601 247524 239449 14994 162728 413089 423904 366993 176051 -170827
15313A63006O7073J41768A38114o6760d1693B67291A9506O2969h4576D8052J06518
$$ 163006 230079 371847 138114 71354 -41693 267291 19506 82475 -84576 48052 154570
15302A54570G3632d3360D9144i3653F2946d7706p722l03521A9961K4953J8476
$$ 154570 73632 -43360 49144 -93653 62946 -47706 -55428 -358949 19961 44914 63390
15291F3390J60670o2655e6933l8121F7120N2789a96733g8793A39326C1739a21546
$$ 63390 224060 161405 -56933 -95054 67120 119909 -196733 -78793 139326 31739 -121546
15279C24683d5830o3849k5070A57122a01444H7477r927l3928d1642k3308k40264
$$ 324683 -45830 -109679 -134749 157122 -101444 87477 77550 43622 -41642 -64950 -305214
15268c05214a31466b1552j67773B117c7279B85892j3398A6077b49332B9135J56714
$$ -305214 -131466 -21552 -189325 2117 -37279 285892 272494 16077 -249332 29135 185849
15257A85849b99288a8888j28190e8777A80682a10603C7022J9430J74559E5093
$$ 185849 -299288 -18888 -147078 -58777 180682 -110603 37022 56452 231011 55093
15246E92957a04053A91632a07174e2235A01544a00422D66444A9363J7260K61538
$$ 592957 -104053 191632 -107174 -52235 101544 -100422 466444 19363 36623 298161
15236B98161N6768p8613j07234L6287H1649M0349K53561L79425M38905k47814
$$ 298161 354929 276316 169082 205369 81649 121998 375559 754984 1193889 946075
15226I46075o8131J44779k73783o1847l41569G5517M88330g9851C4025J99371
$$ 946075 877944 1022723 748940 687093 345524 75517 563847 -79851 34025 233396
15216B33396p7867R5205a47089O3288E4659K04459o3103a54419m598f714A09973
$$ 233396 155529 250734 -147089 -83801 54659 259118 196015 -154419 -159017 -6714 109973
15204A62187J3266d03260E9074R2400k3691a15274f614k78686a17238p0979B09853
$$ 162187 175453 -403260 59074 151474 127783 -115274 -6614 -285300 -117238 -188217 209853
15192A27712b07021B85725j14511J90709J5834A37441n7800b49537J08518B45641
$$ 127712 -207021 285725 171214 361923 377757 137441 79641 -249537 -141019 245641
15181E1152J6886J93800a0217A91619p9823J5239b23325I0239M4553f6180B16614
$$ 51152 68038 261838 -10217 191619 111796 127035 -223325 90239 134792 -66180 216614
15169A38029g4605l06710e176A66178p5320L02347G3786d6825B43337a87404A33584
$$ 138029 -74605 -381315 -5176 166178 90858 393205 73786 -46825 243337 -187404 133584
15157D7308d7693n2518B71091M1942A35629K80921C3366a7562B38838A2442J98599
$$ 47308 -47693 -100211 271091 313033 135629 416550 33366 -17562 238838 12442 211041
15146B11041D1362o156J29612n0724J60124j25415N3936A7007N1105b05683A25590
$$ 211041 41362 35206 164818 114094 274218 148803 202739 17007 68112 -205683 125590
15134G8263Q9377m1691k1364K34269I5545i1661A25660b23019O977B32072F552
$$ 78263 167640 125949 104585 338854 95545 -91661 125660 -223019 -216042 232072 6552
15122C22935j24677L5429a23899A09784J03302I0863O4082m8210a60562A32688
$$ 322935 198258 233687 -123899 109784 213086 90863 154945 106735 -160562 132688
15111c0766A7187J13157a5638C88008J3121J00411j26198A68180K75632j64893
$$ -30766 17187 130344 -15638 388008 401129 501540 375342 168180 443812 278919
15101B78919j23477n2989J18122l1697C6363L20845A78278F0658K28563g2637
$$ 278919 155442 102453 220575 188878 36363 357208 178278 60658 289221 -72637
15090B78200L11608a85150a1118F2814K40436d93272c7460B35732a31843r5902
$$ 278200 589808 -185150 -11118 62814 303250 -493272 -37460 235732 -131843 -227745
15080b27745D2110J5707J43981b9868B42168I3352N05999c4293j7137A56240B6803
$$ -227745 42110 57817 201798 -29868 242168 93352 599351 -34293 -51430 156240 26803
15068a13527g613A41511L3223M31782H2485K01276j14463K03287j13572A9498
$$ -113527 -7613 141511 174734 606516 82485 283761 169298 372585 259013 19498
15057D46505A02378K76784I0245Q4674J25564A08635h0470A65215J31654B5062
$$ 446505 102378 379162 90245 174919 300483 108635 -80470 165215 296869 25062
15046A34664c3914A45133a42024B98176a55673C23571K13465B65430J67250B00479
$$ 134664 -33914 145133 -142024 298176 -155673 323571 537036 265430 432680 200479
15035D72954j31939r4252B685K04531D5260J98607K1179P0097A17838M99582k13078
$$ 472954 341015 246763 2685 207216 45260 243867 265046 335143 117838 617420 404342
15024D04342J38462A71717K44526A87958J5171O511M1733J15721L94589l41631
$$ 404342 542804 171717 416243 187958 203129 209640 251373 367094 761683 420052
15014D20052J90575J92454l40488p9236l0517L41409j99718p5510O8880N9905
$$ 420052 610627 803081 462593 383357 352840 694249 494531 419021 487901 547806
15004E47806B68055o9238Q6710O66531D48135k9366J95086k79967K784o3913N9643
$$ 547806 268055 198817 285527 952058 448135 418769 613855 333888 336672 272759 332402
14993C32402J21018j41382J34159K10820C27883A17309M77105F0905L65800O1502
$$ 332402 453420 312038 446197 657017 327883 117309 594414 60905 426705 488207
14983D88207l1671j13944J67542K92533k47124M6488r3797P9637j00891k04600
$$ 488207 456536 342592 510134 802667 555543 602031 508234 587871 486980 282380
14973B82380L1378J36057J23473k63429j47183L04287J99402J70162Q0519j39360
$$ 282380 313758 449815 573288 309859 162676 466963 666365 836527 917046 777686
14963G77686B72363J15053P5543j76047K8786M81158j34758J48288j99181K26771
$$ 777686 272363 387416 462959 286912 315698 796856 662098 810386 611205 837976
14953H37976C67042G6156K16828K8331G0718L99681E0070K1423J17032K09723
$$ 837976 367042 76156 292984 321315 70718 470399 50070 71493 188525 398248
14943C98248A63928J36041j137J80263N2151B54864F4568L48420j47413J90040
$$ 398248 163928 299969 298832 479095 531246 254864 64568 412988 265575 455615
14933D55615a2528C15698o7978J83973R261O8895J05723q2230N9088J25587J9655
$$ 455615 -12528 315698 247720 431693 440954 509849 615572 533342 592430 718017 737672
14922G37672j06945k77647L69247A96333J67509K32994R4061J9281K14433Q578
$$ 737672 630727 353080 722327 196333 363842 596836 690897 710178 924611 933189
14912I33189J86324r3553L92784k9094P8986J4333j30231L1103k42744O44439
$$ 933189 1119513 1025960 1418744 1389650 1468636 1482969 1352738 1383841 1141097 1785536
14902A785536k03558M27246k51894N1117n37987j15809l882m08560J04471j11382
$$ 1785536 1581978 2009224 1757330 1808447 1270460 1154651 1150769 742209 846680 735298
14892G35298k58848J99700k53052K4954k06259K92100B33425K23930A80294J38871
$$ 735298 476450 676150 423098 448052 241793 533893 233425 457355 180294 319165
14882C19165J43558J47798j04440K9559N1367L1558r2393M5232r1347L0925B46965
$$ 319165 462723 610521 506081 535640 587007 618565 526172 571404 480057 510982 246965
14870E09330J20600K8024M84897m24305j97042L8376L8452J79724p0293q1008
$$ 509330 629930 657954 1142851 718546 521504 559880 598332 778056 707763 626755
14860F26755j35589J51719K85321C76804Q0253M0703j211j14223L11403J93757
$$ 626755 491166 642885 928206 376804 457057 497760 496549 382326 693729 887486
14850H87486p7801M8266j73751j11610l1689B52532L44832J5900p8768n1912j24404
$$ 887486 809685 857951 684200 572590 540901 252532 597364 613264 534496 482584 358180
14839C58180J59749j30963J44094k50591N6989I2991K94261O6977K2439K33756
$$ 358180 517929 386966 531060 280469 337458 92991 387252 454229 476668 710424
14829G10424J2813j40138M82173n7759k40005M00110J38831m56226J1305N8848
$$ 710424 723237 583099 1065272 1007513 767508 1167618 1306449 850223 861528 920376
14819I20376j2154k5682p7646n4819l49307J82252O0420o8906r7389J0598J78776
$$ 920376 908222 882540 804894 750075 400768 583020 643440 574534 477145 487743 666519
14808F66519J6278k8416j26407J15872M57549m65344j30630K79225j5826j63782
$$ 666519 682797 654381 527974 643846 1101395 636051 505421 784646 768820 605038
14798F05038M4512L1600J5494N693j62156K1193J44086J01134k92416M75121j117
$$ 605038 649550 681150 696644 702337 540181 561374 705460 806594 514178 989299 988182
14787I88182j46775o1014K94899l31043l50769q3636M29477m4308k6289m0553
$$ 988182 841407 780393 1075292 744249 393480 309844 739321 695013 668724 628171
14777F28171L36171A93537J55344L87053j45746L4076k9751J79324j90433J07955
$$ 628171 964342 193537 348881 735934 590188 624264 594513 773837 583404 691359
14767F91359K52919n3532r3966C85245J60014J50969Q996J32931p2343O690j08067
$$ 691359 944278 890746 796780 385245 545259 696228 705224 838155 765812 772502 664435
14756F64435R6872j5080j02691J69587P1196l94891J67394J06610k71892L43952
$$ 664435 761307 746227 643536 813123 884319 489428 656822 763432 491540 835492
14746H35492R3914l22524j85757o242J81101J8200M4757k38971j1526O15417l43183
$$ 835492 929406 606882 421125 414883 595984 614184 658941 419970 408444 1023861 680678
14735F80678J87914o1605J98990K4642j15027r6308J48935R5832l16701j44810
$$ 680678 868592 806987 1005977 1030619 915592 819284 968219 1064051 747350 602540
14725F02540j46919J13973k9096P1929J8180J87257k18531J30413L85795k43196
$$ 602540 455621 569594 540498 612427 630607 817864 599333 729746 1115541 872345
14715H72345p355J43507K01831k16355L88629j45129J75719n5063J53029j84721
$$ 872345 864990 1008497 1210328 993973 1382602 1237473 1413192 1358129 1511158 1326437
14705A326437k30882j94401K93274m0970m66662N40370l97265J89911l0519M3790
$$ 1326437 1095555 901154 1194428 1153458 686796 1227166 829901 1019812 989293 1033083
14695A033083j92905p9430J59368K1295M23470j22855l39600K42734j26551L54500
$$ 1033083 840178 760748 920116 941411 1364881 1242026 902426 1145160 1018609 1373109
14685A373109P7600k5866J02679k4608K03563k93864m07725K98553j34063j78358
$$ 1373109 1450709 1424843 1527522 1502914 1706477 1412613 1004888 1303441 1169378 991020
14675I91020M5986O5518l81319L41117K1064P8288K25991p6938l80570R7879r2198
$$ 991020 1037006 1102524 721205 1062322 1083386 1161674 1387665 1310727 930157 1028036 935838
14664I35838K47463l25827p5634K51147L20569o38698L35550O2973o525l6739
$$ 935838 1183301 857474 781840 1032987 1353556 714858 1050408 1113381 1106856 1070117
14654A070117J7952o9972K4125K74142k44212J84677J86669n08501J11066J39319
$$ 1070117 1088069 1018097 1042222 1316364 1072152 1256829 1443498 934997 1046063 1185382
14644A185382J60253k70701j74590O08957m68471j32721J37786m4524M82767k66399
$$ 1185382 1345635 1074934 900344 1509301 1040830 908109 1045895 1001371 1484138 1217739
14634A217739l966M96492o71080J82945r0212n7452L95484m9753m83722N65200
$$ 1217739 1213773 1710265 1039185 1222130 1131918 1074466 1469950 1420197 936475 1501675
14624A501675j1746m19550L47561k71333j386P5557j01437L68223n5787M4098
$$ 1501675 1489929 1070379 1417940 1146607 1145221 1220778 1119341 1487564 1431777 1475875
14614A475875l79358K59199J1444J40913k84599K47324m536k92442P3142j968
$$ 1475875 1096517 1355716 1367160 1508073 1223474 1470798 1466262 1173820 1246962 1244994
14604A244994K88809J85542k99896k51457J78800K14771O2764j97923J04212J9858
$$ 1244994 1533803 1719345 1419449 1167992 1346792 1561563 1624327 1426404 1530616 1550474
14594A550474P6274k58266K55812j20213K93665M0341k39154J30282j07748Q9003
$$ 1550474 1626748 1368482 1624294 1504081 1797746 1838087 1598933 1729215 1621467 1710470
14584A710470J89402p46914P59400j27936L8122J37427m71793N22304Q7044q8666
$$ 1710470 1899872 1152958 1912358 1784422 1822544 1959971 1488178 2010482 2097526 2008860
14574B008860k74764N50054j30734j97754r7097J99165k46665L96706j40110J26014
$$ 2008860 1734096 2284150 2153416 1955662 1858565 2057730 1811065 2207771 2067661 2193675
14564B193675m80303L87125L7805j04593K38352m57973N1357O15839M6984J7225
$$ 2193675 1713372 2100497 2138302 2033709 2272061 1814088 1865445 2481284 2528268 2545493
14554B545493k58126L873K17768Q4909P6421n6280M18452j74199j40532L21401
$$ 2545493 2287367 2291240 2509008 2593917 2670338 2614058 3032510 2858311 2717779 3039180
14544C039180j07780M16314J81780L56273K50245L20378L83328O08892J054141
$$ 3039180 2931400 3347714 3529494 3885767 4136012 4456390 4839718 5448610 6502751
14535F502751J213556K441478L670824O469422R353265K652892j2234511q241593
$$ 6502751 7716307 10157785 13828609 20298031 29651296 32304188 20069677 11828084
14527A1828084l769504k449489q26373J71669j53698j246038n74872n02043L20399
$$ 11828084 8058580 5609091 4782718 4954387 4800689 3554651 2979779 2477736 2798135
14518B798135o8706k62827K244j2431L60384l38529j39415l7897J75432J70900
$$ 2798135 2729429 2466602 2468846 2456415 2816799 2478270 2338855 2300958 2476390 2647290
14508B647290m7003l17298M57932j38168l7491J52686j35081O3947j38853K60671
$$ 2647290 2600287 2282989 2740921 2602753 2565262 2717948 2582867 2646814 2507961 2768632
14498B768632J340J28091j65871k00585N16806J76611K091r6154q4808j22639
$$ 2768632 2769972 2898063 2732192 2531607 3048413 3225024 3227115 3130961 3046153 2923514
14488B923514M35367J50363j37919p84L0550o018j58081J25531J02510j48749
$$ 2923514 3358881 3509244 3371325 3370541 3401091 3395073 3236992 3362523 3465033 3316284
14478C316284J78891k10539L85155j74272J33959r5533K76869j07771M11394K0609
$$ 3316284 3495175 3284636 3669791 3495519 3629478 3533945 3810814 3703043 4114437 4135046
14468D135046J99247m37765J84782j58606m1776n820K07811J90251j96269J06178
$$ 4135046 4334293 3896528 4081310 3922704 3880928 3875108 4082919 4273170 4076901 4183079
14458D183079p5129K39277j2595N19993l94145J44310J93499J5782J1009L11127
$$ 4183079 4107950 4347227 4334632 4854625 4460480 4604790 4798289 4814071 4825080 5136207
14448E136207n0529l1665J92112k01105M1951j67949K73502L18108l99772L43696
$$ 5136207 5085678 5054013 5246125 5045020 5086971 4919022 5192524 5510632 5110860 5454556
14438E454556r9233J6680L99015j69343J69132O5507n0505J21621q5765L78913
$$ 5454556 5355323 5372003 5771018 5601675 5770807 5836314 5785809 5907430 5821665 6200578
14428F200578j16124J9478M04226K30156n77076O91782r2571l0672N2180k43607
$$ 6200578 6084454 6103932 6508158 6738314 6161238 6853020 6760449 6729777 6781957 6538350
14418F538350N35423K73880l36068N23145j75457M7236O6833K74450J57001L16948
$$ 6538350 7073773 7347653 7011585 7534730 7359273 7406509 7473342 7747792 7904793 8221741
14408H221741k27033N1677K95384N87054J60148m76306N17338j04382N08911l74611
$$ 8221741 7994708 8046385 8341769 8928823 9088971 8612665 9130003 9025621 9534532 9159921
14398I159921Q9004K60096L13759n25755N01411L65112L7504N3347N7725N49909
$$ 9159921 9248925 9509021 9822780 9297025 9798436 10163548 10201052 10254399 10312124 10862033
14388A0862033J1297M51293l11498K46301K63079j28827N02840J16303J66989
$$ 10862033 10873330 11324623 11013125 11259426 11522505 11393678 11896518 12012821 12179810
14379A2179810J80450J17290J41874L22533p9236L92245M51748J27919N5611M09059
$$ 12179810 12360260 12477550 12619424 12941957 12862721 13254966 13706714 13834633 13890244 14299303
14369A4299303K62363L91014J16796N44329K40400M10836O27277j4397K63299
$$ 14299303 14561666 14952680 15069476 15613805 15854205 16265041 16892318 16877921 17141220
14360A7141220L71992K93565o2706O13310L18009L49313Q06616K09970J82834
$$ 17141220 17513212 17806777 17744071 18357381 18675390 19024703 19831319 20041289 20224123
14351B0224123N56567N95146N02620M38288J13321M35674P46900J49652P29147
$$ 20224123 20780690 21375836 21878456 22316744 22430065 22865739 23612639 23762291 24491438
14342B4491438N62724P36241M90606N64557O14166Q13631O80675O23916N44445
$$ 24491438 25054162 25790403 26281009 26845566 27459732 28273363 28954038 29577954 30122399
14333C0122399J035148Q47440P25308O78469J112539P44235J191005N68997J512849
$$ 30122399 31157547 32004987 32730295 33408764 34521303 35265538 36456543 37025540 38538389
14324C8538389O35230J383498J146721Q70643J600077J160310J539039J616852
$$ 38538389 39173619 40557117 41703838 42574481 44174558 45334868 46873907 48490759
14316D8490759J265841J443693J743826J984932J553216J966798J869584K354052
$$ 48490759 49756600 51200293 52944119 54929051 56482267 58449065 60318649 62672701
14308F2672701K318790K046929K579574K605203K785317K890645K570973L430584
$$ 62672701 64991491 67038420 69617994 72223197 75008514 77899159 80470132 83900716
14300H3900716K908216L660942L309911M109671M012666M347212M730785M696584
$$ 83900716 86808932 90469874 93779785 97889456 101902122 106249334 110980119 115676703
14292A15676703N163716N114479N841046O333860O810390O778298P586357P573587
$$ 115676703 120840419 125954898 131795944 138129804 144940194 151718492 159304849 166878436
14284A66878436Q269032Q683832R251311R514135J0341947J0895569J1353528
$$ 166878436 175147468 183831300 193082611 202596746 212938693 223834262 235187790
14277B35187790J2227695J2591752J3433009J3865128J4804170J4541808J4416076
$$ 235187790 247415485 260007237 273440246 287305374 302109544 316651352 331067428
14270C31067428J4518151J4422613J4578176J3285489J2387633J1429588J0413784
$$ 331067428 345585579 360008192 374586368 387871857 400259490 411689078 422102862
14263D22102862J0019390R471787P918779O918333O858345L624107K37490k87368
$$ 422102862 432122252 441594039 449512818 456431151 463289496 466913603 467151093 466863725
14255D66863725O90506k068271r297340o895737q036358r459990j2334789j2352871
$$ 466863725 467554231 465485960 456188620 449292883 441256525 431796535 419461746 407108875
14247D07108875j4124275j3474547j4019474j3954155j4416942j3763472j3252366
$$ 407108875 392984600 379510053 365490579 351536424 337119482 323356010 310103644
14240C10103644j3723559j3198938j2692459j1754560j2015555j1210327j0412558
$$ 310103644 296380085 283181147 270488688 258734128 246718573 235508246 225095688
14233B25095688j0209794j0157735r701972r772590q981516r065581p743209p437289
$$ 225095688 214885894 204728159 195026187 185253597 176272081 167206500 159463291 152026002
14225A52026002p604738o500417o250165n735605n354764n466539m850442m716201
$$ 152026002 144421264 137920847 131670682 125935077 120580313 115113774 110263332 105547131
14217A05547131m382785m089059l495898l906814l318638l259673l234907l149780
$$ 105547131 101164346 97075287 93579389 89672575 86353937 83094264 79859357 76709577
14209G6709577k677852k236697k712399k614705k191402j986387j889285k386399
$$ 76709577 74031725 71795028 69082629 66467924 64276522 62290135 60400850 58014451
14201E8014451j898559j384936j577667j530746j603443k097937r84625j499821
$$ 58014451 56115892 54730956 53153289 51622543 50019100 47921163 46936538 45436717
14193D5436717j126124j048723p62845j605585j668567o66109j145555p64384
$$ 45436717 44310593 43261870 42499025 40893440 39224873 38558764 37413209 36648825
14185C6648825r10256r59299p85727r90783p99452p57344r10220p22367r26787
$$ 36648825 35738569 34779270 33993543 33002760 32203308 31445964 30535744 29813377 28886590
14176B8886590l08403o99381q58585m96135q37619k89694o30853n46337o38512
$$ 28886590 28578187 27878806 27020221 26524086 25686467 25396773 24765920 24219583 23581071
14167B3581071k59934q57677n05313n71221l26997j92065l02436o68518l98013
$$ 23581071 23321137 22463460 21958147 21386926 21059929 20867864 20565428 19896910 19498897
14158A9498897j79978o69487j36970l44998k67288p82851m0870l7459n42402m92311
$$ 19498897 19318919 18649432 18512462 18167464 17900176 17117325 17076455 17038996 16496594 16004283
14148A6004283l19109q4806l46054l38091J9356p01801K09879n35665j25206j2539
$$ 16004283 15685174 15600368 15254314 14916223 14935579 14233778 14443657 13907992 13782786 13770247
14138A3770247o25359l9841k14905k86996j87253k69164l9165k78484l62274J23390
$$ 13770247 13144888 13105047 12890142 12603146 12415893 12146729 12107564 11829080 11466806 11590196
14128A1590196k54634j23280k46116R045k96035o917l30918j75622j13902J5901
$$ 11590196 11335562 11212282 10966166 10975211 10679176 10672259 10341341 10165719 10051817 10067718
14118A0067718j27547k85753k25037j92796Q9576j01123l48608M62141n10558
$$ 10067718 9940171 9654418 9429381 9236585 9326161 9225038 8876430 9338571 8828013
14109H828013l50992K20324j66776k27283k66045k0326j52043j62420J99001l26676
$$ 8828013 8477021 8697345 8530569 8303286 8037241 8016915 7864872 7702452 7901453 7574777
14099G574777N2767j20717K62600n09694k34992J20617q7796j75777J83346m52599
$$ 7574777 7627544 7506827 7769427 7259733 7024741 7145358 7057562 6881785 7065131 6612532
14089F612532J15680m46352K52844k90204J46747N0262k23182L07948k34624j40573
$$ 6612532 6728212 6281860 6534704 6244500 6391247 6441509 6218327 6526275 6291651 6151078
14079F151078k83772j3256q2546k14189J1411J07551p2591k66587J33185j99502
$$ 6151078 5867306 5854050 5771504 5557315 5568726 5676277 5603686 5337099 5470284 5270782
14069E270782k79848M76128l69540K63871m07543L68153m25203J62818j62197
$$ 5270782 4990934 5467062 5097522 5361393 4953850 5322003 4896800 5059618 4897421
14060D897421n1500j2850k23666l03494J47729l1201J67426l52459K41736J22172
$$ 4897421 4845921 4833071 4609405 4305911 4453640 4422439 4589865 4237406 4479142 4601314
14050D601314j35988j67202K05431k46366k7379j22792N8488j54503k41689J85138
$$ 4601314 4465326 4298124 4503555 4257189 4229810 4107018 4165506 4011003 3769314 3954452
14040C954452J62629m97719N15731j39792k21671O0552K5886j31926l06921J6425
$$ 3954452 4117081 3619362 4135093 3995301 3773630 3834182 3860068 3728142 3421221 3437646
14030C437646L62005j0622k72122k24874M24661k80888l867j7186j02274J92896
$$ 3437646 3799651 3789029 3516907 3292033 3716694 3435806 3431939 3414753 3312479 3505375
14020C505375l05489j75277J41497K82440l3040l78776J09493l7802J26206k22283
$$ 3505375 3199886 3024609 3166106 3448546 3415506 3036730 3146223 3108421 3234627 3012344
14010C012344j96509j46516N52429k62707k0337J23458k86220k62669J44442Q0051
$$ 3012344 2815835 2669319 3221748 2959041 2938704 3062162 2775942 2513273 2657715 2737766
14000B737766r23M0867k11979O6576L88653k15848l47576O9427j9749J53188l05589
$$ 2737766 2736843 2777710 2565731 2632307 3020960 2805112 2457536 2526963 2507214 2660402 2354813
13989B354813n4149J99352j52661J46285o1094n8549K70895r3455M9220m8461
$$ 2354813 2300664 2500016 2347355 2493640 2432546 2373997 2644892 2551437 2600657 2552196
13979B552196M81159Q9437P0511O51586Q92498J732350L482491N319909R371903
$$ 2552196 3033355 3122792 3193303 3844889 4737387 6469737 9952228 15272137 24644040
13970B4644040Q865569r378579q321380m807362l217204j459960o38793r56288
$$ 24644040 33509609 24131030 15809650 11002288 7785084 6325124 5686331 4730043
13962D730043q02780r1674l63282n8271k74063O6753j09911j39195m09284K64226
$$ 4730043 3927263 3835589 3472307 3414036 3139973 3206726 3096815 2957620 2548336 2812562
13952B812562k37160j52371K44070j2371j19171l58240K93552J14977n41903N5529
$$ 2812562 2575402 2423031 2667101 2654730 2535559 2177319 2470871 2585848 2043945 2099474
13942B099474K33955l36928J85787j9842Q4279o6621J39789m26968J04443J43155
$$ 2099474 2333429 1996501 2182288 2162446 2246725 2180104 2319893 1892925 1997368 2140523
13932B140523l37118K20025M19255n22014j58724J82126k17217L09524k48277
$$ 2140523 1803405 2023430 2442685 1920671 1761947 1944073 1726856 2036380 1788103
13923A788103k1019k53005J91194K96857j49617N0942l00941k2668J73147l14410
$$ 1788103 1767084 1514079 1705273 2002130 1852513 1903455 1602514 1579846 1752993 1438583
13913A438583R0886K46148m2587l8831q3902K90067l7676l46510n6348J33711
$$ 1438583 1529469 1775617 1733030 1694199 1610297 1900364 1862688 1516178 1459830 1593541
13903A593541O7438j55319M8688j30353O9172j03164J07034r3533L12401j31730
$$ 1593541 1660979 1505660 1554348 1423995 1493167 1390003 1497037 1403504 1715905 1584175
13893A584175J94710k41660J67034j27215M2924l74466K37528j13003j29203K81942
$$ 1584175 1778885 1537225 1704259 1577044 1619968 1245502 1483030 1370027 1240824 1522766
13883A522766k13881L7947o8910P7389j99911m4914K11007K46492P8785l69934
$$ 1522766 1308885 1346832 1277922 1355311 1155400 1110486 1321493 1567985 1646770 1276836
13873A276836R9813k10437K47372J15552l9252J55265k88757P002P491j26912
$$ 1276836 1376649 1166212 1413584 1529136 1489884 1645149 1356392 1363394 1370885 1243973
13863A243973l12428J29190J34384n2844J41367k62272L02998j81112j856o2274
$$ 1243973 931545 1060735 1195119 1142275 1283642 1021370 1324368 1143256 1141400 1079126
13853A079126K32373j60916k13603M47748r5628o1526n8428M9562j96851L96145
$$ 1079126 1311499 1150583 936980 1384728 1289100 1227574 1169146 1218708 1021857 1418002
13843A418002m36265K46580l32598K04740k678k65525L26562R9368k48213L20046
$$ 1418002 981737 1228317 895719 1100459 1097781 832256 1158818 1258186 1009973 1330019
13833A330019m96347K4331L88824j4022j83216k42970N1221L86183k73623M29441
$$ 1330019 833672 858003 1246827 1232805 1049589 806619 857840 1244023 970400 1399841
13823A399841l25145k31026o9641J83103J84554j51770l2829N1915r7233L51792
$$ 1399841 1074696 843670 774029 957132 1141686 989916 957087 1009002 911769 1263561
13813A263561l06815J7201J31698l1171l46877q7411M58411P2286n31093J79417
$$ 1263561 956746 973947 1105645 1074474 727597 640186 1098597 1170883 639790 819207
13803H19207K03519o0514J3805k23329K85053K7009r4446k65450J3882P3366m1799
$$ 819207 1022726 962212 976017 752688 1037741 1064750 970304 704854 718736 792102 750303
13792G50303N02904l93853k96518M46846j19874Q6457M3289j60194k3142L53137
$$ 750303 1253207 859354 562836 1009682 889808 976265 1019554 859360 836218 1189355
13782A189355m48942J2722o5958J50335k0385k04156J75900J28950j24928l23200
$$ 1189355 740413 753135 687177 837512 817127 612971 788871 917821 792893 469693
13772D69693L01647K4133j23785K83187m28618L98242k70035K58739p5095L16989
$$ 469693 771340 795473 671688 954875 526257 924499 654464 913203 838108 1155097
13762A155097n04840J34017n4445J00360j73305J55473j54435p3986r7532J26699
$$ 1155097 650257 784274 729829 830189 656884 812357 657922 583936 486404 613103
13752F13103K01118p8315j74653J81180j26361j19006K76473l40339L74545J69207
$$ 613103 814221 735906 561253 742433 616072 497066 773539 433200 807745 976952
13742I76952k10614k20097m8236j57735P06961k23838l97848J09444K67124L9287
$$ 976952 766338 546241 498005 340270 1047231 823393 425545 534989 802113 841400
13732H41400j31256j054J5848p4543J10922j99515j74804j7289K62873j52380
$$ 841400 710144 709090 724938 650395 761317 561802 386998 369709 632582 480202
13722D80202K79089K0255q8852k12535O7526q6450o0059L63064k28401j00380
$$ 480202 759291 779546 690694 478159 545685 459235 399176 762240 533839 433459
13712D33459K0701J22930r7507K52521j47501r8741j04885l5899j55772P60562
$$ 433459 454160 577090 479583 732104 584603 485862 380977 345078 189306 949868
13702I49868j94163O1337k16697l0561q5412P1859K0368J14264B51071K07926
$$ 949868 755705 817042 600345 569784 484372 556231 576599 690863 251071 458997
13692D58997j24484L06514J08115r7560B44076J55067L76292k06801P7243J71868
$$ 458997 334513 641027 749142 651582 244076 399143 775435 568634 645877 817745
13682H17745j68667B96363p3174L8641J67015J36658k11944M72558k47155J53699
$$ 817745 649078 296363 223189 261830 428845 565503 353559 826117 578962 732661
13672G32661k12751A76142M79599O6293C40288k2026J3277l8119L72984j38300
$$ 732661 519910 176142 655741 722034 340288 318262 331539 293420 666404 528104
13662E28104K02176k53765A00289J80254R1431K56671j26098J18624j80131A83753
$$ 528104 730280 476515 100289 280543 371974 628645 502547 621171 441040 183753
13651F30320N9062C40471K59726q6538j18920j60869M80045l03686J21609q8670
$$ 630320 689382 340471 600197 513659 394739 233870 713915 410229 531838 443168
13641D43168J59589m277K9844j50680K52132q2679j10294q8640B21030L57182
$$ 443168 602757 598480 628324 477644 729776 647097 536803 448163 221030 578212
13631E78212k47287J7143o2626J50881J4208J0928j90837R0737a27929E01825
$$ 578212 330925 348068 285442 436323 450531 461459 270622 361359 -127929 501825
13620C46954H3431M94920Q6403l28978L64527B96778J48219p2311K0215g7863
$$ 346954 83431 578351 664754 335776 700303 296778 444997 372686 392901 -77863
13609D58049L39457C23842J08599o3089L06567A89878N61487j54885q8957q4737
$$ 458049 797506 323842 432441 369352 675919 189878 751365 596480 507523 422786
13599D22786P3130j16459Q2722k29170O7448M1076M02669B68966L74982j83727
$$ 422786 495916 379457 462179 233009 300457 341533 744202 268966 643948 460221
13589D60221K5846A98005N0394M07168r5825k04520J1792M5630M81101D05492
$$ 460221 486067 198005 248399 655567 559742 355222 367014 412644 893745 405492
13578C57914j91J67159k22024L70500J80020D15699L5772K7969j43013p1633J41116
$$ 357914 357723 524882 302858 673358 853378 415699 451471 479440 336427 264794 405910
13567D05910J45364j99521j66988R1512J37956j43058F6489M00131j45845K43940
$$ 405910 551274 351753 184765 276277 414233 271175 66489 466620 320775 564715
13557E64715D7812M18152c1582D18086P3170O0493k37394A15524l761R463O171
$$ 564715 47812 465964 -31582 418086 491256 551749 314355 115524 111763 121226 127397
13546A27397K11673E9398M10869r5580j58411P7107J6616J81430j47218j6035
$$ 127397 339070 59398 470267 374687 216276 293383 309999 491429 344211 328176
13536C28176J15869n517j84450R0158J27079j38431o2125K89813B75940L59092
$$ 328176 444045 438528 254078 344236 471315 332884 270759 560572 275940 635032
13526F35032k18187A84548p5827L00589L8969j89295R4653A14844M66272k60272
$$ 635032 416845 184548 108721 409310 448279 258984 353637 114844 581116 320844
13516C20844o8294G409K23369J81760N378K1722B06467N3917n8386J70548j5108
$$ 320844 252550 7409 230778 412538 417916 439638 206467 260384 201998 372546 357438
13505C57438M4760m8759A28734J08646J46719E8023K35347l5931p1826b32502
$$ 357438 402198 353439 128734 237380 384099 58023 293370 257439 185613 -232502
13494E39762B60526j6381F9778L08654j29170n786q5409J89165J44823p1453F604
$$ 539762 260526 244145 69778 378432 249262 243476 158067 347232 492055 420602 6604
13482A92718I781L53731K5397F9471L70176j83107O2780K0931J39994k15712m2943
$$ 192718 9781 363512 388909 69471 439647 256540 319320 340251 480245 264533 221590
13471B21590O3790o7988K00306A16087M52993l0823k60283J09656j14750F3788
$$ 221590 285380 217392 417698 116087 569080 538257 277974 387630 272880 63788
13460G8710K10360D8697J15184m6125P2385n525J70525j04515H5061L39451j33680
$$ 78710 289070 48697 163881 117756 190141 184616 355141 250626 85061 424512 290832
13449B90832j35324o7167K18884k1791E9316K03655J02242n6484j10922K30208
$$ 290832 155508 88341 307225 285434 59316 262971 365213 308729 197807 428015
13439D28015R1322F6943L42369I0081M45595a1859C91692P0141f7325C24014j03546
$$ 428015 519337 66943 409312 90081 535676 -11859 391692 461833 -67325 324014 220468
13428B20468J93742B01413O1327A20720N5738p6512D8627N62578B79838J37254
$$ 220468 414210 201413 262740 120720 176458 99946 48627 611205 279838 417092
13418D17092m6920F5967J61497j03451J3868M44J26057Q2808R5783E2386J33180
$$ 417092 370172 65967 227464 124013 137881 138325 264382 347190 442973 52386 185566
13407A85566J04563J68361c5614B18737K4743a0177A52133J7936J72348a54323
$$ 185566 290129 458490 -35614 218737 243480 -10177 152133 170069 342417 -154323
13396C26660j20981n5535J36204o6010j06927K56324a23345B17418K16318A78508
$$ 326660 205679 150144 286348 220338 113411 369735 -123345 217418 433736 178508
13385B19848J2986K91132q8082P7886A1175N2569J05505K37140q6009q0403J04959
$$ 219848 232834 523966 435884 513770 11175 63744 169249 406389 320380 239977 344936
13374C44936c758E9968l632J33095k9627J64675A16530c6803A95240J90383A101
$$ 344936 -3758 59968 56336 189431 159804 324479 116530 -36803 195240 385623 1101
13362A37721O0447n7635P7441N2085r2416M15753j49890j28640d5337C04449j35913
$$ 137721 198168 140533 217974 270059 177643 593396 443506 314866 -45337 304449 168536
13351A68536L00497A39516K49335j10871J8550H5811d04422e419B03452G6428
$$ 168536 469033 139516 388851 277980 296530 85811 -404422 -5419 203452 76428
13340A02991L79785M1446b739D32181j55851J81129K5224o2707C3412L38784j58159
$$ 102991 482776 524222 -2739 432181 276330 457459 482683 419976 33412 372196 214037
13329B14037E6012J33375Q5707L1800r1876O8421q3829J43454j68742E1029J90472
$$ 214037 56012 189387 275094 306894 215018 283439 199610 343064 174322 51029 241501
13318B41501k2425J44946j0272A72077K62104m0019J23608j17106A85077q5663
$$ 241501 219076 364022 353750 172077 434181 394162 517770 400664 185077 99414
13308I9414M04909e0467A36209J77227J3018b51572C62833A75119m6828L15454
$$ 99414 504323 -50467 136209 313436 326454 -251572 362833 175119 128291 443745
13298D43745j79677a03769B2365M34150G7379K04005i151A35070J38099j25310
$$ 443745 264068 -103769 22365 456515 77379 281384 -9151 135070 273169 147859
13288A47859P0416n5814a91799C24345j54611c32221B4368L55624e6639I0900
$$ 147859 218275 162461 -191799 324345 169734 -332221 24368 379992 -56639 90900
13277G1896K84677F7570l3250e7071C41190a11765C02436a53524B6867b4693B83092
$$ 71896 356573 67570 34320 -57071 341190 -111765 302436 -153524 26867 -24693 283092
13265D4607J58248c07817J05239A66657B694M4561e5582B86230a37619A73140
$$ 44607 202855 -307817 -202578 166657 2694 47255 -55582 286230 -137619 173140
13254A7948d7781A37394O0406G0863R0884J98420i2514M0538A76220K9774r2609
$$ 17948 -47781 137394 197800 70863 161747 360167 -92514 -51976 176220 205994 113385
13243A13385a78684A32649J40909b88653P1099A44128a08195D946g2110j7962
$$ 113385 -178684 132649 273558 -288653 -217554 144128 -108195 4946 -72110 -90072
13233i0072B23116J01424H3454n358J38831e5472A48943N0153b90571r3756a55630
$$ -90072 223116 324540 83454 78096 216927 -55472 148943 199096 -290571 -384327 -155630
13221C59901j57978j5219c8450p001o8215M713G1935J01554n8308P7106H2357
$$ 359901 201923 186704 -38450 -45451 -113666 -108953 71935 173489 115181 192287 82357
13209C6292j0300J6251J52691J51387j59117G2250B6533K92658a7844k23344C5170
$$ 36292 25992 42243 194934 346321 187204 72250 26533 319191 -17844 -241188 35170
13197A6734a07261B19423A4374N3822a06571C63878b72154C61392D3926b59314
$$ 16734 -107261 219423 14374 68196 -106571 363878 -272154 361392 43926 -259314
13186e199H6504K46318p379b21322A06236a17042A60464J4085i592B3214d5399
$$ -5199 86504 332822 325443 -221322 106236 -117042 160464 174549 -9592 23214 -45399
13174b04371d6401B27875i4129M1981I1790R6813m17F795K88651J14600A32718
$$ -204371 -46401 227875 -94129 -52148 91790 188603 188186 6795 295446 410046 132718
13162B18376L5798K0724D3342i920n0591A17210J54891a00329G7811P8911a25595
$$ 218376 254174 274898 43342 -9920 -60511 117210 272101 -100329 77811 156722 -125595
13150C16210a16414I1296J65495h397B51838j14895E3662g5315A89264E2837B4259
$$ 316210 -116414 91296 256791 -8397 251838 136943 53662 -75315 189264 52837 24259
13138A54228e3226A97515G165K8804K61848H036N1479d4519C75036A21291d0437
$$ 154228 -53226 197515 7165 35969 297817 8036 59515 -44519 375036 121291 -40437
13126e4028a5729j11044F6688k9393K16077b2915A0330g9114B07664a16C83808
$$ -54028 -15729 -126773 66688 37295 253372 -22915 10330 -79114 207664 -116 383808
13114a8690m627B97389m7030B2522I670a36837J8201e0554F0055d9538j39395
$$ -18690 -23317 297389 250359 22522 9670 -136837 -118636 -50554 60055 -49538 -188933
13103a88933G1647q941l0146b999n9483A12454Q2210N3532C721a7841f713B92100
$$ -188933 71647 62706 32560 -2999 -62482 112454 194664 248196 3721 -17841 -6713 292100
13090B7663n744b9593B89924a45665D42860E0513c1483j54556e0985A22173i2441
$$ 27663 21919 -29593 289924 -145665 442860 50513 -31483 -186039 -50985 122173 -92441
13078c18082c7527C47536j45626h201n7743j26660d71B88288j33424A367f6656
$$ -318082 -37527 347536 201910 -8201 -65944 -192604 -471 288288 154864 1367 -66656
13066B9054K07010L9919A19831K7073l5149L03553A39398L45151k05803o8250
$$ 29054 236064 275983 119831 146904 111755 415308 139398 484549 278746 210496
13056B10496J32022j1102J7468C1803J88051G4411K3267k6168j0548a08642D6991
$$ 210496 342518 331416 348884 31803 219854 74411 97678 71510 60962 -108642 46991
13044F05405D2863G23K61461a3716k02929E8750J30140J15039j38704o5948J4923
$$ 605405 42863 723 262184 -13716 -216645 58750 188890 303929 165225 99277 114200
13033A14200J16937E9792K7989d3314g370j53992A61128E9766J42447a8379j15087
$$ 114200 231137 59792 87781 -43314 -7370 -161362 161128 59766 202213 -18379 -133466
13022a33466d9218A47096a3619G1764c55725B63196c82114a88729k4696B57752
$$ -133466 -49218 147096 -13619 71764 -355725 263196 -382114 -188729 -213425 257752
13011B17851j4653b43353D0244a11938A7715a77553h2577A32853o5954K4721K1903
$$ 217851 203198 -243353 40244 -111938 17715 -177553 -82577 132853 66899 91620 113523
13000A13523K06115e7635B66841l8650Q6264A53127b10812a01868I1185d820B5282
$$ 113523 319638 -57635 266841 228191 314455 153127 -210812 -101868 91185 -4820 25282
12988B93786g955k39030A12036b10344G5378j2357N924J73303b89540A4758a20392
$$ 293786 -7955 -246985 112036 -210344 75378 63021 68945 242248 -289540 14758 -120392
12976D24676A20437A6270L86884b83712d0742D0063g4127L6691F1217g0834G4128
$$ 424676 120437 16270 403154 -283712 -40742 40063 -74127 -37436 61217 -70834 74128
12964B01050i6263C8513d706k69215J15279q2697d8020A45676h5924m5379A42026
$$ 201050 -96263 38513 -4706 -273921 -158642 -241339 -48020 145676 -85924 -131303 142026
12952a03835p752L8736b0472H5720c63214B0211f0387B40481H1476J22536F8284
$$ -103835 -111587 -72851 -20472 85720 -363214 20211 -60387 240481 81476 204012 68284
12940d8677C69325j56313G9936k3557b8495o1429a4869B81567E4708b5413A50228
$$ -48677 369325 213012 79936 56379 -28495 -89924 -14869 281567 54708 -25413 150228
12928b4597l0114B11964G0439a4110k27140P3937A33904J9906H631K08572D9536
$$ -24597 -54711 211964 70439 -14110 -241250 -167313 133904 153810 8631 217203 49536
12916B15118b56307F6323o511L36731a0648k84610N7871R0661a9189j0947r7100
$$ 215118 -256307 66323 59812 396543 -10648 -295258 -237387 -146726 -19189 -30136 -127236
12905a27236j9749A04105b54206i5463j41368K4107B91689b52308O0844l6088
$$ -127236 -146985 104105 -254206 -95463 -236831 -212724 291689 -252308 -191464 -227552
12895b27552R7400C5547J59405A4568R8367e4720H9398J24535E2864b82961H2189
$$ -227552 -130152 35547 194952 14568 112935 -54720 89398 213933 52864 -282961 82189
12883a92934A4174d15054B5542a29734B16495a6383A10956N1604e4970D17580
$$ -192934 14174 -415054 25542 -129734 216495 -16383 110956 162560 -54970 417580
12872B35350i5709j75328B73067D1194Q3306a89643A82544b9976A36354b31190
$$ 235350 -95709 -271037 273067 41194 124500 -189643 182544 -29976 136354 -231190
12861a27343A35747h6062C1169M9160a30347B99903a03273D12194b15944E21907
$$ -127343 135747 -86062 31169 80329 -130347 299903 -103273 412194 -215944 521907
12850B41725a82209a5603A8784K201K21488D3572a7583B26435r546O6733M2781
$$ 241725 -182209 -15603 18784 20985 242473 43572 -17583 226435 216889 283622 326403
12839C26403E9930d5532m6533j46801L5637B41796b02140g5819C0447H571J75728
$$ 326403 59930 -45532 -92065 -238866 -203229 241796 -202140 -75819 30447 8571 184299
12828A84299c6656p6351M859B9004e3735C20237I5339a34004A1367J85380j6723
$$ 184299 -36656 -113007 -108148 29004 -53735 320237 95339 -134004 11367 196747 180024
12817A80024K616B7119c05266B403b87010A26230b5048E7691K66807b32186I0074
$$ 180024 182640 27119 -305266 2403 -287010 126230 -25048 57691 324498 -232186 90074
12805H7612i3015A07648a76833N6576A2969P6899i6888H0965b46209J06935E4512
$$ 87612 -93015 107648 -176833 -120257 12969 89868 -96888 80965 -246209 -139274 54512
12793c44576C16996d97354G6863g4810k1442C76974A10432a12921k7940o0628
$$ -344576 316996 -497354 76863 -74810 -96252 376974 110432 -112921 -140861 -201489
12783b01489C67504q0881C4809b66527Q8729H7781a15470b4171B07255G9891L9304
$$ -201489 367504 286623 34809 -266527 -177798 87781 -115470 -24171 207255 79891 119195
12772A19195g2301B46471F9777b05952D7502N6057R5552a33862l916H4446b11882
$$ 119195 -72301 246471 69777 -205952 47502 103559 199111 -133862 -137778 84446 -211882
12760C30310F7678N6568b09909d4239l48793a39762d2751k6146K4429C8885f3953
$$ 330310 67678 124246 -209909 -44239 -393032 -139762 -42751 -68897 -44468 38885 -63953
12748c58808i8120a2941B14783C1762e2758o8171B22506g7494a6964A10149h2556
$$ -358808 -98120 -12941 214783 31762 -52758 -120929 222506 -77494 -16964 110149 -82556
12736b24038D3811b52809L0202R8409B2390b93286a05739c2661p5677B8273a27568
$$ -224038 43811 -252809 -222607 -124198 22390 -293286 -105739 -32661 -108338 28273 -127568
12724B75878d503j35007B5000K29482I8828c76023I3150d0383q4031J3340a7210
$$ 275878 -4503 -139510 25000 254482 98828 -376023 93150 -40383 -124414 -111074 -17210
12712A97263a07390b2864i873j12541a909r3656A89396J56580C8036a01837B56799
$$ 197263 -107390 -22864 -9873 -122414 -1909 -95565 189396 345976 38036 -101837 256799
12700A02106K00895g7690o9469A56335b0905l3888B17997C9511O5528Q2989L1786
$$ 102106 303001 -77690 -147159 156335 -20905 -54793 217997 39511 105039 188028 219814
12689B19814H7735K67231A75310H4064K65037a17605B91181H6778K62971b28772
$$ 219814 87735 354966 175310 84064 349101 -117605 291181 86778 349749 -228772
12678H9128b5045F2189Q996B210b80304B17613g1981B60154A29128J99124j35663
$$ 89128 -25045 62189 71185 2210 -280304 217613 -71981 260154 129128 328252 192589
12667A92589J74782A00910L26322j80269b6073C82405B7997f2727A90134H6816
$$ 192589 367371 100910 427232 246963 -26073 382405 27997 -62727 190134 86816
12656C84162b9286F0367O4402a52856f4325o8743A07532a46642A7752M7876c8126
$$ 384162 -29286 60367 124769 -152856 -64325 -133068 107532 -146642 17752 65628 -38126
12644A53680D8867K60112G0713e2412R733B00755e8731B404h4610j2929j30185
$$ 153680 48867 308979 70713 -52412 -42679 200755 -58731 2404 -84610 -97539 -227724
12633b27724k06974K07351H1751a6545B5648Q4709a15413H3679c5356A54227b60510
$$ -227724 -434698 -227347 81751 -16545 25648 110357 -115413 83679 -35356 154227 -260510
12621A694c46272B06012b23954f6124B9869P8468J28828j14715J92137j31365
$$ 1694 -346272 206012 -223954 -66124 29869 108337 237165 122450 314587 183222
12611A83222j2579h2062B68651e6857A69959b2611F9761O5501J48815g877B62263
$$ 183222 170643 -82062 268651 -56857 169959 -22611 69761 135262 284077 -7877 262263
12599b19939A59533D9108Q7273g7160C29411j55245D1951a45165k447I8940f2852
$$ -219939 159533 49108 136381 -77160 329411 174166 41951 -145165 -147612 98940 -62852
12587G1466J92622p03H988L61951a67051A21490J92564H8706g1195B46826b40651
$$ 71466 264088 263385 8988 370939 -167051 121490 314054 88706 -71195 246826 -240651
12575d6428K1201C8432P019d6463A04699b08262l390B6827a04026B54525r3345
$$ -46428 -25227 38432 45451 -46463 104699 -208262 -211652 26827 -104026 254525 161180
12564A61180o1018c11984A58732a80814A07536k7526c1536j5248B02455M8627
$$ 161180 100162 -311984 158732 -180814 107536 80010 -31536 -46784 202455 251082
12554B51082J5305a19281A47682c0018F2639f5402j3399B1165e9166k42819H1461
$$ 251082 266387 -119281 147682 -30018 62639 -65402 -78801 21165 -59166 -301985 81461
12542f52A28264K9583g5723B82391d43722a2782j1128A55789J52936i301B57604
$$ -652 128264 157847 -75723 282391 -443722 -12782 -23910 155789 308725 -9301 257604
12530b51366J0343f5542p1668C5004N2278A4738a95053F6404P7869D1469h9802
$$ -251366 -241023 -65542 -137210 35004 87282 14738 -195053 66404 144273 41469 -89802
12518A04160e3334j79735E0105k0742N7572a35659A37155a53575d5745B31135
$$ 104160 -53334 -233069 50105 29363 86935 -135659 137155 -153575 -45745 231135
12507A74264p347h8087j6316q5538H2595h6611j22155A74339d20389a45603M6617
$$ 174264 166917 -88087 -104403 -189941 82595 -86611 -208766 174339 -420389 -145603 -98986
12496i8986A97540C282g7903A86788n8398a82695a7606j32044j03605e988B08063
$$ -98986 197540 3282 -77903 186788 128390 -182695 -17606 -149650 -253255 -5988 208063
12484i8886C57869h7995A44689c1816B63556B7512O1053c34406J24925M2682A66303
$$ -98886 357869 -87995 144689 -31816 263556 27512 88565 -334406 -209481 -166799 166303
12472b8618j63434N6971A24804D8361b29483a01060j02030B1049L7385a22796
$$ -28618 -192052 -135081 124804 48361 -229483 -101060 -203090 21049 58434 -122796
12461D0950f0352G4440a73698n1726k59047h6410b3596A61361f6959l740I4698
$$ 40950 -60352 74440 -173698 -225424 -484471 -86410 -23596 161361 -66959 -70699 94698
12449B37432F1965P7451b00134c8910D6959K52755b68385A73934F1916I28e014
$$ 237432 61965 139416 -200134 -38910 46959 299714 -268385 173934 61916 928 -5014
12437i1543D810J8418E652P2319f1350B53777q9464i1732L695D978L815a57034
$$ -91543 4810 23228 5652 77971 -61350 253777 164313 -91732 -88037 4978 8793 -157034
12424A36251i0283b7332H3034q446K28288j32749a25058C21042g6072A63623a53416
$$ 136251 -90283 -27332 83034 74588 302876 170127 -125058 321042 -76072 163623 -153416
12412A65320b67988d155B0372b13807d8522j64271f6980J0814B0142R6423J30606
$$ 165320 -267988 -4155 20372 -213807 -48522 -212793 -66980 -56166 20142 116565 247171
12401B47171b66830A60692a31857B17375j06365d9733A52033m3545b31167B78993
$$ 247171 -266830 160692 -131857 217375 111010 -49733 152033 108488 -231167 278993
12390H7530i334j05746A29431E5434a25228k96443C0841K4364a88340A42183e7112
$$ 87530 -9334 -115080 129431 55434 -125228 -421671 30841 55205 -188340 142183 -57112
12378d16026g3239o1726B69738d4698B92707c1949B12208b2237B3197K94722m4632
$$ -416026 -73239 -134965 269738 -44698 292707 -31949 212208 -22237 23197 317919 273287
12367B73287b57799O8132c2449j23720j03721P6027N0836C64607j22006J45088
$$ 273287 -257799 -189667 -32449 -156169 -259890 -183863 -133027 364607 242601 387689
12357C87689g0691G6506g5043m26036d1658m6629n311o4988B96268a29525M7948
$$ 387689 -70691 76506 -75043 -501079 -41658 -88287 -93598 -158586 296268 -129525 -81577
12346h1577j31753C18812q2121H514b64094e945r6789l35094C47739A55948D6528
$$ -81577 -213330 318812 236691 8514 -264094 -5945 -102734 -437828 347739 155948 46528
12334d11428B00880l1658n7613C7917J13821c7335B3668J02973f7285A90764A9602
$$ -411428 200880 169222 111609 37917 151738 -37335 23668 126641 -67285 190764 19602
12322H6237K25440A54893F386K74934a3172B11505C69J45558J0247J19512j18488
$$ 86237 311677 154893 6386 281320 -13172 211505 369 145927 156174 275686 157198
12311A57198Q3057a3100D13991a60193b003j14235D7344J22873K08780j81662
$$ 157198 240255 -13100 413991 -160193 -2003 -116238 47344 170217 378997 197335
12301A97335h376D21839I1006M4313i5899C7246M8952J0121h2717A9507c31347
$$ 197335 -8376 421839 91006 135319 -95899 37246 86198 96319 -82717 19507 -331347
12289B60220b12619A60307O1211r9221a18883B33705j15415C3265A6247b8365
$$ 260220 -212619 160307 221518 122297 -118883 233705 118290 33265 16247 -28365
12278a78572A59370b2693C7689L61752o6893j18991o6277j139a74963O5359C30593
$$ -178572 159370 -22693 37689 399441 332548 213557 147280 146141 -174963 -109604 330593
12266d9286A49038J76186F3292b303B35559N2203E2132M6912a3337E385K130M8989
$$ -49286 149038 325224 63292 -2303 235559 287762 52132 99044 -13337 5385 7515 56504
12254E6504J57578g942I1334K1064F072K50211J43430A6449J33466P0682A09663
$$ 56504 214082 -7942 91334 112398 6072 256283 399713 16449 149915 220597 109663
12242a00409F3238K76761j13636J31897a14653D47404j08196E4292L24025C2384
$$ -100409 63238 339999 226363 358260 -114653 447404 339208 54292 378317 32384
12231I9595K27659a67074E2043J74352d9988E0545b4902B75359o6063q4030C7601
$$ 99595 327254 -167074 52043 226395 -49988 50545 -24902 275359 209296 125266 37601
12219B59992A23509m7224J32995R8940G4809O3044q492a34330A43000a60519F03834
$$ 259992 123509 76285 209280 308220 74809 137853 129361 -134330 143000 -160519 603834
12207H0909J67304P4800G5446i559A64690n7856R40J13242J65227o4019b34730
$$ 80909 248213 323013 75446 -9559 164690 106834 107774 221016 386243 322224 -234730
12195g885k2148k35330A66134J01143j29081i8629B2801g4192A30128L95401d617
$$ -7885 -30033 -265363 166134 267277 138196 -98629 22801 -74192 130128 525529 -4617
12183c3027B31338I1162f7678D31020a44981C42396j36018J26658r7782j3689
$$ -33027 231338 91162 -67678 431020 -144981 342396 206378 333036 235254 221565
12173B21565J34971A18293i0538D36754p9607a4930I0701A9299L54787Q5520o9135
$$ 221565 356536 118293 -90538 436754 357147 -14930 90701 19299 374086 459606 390471
12162C90471k4811A71486D931R7788L0419m0909N9947L86356j43178h0084B47707
$$ 390471 365660 171486 4931 102719 133138 92229 152176 538532 395354 -80084 247707
12150C49427j53219J11260f3605D404L1533J42264h1399c3550B44872Q0848A03638
$$ 349427 196208 307468 -63605 4404 35937 178201 -81399 -33550 244872 325720 103638
12138A0158J12562K4294i0614r193l8525F913J59723K45880A55490K94052B4869
$$ 10158 122720 147014 -90614 -99807 -138332 6913 166636 412516 155490 449542 24869
12126B77871j06408g9311a7769n2985C113J06968J0598K07182A27047K31177r7151
$$ 277871 171463 -79311 -17769 -70754 3113 110081 120679 327861 127047 358224 261073
12115B61073H9071C9681b66889A43829a10920B95639f1425j18796B8333K2250
$$ 261073 89071 39681 -266889 143829 -110920 295639 -61425 -180221 28333 50583
12105E0583J6415J0882a61567E1719a14516D143O4735J22297M7917n4793q2819
$$ 50583 66998 77880 -161567 51719 -114516 4143 68878 191175 239092 184299 101480
12094A01480a09227k4805B51693d7382B4063L22591k5585a2991k22746a097k0986
$$ 101480 -109227 -134032 251693 -47382 24063 346654 321069 -12991 -235737 -1097 -22083
12083b2083F5025L3259K9208q343C5864P3305p869K5360D5980i1454F8015a45936
$$ -22083 65025 98284 127492 119149 35864 109169 101300 126660 45980 -91454 68015 -145936
12070A77789F9584c528B46229D0278J78739J5629N1563F2807k186K8097a1546
$$ 177789 69584 -3528 246229 40278 219017 234646 286209 62807 60621 88718 -11546
12058c8465B45432J82159c8727E9022O3439J20053a38960B32349L5102i5757c0024
$$ -38465 245432 427591 -38727 59022 122461 242514 -138960 232349 267451 -95757 -30024
12046b3598A41554D3451g297k130F6531a8611A08028O2909l8535k6274j8439J71559
$$ -23598 141554 43451 -7297 -9427 66531 -18611 108028 170937 132402 106128 87689 259248
12034B59248e4994A25755b65321a9926m0985m7436K5361k0428B15473b78407B71735
$$ 259248 -54994 125755 -265321 -19926 -60911 -108347 -82986 -103414 215473 -278407 271735
12022A30760l994o1863A9521J58116a43492C47102a87112C56385o1844C0756M1815
$$ 130760 126766 64903 19521 177637 -143492 347102 -187112 356385 294541 30756 72571
12011G2571f4052k813a6206r7870p1151J6600f1030b6643A1680P4437J69259j8098
$$ 72571 -64052 -66865 -16206 -114076 -185227 -168627 -61030 -26643 11680 86117 255376 237278
11999B37278a27351A46970J14877b9188A74716o9706O303P269L5268b89500A47388
$$ 237278 -127351 146970 261847 -29188 174716 105010 111313 118582 153850 -289500 147388
11987A6704K40000c32k94677J09673B0665J71233K1901q7514J67165j41235i7837
$$ 16704 256704 -332 -295009 -185336 20665 191898 213799 126285 293450 152215 -97837
11975a66274A62659i0916r0693j5920j46669a36498A05641D0003i8167B6700b00980
$$ -166274 162659 -90916 -181609 -197529 -344198 -136498 105641 40003 -98167 26700 -200980
11963F9687c5762k43886J25877F1276J87765B1975K230a12718A07536a81884I518
$$ 69687 -35762 -279648 -153771 61276 249041 21975 24205 -112718 107536 -181884 9518
11951a88697D7114a9689j98543R3339B30262p2883b7300l84718g2878I5785g4617
$$ -188697 47114 -19689 -218232 -124893 230262 157379 -27300 -412018 -72878 95785 -74617
11939B54770n1884b04528e5599j708j61588a08420B9370K46433F00a43779A24529
$$ 254770 202886 -204528 -55599 -57307 -218895 -108420 29370 275803 600 -143779 124529
11927e6746l4175F3593a51014A59292F0810K3925b92223C48377j01724J87361
$$ -56746 -90921 63593 -151014 159292 60810 84735 -292223 348377 246653 434014
11917D34014A82034a1897B7700K22524a37926k4580g6286K9973l01053B46119
$$ 434014 182034 -11897 27700 250224 -137926 -162506 -76286 -46313 -347366 246119
11906B97514e0828a8929B4448J3828L25324G7955L30950A42251L09392I4812b64917
$$ 297514 -50828 -18929 24448 38276 363600 77955 408905 142251 451643 94812 -264917
11894h3685p252G418a07495C34109A31164g1458H3424b02986A7660a2383k98133
$$ -83685 -90937 7418 -107495 334109 131164 -71458 83424 -202986 17660 -12383 -310516
11883c10516R7229o3731e3396j29169A62585a58827j3409C6966g9059B86654C4585
$$ -310516 -213287 -277018 -53396 -182565 162585 -158827 -172236 36966 -79059 286654 34585
11871A44196E352b34541j8972g6846n56248a76847C7752K05780b55638p1296F1027
$$ 144196 5352 -234541 -253513 -76846 -633094 -176847 37752 243532 -255638 -326934 61027
11859A08104c96602A6021M8614g7557o5447D8598h1542A74580a23142j8814G5848
$$ 108104 -396602 16021 64635 -77557 -143004 48598 -81542 174580 -123142 -141956 75848
11847b2327C08133c3882B13539a70618L1865j3323l56638a14315L4254n703G8979
$$ -22327 308133 -33882 213539 -170618 -138753 -152076 -508714 -114315 -80061 -85764 78979
11835A09166g1791G2950a60076A32728a71633B05347b02629f09k62050o6500d0143
$$ 109166 -71791 72950 -160076 132728 -171633 205347 -202629 -609 -262659 -329159 -40143
11823g5238b8501C6915K08440b65669N2515B8495c23147A28319D105c0206k20186
$$ -75238 -28501 36915 245355 -265669 -213154 28495 -323147 128319 4105 -30206 -250392
11812b50392M971h7163B62515A02369I445L97957b96847b7539A36031c17604H7421
$$ -250392 -245421 -87163 262515 102369 9445 407402 -296847 -27539 136031 -317604 87421
11800a24454G217d62551d7462C47576b4305m3981C0596L62407g6502j49529J05468
$$ -124454 7217 -462551 -47462 347576 -24305 -68286 30596 393003 -76502 -226031 -120563
11789a20563r6565k6665p7277a37317I8012J3656l8800a4791k8646n2425K3976
$$ -120563 -217128 -243793 -321070 -137317 98012 111668 72868 -14791 -43437 -95862 -71886
11778g1886G5283b76499B77901a8696B3415c63889A43030a635q938B03882d0068
$$ -71886 75283 -276499 277901 -18696 23415 -363889 143030 -1635 -10573 203882 -40068
11766B4015f2117C13233D9970K13753g1470B07607I2991b31981h4248Ad4072K972
$$ 24015 -62117 313233 49970 263723 -71470 207607 92991 -231981 -84248 1 -44072 -41100
11754d1100p8988B99707b33743b1533H2559l5761A7302a31214I541J92824a37472
$$ -41100 -120088 299707 -233743 -21533 82559 46798 17302 -131214 9541 202365 -137472
11742g3342A9326i96D3127K12894C816a57780E0277c9792A94660J8772a34521
$$ -73342 19326 -996 43127 256021 3816 -157780 50277 -39792 194660 213432 -134521
11730I6125a62160j37342N4514a08621C71475d936j05009C37910a18160j11444
$$ 96125 -162160 -299502 -244988 -108621 371475 -4936 -109945 337910 -118160 -229604
11720b29604G7565a88978A05271b7339A29725m3282c3948D866K81826a46143c9408
$$ -229604 77565 -188978 105271 -27339 129725 86443 -33948 4866 286692 -146143 -39408
11708c4363E2903J82839a05086B6318b87392o6367P0015C67254a71775M2865I278
$$ -34363 52903 235742 -105086 26318 -287392 -353759 -283744 367254 -171775 -128910 9278
11696C50301j43423d6042p0044e3895H068a17386C51573I6209k0184k6374f6088
$$ 350301 206878 -46042 -116086 -53895 8068 -117386 351573 96209 76025 49651 -66088
11684E5999A5340J23888C214c6787A28253Q2092N7948A1979J20404a2057G7898
$$ 55999 15340 139228 3214 -36787 128253 210345 268293 11979 132383 -12057 77898
11672a11540C95232c7719m5562C26447a25029r9932H5182k4858J3376c1173B5143
$$ -111540 395232 -37719 -83281 326447 -125029 -224961 85182 60324 73700 -31173 25143
11660c1599A52477g7465E557K41717e0995j27578j58787I5664M6769A444a74786
$$ -31599 152477 -77465 5557 247274 -50995 -178573 -337360 95664 142433 1444 -174786
11648g2932r7572H5415I148O018M89236A77697e5849D4267j8387J2332O4667D5070
$$ -72932 -170504 85415 9148 15166 504402 177697 -55849 44267 25880 38212 102879 45070
11635c20038C19844b48193a9385H7227a33854m6308D6294K65418a47972C75526
$$ -320038 319844 -248193 -19385 87227 -133854 -180162 46294 311712 -147972 375526
11624a62548A0130a99482L570D8088c04000I190N2191h7271G201e6848j88308
$$ -162548 10130 -199482 -195912 48088 -304000 9190 61381 -87271 7201 -56848 -245156
11613b45156i3154E5694d449A24001a10535N2394A91351D1568R1567J4351i9463
$$ -245156 -93154 55694 -4449 124001 -110535 -58141 191351 41568 133135 147486 -99463
11601a06177j68928B28039E4411O7664e0250A70475b23765o5584A45651a02720
$$ -106177 -275105 228039 54411 122075 -50250 170475 -223765 -289349 145651 -102720
11590a47795B04674a37458L197m4247A14310a17198M1062B85717G1221i3419G2455
$$ -147795 204674 -137458 -134261 -178508 114310 -117198 -76136 285717 71221 -93419 72455
11578B29370A14381J12543J04273b06650E62766a70959b3834j23553P1204E0390
$$ 229370 114381 226924 331197 -206650 562766 -170959 -23834 -147387 -76183 50390
11567b9404A93902a83595I6955a32051e0886B80557H1916a40630M7340E3783A5266
$$ -29404 193902 -183595 96955 -132051 -50886 280557 81916 -140630 -93290 53783 15266
11555d7800A52881J07023H4426A1038J85288G0185a39061N8915C25869E6268a4172
$$ -47800 152881 259904 84426 11038 196326 70185 -139061 -80146 325869 56268 -14172
11543D40146b7878j40157E0049L1307e3268g084G1582J45479a22703m5325A91351
$$ 440146 -27878 -168035 50049 81356 -53268 -7084 71582 217061 -122703 -168028 191351
11531C34004H9066N5112h1779p814A51159J66455b06201C6880g5326c1515A85860
$$ 334004 89066 144178 -81779 -89593 151159 317614 -206201 36880 -75326 -31515 185860
11519A93485J18221j0223A46802d1069E3312L6118K71065A14252c38368I307L84526
$$ 193485 311706 301483 146802 -41069 53312 89430 360495 114252 -338368 9307 393833
11508C93833A84332e6639j09431I9354B100a36347e6843G0052j1710l492i2092
$$ 393833 184332 -56639 -166070 99354 2100 -136347 -56843 70052 58342 54850 -92092
11496E1706a23562A7851f2I1165J95826H3587D0304a8820B66404A31302E3192
$$ 51706 -123562 17851 -62 91165 286991 83587 40304 -18820 266404 131302 53192
11484b68916B88011h4226A34231a08856M2819B85014a21690e0698m8035I2322
$$ -268916 288011 -84226 134231 -108856 -66037 285014 -121690 -50698 -98733 92322
11473d1437q1712A82215C6723b96815F5398K16145L1114a44032A79062L21094
$$ -41437 -123149 182215 36723 -296815 65398 281543 312657 -144032 179062 500156
11463E00156B25426c29052B34776k8610n5328B8308K03830R0546o0507K0028E7026
$$ 500156 225426 -329052 234776 206166 150838 28308 232138 322684 262177 282205 57026
11451A27629J94872a09562B77345G6164P852Q0978c5707j8198l81982G4149R7672
$$ 127629 322501 -109562 277345 76164 84016 164994 -35707 -53905 -435887 74149 171821
11440A71821f8137B93878q5515E5011J57450a77008A04122j3664a25408e9769
$$ 171821 -68137 293878 208363 55011 212461 -177008 104122 90458 -125408 -59769
11429A59140c1000E9445L79996C7172b05917r2893A61380c7714C9282O8604R4736
$$ 159140 -31000 59445 439441 37172 -205917 -298810 161380 -37714 39282 107886 202622
11418B02622k1808j6127J4800a03605m2074B6111a46053N7007A23337a06164H0128
$$ 202622 180814 164687 179487 -103605 -145679 26111 -146053 -89046 123337 -106164 80128
11406h1597A30480n6152a35273B44872I4301k7086a65184H5091J7498P8300c01381
$$ -81597 130480 74328 -135273 244872 94301 67215 -165184 85091 102589 180889 -301381
11394c03910i9588b2597A98387e8008j27038B20105a47308K6493A47405J9340
$$ -303910 -99588 -22597 198387 -58008 -185046 220105 -147308 -120815 147405 166745
11384A66745A2588K86438b5344j11011j27639C27764P5542a55419e3889q0143
$$ 166745 12588 299026 -25344 -136355 -263994 327764 403306 -155419 -53889 -134032
11374a34032j50444A85747o8068a88565k27078E0248A534P4902J01391M283d1293
$$ -134032 -284476 185747 117679 -188565 -415643 50248 1534 76436 177827 182110 -41293
11362a22705j73562A14041O6941a283C0402h0885A25985E3435b47153e618j1240
$$ -122705 -296267 114041 180982 -1283 30402 -80885 125985 53435 -247153 -5618 -16858
11351a6858A75502d7620D83349A76123b17704C81635a66736r8675l0443c9225
$$ -16858 175502 -47620 483349 176123 -217704 381635 -166736 -265411 -295854 -39225
11340b84960a02117j93423H7777d14498a0500B8446a13290B12910G1153b10343
$$ -284960 -102117 -295540 87777 -414498 -10500 28446 -113290 212910 71153 -210343
11329b22652q391C67595a9972F452L7372k1317L5175J8393j5030a83330A6369
$$ -222652 -231043 367595 -19972 6452 43824 22507 57682 76075 61045 -183330 16369
11317B0261a29284B1845L23449c04960a51520P3300c764j7343A42363a86801n194
$$ 20261 -129284 21845 345294 -304960 -151520 -78220 -3764 -21107 142363 -186801 -191995
11306a91995B59702G3988K4267K8017c07933A25470a37409d2514j77009j14968
$$ -191995 259702 73988 98255 126272 -307933 125470 -137409 -42514 -219523 -334491
11296c34491i3855j08231j18024B3650K094g4245l19489b3447F2444A5346b73820
$$ -334491 -93855 -202086 -320110 23650 25744 -74245 -393734 -23447 62444 15346 -273820
11284c9257D9009e7928A55809a20775C06381E7082K45723a17184r5563b7418n6511
$$ -39257 49009 -57928 155809 -120775 306381 57082 302805 -117184 -212747 -27418 -83929
11273h3929l1498A8584b9632D7138a6255B8243b63449e727B159b75320A2064L3463
$$ -83929 -115427 18584 -29632 47138 -16255 28243 -263449 -5727 2159 -275320 12064 45527
11261D5527i7386n9364b3105B7909K39211a74452A34805c7243k10126D9798c26836
$$ 45527 -97386 -156750 -23105 27909 267120 -174452 134805 -37243 -247369 49798 -326836
11249I4537f6491k24860b3406B66845C2756a5219A38245g954j46434K4755L8635
$$ 94537 -66491 -291351 -23406 266845 32756 -15219 138245 -7954 -154388 -129633 -90998
11238i0998k35478q0531a83351C8694a79346f3917k04394l6816J01900K1832A0575
$$ -90998 -326476 -407007 -183351 38694 -179346 -63917 -268311 -305127 -203227 -181395 10575
11226A56800L59256A40455J95067d89559K29415H8573c83355k4481I4060q082
$$ 156800 516056 140455 335522 -489559 -260144 88573 -383355 -407836 94060 85978
11216H5978c7120I3071b37002J02086f4361k0510I5577j4858A295b83418g6461
$$ 85978 -37120 93071 -237002 -134916 -64361 -84871 95577 80719 1295 -283418 -76461
11204C34634b24714A58705b90384a5884m8290m2089d9090G6869h3649j95569j40922
$$ 334634 -224714 158705 -290384 -15884 -64174 -106263 -49090 76869 -83649 -279218 -420140
11193d20140l6015e3592A34725C9277h603j52525G2608P2790N026p0415J57956
$$ -420140 -456155 -53592 134725 39277 -8603 -161128 72608 145398 150424 80009 237965
11182B37965d11355J45942J28545A5387a52062E5192b285C95508A53801c09080
$$ 237965 -411355 -265413 -136868 15387 -152062 55192 -2285 395508 153801 -309080
11171h7081J2388j34287A34094f3759C08779a41191B12752c2777I4349c47631
$$ -87081 -74693 -208980 134094 -63759 308779 -141191 212752 -32777 94349 -347631
11160c9499F1258a35779c4154A85654a64936g7404A76578D8098a42441N1587j59919
$$ -39499 61258 -135779 -34154 185654 -164936 -77404 176578 48098 -142441 -90854 -250773
11149b50773N8630L4303A98249H0011a31001n936A11241a50005O6389k63534A02281
$$ -250773 -192143 -157840 198249 80011 -131001 -136937 111241 -150005 -83616 -347150 102281
11137A03239D7411a31448q6798C9303b28483C9678d1578b111D2467a27523A13090
$$ 103239 47411 -131448 -218246 39303 -228483 39678 -41578 -2111 42467 -127523 113090
11125B51624a66335A15955b22495g840k04366g6586m7380G2176a11452A59885
$$ 251624 -166335 115955 -222495 -7840 -212206 -76586 -123966 72176 -111452 159885
11114a04586A04213C6070b7197A260K11834L8112a98411q1804A86145k2516G7990
$$ -104586 104213 36070 -27197 1260 213094 251206 -198411 -280215 186145 163629 77990
11102A4286h5902K0683j97592A62048h6038A014a64071d9925A97822r1727d8151
$$ 14286 -85902 -65219 -262811 162048 -86038 1014 -164071 -49925 197822 106095 -48151
11090g6079b775B7715b48612h7704A82522K5961g4220A0528K82659H8504K41173
$$ -76079 -2775 27715 -248612 -87704 182522 208483 -74220 10528 293187 88504 329677
11079C29677A64516p9386J87618A24316a7920E22N34776A09486a09603j37060
$$ 329677 164516 85130 272748 124316 -17920 522 535298 109486 -109603 -246663
11069b46663a4903A35809E7054J94572n7020O2565J00939n7067q8109K40700j71874
$$ -246663 -14903 135809 57054 251626 194606 257171 358110 301043 212934 453634 281760
11058B81760m7818A04194K22672m0676n8371E6352K48623F020K20295A04501J90329
$$ 281760 233942 104194 326866 286190 227819 56352 304975 6020 226315 104501 294830
11047B94830Q7502K450j88108J35791j31177k5617M57574j42206J15056k57922
$$ 294830 382332 384782 196674 332465 201288 175671 633245 491039 606095 348173
11037C48173N11436l60725j08580R4307L7602M25036m21789N4442k1410q1223
$$ 348173 859609 498884 390304 484611 522213 947249 525460 579902 558492 477269
11027D77269J65908N548r8322o8845J91100k6502K05159B41536J32126L45090
$$ 477269 643177 648725 550403 481558 672658 646156 851315 241536 373662 718752
11017G18752l28790J27699L45690k68596n3654J17106j08888J50291N2641o6660
$$ 718752 389962 517661 863351 594755 541101 658207 549319 699610 752251 685591
11007F85591k04646j99417L96055k03466j33677J20453K13237j94366k15972M21842
$$ 685591 480945 281528 677583 474117 340440 460893 674130 479764 263792 685634
10997F85634l08725K90025B38437J85827J01870J04983B97419m0102L33171r3197
$$ 685634 376909 666934 238437 424264 526134 631117 297419 257317 590488 497291
10987D97291l056J18681I5372J27168E6983M04259n9272K46223A90997N70705
$$ 497291 494235 612916 95372 222540 56983 461242 401970 648193 190997 761702
10977G61702l3180k57917A94572J88066Q7572J77637m9344J36545J92568D52784
$$ 761702 728522 470605 194572 382638 470210 647847 598503 735048 927616 452784
10966I31356m0117L29734l66576Q7262J35507j44675J65536J33308K24126P2524
$$ 931356 891239 1220973 854397 941659 1077166 932491 1098027 1231335 1455461 1527985
10956A527985j31141N39941J8381K0281L4060j10127j40636J32065o1536m55901
$$ 1527985 1396844 1936785 1955166 1975447 2009507 1899380 1758744 1890809 1829273 1373372
10946A373372K18540M8920m3034Q9552n4828J19273m10103K52509O1531k36982
$$ 1373372 1591912 1640832 1597798 1687350 1632522 1751795 1341692 1594201 1655732 1418750
10936A418750l72250N31742o96841j39419M62229m7659k73529l00111O7486M2960
$$ 1418750 1046500 1578242 881401 741982 1204211 1156552 883023 582912 650398 693358
10926F93358C18912N6793A80559m1979B4739O2464K11343D8649M44255F4324D287
$$ 693358 318912 375705 180559 138580 24739 87203 298546 48649 492904 64324 4287
10914B88116C7604g8459j68974A22188J67245j8121A11347J86715d5617D5122
$$ 288116 37604 -78459 -247433 122188 289433 271312 111347 298062 -45617 45122
10903A4802D706b22445l6898B26075b77517G225a96709m099A85378b60182A77204
$$ 14802 4706 -222445 -259343 226075 -277517 7225 -196709 -200808 185378 -260182 177204
10891A16553Q7722H1906o24a52740j55585a29220A67524b14258A20632a63018
$$ 116553 204275 81906 81282 -152740 -308325 -129220 167524 -214258 120632 -163018
10880b51641d5648b474m2946C1690a28689A95794a54393o1205F2538b18778D53510
$$ -251641 -45648 -2474 -45420 31690 -128689 195794 -154393 -215598 62538 -218778 453510
10868B22610H0223A2964d02310A84133K54610a88131B1748m677K77029E3465c35097
$$ 222610 80223 12964 -402310 184133 438743 -188131 21748 17071 294100 53465 -335097
10856e1073A39807a97530o053E2604K11345j10564b01000o7630A38055o6120q743
$$ -51073 139807 -197530 -203583 52604 263949 153385 -201000 -268630 138055 71935 63192
10845F3192d66370A55373o0358i0662F952J65395J03076A0798g6587F8070d6454
$$ 63192 -466370 155373 95015 -90662 6952 172347 275423 10798 -76587 68070 -46454
10833D4224c41489f8013A98424a0826C7339m616O3298i1208k2183B02203I8625
$$ 44224 -341489 -68013 198424 -10826 37339 32723 96021 -91208 -113391 202203 98625
10821C34209D2260f326k12344A6065b40799B00573c11683h3261j07061j3556N4176
$$ 334209 42260 -6326 -218670 16065 -240799 200573 -311683 -83261 -190322 -203878 -149702
10810a49702A30360e7447k67121a19051A437J61322i8959C8292d49486d9430g403
$$ -149702 130360 -57447 -324568 -119051 1437 162759 -98959 38292 -449486 -49430 -7403
10798g8938r1678q1297f5374h229q4485M1664D74R3005D6394a05227I2369i2153
$$ -78938 -170616 -251913 -65374 -8229 -92714 -51050 474 93479 46394 -105227 92369 -92153
10785a00246A2117B293M8112b23988B63496D0417d2406F565a28996D0182O820
$$ -100246 12117 2293 50405 -223988 263496 40417 -42406 6565 -128996 40182 47002
10774D7002O9125h3276r0811B70113d4504j24450A06104D2777R7055a39120M0734
$$ 47002 116127 -83276 -174087 270113 -44504 -168954 106104 42777 139832 -139120 -98386
10763i8386B28307d86925N0243A92219J19574A7207c83409B62425b18784Q0499
$$ -98386 228307 -486925 -436682 192219 311793 17207 -383409 262425 -218784 -138285
10753a38285d9302A06977b4473B65338f2966K0160B917J47121A3765c03435L9703
$$ -138285 -49302 106977 -24473 265338 -62966 -42806 2917 150038 13765 -303435 -263732
10742b63732I6819J01099i6205h37l1580E8382e0069k07930R3671f5899A1983
$$ -263732 96819 197918 -96205 -837 -32417 58382 -50069 -257999 -164328 -65899 11983
10730b20748R5078k9580i209B03695D7804L67244D0312b69000D2140b9911k90442
$$ -220748 -125670 -155250 -9209 203695 47804 415048 40312 -269000 42140 -29911 -320353
10719c20353A42459K84220h8321D4431d96892a02340p8694P4856o1968J9482B41147
$$ -320353 142459 426679 -88321 44431 -496892 -102340 -181034 -106178 -168146 -148664 241147
10707a53991A93775a65675b5267b829j03852B82129c6628j34262k02226G9733
$$ -153991 193775 -165675 -25267 -2829 -106681 282129 -36628 -170890 -373116 79733
10696b18728d6148B4066L8119M3662D408J27307d71078A227L79652d8683B5071
$$ -218728 -46148 24066 62185 105847 4408 131715 -471078 1227 380879 -48683 25071
10684A77958O292c66383A68610a39022A18808L1807a35770H7071b06553A16310
$$ 177958 184250 -366383 168610 -139022 118808 150615 -135770 87071 -206553 116310
10673b2841B60986b70348I1399i7695A2799a81768d5477B003a73753J9742A08346
$$ -22841 260986 -270348 91399 -97695 12799 -181768 -45477 2003 -173753 -154011 108346
10661E5863f8728C4090c36491D3333b92148J17090C5990a05147K165e0372k44385
$$ 55863 -68728 34090 -336491 43333 -292148 -175058 35990 -105147 -102982 -50372 -294757
10650b94757h0649o4814k3063m4498G7323d37356B01223a26161H5615a96977B27438
$$ -294757 -80649 -145463 -168526 -213024 77323 -437356 201223 -126161 85615 -196977 227438
10638A0700i6370k9212i409C30368C5219L07762a75768Q1865j57983d0641k19716
$$ 10700 -96370 -125582 -9409 330368 35219 342981 -175768 -93903 -251886 -40641 -260357
10627b60357j4426b1763o9075j7046A4647b37842J07644A22517A0845N2816i3051
$$ -260357 -274783 -21763 -90838 -107884 14647 -237842 -130198 122517 10845 63661 -93051
10615F4628i0214l6423j51732A86057a61302A05851b50972A67076K5545K8909
$$ 64628 -90214 -126637 -278369 186057 -161302 105851 -250972 167076 192621 221530
10605B21530b30863b9285I9008M387b01051j48136a58752L6950B38663i3294b1137
$$ 221530 -230863 -29285 99008 103395 -201051 -349187 -158752 -121802 238663 -93294 -21137
10593b9371k47144j4500B37013a93898b1124k36499j81870J00837b9668k44915
$$ -29371 -276515 -291015 237013 -193898 -21124 -257623 -439493 -338656 -29668 -274583
10583b74583M1905b3221j53229A0610a28871B40400q3620g256A28847d10094a19007
$$ -274583 -232678 -23221 -176450 10610 -128871 240400 156780 -7256 128847 -410094 -119007
10571e6473E4837j0948h8098e633k8095H2835a3723k25451A35265D9674L05873
$$ -56473 54837 43889 -88098 -5633 -33728 82835 -13723 -239174 135265 49674 355547
10560C55547a92567R2840B29560a24255I0738J32220a28602b4971l9923C1327
$$ 355547 -192567 -99727 229560 -124255 90738 222958 -128602 -24971 -64894 31327
10549b86291a31181p1141A11874a32968o2408E0599r345R7668a11008J8770E6252
$$ -286291 -131181 -202322 111874 -132968 -195376 50599 41254 138922 -111008 -92238 56252
10537c5864n2905A17615N4833C9760J19540G3217b11601O2886G5656K07902a55239
$$ -35864 -88769 117615 172448 39760 159300 73217 -211601 -148715 75656 283558 -155239
10525a95117e1959E9248b45560j67883a58066p1917D6172a76116j7599E4571k841
$$ -195117 -51959 59248 -245560 -413443 -158066 -229983 46172 -176116 -193715 54571 51730
10514E1730b35817I389a32585b9071A00460a75531p7712J4491J3616Q2385a1732
$$ 51730 -235817 9389 -132585 -29071 100460 -175531 -253243 -238752 -225136 -142751 -11732
10502c31817b8245o9913A15435g1932B8280E208c4304q1464o9135c4130j83993
$$ -331817 -28245 -98158 115435 -71932 28280 5208 -34304 -115768 -184903 -34130 -218123
10491b18123A13155m8416b39578a16264A04892d53926A00907N5756a8774A85458
$$ -218123 113155 64739 -239578 -116264 104892 -453926 100907 156663 -18774 185458
10480B40420a29362D9903a07700j6413n7597j62163J16330B6572a36512l52252
$$ 240420 -129362 49903 -107700 -124113 -181710 -343873 -227543 26572 -136512 -488764
10470d88764a04673j41918N0105E98629A92448c27557J62100A55504n2974M68087
$$ -488764 -104673 -246591 -196486 598629 192448 -327557 -165457 155504 102530 570617
10460E70617B40009M73714l39147o6534A2536L51408A69096E7601M2923b11818
$$ 570617 240009 713723 374576 308042 12536 363944 169096 57601 100524 -211818
10449a10198E0457a26130B40358I6123e6262m5021A67653c8113E3888k475c30938
$$ -110198 50457 -126130 240358 96123 -56262 -101283 167653 -38113 53888 51413 -330938
10437A87765F8149a52637D79114k14721k6912a68774G9404J91211a64177N8811
$$ 187765 68149 -152637 479114 264393 237481 -168774 79404 270615 -164177 -105366
10427a05366j21733M6320B6715a20701k02266D8266a90582A39848d83469a90829
$$ -105366 -227099 -180779 26715 -120701 -322967 48266 -190582 139848 -483469 -190829
10416C1936b3619G3844a7328A1080a11136l2999a4954D8982b06968A62225D4364
$$ 31936 -23619 73844 -17328 11080 -111136 -144135 -14954 48982 -206968 162225 44364
10404c0265B41505e7504n59j63186a719o6805k98675d5254A12010a09065A73243
$$ -30265 241505 -57504 -58063 -221249 -1719 -68524 -367199 -45254 112010 -109065 173243
10392a43012C0026b2844A67929a18446C5555L13030j09042c64164J74500p4454
$$ -143012 30026 -22844 167929 -118446 35555 348585 239543 -364164 -189664 -264118
10382b64118A0565c2991G5075M1175M4167a04798L7114n6400A68046C5299h1198
$$ -264118 10565 -32991 75075 116250 160417 -104798 -67684 -124084 168046 35299 -81198
10370G2306J95890b01430H970b52018a07746A42447C1557A4671M3914a00046B35458
$$ 72306 268196 -201430 8970 -252018 -107746 142447 31557 14671 58585 -100046 235458
10358H2820C3545J08767b1896I6846a3005H5909J88863A13295L3074J3055Q0097
$$ 82820 33545 142312 -21896 96846 -13005 85909 274772 113295 146369 159424 239521
10347B39521j4687J88838A81654J0689J45262A14396f226A52336L7925E4613a34531
$$ 239521 224834 413672 181654 192343 337605 114396 -6226 152336 190261 54613 -134531
10335a46802B91871b40388E5200K79349J76564j6172r5607A25421M26540B57549
$$ -146802 291871 -240388 55200 334549 511113 494941 399334 125421 551961 257549
10324C67798D6285l844M14076H9254O753n489B1673b0606B08062K2901I2609a8295
$$ 367798 46285 42441 456517 89254 96007 90518 21673 -20606 208062 230963 92609 -18295
10311D85224b14789G641c29415a33743N9278I9292J33997d18319D8208a26261
$$ 485224 -214789 7641 -329415 -133743 -74465 99292 233289 -418319 48208 -126261
10300A25880P2539a88792B70904j08440a36622L3484A70056E1753J447e8147C76623
$$ 125880 198419 -188792 270904 162464 -136622 -103138 170056 51753 53200 -58147 376623
10288A69465a57872L2420d2731j72191E6367a42559j59026g1191B96866a92858
$$ 169465 -157872 -125452 -42731 -214922 56367 -142559 -301585 -71191 296866 -192858
10277a24573i505l2432D0865g107j19552M0810g17j73128A33675d0767o8750J283
$$ -124573 -9505 -41937 40865 -7107 -126659 -85849 -717 -173845 133675 -40767 -109517 -108234
10265a08234r0658M4859a1467o4500G6781K37026k7238r0740d328k7970j50079
$$ -108234 -198892 -154033 -11467 -75967 76781 313807 286569 195829 -4328 -32298 -182377
10254a82377p292N2007d1655j96160M3631Q075B1880d3767o4360A73380k0609
$$ -182377 -189669 -137662 -41655 -237815 -194184 -186109 21880 -43767 -108127 173380 152771
10243A52771M2812D8189J14809g522j8753D01358j15525J33029A83134M6784e8566
$$ 152771 195583 48189 162998 -7522 -26275 401358 285833 418862 183134 229918 -58566
10231F7907a2817A74638f1858D9134a57908g7479k6164B9641b6345A17695J42175
$$ 67907 -12817 174638 -61858 49134 -157908 -77479 -103643 29641 -26345 117695 259870
10220B59870e9886A22986b11953q0837a29650K2271l00488B66329b94786f9613
$$ 259870 -59886 122986 -211953 -292790 -129650 -107379 -407867 266329 -294786 -69613
10209A42165h6540n5868f2103B37669P4154J6508a80935a4686j80590C2635e9846
$$ 142165 -86540 -142408 -62103 237669 311823 328331 -180935 -14686 -195276 32635 -59846
10197G8261a4134l520o8239j66047C8515K8032B7913h3806c5256B99824A44038
$$ 78261 -14134 -17654 -85893 -251940 38515 66547 27913 -83806 -35256 299824 144038
10185H4964a37900A29272k2052C2046b06656E5152b98040R8311e9399N43A87958
$$ 84964 -137900 129272 107220 32046 -206656 55152 -298040 -199729 -59399 -58856 187958
10173a34716k5055A46986j2778E4123B1483M9939J68108O9388a20459k220E7569
$$ -134716 -159771 146986 134208 54123 21483 71422 239530 308918 -120459 -122679 57569
10161a55078b7053A16759b94318k16194A9321K0896r75c3039E402a87262h7833
$$ -155078 -27053 116759 -294318 -510512 19321 40217 39242 -33039 5402 -187262 -87833
10149f9095r8463B236K25026a46137F6821A1310g2510l19271A24899a47520n94960
$$ -69095 -167558 2236 227262 -146137 66821 11310 -72510 -391781 124899 -147520 -742480
10138g42480L35490a52483B55212F3077f169A00219c64614C6950b30237L7241
$$ -742480 -406990 -152483 255212 63077 -6169 100219 -364614 36950 -230237 -192996
10128a92996A22947d4313q9572F7095O4407P3675M7951e0327m0710K2136k50822
$$ -192996 122947 -44313 -133885 67095 131502 205177 253128 -50327 -91037 -68901 -319723
10117c19723a17001A38156R571b1865p121j54735O465j05129C17115g5210f668
$$ -319723 -117001 138156 147727 -21865 -28986 -183721 -177256 -282385 317115 -75210 -6668
10105b38203A26611J1430a64386O4753I2576a69661A16077D3363j939N4667b43202
$$ -238203 126611 138041 -164386 -99633 92576 -169661 116077 43363 41424 96091 -243202
10093A85714a96414N0767A66176f5076A25354i7328B72401b46352h4294H8675
$$ 185714 -196414 -145647 166176 -65076 125354 -97328 272401 -246352 -84294 88675
10082A74012c67040A29503i9463A12467D1831K5824b05493R5162o4388E2473b6757
$$ 174012 -367040 129503 -99463 112467 41831 67655 -205493 -110331 -174719 52473 -26757
10070b31870C7592K5261a59693o8916L9959j37829E561P2301d8965B8262j1554
$$ -231870 37592 62853 -159693 -228609 -188650 -326479 5561 77862 -48965 28262 16708
10059A6708N7107a6049F8557a0424H9168C6906b14851a9687j11774l7474O6566
$$ 16708 73815 -16049 68557 -10424 89168 36906 -214851 -19687 -131461 -168935 -102369
10048a02369C57296d22857f5235k57048C6766a10049K9551a5420D4576J13764
$$ -102369 357296 -422857 -65235 -322283 36766 -110049 -80498 -15420 44576 158340
10038A58340d3478r2340B8116b83979g0497o0371A08754K234b82674E8773d32828
$$ 158340 -43478 -135818 28116 -283979 -70497 -130868 108754 110988 -282674 58773 -432828
10026b51465n912J23340A63921G3122c57411M6575e3885G0541c55638q0679C4054
$$ -251465 -257377 -134037 163921 73122 -357411 -310836 -53885 70541 -355638 -436317 34054
10014c48826c3725B24600a73711D6009e0390A45908e1793B8394a11987B12184
$$ -348826 -33725 224600 -173711 46009 -50390 145908 -51793 28394 -111987 212184
10003b46927A97018P2136a80367b1312j4210B519J03794j9626e1392k18461h5369
$$ -246927 197018 269154 -180367 -21312 -35522 2519 106313 86687 -51392 -269853 -85369
9991a75083c9021k39807b206D0498c37682K0713j18980A99323H8748B2444l20
$$ -175083 -39021 -278828 -2206 40498 -337682 -316969 -435949 199323 88748 22444 22124
9980B2124N9194a79298N6161j1876o4153r9376H8622d5252R592k71385A15374
$$ 22124 81318 -179298 -123137 -135013 -199166 -298542 88622 -45252 -35660 -307045 115374
9968b58101K2638B74688c76284E3977a83104D36035b08809H4613e5351A34503
$$ -258101 -235463 274688 -376284 53977 -183104 436035 -208809 84613 -55351 134503
9957c10258R2148A32324f9954m05431A24964Q6260b06218a6544k85409a41194
$$ -310258 -218110 132324 -69954 -475385 124964 211224 -206218 -16544 -301953 -141194
9946F8240J4819a16712d1899o5887j08066B53586B4949b47778m6610A53330G0429
$$ 68240 83059 -116712 -41899 -107786 -215852 253586 24949 -247778 -294388 153330 70429
9934c38779i4920k46712Q1554B79910D973J70520d1762E5703J59105a63142e299
$$ -338779 -94920 -341632 -260078 279910 4973 175493 -41762 55703 214808 -163142 -5299
9922g9248j56600Q3256q0642I4862O5504a17936j63227B3801L31601f194r4127
$$ -79248 -235848 -152592 -233234 94862 160366 -117936 -281163 23801 355402 -6194 -100321
9911a00321A20024a33559m3566P5660k45285a62048I9870d74950a90076N3264
$$ -100321 120024 -133559 -177125 -101465 -346750 -162048 99870 -474950 -190076 -136812
9901a36812n650O5971C2480N2532g0348B1897b90349C0704J84883b86923j5066
$$ -136812 -142462 -76491 32480 85012 -70348 21897 -290349 30704 215587 -286923 -301989
9890c01989f1978l6973A06478C5518J24358a73095B1432a44332M7274A36988c30616
$$ -301989 -61978 -98951 106478 35518 159876 -173095 21432 -144332 -97058 136988 -330616
9878C5388a27635L7280B32792a67689f1847j50534A68030a21898E8375M7312L4975
$$ 35388 -127635 -90355 232792 -167689 -61847 -212381 168030 -121898 58375 105687 140662
9867A40662a22282M4767j06780M1343r4766h1931A24111P777a74150A06757C9330
$$ 140662 -122282 -77515 -184295 -142952 -237718 -81931 124111 131888 -174150 106757 39330
9855a70250G1056e1946a7693m2525A55473e10148a78153A7975J09954a49244j34157
$$ -170250 71056 -51946 -17693 -60218 155473 -510148 -178153 17975 127929 -149244 -283401
9844b83401H350a92540d0966n5769I0501N9574p4452k9874j6345a39270j8564
$$ -283401 8350 -192540 -40966 -96735 90501 150075 75623 45749 29404 -139270 -157834
9833a57834A194b04743E5980a51531B41957g5176b0608B55252a148o0468j20532
$$ -157834 1194 -204743 55980 -151531 241957 -75176 -20608 255252 -1148 -61616 -182148
9822a82148K4233B37867h2619j47977h3998b2237E2931h3881E832J57504H0982
$$ -182148 -157915 237867 -82619 -230596 -83998 -22237 52931 -83881 5832 163336 80982
9810h7828a2324A58065c29116J41024m9608R0624a6065k94697f0092A32157h5255
$$ -87828 -12324 158065 -329116 -188092 -237700 -147076 -16065 -310762 -60092 132157 -85255
9798f2100j95984c8530B76520b8990j56559Q89B73970d26160b09311Q5006K7071
$$ -62100 -258084 -38530 276520 -28990 -185549 -184660 273970 -426160 -209311 -124305 -97234
9787i7234k47062a55345c0281B58425d28308B8206g742j86432J4585r2977r84
$$ -97234 -344296 -155345 -30281 258425 -428308 28206 -7742 -194174 -179589 -272566 -273550
9776b73550D2784B56a12343N0161B5003b35291j68768a13704d6006E6833d35715
$$ -273550 42784 256 -112343 -62182 25003 -235291 -404059 -113704 -46006 56833 -435715
9764C5323J25782f3718A58011i2164G7830O211k8960J15364A4806b46116g6281
$$ 35323 161105 -63718 158011 -92164 77830 84041 55081 170445 14806 -246116 -76281
9752a32726c8738a4094A29338f7534K1625j26107E7089c41701d9978I9343B2222
$$ -132726 -38738 -14094 129338 -67534 -45909 -172016 57089 -341701 -49978 99343 22222
9740a05857l8876H2056d4939G1801N5638j9413E705e0150j44029b0263Q472A67403
$$ -105857 -144733 82056 -44939 71801 127439 108026 5705 -50150 -194179 -20263 -11791 167403
9727i2223L0673j14423a2050k84330C1625a67100B67032F9566b11692J00218k6428
$$ -92223 -61550 -175973 -12050 -296380 31625 -167100 267032 69566 -211692 -111474 -137902
9716a37902j31282b9245k16342N6404b9755k07415b0090l18194f9207E6513d25989
$$ -137902 -269184 -29245 -245587 -189183 -29755 -237170 -20090 -338284 -69207 56513 -425989
9704a19365E9472g8124r9590j51272a01318r6991C3747f4139j08647g7026F3082
$$ -119365 59472 -78124 -177714 -328986 -101318 -198309 33747 -64139 -172786 -77026 63082
9692a39319D7194O1488c03103j74115a27161k44540a31074E678J34930d5004m6799
$$ -139319 47194 108682 -303103 -477218 -127161 -371701 -131074 5678 140608 -45004 -91803
9681i1803m8306o3558A56537b49240D5421d77032e1261j87168h3741B1192a6680
$$ -91803 -140109 -203667 156537 -249240 45421 -477032 -51261 -238429 -83741 21192 -16680
9669c37722A8827b98105a33939p8777A92836g5284A41472a05251j35036Q1529
$$ -337722 18827 -298105 -133939 -212716 192836 -75284 141472 -105251 -240287 -158758
9659a58758K3145c5127n3719C2894a64070l00097a87j46801C47967B5596a65531
$$ -158758 -135613 -35127 -88846 32894 -164070 -464167 -187 -146988 347967 25596 -165531
9647b39938G0082a35225k02537a09379c4688m60554a43807e0286n1695j49144
$$ -239938 70082 -135225 -337762 -109379 -34688 -495242 -143807 -50286 -101981 -251125
9637b51125j824A32963e5538g782n8568q529o6188f6902C9657J25568f1161A51753
$$ -251125 -252949 132963 -55538 -7782 -66350 -74879 -141067 -66902 39657 165225 -61161 151753
9624E1878R1403B2294d8332c965B97733h2515B40343f7982k2752a0327A6633a15952
$$ 51878 143281 22294 -48332 -3965 297733 -82515 240343 -67982 -90734 -10327 16633 -115952
9611b59421B61187P9304H5097a46558B82144a09766l195A25071A6187N6031c30489
$$ -259421 261187 340491 85097 -146558 282144 -109766 -112961 125071 16187 72218 -330489
9599C5658a49838j40458J02308j9247B02930f93F2727f6686k76195D43348G9173
$$ 35658 -149838 -290296 -187988 -207235 202930 -693 62727 -66686 -342881 443348 79173
9587c7169l00955g0223j94914J21305r2364B32361b69976B82745a17413j2902
$$ -37169 -338124 -70223 -265137 -143832 -236196 232361 -269976 282745 -117413 -130315
9577a30315e0081a3425D3693L26791h9903k96805O8233A28551o0843a16891j05079
$$ -130315 -50081 -13425 43693 370484 -89903 -386708 -318475 128551 67708 -116891 -221970
9566b21970R031H467a61613B46826a64629b3930j4564B04934a10021b3984k9463
$$ -221970 -212939 8467 -161613 246826 -164629 -23930 -38494 204934 -110021 -23984 -53447
9555e3447b795G6806c42428d8869j76918B17977B1301J02373c10695P0166B13474
$$ -53447 -2795 76806 -342428 -48869 -225787 217977 21301 123674 -310695 -240529 213474
9543e5924j5848j66192A24192a33768d3507j37039G259a71105h1365F0818c84970
$$ -55924 -71772 -237964 124192 -133768 -43507 -180546 7259 -171105 -81365 60818 -384970
9531g9058L3000j48267I6710b26139R8321O2126F334N1600c95084A20653b3745
$$ -79058 -46058 -194325 96710 -226139 -127818 -65692 6334 57934 -395084 120653 -23745
9519D1551a2392m9713D22793c8216j47660A32597e8481l133m5479K6086j0718
$$ 41551 -12392 -62105 422793 -38216 -185876 132597 -58481 -61614 -107093 -81007 -91725
9508i1725i821l1776I8054A1302b31400c7109l4494J2606r1970B68536b46540
$$ -91725 -9821 -41597 98054 11302 -231400 -37109 -71603 -58997 -150967 268536 -246540
9496b32807B75365A06566b7619c01l59950a41997A30655a09160n0551g2859K9075
$$ -232807 275365 106566 -27619 -301 -360251 -141997 130655 -109160 -159711 -72859 -43784
9485d3784j2742R724B42059D6057a42575c960k13557H3931a23391b618k29976
$$ -43784 -56526 -46802 242059 46057 -142575 -3960 -217517 83931 -123391 -2618 -232594
9474b32594J10572A31869o762b45134j6554m9107n933a29560A15304a54459n455
$$ -232594 -122022 131869 125107 -245134 -261688 -310795 -316728 -129560 115304 -154459 -159914
9463a59914A8766a99648B7361a11210L238B72019b06616d8195E9389K260i5938
$$ -159914 18766 -199648 27361 -111210 -107972 272019 -206616 -48195 59389 61649 -95938
9451a96218p0945c6597k03382K7398d4190k14073j6332J16855m8182p969B1587
$$ -196218 -267163 -36597 -239979 -212581 -44190 -258263 -274595 -157740 -205922 -213891 21587
9439A830b35426M5977E8695a88836e4271j09206I5805M6807b9073B12035f3691
$$ 1830 -235426 -189449 58695 -188836 -54271 -163477 95805 142612 -29073 212035 -63691
9427C2162b59662A49371K7924G6583J36449b31720j23410J28190C95254b5776
$$ 32162 -259662 149371 177295 76583 213032 -231720 -355130 -226940 395254 -25776
9416A1922b78147Q8683m0339A08980a6977Q382k7256j19896c4604j9156k90418
$$ 11922 -278147 -189464 -229803 108980 -16977 -8595 -35851 -155747 -34604 -53760 -344178
9405c44178R0006c9932A27052a54056K2804j08503G5425a99304j3800d49A59992
$$ -344178 -254172 -39932 127052 -154056 -131252 -239755 75425 -199304 -213104 -449 159992
9393f1171A23004a20426A72942d2132A02358D8737a47943f7897b1766A2792K5608
$$ -61171 123004 -120426 172942 -42132 102358 48737 -147943 -67897 -21766 12792 38400
9382C8400N7610e3958j03495D8152a8728B3952J1213M8776J33502e0830j48234
$$ 38400 96010 -53958 -157453 48152 -18728 23952 35165 83941 217443 -50830 -199064
9371a99064B16303c3956r2027D22312a51956B00130F9189a73145E6623J94300
$$ -199064 216303 -33956 -125983 422312 -151956 200130 69189 -173145 56623 250923
9361B50923a68741Q3374O223j47297a00499M897m08778J77043A30563l7557D6239
$$ 250923 -168741 -85367 -79144 -226441 -100499 -95602 -504380 -327337 130563 93006 46239
9349B7030J52679D3036b13917l9493P823q490a7466j117m53620C4562B28a03021
$$ 27030 179709 43036 -213917 -253410 -245587 -254077 -17466 -18583 -472203 34562 228 -103021
9336h3904A02939c4779k29442F9293a63660m5554q2363B30692g0928C9016c96782
$$ -83904 102939 -34779 -264221 69293 -163660 -209214 -291577 230692 -70928 39016 -396782
9324A35745R0439j134B9215a04311n0058j914F4846a37799q7976R7968M0696j72410
$$ 135745 226184 225050 29215 -104311 -154369 -156283 64846 -137799 -225775 -127807 -87111 -259521
9312b59521B5397c96252a46083K9648C2693J74200G5675K2748b12527R4669j19880
$$ -259521 25397 -396252 -146083 -116435 32693 206893 75675 98423 -212527 -117858 -237738
9301b37738A50831g7661p9339D3910A8480c67756a49856k05286a35182a2198p9803
$$ -237738 150831 -77661 -157000 43910 18480 -367756 -149856 -355142 -135182 -12198 -92001
9290i2001B72411G2664R80a16725p965k28498P8299k0067A40626a16537M659L8462
$$ -92001 272411 72664 73644 -116725 -124690 -353188 -274889 -294956 140626 -116537 -111878 -73416
9278g3416k91788f5263q891j31940J3694B5198b6527m9530j57552g4222G3960
$$ -73416 -365204 -65263 -74154 -206094 -192400 25198 -26527 -76057 -233609 -74222 73960
9266E7114c241D2646a09094F008b10035c1967A68720h9775j53834c0610j03255
$$ 57114 -3241 42646 -109094 6008 -210035 -31967 168720 -89775 -243609 -30610 -133865
9255a33865l67C6344d2900D0299g3211B8960e21720A80416g1428I8771a12538
$$ -133865 -134232 36344 -42900 40299 -73211 28960 -521720 180416 -71428 98771 -112538
9243F4639b89768B24556B1318M3417b09041D7791A1019a6638m4012B7437b4506
$$ 64639 -289768 224556 21318 64735 -209041 47791 11019 -16638 -60650 27437 -24506
9231H9553k5943b44462J5466A35048c44239M3472A9605M8608g5702G8841J33058
$$ 89553 63610 -244462 -228996 135048 -344239 -300767 19605 68213 -75702 78841 211899
9220B11899F1024a81073A138c04425e696j82676J7804A92839C7084J52093J19489
$$ 211899 61024 -181073 1138 -304425 -5696 -188372 -170568 192839 37084 189177 308666
9209C08666c90184a02142C4681g7064B23147j09420L1927a23560j28754b6021
$$ 308666 -390184 -102142 34681 -77064 223147 113727 145654 -123560 -252314 -26021
9198a09575B21713q2127j2042a57923A1227b54247J15334j49518P4443D8379a86378
$$ -109575 221713 139586 127544 -157923 11227 -254247 -138913 -288431 -213988 48379 -186378
9186b575G0783M8496h1941E6534a04305k4784B3634J84244a63435Q0516n8678
$$ -2575 70783 119279 -81941 56534 -104305 -129089 23634 207878 -163435 -82919 -141597
9175a41597p1321d3362B39281a83188D7001c66221a28980A18082e0293B392d67937
$$ -141597 -212918 -43362 239281 -183188 47001 -366221 -128980 118082 -50293 2392 -467937
9163C70683b1673A59717a53024k1206A0194K43528j8829C2983O122r031h7051
$$ 370683 -21673 159717 -153024 -174230 10194 253722 234893 32983 39105 30074 -87051
9151A61024d42929G361a21102j04919O425k18995A8366b82977D7656c255j2898
$$ 161024 -442929 7361 -121102 -226021 -219596 -438591 18366 -282977 47656 -3255 -16153
9140a6153l40994J17647N7480D4672k0433J68289a77864P1016A43404b31770f3990
$$ -16153 -357147 -239500 -182020 44672 24239 192528 -177864 -106848 143404 -231770 -63990
9128d3557e408A41772d1017k39370A43548a99530B5619e7079A88132a95653H1495
$$ -43557 -5408 141772 -41017 -280387 143548 -199530 25619 -57079 188132 -195653 81495
9116B4108a5351F004O432f2457A35589k9687N9080n5785J23552d76147J07287
$$ 24108 -15351 6004 12436 -62457 135589 105902 164982 109197 232749 -476147 -368860
9105c68860J71178b1491l62906J80303i9746H7037K03978A10528c17269A48328
$$ -368860 -197682 -21491 -384397 -204094 -99746 87037 291015 110528 -317269 148328
9094G9899J28168b29004k25239A21500d1045j17050A562K92584c09633e8618j80779
$$ 79899 208067 -229004 -454243 121500 -41045 -158095 1562 294146 -309633 -58618 -239397
9083b39397b7672n1676c2643A0237O7819c25710i2991F5030a47641B73231E7445
$$ -239397 -27672 -79348 -32643 10237 78056 -325710 -92991 65030 -147641 273231 57445
9071A63702c361j51231R22j69885J17832O6505d6908k14277m1934a40042k33347
$$ 163702 -3361 -154592 -153670 -323555 -205723 -139218 -46908 -261185 -303119 -140042 -373389
9060c73389N5929A23991a32732k66745B05435e2733q3020m7540f1904A2406L6681
$$ -373389 -317460 123991 -132732 -399477 205435 -52733 -135753 -183293 -61904 12406 49087
9049D9087J94111a18366A52523J45017h4867l01043J82246A82641a50031A74741
$$ 49087 243198 -118366 152523 297540 -84867 -385910 -203664 182641 -150031 174741
9038a32532L489N3676j68298A42543a92871b6431l44774A86237j9455q1642e4787
$$ -132532 -129043 -75367 -243665 142543 -192871 -26431 -371205 186237 166782 85140 -54787
9026A09722a40761o7410O5974B03371d7717A95842c93630A04025a57516O444l3079
$$ 109722 -140761 -208171 -142197 203371 -47717 195842 -393630 104025 -157516 -151072 -184151
9015a84151A1963e7870j70932E9827a6585B1826c36988b1711k06635j76159E9884
$$ -184151 11963 -57870 -228802 59827 -16585 21826 -336988 -21711 -228346 -404505 59884
9003A5981a76431K8629E9664d8157A27142b00825I8306i5441B8272b2903B11162
$$ 15981 -176431 -147802 59664 -48157 127142 -200825 98306 -95441 28272 -22903 211162
8991A75084A8439N746c20152a11724a2266k11595C1719a79143c4642j83861A78247
$$ 175084 18439 24185 -320152 -111724 -12266 -223861 31719 -179143 -34642 -218503 178247
8979D0593J55273c94668A03832a24670j0034C39941B0566J7549c05041P8235L2049
$$ 40593 195866 -394668 103832 -124670 -134704 339941 20566 38115 -305041 -226806 -194757
8968a94757j89213B13417M3476r3616A301b38370F2421F955L08490b09658e4208
$$ -194757 -383970 213417 256893 163277 1301 -238370 62421 6955 315445 -209658 -54208
8956a54206N4346n5359P4669r7932K8896l7154G1830J09962a30433n5828C06449
$$ -154206 -99860 -155219 -80550 -178482 -149586 -186740 71830 181792 -130433 -186261 306449
8944i1310H5715b39696E4781a18791L3792c2589p3381j49034A41108d48233a21793
$$ -91310 85715 -239696 54781 -118791 -84999 -32589 -105970 -255004 141108 -448233 -121793
8932C1760b07566G5368R3674a38348b3048A76256o8542k397a28996j30307A60354
$$ 31760 -207566 75368 169042 -138348 -23048 176256 107714 105317 -128996 -259303 160354
8920e2568j8694C8814a13365c413B84647J4362e6419r2271C08279A08629Q5081
$$ -52568 -71262 38814 -113365 -3413 284647 299009 -56419 -148690 308279 108629 193710
8909A93710j9376K27611j65456N03677R10700J426683K863791j830950j705899
$$ 193710 174334 401945 236489 740166 1650866 3077549 5941340 4110390 2404491
8900B404491j198075n38558R0442C30176o8146L9441J23376g1044A32543A3065
$$ 2404491 1206416 667858 758300 330176 262030 301471 424847 -71044 132543 13065
8889I9109L65047b87649i7210H3545c94966A81192K05138A42412h416A43636h5929
$$ 99109 464156 -287649 -97210 83545 -394966 181192 386330 142412 -8416 143636 -85929
8877d303A13199g206r9965L838l50659A59171N5309I7485g426j35317D0169a59186
$$ -4303 113199 -7206 -107171 -103333 -453992 159171 214480 97485 -7426 -142743 40169 -159186
8864d7222p8359K497b028D19442a38055k28894a32200D9263c59912a71392A71599
$$ -47222 -125581 -123084 -2028 419442 -138055 -366949 -132200 49263 -359912 -171392 171599
8852b28148j2806F2405M0311D0745b73769f0421j54152K9928O9354q9787p1251
$$ -228148 -240954 62405 102716 40745 -273769 -60421 -214573 -184645 -115291 -205078 -276329
8841b76329R5465B11706a42107m8700D5210J54756i1446m2614j8331B36340g5245
$$ -276329 -180864 211706 -142107 -190807 45210 199966 -91446 -134060 -152391 236340 -75245
$$ [...]
##END NTUPLES=NMR SPECTRUM
##END=
