
##TITLE=AC1193_1089_5867906_VjN5j14SWM
##JCAMPDX= 6.0         $$ Bruker NMR JCAMP-DX V2.0
##DATA TYPE= NMR SPECTRUM
##DATA CLASS= NTUPLES
##ORIGIN= BRUKER
##OWNER= Administrator
$$ 1.72 TOPSPIN		Version 2.1
$$ 2012-03-31 02:56:45.156 -0500  Administrator@TOPSPIN
$$ Compression mode = diff/dup
##.OBSERVE FREQUENCY= 400.13188235
##.OBSERVE NUCLEUS= ^1H
##.ACQUISITION MODE= SIMULTANEOUS (DQD)
##.ACQUISITION SCHEME= undefined
##.AVERAGES= 8
##.DIGITISER RES= 22
##SPECTROMETER/DATA SYSTEM= spect
##.PULSE SEQUENCE= zg30
##.SOLVENT NAME= COFFEE_meoh
##.SHIFT REFERENCE= INTERNAL, COFFEE_meoh, 1, 14.98061
##AUDIT TRAIL= $$ (NUMBER, WHEN, WHO, WHERE, PROCESS, VERSION, WHAT)
$$ ##TITLE= Audit trail, TOPSPIN		Version 2.1
$$ ##JCAMPDX= 5.01
$$ ##ORIGIN= Bruker BioSpin GmbH
$$ ##OWNER= Administrator
$$ $$ C:\Bruker\TOPSPIN/data/COFFEE/nmr/AC1193_1089_5867906_VjN5j14SWM/10/pdata/1/auditp.txt
$$ ##AUDIT TRAIL=  $$ (NUMBER, WHEN, WHO, WHERE, PROCESS, VERSION, WHAT)
(   1,<2012-03-31 02:56:38.171 -0500>,<Administrator>,<TOPSPIN>,<go>,<TOPSPIN 2.1>,
      <created by zg
	started at 2012-03-31 02:55:31.625 -0500,
	POWCHK enabled, PULCHK disabled,
       configuration hash MD5:
       1A 1E CE 29 27 FD 77 03 67 4E F0 E3 C4 B2 CB 90
       data hash MD5: 64K
       59 64 39 C2 ED FA 71 E4 B9 1B 1A DC 5B 07 EA 3E>)
(   2,<2012-03-31 02:56:40.750 -0500>,<Administrator>,<TOPSPIN>,<proc1d>,<TOPSPIN 2.1>,
      <Start of raw data processing
       efp LB = 0 FT_mod = 6 PKNL = 1 PHC0 = 0 PHC1 = 0 SI = 32K 
       data hash MD5: 32K
       57 2C E2 11 73 89 CF 91 92 E6 10 B8 5F 59 D9 C7>)
(   3,<2012-03-31 02:56:41.140 -0500>,<Administrator>,<TOPSPIN>,<proc1d>,<TOPSPIN 2.1>,
      <pk PHC0 = 209.6741 PHC1 = 0 
       data hash MD5: 32K
       FE 23 18 B0 0A 88 D6 EC 80 F6 30 EE B6 E9 54 39>)
(   4,<2012-03-31 02:56:41.234 -0500>,<Administrator>,<TOPSPIN>,<proc1d>,<TOPSPIN 2.1>,
      <abs ABSG = 1 
       data hash MD5: 32K
       30 74 B7 F1 CC 27 91 6D 78 68 34 36 E6 3A C4 57>)
(   5,<2012-03-31 02:56:41.312 -0500>,<Administrator>,<TOPSPIN>,<proc1d>,<TOPSPIN 2.1>,
      <abs ABSG = 2 
       data hash MD5: 32K
       6B 78 42 41 B7 CB B4 67 FD 4C 0F 2F 0D 99 74 6B>)
(   6,<2012-03-31 02:56:41.343 -0500>,<Administrator>,<TOPSPIN>,<proc1d>,<TOPSPIN 2.1>,
      <abs ABSG = 3 
       data hash MD5: 32K
       87 79 D3 99 9A 16 05 CE 79 9C BD 86 9B EF DA B0>)
(   7,<2012-03-31 02:56:41.375 -0500>,<Administrator>,<TOPSPIN>,<proc1d>,<TOPSPIN 2.1>,
      <abs ABSG = 4 
       data hash MD5: 32K
       5F C1 D3 27 21 DE DE 94 BD 4F F0 50 01 B5 30 CF>)
(   8,<2012-03-31 02:56:41.390 -0500>,<Administrator>,<TOPSPIN>,<proc1d>,<TOPSPIN 2.1>,
      <abs ABSG = 5 
       data hash MD5: 32K
       8A 03 39 43 1C 78 27 48 85 16 BC 18 E3 F0 06 1B>)
$$ ##END=
$$ 
$$ $$ hash MD5
$$ $$ EB 8D 72 30 42 DD 7E 89 BB 9F E0 F5 01 EA BA A3
##$RELAX= 
##$RELAX= 
##$RELAX= 
##$RELAX= 
##$RELAX= 
##$RELAX= 
##$RELAX= 
$$ Bruker specific parameters
$$ --------------------------
$$ [...]
##$TP= (0..7)
150 150 150 150 150 150 150 150
##$TP07= 0
##$TPNAME0= <>
##$TPNAME1= <>
##$TPNAME2= <>
##$TPNAME3= <>
##$TPNAME4= <>
##$TPNAME5= <>
##$TPNAME6= <>
##$TPNAME7= <>
##$TPOAL= (0..7)
0.5 0.5 0.5 0.5 0.5 0.5 0.5 0.5
##$TPOFFS= (0..7)
0 0 0 0 0 0 0 0
##$TUNHIN= 0
##$TUNHOUT= 0
##$TUNXOUT= 0
##$USERA1= <user>
##$USERA2= <user>
##$USERA3= <user>
##$USERA4= <user>
##$USERA5= <user>
##$V9= 5
##$VALIST= <valist>
##$VCLIST= <CCCCCCCCCCCCCCC>
##$VD= 0
##$VDLIST= <DDDDDDDDDDDDDDD>
##$VPLIST= <PPPPPPPPPPPPPPP>
##$VTLIST= <TTTTTTTTTTTTTTT>
##$WBST= 2048
##$WBSW= 25
##$XGAIN= (0..3)
0 0 0 0
##$XL= 0
##$YL= 0
##$YMAX_a= 547729
##$YMIN_a= -668380
##$ZGOPTNS= <>
##$ZL1= 120
##$ZL2= 120
##$ZL3= 120
##$ZL4= 120
##$ABSF1= 14.98061
##$ABSF2= -5.57192
##$ABSG= 5
##$ABSL= 3
##$ALPHA= 0
##$AQORDER= 0
##$ASSFAC= 0
##$ASSFACI= 0
##$ASSFACX= 0
##$ASSWID= 0
##$AUNMP= <proc_prof1d_extract_pilot.lims>
##$AXLEFT= 0
##$AXNAME= <>
##$AXNUC= <1H>
##$AXRIGHT= 0
##$AXTYPE= 0
##$AXUNIT= <>
##$AZFE= 0.1
##$AZFW= 0.1
##$BCFW= 0
##$BC_mod= 0
##$BYTORDP= 0
##$COROFFS= 0
##$CY= 15
##$DATMOD= 1
##$DC= 0
##$DFILT= <>
##$DTYPP= 0
##$F1P= 0
##$F2P= 0
##$FCOR= 0.5
##$FTSIZE= 32768
##$FT_mod= 6
##$GAMMA= 0
##$GB= 0
##$INTBC= 1
##$INTSCL= 1
##$ISEN= 128
##$LB= 0
##$LEV0= 0
##$LPBIN= 0
##$MAXI= 10000
##$MC2= 0
##$MEAN= 0
##$ME_mod= 0
##$MI= 0
##$NCOEF= 0
##$NC_proc= -8
##$NLEV= 6
##$NOISF1= 0
##$NOISF2= 0
##$NSP= 0
##$NTH_PI= 0
##$NZP= 0
##$OFFSET= 14.98061
##$PC= 1
##$PHC0= 209.6741
##$PHC1= 0
##$PH_mod= 1
##$PKNL= yes
##$PPARMOD= 0
##$PPDIAG= 0
##$PPIPTYP= 0
##$PPMPNUM= 2147483647
##$PPRESOL= 1
##$PSCAL= 4
##$PSIGN= 0
##$PYNMP= <proc.py>
##$REVERSE= no
##$SF= 400.13
##$SI= 32768
##$SIGF1= 0
##$SIGF2= 0
##$SINO= 400
##$SIOLD= 32768
##$SPECTYP= <>
##$SREGLST= <1H.CDCl3>
##$SSB= 0
##$STSI= 32768
##$STSR= 0
##$SW_p= 8223.68421052632
##$SYMM= 0
##$S_DEV= 0
##$TDeff= 65536
##$TDoff= 0
##$TI= <>
##$TILT= no
##$TM1= 0
##$TM2= 0
##$TOPLEV= 0
##$USERP1= <user>
##$USERP2= <user>
##$USERP3= <user>
##$USERP4= <user>
##$USERP5= <user>
##$WDW= 1
##$XDIM= 32768
##$YMAX_p= 473186916
##$YMIN_p= -663247
##$CURPLOT= <Network HP LaserJet P1505>
##$CURPRIN= <$Network HP LaserJet P1505>
##$DFORMAT= <normdp>
##$LAYOUT= <+/1D_H.xwp>
##$LFORMAT= <normlp>
##$PFORMAT= <normpl>
##$SURQMSG= 1
$$ End of Bruker specific parameters
$$ ---------------------------------
##NTUPLES= NMR SPECTRUM
##VAR_NAME=  FREQUENCY,     SPECTRUM/REAL,   SPECTRUM/IMAG
##SYMBOL=    X,             R,               I
##VAR_TYPE=  INDEPENDENT,   DEPENDENT,       DEPENDENT
##VAR_FORM=  AFFN,          ASDF,            ASDF
##VAR_DIM=   32768,         32768,           32768
##UNITS=     HZ,            ARBITRARY UNITS, ARBITRARY UNITS
##FACTOR=    0.250966925370066, 1,           1
##FIRST=     8223.43324360095, 191635,       29785
##LAST=      0,             -182196,         68447
##MIN=       0,             -663247,         0
##MAX=       8223.43324360095, 473186916,    0
$$ Real data points
##PAGE= N=1
##DATA TABLE= (X++(R..R)), XYDATA
$$ [...]
19536a37795l3188g6779K5641B16979c3124j04256k46933a06379H011b85717a649
$$ -137795 -170983 -76779 -51138 216979 -33124 -137380 -384313 -106379 8011 -285717 -1649
19524G7312c39463e1557A20761D025J35766c62266k5469f4096l8758J7450k84557
$$ 77312 -339463 -51557 120761 4025 139791 -362266 -387735 -64096 -102854 -85404 -369961
19513c69961L5284a1735j5080B83590A5939J43280a76376j16878C51384c6499
$$ -369961 -334677 -11735 -26815 283590 15939 159219 -176376 -293254 351384 -36499
19502i8692O085B22839j06192C3678Q2818b01009e4888k06692j37902A7815L31520
$$ -98692 -92607 222839 116647 33678 116496 -201009 -54888 -261580 -399482 17815 349335
19491C49335A29716b5062A19047b82715d1580j86215a13566F9290a06566C2331
$$ 349335 129716 -25062 119047 -282715 -41580 -227795 -113566 69290 -106566 32331
19480C3708d5238G7765i4932k25300K931a09520j2445b8349B4016a95339j83316
$$ 33708 -45238 77765 -94932 -320232 -317301 -109520 -121965 -28349 24016 -195339 -378655
19469c78655H5522h2975b2085l8235j7678A16647K17817b29k41913k02690A34675
$$ -378655 85522 -82975 -22085 -60320 -77998 116647 334464 -229 -242142 -444832 134675
19457B70977a49917q2173j6423I2072a81654O9421m7995b1691j13212j242j97837
$$ 270977 -149917 -232090 -248513 92072 -181654 -112233 -160228 -21691 -134903 -136145 -333982
19446c33982C8925d963C1983c63849L4015O9758c316j20234I8382a9185A71546
$$ -333982 38925 -4963 31983 -363849 -329834 -260076 -3316 -123550 98382 -19185 171546
19434a27039k12670a16601A35656L9665b99563B4602b7832a2268H2848b65050
$$ -127039 -339709 -116601 135656 175321 -299563 24602 -27832 -12268 82848 -265050
19423A0099D598a03751A91024b02166B20861f8298D9821l369M5248b63026B63313
$$ 10099 4598 -103751 191024 -202166 220861 -68298 49821 46452 91700 -263026 263313
19411E9714d29064A70394b55375A31076g0661o0516e1210k92485J26332A99979
$$ 59714 -429064 170394 -255375 131076 -70661 -131177 -51210 -343695 -217363 199979
19400c5618A33606B9054a83859B65420f8513n4411k5424C52467e7654j01284C2932
$$ -35618 133606 29054 -183859 265420 -68513 -122924 -148348 352467 -57654 -158938 32932
19388a95273A18477J22871B4645J00209h4350m8001j4981A16808b21344A89616
$$ -195273 118477 241348 24645 124854 -84350 -132351 -147332 116808 -221344 189616
19377c9002l02555B1770J82390a99539a4901I9733N6106e5727N717j99742A72216
$$ -39002 -341557 21770 204160 -199539 -14901 99733 155839 -55727 -50010 -249752 172216
19365i5358m9696G676Q6464h2808F1350c99288Q8799B0096e5748j72897d9857
$$ -95358 -145054 7676 94140 -82808 61350 -399288 -310489 20096 -55748 -228645 -49857
19353i7782k88776c9988l41887D7244b66383b4400q0208J9681A2697J94137b29744
$$ -97782 -386558 -39988 -381875 47244 -266383 -24400 -104608 -84927 12697 206834 -229744
19341c54720J52154H9657L4321a26429B97882a49527q9972J09022A69511e20234
$$ -354720 -202566 89657 123978 -126429 297882 -149527 -239499 -130477 169511 -520234
19330B73225A10249i6174k2895L0673J0651l7705A33787c84871J31137Q134C76017
$$ 273225 110249 -96174 -119069 -88396 -77745 -115450 133787 -384871 -253734 -245600 376017
19318a39041B65551d1839k41059Q4450L1203D2159A335a61757A82434b1153H3426
$$ -139041 265551 -41839 -282898 -198448 -167245 42159 1335 -161757 182434 -21153 83426
19306g2726o1486e1567n3883j268J7125F5216b41404Q4090J8487d8503B1097a43228
$$ -72726 -134212 -51567 -105450 -106718 -89593 65216 -241404 -157314 -138827 -48503 21097 -143228
19293g8465k32469D4849e0530j95179J7538D1558a87231N8628A46770b15061G0237
$$ -78465 -310934 44849 -50530 -245709 -228171 41558 -187231 -128603 146770 -215061 70237
19281D6091M096d8441k15o7204j16684a10241L7757J003B0383R5182n4833M6096
$$ 46091 50187 -48441 -48656 -115860 -232544 -110241 -72484 -71481 20383 115565 60732 106828
19269A06828a53448A98503b74503c7613a4531k73894a39016J8477A10142g2859
$$ 106828 -153448 198503 -274503 -37613 -14531 -288425 -139016 -120539 110142 -72859
19258B06974b84568h8810F1603L7847g1523a5580B19695E2178K09964o9388a41220
$$ 206974 -284568 -88810 61603 99450 -71523 -15580 219695 52178 262142 192754 -141220
19246b72023R6143A64250a55135j10312r2979a73476Q3503J4526C16953a3353
$$ -272023 -175880 164250 -155135 -265447 -358426 -173476 -89973 -75447 316953 -13353
19235G4572c36086i1675K5636j64755H4899a06351F2542k8809b3902l1528A04383
$$ 74572 -336086 -91675 -66039 -230794 84899 -106351 62542 33733 -23902 -55430 104383
19223A58803Q7934c687A17737B767a68834a7806C45738j43621a85847A57229f8845
$$ 158803 246737 -3687 117737 2767 -168834 -17806 345738 202117 -185847 157229 -68845
19211a22193A8243J378c58336g2488F8552a2539j23864q6737B9208i3344m9970
$$ -122193 18243 19621 -358336 -72488 68552 -12539 -136403 -223140 29208 -93344 -143314
19200a43314a4510k2882o7005B62213f2846D8516a71960C580N143i4703r893A35387
$$ -143314 -14510 -37392 -104397 262213 -62846 48516 -171960 3580 8723 -94703 -104596 135387
19187e2048D4063h4958B45534I2855c7212A8272i9527k53865E6830J61171b50356
$$ -52048 44063 -84958 245534 92855 -37212 18272 -99527 -353392 56830 218001 -250356
19175c4741G408a66593I8854B6168c80046i5982a4211F0589b0129j07054F253
$$ -34741 7408 -166593 98854 26168 -380046 -95982 -14211 60589 -20129 -127183 6253
19163A6353a4728l1961A14186f516B00939a82153Q1870j07478k1229R5427L8761
$$ 16353 -14728 -46689 114186 -6516 200939 -182153 -100283 -207761 -228990 -133563 -94802
19152i4802a9037j61607m1677P5596D4161R3264c33593i3181j83417I5284O926
$$ -94802 -19037 -180644 -222321 -146725 44161 137425 -333593 -93181 -276598 95284 102210
19141A02210c44126p9686a14077A02828b36837J11898q5081Q0617j88823N8128
$$ 102210 -344126 -423812 -114077 102828 -236837 -124939 -210020 -129403 -318226 -260098
19131b60098Q9207C1335a17003G3674a92132E5874a01840k38280c5073H5600l2553
$$ -260098 -170891 31335 -117003 73674 -192132 55874 -101840 -340120 -35073 85600 53047
19120E3047A0601b62213E2356A5686a01146A06862b84589R2798B03097G4249N6831
$$ 53047 10601 -262213 52356 15686 -101146 106862 -284589 -191791 203097 74249 131080
19109A31080c685A3212J34517a32245F8544C0908Q8500C254d0126H9281L8275
$$ 131080 -3685 13212 147729 -132245 68544 30908 119408 3254 -40126 89281 127556
19098A27556a10686B89595a42063G9243J57310b06446G7314N2587b52043f5522
$$ 127556 -110686 289595 -142063 79243 236553 -206446 77314 129901 -252043 -65522
19087a00803r5155C33303A41218b29927d4356D1892g5484j19040f4430D6061J58725
$$ -100803 -195958 333303 141218 -229927 -44356 41892 -75484 -194524 -64430 46061 204786
19076B04786H004h5670B99219a61472H9931a79178O001H0278b8801A30398g6924
$$ 204786 8004 -85670 299219 -161472 89931 -179178 -173177 80278 -28801 130398 -76924
19064c78316l1356J05151a02644n4674B45544E769c18351p1123e4467j28343f1887
$$ -378316 -409672 -304521 -102644 -157318 245544 5769 -318351 -389474 -54467 -182810 -61887
19052B30566b80081A54025a05944k6602A20489c55723d0127q2621c2184A48459
$$ 230566 -280081 154025 -105944 -132546 120489 -355723 -40127 -122748 -32184 148459
19041A94701b5071G7825a31174d6767n454A17587c66942m5034O636i7369k40138
$$ 194701 -25071 77825 -131174 -46767 -52221 117587 -366942 -411976 -405340 -97369 -337507
19030c37507d0803a1316j97096D7044D161Q5759m0997a2007A51172b15056p2479
$$ -337507 -40803 -11316 -208412 47044 4161 89920 48923 -12007 151172 -215056 -287535
19019b87535A90442B3053N00935b7072F5196R6423B4607J65841a42044N1066E0987
$$ -287535 190442 23053 523988 -27072 65196 161619 24607 190448 -142044 -90978 50987
19007H7650b79791c3406o3467d3884n52818A63358F7253g1131k05821g1194B39204
$$ 87650 -279791 -33406 -96873 -43884 -596702 163358 67253 -71131 -276952 -71194 239204
18995g7918j91240B0375h5377C1898g0690P356k00860f6519I5953J27569D174
$$ -77918 -269158 20375 -85377 31898 -70690 -63334 -264194 -66519 95953 223522 4174
18983B00724F1443a59633j79070I3586b02252j06617m4050A25814j17k7837Q8638
$$ 200724 61443 -159633 -338703 93586 -202252 -308869 -352919 125814 125697 97860 186498
18972A86498F9491f4533A23344l8458a95790C04404a67598K4953B71647a21255
$$ 186498 69491 -64533 123344 84886 -195790 304404 -167598 -142645 271647 -121255
18961h8111l8842C5441F872a30915N4707k43259M9519A47243c23488A68772c3102
$$ -88111 -126953 35441 6872 -130915 -76208 -319467 -269948 147243 -323488 168772 -33102
18949f0814n8635n5408B74089a64391j23108e48j2457D3354K32358g2324A08891
$$ -60814 -119449 -174857 274089 -164391 -287499 -548 -13005 43354 275712 -72324 108891
18937c76215a43329A73070c17096B51767B4708a84171M6328B43854b32400a03448
$$ -376215 -143329 173070 -317096 251767 24708 -184171 -137843 243854 -232400 -103448
18926B14192a36689n4564H4547d5658p0682E999b09813D4486i0061G5908g7071
$$ 214192 -136689 -191253 84547 -45658 -116340 5999 -209813 44486 -90061 75908 -77071
18914a25471D1728A8321M2789a01967J7742c3969G1228f6958A96542a78774G1040
$$ -125471 41728 18321 61110 -101967 -84225 -33969 71228 -66958 196542 -178774 71040
18902B6278a79932A45203B2987J63651b79557b215A91920a1493D1726a48043L3468
$$ 26278 -179932 145203 22987 186638 -279557 -2215 191920 -11493 41726 -148043 -114575
18891a14575o8997J8083k22403J81988e2694A21073N3238a18070M7949B4806g702
$$ -114575 -183572 -165489 -387892 -205904 -52694 121073 174311 -118070 -70121 24806 -7702
18879B52554B0681f1640B41029a97440M5920E6588f1601A11625a92275B96209
$$ 252554 20681 -61640 241029 -197440 -151520 56588 -61601 111625 -192275 296209
18868h1659B54195g2967B92557e2948k6041j64935g4211B16699a15474C1558O1972
$$ -81659 254195 -72967 292557 -52948 -78989 -243924 -74211 216699 -115474 31558 93530
18857I3530c727E706c0074p5723A67539L4029e541j03103j85115c0508A24592
$$ 93530 -3727 5706 -30074 -105797 167539 201568 -5541 -108644 -293759 -30508 124592
18845A67228a29802j78547a03070K2666q6762j38132I9872a46473j41912J09230
$$ 167228 -129802 -308349 -103070 -80404 -167166 -305298 99872 -146473 -288385 -179155
18835a79155F047b09301C0968a28981A25978b3180j80332Q8684j46397A23764
$$ -179155 6047 -209301 30968 -128981 125978 -23180 -203512 -114828 -261225 123764
18824e3747C545d786j83675B04636M3849d05356A39209J61024j32472C5502A1776
$$ -53747 3545 -4786 -188461 204636 248485 -405356 139209 300233 167761 35502 11776
18812d01531F1915c07319b0818A24295a85282A0385R5127g5441j96816C84792
$$ -401531 61915 -307319 -20818 124295 -185282 10385 105512 -75441 -272257 384792
18801A35723E2475F535b6592A28052B7230L47819G0489G860a57051A4171J92047
$$ 135723 52475 6535 -26592 128052 27230 375049 70489 7860 -157051 14171 206218
18790B06218H1625J03597d1382j27418A08992a97803j88151J19601m6416B09572
$$ 206218 81625 185222 -41382 -168800 108992 -197803 -385954 -266353 -312769 209572
18779c06515P0570j81925B7544K18061j11802K9844E4390h9265A03709b16865
$$ -306515 -235945 -417870 27544 245605 133803 163647 54390 -89265 103709 -216865
18768b41388H0110a93897A37851a07288A02642a02954o1539B6925d5854B28443
$$ -241388 80110 -193897 137851 -107288 102642 -102954 -164493 26925 -45854 228443
18757b48149M7671A58887o1034a21759F687b8835j99170B8157f8649j52014A67546
$$ -248149 -200478 158887 97853 -121759 6687 -28835 -228005 28157 -68649 -220663 167546
18745A72819o919a81808h4084q1295h449B79557j05933h4177C2652c04468B4768
$$ 172819 165900 -181808 -84084 -165379 -8449 279557 173624 -84177 32652 -304468 24768
18733i3962A02019m5353E639K6166c25584a62716E8988b43670k568G1772a86457
$$ -93962 102019 56666 5639 31805 -325584 -162716 58988 -243670 -246238 71772 -186457
18721d27589b06168o0806g7291o3664F963a86823A01640M9919e7506A23823c0599
$$ -427589 -206168 -266974 -77291 -140955 6963 -186823 101640 151559 -57506 123823 -30599
18709A67946a9343A21377E2472Q7347c57217h7548A13235j1053K7861b0548C60010
$$ 167946 -19343 121377 52472 139819 -357217 -87548 113235 102182 130043 -20548 360010
18697a39001j5945M6047Q530C286b7441g96B5487K12627b29093e0565A32748B3598
$$ -139001 -154946 -108899 -100369 3286 -27441 -796 25487 238114 -229093 -50565 132748 23598
18684b13528D2521a88233M2041a7043m9076A09164F42b05299j44078B17034a47881
$$ -213528 42521 -188233 -146192 -17043 -66119 109164 642 -205299 -349377 217034 -147881
18672a21521k00602A4680a86953Q5727j88286A20706a90747A61086R103b78979
$$ -121521 -322123 14680 -186953 -101226 -289512 120706 -190747 161086 170189 -278979
18661I6567K5815b0247l96287A99741a9223k02601r9660g1114F4808K92413b90570
$$ 96567 122382 -20247 -416534 199741 -19223 -221824 -321484 -71114 64808 357221 -290570
18649a35793M0068I5131a40001j99998j62226J46784B9600c62950J59715l315
$$ -135793 -95725 95131 -140001 -339999 -502225 -355441 29600 -362950 -203235 -206550
18639b06550M1110k2566d6398j2597A30398a23826j47165B48414b21017a6163
$$ -206550 -165440 -188006 -46398 -58995 130398 -123826 -270991 248414 -221017 -16163
18628F0287K04401F8873a30289R287A6643R982c1454C70754B2539b51747A1099
$$ 60287 264688 68873 -130289 -121002 16643 26625 -31454 370754 22539 -251747 11099
18616a34516j47411a28481k93629c5724j0385B50376a38975O1279l7203D7632
$$ -134516 -281927 -128481 -422110 -35724 -46109 250376 -138975 -77696 -114899 47632
18605B3888b9183B22672a16225k1294A09862a55230e2801j34972K8357B21310
$$ 23888 -29183 222672 -116225 -137519 109862 -155230 -52801 -187773 -159416 221310
18594a31273l215k0170j20962J21007g1267B2195c3101D0730a08209d3988A8804
$$ -131273 -134488 -154658 -275620 -154613 -71267 22195 -33101 40730 -108209 -43988 18804
18582a57376o9773j2667h7761A03573I93J01730a63572L5985e1419I5728i2467
$$ -157376 -227149 -239816 -87761 103573 993 102723 -163572 -127587 -51419 95728 -92467
18570a85187h289r7450A2694i0444C56212j55259d37084B1164g2738k8142A6205
$$ -185187 -8289 -105739 12694 -90444 356212 200953 -437084 21164 -72738 -100880 16205
18558b60923d8111j8545C0237a01796m1669E6770J9270b17137Q4152m943F9341
$$ -260923 -48111 -66656 30237 -101796 -143465 56770 76040 -217137 -132985 -137928 69341
18546e5454l6328B80272a22508H2686b55325H2847a9804j37244d407A0177R6411
$$ -55454 -91782 280272 -122508 82686 -255325 82847 -19804 -157048 -4407 10177 106588
18535A06588a04826j88421R6255A88721B1368e46256a48478c8387G8090J21927
$$ 106588 -104826 -293247 -196992 188721 21368 -546256 -148478 -38387 78090 200017
18525B00017F7106i6111D6741b90755C2020L326k224q427a9440H6971c34749e5829
$$ 200017 67106 -96111 46741 -290755 32020 35346 33122 24695 -19440 86971 -334749 -55829
18512A80109N6403d6414j06351I4852b48100j27205A05085O1364b6661B8761a64695
$$ 180109 236512 -46414 -152765 94852 -248100 -375305 105085 166449 -26661 28761 -164695
18500B21648a59048b750A56926K01834c37765J04436b9682A6770B625e8551l7742
$$ 221648 -159048 -2750 156926 358760 -337765 -233329 -29682 16770 2625 -58551 -96293
18489i6293m1871n2618e269j90236D3586K6561d7880D5551c6983J5350A80302
$$ -96293 -138164 -190782 -5269 -195505 43586 70147 -47880 45551 -36983 -21633 180302
18477D9326a40740A45953m5867a43233A11723i1858l63020i5182K7834m9898a9402
$$ 49326 -140740 145953 100086 -143233 111723 -91858 -454878 -95182 -67348 -117246 -19402
18465d4663A53606c39559h8547K0839C6580a61789j70958a29743m4396B1732f2198
$$ -44663 153606 -339559 -88547 -67708 36580 -161789 -332747 -129743 -174139 21732 -62198
18453B6258K20617a51211A46005b12620O0887p0162A14067c65391B8993a85511
$$ 26258 246875 -151211 146005 -212620 -151733 -221895 114067 -365391 28993 -185511
18442A52588a79110j22022F5197J84974b33301i0768J1250L6657j07746n2052
$$ 152588 -179110 -301132 65197 250171 -233301 -90768 -79518 -42861 -150607 -202659
18432b02659P0079e9389j86344B65890c7805k84028a53682A63344A0335J05165
$$ -202659 -132580 -59389 -245733 265890 -37805 -321833 -153682 163344 10335 115500
18422A15500b2378A69218K2603g4965k7999G7285e6923k95001C59118b43556b5706
$$ 115500 -22378 169218 191821 -74965 -102964 77285 -56923 -351924 359118 -243556 -25706
18410A09838P9491G4408h0267R76n2279f0340a4152G5140h685j6025B18279N2702
$$ 109838 189329 74408 -80267 -79291 -131570 -60340 -14152 75140 -8685 -24710 218279 270981
18398B70981i8966B66752A32703b05817A97404K7909H6418M9680m3377q12J5349
$$ 270981 -98966 266752 132703 -205817 197404 225313 86418 136098 92721 91909 107258
18387A07258d7279G4071c36245E66832b15773N0818H5115L85J56624E2291N5839
$$ 107258 -47279 74071 -336245 566832 -215773 -164955 85115 85500 242124 52291 108130
18376A08130i7723A12411a76801B58693b62932h7232j60355H8076h7396O225F036
$$ 108130 -97723 112411 -176801 258693 -262932 -87232 -247587 88076 -87396 -81171 6036
18364e0847l3755p5755c6438p3530a7186j50989A08791J10136h5633K4209B17175
$$ -50847 -84602 -160357 -36438 -109968 -17186 -168175 108791 218927 -85633 -61424 217175
18352g4754j0202H2767L32594g1351p3689j31043n642K4149b8974j22331F2636
$$ -74754 -84956 82767 415361 -71351 -145040 -276083 -281725 -257576 -28974 -151305 62636
18340c6919k32380C99451C322c7007B3306a61813B30368c74504J07555d7338b0513
$$ -36919 -269299 399451 3322 -37007 23306 -161813 230368 -374504 -266949 -47338 -20513
18328B18417a52311E516Q0791A9779J52510C6766i7056k9610n5251Q1350j63416
$$ 218417 -152311 5516 86307 19779 172289 36766 -97056 -126666 -181917 -100567 -263983
18317b63983F8050g0351k5405o9110b4758j89022H619a07553m4484L9004A86918
$$ -263983 68050 -70351 -95756 -164866 -24758 -213780 8619 -107553 -152037 -113033 186918
18305A80827b8501I4932J11977E0999a31729l4020E5488K29618b96524J44809
$$ 180827 -28501 94932 206909 50999 -131729 -165749 55488 285106 -296524 -151715
18295a51715B6483K31321d9948l6529e628j22250m92992a57448E136b39098J07119
$$ -151715 26483 257804 -49948 -86477 -5628 -127878 -620870 -157448 5136 -239098 -131979
18284a31979C57187A12754f0507a6761A39784K6841a164A77442b03572Q2780b4680
$$ -131979 357187 112754 -60507 -16761 139784 166625 -1164 177442 -203572 -120792 -24680
18272a100l1503j11118j69309a18601B63150e2901j99677L6840O1110A47150f3565
$$ -1100 -32603 -143721 -313030 -118601 263150 -52901 -252578 -215738 -154628 147150 -63565
18260D1492a33017A22723c6539H4613e354l42580a57384I8087J85993a75428a6573
$$ 41492 -133017 122723 -36539 84613 -5354 -347934 -157384 98087 284080 -175428 -16573
18248D4552A7966c5600p2481B35022L0787M4722C4568K5316p405J56540h3186
$$ 44552 17966 -35600 -108081 235022 265809 310531 34568 59884 52479 209019 -83186
18236b57125A10594i8671j2965A76402e04352a54474J0719B17971k5793p7873
$$ -257125 110594 -98671 -111636 176402 -504352 -154474 -143755 217971 192178 114305
18226A14305a43231b6970n367j39335H3437a74819l0898j13351C788J28739i7696
$$ 114305 -143231 -26970 -32337 -171672 83437 -174819 -205717 -319068 3788 132527 -97696
18214a58672j86769A37066E6940a4481j83804b4332j1752A36062K8272e4466l93792
$$ -158672 -345441 137066 56940 -14481 -198285 -24332 -36084 136062 164334 -54466 -448258
18203d48258b733B31824b10651E40587a55231I1502Q6287H5027a02479j31124
$$ -448258 -2733 231824 -210651 540587 -155231 91502 177789 85027 -102479 -233603
18193b33603c8828m294l1699G013a33006J9118b5105A61887C3840a90104f1071
$$ -233603 -38828 -43122 -74821 7013 -133006 -113888 -25105 161887 33840 -190104 -61071
18181D6275Q1552A9407b09868f9315C00627b59331C5969c4116l73150a00844c8090
$$ 46275 127827 19407 -209868 -69315 300627 -259331 35969 -34116 -407266 -100844 -38090
18169I5835J11190c4494l5976D72958A18545a40482e6815q6521A65228h4420A52755
$$ 95835 207025 -34494 -70470 472958 118545 -140482 -56815 -143336 165228 -84420 152755
18157a04191m64j53059G148c0270D0905L69815G0013R347C9191q066a79278j1559
$$ -104191 -104655 -257714 7148 -30270 40905 410720 70013 79360 39191 31125 -179278 -190837
18145a90837A93600a33404k9322H7221K32896j4114j18779C6294h7586j1792F9285
$$ -190837 193600 -133404 -162726 87221 320117 306003 187224 36294 -87586 -99378 69285
18133a47803M0726n9685O5311a5239k02736j14206d2021A97958c8587j80219I3923
$$ -147803 -107077 -166762 -101451 -15239 -217975 -332181 -42021 197958 -38587 -218806 93923
18121A83923m3769a3567n3531A71590a21783b4281k6044i830B2790b52992A21733
$$ 183923 140154 -13567 -67098 171590 -121783 -24281 -50325 -9830 22790 -252992 121733
18109g5951A7607a3922j70007d19k85813e890l7681I707a04549J8889a1258D0976
$$ -75951 17607 -13922 -183929 -419 -286232 -5890 -43571 9707 -104549 -85660 -11258 40976
18096e0945p4168n7566B9320J63847a00771K0293o843j44978B16765a09586j14331
$$ -50945 -125113 -182679 29320 193167 -100771 -80478 -87321 -232299 216765 -109586 -223917
18085b23917j6033G5570B6947J517J82442A05239A4558J0311b86931A34557m2235
$$ -223917 -239950 75570 26947 28464 210906 105239 14558 24869 -286931 134557 92322
18074I2322b9195r795F6646c3555C0585O9145b46214a07128k71687a7436m7181
$$ 92322 -29195 -38990 66646 -33555 30585 99730 -246214 -107128 -378815 -17436 -64617
18063f4617j14405A23913j7934j239b45486C80671C4147f6626m4214F5586b50678
$$ -64617 -179022 123913 105979 104740 -245486 380671 34147 -66626 -110840 65586 -250678
18051b88093B87868c15534B06164G3968c47780J54425A37172M8514b15060A19757
$$ -288093 287868 -315534 206164 73968 -347780 -193355 137172 185686 -215060 119757
18040c3973B60161B6569a5940j54663F7266b50689O5599C36003A07386d7401D3292
$$ -33973 260161 26569 -15940 -170603 67266 -250689 -185090 336003 107386 -47401 43292
18028A70416i4898A71816g519B18102G3413i0165A9061b06534Q673f4408l3694
$$ 170416 -94898 171816 -7519 218102 73413 -90165 19061 -206534 -197861 -64408 -98102
18017i8102A25177J46563c36951C5987j6078K6853b04790h044C9742M5179A2495
$$ -98102 125177 271740 -336951 35987 19909 46762 -204790 -8044 39742 84921 12495
18005D636J51237f6781K8549k95654a05969k76422A66356c12773M8103f6281A39541
$$ 4636 155873 -66781 -38232 -333886 -105969 -382391 166356 -312773 -264670 -66281 139541
17993a38322a1159j93502A16938d2110j05605E1380b9258A95142J13716g3078
$$ -138322 -11159 -204661 116938 -42110 -147715 51380 -29258 195142 308858 -73078
17982a9034k4920A2575n631b0356m68558B35474D8810J8738d5970k13425A68194
$$ -19034 -43954 12575 6944 -20356 -488914 235474 48810 67548 -45970 -259395 168194
17970g9847q2713I4223f1974H9102O8105j563a80110F7908l2877a14325c2904
$$ -79847 -162560 94223 -61974 89102 157207 155644 -180110 67908 35031 -114325 -32904
17958d0351F2813a24109B63949G1997e4527J9620q9762k49159h4733E8903c61479
$$ -40351 62813 -124109 263949 71997 -54527 -34907 -124669 -373828 -84733 58903 -361479
17946C91J09519a15511a9232A74521A3051K47803f7141m7436j35368g7046j18323
$$ 391 109910 -115511 -19232 174521 13051 260854 -67141 -114577 -249945 -77046 -195369
17935a95369A56461J9690c43880b8404j29255k39718a2402c793l53230A23682
$$ -195369 156461 176151 -343880 -28404 -157659 -397377 -12402 -3793 -357023 123682
17924h0129C13699a90739i4463k68591J06036a04210K4398E2218b22077A1920
$$ -80129 313699 -190739 -94463 -363054 -257018 -104210 -79812 52218 -222077 11920
17913a02690j36584A22435D7556h4058A16280C4867a10644B76010a32904M9288
$$ -102690 -239274 122435 47556 -84058 116280 34867 -110644 276010 -132904 -83616
17903h3616r3035f4999b6041j25636g621I278L85658E3514h3319k55521a24571
$$ -83616 -176651 -64999 -26041 -151677 -7621 9278 394936 53514 -83319 -338840 -124571
17891e8255j16306A09654a38074A66386b17843G5375J15847b26253O5787j209
$$ -58255 -174561 109654 -138074 166386 -217843 75375 191222 -226253 -160466 -161675
17881a61675K3621k12m669I4709a34301k6501F5860N3314a47861B19695d06018
$$ -161675 -138054 -138266 -142935 94709 -134301 -160802 65860 119174 -147861 219695 -406018
17869b72169h8564B0445K29863j01461f5628b917n7870m8790K3719b0442j25454
$$ -272169 -88564 20445 250308 148847 -65628 -2917 -60787 -109577 -85858 -20442 -145896
17858a45896C8653L59288b43880f8340j92969C30198n5115h2021E1624B525R0323
$$ -145896 38653 397941 -243880 -68340 -261309 330198 275083 -82021 51624 2525 92848
17847I2848A7439i0631B06142a35768j30721m5434H3250b32029B01328A00258
$$ 92848 17439 -90631 206142 -135768 -266489 -311923 83250 -232029 201328 100258
17836B7144J67753a13241F1816a09782e4360C51361J4624b03172C48057g7697
$$ 27144 194897 -113241 61816 -109782 -54360 351361 365985 -203172 348057 -77697
17825G1326E418a09794K0248k82882A71232J129i5733b0573r8449M7187A59285
$$ 71326 5418 -109794 -89546 -372428 171232 172361 -95733 -20573 -119022 -71835 159285
17813a77003A62186a52907H3985c96502a27276A07143m7161b56909c768D4764
$$ -177003 162186 -152907 83985 -396502 -127276 107143 59982 -256909 -3768 44764
17802I1393e7591B8372a71173C3207b14212g5903k84285A33295L0984l3983a80306
$$ 91393 -57591 28372 -171173 33207 -214212 -75903 -360188 133295 164279 130296 -180306
17790h3406A32021Q1305g5964A88559b60983g4379A54116e2342C63153B0494K01
$$ -83406 132021 213326 -75964 188559 -260983 -74379 154116 -52342 363153 20494 20695
17779B0695K55417a60934D96861c46353B5176N0110c8603n6459r6169B47832b4509
$$ 20695 276112 -160934 496861 -346353 25176 75286 -38603 -95062 -191231 247832 -24509
17767B23900j00881d6442F5184J12129R4397b15364k25745a24045B33371c48383
$$ 223900 123019 -46442 65184 177313 271710 -215364 -441109 -124045 233371 -348383
17756B04760e5681n3735A97631a70528B08954c4273A28381b032G7255i7100b3969
$$ 204760 -55681 -109416 197631 -170528 208954 -34273 128381 -2032 77255 -97100 -23969
17744c18158D362J44842b76964d1274C5507b16409Q6650D9322A8470d1501m4324
$$ -318158 4362 149204 -276964 -41274 35507 -216409 -129759 49322 18470 -41501 -85825
17733h5825r3875g9166D35182A33717a1179B11257D1914f9657p6570G5335b42860
$$ -85825 -179700 -79166 435182 133717 -11179 211257 41914 -69657 -146227 75335 -242860
17721c62370B78724A01159J18700h7610A94298m5716J67772K4218j69329d9334
$$ -362370 278724 101159 219859 -87610 194298 148582 316354 340572 171243 -49334
17710a04193A56444j6133h3750H5480L8421J91384b18040j11814I3120C7482e756
$$ -104193 156444 140311 -83750 85480 123901 315285 -218040 -329854 93120 37482 -5756
17698b41964B26180a11365E8022b53451B82303H3086B3675a89037d750k63465
$$ -241964 226180 -111365 58022 -253451 282303 83086 23675 -189037 -4750 -268215
17688b68215a09506j42540C68437I4753C4200d6772k7291A73394J5739B0920J72282
$$ -268215 -109506 -252046 368437 94753 34200 -46772 -74063 173394 189133 20920 193202
17677A93202d5634C3333N2140h0686A86045c70075A52361L08643f173j5889B9123
$$ 193202 -45634 33333 85473 -80686 186045 -370075 152361 461004 -6173 -22062 29123
17665A52180l0352a42976H039J01130N7684J0262J44562b73134M1633B57780r7224
$$ 152180 121828 -142976 8039 109169 166853 177115 321677 -273134 -231501 257780 160556
17654A60556b98249D0731b80045H5177a26181F149K94688a98772A26446l2096
$$ 160556 -298249 40731 -280045 85177 -126181 6149 300837 -198772 126446 94350
17644I4350D1022K00525a71477B1277K7603b279B15176g3535p9166d839p474m9385
$$ 94350 41022 241547 -171477 21277 48880 -2279 215176 -73535 -152701 -4839 -12313 -61698
17632f1698D8574N160a19450L203J1206D62057i0334N681q84K9042j06011Q0579
$$ -61698 48574 53734 -119450 -116247 -105041 462057 -90334 -84653 -85537 -56495 -162506 -81927
17620h1927m19345C21767H1149p597J21982P016a4439m3163A99827b88119i1707
$$ -81927 -501272 321767 81149 73552 195534 202550 -14439 -57602 199827 -288119 -91707
17608A44466a77812M0617l1915B46794A15944R987d06101J73657A59478i3712
$$ 144466 -177812 -137195 -169110 246794 115944 125931 -406101 -232444 159478 -93712
17597E6502F090K4392J7439h4351J6737G8241e329D36241a83430a7134B04987
$$ 56502 6090 30482 47921 -84351 -67614 78241 -5329 436241 -183430 -17134 204987
17585B8874M6837K27714c28753F3084d5194F5107g6970b9226n1280A12255e3707
$$ 28874 75711 303425 -328753 63084 -45194 65107 -76970 -29226 -80506 112255 -53707
17573A55820o9997a25598B34099H0810m109b45319N1009C36946f6124j0664j67954
$$ 155820 85823 -125598 234099 80810 76701 -245319 -194310 336946 -66124 -76788 -244742
17562b44742j48187B6391a75912k8592D807K88013a13787q9543h0029p8538C53399
$$ -244742 -392929 26391 -175912 -204504 4807 292820 -113787 -203330 -80029 -158567 353399
17550a76642B34748d9166J8152k040D1695a47512g3361A74135a20117a3695A40609
$$ -176642 234748 -49166 -31014 -33054 41695 -147512 -73361 174135 -120117 -13695 140609
17538b87028F8522h1297a9999B1495a28503M0078I173R8302p031a10508A09258
$$ -287028 68522 -81297 -19999 21495 -128503 -88425 9173 107475 100444 -110508 109258
17526C58632Q2818e312j11411e1423D0334M7350l1053a4500j45317g2477D9874
$$ 358632 441450 -5312 -116723 -51423 40334 87684 56631 -14500 -159817 -72477 49874
17514B44979r4358b8091n4829A21053H907Q6814a39829A42050J90936J07829A11119
$$ 244979 150621 -28091 -82920 121053 8907 95721 -139829 142050 332986 440815 111119
17502a05113B12180F7897b668A04050K26288j45939M5133b84510J34098G8887
$$ -105113 212180 67897 -2668 104050 330338 184399 229532 -284510 -150412 78887
17491a00819C20211I5168l5785a12735L9551B94617p2980j2970D3656e1954B78810
$$ -100819 320211 95168 59383 -112735 -73184 294617 221637 208667 43656 -51954 278810
17479a00083H1210a21014D0530L00552A15295J72051A21025I491L02129j45663
$$ -100083 81210 -121014 40530 341082 115295 287346 121025 9491 311620 165957
17469A65957e2025A77164b16504f8257a2297B82065K7099F4086J17049J33238
$$ 165957 -52025 177164 -216504 -68257 -12297 282065 309164 64086 181135 314373
17459C14373H6911L00849A39344L0997K4264J9910R4434A11539R1330I9351J26978
$$ 314373 86911 387760 139344 170341 194605 214515 308949 111539 202869 99351 226329
17448B26329J77086I9995J12340n6786o5770a5493D63100R4326A0109i4309A70315
$$ 226329 403415 99995 212335 155549 89779 -15493 463100 557426 10109 -94309 170315
17436C27857A51824L5978J39555a84180B25607J21765A4873L27803g1626B26506
$$ 327857 151824 187802 327357 -184180 225607 347372 14873 342676 -71626 226506
17425A28635E7608K28998j21693F4078A6343K08455J221P8788a3757A68106J13907
$$ 128635 57608 286606 164913 64078 16343 224798 226019 304807 -13757 168106 282013
17414B82013o9786K69416A14779M55339g2870C21108L99420G7903C0241K60161
$$ 282013 212227 481643 114779 570118 -72870 321108 720528 77903 30241 290402
17404B90402j2416J34471c5986B38427a84159B53218L51322k30665j03835a43731
$$ 290402 277986 412457 -35986 238427 -184159 253218 604540 373875 270040 -143731
17393D73690H8866b1695C86955c2643A38801C2404a17884A95643b80760C69866
$$ 473690 88866 -21695 386955 -32643 138801 32404 -117884 195643 -280760 369866
17382C28914A58763a9532A06389J83610A32961a12116B27239P4251D5689J22391
$$ 328914 158763 -19532 106389 289999 132961 -112116 227239 301490 45689 168080
17372A68080d3207B58534j28725a8359D9759J15952a52986N1498E5508g9282H8702
$$ 168080 -43207 258534 129809 -18359 49759 165711 -152986 -101488 55508 -79282 88702
17360A41730c63952i4143A47395D8478J73222k9766p387p9411a32476B8369a99830
$$ 141730 -363952 -94143 147395 48478 221700 191934 184547 105136 -132476 28369 -199830
17348a39631B99059k3616K3997j12160M140b8553H4468D1574J45787P3865b02017
$$ -139631 299059 275443 299440 187280 191420 -28553 84468 41574 187361 261226 -202017
17336B14154l5992o4767K7538a41625C24176g4311B39758J2141h9020A13653a87676
$$ 214154 178162 113395 140933 -141625 324176 -74311 239758 251899 -89020 113653 -187676
17324G8074Q9187a90732b4281C07941n6573a07128B38481N9203E5064K70052A23813
$$ 78074 167261 -190732 -24281 307941 251368 -107128 238481 297684 55064 325116 123813
17312B85335M8836M7677j42988j05062L0747K46359k9200F259L48369A33862J91322
$$ 285335 334171 381848 238860 133798 164545 410904 381704 6259 354628 133862 325184
17301C25184q6435M867J76129q3372a52726g1476A59938A1327a10852A32761J25654
$$ 325184 238749 243616 419745 336373 -152726 -71476 159938 11327 -110852 132761 258415
17290B58415B2040K47646A11299b01514C00520j00549k7q7952L9417K41631I2015
$$ 258415 22040 269686 111299 -201514 300520 199971 199944 111992 151409 393040 92015
17278G6177L40516A92211j6425p9321a6390B09438K00665d2650H9003M2777K22233
$$ 76177 416693 192211 175786 96465 -16390 209438 410103 -42650 89003 131780 354013
17267C54013j65253G1126K08397q9317Q6824j34145D0609J45942J64368c89424
$$ 354013 188760 71126 279523 190206 277030 142885 40609 186551 350919 -389424
17256B80709D3301L5229f9993D84342A06351l2215b9625A88480J03779N6689I7947
$$ 280709 43301 78530 -69993 484342 106351 74136 -29625 188480 292259 348948 97947
17244C13070F0392A6780b18665B84193j26447N851k6536l511e3645C91836q5277
$$ 313070 60392 16780 -218665 284193 157746 163597 137061 133550 -53645 391836 306559
17233C06559J1621k9618r9947m5833l0032j822J45675I9611h6109G3580K25866
$$ 306559 318180 288562 188615 142782 112750 110928 256603 99611 -86109 73580 299446
17222B99446n8394n7068J6504a26513A74902K6897r6754b18386B60839b5009B55281
$$ 299446 241052 183984 200488 -126513 174902 201799 105045 -218386 260839 -25009 255281
17210B32190l482A01119l299Q525R4528J41556A41622K3890n7895L35518o0141
$$ 232190 228708 101119 97820 106345 200873 342429 141622 165512 107617 443135 382994
17199C82994C1098N4636J71492A13796K55761A77727F478J09489J0991L62324
$$ 382994 31098 85734 257226 113796 369557 177727 6478 115967 126958 489282
17189D89282D9333M75706r8282F0814K01510A13871J96705J85405k38481A22626
$$ 489282 49333 525039 426757 60814 262324 113871 310576 495981 257500 122626
17178G3232h1273B23876O1230J39842A70955L12265B07377L82228B94600i1110
$$ 73232 -81273 223876 285106 424948 170955 483220 207377 589605 294600 -91110
17167A36345J50939j963L66229B93799A13269J79471J42422A43621M2067M3006
$$ 136345 287284 285321 651550 293799 113269 292740 435162 143621 185688 228694
17157B28694K26951j88573m4812g7640C48344K50024j8995B73594j35508M55815
$$ 228694 455645 267072 222260 -77640 348344 598368 579373 273594 138086 593901
17147E93901N1452A34385J9383L75551A18374K03269J17725K1490B00284F3848
$$ 593901 645353 134385 153768 529319 118374 321643 439368 460858 200284 63848
17136A04489M98123k61674P057A16528L02616E2148M85834j92624o1467j39864
$$ 104489 602612 340938 347995 116528 419144 52148 537982 345358 283891 144027
17126A44027M5812Q9172c7954A59510K57193m7301J67603J16841k81549j77587
$$ 144027 189839 279011 -37954 159510 416703 369402 537005 653846 372297 194710
17116A94710j9609l3411O8446L580n1477K69307A22481L56634j36449K81807j88273
$$ 194710 175101 141690 210136 213716 162239 431546 122481 479115 342666 624473 436200
17105D36200j25145b4760B70386m2168K14661n5652L26227B80875j9265j12518
$$ 436200 311055 -24760 270386 228218 442879 387227 713454 280875 261610 149092
17095A49092K23J6873J71914C326J00404K18600L07045K492q7145n7216L7954
$$ 149092 149315 166188 338102 3326 103730 322330 629375 631867 544722 487506 525460
17084E25460K19138j08383j71736J81823B75834I9152M22378D6401K96155n3724
$$ 525460 744598 636215 464479 646302 275834 99152 521530 46401 342556 288832
17074B88832j22885J05994J44658h7131C29611o6270L59791k76368J5443Q3517
$$ 288832 165947 271941 416599 -87131 329611 263341 623132 346764 362207 445724
17064D45724P9156j65279K77234H8710L54058n8372K2927L68710k40793j84195
$$ 445724 524880 359601 636835 88710 442768 384396 407323 776033 535240 351045
17054C51045J68546k10680K09162j1312n2686J28092o2317j4182j8967l7953J89357
$$ 351045 519591 308911 518073 506761 454075 582167 519850 505668 486701 448748 638105
17043F38105k91404J5101J33599j09878l4814P9961L25769j60099M3360k32620
$$ 638105 346701 361802 495401 385523 350709 430670 756439 596340 639700 407080
17033D07080A02170K28429J60615L31946k26897K55815q5952j48018N7013N2821
$$ 407080 102170 330599 491214 823160 596263 852078 766126 618108 675121 727942
17023G27942j81325Q6510R0089C50703N545j63439J95821P4015J03981j11234
$$ 727942 546617 633127 723216 350703 356248 192809 388630 462645 566626 455392
17013D55392N0105J19116r5833K98817k51338M3505K11485C22359J33354l3103
$$ 455392 505497 624613 528780 827597 576259 619764 831249 322359 455713 422610
17003D22610r885M05737k41534L52320D62326L47625j79504j50774M32203m4103
$$ 422610 412725 818462 576928 929248 462326 809951 630447 479673 911876 867773
16993H67773k54501J82360m7894j84086m5817K00141K22348k48832j62058M0811
$$ 867773 613272 795632 747738 563652 517835 717976 940324 691492 529434 570245
16983E70245M0701J75537J3328Q4676k25289K5723L82587l31624J3025P3400L8698
$$ 570245 610946 786483 799811 884487 659198 684921 1067508 735884 748909 822309 861007
16972H61007j34662L4477L51016k21625k8623O98k49190K91117L34147m78976
$$ 861007 726345 760822 1111838 890213 861590 862288 613098 904215 1238362 759386
16962G59386j37254L61716J18221j72804J91467j90252J16431j04408L62306j81108
$$ 759386 622132 983848 1102069 929265 1120732 930480 1046911 942503 1304809 1123701
16952A123701k65780K19020p3637N2249l3783k35887j3758Q6548L18247k55028
$$ 1123701 857921 1076941 1003304 1055553 1021770 785883 772125 858673 1176920 921892
16942I21892J17078m9708l00134L01225J96299j80082J52205J94782n86284M45462
$$ 921892 1038970 989262 689128 990353 1186652 1006570 1158775 1353557 767273 1212735
16932A212735o1593K63414m33613L68781m61255M45224l95016K24034R0122j94873
$$ 1212735 1151142 1414556 980943 1349724 888469 1333693 938677 1162711 1252833 1057960
16922A057960K72802j40860N0258J56404l1412J31339n2260n8117k57014K29612
$$ 1057960 1330762 1189902 1240160 1396564 1365152 1496491 1444231 1386114 1129100 1358712
16912A358712j54275J84462j69172P0403K30084R9773k85470k8732M4021j95677
$$ 1358712 1204437 1388899 1219727 1290130 1520214 1619987 1334517 1305785 1349806 1154129
16902A154129O25298k6819q0516l4280p5372J78632K7340j37457k38872K08486
$$ 1154129 1779427 1752608 1672092 1637812 1562440 1741072 1768412 1630955 1392083 1600569
16892A600569J3456m73925N61716k59087J09892L27454r2155j11059j5056K21315
$$ 1600569 1614025 1140100 1701816 1442729 1552621 1880075 1787920 1676861 1661805 1883120
16882A883120q9047O9165L25954j03474k97594N71052k8119k53360O2841l2310
$$ 1883120 1794073 1863238 2189192 2085718 1788124 2359176 2331057 2077697 2140538 2108228
16872B108228K0605j97556L6596J77376K6366k44390K66404M83363l67973K05350
$$ 2108228 2128833 1931277 1967873 2145249 2171615 1927225 2193629 2676992 2309019 2514369
16862B514369j10960L0277k2082K06332j03121J75578j79953L39201j72879l7780
$$ 2514369 2403409 2433686 2411604 2617936 2514815 2690393 2510440 2849641 2676762 2638982
16852B638982j81609J86111J19383j59976L85287k08370L82829J18394j56379
$$ 2638982 2457373 2643484 2762867 2602891 2988178 2779808 3162637 3281031 3124652
16843C124652O7464q0538J72296k26935N2427K54956j70914n0988J20660j00802
$$ 3124652 3192116 3111578 3283874 3056939 3109366 3364322 3193408 3142420 3263080 3162278
16833C162278M49343k68511N75304k39423j20412M96737j50161L9355Q6375L04303
$$ 3162278 3611621 3343110 3918414 3678991 3558579 4055316 3905155 3944510 4030885 4335188
16823D335188J00246o7535J27264j14701J98784l0430K17225M20335m70807O3247
$$ 4335188 4435434 4367899 4495163 4380462 4579246 4548816 4766041 5186376 4715569 4778816
16813D778816L98030k49676O37532m82126L90715J81981j72896M17654J96612
$$ 4778816 5176846 4927170 5564702 5082576 5473291 5655272 5482376 5900030 6096642
16804F096642r2469M6177J50489L83087l27839L76608K87531L62249l55891J43634
$$ 6096642 6004173 6050350 6200839 6583926 6256087 6632695 6920226 7282475 6926584 7070218
16794G070218M18524r3099L12280J47815M70065j03556J93311n8066L37797L86124
$$ 7070218 7488742 7395643 7707923 7855738 8325803 8222247 8415558 8357492 8695289 9081413
16784I081413L99080K57411R6720L19572L9617N39606k2275N65285M51N39906
$$ 9081413 9480493 9737904 9834624 10154196 10193813 10733419 10711144 11276429 11276880 11816786
16774A1816786L28286J62854N37519J45398O28454O7530P46451K09989M86862
$$ 11816786 12145072 12307926 12845445 12990843 13619297 13686827 14433278 14643267 15130129
16765A5130129O08908N78149K16554O57201P34082L34495Q54145L79562O58410
$$ 15130129 15739037 16317186 16533740 17190941 17925023 18259518 19113663 19493225 20151635
16756B0151635Q34268Q20989Q24479Q67792Q52847P40200J108994J075135J423120
$$ 20151635 20985903 21806892 22631371 23499163 24352010 25092210 26201204 27276339 28699459
16747B8699459Q67619J618591Q16034J598204J533843J478654J613353J880204
$$ 28699459 29567078 31185669 32001703 33599907 35133750 36612404 38225757 40105961
16739D0105961K190201J578645K416936K039907K786562K220810K958202K796267
$$ 40105961 42296162 43874807 46291743 48331650 51118212 53339022 56297224 59093491
16731E9093491L192920L209065L677234L996002M055472M310308M448774N311406
$$ 59093491 62286411 65495476 69172710 73168712 77224184 81534492 85983266 91294672
16723I1294672M855701N493267N521986N694936O440850O158029O570451O520464
$$ 91294672 96150373 101643640 107165626 112860562 119301412 125459441 132029892 138550356
16715A38550356O892856O249209O643331O283975N775756N318525M708841L957039
$$ 138550356 145443212 151692421 158335752 164619727 170395483 175714008 180422849 184379888
16707A84379888K798528K221038J116682j6773j000055j417966l698654l701503
$$ 184379888 187178416 189399454 190516136 190499363 189499308 188081342 184382688 180681185
16699A80681185m729695n426858n795005o047895o765848o602653o707045o658895
$$ 180681185 175951490 170524632 164729627 158681732 151915884 145313231 138606186 131947291
16691A31947291o319113o724143n954179n900127o239816n089609n263833n077236
$$ 131947291 125628178 118904035 112949856 107049729 100809913 95720304 90456471 85379235
16683H5379235m175582m467960m063584m146620l334374l711715l077848l083200
$$ 85379235 81203653 76735693 72672109 68525489 65191115 61479400 58401552 55318352
16675E5318352k575107k515420k596859k358731k133305j910008j917971k003782
$$ 55318352 52743245 50227825 47630966 45272235 43138930 41228922 39310951 37307169
16667C7307169j505587j501700j518240j509396j237666j454839q56947r30819
$$ 37307169 35801582 34299882 32781642 31272246 30034580 28579741 27722794 26791975
16659B6791975j137280j107253j149929p29224q47991p64172p33222n02232p73189
$$ 26791975 25654695 24547442 23397513 22668289 21820298 21056126 20322904 19820672 19047483
16650A9047483q08837k05065r66738m98723k30100n02832p70012p1392n83622
$$ 19047483 18238646 18033581 17066843 16568120 16338020 15835188 15065176 14993784 14410162
16641A4410162m87252m14163o14324j71552m58230l32370m13220j03686m14443
$$ 14410162 13922910 13508747 12894423 12722871 12264641 11932271 11519051 11415365 11000922
16632A1000922k97391j38873n32335k56381r8619l36139k06026r961N6188r36883
$$ 11000922 10703531 10564658 10032323 9775942 9677323 9341184 9135158 9125197 9181385 8244502
16622H244502J76067o53356J39392k096k16333m19295l35580K5485k2011k07815
$$ 8244502 8420569 7767213 7906605 7904509 7688176 7268881 6933301 6958786 6936775 6728960
16612F728960O7641o74492J1921K41139n02489j01442P9050j25232j11901K26336
$$ 6728960 6796601 6122109 6134030 6375169 5872680 5771238 5850288 5725056 5613155 5839491
16602E839491k77191k13385q0067l93816l0540n6196J1679L043K9030k29846K22788
$$ 5839491 5562300 5348915 5268848 4875032 4844492 4788296 4799975 4803018 4832048 4602202 4824990
16591D824990k97358j50955p7638j12505r1806N5528m61338L40441k27140K08069
$$ 4824990 4527632 4376677 4299039 4186534 4094728 4150256 3688918 4029359 3802219 4010288
16581D010288j86138j78127j92284j8395j00820J36993J31543l42041j29807J42443
$$ 4010288 3824150 3646023 3453739 3435344 3334524 3471517 3603060 3261019 3131212 3273655
16571C273655k987j64028o1931J45978k98395o4351j84835Q1871J37221j29980
$$ 3273655 3270668 3106640 3044709 3190687 2892292 2827941 2643106 2724977 2862198 2732218
16561B732218L28814j86920k03950J17518j48706J51287l80451K88433k1473k24289
$$ 2732218 3061032 2874112 2670162 2787680 2638974 2790261 2409810 2698243 2676770 2452481
16551B452481J4717r1848O7854j86571l0798j29335M66529m66342Q2794k56528
$$ 2452481 2467198 2375350 2443204 2256633 2225835 2096500 2563029 2096687 2179481 1922953
16541A922953Q0424J39560l40489K32521p7325L9404j60266K06082Q5774j16528
$$ 1922953 2003377 2142937 1802448 2034969 1957644 1997048 1836782 2042864 2128638 2012110
16531B012110m66415M79452m30316M14525r2254k60333L22238l44999K2575J07344
$$ 2012110 1545695 2025147 1594831 2009356 1917102 1656769 1979007 1634008 1656583 1763927
16521A763927j01021p1913j18658K09180r5113J18453j02761J42094p7141k42084
$$ 1763927 1662906 1590993 1472335 1681515 1586402 1704855 1602094 1744188 1667047 1424963
16511A424963J49148O3089k46119J43041K89623j65928m75753J25419K23972N6459
$$ 1424963 1574111 1637200 1391081 1534122 1823745 1657817 1182064 1307483 1531455 1587914
16501A587914m34308K15684k68152N95133m24127J3021J21889n1521j43168K90638
$$ 1587914 1153606 1369290 1101138 1696271 1272144 1285165 1407054 1355533 1212365 1503003
16491A503003l07805J93483q9682j29825R9088k97669K47253j04622J3378m5858
$$ 1503003 1195198 1388681 1298999 1169174 1268262 970593 1217846 1113224 1126602 1080744
16481A080744J56853J5941J10115n11601p5254J55419K445K32788j60337P8564
$$ 1080744 1237597 1253538 1363653 852052 776798 932217 934662 1167450 1007113 1085677
16471A085677Q5354j70661J091J2659l74177L73617m5604J62517j31657M08684
$$ 1085677 1171031 1000370 1001461 1014120 639943 1013560 967956 1130473 998816 1407500
16461A407500n53829J01609l92368L10163K12973j12956p6889L801j6684r3804
$$ 1407500 853671 955280 562912 873075 1086048 973092 896203 900004 883320 789516
16451G89516J66898m23291l23L94253j99373j81821M08187l04703L79931l83234
$$ 789516 956414 533123 532800 927053 727680 545859 954046 649343 1029274 646040
16441F46040L55741p4026k20981m4970j3899M60961j33533m34655M26555l42580
$$ 646040 1001781 927755 706774 661804 647905 1108866 975333 540678 967233 624653
16431F24653M44486l45709M9499p526j26586q1961K93973k93415K83129k01561
$$ 624653 1069139 723430 772929 765403 638817 556856 850829 557414 840543 638982
16421F38982J08285j06767K95303l98315J5694K94887j59910j67149K58623r9385
$$ 638982 747267 640500 935803 537488 553182 848069 688159 521010 779633 680248
16411F80248q181K12173D13472M1216j44189N3560L9346J23589K66363k25061
$$ 680248 672067 884240 413472 454688 310499 364059 403405 526994 793357 568296
16401E68296j50370J72968j82151L081L12821M8150j11982k92774K85952k09013
$$ 568296 417926 590894 408743 411824 724645 772795 660813 368039 653991 444978
16391D44978J82481J15175k30207P3467O2015A48969K31696Q6427J69628O6861
$$ 444978 627459 742634 512427 585894 647909 148969 380665 467092 636720 703581
16381G03581k68440J39307M113p5502J28130J58769B68491M79204k65981l5166
$$ 703581 435141 574448 578561 503059 631189 789958 268491 747695 481714 446548
16371D46548J12794k32312Q1124I8369L70385M3338o0003J29583k45335N17504
$$ 446548 559342 327030 408154 98369 468754 512092 452089 581672 336337 853841
16361H53841l45056K74946k77114q1540r3448J80184M1147k65077J37892j25344
$$ 853841 508785 783731 506617 425077 331629 511813 552960 287883 425775 300431
16351C00431K59891k17952R6689A94451J88991J67902J88771k90283J62590n0754
$$ 300431 560322 342370 439059 194451 383442 551344 740115 449832 612422 561668
16341E61668B50022O0403l4784K16533j08243K51965p6835k14015K99640A75824
$$ 561668 250022 310425 275641 492174 383931 635896 559061 345046 644686 175824
16330B37825J93248j81952a19650D83526q5520J51803J20772B67175q315J29128
$$ 237825 431073 249121 -119650 483526 398006 549809 670581 267175 258860 387988
16320C87988j31529K19521n8133A44460M53772B28593N4754M54891j86366A89567
$$ 387988 256459 475980 417847 144460 598232 228593 283347 738238 551872 189567
16309G17037B47256E3918N10136D9555N21573j41385R3377A75259M6100K68173
$$ 717037 247256 53918 564054 49555 571128 429743 523120 175259 221359 489532
16299D89532j94605j9920j15122P0179q3527Q2062R7230G2710J85113L42170k75383
$$ 489532 294927 275007 159885 230064 146537 228599 325829 72710 257823 599993 324610
16288C24610k238A21046L60078j75476I2301M15443j96836E1861L45203A48950
$$ 324610 322372 121046 481124 305648 92301 507744 310908 51861 397064 148950
16277D34321D4675N91605j66072k30619K8541K62951j70576j3768j8467A02325
$$ 434321 44675 636280 470208 239589 268130 531081 360505 346737 328270 102325
16266B26957I2740J15932e5499B30620G2764K02110j25035K98625A17475J59303
$$ 226957 92740 208672 -55499 230620 72764 274874 149839 448464 117475 276778
16256B76778K93205j75138m2590j27712J08521J46389a37834A6387L01454L8949
$$ 276778 569983 394845 352255 224543 333064 479453 -137834 16387 317841 356790
16246C56790K76493a1253C58456D0197P9242P6399O9819l4221J8738a8412A30397
$$ 356790 633283 -11253 358456 40197 119439 195838 265657 231436 250174 -18412 130397
16234D47565k08839M9436A09108J05084J20803p4452J73576j81853r60p9279L9555
$$ 447565 238726 288162 109108 214192 334995 260543 434119 252266 251306 172027 211582
16223B11582a03487B81803K7362o7083B3998J16741K91998A65084Q9592l2565
$$ 211582 -103487 281803 309165 242082 23998 140739 432737 165084 254676 222111
16213B22111J3064A16814K09214a89222A76686K13371J19984A05666K82394J82259
$$ 222111 235175 116814 326028 -189222 176686 390057 510041 105666 388060 570319
16203E70319A98593k8847J04332F7218h0321F3881m13J76871J6173A22427J49472
$$ 570319 198593 169746 274078 67218 -80321 63881 63468 240339 256512 122427 271899
16192B71899J62758A05085K08818f5388D5038J40734R0557M0734j40015c88296
$$ 271899 434657 105085 313903 -65388 45038 185772 276329 317063 177048 -388296
16181I4136r821K33353F1299J74528m2711P3174p349r9318J74820K15503A09687
$$ 94136 84315 317668 61299 235827 193116 266290 258941 159623 334443 549946 109687
16169g4513b472H7519h961o3919c3186G8472K9350m4572N4671j2299j0002L33
$$ -74513 -2472 87519 -8961 -72880 -33186 78472 107822 63250 117921 105622 95620 95953
16157I5953a1555j20512H3501a36665A04309a6925A6661M54378A71568K7048g5102
$$ 95953 -11555 -132067 83501 -136665 104309 -16925 16661 471039 171568 198616 -75102
16145F05068A11261n2315Q3893q984M816l1906C597J1009J58852k4229a08037
$$ 605068 111261 58946 142839 133855 138671 106765 3597 14606 173458 149229 -108037
16133D26512a37338B90499A27672a14176M3981C11213q0271C104M0716b6127C1564
$$ 426512 -137338 290499 127672 -114176 -70195 311213 230942 3104 43820 -26127 31564
16121c8343C50594G1055b2374C6685a45014G8164o183K21120j41883J7302b97800
$$ -38343 350594 71055 -22374 36685 -145014 78164 71981 293101 151218 168520 -297800
16109H2029R3180J44110e8404H1803O4275a30856B0112K05864B7223N1351a6172
$$ 82029 175209 319319 -58404 81803 146078 -130856 20112 225976 27223 78574 -16172
16097A42065O9849g7483G9996J99765b57287c6003j9106l2376E16212k34506I575
$$ 142065 211914 -77483 79996 279761 -257287 -36003 -55109 -87485 516212 281706 9575
16085B31843o9705J43654j46669b43791G1065P9100i7369l5288Q665E0719a06574
$$ 231843 162138 305792 159123 -243791 71065 150165 -97369 -132657 -123992 50719 -106574
16073a1516B03557H4174b7597j25405C63032E5876K43978A42443P9661f7934A34651
$$ -11516 203557 84174 -27597 -153002 363032 55876 299854 142443 222104 -67934 134651
16061B10853b01559b5280A30413l4957a5382G4631L00095A12990M8958a81045
$$ 210853 -201559 -25280 130413 95456 -15382 74631 374726 112990 161948 -181045
16050b17938e0961C1378b839B52396K0035H6569J42628a47160D59369j85695j35390
$$ -217938 -50961 31378 -2839 252396 272431 86569 229197 -147160 459369 273674 138284
16039A38284b18225A43890b55750I171g4768j50548P2999e884B0052b74719a03183
$$ 138284 -218225 143890 -255750 9171 -74768 -225316 -152317 -5884 20052 -274719 -103183
16027A51684E9233b61763d6065b1790r5152B01806b77871G452g6903j46267A13386
$$ 151684 59233 -261763 -46065 -21790 -116942 201806 -277871 7452 -76903 -223170 113386
16015E1367a23850A33911e8201O880k37914d8572B11058c6395q4658n078A00140
$$ 51367 -123850 133911 -58201 -51321 -289235 -48572 211058 -36395 -121053 -126131 100140
16003H3595F582N8396c5131l77239C27865c19627B21567J8841A022P7987C5162
$$ 83595 6582 64978 -35131 -412370 327865 -319627 221567 240408 1022 79009 35162
15991d08917c6572j04120M0680K6799n9436k28249H8609A0303J13456B1649K88582
$$ -408917 -36572 -140692 -100012 -73213 -132649 -360898 88609 10303 123759 21649 310231
15980C10231a11285n0959E6736d4069F1573J1983a24685G694J01100b46414A13938
$$ 310231 -111285 -162244 56736 -44069 61573 73556 -124685 7694 108794 -246414 113938
15968I0265J33699b79141B25445E7949P5247J89693b14656A01893a24983M4911
$$ 90265 223964 -279141 225445 57949 133196 322889 -214656 101893 -124983 -80072
15958h0072j44714A26272E8474a76524G5619a476j40734C91940G8485J86373e0225
$$ -80072 -224786 126272 58474 -176524 75619 -1476 -142210 391940 78485 264858 -50225
15946a44242N8380A46601n7956c72557J23158J20088B12363a10368e4483p5708
$$ -144242 -85862 146601 88645 -372557 -249399 -129311 212363 -110368 -54483 -130191
15936a30191K4843M9397q8113j49334a05230P489M6422B728L9468A5116J38277
$$ -130191 -105348 -55951 -144064 -293398 -105230 -97741 -51319 2728 42196 15116 153393
15925A53393g4100a9920j15174A05245B2232J24006b56812e9118A9647c66938
$$ 153393 -74100 -19920 -135094 105245 22232 146238 -256812 -59118 19647 -366938
15914b5175r2018B55432b85194e2809j68835m3610N9104C1937a02394h719l9160
$$ -25175 -117193 255432 -285194 -52809 -221644 -265254 -206150 31937 -102394 -8719 -47879
15903d7879b694j18683j10489J08922E4334A1347a57054A05015B4422J78360i6170
$$ -47879 -2694 -121377 -231866 -122944 54334 11347 -157054 105015 24422 202782 -96170
15891d24328A170b31890K31B6686a07901o4418E4271a01194I4746B640J4930a25447
$$ -424328 1170 -231890 -231659 26686 -107901 -172319 54271 -101194 94746 2640 17570 -125447
15878a87450g8561A30377J61723A22242O3671b21517A72837b05248A38606g8662
$$ -187450 -78561 130377 292100 122242 185913 -221517 172837 -205248 138606 -78662
15867a21442C5428L5180a5653A03376a74270j3756j40995B14416b54167R0040
$$ -121442 35428 70608 -15653 103376 -174270 -188026 -329021 214416 -254167 -164127
15857a64127c7837C6246f7043j96501M1071I868i1770I0265l3633b98313A67887
$$ -164127 -37837 36246 -67043 -263544 -222473 9868 -91770 90265 56632 -298313 167887
15845e5338D2916J72555a37068A53833A4589b2840A64236a02984p2043B24572
$$ -55338 42916 215471 -137068 153833 14589 -22840 164236 -102984 -175027 224572
15834b29009A41419J38509C4386c3599G8301R7260l5110K15389K35942A34532
$$ -229009 141419 279928 34386 -33599 78301 175561 140451 355840 591782 134532
15823B58297e7908F7418b767j72603l02891a62343C5207c1020k00738I4419b4095
$$ 258297 -57908 67418 -2767 -175370 -478261 -162343 35207 -31020 -231758 94419 -24095
15811i242k54729f8367l1246m3500M2156A08620C0552J74187a29025d5828G35
$$ -9242 -263971 -68367 -99613 -143113 -100957 108620 30552 204739 -129025 -45828 735
15799a04262l17496a94971c0924B2151K6103j3981Q3612l5394f7901M725A68478
$$ -104262 -421758 -194971 -30924 22151 48254 34273 117885 82491 -67901 -63176 168478
15787a57905A70663b97160A27641i3108r6151f0826A34643a6125q0423G056a90414
$$ -157905 170663 -297160 127641 -93108 -189259 -60826 134643 -16125 -96548 7056 -190414
15775B70811f9621D9651M7749b73791A45090B860b15629B14175G5319g951p6936
$$ 270811 -69621 49651 97400 -273791 145090 2860 -215629 214175 75319 -7951 -84887
15764h4887A50952a17989K7862L9473A34100i2251C17949a71749G714f2880k63770
$$ -84887 150952 -117989 -90127 -50654 134100 -92251 317949 -171749 7714 -62880 -326650
15753c26650K4075b1675B76399e833j4779k23065h3843l079J9815m9361j50752
$$ -326650 -302575 -21675 276399 -5833 -20612 -243677 -83843 -86922 -67107 -116468 -267220
15742b67220b3726A34457n884a54071A49430f3256k0906D12332A45500b92233
$$ -267220 -23726 134457 128573 -154071 149430 -63256 -84162 412332 145500 -292233
15731a70554E2082J8392b5196I266d02839J62439J03874O2578B25289E1533Q1337
$$ -170554 52082 70474 -25196 9266 -402839 -240400 -136526 -73948 225289 51533 132870
15720A32870a59053a7525I0111g2753c0570r9987B07682h9470B21865G9092d4807
$$ 132870 -159053 -17525 90111 -72753 -30570 -130557 207682 -89470 221865 79092 -44807
15708d24202A3735J02297a45359j45087a8270p0588j12111O4203l5164j10401
$$ -424202 13735 116032 -145359 -290446 -18270 -88858 -200969 -136766 -171930 -282331
15698b82331J08126B03847I2347f5895J4199l20608E7921B5598f8456l510a9664
$$ -282331 -174205 203847 92347 -65895 -51696 -372304 57921 25598 -68456 -71966 -19664
15686i8642j89085a10999A65186E3047a01279l22416a671B4218b16367J9321I6095
$$ -98642 -287727 -110999 165186 53047 -101279 -423695 -1671 24218 -216367 -197046 96095
15674a91646A99653C1315e341A381b83694P5662p0928J31360g0961j39001C8385
$$ -191646 199653 31315 -5341 1381 -283694 -208032 -278960 -147600 -70961 -209962 38385
15662a27737j98505P5118J8469F4600h7377A951P7763J46489b2423j27180e8342
$$ -127737 -326242 -251124 -232655 64600 -87377 1951 79714 226203 -22423 -149603 -58342
15650A55103J67428i8315B19277m2680a2701m27626J61553J28717f519j19254
$$ 155103 322531 -98315 219277 176597 -12701 -440327 -278774 -150057 -6519 -125773
15640a25773B5650J19000b38935F3328O8543a64070N9185A2488J00080h8465E5941
$$ -125773 25650 144650 -238935 63328 131871 -164070 -104885 12488 112568 -88465 55941
15628c42754a9746l10563b8134k06223A33378n5417e25351c7658l32787A62570
$$ -342754 -19746 -330309 -28134 -234357 133378 77961 -525351 -37658 -370445 162570
15617i3654E2820b21719d8683A81738J05452b9222B1586i4549B45923D8480l174
$$ -93654 52820 -221719 -48683 181738 287190 -29222 21586 -94549 245923 48480 45306
15606D5306f7338C81663A66799f6841q8740d8537A88708a45021k649c3839j21429
$$ 45306 -67338 381663 166799 -66841 -155581 -48537 188708 -145021 -147670 -33839 -155268
15595a55268e3425A31887i5742B336f0991n7540B20835a23804m9850e0093A47066
$$ -155268 -53425 131887 -95742 2336 -60991 -118531 220835 -123804 -173654 -50093 147066
15583B07604l9226a52955D2509b50997b1179B25327b2352k51593B14637F8497
$$ 207604 168378 -152955 42509 -250997 -21179 225327 -22352 -273945 214637 68497
15572f1434l6502b7860F3117a76767I0072r066a00827A73194d4717A48717A5892
$$ -61434 -97936 -27860 63117 -176767 90072 81006 -100827 173194 -44717 148717 15892
15560a48382j10188A66813b31404A43842a03745c3826j22331B8563a01435H3936
$$ -148382 -258570 166813 -231404 143842 -103745 -33826 -156157 28563 -101435 83936
15549b43948O5244j2549C419h8160B19510e777A44905b26248i0590A71574F3279
$$ -243948 -178704 -191253 3419 -88160 219510 -5777 144905 -226248 -90590 171574 63279
15537F799a36723A22287a16635E2466N5820c13301a14854r4893g9527A84757m5400
$$ 6799 -136723 122287 -116635 52466 108286 -313301 -114854 -209747 -79527 184757 139357
15526A39357o1977b9536j00658e0117r7019M9804j67549g7169k16542i4266E25600
$$ 139357 77380 -29536 -130194 -50117 -147136 -97332 -264881 -77169 -293711 -94266 525600
15514A06601A0444P8956e6917A50129h2652C22306c78312e9612k23262F8863a63136
$$ 106601 10444 89400 -56917 150129 -82652 322306 -378312 -59612 -282874 68863 -163136
15502e7985A80012p1705a57977A85376d00313A05340a63376A07145a2468D06795
$$ -57985 180012 108307 -157977 185376 -400313 105340 -163376 107145 -12468 406795
15491h971j5301l7247B81418b1154j33814C3333N5313b96048A35496O261a07080
$$ -8971 -24272 -61519 281418 -21154 -154968 33333 88646 -296048 135496 141757 -107080
15479A5789i433k50753e915A95457e5518d506l2594A99011f7824B30102a65656
$$ 15789 -9433 -260186 -5915 195457 -55518 -4506 -37100 199011 -67824 230102 -165656
15467A7751a37353C1980R3139a15401d3667a8587B67214q8402a58421e9454A89988
$$ 17751 -137353 31980 125119 -115401 -43667 -18587 267214 178812 -158421 -59454 189988
15455B20406F0420f3600j43544H8405e6728j55394A9274b99597a35243I387b47083
$$ 220406 60420 -63600 -207144 88405 -56728 -212122 19274 -299597 -135243 9387 -247083
15443a08563l202E902J21331d0301D153K09984I2757d34847b08399h8790K3434
$$ -108563 -111765 5902 127233 -40301 4153 214137 92757 -434847 -208399 -88790 -65356
15432f5356o5657I4375A0687b82729G2771N7995J13567a6084F0624a43440j19322
$$ -65356 -131013 94375 10687 -282729 72771 130766 244333 -16084 60624 -143440 -262762
15421b62762B01823a80900h5123j93124A11426C6396b91891P6523O0253O0232
$$ -262762 201823 -180900 -85123 -278247 111426 36396 -291891 -215368 -155115 -94883
15411i4883k9840L2294I0783J55633o0190c6003j43381B0878c5266A05606J07239
$$ -94883 -124723 -92429 90783 246416 186226 -36003 -179384 20878 -35266 105606 212845
15400B12845D7475f4348n6561A571g2772l3947b2810B01125D202a9299A13420
$$ 212845 47475 -64348 -120909 1571 -72772 -106719 -22810 201125 4202 -19299 113420
15388b21353j5117a0460A27660B1809b6040I6462d4872o7823A85858d0212k41423
$$ -221353 -236470 -10460 127660 21809 -26040 96462 -44872 -112695 185858 -40212 -281635
15377b81635h7225A8648R377b83866A49445a28421F6666a06299J8444p6675c9585
$$ -281635 -87225 18648 28025 -283866 149445 -128421 66666 -106299 -87855 -164530 -39585
15365B33636m3714G7346L92048A39956o0891N5845b9305j49416B6268J9349K06326
$$ 233636 189922 77346 469394 139956 79065 134910 -29305 -178721 26268 45617 251943
15354B51943e8735o5037G5600O1705b45826C52798d7596A17989b8866j45328j40976
$$ 251943 -58735 -123772 75600 137305 -245826 352798 -47596 117989 -28866 -174194 -315170
15343c15170g625m18222A45028E9185a60591d2464D3961O6247m6785c2793j0328
$$ -315170 -7625 -425847 145028 59185 -160591 -42464 43961 110208 63423 -32793 -43121
15332d3121A9408R2133P911c65274b9920B8236J13294B4601g0542j83261a16323
$$ -43121 19408 111541 119452 -365274 -29920 28236 141530 24601 -70542 -253803 -116323
15320A38468i7372B36794P6304g2199A19586L89366A55211c59155J55069I8135
$$ 138468 -97372 236794 313098 -72199 119586 508952 155211 -359155 -204086 98135
15309b29380f7637g243B46019A22114J26106H1761L19436B7762d8410k97471E394
$$ -229380 -67637 -7243 246019 122114 248220 81761 401197 27762 -48410 -345881 5394
15297b73433a17226N5048k45231B30489J8790A1137J07228a1146A9805b44625
$$ -273433 -117226 -62178 -307409 230489 249279 11137 118365 -11146 19805 -244625
15286F6774J81815k8447o7535a87034A63487M5034n8844F3482J93095i4432C62304
$$ 66774 248589 220142 152607 -187034 163487 208521 149677 63482 256577 -94432 362304
15274a47499A43460F2065b11543L7746A18019m4224b6840j16949A4641O4720A8504
$$ -147499 143460 62065 -211543 -173797 118019 73795 -26840 -143789 14641 79361 18504
15262D12397c7744B76617K68234A8972K52237c4140A49897D3884Q3066A8653K4551
$$ 412397 -37744 276617 544851 18972 271209 -34140 149897 43884 126950 18653 43204
15251D3204a45769M702A31596n1639L77852B9377A1066P1707L47366j11030b1097
$$ 43204 -145769 -141067 131596 79957 457809 29377 11066 82773 430139 319109 -21097
15239F1021a28380G348L07490J24789L72445L59138l05379K56267D81314J96767
$$ 61021 -128380 7348 314838 439627 812072 1171210 865831 1122098 481314 678081
15229F78081B61496Q6377D5352K95831A03879K05152j7470E6808J37474h6324
$$ 678081 261496 347873 45352 341183 103879 309031 291561 56808 194282 -86324
15218A15076a74195B11559n8558A4599i6217j0729G7627K74004c7415B23285L66079
$$ 115076 -174195 211559 153001 14599 -96217 -106946 77627 351631 -37415 223285 589364
15207E89364B22668j0713a46170e1739D0005a1427A52833d0821D8537J42811J69711
$$ 589364 222668 211955 -146170 -51739 40005 -11427 152833 -40821 48537 191348 361059
15196C61059A31072e5246A52740b32375A42297F7255d5207B17590g2008C21538
$$ 361059 131072 -55246 152740 -232375 142297 67255 -45207 217590 -72008 321538
15185f5594A50479l2835m1827J68870h5136A23077L0157H971c8263o6477H0998
$$ -65594 150479 117644 75817 244687 -85136 123077 153234 8971 -38263 -104740 80998
15173A62762l1033d8741A04829a38363L8980G8938Q2343n7953A8870N38N3972
$$ 162762 131729 -48741 104829 -138363 -99383 78938 161281 103328 18870 19408 73380
15162G3380J83955c0003k3902B12746G9186a4291k22236h3771J1117l0762A20978
$$ 73380 257335 -30003 -53905 212746 79186 -14291 -236527 -83771 -72654 -103416 120978
15150B66356m6736a28465D8342M9137K6318a13310L791B80744d311C31866A8530
$$ 266356 219620 -128465 48342 97479 123797 -113310 -109519 280744 -4311 331866 18530
15138B23593K2356a29230G5400c0239H0630A1367L16342A20169J68269n4181A6149
$$ 223593 245949 -129230 75400 -30239 80630 11367 327709 120169 288438 234257 16149
15126f8788H5198P4993O2623F3252b91761i229j53806B05263p1273A7416K80562
$$ -68788 85198 160191 222814 63252 -291761 -9229 -163035 205263 133990 17416 297978
15115B97978J1325A26737K6264N5138c9200G0495l5048K13631a20458d9895B56878
$$ 297978 309303 126737 153001 208139 -39200 70495 35447 249078 -120458 -49895 256878
15103C87447e3340j18742C8466J72865l3625a44910B66660J54736j62476N0594
$$ 387447 -53340 -172082 38466 211331 177706 -144910 266660 421396 258920 309514
15093C09514b43A37466J54260A14355J6127L41302j52037r3214b0349B95645h0267
$$ 309514 -243 137466 291726 114355 130482 471784 319747 226533 -20349 295645 -80267
15081I2713K70062I9930j8676N8363K7788C7132J24199k4422d6969P255H0429
$$ 92713 362775 99930 81254 139617 167405 37132 161331 136909 -46969 -39714 80429
15069H9288C8289e4096A44695b3270A63948a36480o4561A56581o3122b20376B8454
$$ 89288 38289 -54096 144695 -23270 163948 -136480 -201041 156581 93459 -220376 28454
15057a70210A51363D5510K14864c7002C16006J51597E895J56418e1007j49859
$$ -170210 151363 45510 260374 -37002 316006 467603 5895 162313 -51007 -200866
15047b00866C34524A3319N5251i4208E98838A79993N8769a36761A63743D8192
$$ -200866 334524 13319 68570 -94208 598838 179993 238762 -136761 163743 48192
15036A83241K2917K96399B25367I7399J15970h3094A31870K79510G6882P661a6250
$$ 183241 206158 502557 225367 97399 213369 -83094 131870 411380 76882 84543 -16250
15024A60374m2681i0447K3556A21173J61092C0833L18051a10439C83476d936A54985
$$ 160374 117693 -90447 -66891 121173 282265 30833 348884 -110439 383476 -4936 154985
15012A6341K87616j36435b5878F5415L55169j70633B9041J96555J53879a89284
$$ 16341 303957 167522 -25878 65415 420584 249951 29041 225596 379475 -189284
15001B78229J03707j36248J78374j55088j25563g6555A40202C7253O7634J98944
$$ 278229 381936 245688 424062 268974 143411 -76555 140202 37253 104887 303831
14991C03831b75975J35058C82803C1075J86643J91849j7028A01898K44625j18506
$$ 303831 -275975 -140917 382803 31075 217718 409567 392539 101898 346523 228017
14981B28017R7274a15946A06917J9020N723L81649B33923h5605B54506K4169k7789
$$ 228017 325291 -115946 106917 125937 131660 513309 233923 -85605 254506 278675 250886
14970B50886n7420q504K33032d2154D76870n3774i7396A09770L14086j37310n6897
$$ 250886 193466 184962 417994 -42154 476870 423096 -97396 109770 423856 286546 229649
14959B29649o021B5078i5784A53372J47737A04207J48248G5048j6205k7628M30617
$$ 229649 223628 25078 -95784 153372 301109 104207 252455 75048 58843 31215 461832
14948D61832j07460A07784K7644K65276a04399D46774E8162Q6161J99907n4048
$$ 461832 354372 107784 135428 400704 -104399 446774 58162 144323 344230 290182
14938B90182Q9462B3293N39674b0555B45054A07703J34414L56840k59476M64060
$$ 290182 379644 23293 562967 -20555 245054 107703 242117 598957 339481 803541
14928H03541l33213B22389J52057j54872M779l6587Q9737D2880P5910K38453j15201
$$ 803541 470328 222389 374446 219574 224353 187766 277503 42880 118790 357243 242042
14917B42042A7606J78703J90107J07797m7789F8894N18480B36476K61525K19050
$$ 242042 17606 196309 386416 494213 446424 68894 587374 236476 498001 717051
14907G17051A38024L20563K1088E5813L37516K57232j55436k38328K9244j41836
$$ 717051 138024 458587 479675 55813 393329 650561 495125 256797 286041 144205
14897A44205K98145B16378R7254R91n1984K6571r7686K72413A57263J1492K2281
$$ 144205 442350 216378 313632 314623 262639 289210 191524 463937 157263 168755 191036
14886A91036M11876j68220B4793L33426J2375M0654A80164L51297j85083J35169
$$ 191036 602912 434692 24793 358219 370594 411248 180164 531461 346378 481547
14876D81547j47178m512J33498j78648N491K90286j14831A61651J6468K20016
$$ 481547 334369 329857 463355 284707 290198 580484 465653 161651 178119 398135
14866C98135j90362K09138q559L4823A26191J28328J62410A97032P0423J91809
$$ 398135 207773 416911 408352 443175 126191 254519 416929 197032 267455 459264
14856D59264j39788n9701K8040J87722Q3550o3828O1099o641k40926J41012j15265
$$ 459264 319476 259775 287815 475537 559087 495259 556358 549717 308791 449803 334538
14845C34538k8006O3022Q1360A49308L71634J1196j38187K4662j06180A50059
$$ 334538 306532 369554 450914 149308 520942 532138 393951 418613 312433 150059
14834B30301M46297C10841K88371j00958p4548L8060j03194K52352r7350j48510
$$ 230301 676598 310841 599212 498254 423706 461766 358572 610924 513574 365064
14824C65064r2601J78652A27615j0753K96721A98105K47252j5262M85355m24541
$$ 365064 272463 451115 127615 116862 413583 198105 445357 430095 915450 490909
14814D90909J21786r7435A46036K83368q7767K40199k06329J07061j44475a6668
$$ 490909 612695 515260 146036 429404 341637 581836 375507 482568 338093 -16668
14803G01973B72616M81156k76077m2880J32280j57436K08781n4359J24903j12504
$$ 701973 272616 753772 477695 434815 567095 409659 618440 564081 688984 576480
14793E76480l4281B34830M97938m2525B57030O99617m26482K63610K6132B10600
$$ 576480 542199 234830 732768 690243 257030 956647 530165 793775 819907 210600
14782D51064K27751B83042K94268K16198k78211K50587n09k84648L87276C89215
$$ 451064 678815 283042 577310 793508 515297 765884 765375 480727 868003 389215
14771E31126K52240o9358C42160Q9281K31542l01384N03608j41251n0995k4485
$$ 531126 783366 714008 342160 431441 662983 361599 865207 723956 672961 648476
14761F48476L4806M9814r9007j83320K63962n0988L4241k63940J58610j45553
$$ 648476 683282 733096 634089 450769 714731 663743 697984 434044 592654 447101
14751D47101K6774K36395k87861K39936k3907j44665k29351R822M01942P9008
$$ 447101 473875 710270 422409 662345 638438 493773 264422 274244 676186 755194
14741G55194j29291j6281N578J77544j11278k48346J72794P0216J86541L38609
$$ 755194 625903 609622 615200 792744 681466 433120 605914 676130 862671 1201280
14731A201280l50496D16054O29672j07476k78122p5696j04967M70841j65028K05688
$$ 1201280 850784 416054 1045726 938250 660128 584432 479465 950306 785278 990966
14721I90966m6916m11742L76212m22618N02054j23545L9045k28395q0109L12726
$$ 990966 944050 532308 908520 485902 987956 864411 903456 675061 594952 907678
14711I07678N4747J15287j00731k5473l53530p2050P5587N37661l95755R5294
$$ 907678 962425 1077712 976981 951508 597978 525928 601515 1139176 743421 838715
14701H38715j26530J37990j4011M05477m14147j58202M13570j61046j9987l41281
$$ 838715 712185 850175 836164 1241641 827494 669292 1082862 921816 901829 560548
14691E60548K2204M84227j88792R4448k61771L47762m2767J32625l58589K46728
$$ 560548 582752 1066979 878187 972635 710864 1058626 1015859 1148484 789895 1036623
14681A036623L6512L9658k15911j72910K21972q1257O9238O2055o4629l13832
$$ 1036623 1073135 1112793 896882 723972 945944 864687 933925 995980 931351 617519
14671F17519N07336q8537j50384J8123J01087K79800k63710j06483k03802L87171
$$ 617519 1124855 1036318 885934 904057 1005144 1284944 1021234 914751 710949 1098120
14661A098120l45069J14930k75264L75866l30635L89008K60297j96565j49140
$$ 1098120 753051 867981 592717 968583 637948 1026956 1287253 1090688 941548
14652I41548L4930r108K71098j43088n0461j8912N7501k94247M02803j26269L30644
$$ 941548 976478 967370 1238468 1095380 1044919 1026007 1083508 789261 1192064 1065795 1396439
14641A396439k11468K00771k9803p4257R9012k05620K08177j96199Q6451J48087
$$ 1396439 1184971 1385742 1355939 1281682 1380694 1175074 1383251 1187052 1273503 1421590
14631A421590o31836M64403P7125p3896J26256K17836k30072k87202L57889k77198
$$ 1421590 789754 1254157 1331282 1257386 1383642 1601478 1371406 1084204 1442093 1164895
14621A164895j8265M03872l55847j7427L7629O1288M6722k4931O0483J57659J32244
$$ 1164895 1146630 1550502 1194655 1177228 1214857 1276145 1322867 1297936 1358419 1516078 1648322
14610A648322L7542Q7233l32584J15724J06683k64528J33450J1527J80938j29197
$$ 1648322 1685864 1773097 1440513 1556237 1662920 1398392 1531842 1543369 1724307 1595110
14600A595110k9001J34707l93747R0457P2156k30228L75814R2315J45767j57076
$$ 1595110 1566109 1700816 1307069 1397526 1469682 1239454 1615268 1707583 1853350 1696274
14590A696274n7692j72985J97095j36226K65751j91505K70891k2154m59487L03975
$$ 1696274 1638582 1465597 1662692 1526466 1792217 1600712 1871603 1849449 1389962 1693937
14580A693937Q6884q6943k18719L32912j64753K68112l13131J73898J95022K41937
$$ 1693937 1780821 1693878 1475159 1808071 1643318 1911430 1598299 1772197 1967219 2209156
14570B209156l90068M32962l50360J05758K28033m23918L92285p2678L605n4773
$$ 2209156 1819088 2252050 1901690 2007448 2235481 1811563 2203848 2131170 2134775 2080002
14560B080002M705J21335q9965J20207L76023m46607J82345J4712L25963j66262
$$ 2080002 2084707 2206042 2116077 2236284 2612307 2165700 2348045 2362757 2688720 2522458
14550B522458M00732k01844k3590P2847L05508J54841k27651P09511j01502L15512
$$ 2522458 2923190 2721346 2697756 2770603 3076111 3230952 3003301 3712812 3611310 3926822
14540C926822K84889N13821K24159P12319R28990J433055K470171M625427O683723
$$ 3926822 4211711 4725532 4949691 5662010 6591000 8024055 10494226 15119653 21803376
14531B1803376J0328278j601165j0934251o895959m216173k551559j623242r06191
$$ 21803376 32131654 30530489 19596238 12700279 8484106 5932547 4309305 3403114
14523C403114k46446l43985j82277j3343k10143j87906K95023J3612r0924J94701
$$ 3403114 3156668 2812683 2630406 2617063 2406920 2219014 2514037 2527649 2436725 2631426
14513B631426l81306j9727M82614O6186o18139L97239K18044K43589n00420K62565
$$ 2631426 2250120 2230393 2713007 2779193 2161054 2558293 2776337 3019926 2519506 2782071
14503B782071k7075R3488k31055L15137M7758j50465k70046N27802k65117M9656
$$ 2782071 2754996 2848484 2617429 2932566 2980324 2829859 2559813 3087615 2822498 2872154
14493B872154K87758j19666K02273j88423J00520j54326L02096p5634j52950M06028
$$ 2872154 3159912 3040246 3242519 3054096 3154616 3000290 3302386 3226752 3073802 3479830
14483C479830k79886K51695n4725j13636o564K27328Q7806k1896J67135j77218
$$ 3479830 3199944 3451639 3396914 3283278 3276714 3504042 3591848 3569952 3737087 3559869
14473C559869J18499J96961k2573k16495K05144K00394l21608J50706J46606J12909
$$ 3559869 3678368 3875329 3852756 3636261 3841405 4041799 3720191 3870897 4017503 4130412
14463D130412m8762Q3275Q4327K51617O7647J94980k06052j5347J55745j63402
$$ 4130412 4081650 4164925 4249252 4500869 4568516 4763496 4557444 4542097 4697842 4534440
14453D534440M4411L374J53320O173k6927K50075j00616L24422L0976j234J72035
$$ 4534440 4578851 4582225 4735545 4741718 4714791 4964866 4864250 5188672 5219648 5218414 5390449
14442E390449r8919L06007j45278J94775J83371l47659K78435l6961J21499K03014
$$ 5390449 5291530 5597537 5452259 5647034 5830405 5482746 5761181 5724220 5845719 6048733
14432F048733k64495m1245M07082j31209Q6721P2122K78374K9144q2178O5739
$$ 6048733 5784238 5742993 6150075 6018866 6105587 6177709 6456083 6485227 6403049 6468788
14422F468788M4531M38003J66201K81898m70238P3370J31597K43021J0583l564
$$ 6468788 6513319 6951322 7117523 7399421 6929183 7002553 7134150 7377171 7387754 7384190
14412G384190n7881L41099J42375J95097L8828L13216k75194K59862P3801M43798
$$ 7384190 7326309 7667408 7809783 8004880 8043708 8356924 8081730 8341592 8415393 8859191
14402H859191K43338k22450M07814k22260J64075N89601k2572j27120j21866M58989
$$ 8859191 9102529 8880079 9287893 9065633 9229708 9819309 9796737 9669617 9547751 10006740
14392A0006740L58238K57749j573L67437m7095K59183k14685L59282J62010Q2671
$$ 10006740 10364978 10622727 10621154 10988591 10941496 11200679 10985994 11345276 11507286 11589957
14382A1589957M13096N4703o3696K70013M58179K90280K4910N20002k75737N66323
$$ 11589957 12003053 12057756 11994060 12264073 12722252 13012532 13037442 13557444 13281707 13848030
14372A3848030J60699M68870L94218k1428L63722L48876J39426M12297J24843
$$ 13848030 14008729 14477599 14871817 14850389 15214111 15562987 15702413 16114710 16239553
14363A6239553L82305M43452J69180M30359J87485O10440L97508M08144J73462
$$ 16239553 16621858 17065310 17234490 17664849 17852334 18462774 18860282 19268426 19441888
14354A9441888M06835O28202L74754M68055K97963N58725M84900L66090M13904
$$ 19441888 19848723 20476925 20851679 21319734 21617697 22176422 22661322 23027412 23441316
14345B3441316P86047Q05100M01182N32212L60615M71110Q76121P00467O51114
$$ 23441316 24227363 25032463 25433645 25965857 26326472 26797582 27673703 28374170 29025284
14336B9025284P42900O93179Q08556P66683N48998J072213Q30855R05243J154930
$$ 29025284 29768184 30461363 31269919 32036602 32585600 33657813 34488668 35393911 36548841
14327C6548841P99525R73669J242673R06229J273656J203931J211053J252993
$$ 36548841 37348366 38322035 39564708 40470937 41744593 42948524 44159577 45412570
14319D5412570J628159J239707J382600J925612J436973J804076J776323J939753
$$ 45412570 47040729 48280436 49663036 51588648 53025621 54829697 56606020 58545773
14311E8545773J596170K700791J608914K413906K284006K460780K490313L130566
$$ 58545773 60141943 62842734 64451648 66865554 69149560 71610340 74100653 77231219
14303G7231219L135990K468677L481268L311571L777046L454062M074711M093583
$$ 77231219 80367209 82835886 86317154 89628725 93405771 96859833 100934544 105028127
14295A05028127M497788N125497N038003N272081N548586O122443O728704O498021
$$ 105028127 109525915 114651412 119689415 124961496 130510082 136632525 143361229 149859250
14287A49859250O874937Q073289P904598Q405578R068420R230380J0132347J0504960
$$ 149859250 156734187 164807476 172712074 181117652 190186072 199416452 209548799 220053759
14279B20053759J1075368J1656778J2154681J2933539J3561020J3835860J4555424
$$ 220053759 231129127 242785905 254940586 267874125 281435145 295271005 309826429
14272C09826429J4629552J4815690J4627184J4652860J4439936J2721099J2616547
$$ 309826429 324455981 339271671 353898855 368551715 382991651 395712750 408329297
14265D08329297J1412597J0409311J0016807Q814940P828792P130819N497243
$$ 408329297 419741894 430151205 440168012 448982952 456811744 463942563 469439806
14258D69439806L747110q7232j304769j270553n402148r355722o986152p370074
$$ 469439806 473186916 473099684 471794915 470524362 465122214 455766492 448780340 441410266
14250D41410266q880161j0621216j2767112j4138180j4635842j4742561j4499057
$$ 441410266 432530105 421908889 409141777 395003597 380367755 365625194 351126137
14243C51126137j4588153j4695284j3609105j3790234j2980488j2821885j2338273
$$ 351126137 336537984 321842700 308233595 294443361 281462873 268640988 256302715
14236B56302715j1670717j1225982j1604555j1462848j0459800j0015603r067413
$$ 256302715 244631998 233406016 221801461 210338613 199878813 189863210 180795797
14229A80795797r041194q125491p910463p284371o561925o592292n872260n733883
$$ 180795797 171754603 163629112 155718649 148434278 141872353 135280061 129407801 123673918
14221A23673918n283435n226944m642430m438265l850722m022601l930036l543566
$$ 123673918 118390483 113163539 108521109 104082844 100232122 96209521 92279485 88735919
14213H8735919l529664l670672k435820l188028k577318k463495k562811k438090
$$ 88735919 85206255 81535583 79099763 75911735 73334417 70870922 68308111 65870021
14205F5870021k097747k000655k119839k246006j541891j681517j472761j542232
$$ 65870021 63772274 61771619 59651780 57405774 55863883 54182366 52709605 51167373
14197E1167373j465223j490219j693926j522953p24822j245612j316454q92390
$$ 51167373 49702150 48211931 46518005 44995052 44270230 43024618 41708164 40815774
14189D0815774j352643j226552p25493j236166n16061j041993j032138r21997
$$ 40815774 39463131 38236579 37511086 36274920 35758859 34716866 33684728 32762731
14181C2762731o95047p75188j153487o64162n34225n26490o18292r69663n00531
$$ 32762731 32067684 31292496 30139009 29474847 28940622 28414132 27795840 26826177 26325646
14172B6325646o80880n11210p48845k65037m84010q02693n04792n06003j38911
$$ 26325646 25644766 25133556 24384711 24119674 23635664 22832971 22328179 21822176 21683265
14163B1683265p11814N2707o82300k74097k48718n07803o05138j99317o54576
$$ 21683265 20971451 21024158 20341858 20067761 19819043 19311240 18706102 18506785 17852209
14154A7852209K8098n45992l52558m66803n83081J54419j52283k96603k68246
$$ 17852209 17880307 17334315 16981757 16514954 15931873 16086292 15934009 15637406 15369160
14145A5369160m48612j2320m41805k59294j78671k14856j44168o0681m42712k3653
$$ 15369160 14920548 14908228 14466423 14207129 14028458 13813602 13669434 13608753 13166041 13142388
14135A3142388o09033k13607o8116p5343l21154k67600M4301r9533l20761k69633
$$ 13142388 12533355 12319748 12251632 12176289 11855135 11587535 11631836 11532303 11211542 10941909
14125A0941909k41810J81329k31070m56625Q012L8793k48992m6598p1395l12691
$$ 10941909 10700099 10881428 10650358 10193733 10201745 10240538 9991546 9944948 9873553 9560862
14115I560862J9475L5146m61596K2589k83843J72139m82655L96665k99588l64711
$$ 9560862 9580337 9615483 9153887 9176476 8892633 9064772 8582117 8978782 8679194 8314483
14105H314483Q3220l58294j94340R20K8892R0898l59519j89684J26782l76006
$$ 8314483 8397703 8039409 7845069 7845989 7874881 7965779 7606260 7416576 7543358 7167352
14095G167352l1934K17508j06478m70819o4053J3658P813o9207p9010k7593j71242
$$ 7167352 7135418 7352926 7246448 6775629 6711576 6725234 6733047 6663840 6584830 6557237 6385995
14084F385995k17068L7056K82302k73786q6548j94151j93940Q6128J13478o37404
$$ 6385995 6168927 6205983 6488285 6214499 6127951 5933800 5739860 5825988 5939466 5302062
14074E302062L75166q3114K6122p6010r6794k78756J46068m2993k85229N83323
$$ 5302062 5677228 5594114 5620236 5544226 5447432 5168676 5314744 5271751 4986522 5569845
14064E569845m85288M5752k7669k78872K86799n8803k67921j49505o6615K23929
$$ 5569845 5084557 5130309 5102640 4823768 5110567 5051764 4783843 4634338 4567723 4791652
14054D791652j61734M5375m46438Q2709l73110O62574J9708k98889M7899j34870
$$ 4791652 4629918 4675293 4228855 4311564 3938454 4601028 4620736 4321847 4369746 4234876
14044D234876m0810L26394j54994l28709K51407l59502l31118N00949k21215r9817
$$ 4234876 4194066 4520460 4365466 4036757 4288164 3928662 3597544 4098493 3877278 3777461
14034C777461L3445j52593M970j49675K24702m43900L89705j00114k78651M4973
$$ 3777461 3810906 3658313 3663283 3513608 3738310 3294410 3684115 3584001 3305350 3350323
14024C350323j85182J06737k92329N82528L7803n9432k68400L22720m15862J43398
$$ 3350323 3165141 3271878 2979549 3562077 3599880 3540448 3272048 3594768 3178906 3322304
14014C322304j98708J43360k07090J73098m98636N27410J3727q0863l50478K8535
$$ 3322304 3123596 3266956 3059866 3232964 2734328 3261738 3275465 3194602 2844124 2872659
14004B872659L6709j89006J78203l90302L15357K04501l47551J17590k01165J22926
$$ 2872659 2909368 2720362 2898565 2508263 2823620 3028121 2680570 2798160 2596995 2719921
13994B719921K60835n2140m52855K58702k11796j29910J53983R5588J27591l25906
$$ 2719921 2980756 2928616 2475761 2734463 2522667 2392757 2546740 2642328 2769919 2444013
13984B444013L1832j05087M54709q0512K91887Q9434j81405M66127Q71896R10114
$$ 2444013 2475845 2370758 2825467 2744955 3036842 3126276 2944871 3410998 4282894 5193008
13974E193008J756304L238774O121113J0200555M071256q979792o156350l862724
$$ 5193008 6949312 10188086 16309199 26509754 30581010 21601218 15444868 11582144
13966A1582144l235482j817912j191658m41544o69357j97454m19354j80023o987
$$ 11582144 8346662 6528750 5337092 4895548 4226191 4028737 3609383 3429360 3422373
13957C422373n57172L89161l53848l5139J26903k33523J7675n8768M240n1997
$$ 3422373 2865201 3254362 2900514 2865375 2992278 2758755 2776430 2717662 2721902 2669905
13947B669905l40307q1328j88377M8185Q4137p2531K88606k8366o00658M53539
$$ 2669905 2329598 2248270 2059893 2108078 2192215 2119684 2408290 2379924 1779266 2232805
13937B232805K8829m58184m9445K60194J15380k94544Q7608L15424k59511k18496
$$ 2232805 2261634 1803450 1754005 2014199 2129579 1835035 1922643 2238067 1978556 1760060
13927A760060K21160m98070L39977k58848L17995p4895K0405N6337k6714o1084
$$ 1760060 1981220 1483150 1823127 1564279 1882274 1807379 1827784 1884121 1857407 1796323
13917A796323P1798k09050j29332K86602N1385k84681R1037Q6286j34389m9662
$$ 1796323 1868121 1659071 1529739 1816341 1867726 1583045 1674082 1760368 1625979 1576317
13907A576317k93005L34855m7107j54274J24656j48785K36379k25474J74820J50803
$$ 1576317 1283312 1618167 1571060 1416786 1541442 1392657 1629036 1403562 1578382 1729185
13897A729185k56508K04468K24262n90501J19423J46402l8303M823o0363K63318
$$ 1729185 1472677 1677145 1901407 1310906 1430329 1576731 1538428 1543251 1482888 1746206
13887A746206k14543j97292M6737J77135l77702O34809k60140k20967J00227J69395
$$ 1746206 1531663 1334371 1381108 1558243 1180541 1815350 1555210 1334243 1434470 1603865
13877A603865k16496p638l27913N27239l35912j44102J65964l77153N51437p8962
$$ 1603865 1387369 1379731 1051818 1579057 1243145 1099043 1265007 887854 1439291 1360329
13867A360329K58350k89124k3031J92737k26006K58841j12588j38760j00057P6750
$$ 1360329 1618679 1329555 1306524 1499261 1273255 1532096 1419508 1280748 1180691 1257441
13857A257441K09181l43434O2372l5034O9561j59529k14589Q4278K24276K8518
$$ 1257441 1466622 1123188 1185560 1150526 1220087 1060558 845969 930247 1154523 1183041
13847A183041K34635l25677J14888O7837m16662K95851J91174k11070k2763l39270
$$ 1183041 1417676 1091999 1206887 1274724 858062 1153913 1345087 1134017 1111254 771984
13837G71984J48482P6851M41459q3495O1152l91204Q4959Q6434Q1097n22794K68050
$$ 771984 920466 997317 1438776 1355281 1416433 1025229 1110188 1196622 1277719 754925 1022975
13826A022975j50686J74150K4686n01466R62967m76632L4510J13096l28872K67849
$$ 1022975 872289 1046439 1071125 569659 1532626 1055994 1090504 1203600 874728 1142577
13816A142577j61419k6686J90475k8705m2278j60050q9998o3873J93789p0348
$$ 1142577 981158 954472 1144947 1116242 1073964 913914 823916 760043 953832 883484
13806H83484J64787q1713k22940j08728M88180j38293j25509p8935l9504k661
$$ 883484 1048271 966558 743618 634890 1123070 984777 859268 780333 740829 738168
13796G38168J46188M64369n05059J31914N3338l6140K14928l71146J61012j15575
$$ 738168 884356 1348725 843666 975580 1028918 992778 1207706 836560 997572 881997
13786H81997j28067Q3244J63424m51025N40156l09324j68280J08270M61844n04500
$$ 881997 753930 837174 1000598 549573 1089729 780405 612125 720395 1182239 677739
13776F77739Q6343q7784m2942L56205L0822k44923j4008j92166K16367l51496
$$ 677739 764082 676298 633356 989561 1020383 775460 761452 569286 785653 434157
13766D34157O11883K6247m3712p8018k54088L55710l7031l14175K27853K12634
$$ 434157 1046040 1072287 1028575 950557 696469 1052179 1015148 700973 928826 1141460
13756A141460k64349J51500n08468j1740J46954o7086J67584J29569K8736j5985
$$ 1141460 877111 1028611 520143 508403 655357 588271 755855 885424 914160 898175
13746H98175k46033K87659k4493j54198k51424M332J64813n6442k7828K57564
$$ 898175 652142 939801 915308 761110 509686 514018 678831 622389 594561 852125
13736H52125k54399M54821n15409M48125o6613j0078P3802C35941L69570j6371
$$ 852125 597726 1052547 537138 985263 918650 908572 982374 335941 705511 689140
13726F89140J48368l32666J42305K79140l71274N4603N1445J5781j08065L40609
$$ 689140 837508 504842 647147 926287 555013 609616 661061 676842 568777 909386
13716I09386p0434l50271J36480K41027l83185J31698J39733k40756Q2078L14265
$$ 909386 838952 488681 625161 866188 483003 614701 754434 513678 595756 910021
13706I10021j17740l36484L04795l79589L73951j31768j35685j73749L88684r3415
$$ 910021 792281 455797 760592 381003 754954 623186 487501 313752 702436 609021
13696F09021k40628K18940J22366J0271C56709L63490C36974M11538j79403j20532
$$ 609021 368393 587333 709699 719970 356709 720199 336974 748512 569109 448577
13686D48577J29220r0617R2912p6563R1322P0996K4658l6770N971l4841k39898
$$ 448577 577797 487180 580092 503529 594851 665847 690505 653735 659706 624865 384967
13675C84967J53400j37008K82451j50480J29030J26297B85975L67084j95862J76897
$$ 384967 538367 401359 683810 533330 662360 788657 285975 653059 457197 634094
13665F34094J73644k10101j92496m5932J20568J99566q8179q6256O8001k26863
$$ 634094 807738 597637 405141 359209 479777 679343 591164 504908 572909 346046
13655C46046L78955N6602B03336M31171j48392m1076J95367k27064m9266j26294
$$ 346046 725001 781603 203336 634507 486115 445039 640406 413342 364076 237782
13645B37782N37260m043l49210K33469m6686j03603k17032j04989K05236N780
$$ 237782 775042 770999 421789 655258 608572 504969 287937 182948 388184 393964
13635C93964O8716k5869P6025j44663J13611j16179K36144k58544K20798k8113
$$ 393964 462680 436811 512836 368173 481784 365605 601749 343205 564003 535890
13625E35890r650J05203k40768Q224J25132K74307P2969l37182P6895J16878k76388
$$ 535890 526240 631443 390675 398899 524031 798338 871307 534125 611020 727898 451510
13614D51510J35311B22883J53979M7524j20807L19060k76206K44927A67997K86836
$$ 451510 586821 222883 376862 424386 303579 622639 346433 591360 167997 454833
13604D54833A03667P84683D31322J55098j69402j09512j28749K27401j92648N89762
$$ 454833 103667 888350 431322 586420 417018 307506 178757 406158 213510 803272
13594H03272B34744K34015p2388J54552J20189O1246l44270Q5343j49673O4378
$$ 803272 234744 468759 396371 550923 671112 732358 388088 473431 323758 388136
13584C88136q3850j35808L43562n7567J25825B14255J30823K222o8226j01342
$$ 388136 304286 168478 512040 454473 580298 214255 345078 347300 279074 177732
13574A77732M91337A17615N68773j11777k65447A13171M75826B44040A5779M41307
$$ 177732 669069 117615 686388 574611 309164 113171 588997 244040 15779 457086
13564D57086I5125P9715J26793J36599I7781N5035N88141j93102M7774n553k30768
$$ 457086 95125 174840 301633 438232 97781 152816 740957 547855 595629 590076 359308
13553C59308j49834K10349J61868L6705j93197o5447K27244B05195K76102A02093
$$ 359308 209474 419823 581691 618396 425199 359752 586996 205195 481297 102093
13542B61957J7515P2363A51631L35111o822D4338O04032j55100j33075J27219
$$ 261957 279472 351835 151631 486742 479920 44338 648370 493270 360195 487414
13532D87414j86784K32146A79320J15179Q6892j13186K44899J26078j49578G2208
$$ 487414 300630 532776 179320 294499 381391 268205 513104 639182 489604 72208
13521C30576M9641K46035k04338j41978M1870J33481J08696k30392K28458j45691
$$ 330576 380217 626252 421914 279936 321806 455287 563983 333591 562049 416358
13511D16358I6387M47370J757A87932P1000J72756G5105J25107O9825A05356M80766
$$ 416358 96387 543757 545514 187932 258932 431688 75105 200212 270037 105356 586122
13500E86122k48060b26850E50139j15352A53068N6882m0775q2776K50540A42725
$$ 586122 338062 -226850 550139 434787 153068 209950 169175 86399 336939 142725
13489D49708M8758j33033j48040J67511M5679j80888q8882K06176P961K0875E2417
$$ 449708 498466 365433 217393 384904 430583 249695 160813 366989 374950 395825 52417
13477B28114M7142A33352B0001L01813j25076b2066C76803K17260a05130B80623
$$ 228114 275256 133352 20001 321814 196738 -22066 376803 594063 -105130 280623
13466A56972J22358q221A4603K91613J01443J14605B10990K04301m1657q4482
$$ 156972 279330 271109 14603 306216 407659 522264 210990 415291 373634 289152
13456B89152a7171B9472p056M58753A32994L65162A75962K06042p6300K97699
$$ 289152 -17171 29472 22416 481169 132994 498156 175962 382004 305704 603403
13446F03403B66715J38405j49333H4528K76491j30650K74502k32858p368R6583
$$ 603403 266715 405120 255787 84528 361019 230369 504871 272013 264645 361228
13436C61228J58398B29369O7362A05173m3158L32200j84169f2832C62771j34658
$$ 361228 519626 229369 296731 105173 62015 394215 210046 -62832 362771 228113
13426B28113R8534K76870g5604C60011b6271B95432j20854L22122B26242N2129
$$ 228113 326647 603517 -75604 360011 -26271 295432 174578 496700 226242 278371
13416B78371m4719K32871F2188R8564n6410m1957K79546l0360D9737M26914F1373
$$ 278371 233652 466523 62188 160752 104342 62385 341931 311571 49737 476651 61373
13404A76207p4107M80590B58069E0625R5762B1037L25162A41581P6273f6609B44056
$$ 176207 102100 582690 258069 50625 146387 21037 346199 141581 217854 -66609 244056
13392C06831L4706q5767p1387J79747j42107Q8523j17342C6340J96472n0126K66032
$$ 306831 341537 255770 184383 364130 222023 310546 193204 36340 232812 182686 448718
13381D48718A25177J42584H8131J2387N3176B7885M348N0005J62060Q8176A02686
$$ 448718 125177 267761 88131 100518 153694 27885 32233 82238 244298 332474 102686
13369C83889A75818J13731A41020O342L27891k11054q5074K58641A73340L16566
$$ 383889 175818 289549 141020 147362 475253 264199 179125 437766 173340 489906
13359D89906B23505J7455J48179m8512j54566J03162b2022H5401K10252r7809
$$ 489906 223505 240960 389139 340627 186061 289223 -22022 85401 295653 197844
13349A97844O7175Q8574a0465G770J95830m9557K8950m3153N8051J65945k6693
$$ 197844 265019 353593 -10465 7770 203600 154043 182993 139840 197891 363836 337143
13338C37143d0571I930K79334Q9212K44836A28748J86792J49723A98392J49504
$$ 337143 -40571 9930 289264 378476 623312 128748 315540 465263 198392 347896
13328C47896m6333J02638l6362N3248J23281j15678j71476N5752K7146f4035B85189
$$ 347896 301563 404201 367839 421087 544368 428690 257214 312966 340112 -64035 285189
13316B47592n6281o7534j6528a03166C10060n5889a79638A55914K48243E4244
$$ 247592 191311 123777 107249 -103166 310060 254171 -179638 155914 404157 54244
13305B56208d337A66086N8689L58886B78532k221G9126K77359A11049Q8468R121
$$ 256208 -4337 166086 224775 583661 278532 276311 79126 356485 111049 199517 208638
13294B08638M0993H2717K39797j05489d5271C31050R7911m938j68236F374Q1028
$$ 208638 249631 82717 322514 217025 -45271 331050 428961 424023 255787 6374 87402
13283H7402l7644a41487B90040A28845J81106G772R3458A7163K37688H1514l0585
$$ 87402 49758 -141487 290040 128845 309951 7772 101230 17163 254851 81514 50929
13272E0929R3388K45418A90743J42770a0052J80E6920J79271b6306n7416A88134
$$ 50929 144317 389735 190743 333513 -10052 -9872 56920 236191 -26306 -83722 188134
13260H6219c8679A88510M3686P0678m9820r1949A1594K32730K91916b62430A86465
$$ 86219 -38679 188510 232196 302874 253054 161105 11594 244324 536240 -262430 186465
13248C33994A46493R1645l7387m7298a03942C96579m9418b0660r0630D58536c2246
$$ 333994 146493 238138 200751 153453 -103942 396579 347161 -20660 -111290 458536 -32246
13236B70733a27358A58491P0117b0073C76856A80156b6885r6363D28264A27371
$$ 270733 -127358 158491 228608 -20073 376856 180156 -26885 -123248 428264 127371
13225b45558C8096J46843I1809F845J01498K3671C4790Q7293K41771A8181m85
$$ -245558 38096 184939 91809 6845 108343 132014 34790 122083 363854 18181 17696
13214A7696J91199e4730B38963l7250p0374K94178A3000J1161a61671B34762l9751
$$ 17696 208895 -54730 238963 201713 131339 425517 13000 24161 -161671 234762 195011
13203A95011N29046b63538a29752C16533j5769H4633K2062d7836H8276Q6670J10900
$$ 195011 724057 -263538 -129752 316533 300764 84633 106695 -47836 88276 174946 285846
13192B85846j36425J5497K07714R3175D627J17558a18781A51086K3725O3684I1066
$$ 285846 149421 164918 372632 465807 4627 122185 -118781 151086 174811 238495 91066
13180A61613o0217b53481g3432L3047j67162B17295k3876F9854M6741M0757K53010
$$ 161613 101396 -253481 -73432 -40385 -207547 217295 193419 69854 116595 157352 410362
13169D10362e1277J2365l1443B02175J5919R7019A19898J44552j2191k2992O6784
$$ 410362 -51277 -38912 -70355 202175 218094 315113 119898 264450 252259 229267 296051
13158B96051A34268E7428a8845j45076A00596Q0391E0530K16110F8271a11753
$$ 296051 134268 57428 -18845 -163921 100596 180987 50530 266640 68271 -111753
13147B08803B6420K47297j24927K77l3767e5923F1601J21482g8982C9818K4698
$$ 208803 26420 273717 148790 149067 115300 -55923 61601 183083 -78982 39818 64516
13136F4516j6792J03985R0041m778J6767j06715C3297a5706B54309A1568L95215
$$ 64516 47724 151709 241750 236972 253739 147024 33297 -15706 254309 11568 406783
13125D06783H2361J39141G5972L8512q952J60722A04297K20801D8078g6523B11108
$$ 406783 82361 221502 75972 114484 105532 266254 104297 325098 48078 -76523 211108
13113B0317J85334F0843K79458b7220A59200J12065D8393J04763E088J50531J1703
$$ 20317 205651 60843 340301 -27220 159200 271265 48393 153156 5088 155619 167322
13102A67322C4469J78322J93452H4077h673k22894C41355A44080A6990F428K54114
$$ 167322 34469 212791 406243 84077 -8673 -231567 341355 144080 16990 6428 260542
13091B60542b89240A66620J42045b77152h6200D8726J83479A10025M0460K67007
$$ 260542 -289240 166620 308665 -277152 -86200 48726 232205 110025 150485 417492
13081D17492E8361K62834A59969J02203m4792b23310C41923c3660E8438K5720
$$ 417492 58361 321195 159969 262172 217380 -223310 341923 -33660 58438 84158
13071H4158A8975P8097K06260j41343P3491m2173i7262B53180g6907A83512b95757
$$ 84158 18975 97072 303332 161989 235480 193307 -97262 253180 -76907 183512 -295757
13059B01724a05615j807b2882I6483J02383d21797a7971B4532N922K92807C8986
$$ 201724 -105615 -107422 -22882 96483 198866 -421797 -17971 24532 30454 323261 38986
13047E2550J83406b23519B91631i289A94113D3687K23640e6820F4032R6M09570
$$ 52550 235956 -223519 291631 -9289 194113 43687 267327 -56820 64032 64128 473698
13036D73698E0405L8253k9807h5846A57693M36892C9541a37260j6480B27126I3318
$$ 473698 50405 88658 58851 -85846 157693 594585 39541 -137260 -153740 227126 93318
13024A18556M4073J56506b32767A95778o8147a58011D7115N01211k20490p2758
$$ 118556 162629 319135 -232767 195778 127631 -158011 47115 548326 327836 255078
13014B55078D6120J70115J559l7914o5462h2896j48170A16292i9375E7379J66587
$$ 255078 46120 216235 217794 179880 114418 -82896 -231066 116292 -99375 57379 223966
13003B23966D4300a38252A68054Q7685A4993K44952p8192Q525m4033g7860G9139
$$ 223966 44300 -138252 168054 255739 14993 259945 181753 190278 146245 -77860 79139
12991C70001I8325k8239M07774N671a65769B36299M1375a52366A39872J52392
$$ 370001 98325 70086 477860 483531 -165769 236299 277674 -152366 139872 292264
12981B92264q0916o0087b20434B297J36624R2519q2237i406j81621A20632K69934
$$ 292264 211348 151261 -220434 2297 138921 231440 149203 -9406 -191027 120632 390566
12970C90566A64214p0651m5258b24977E209K19509b2000B05344b15089B24412
$$ 390566 164214 93563 48305 -224977 5209 224718 -22000 205344 -215089 224412
12959b4570A92070I4153d3459A69415L7370c4614C5325J7024M6568D7003B873
$$ -24570 192070 94153 -43459 169415 206785 -34614 35325 52349 98917 47003 2873
12947d1290A35084o6530a69614H965b98952B76872c3777l5217J7501A67050o3718
$$ -41290 135084 68554 -169614 8965 -298952 276872 -33777 -68994 -51493 167050 103332
12936A03332i0853b669m0674q1754e4933B06109j2419n7212F2073J16848c6205
$$ 103332 -90853 -2669 -43343 -125097 -54933 206109 193690 136478 62073 178921 -36205
12924E9313J02563d746A24483j8993O2333q0092A5882a60548H2632R1281B8131
$$ 59313 161876 -4746 124483 105490 167823 87731 15882 -160548 82632 173913 28131
12912G9190a83138b7150A33937J02198a24702B58697F236L94634A55701a58269
$$ 79190 -183138 -27150 133937 236135 -124702 258697 6236 400870 155701 -158269
12901A47173L5571O020P2181I9154P5383b7565C5759L05967a52319A15870j6452
$$ 147173 182744 188764 260945 99154 174537 -27565 35759 341726 -152319 115870 99418
12890I9418E829J39729J6957a03756k8022A00416d73629A42779e2236B59940F742
$$ 99418 5829 145558 162515 -103756 -131778 100416 -473629 142779 -52236 259940 6742
12878c8606C2292K29541i5021C43413b7876A82688G2096j6141L91861a06546j32976
$$ -38606 32292 261833 -95021 343413 -27876 182688 72096 55955 447816 -106546 -239522
12867b39522B91728A800J81245J19051m2504K0154a90853A62619m3575a7047j48096
$$ -239522 291728 1800 183045 302096 259592 279746 -190853 162619 119044 -17047 -165143
12856a65143p4945C75236b00193C82459f6157A72063a20505G2945i4718A00598
$$ -165143 -240088 375236 -200193 382459 -66157 172063 -120505 72945 -94718 100598
12845D7295g4885D7663P6285n5818a79082B0176g8365B8715a71395A67618F4706
$$ 47295 -74885 47663 123948 68130 -179082 20176 -78365 28715 -171395 167618 64706
12833e0936A36439e2440C3702b86207E7711L90085a33947B36714H422J65504E2776
$$ -50936 136439 -52440 33702 -286207 57711 447796 -133947 236714 8422 173926 52776
12821A69756c22720B6174h7496G2738J36749q5208l9673J06821P719A7387a92322
$$ 169756 -322720 26174 -87496 72738 209487 124279 84606 191427 199146 17387 -192322
12809G9595a01448r5046p0438M480H142e2733N118B62847G3389a54217A25682
$$ 79595 -101448 -196494 -266932 -262452 8142 -52733 -47615 262847 73389 -154217 125682
12797A95408b73877a0959B44108n8393J75823A14295b4186E1592a71704k5862
$$ 195408 -273877 -10959 244108 185715 361538 114295 -24186 51592 -171704 -197566
12787a97566D19321j88245j05281M2768b93112J32916B12162b1306l66072F8021
$$ -197566 419321 231076 125795 168563 -293112 -160196 212162 -21306 -387378 68021
12776A89775m9458b08199i1579k7787l6736F6611C1891g8739I7859L8410o4128
$$ 189775 140317 -208199 -91579 -119366 -156102 66611 31891 -78739 97859 136269 72141
12765G2141c15411B47958o6117G9318L9953j2302c0668A77589J05321A7895a4137
$$ 72141 -315411 247958 181841 79318 119271 106969 -30668 177589 282910 17895 -14137
12753e4499C34565j32384J9074d55122A38321a96676A96203F1856f4945A95145
$$ -54499 334565 202181 221255 -455122 138321 -196676 196203 61856 -64945 195145
12742a07521j19225A02123a85241l6406A06870e6668m3676A89878J1636G7989
$$ -107521 -226746 102123 -185241 -221647 106870 -56668 -100344 189878 201514 77989
12731E2156K59056j41769q0546d3168o1764l6727A43067Q5153L11299A97064J48025
$$ 52156 311212 169443 88897 -43168 -104932 -141659 143067 228220 539519 197064 345089
12720C45089b2896B39015I2337C9174J01517k0906R2499k4439E0333d7752R078
$$ 345089 -22896 239015 92337 39174 140691 119785 212284 187845 50333 -47752 -38674
12709c8674A26766l4983a90514A6623b86836R825g2656a5551A0243O7028a36890
$$ -38674 126766 91783 -190514 16623 -286836 -277011 -72656 -15551 10243 77271 -136890
12697f9299A66464a1208k72131G3988O4374a79610A42284e0386k4105A65161a86848
$$ -69299 166464 -11208 -283339 73988 138362 -179610 142284 -50386 -74491 165161 -186848
12685b56922J04693M4798j92144I7125K13978a2897k3799A02376b7398j15200
$$ -256922 -152229 -107431 -299575 97125 311103 -12897 -36696 102376 -27398 -142598
12675a42598C5965K8408j9163h6859H9762a91229A23628M9638K36065C7789a16818
$$ -142598 35965 64373 45210 -86859 89762 -191229 123628 173266 409331 37789 -116818
12663B97987j7986F2482a79782B03922o7106L8788O2646A18046L79863A10750
$$ 297987 280001 62482 -179782 203922 136816 175604 238250 118046 497909 110750
12652c47257A75588c42826J11547h5684B97115N6126D3841L4870n954B8406K29567
$$ -347257 175588 -342826 -231279 -85684 297115 353241 43841 78711 72757 28406 257973
12641B57973a28789e4911A20407J9828m8709I542b26703B54690K62787A11075
$$ 257973 -128789 -54911 120407 140235 91526 9542 -226703 254690 517477 111075
12630I5705b2998B55930A24560J87562a70953A44712l0419J99496b9704B23142
$$ 95705 -22998 255930 124560 312122 -170953 144712 114293 313789 -29704 223142
12619D4386K5503J15809H4746j6286K55907A28390K65057j58827k8038j0383d1394
$$ 44386 69889 185698 84746 68460 324367 128390 393447 234620 206582 196199 -41394
12607A78355N210L04619c5240B62858B2895L28840j25913a0219A85646J47499
$$ 178355 183565 488184 -35240 262858 22895 351735 225822 -10219 185646 333145
12597C33145b8655a0866o5715B86507k0159d4766k42452P5826H7371a48487C02535
$$ 333145 -28655 -10866 -76581 286507 266348 -44766 -287218 -211392 87371 -148487 302535
12585C2622J74730J4046I9180L3382J82852a64553E7688J80598j04063a2316B42845
$$ 32622 207352 221398 99180 132562 315414 -164553 57688 238286 134223 -12316 242845
12573A16088J20600o4224g6615j47421d0867l35614B31922J2129F0202a29410
$$ 116088 236688 172464 -76615 -224036 -40867 -376481 231922 244051 60202 -129410
12562A33943b51650J08868O3122J8392j04128r0435c5656B29595A00969J55272
$$ 133943 -251650 -142782 -79660 -61268 -165396 -255831 -35656 229595 100969 256241
12552B56241A15234J78381J30515j74778L3114G0261a76836e4946q6437h197I5987
$$ 256241 115234 293615 424130 249352 282466 70261 -176836 -54946 -141383 -8197 95987
12540a0317l9574A58108f5415A80393i1721B09659I2268l9225d3645a4868n2565
$$ -10317 -49891 158108 -65415 180393 -91721 209659 92268 53043 -43645 -14868 -67433
12529f7433C2374L1290O3364a25513k1548A99758j6544m2897L0174A06K14260
$$ -67433 32374 63664 127028 -125513 -147061 199758 183214 140317 170491 106 214366
12518B14366h0448D1146b15823D9943b11086D02486a8986D3402J18485d1324D55929
$$ 214366 -80448 41146 -215823 49943 -211086 402486 -18986 43402 161887 -41324 455929
12506I7720c7051L77B7817a978B72403A084a19364A62686c0065B01777O5239a86682
$$ 97720 -37051 -36674 27817 -1978 272403 1084 -119364 162686 -30065 201777 267016 -186682
12493c03255C13966b9879C85736a61652F9144a70227B20059K0687A0024J78142
$$ -303255 313966 -29879 385736 -161652 69144 -170227 220059 240746 10024 188166
12483A88166a29988D8991K06010l0679a17672k4940c3063B15998N8128a62530
$$ 188166 -129988 48991 255001 224322 -117672 -142612 -33063 215998 274126 -162530
12472A21994b58241F3801L415a79379r5988h6115K1459R221n2063l0767B6984
$$ 121994 -258241 63801 67216 -179379 -275367 -86115 -64656 -55435 -107498 -138265 26984
12460G6772M86673a19337A67179p6644L29676a87207A56142H442P8587L25567
$$ 76772 563445 -119337 167179 90535 420211 -187207 156142 8442 87029 412596
12450D12596A04102i1846b6795C51471B8122Q1043A3697b75524a4730C40161E395
$$ 412596 104102 -91846 -26795 351471 28122 109165 13697 -275524 -14730 340161 5395
12438f4623j74941a12446B32886d4982n5026A16474E5497K14137a74013B6051
$$ -64623 -239564 -112446 232886 -44982 -100008 116474 55497 269634 -174013 26051
12427F158J32616N3607a29933n6002A9324J38142m2919Q3727I2580a22308B43729
$$ 6158 138774 192381 -129933 -185935 19324 157466 114547 198274 92580 -122308 243729
12415A31939d4741b2199j59214l8642d0557j05791D3000e761o1892I5209J25180
$$ 131939 -44741 -22199 -181413 -220055 -40557 -146348 43000 -5761 -67653 95209 220389
12404B20389c53426A77142a96713c999j98189N8998n4703h2335l1222B2258h4011
$$ 220389 -353426 177142 -196713 -3999 -202188 -143190 -197893 -82335 -113557 22258 -84011
12392A01567L3108e1397B2361b34171A47121J769l6590a31625j66923Q9929e2207
$$ 101567 134675 -51397 22361 -234171 147121 148890 112300 -131625 -298548 -208619 -52207
12380c95027a20254e5377j01508B71123H0583b85703E25655g1052A31463h2960
$$ -395027 -120254 -55377 -156885 271123 80583 -285703 525655 -71052 131463 -82960
12369a35196C99219C6652g1762p6436C69643b48992A2076a59699e3263A64740
$$ -135196 399219 36652 -71762 -148198 369643 -248992 12076 -159699 -53263 164740
12358b3087A12382b11222A5156e2576a9912n8277B03523D4689R2600R3769c50896
$$ -23087 112382 -211222 15156 -52576 -19912 -78189 203523 44689 137289 231058 -350896
12346A23193b78944A13653d8722E9957f9027I6673b54898A3698e4521k42475a46743
$$ 123193 -278944 113653 -48722 59957 -69027 96673 -254898 13698 -54521 -296996 -146743
12334B63474B7114d1905j69417C85892c45974F7574B9255F117e1420k64380C77705
$$ 263474 27114 -41905 -211322 385892 -345974 67574 29255 6117 -51420 -315800 377705
12322A38795J96679a85244f5312B83429J5653A9724Q5772g534j89918D1499K26795
$$ 138795 335474 -185244 -65312 283429 299082 19724 105496 -7534 -197452 41499 268294
12311B68294r6207b0373q0726j75194c0549A32407B1591R4243b03068j84490E8626
$$ 268294 172087 -20373 -101099 -276293 -30549 132407 21591 115834 -203068 -387558 58626
12299C29329e8163m8806B02421a27568q1070A66041d7136I8695a08959A22918
$$ 329329 -58163 -106969 202421 -127568 -208638 166041 -47136 98695 -108959 122918
12288b9263H5016M7982f3994B40268A2347b9122b871j99456e9138A31738a28818
$$ -29263 85016 132998 -63994 240268 12347 -29122 -2871 -202327 -59138 131738 -128818
12276B4369a7154A14759J5933A1641c1479p9410o642A14333M45550A75380p9498
$$ 24369 -17154 114759 130692 11641 -31479 -110889 -117531 114333 559883 175380 95882
12265I5882J39642g6263j90816A54976o1084K2552J50542a29678A67524i0029
$$ 95882 235524 -76263 -267079 154976 93892 116444 266986 -129678 167524 -90029
12254B39481G035J23409B2744N5191l5279a12806I6889A986K85400i295B76100
$$ 239481 7035 130444 22744 77935 42656 -112806 96889 1986 287386 -9295 276100
12242h8810J8937A08533b65026C30643m9514E1377L76333b12836B56850A9012
$$ -88810 -69873 108533 -265026 330643 281129 51377 427710 -212836 256850 19012
12231A84712A7316L13999A06572L2739C4124a0499A23812i5080B25157j8692Q7172
$$ 184712 17316 331315 106572 139311 34124 -10499 123812 -95080 225157 206465 293637
12220B93637g24j47891A24614R2682j5706q3098A4293L07780E1463K36483J77412
$$ 293637 -724 -148615 124614 217296 201590 118492 14293 322073 51463 287946 465358
12209D65358I1272J45647a04435k6722C62485I1118J20631L20880C1256K53704
$$ 465358 91272 236919 -104435 -131157 362485 91118 211749 532629 31256 284960
12199B84960d7011B86960r2954F675M17208A06248J1966q79a54649B62104L0178
$$ 284960 -47011 286960 194006 6675 423883 106248 118214 117335 -154649 262104 292282
12188B92282G4786B2137M56768a12758G5315K95755A64346D2528L37845g2185
$$ 292282 74786 22137 478905 -112758 75315 371070 164346 42528 380373 -72185
12177B63502f9585A38690B6118J06002K9008Q6865F9236F81a8629A67057a07064
$$ 263502 -69585 138690 26118 132120 161128 247993 69236 681 -18629 167057 -107064
12165G8083A3925a60834q7981e3699n9712H6147J3598c133D70160j99979B5209
$$ 78083 13925 -160834 -248815 -53699 -113411 86147 99745 -3133 470160 270181 25209
12153B84189E0739J29291a16607A83126a30007E6490h6326B03480a19822b3229
$$ 284189 50739 180030 -116607 183126 -130007 56490 -86326 203480 -119822 -23229
12142e2781p9299F745P8418K4436M7981i0821I9603e1029C2831M59160E0011a16904
$$ -52781 -132080 6745 85163 109599 157580 -90821 99603 -51029 32831 491991 50011 -116904
12129H6055a21291D5062c7291A26792K33475A74995b81819J34119E1345a80500
$$ 86055 -121291 45062 -37291 126792 360267 174995 -281819 -147700 51345 -180500
12118b49592A52863b1549I4301N8954E1529f8821I1736K3173a69085M7316e2422
$$ -249592 152863 -21549 94301 153255 51529 -68821 91736 114909 -169085 -121769 -52422
12106A95041a56410O5123H2711a77218A66543G7409I538K38149c165C67836E188
$$ 195041 -156410 -91287 82711 -177218 166543 77409 9538 247687 -3165 367836 5188
12094G1500L37457a77395j3901A55664d9440B93456F2296a73437d1819o0356A77438
$$ 71500 408957 -177395 -191296 155664 -49440 293456 62296 -173437 -41819 -102175 177438
12082c79120A59206b14623A54933b4169m28962g2023j69630h7638j5722p3840
$$ -379120 159206 -214623 154933 -24169 -453131 -72023 -241653 -87638 -103360 -177200
12072a77200l5130d9216j41091A7075P2970e4201C5904c02440R4475A60516e4280
$$ -177200 -212330 -49216 -190307 17075 90045 -54201 35904 -302440 -207965 160516 -54280
12060i5858C6077L0587k1309J78697e1004A39425E4242K67849c1659C07344M7931
$$ -95858 36077 66664 45355 224052 -51004 139425 54242 322091 -31659 307344 355275
12049C55275R62017l88566B39565q7153C752R2555e5780j70119p6493F3919a2069
$$ 355275 1317292 928726 239565 152412 3752 96307 -55780 -225899 -302392 63919 -12069
12037f5935E10399a40424B46001b6977A07061l5607b73039G2408b69487c6307
$$ -65935 510399 -140424 246001 -26977 107061 71454 -273039 72408 -269487 -36307
12026B38655E7596a80079b0349C33559b8329E1378c9474n7868l9615E2104J92561
$$ 238655 57596 -180079 -20349 333559 -28329 51378 -39474 -97342 -136957 52104 244665
12015B44665E5522N4363l3501b51617A84721j0399J9157e164D1079d8076I1663
$$ 244665 55522 109885 76384 -251617 184721 174322 193479 -5164 41079 -48076 91663
12003A70780a10550B72629B6679J2466j5459b46697E5100K3464N4242c47765Q5215
$$ 170780 -110550 272629 26679 39145 23686 -246697 55100 78564 132806 -347765 -262550
11992b62550J12338A08786g8272A46279L7695A4790a61877G6175M7363O936g193
$$ -262550 -150212 108786 -78272 146279 183974 14790 -161877 76175 123538 130474 -7193
11980a03262R491a9858G29c91498G9357K32233g7018j16924C7504a05632j2819
$$ -103262 -93771 -19858 729 -391498 79357 311590 -77018 -193942 37504 -105632 -118451
11969a18451A17940Q798a13245M972m460D20896e06281a75412A12383b6529o788
$$ -118451 117940 126738 -113245 -108273 -112733 420896 -506281 -175412 112383 -26529 -33317
11958c3317k13470p4520B29802E8007k4596a14666E2888N1274q305k6246B3215
$$ -33317 -246787 -321307 229802 58007 33411 -114666 52888 104162 95857 69611 23215
11946a9765A12676a69540P4106k74829A78534a39993n3758C9932K15849E9699
$$ -19765 112676 -169540 -95434 -370263 178534 -139993 -193751 39932 255781 59699
11935G9730b6366M450B25231q9692J8319A2008a82472d9383A80386a09406A4788
$$ 79730 -26366 -21916 225231 135539 153858 12008 -182472 -49383 180386 -109406 14788
11923A49919a6280j35296F9040A3488b74672J17760k99760A58045h1058k22665
$$ 149919 -16280 -151576 69040 13488 -274672 -156912 -456672 158045 -81058 -303723
11913c03723A92542a50769e3330A28556e0763k13021M96a06838b7501j27105d4536
$$ -303723 192542 -150769 -53330 128556 -50763 -263784 -263288 -106838 -27501 -154606 -44536
11901a9623F7498a57028A9518c82909A11008L8620a33251C07779I1729e3668k08308
$$ -19623 67498 -157028 19518 -382909 111008 149628 -133251 307779 91729 -53668 -261976
11890b61976A95057J13802a84296B3022J55376E4617i6119j18419b6369j54687
$$ -261976 195057 308859 -184296 23022 178398 54617 -96119 -214538 -26369 -181056
11880a81056k0608k30590a16379L5784B10167i0194A00817b45331j23270B26403
$$ -181056 -201664 -432254 -116379 -80595 210167 -90194 100817 -245331 -368601 226403
11869c1222I2199M6255d62663f9744j42733P0245C30629a32482j55245i2898K8924
$$ -31222 92199 138454 -462663 -69744 -212477 -142232 330629 -132482 -287727 -92898 -63974
11858f3974m5558A97226Q4076a5525j45403L1917A68154d32163a17814C4685O0448
$$ -63974 -109532 197226 281302 -15525 -160928 -129011 168154 -432163 -117814 34685 95133
11847I5133N2292c58640E9230f2234F8523a44385N1574F2123g4554k08912G6657
$$ 95133 147425 -358640 59230 -62234 68523 -144385 -92811 62123 -74554 -283466 76657
11835B77253a99172i514p1944B32547a16500o7106M0045A30685J03062a2693C67866
$$ 277253 -199172 -9514 -81458 232547 -116500 -183606 -143561 130685 233747 -12693 367866
11823g17B9314b24352I1308a084j88587J0724h7024k1692c7159r5577p4076D8808
$$ -717 29314 -224352 91308 -1084 -189671 -178947 -87024 -108716 -37159 -132736 -206812 48808
11810C08609j08133b05271D7349K60195a55716a1576q4142A63350E3033g7624
$$ 308609 200476 -205271 47349 307544 -155716 -11576 -95718 163350 53033 -77624
11799a35005L505E8829j4973K9058d3008B9958c00385B077a5521G5616a63163
$$ -135005 -131500 58829 43856 72914 -43008 29958 -300385 2077 -15521 75616 -163163
11787i9919P416A30535i7913n1469A07672a53646K3782e906A73982O566b58952
$$ -99919 -92503 130535 -97913 -149382 107672 -153646 -129864 -5906 173982 180548 -258952
11775D27441C1255K26729A03188j4173a64585l34409A12900a08255k47907A50739
$$ 427441 31255 257984 103188 89015 -164585 -498994 112900 -108255 -356162 150739
11764I3770b60647j9176J11596L3054H7531d9049G2615c7894I4148L6150j0266
$$ 93770 -260647 -279823 -168227 -135173 87531 -49049 72615 -37894 94148 130298 120032
11753A20032c7190B45199P4305c59358a9630j47348G1924a47255c0498A80574
$$ 120032 -37190 245199 319504 -359358 -19630 -166978 71924 -147255 -30498 180574
11742C28097e44783K49771g7996j10905j69090h3275B48447n4045K73393D63c21646
$$ 328097 -544783 -295012 -77996 -188901 -357991 -83275 248447 194402 467795 463 -321646
11730a47163I2008N9797e21k02520I6238J70004A22116a5846j56688l5133F3397
$$ -147163 92008 151805 -521 -203041 96238 266242 122116 -15846 -172534 -207667 63397
11718b06986b9595B85692A09254c3788l6863k83061c3875m48505a19477B5331
$$ -206986 -29595 285692 109254 -33788 -70651 -353712 -33875 -482380 -119477 25331
11707a42640M7297B45010Q0403a55109j36748B75275C0988M9595a9266C02541
$$ -142640 -95343 245010 325413 -155109 -291857 275275 30988 80583 -19266 302541
11696E857c59060A39591k783M0286d39753A03830J64119I645g59k4340B7621b0488
$$ 5857 -359060 139591 136808 177094 -439753 103830 267949 9645 -759 -25099 27621 -20488
11683A91177P0860H1558A0070N293a8988k18447O7153C23476b13322P1070B77678
$$ 191177 262037 81558 10070 15363 -18988 -237435 -170282 323476 -213322 -142252 277678
11671a09264G5236f7886j41495f7844k64171a54932C8092A6912a35434f506A42420
$$ -109264 75236 -67886 -209381 -67844 -332015 -154932 38092 16912 -135434 -6506 142420
11659e8010B46654g5460k3475C3121J26962p5994h0160A25198e0555B42919D3463
$$ -58010 246654 -75460 -98935 33121 160083 84089 -80160 125198 -50555 242919 43463
11647a10142A05968J65018n6727H4933K4563e0201A99441D5532c7891A60568a41218
$$ -110142 105968 270986 214259 84933 109496 -50201 199441 45532 -37891 160568 -141218
11635I7184j1912f873l93443A4521J41884d0637B02171C834a02440D0103J78047
$$ 97184 85272 -6873 -400316 14521 156405 -40637 202171 3834 -102440 40103 218150
11624B18150G9600b6414j17456I7120K92909f2819j83476i8615A13640a59303
$$ 218150 79600 -26414 -143870 97120 390029 -62819 -246295 -98615 113640 -159303
11613B07803I0325j2759O2198C0055b04787N3935C8900J34071n6084j2040d34438
$$ 207803 90325 77566 139764 30055 -204787 -150852 38900 172971 116887 104847 -434438
11601a00880C08893E5093a48872E1118h0343H690J11805i985B6048J75848R5676
$$ -100880 308893 55093 -148872 51118 -80343 8690 120495 -9985 26048 201896 297572
11590B97572I7835J73636A21444b35087a4871A55977l4923J54835C8263J1787
$$ 297572 97835 271471 121444 -235087 -14871 155977 121054 275889 38263 50050
11580E0050a16682N3650j92900i5884b8416A44284b66045e592B35327M063a34547
$$ 50050 -116682 -63032 -255932 -95884 -28416 144284 -266045 -5592 235327 239390 -134547
11568A28886K3101B8720P2835k7631a22144C95052A77795B5164N3579b17682A74879
$$ 128886 151987 28720 101555 73924 -122144 395052 177795 25164 78743 -217682 174879
11556B49718a24361c891C08383i9228b8441j75154A22018K2165a44202e3775E4689
$$ 249718 -124361 -3891 308383 -99228 -28441 -203595 122018 144183 -144202 -53775 54689
11544A44061L254J9156p3619d4466A13164m9538J00200H048a10127c9191E3073
$$ 144061 147315 166471 92852 -44466 113164 63626 163826 8048 -110127 -39191 53073
11532C39749b54606C3268J5231b73058A65617p6863g1255D16626A73395K2251
$$ 339749 -254606 33268 48499 -273058 165617 88754 -71255 416626 173395 195646
11522A95646c1143k53666B8285d5129a9169q2047d4021n774A54678R2751j4532
$$ 195646 -31143 -284809 28285 -45129 -19169 -101216 -44021 -49795 154678 247429 232897
11511B32897L1776i4433C11241F226J07462j5929b12158D1668L5640a06846C01068
$$ 232897 264673 -94433 311241 6226 113688 97759 -212158 41668 77308 -106846 301068
11499F2597f1050A00210a99890D2541J58727c20478a2452q0794G9746b90419a44746
$$ 62597 -61050 100210 -199890 42541 201268 -320478 -12452 -93246 79746 -290419 -144746
11487i982k02055A28934J3118J75015H4933j8015P4926a28414A50767C1088J49221
$$ -9982 -212037 128934 142052 317067 84933 66918 141844 -128414 150767 31088 180309
11476A80309k4918j5401a99006E1418J32634N3292c7803B61498e5207B5269J96264
$$ 180309 155391 139990 -199006 51418 184052 237344 -37803 261498 -55207 25269 221533
11465B21533I6276O9242K73521b0629B05104h0513k01016D50345j50561C9156
$$ 221533 96276 165518 439039 -20629 205104 -80513 -281529 450345 299784 39156
11454A81937q0173k0376K3874J69557A02108J29299i8048C06991d2978I728K11557
$$ 181937 101764 81388 105262 274819 102108 231407 -98048 306991 -42978 9728 221285
11443B21285l5568a65434c531k2444H5010j7367a217H2929l3068k807a18102D8068
$$ 221285 185717 -165434 -3531 -25975 85010 67643 -1217 82929 49861 47054 -118102 48068
11430A71802R6989E6968b2182j72889A83149d9399j73879B18756b76711b9835
$$ 171802 268791 56968 -22182 -195071 183149 -49399 -223278 218756 -276711 -29835
11419F8736D589J14345a59951A77695p2602a09975j86275J7662c3397B0422J13533
$$ 68736 4589 118934 -159951 177695 105093 -109975 -296250 -278588 -33397 20422 133955
11408A33955J35443C7943d58583a18087a2609A82214B3219K06227E0213a18462
$$ 133955 269398 37943 -458583 -118087 -12609 182214 23219 229446 50213 -118462
11397b03405A29182J15741A6883L2866b7783j02236d1625r6880G3157g1208C2026
$$ -203405 129182 244923 16883 49749 -27783 -130019 -41625 -138505 73157 -71208 32026
11385B3220P6215Q899b13049a4133q5254d8112r1573f359j62144b1734l43199
$$ 23220 99435 108334 -213049 -14133 -99387 -48112 -139685 -6359 -168503 -21734 -364933
11374c64933A17314d5720j47293B9655M3556l51K1924h6238B72133j33597b64712
$$ -364933 117314 -45720 -193013 29655 73211 72860 94784 -86238 272133 138536 -264712
11362B80695Q9069a54627O3991B04907Q6155M9169a53250G9960d9463A20826c2644
$$ 280695 369764 -154627 -90636 204907 291062 340231 -153250 79960 -49463 120826 -32644
11350a54678q7419P3548F7176K68602a6128k38858J20164k28975a31739j16923
$$ -154678 -242097 -168549 67176 335778 -16128 -254986 -134822 -363797 -131739 -248662
11340b48662F6302b5469A68744j5289h7291B92561a04516A40016B3130K00089
$$ -248662 66302 -25469 168744 153455 -87291 292561 -104516 140016 23130 223219
11330B23219g6077j94074H0210g4046C9753b90595E5099a34573c002j23694q4826
$$ 223219 -76077 -270151 80210 -74046 39753 -290595 55099 -134573 -3002 -126696 -211522
11319b11522A29777a91749A41898m7467d8878C07590a2548m7294B5395M5699i0521
$$ -211522 129777 -191749 141898 94431 -48878 307590 -12548 -59842 25395 71094 -90521
11307I6617J63153H6564h3330c2011k82k55071A92008G6432c57944B50842B8743
$$ 96617 259770 86564 -83330 -32011 -32293 -287364 192008 76432 -357944 250842 28743
11295a68758e9317A98608h6762j27820k08868c7392k69754N0533A47049b33557
$$ -168758 -59317 198608 -86762 -214582 -423450 -37392 -307146 -256613 147049 -233557
11284A89588a59441A97067c25660J24851G6834a18492e8332B0319g8790A05512
$$ 189588 -159441 197067 -325660 -200809 76834 -118492 -58332 20319 -78790 105512
11273F2868c3065o0135j18442j5119P3162a0188j27835m6701p7900A26512J22730
$$ 62868 -33065 -93200 -211642 -226761 -153599 -10188 -138023 -184724 -262624 126512 249242
11262B49242a07172A36448Q4330m335g0590o4441C8407a20963A02914a04837m7853
$$ 249242 -107172 136448 220778 216443 -70590 -135031 38407 -120963 102914 -104837 -152690
11251a52690e2281o0625B49676c0478m6748j98277C03505d9377k74068g0221B85996
$$ -152690 -52281 -112906 249676 -30478 -77226 -275503 303505 -49377 -323445 -70221 285996
11239C06799i7284r137m108C4102I19b94902a6634k54824C76012b71570A99794
$$ 306799 -97284 -106421 -110529 34102 919 -294902 -16634 -271458 376012 -271570 199794
11227E3696J36201H2791c115k20099d042m43694a0005q2377A7936d26138f1512
$$ 53696 189897 82791 -3115 -223214 -4042 -447736 -10005 -92382 17936 -426138 -61512
11215b40187I4716A8840N0717c5189p3375G1561E658G71J85702J02254A41938
$$ -240187 94716 18840 69557 -35189 -108564 71561 5658 771 186473 288727 141938
11203c61454A38469D735b75930H5959J58864a86814B5654J60878b9556A10304
$$ -361454 138469 4735 -275930 85959 244823 -186814 25654 186532 -29556 110304
11192b95744A35818a32005e4916B3335b85830B07244R399q6326c23529g428q5493
$$ -295744 135818 -132005 -54916 23335 -285830 207244 216643 130317 -323529 -7428 -92921
11181i2921b3762k40133d8437B27639b0001k21559G3651M0036b60804N3223J02782
$$ -92921 -23762 -263895 -48437 227639 -20001 -241560 73651 113687 -260804 -207581 -104799
11170a04799b4077r304J6475A0460Q1047J83024j20488d9820j07986G1928k4907
$$ -104799 -24077 -33381 -16906 10460 91507 274531 154043 -49820 -157806 71928 47021
11159D7021g8829b2873j53044F65a22214j8213Q23A06369i3171b8860J1240n8724
$$ 47021 -78829 -22873 -175917 665 -122214 -140427 -139604 106369 -93171 -28860 -17620 -76344
11147g6344D7953a89507d3728a9250F6922c30019G1407A4250i331A00782f8605
$$ -76344 47953 -189507 -43728 -19250 66922 -330019 71407 14250 -9331 100782 -68605
11135i4759m3693p4023a7124k86126N3850C4467b08361e9591A07895L2661d4731
$$ -94759 -138452 -212475 -17124 -303250 -249400 34467 -208361 -59591 107895 140556 -44731
11123G0515b45879j1707J08663N366E064O3774e9789D2417K59228B0665M32996
$$ 70515 -245879 -257586 -148923 -143557 5064 68838 -59789 42417 301645 20665 453661
11112D53661A30446a66399B80659F015J45991A9026J51436A144J68077a52008
$$ 453661 130446 -166399 280659 6015 152006 19026 170462 1144 169221 -152008
11101b1896O554E5951M11044A34507J39050b12403k006B75252F1962J63211I1977
$$ -21896 -15342 55951 466995 134507 273557 -212403 -214409 275252 61962 225173 91977
11089A48194N7407b5706j1108G5576K23647A03466J79608f1977B18571C2276N45261
$$ 148194 205601 -25706 -36814 75576 299223 103466 283074 -61977 218571 32276 577537
11078E77537I2577L6151K20848d0179B66489k5914C6774a41793E20610f718C3922
$$ 577537 92577 128728 349576 -40179 266489 240575 36774 -141793 520610 -6718 33922
11066A58267D8402f7358A18323J29099j8715g6167k8797n2539H3411K55502L47107
$$ 158267 48402 -67358 118323 247422 228707 -76167 -104964 -157503 83411 338913 686020
11055F86020j39005A55568P158J97104G6727L05364A78039J11899K01780p7646
$$ 686020 547015 155568 162726 359830 76727 382091 178039 289938 491718 414072
11045D14072G6576L81759N3663o0266Q1791m5793R521k00998L66359j63130J02626
$$ 414072 76576 458335 511998 451732 533523 487730 497251 296253 662612 499482 602108
11034F02108M8177C12257L33758j10108N3531J64000k20238j26848j71781L93192
$$ 602108 650285 312257 646015 535907 589438 753438 533200 406352 234571 627763
11024F27763L825j40797J20660N1672j5376L27997D31605J53201K88038l95060
$$ 627763 631588 490791 611451 663123 647747 975744 431605 584806 872844 477784
11014D77784K18084l4511M5804k63499K13530q4567J5645l3933j1576K16628C04474
$$ 477784 695868 661357 707161 443662 657192 572625 588270 554337 542761 759389 304474
11002B28649L62229k35258L38344j60564j11881M5833m850A75266L28429R3111
$$ 228649 590878 355620 693964 533400 421519 467352 462502 175266 503695 596806
10992E96806k371L4072M6789j99932M73308j74899k14712j6456J95190j77469
$$ 596806 594435 628507 675296 475364 948672 773773 559061 542605 737795 560326
10982E60326l9237J152J03085P6060j72127K62707j32715q9577n881L61360k84672
$$ 560326 521089 522241 625326 701386 529259 791966 659251 569674 563793 925153 640481
10971F40481O0106K32205O1351L04084j39029l9346l32621J56082O39934j08389
$$ 640481 700587 932792 994143 1298227 1159198 1119852 787231 943313 1583247 1474858
10961A474858J90464J78608p0887P7793L53218j54514J19035m8116K75401l18987
$$ 1474858 1665322 1843930 1773043 1850836 2204054 2049540 2168575 2120459 2395860 2076873
10951B076873k83072k24608R2843l93405J26769j99581M6216j2594M2735o3000
$$ 2076873 1793801 1569193 1662036 1268631 1395400 1195819 1242035 1229441 1272176 1209176
10941A209176K60332j59203p2474n20811n9477m4371L20590l79992k11272J04344
$$ 1209176 1469508 1310305 1237831 717020 657543 613172 933762 553770 342498 446842
10931D46842D9982K28961m4948L07236B65591p6585P680m6064O5277i3049A5170
$$ 446842 49982 278943 233995 541231 265591 189006 196686 150622 215899 -93049 15170
10919d9113G1297l3116j3117K1394J93313d1813j42987A44257a06479q1304a346
$$ -49113 71297 38181 25064 46458 239771 -41813 -184800 144257 -106479 -187783 -1346
10907b9407E8286J79842g5534F9931C413e7841A62772D7317j3162h3563l713j50740
$$ -29407 58286 238128 -75534 69931 3413 -57841 162772 47317 34155 -83563 -87276 -238016
10895b38016h2416l56725b3723j04208C9332h3067A77479N2353B8401A817J90594
$$ -238016 -82416 -439141 -23723 -127931 39332 -83067 177479 229832 28401 1817 192411
10884A92411m9791J3385p4128K20980A26255J24176a69429D6073N9158c34327
$$ 192411 142620 156005 81877 302857 126255 250431 -169429 46073 105231 -334327
10873E1572J23738q5207J6605L4304B0269b04086d334k26966p952H748J20131
$$ 51572 175310 90103 106708 141012 20269 -204086 -4334 -231300 -239252 8748 128879
10862A28879b32494A59642J37285i020C20606b93506e6874k65097C1403a74778
$$ 128879 -232494 159642 296927 -9020 320606 -293506 -56874 -321971 31403 -174778
10851c3970j04902k72136B85107j31160B7519d8277K0202j06627k1712k27008
$$ -33970 -138872 -411008 285107 153947 27519 -48277 -28075 -134702 -156414 -383422
10841c83422c4820D77207A91939a00179D6953e3800B62908d8767O97j76061d8587
$$ -383422 -34820 477207 191939 -100179 46953 -53800 262908 -48767 -48070 -224131 -48587
10829f8253r2411F0471k1868e467l4461k62230J25837j45895k36648A13907g2510
$$ -68253 -160664 60471 38603 -5467 -39928 -302158 -176321 -322216 -558864 113907 -72510
10817B24324b29084a4941A11946J6504J10497o6120F1548b58835c4835C62659
$$ 224324 -229084 -14941 111946 128450 238947 172827 61548 -258835 -34835 362659
10806a54019j98190q4363r0989d6555G5665b559j91864Q6442B05472C0520a03457
$$ -154019 -352209 -436572 -527561 -46555 75665 -2559 -194423 -107981 205472 30520 -103457
10794b69770f6402L2564D5985d5820C09354a59201e95k96377A78209a2196n8214
$$ -269770 -66402 -33838 45985 -45820 309354 -159201 -595 -296972 178209 -12196 -70410
10783g0410j62767J10492l144c3659j36458g3825D5406c09485f4743J5051R881
$$ -70410 -233177 -122685 -125829 -33659 -170117 -73825 45406 -309485 -64743 -49692 -39811
10772c9811A55389A9581K12616e8583B45140H430i5418G5620R7937p2985a63338
$$ -39811 155389 19581 232197 -58583 245140 8430 -95418 75620 173557 100572 -163338
10760g2953B10403q2621b11583A71411Q8888c15419a5172B995b3030j10294d3888
$$ -72953 210403 127782 -211583 171411 260299 -315419 -15172 2995 -23030 -133324 -43888
10748b64445D8024L395d3952n0718q0587R278j06100a19470q912a9901B30995
$$ -264445 48024 51419 -43952 -94670 -175257 -165979 -272079 -119470 -128382 -19901 230995
10736A74393b73788k4392M8459j68830K07764d8941E0288a28252f0282C4575K55792
$$ 174393 -273788 -298180 -249721 -418551 -210787 -48941 50288 -128252 -60282 34575 290367
10725B90367j06698b39029K0128B3614K0633b0227A75066h3856p9920d5547r3800
$$ 290367 183669 -239029 -218901 23614 44247 -20227 175066 -83856 -163776 -45547 -139347
10714a39347A30045i4744G3372d1629J8342l14689B35999Q7100B6005J00426D3573
$$ -139347 130045 -94744 73372 -41629 -23287 -337976 235999 323099 26005 126431 43573
10702e0876B56743q5108b8690J4295r0577e421k8614a4506j99627m7017J24361
$$ -50876 256743 171635 -28690 -14395 -104972 -5421 -34035 -14506 -214133 -261150 -136789
10691a36789O0207B13535K152o5483a53439B7977b19458R4850a7787C0367h6053
$$ -136789 -76582 213535 215687 150204 -153439 27977 -219458 -124608 -17787 30367 -86053
10679f1323k23914a28854d2991A99936F7394a54575C6394J18154a75658B80635
$$ -61323 -285237 -128854 -42991 199936 67394 -154575 36394 154548 -175658 280635
10668b07551e229A70167B2395J62030c43049A19256a39158j79079A65131L6376
$$ -207551 -5229 170167 22395 184425 -343049 119256 -139158 -318237 165131 201507
10658B01507a95128H5345a36847G4279a88471k854f2508m3435L9669k31059c7613
$$ 201507 -195128 85345 -136847 74279 -188471 -191325 -62508 -105943 -66274 -297333 -37613
10646D1442J82604i0907j6016D09187A87971a55334O5524p6433A26190i9458j82227
$$ 41442 224046 -90907 -106923 409187 187971 -155334 -89810 -166243 126190 -99458 -281685
10635b81685d7609j67969D1044a63570c9188n1537p7010a8099q0399b360o4533
$$ -281685 -47609 -215578 41044 -163570 -39188 -90725 -167735 -18099 -98498 -2360 -66893
10624f6893k03489D7317A5900e5621B03711f6938l1345k68919f8601A81194b96206
$$ -66893 -270382 47317 15900 -55621 203711 -66938 -98283 -367202 -68601 181194 -296206
10612a3947k29661C17178j18374l847a16832B3017b5631C1927a47973A45509k5274
$$ -13947 -243608 317178 198804 194957 -116832 23017 -25631 31927 -147973 145509 120235
10601A20235P6856i8376A06990b1967A12781c49204C63343b21305A9083d28288
$$ 120235 197091 -98376 106990 -21967 112781 -349204 363343 -221305 19083 -428288
10590e5721o0348n9335G1345K0031a63579B90591b74529l5821F8987d542k84710
$$ -55721 -116069 -175404 71345 91376 -163579 290591 -274529 -310350 68987 -4542 -289252
10579b89252O8215H1861d6679A36967i2807B81758M8919r1809b2869j41488j55323
$$ -289252 -221037 81861 -46679 136967 -92807 281758 330677 238868 -22869 -164357 -319680
10568c19680J50954E85a33868r4608A01290e487E1778J88385A02550b98276a31255
$$ -319680 -168726 585 -133868 -228476 101290 -5487 51778 240163 102550 -298276 -131255
10556B21375p8911K57297A9428a5046k64001G862b09538J7204c6477D0639f3373
$$ 221375 142464 399761 19428 -15046 -279047 7862 -209538 -192334 -36477 40639 -63373
10544a85502e7974j37973g9882k97594d9001k56746G638a30620A93596o8805f7575
$$ -185502 -57974 -195947 -79882 -377476 -49001 -305747 7638 -130620 193596 124791 -67575
10532g6622l1654B0479K97514J4775C5026a55998e9938j43573F530K7915d033
$$ -76622 -108276 20479 317993 332768 35026 -155998 -59938 -203511 6530 34445 -4033
10520c29975P1005n313H425c466A1151d57599a79696B8622c48739A35971c412
$$ -329975 -258970 -264283 8425 -3466 11151 -457599 -179696 28622 -348739 135971 -3412
10508b42041A22259d7926A81051e4942A33962b95106d6548p8222H5247C3486J75562
$$ -242041 122259 -47926 181051 -54942 133962 -295106 -46548 -124770 85247 33486 209048
10497B09048j00790a521j87160E1506c39870D3279g8533k71544A4130J26041g3307
$$ 209048 108258 -1521 -188681 51506 -339870 43279 -78533 -350077 14130 140171 -73307
10485a49961e5622j18874E6892a02433j62739i8283j26454O5575e7032j99505
$$ -149961 -55622 -174496 56892 -102433 -265172 -98283 -224737 -159162 -57032 -256537
10475b56537e143j56497a2430B34689c1473A68504q1561N4327J19351N9894O767
$$ -256537 -5143 -161640 -12430 234689 -31473 168504 86943 141270 260621 320515 327282
10464C27282j42476e5673A43840Q817B5307c4901B16730g8388I8999b36975d4570
$$ 327282 184806 -55673 143840 152657 25307 -34901 216730 -78388 98999 -236975 -44570
10452B49040b15515A18619l1918c9079f188j28221A87717a77981C05080E3274
$$ 249040 -215515 118619 86701 -39079 -6188 -134409 187717 -177981 305080 53274
10441a08530A80275d00761B37777A8834K31529j10474F0683J29749e9924B86878
$$ -108530 180275 -400761 237777 18834 250363 139889 60683 190432 -59924 286878
10430a06227A56106b23921b7067o0996c2275H3048b03838b1137j30927A89424
$$ -106227 156106 -223921 -27067 -88063 -32275 83048 -203838 -21137 -152064 189424
10419g1962a4832j60614E5045J57099i1794p0111O7930L0727p1620j51369A5688
$$ -71962 -14832 -175446 55045 212144 -91794 -161905 -93975 -63248 -134868 -286237 15688
10407B04830f7254N278j25581f5295A52855a64980j1191A04222q926h4774E9851
$$ 204830 -67254 -61976 -187557 -65295 152855 -164980 -176171 104222 95296 -84774 59851
10395g9128A6183O6313a49699G8653b36654R5356n6762A04644a41532A72083a30751
$$ -79128 16183 82496 -149699 78653 -236654 -141298 -198060 104644 -141532 172083 -130751
10383H2270L2222l6337J14800a20246I6727J8686l4606b1238j7453B93785A00718
$$ 82270 114492 78155 192955 -120246 96727 115413 80807 -21238 -38691 293785 100718
10371a09311A62853o8341a76848r7140A54190k1189J4547A5925J17594a9313D51169
$$ -109311 162853 94512 -176848 -273988 154190 133001 147548 15925 133519 -19313 451169
10359B73213J36582j90802J76472L8399f3865B35870p0199n9166L29575k11467
$$ 273213 409795 218993 395465 433864 -63865 235870 165671 106505 436080 224613
10349B24613P8565b7497E69186A88305O1057B2333K89590A19982K49168A38893
$$ 224613 303178 -27497 569186 188305 249362 22333 311923 119982 369150 138893
10338E54024B74387r7551J99766M9032K01372B44794H0935K04226j21169J11731
$$ 554024 274387 176836 376602 425634 627006 244794 80935 285161 163992 275723
10328B75723A04841L17947k02808n286j1832c329B8766J76405J08515b6520J0417
$$ 275723 104841 422788 219980 214694 202862 -3329 28766 205171 313686 -26520 -16103
10317a6103A56285p5530k4320j7670K53816E4125K766P9678a01227I5054A9178
$$ -16103 156285 80755 56435 38765 292581 54125 56891 136569 -101227 95054 19178
10305A41204J34381A05911a974B33766b42304C5349J1357M26462F3257i6781F725
$$ 141204 275585 105911 -1974 233766 -242304 35349 46706 473168 63257 -96781 6725
10293I3317J66221G5035b29236a723A10365l0616d02532b4779o3217A7314J58662
$$ 93317 259538 75035 -229236 -1723 110365 79749 -402532 -24779 -87996 17314 175976
10282A75976n6600a22648k6592l8275H8588c3236B99580b8873l76584A80971l8944
$$ 175976 119376 -122648 -149240 -187515 88588 -33236 299580 -28873 -405457 180971 142027
10271A42027a2345A32983a5722k24669B17094c1998k90739a12695b3062A22481
$$ 142027 -12345 132983 -15722 -240391 217094 -31998 -322737 -112695 -23062 122481
10260a44117G7643c31322A69899a66366A46348A674K6747J21352o5201a42352
$$ -144117 77643 -331322 169899 -166366 146348 1674 28421 149773 84572 -142352
10249E3443K6304a65043A36328L3465j4115E9001j1592J84011J09521H4457L1951
$$ 53443 79747 -165043 136328 169793 155678 59001 47409 231420 340941 84457 116408
10238A16408j271J15536i1016J3203c1446k59756N6820C84823e4945o7859A42336
$$ 116408 115137 230673 -91016 -77813 -31446 -291202 -234382 384823 -54945 -122804 142336
10226A59206b25729A12691R0992P9665a01013k020j08627h5106A12186a88191
$$ 159206 -225729 112691 203683 283348 -101013 -103033 -211660 -85106 112186 -188191
10215A69421o4230K0929g6332A82652b93452J21199g3759E08203k26073p3219
$$ 169421 105191 126120 -76332 182652 -293452 -172253 -73759 508203 282130 208911
10205B08911J14552A42173F1036b49344J20864p9435d701G2735b18532A42857
$$ 208911 323463 142173 61036 -249344 -128480 -207915 -4701 72735 -218532 142857
10194d4775k08541e3138j62704B1272c40192i6196C85013a28710C0623c18379
$$ -44775 -253316 -53138 -215842 21272 -340192 -96196 385013 -128710 30623 -318379
10183D9073a42434K6074B8436c1061A44610a57769d0774n3749J6512G0834e9074
$$ 49073 -142434 -116360 28436 -31061 144610 -157769 -40774 -94523 -78011 70834 -59074
10171B071a19887j3197e6204I7799B482K8600a05811j49357e9258n3822A26643
$$ 2071 -119887 -133084 -56204 97799 2482 31082 -105811 -255168 -59258 -113080 126643
10159G2265Q2281o4534b57669l3021i5966d7439j25368J7014c7226B68730C7044
$$ 72265 154546 90012 -257669 -290690 -95966 -47439 -172807 -155793 -37226 268730 37044
10147g2446k40679A65012K16563d35395i5501r4529d7647A56104N0810A5035J50306
$$ -72446 -313125 165012 381575 -435395 -95501 -190030 -47647 156104 206914 15035 165341
10136A65341a57955O1587D52950b19691A32850B6017a06578K3226m18276B2110
$$ 165341 -157955 -96368 452950 -219691 132850 26017 -106578 -83352 -501628 22110
10125a90101h7864J6889j30340N7037p8624H8530c03278A48076A9742c112l18183
$$ -190101 -87864 -70975 -201315 -144278 -222902 88530 -303278 148076 19742 -3112 -321295
10114c21295F0586d5558m1087c325m1528r0322j0265j94360O8671a35431A65652
$$ -321295 60586 -45558 -86645 -3325 -44853 -135175 -145440 -339800 -271129 -135431 165652
10102a29360r6820p8356i3905A5871b95663b4322k51828J27142j68007c1584C7328
$$ -129360 -226180 -304536 -93905 15871 -295663 -24322 -276150 -149008 -317015 -31584 37328
10090B01124a26852C26951a14138A34010b45378A19535b34518P1361e3724D0412
$$ 201124 -126852 326951 -114138 134010 -245378 119535 -234518 -163157 -53724 40412
10079d24998f1691A37327J23117A11830a86559l5253B6352a70973k49803l601
$$ -424998 -61691 137327 260444 111830 -186559 -221812 26352 -170973 -420776 -424377
10069d24377a52573C95707A07293m4808Q4314h2897m7348A37531a64988e1000
$$ -424377 -152573 395707 107293 62485 146799 -82897 -130245 137531 -164988 -51000
10058f032k31853A9505a90648C6227h055q0905F6884a29775j983A63737d7502
$$ -6032 -237885 19505 -190648 36227 -8055 -88960 66884 -129775 -131758 163737 -47502
10046g9311k41055F6782c6346j31479k02729D445a00195A23936a9099j06598j61375
$$ -79311 -320366 66782 -36346 -167825 -370554 4445 -100195 123936 -19099 -125697 -287072
10035b87072d640B23568c94601c209A05533C7719a27861j48060a7758j31645n5275
$$ -287072 -4640 223568 -394601 -3209 105533 37719 -127861 -275921 -17758 -149403 -204678
10024b04678N020Q7712D0443A331K6774c43349i2659c9975C58282b08030A16194
$$ -204678 -199658 -111946 40443 1331 28105 -343349 -92659 -39975 358282 -208030 116194
10012b89331I1259i1648A16072Q765C7097a51463h144G9997b99083J03655m0715
$$ -289331 91259 -91648 116072 124837 37097 -151463 -8144 79997 -299083 -195428 -236143
10001b36143I6925b37486e2809D8302b06634b3767A6369K4222b31208j16397g1431
$$ -236143 96925 -237486 -52809 48302 -206634 -23767 16369 40591 -231208 -347605 -71431
9989A75970a71653C14948A10545d67612D04712A22032a53290j50631J5464a07246
$$ 175970 -171653 314948 110545 -467612 404712 122032 -153290 -303921 -288457 -107246
9978a45294O1091H9884a32621Q340B10287a41603D32956H6148M6709d32140B54776
$$ -145294 -84203 89884 -132621 -124281 210287 -141603 432956 86148 132857 -432140 254776
9966A48559d76428J61404d5137a1824D2258J86407I9852a81673B5222K8915a49821
$$ 148559 -476428 -315024 -45137 -11824 42258 228665 99852 -181673 25222 54137 -149821
9954F4891J2698f6012j16206O314G013a5740j18180L1597O336j05848n5207g6873
$$ 64891 77589 -66012 -182218 -175904 7013 -15740 -133920 -102323 -95987 -201835 -257042 -76873
9941D4634A6869L12047A38714K45682e5007r9350j40615d4820j3158j39338C9509
$$ 44634 16869 328916 138714 384396 -55007 -154357 -294972 -44820 -57978 -197316 39509
9929b02712Q7607c2016B08658d8531j19745O208N3922A9668a90384i0349m44010
$$ -202712 -115105 -32016 208658 -48531 -168276 -162068 -108146 19668 -190384 -90349 -534359
9918e34359d7898A7341M8952d7720p7445A04207k5885b14936c0467j54390j84587
$$ -534359 -47898 17341 66293 -47720 -125165 104207 78322 -214936 -30467 -184857 -369444
9907c69444B53865b29978P9358k4518B36803c01527A4888P1326j947N5541E8924
$$ -369444 253865 -229978 -150620 -175138 236803 -301527 14888 86214 84267 139808 58924
9895A03382a19496C783b27003I919b84432a18378c0759C4138a62747N8722d4462
$$ 103382 -119496 3783 -227003 9919 -284432 -118378 -30759 34138 -162747 -104025 -44462
9883I4112b80198k25508K28452A58373c56864A11495b07052A89293A6P3608M22436
$$ 94112 -280198 -505706 -277254 158373 -356864 111495 -207052 189293 16 73624 496060
9872D96060A49119a12991E4763i6611p0409m9432c6843j68110A51763b34621J04142
$$ 496060 149119 -112991 54763 -96611 -167020 -216452 -36843 -204953 151763 -234621 -130479
9861a30479k79363H4737l327K586g0264C246b73477J01689p2258A24468J07560
$$ -130479 -409842 84737 81410 83996 -70264 3246 -273477 -171788 -244046 124468 232028
9850B32028o9218b12130i4677G3709f4041b4130q6852L1890j65248R4449f8609
$$ 232028 162810 -212130 -94677 73709 -64041 -24130 -110982 -79092 -244340 -149891 -68609
9838C03791e5927k59845A35826a81102d2720G5603k7687g1195j35112e5297p9092
$$ 303791 -55927 -315772 135826 -181102 -42720 75603 47916 -71195 -206307 -55297 -134389
9827a34389A04390a82328C1360b88267B9371e0346n0379A16038a66194c2608j80403
$$ -134389 104390 -182328 31360 -288267 29371 -50346 -100725 116038 -166194 -32608 -213011
9816b13011a02797m2121b2068A5478f8997k84615m3664C58249b68127J18925g0241
$$ -213011 -102797 -144918 -22068 15478 -68997 -353612 -397276 358249 -268127 -149202 -70241
9804c1525A61324b07472i5511B03015f2013C2354c95266J92153b8015j76815Q6746
$$ -31525 161324 -207472 -95511 203015 -62013 32354 -395266 -203113 -28015 -204830 -118084
9793a18084J2056B31371c58172A93157b96140H4911a43040A76432H091b40055
$$ -118084 -106028 231371 -358172 193157 -296140 84911 -143040 176432 8091 -240055
9782a25066M254H5822c0949A00403N7315g2643k3973a9973A33310c28191b0101
$$ -125066 -120812 85822 -30949 100403 157718 -72643 -96616 -19973 133310 -328191 -20101
9770e60943g5248K8181C222J09352m6854h9221H9070a36505H0519A6068a01758
$$ -560943 -75248 -47067 3222 112574 65720 -89221 89070 -136505 80519 16068 -101758
9758b36260k2865G4878a09041c369n8170G0907f0560a1619o4512j40733a00145
$$ -236260 -259125 74878 -109041 -3369 -61539 70907 -60560 -11619 -76131 -216864 -100145
9746E6554b1805C3109h3342a3247K840k41484b92j08020B46405I5348a90290O9269
$$ 56554 -21805 33109 -83342 -13247 -10407 -251891 -292 -108312 246405 95348 -190290 -121021
9734a21021N3931b8942j31714l4097m1611G1494M708f8099q5803g0275m00391
$$ -121021 -67090 -28942 -160656 -194753 -236364 71494 76202 -68099 -153902 -70275 -470666
9723d70666N8989i0159K3192A39821D8402Q346L2282Q8042b06236d5713A24639
$$ -470666 -411677 -90159 -66967 139821 48402 56748 89030 177072 -206236 -45713 124639
9711H4992a12487p4064A20392B0370g0747C0265a68407K1230j27890e9558D95
$$ 84992 -112487 -186551 120392 20370 -70747 30265 -168407 -147177 -275067 -59558 495
9699b53360q125e0322b818G9216M2583o998a39843A890J3598g0743j09677J0309
$$ -253360 -261485 -50322 -2818 79216 121799 114801 -139843 1890 15488 -70743 -180420 -170111
9687a70111l08200E8006b5435j36978j11759c3342j85581L7224K0678j67146h8533
$$ -170111 -478311 58006 -25435 -162413 -274172 -33342 -218923 -181699 -161021 -328167 -88533
9675D75801a50256l769B0749J00695f0424b0439A8969J54297c06052B10574M0926
$$ 475801 -150256 -154025 20749 121444 -60424 -20439 18969 173266 -306052 210574 251500
9664B51500c70753I2030K18511A44116b07823I5667J23258p2903A4440a26564
$$ 251500 -370753 92030 310541 144116 -207823 95667 218925 146022 14440 -126564
9653a09423H8014b03895b4089A40287o0470b51518B87802A768b13081c8898H7706
$$ -109423 88014 -203895 -24089 140287 79817 -251518 287802 1768 -213081 -38898 87706
9641h4282b190I9651g880r156D1622f2797b2640q2556M7215k02448E9521b18065
$$ -84282 -2190 99651 -7880 -17036 41622 -62797 -22640 -105196 -57981 -260429 59521 -218065
9628i9995j59484B22951F6724a94636A26000d1641j64751H2071b55564k18808
$$ -99995 -259479 222951 66724 -194636 126000 -41641 -206392 82071 -255564 -474372
9618d74372a4374C4918d747k32659R4724N4268A97530J24655N249H9785b19560
$$ -474372 -14374 34918 -4747 -237406 -142682 -88414 197530 322185 327434 89785 -219560
9606c2533l14682G8393a8335j18989n7787G8472d5898q4230J7741q0996N4405
$$ -32533 -347215 78393 -18335 -137324 -195111 78472 -45898 -130128 -112387 -193383 -138978
9595a38978f5194i943j83179f8502k36800C8350f3319A26751a94880c4962j34161
$$ -138978 -65194 -9943 -193122 -68502 -305302 38350 -63319 126751 -194880 -34962 -169123
9584a69123J1629G9606i0108k3759A09837Q3174h4622l6153n3591A7067L8868
$$ -169123 -157494 79606 -90108 -113867 109837 193011 -84622 -120775 -174366 17067 55935
9573E5935c76086J07369C30473h4624l2427l91645i6417A55705e6174A3560a678
$$ 55935 -376086 -268717 330473 -84624 -117051 -508696 -96417 155705 -56174 13560 -1678
9561B84496D0400b33474I2149c8190k81221f0178j12396A66383b2746A14590d3940
$$ 284496 40400 -233474 92149 -38190 -319411 -60178 -172574 166383 -22746 114590 -43940
9549G0141a95742Q7550b4536k5352j65759b18q2398j68297Q8922A99955I8438
$$ 70141 -195742 -108192 -24536 -49888 -215647 -218 -82616 -250913 -161991 199955 98438
9537a8305j30204A42353m6444J23692j4090c61157c8929k64251f9000C0301h5628
$$ -18305 -148509 142353 95909 219601 205511 -361157 -38929 -303180 -69000 30301 -85628
9525B7236M4111H054a71068l4402R2938l04446A54007c122A35602o0458a8689
$$ 27236 71347 8054 -171068 -205470 -112532 -416978 154007 -3122 135602 75144 -18689
9513c5432o1721c2609l97870A72621f8758j91705d7204k01264J05928k5361A22310
$$ -35432 -97153 -32609 -430479 172621 -68758 -260463 -47204 -248468 -142540 -167901 122310
9501e1676I74L56606a08000k8150B55566i0468j14657A83564a48990d8502k82524
$$ -51676 974 357580 -108000 -136150 255566 -90468 -205125 183564 -148990 -48502 -331026
9490c31026o4107A57487b4786E5805c24824J38389P2337A14846J11517a44983
$$ -331026 -395133 157487 -24786 55805 -324824 -186435 -114098 114846 226363 -144983
9479a66493A88431b6844k87777i0918A60643B1595c6424o7505D8674Q080i1641
$$ -166493 188431 -26844 -314621 -90918 160643 21595 -36424 -103929 48674 56754 -91641
9467c10173B7468P836J43597d5393l79076a48160L3445F9280c62550B2573g4952
$$ -310173 27468 35304 178901 -45393 -424469 -148160 -114715 69280 -362550 22573 -74952
9455G060a52229O9484m2809m537A39424b22154Q9802F5252a99259j37319g9768
$$ 7060 -152229 -82745 -125554 -130091 139424 -222154 -132352 65252 -199259 -336578 -79768
9443a05830j16096A9605a44594A26569b98352a6557p3852B23508a2661I5263K12880
$$ -105830 -221926 19605 -144594 126569 -298352 -16557 -90409 223508 -12661 95263 308143
9432C08143c736A90130a40759o4165P5414j48975D08355p4250b07543a00774D9307
$$ 308143 -3736 190130 -140759 -204924 -129510 -278485 408355 334105 -207543 -100774 49307
9420A33101a4165j4456j28756b5717j60920O1434p879n8839Q4258k22808Q3485
$$ 133101 -14165 -28621 -157377 -25717 -186637 -125203 -133082 -191921 -107663 -330471 -246986
9409b46986A32037a72999G9847N2782c54096a22662k02334f9966D8242a13486
$$ -246986 132037 -172999 79847 132629 -354096 -122662 -324996 -69966 48242 -113486
9398b17362k36596b19160A20973P9293C812R1347K8324k2868c9523p4699G4676
$$ -217362 -453958 -219160 120973 200266 3812 95159 123483 100615 -39523 -114222 74676
9386c5617A23097a43835r005j26752a5590E042J35733o1687a61994Q092B386M629
$$ -35617 123097 -143835 -152840 -279592 -15590 5042 140775 79088 -161994 -153902 2386 7015
9374G015e3713j05937c6382I2618b91120h1625r2210B25314J04774d1041G3009
$$ 7015 -53713 -159650 -36382 92618 -291120 -81625 -173835 225314 330088 -41041 73009
9362d5212A27534e15060a97870G8762a17594e3526A07700a22848m9473e1179l3898
$$ -45212 127534 -515060 -197870 78762 -117594 -53526 107700 -122848 -172321 -51179 -85077
9351h5077K9846j73267b8753j00442A24960a57295A1185e7819j09172A04805K10715
$$ -85077 -55231 -228498 -28753 -129195 124960 -157295 11185 -57819 -166991 104805 315520
9340C15520g2504A58202b57307O2816B155b64939J09970O0524a4795j37038j89532
$$ 315520 -72504 158202 -257307 -194491 2155 -264939 -154969 -94445 -14795 -151833 -341365
9329c41365A05786J42030a13238d7987M44B16553a33449J8783n7620g8231C59346
$$ -341365 105786 247816 -113238 -47987 -47543 216553 -133449 -114666 -172286 -78231 359346
9317b75849J29694L2709l2629n603k73531J73918A40236J50373C8782j6425d856
$$ -275849 -146155 -113446 -146075 -151678 -425209 -251291 140236 290609 38782 22357 -4856
9305A30437b30853B8279i4702A66867B7541b8874l6361m045A31210f2109k19242
$$ 130437 -230853 28279 -94702 166867 27541 -28874 -65235 -69280 131210 -62109 -281351
9294b81351A00272c45164c4476C8934b05656A14539a36171B14492j04322b38915
$$ -281351 100272 -345164 -34476 38934 -205656 114539 -136171 214492 110170 -238915
9283b11333A7857f8563H2458b33253e3368p3888G3022K54957G5114j8596e4669
$$ -211333 17857 -68563 82458 -233253 -53368 -127256 73022 327979 75114 56518 -54669
9271b40089a06211K4562j38244C5893a6284G4742b31141C6493a1736O68k09877
$$ -240089 -106211 -81649 -219893 35893 -16284 74742 -231141 36493 -11736 -11068 -220945
9260b20945b3832m0443A1151N7400M0787R7356i3759m0928B81099f1811j01537
$$ -220945 -23832 -64275 11151 68551 109338 206694 -93759 -134687 281099 -61811 -163348
9249a63348A37519o198b17681E9146J67766a66751B6319a77317A85537c21416
$$ -163348 137519 131321 -217681 59146 226912 -166751 26319 -177317 185537 -321416
9238b59532e0091B3985a13134M487n475j18958A43537a00361J4021p5504I892
$$ -259532 -50091 23985 -113134 -108647 -114122 -233080 143537 -100361 -86340 -161844 9892
9226b43917O1102H5337K6299j6866a90079E8350c26456A18449b34706D1044P4256
$$ -243917 -182815 85337 111636 94770 -190079 58350 -326456 118449 -234706 41044 115300
9215A15300J07305i7496j40414E292a88801f4268A98400d6384a1273k87335j68108
$$ 115300 222605 -97496 -237910 5292 -188801 -64268 198400 -46384 -11273 -298608 -466716
9204d66716A98184E5545M3237e0784C6034a76810K2320c328j7659A89604A4974
$$ -466716 198184 55545 98782 -50784 36034 -176810 -154490 -3328 -20987 189604 14974
9192B58575f4081k6876B9314b16775g464A99826a94476O6941I7286a59261e3581
$$ 258575 -64081 -90957 29314 -216775 -7464 199826 -194476 -127535 97286 -159261 -53581
9180A79908n3961e6616a2780G6597K8022B2216P125b3143j12729N7462c7033n3518
$$ 179908 125947 -56616 -12780 76597 104619 22216 29341 -23143 -135872 -78410 -37033 -90551
9168i0551r9469A27069b84438j44850A43453i6485H4779e8427F4381b1669l4292
$$ -90551 -190020 127069 -284438 -429288 143453 -96485 84779 -58427 64381 -21669 -55961
9157e5961C4382N135J98162I527c68785A22504b6392B79501H203b52336o7427
$$ -55961 34382 39517 237679 9527 -368785 122504 -26392 279501 8203 -252336 -319763
9146c19763a8581n8410n1975C2188a39199K1671k29571F7531h5247j13781A06065
$$ -319763 -18581 -76991 -128966 32188 -139199 -117528 -347099 67531 -85247 -199028 106065
9134a55028g2268q3809p8168a2578H696c2619k81958e5838D8226L1941i4746C4873
$$ -155028 -72268 -156077 -234245 -12578 8696 -32619 -314577 -55838 48226 80167 -94746 34873
9121C10775A06705a29033I140e4440j91653O9701m2924i6958j70590A85410b06752
$$ 310775 106705 -129033 9140 -54440 -246093 -176392 -219316 -96958 -267548 185410 -206752
9109c58778g7269j3045q652C42392a72314D65524c24797q9827f9694E2282c52754
$$ -358778 -77269 -90314 -98966 342392 -172314 465524 -324797 -414624 -69694 52282 -352754
9097h5059m07403B56218D3829c7752A57126F8392d19427J11629A07336a1965n27375
$$ -85059 -492462 256218 43829 -37752 157126 68392 -419427 -307798 107336 -11965 -539340
9086e39340a4736q5258A60149K9669a41283j4553j14790H8703K8550c50741b3814
$$ -539340 -14736 -99994 160149 189818 -141283 -155836 -270626 88703 117253 -350741 -23814
9074a6796A09963A6107a56217c2179B67183r999c30598e4359b423q3143A60928
$$ -16796 109963 16107 -156217 -32179 267183 257184 -330598 -54359 -2423 -85566 160928
9062G2792a45580f134A37955b91908m1104D2409a66776B4369J38329a51179o3683
$$ 72792 -145580 -6134 137955 -291908 -333012 42409 -166776 24369 162698 -151179 -214862
9051b14862a2310C04333a34726k23969a64314k0695m6140j34720e5179i983A91496
$$ -214862 -12310 304333 -134726 -358695 -164314 -185009 -231149 -365869 -55179 -9983 191496
9039I6720J9783I390J05359h751k12915G136O7680Q0256a67164D22121a07161
$$ 96720 116503 9390 114749 -8751 -221666 7136 74816 155072 -167164 422121 -107161
9027a04155H3744a09669b0493j78405f4942A42885a31606l7501A55787F2740a17199
$$ -104155 83744 -109669 -20493 -198898 -64942 142885 -131606 -169107 155787 62740 -117199
9015C1181a82085l608d0834C0194K8151a3004j1320j76455R7637A92448b17591
$$ 31181 -182085 -185693 -40834 30194 58345 -13004 -24324 -200779 -103142 192448 -217591
9003a31945B30497K42646b59447B7448a90092P3283j03646f2991j68213G2111
$$ -131945 230497 473143 -259447 27448 -190092 -116809 -220455 -62991 -231204 72111
8992b43686G8726b17234J4462M3606n7157f269j02014G4362k3871b9870j47927
$$ -243686 78726 -217234 -202772 -159166 -216323 -6269 -108283 74362 50491 -29870 -177797
8981a77797A82417c51501h6690M0417k49131A87691a75561j1058c0533A64810
$$ -177797 182417 -351501 -86690 -46273 -295404 187691 -175561 -186619 -30533 164810
8970B35377I4000j3106a98461B9649K38256c0122A62484e47416f7217k58957G0578
$$ 235377 94000 80894 -198461 29649 267905 -30122 162484 -547416 -67217 -326174 70578
8958i2204A29134a51354g4833K7544l8431m6391g126n31893g6415B3237a00385
$$ -92204 129134 -151354 -74833 -47289 -85720 -132111 -7126 -539019 -76415 23237 -100385
8946A6472a559k48536j26922h7647G5822h2156A07331D3111K9239O1619a04891
$$ 16472 -1559 -250095 -377017 -87647 75822 -82156 107331 43111 72350 133969 -104891
8934b68703a02514o3012j5722A29643b9850j36214A6221b66118A30322a47045
$$ -268703 -102514 -165526 -181248 129643 -29850 -166064 16221 -266118 130322 -147045
8923A15235a03873I5259c8932B96961r9878K15898A49140J66974l0439K34460
$$ 115235 -103873 95259 -38932 296961 197083 412981 149140 316114 285675 520135
8913E20135h3384D28044K7018J7391M34821N4033J874288K606694K863706C645335
$$ 520135 -83384 428044 455062 472453 907274 961307 2835595 5442289 8305995 3645335
8902B785248j243486p33352l96811A37978n6964J95142J0944A25778d38664A18400
$$ 2785248 1541762 808410 411599 137978 81014 276156 287100 125778 -438664 118400
8891F07170I5928a21040G0443c59076F6724A211b34451o0579a4569m572p1061
$$ 607170 95928 -121040 70443 -359076 66724 1211 -234451 -295030 -14569 -19141 -90202
8880i0202C2422J58944O5078i7564j75816N4856A66237J49195c59049a72194O2048
$$ -90202 32422 191366 256444 -97564 -273380 -218524 166237 315432 -359049 -172194 -110146
8869a10146k00903c1386k4959k99203a09153R523K4694p9238e8093n5299B44226
$$ -110146 -311049 -31386 -56345 -355548 -109153 -99630 -74936 -154174 -58093 -113392 244226
8857E8013i1904p7063K6650M5205b9602B52447e48999a52884D8350b7253G8245
$$ 58013 -91904 -168967 -142317 -97112 -29602 252447 -548999 -152884 48350 -27253 78245
$$ [...]
##END NTUPLES=NMR SPECTRUM
##END=
