
##TITLE=AC1193_1089_5867906_VjN5j14SWM
##JCAMPDX= 6.0         $$ Bruker NMR JCAMP-DX V2.0
##DATA TYPE= NMR SPECTRUM
##DATA CLASS= NTUPLES
##ORIGIN= BRUKER
##OWNER= Administrator
$$ 1.72 TOPSPIN		Version 2.1
$$ 2012-03-31 03:10:20.265 -0500  Administrator@TOPSPIN
$$ Compression mode = diff/dup
##.OBSERVE FREQUENCY= 400.13188235
##.OBSERVE NUCLEUS= ^1H
##.ACQUISITION MODE= SIMULTANEOUS (DQD)
##.ACQUISITION SCHEME= undefined
##.AVERAGES= 64
##.DIGITISER RES= 22
##SPECTROMETER/DATA SYSTEM= spect
##.PULSE SEQUENCE= noesygpps1d.comp
##.SOLVENT NAME= COFFEE_meoh
##.SHIFT REFERENCE= INTERNAL, COFFEE_meoh, 1, 14.96697
##AUDIT TRAIL= $$ (NUMBER, WHEN, WHO, WHERE, PROCESS, VERSION, WHAT)
$$ ##TITLE= Audit trail, TOPSPIN		Version 2.1
$$ ##JCAMPDX= 5.01
$$ ##ORIGIN= Bruker BioSpin GmbH
$$ ##OWNER= Administrator
$$ $$ C:\Bruker\TOPSPIN/data/COFFEE/nmr/AC1193_1089_5867906_VjN5j14SWM/12/pdata/1/auditp.txt
$$ ##AUDIT TRAIL=  $$ (NUMBER, WHEN, WHO, WHERE, PROCESS, VERSION, WHAT)
(   1,<2012-03-31 03:10:15.578 -0500>,<Administrator>,<TOPSPIN>,<go>,<TOPSPIN 2.1>,
      <created by zg
	started at 2012-03-31 02:58:43.953 -0500,
	POWCHK enabled, PULCHK disabled,
       configuration hash MD5:
       1A 1E CE 29 27 FD 77 03 67 4E F0 E3 C4 B2 CB 90
       data hash MD5: 64K
       AE DE A5 74 87 FB 2B 2E DB 40 4A 26 ED 9A 13 20>)
(   2,<2012-03-31 03:10:18.328 -0500>,<Administrator>,<TOPSPIN>,<proc1d>,<TOPSPIN 2.1>,
      <Start of raw data processing
       efp LB = 0.3 FT_mod = 6 PKNL = 1 PHC0 = 0 PHC1 = 0 SI = 128K 
       data hash MD5: 128K
       AA 58 2A 84 2F E4 FF FF 7A 67 8B 95 7F 7C 13 81>)
(   3,<2012-03-31 03:10:19.500 -0500>,<Administrator>,<TOPSPIN>,<proc1d>,<TOPSPIN 2.1>,
      <pk PHC0 = 31.28906 PHC1 = 0 
       data hash MD5: 128K
       C7 C7 96 3A 0F 62 82 20 19 FB 36 13 0F C9 32 8E>)
(   4,<2012-03-31 03:10:19.734 -0500>,<Administrator>,<TOPSPIN>,<proc1d>,<TOPSPIN 2.1>,
      <abs ABSG = 1 
       data hash MD5: 128K
       1D 92 74 BB 09 84 88 8B FA 62 4E E2 67 15 4B 12>)
(   5,<2012-03-31 03:10:19.812 -0500>,<Administrator>,<TOPSPIN>,<proc1d>,<TOPSPIN 2.1>,
      <abs ABSG = 2 
       data hash MD5: 128K
       60 3A 04 D1 BB 85 A2 6A D2 49 D1 70 27 46 19 DB>)
(   6,<2012-03-31 03:10:20.062 -0500>,<Administrator>,<TOPSPIN>,<proc1d>,<TOPSPIN 2.1>,
      <abs ABSG = 3 
       data hash MD5: 128K
       59 D1 D7 48 71 6C BC C5 95 C7 B8 C9 AB F4 4B B8>)
(   7,<2012-03-31 03:10:20.125 -0500>,<Administrator>,<TOPSPIN>,<proc1d>,<TOPSPIN 2.1>,
      <abs ABSG = 4 
       data hash MD5: 128K
       4B 60 55 ED 36 D8 B2 5B 99 DD 52 11 CA 1A 13 1B>)
(   8,<2012-03-31 03:10:20.187 -0500>,<Administrator>,<TOPSPIN>,<proc1d>,<TOPSPIN 2.1>,
      <abs ABSG = 5 
       data hash MD5: 128K
       6E 6F B9 9F C6 56 04 01 3E 39 8C 37 65 4E A6 DC>)
$$ ##END=
$$ 
$$ $$ hash MD5
$$ $$ B4 BA DB 09 F3 B7 F1 DC 06 6F 3D 63 29 BF 58 35
##$RELAX= 
##$RELAX= 
##$RELAX= 
##$RELAX= 
##$RELAX= 
##$RELAX= 
##$RELAX= 
##$RELAX= 
$$ Bruker specific parameters
$$ [...]
##$TP07= 0
##$TPNAME0= <>
##$TPNAME1= <>
##$TPNAME2= <>
##$TPNAME3= <>
##$TPNAME4= <>
##$TPNAME5= <>
##$TPNAME6= <>
##$TPNAME7= <>
##$TPOAL= (0..7)
0.5 0.5 0.5 0.5 0.5 0.5 0.5 0.5
##$TPOFFS= (0..7)
0 0 0 0 0 0 0 0
##$TUNHIN= 0
##$TUNHOUT= 0
##$TUNXOUT= 0
##$USERA1= <user>
##$USERA2= <user>
##$USERA3= <user>
##$USERA4= <user>
##$USERA5= <user>
##$V9= 5
##$VALIST= <valist>
##$VCLIST= <CCCCCCCCCCCCCCC>
##$VD= 0
##$VDLIST= <DDDDDDDDDDDDDDD>
##$VPLIST= <PPPPPPPPPPPPPPP>
##$VTLIST= <TTTTTTTTTTTTTTT>
##$WBST= 2048
##$WBSW= 25
##$XGAIN= (0..3)
0 0 0 0
##$XL= 0
##$YL= 0
##$YMAX_a= 9434545
##$YMIN_a= -5746437
##$ZGOPTNS= <>
##$ZL1= 120
##$ZL2= 120
##$ZL3= 120
##$ZL4= 120
##$ABSF1= 14.96697
##$ABSF2= -5.58556
##$ABSG= 5
##$ABSL= 3
##$ALPHA= 0
##$AQORDER= 0
##$ASSFAC= 0
##$ASSFACI= 0
##$ASSFACX= 0
##$ASSWID= 0
##$AUNMP= <proc_prof1d_extract.lims>
##$AXLEFT= 0
##$AXNAME= <>
##$AXNUC= <1H>
##$AXRIGHT= 0
##$AXTYPE= 0
##$AXUNIT= <>
##$AZFE= 0.1
##$AZFW= 0.1
##$BCFW= 0
##$BC_mod= 0
##$BYTORDP= 0
##$COROFFS= 0
##$CY= 15
##$DATMOD= 1
##$DC= 0
##$DFILT= <>
##$DTYPP= 0
##$F1P= 0
##$F2P= 0
##$FCOR= 0.5
##$FTSIZE= 131072
##$FT_mod= 6
##$GAMMA= 0
##$GB= 0
##$INTBC= 1
##$INTSCL= 1
##$ISEN= 128
##$LB= 0.3
##$LEV0= 0
##$LPBIN= 0
##$MAXI= 10000
##$MC2= 0
##$MEAN= 0
##$ME_mod= 0
##$MI= 0
##$NCOEF= 0
##$NC_proc= -3
##$NLEV= 6
##$NOISF1= 0
##$NOISF2= 0
##$NSP= 0
##$NTH_PI= 0
##$NZP= 0
##$OFFSET= 14.96697
##$PC= 1
##$PHC0= 31.28906
##$PHC1= 0
##$PH_mod= 1
##$PKNL= yes
##$PPARMOD= 0
##$PPDIAG= 0
##$PPIPTYP= 0
##$PPMPNUM= 2147483647
##$PPRESOL= 1
##$PSCAL= 4
##$PSIGN= 0
##$PYNMP= <proc.py>
##$REVERSE= no
##$SF= 400.130005458651
##$SI= 131072
##$SIGF1= 0
##$SIGF2= 0
##$SINO= 400
##$SIOLD= 131072
##$SPECTYP= <>
##$SREGLST= <1H.CDCl3>
##$SSB= 0
##$STSI= 131072
##$STSR= 0
##$SW_p= 8223.68421052632
##$SYMM= 0
##$S_DEV= 0
##$TDeff= 65536
##$TDoff= 0
##$TI= <>
##$TILT= no
##$TM1= 0
##$TM2= 0
##$TOPLEV= 0
##$USERP1= <user>
##$USERP2= <user>
##$USERP3= <user>
##$USERP4= <user>
##$USERP5= <user>
##$WDW= 1
##$XDIM= 131072
##$YMAX_p= 468342907
##$YMIN_p= -271282118
##$CURPLOT= <Network HP LaserJet P1505>
##$CURPRIN= <$Network HP LaserJet P1505>
##$DFORMAT= <normdp>
##$LAYOUT= <+/1D_H.xwp>
##$LFORMAT= <normlp>
##$PFORMAT= <normpl>
##$SURQMSG= 1
$$ End of Bruker specific parameters
$$ ---------------------------------
##NTUPLES= NMR SPECTRUM
##VAR_NAME=  FREQUENCY,     SPECTRUM/REAL,   SPECTRUM/IMAG
##SYMBOL=    X,             R,               I
##VAR_TYPE=  INDEPENDENT,   DEPENDENT,       DEPENDENT
##VAR_FORM=  AFFN,          ASDF,            ASDF
##VAR_DIM=   131072,        131072,          131072
##UNITS=     HZ,            ARBITRARY UNITS, ARBITRARY UNITS
##FACTOR=    0.0627417313425165, 1,          1
##FIRST=     8223.62146879498, 3022,         -97388
##LAST=      0,             6993,            -96205
##MIN=       0,             -271282118,      0
##MAX=       8223.62146879498, 468342907,    0
$$ Real data points
##PAGE= N=1
##DATA TABLE= (X++(R..R)), XYDATA
$$ [...]
$$ plain form
63648 467185 463823 460369 457064 454362 452396 451052 450300 450274 451232 453344 456194 458740 460270 461176 462216
63633 462216 463456 464777 466912 470626 475078 478565 481132 484816 490774 497674 503686 508529 512503 515017
63619 515017 515668 515756 517027 519430 521678 523548 526038 529431 532774 535394 537480 538930 538984 537586 536058
63604 536058 535703 536358 536828 536272 534836 533304 532260 531157 528250 522185 513740 505358 498900 494629 492340
63589 492340 492222 494033 496539 498718 500907 503879 507317 510188 512433 515294 519905 526202 533369 540861
63575 540861 548825 557858 568422 580238 592383 604408 617229 632363 650215 669664 689581 710205
63563 710205 732607 757208 783420 810638 838982 868976 901033 935612 973465 1015010 1059336
63552 1059336 1104407 1148783 1192964 1238544 1285914 1333159 1377281 1415952 1447713 1471122 1485003
$$ packed form
63648D67185l362l454l305k702j966j344p52k6R58K112K850K546J530R06J040
63633D62216J240J321K135L714M452L487K567L684N958O900O012M843L974K514
63619E15017O51Q8J271K403K248J870K490L393L343K620K086J450N4j398j528
63604E36058l55O55M70n56j436j532j044j103k907o065q445q382o458m271k289
63589D92340j18J811K506K179K189K972L438K871K245K861M611O297P167P492
63575E40861P964R033J0564J1816J2145J2025J2821J5134J7852J9449J9917K0624
63563G10205K2402K4601K6212K7218K8344K9994L2057L4579L7853M1545M4326
63552A059336M5071M4376M4181M5580M7370M7245M4122L8671L1761K3409J3881
$$ plain form
63541 1485003 1489953 1488835 1484916 1479634 1472574 1463279 1452178 1439661 1425096 1407244 1385213 1358739
63529 1358739 1328112 1294402 1259286 1224001 1188755 1153747 1120294 1089966 1062758 1037210 1012533
63518 1012533 989653 969864 953450 940199 930229 923313 918070 913100 908874 907587 910997 919007 930364
63505 930364 944076 959892 977864 997784 1019118 1041592 1065854 1093128 1123923 1157525 1193187
63494 1193187 1231271 1272547 1316867 1363565 1412990 1466443 1524218 1584182 1642265 1693543 1733048
63483 1733048 1757175 1765520 1761092 1748214 1730356 1709842 1688445 1667311 1646736 1626747 1607600 1588995
63471 1588995 1569168 1545661 1517208 1484413 1448536 1410091 1368756 1324257 1277035 1228195 1179027
63460 1179027 1130669 1084131 1040225 999115 960106 922390 886043 851987 821093 793871 770681
$$ packed form
63541A485003M950j118l919n282p060r295j1101j2517j4565j7852k2031k6474
63529A358739l0627l3710l5116l5285l5246l5008l3453l0328k7208k5548k4677
63518A012533k2880j9789j6414j3251r970o916n243m970m226j287L410Q010J1357
63505I30364J3712J5816J7972J9920K1334K2474K4262K7274L0795L3602L5662
63494A193187L8084M1276M4320M6698M9425N3453N7775N9964N8083N1278L9505
63483A733048K4127Q345m428j2878j7858k0514k1397k1134k0575j9989j9147j8605
63471A588995j9827k3507k8453l2795l5877l8445m1335m4499m7222m8840m9168
63460A179027m8358m6538m3906m1110l9009l7716l6347l4056l0894k7222k3190
$$ plain form
63449 770681 751184 733489 715243 696275 679061 665599 654798 644160 633188 623495 615912 609337
63437 609337 602716 596560 591791 588215 584992 581839 579095 577191 576636 577892 580623 583539 585567 586882
63423 586882 588406 590785 594265 598986 604748 610904 617045 623451 630260 636611 641237 643591 643869 642363
63409 642363 639539 636357 633546 630705 626959 622462 618366 615413 613486 612585 613122 614965 617209 619448 622354
63394 622354 626382 630774 634758 639161 645924 656279 670162 687018 706235 726974 748685 772184
63382 772184 799503 832268 870482 912931 958321 1005963 1055855 1108086 1161430 1212294 1255912
63371 1255912 1289490 1314134 1333423 1350460 1366694 1383075 1401255 1423266 1450400 1482715 1519467
63360 1519467 1559926 1603852 1651159 1700992 1751133 1798479 1840091 1873805 1898272 1913016 1918551
$$ packed form
63449G70681j9497j7695j8246j8968j7214j3462j0801j0638j0972r693p583o575
63437F09337o621o156m769l576l223l153k744j904n55J256K731K916K028J315
63423E86882J524K379L480M721N762O156O141O406O809O351M626K354K78j506
63409F42363k824l182k811k841l746m497m096k953j927r01N37J843K244K239K906
63394F22354M028M392L984M403O763J0355J3883J6856J9217K0739K1711K3499
63382G72184K7319L2765L8214M2449M5390M7642M9892N2231N3344N0864M3618
63371A255912L3578K4644J9289J7037J6234J6381J8180K2011K7134L2315L6752
63360A519467M0459M3926M7307M9833N0141M7346M1612L3714K4467J4744N535
$$ plain form
63349 1918551 1916110 1907127 1893255 1876642 1859290 1841612 1822016 1798509 1770519 1738721 1703438 1664124
63337 1664124 1620505 1573443 1524219 1473560 1421925 1370355 1320348 1272972 1228653 1187806 1151187
63326 1151187 1119435 1092611 1070222 1051391 1035122 1020991 1009683 1002209 998312 996417 995787 998034
63314 998034 1005426 1017963 1033303 1049821 1068569 1091619 1119390 1150610 1184319 1220636 1259596 1300458
63302 1300458 1342783 1387370 1435316 1486539 1539854 1594159 1648537 1701011 1748189 1786974 1816429
63291 1816429 1837395 1850569 1855757 1853193 1844693 1832715 1818491 1801794 1782427 1761071 1738205 1712796
63279 1712796 1682793 1646880 1605390 1559736 1511618 1462760 1414559 1367401 1320742 1274521 1230308
63268 1230308 1190415 1155896 1126152 1100670 1080207 1065391 1054586 1044109 1030605 1012497 989194
$$ packed form
63349A918551k441q983j3872j6613j7352j7678j9596k3507k7990l1798l5283l9314
63337A664124m3619m7062m9224n0659n1635n1570n0007m7376m4319m0847l6619
63326A151187l1752k6824k2389j8831j6269j4131j1308p474l897j895o30K247
63314I98034P392J2537J5340J6518J8748K3050K7771L1220L3709L6317L8960M0862
63302A300458M2325M4587M7946N1223N3315N4305N4378N2474M7178L8785K9455
63291A816429K0966J3174N188k564q500j1978j4224j6697j9367k1356k2866k5409
63279A712796l0003l5913m1490m5654m8118m8858m8201m7158m6659m6221m4213
63268A230308l9893l4519k9744k5482k0463j4816j0805j0477j3504j8108k3303
$$ plain form
63257 989194 960261 926349 890140 855040 822764 793060 765721 741631 721261 703226 685521
63246 685521 667882 651824 638328 626573 615364 604884 596149 589176 582732 576003 569611 564391 559683
63233 559683 553651 545359 535933 527362 520541 514905 509833 505834 504038 504650 506182 506418 504236 500507 497073
63218 497073 494865 493238 491301 489479 489174 490901 493348 494677 494437 493814 494225 496126 499164 502927 507185
63203 507185 511580 515537 518606 520807 522588 524549 527266 531157 536226 541926 547601 553157 559012 565355
63189 565355 571896 578669 586554 596350 607587 619070 630570 643091 657341 672903 689402 707522
63177 707522 727940 749856 771641 792752 813969 835784 857645 879149 901006 924068 947855
63166 947855 970792 991884 1011665 1031459 1052087 1073365 1094588 1115131 1134571 1152505 1168609
$$ packed form
63257I89194k8933l3912l6209l5100l2276k9704k7339k4090k0370j8035j7705
63246F85521j7639j6058j3496j1755j1209j0480q735o973o444o729o392n220m708
63233E59683o032q292r426q571o821n636n072l999j796O12J532K36k182l729l434
63218D97073k208j627j937j822l05J727K447J329k40o23M11J901L038L763M258
63203E07185M395L957L069K201J781J961K717L891N069N700N675N556N855O343
63189E65355O541O773P885R796J1237J1483J1500J2521J4250J5562J6499J8120
63177G07522K0418K1916K1785K1111K1217K1815K1861K1504K1857K3062K3787
63166I47855K2937K1092J9781J9794K0628K1278K1223K0543J9440J7934J6104
$$ plain form
63155 1168609 1182877 1195432 1205912 1213309 1216687 1215806 1210740 1201273 1187243 1169402 1149321 1128310
63143 1128310 1106867 1085245 1064086 1044318 1026692 1011531 998643 987523 978017 970771 966540 965100
63131 965100 965534 967793 973209 983027 996922 1013450 1031458 1050527 1070491 1091155 1112248 1133132
63119 1133132 1152860 1171180 1189276 1208687 1229504 1250213 1269366 1286689 1302443 1316502 1328475
63108 1328475 1338116 1344920 1347657 1345031 1336841 1323901 1306610 1284129 1255520 1221649 1185407 1149805
63096 1149805 1116070 1083758 1052215 1021290 990868 960730 931291 903761 878898 856028 833991
63085 833991 812733 793273 776313 761780 749685 740418 733786 728604 723796 719306 715335 711295 706442
63072 706442 701404 698089 697750 699627 701746 702759 702823 703058 704525 707606 712016 717237 722884 728654 734090
$$ packed form
63155A168609J4268J2555J0480P397L378q81n066r467j4030j7841k0081k1011
63143A128310k1443k1622k1159j9768j7626j5161j2888j1120r506p246m231j440
63131I65100M34K259N416R818J3895J6528J8008J9069J9964K0664K1093K0884
63119A133132J9728J8320J8096J9411K0817K0709J9153J7323J5754J4059J1973
63108A328475R641O804K737k626q190j2940j7291k2481k8609l3871l6242l5602
63096A149805l3735l2312l1543l0925l0422l0138k9439k7530k4863k2870k2037
63085H33991k1258j9460j6960j4533j2095r267o632n182m808m490l971m040m853
63072G06442n038l315l39J877K119J013O4K35J467L081M410N221N647N770N436
$$ plain form
63057 734090 738787 742930 747390 752939 759436 766000 771971 777480 783083 789100 795493 802163 809144 816586
63043 816586 824744 833843 843529 852477 859128 863258 866552 871045 877048 883096 887914 891738 895347 898596
63029 898596 900783 902189 904107 907035 909766 910903 910609 910062 909736 909367 909409 911151 914925 919363 923238 927240
63013 927240 932977 940884 950255 960938 973651 988534 1004603 1020999 1037838 1055536 1074349 1095085
63001 1095085 1119165 1147118 1177862 1210429 1245615 1284624 1326570 1368931 1410683 1453632 1500034
62990 1500034 1549912 1601516 1653764 1707226 1762780 1819988 1877091 1932326 1985179 2036462 2087293
62979 2087293 2138133 2188845 2239404 2290065 2340638 2389721 2434821 2473305 2503534 2525293 2539081
62968 2539081 2544812 2541414 2527896 2504502 2472432 2432858 2386858 2336040 2282374 2227272 2171619 2116856
$$ packed form
63057G34090M697M143M460N549O497O564N971N509N603O017O393O670O981P442
63043H16586Q158R099R686Q948O651M130L294M493O003O048M818L824L609L249
63029H98596K187J406J918K928K731J137k94n47l26l69M2J742L774M438L875M002
63013I27240N737P907R371J0683J2713J4883J6069J6396J6839J7698J8813K0736
63001A095085K4080K7953L0744L2567L5186L9009M1946M2361M1752M2949M6402
62990A500034M9878N1604N2248N3462N5554N7208N7103N5235N2853N1283N0831
62979B087293N0840N0712N0559N0661N0573M9083M5100L8484L0229K1759J3788
62968B539081N731l398j3518k3394l2070l9574m6000n0818n3666n5102n5653n4763
$$ plain form
62956 2116856 2065202 2018439 1977066 1940950 1909988 1883684 1861019 1841785 1827675 1821009 1822373 1830239
62944 1830239 1842857 1859790 1881358 1907298 1936374 1967082 1998468 2030442 2063410 2097478 2132019
62933 2132019 2166145 2199518 2232349 2264615 2295529 2323828 2348311 2367978 2381860 2388892 2387882 2377683
62921 2377683 2357637 2328114 2290529 2246657 2197600 2143318 2083347 2018256 1950299 1882175 1815186
62910 1815186 1749169 1684291 1622017 1563710 1508994 1456527 1406121 1359115 1316616 1278303 1243126
62899 1243126 1210167 1178305 1145998 1112502 1079134 1048444 1021902 998861 977811 958054 939731
62888 939731 922622 905681 887941 869407 850743 832525 815321 800111 787624 777087 766578
62877 766578 755095 743559 733255 724203 715891 708652 702930 697777 691784 685426 680724 678217 676037
$$ packed form
62956B116856n1654m6763m1373l6116l0962k6304k2665j9234j4110o666J364P866
62944A830239J2618J6933K1568K5940K9076L0708L1386L1974L2968L4068L4541
62933B132019L4126L3373L2831L2266L0914K8299K4483J9667J3882P032j010j0199
62921B377683k0046k9523l7585m3872m9057n4282n9971o5091o7957o8124o6989
62910A815186o6017o4878o2274n8307n4716n2467n0406m7006m2499l8313l5177
62899A243126l2959l1862l2307l3496l3368l0690k6542k3041k1050j9757j8323
62888I39731j7109j6941j7740j8534j8664j8218j7204j5210j2487j0537j0509
62877G66578j1483j1536j0304r052q312p239n722n153n993o358m702k507k180
$$ plain form
62864 676037 672755 669440 667557 666167 662943 657439 651751 648194 647540 649274 652100 654061 653623 651225 648953
62849 648953 648264 648757 649415 650145 651590 654118 657605 661758 666140 670115 673251 675700 678126 681360 685961
62834 685961 691606 696907 700452 702074 702638 702635 701856 700539 699702 699728 699506 697761 694579 690723 686083 679955
62818 679955 672704 665982 661065 657758 655158 652712 650146 646998 642931 638365 634311 631457 629561 627795
62804 627795 625668 623576 622283 621752 620695 617694 612875 608203 605864 606386 608385 610022 610483 610119 609579
62789 609579 609319 609802 611469 614096 616630 618210 619007 619440 618929 616483 612563 609333 608625 610383 613327 616307
62773 616307 618586 619821 620525 621884 624410 627423 630416 634007 638712 643764 648300 652811 657960 662740
62759 662740 665616 667156 669673 674244 679941 686047 693070 701032 708746 715746 723196 731815 740539 748604
$$ packed form
62864F76037l282l315j883j390l224n504n688l557o54J734K826J961m38k398k272
62849F48953o89M93O58P30J445K528L487M153M382L975L136K449K426L234M601
62834F85961N645N301L545J622N64lp79j317q37K6k22j745l182l856m640o128
62818F79955p251o722m917l307k600k446k566l148m067m566m054k854j896j766
62804F27795k127k092j293n31j057l001m819m672k339N22J999J637M61l64n40
62789F09579k60M83J667K627K534J580P97M33n11k446l920l230p08J758K944K980
62773F16307K279J235P04J359K526L013K993L591M705N052M536M511N149M780
62759F62740K876J540K517M571N697O106P023P962P714P000P450Q619Q724Q065
$$ plain form
62745 748604 757563 769543 784490 800705 817207 833938 850429 866285 882724 901767 923772 947388
62733 947388 972024 998718 1028229 1060024 1093916 1131224 1173185 1219268 1268316 1320743 1378318
62722 1378318 1441836 1510053 1581235 1655112 1732732 1814328 1897653 1978686 2053961 2121902 2181978
62711 2181978 2233435 2275491 2307986 2330628 2341757 2339095 2322089 2292720 2253783 2207242 2154443
62700 2154443 2096766 2035202 1969890 1900921 1829387 1757150 1685769 1616020 1548096 1481924 1417589
62689 1417589 1355879 1298177 1245485 1197753 1154296 1114465 1077647 1043105 1010338 979538 951484
62678 951484 927134 907180 891394 878291 866128 854506 844395 836398 829959 824776 821846 822059 824488
62665 824488 827289 829883 833157 837897 844234 852494 863217 876173 890451 905806 922866 941869 962400
$$ packed form
62745G48604Q959J1980J4947J6215J6502J6731J6491J5856J6439J9043K2005K3616
62733I47388K4636K6694K9511L1795L3892L7308M1961M6083M9048N2427N7575
62722A378318O3518O8217P1182P3877P7620Q1596Q3325Q1033P5275O7941O0076
62711B181978N1457M2056L2495K2642J1129k662j7006k9369l8937m6541n2799
62700B154443n7677o1564o5312o8969p1534p2237p1381o9749o7924o6172o4335
62689A417589o1710n7702n2692m7732m3457l9831l6818l4542l2767l0800k8054
62678I51484k4350j9954j5786j3103j2163j1622j0111p997o439n183k930K13K429
62665H24488K801K594L274M740O337Q260J0723J2956J4278J5355J7060J9003K0531
$$ plain form
62652 962400 984862 1010911 1041539 1075640 1111509 1149165 1190139 1235391 1284562 1337162 1393514
62641 1393514 1454223 1519370 1588406 1660456 1734564 1810037 1886472 1963023 2037668 2107720 2171167
62630 2171167 2227043 2274353 2311272 2335818 2347052 2345213 2330791 2303784 2263934 2211670 2149003
62619 2149003 2079443 2006560 1932223 1856393 1778915 1701247 1626007 1554855 1487333 1421954 1358073
62608 1358073 1296438 1238194 1183797 1132965 1085415 1041366 1001301 965325 932841 902952 875191
62597 875191 849861 827574 808457 791756 776243 761052 746166 732103 719183 707175 695682
62586 695682 684669 674442 665259 657242 650622 645729 642647 641102 640790 641488 642670 643412 643166 642481 642406
62571 642406 643113 643590 642916 641472 640473 640542 641193 641711 642064 642723 643943 645638 647841 650876 654987 660125 666241
$$ packed form
62652I62400K2462K6049L0628L4101L5869L7656M0974M5252M9171N2600N6352
62641A393514O0709O5147O9036P2050P4108P5473P6435P6551P4645P0052O3447
62630B171167N5876M7310L6919K4546J1234j839j4422k7007l9850n2264o2667
62619B149003o9560p2883p4337p5830p7478p7668p5240p1152o7522o5379o3881
62608A358073o1635n8244n4397n0832m7550m4049m0065l5976l2484k9889k7761
62597H75191k5330k2287j9117j6701j5513j5191j4886j4063j2920j2008j1493
62586F95682j1013j0227r183q017o620m893l082j545l12O98J182P42k46o85p5
62571F42406P07M77o74j444r99O9O51N18L53O59J220J695K203L035M111N138O116
$$ plain form
62554 666241 673443 681636 690316 699125 708444 718979 730850 743573 756970 771583 787997 806180
62542 806180 825703 846284 867944 891021 916188 944047 974439 1006563 1039937 1074746 1110960
62531 1110960 1147662 1183536 1217285 1247137 1270924 1287702 1298768 1305945 1309193 1306924 1298280 1283829
62519 1283829 1264196 1239501 1210408 1178505 1145242 1111488 1078312 1046835 1016824 986779 956187
62508 956187 926552 899366 874327 850596 828595 809031 791112 773532 756871 743162 732964
62497 732964 724442 715773 707208 700104 694899 690766 686740 682585 678738 675749 673782 672766 673051 675245
62483 675245 678895 682072 683353 683819 685891 690398 696172 702432 709839 718709 727816 736022 743771 751850
62469 751850 759893 767692 777205 791323 810544 832422 854712 877814 903515 932407 963621 996592
$$ packed form
62554F66241P202Q193Q680Q809R319J0535J1871J2723J3397J4613J6414J8183
62542H06180J9523K0581K1660K3077K5167K7859L0392L2124L3374L4809L6214
62531A110960L6702L5874L3749K9852K3787J6778J1066P177L248k269q644j4451
62519A283829j9633k4695k9093l1903l3263l3754l3176l1477l0011l0045l0592
62508I56187k9635k7186k5039k3731k2001j9564j7919j7580j6661j3709j0198
62497G32964q522q669q565p104n205m133m026m155l847k989j967j016K85K194
62483F75245L650L177J281M66K072M507N774O260P407Q870R107Q206P749Q079
62469G51850Q043P799R513J4118J9221K1878K2290K3102K5701K8892L1214L2971
$$ plain form
62457 996592 1031967 1070576 1112247 1156158 1201996 1250057 1299862 1349099 1394583 1434472 1469226
62446 1469226 1500239 1527868 1551012 1568377 1579744 1586027 1588294 1586758 1580752 1569756 1554372 1536162
62434 1536162 1516830 1498161 1482434 1471722 1466218 1464174 1464384 1468112 1477533 1492720 1511480 1532186
62422 1532186 1555342 1581801 1610590 1639434 1666685 1691627 1713225 1729820 1740386 1745334 1745526 1740719
62410 1740719 1729260 1709137 1679292 1640361 1594591 1545053 1494550 1444825 1396364 1348582 1300282
62399 1300282 1250554 1199703 1149363 1101493 1057279 1017011 980728 948565 920490 896036 874440
62388 874440 854936 836938 820198 804878 791341 779833 770478 763437 758600 754996 751045 745892 740390
62375 740390 736314 734524 734131 733419 731305 727806 723442 718583 713420 708154 702758 696577 688844 680012 672087
$$ packed form
62457I96592L5375L8609M1671M3911M5838M8061M9805M9237M5484L9889L4754
62446A469226L1013K7629K3144J7365J1367O283K267j536o006j0996j5384j8210
62434A536162j9332j8669j5727j0712n504k044K10L728R421J5187J8760K0706
62422A532186K3156K6459K8789K8844K7251K4942K1598J6595J0566M948J92m807
62410A740719j1459k0123k9845l8931m5770m9538n0503m9725m8461m7782m8300
62399A300282m9728n0851n0340m7870m4214m0268l6283l2163k8075k4454k1596
62388H74440j9504j7998j6740j5320j3537j1508r355p041m837l604l951n153n502
62375G40390m076j790l93p12k114l499m364m859n163n266n396o181p733q832p925
$$ plain form
62360 672087 666825 663672 660326 655438 649867 645021 641112 637863 635811 635422 635384 633494 629538 625957 625066
62345 625066 626658 629022 631357 634127 637623 641381 645047 648895 653216 657728 661904 665573 669030 672824
62331 672824 677635 684114 692546 702632 713784 725712 738621 752743 767817 783290 798997 815286
62319 815286 832306 849612 866923 885066 905518 928901 954296 980207 1005973 1032198 1060155
62308 1060155 1090985 1125344 1163598 1206093 1252899 1303306 1356270 1411957 1472398 1539796 1614235
62297 1614235 1693691 1776050 1860048 1944058 2025075 2099700 2165712 2222180 2268437 2303491 2326273
62286 2326273 2336203 2333713 2320341 2297972 2267861 2230638 2187012 2137663 2082468 2020982 1954311 1885719
62274 1885719 1818680 1754788 1693971 1635929 1580587 1527788 1477584 1430628 1387575 1348238 1311815
$$ packed form
62360F72087n262l153l346m888n571m846l909l249k052l89l8j890l956l581q91
62345F25066J592K364K335K770L496L758L666L848M321M512M176L669L457L794
62331F72824M811O479Q432J0086J1152J1928J2909J4122J5074J5473J5707J6289
62319H15286J7020J7306J7311J8143K0452K3383K5395K5911K5766K6225K7957
62308A060155L0830L4359L8254M2495M6806N0407N2964N5687O0441O7398P4439
62297A614235P9456Q2359Q3998Q4010Q1017P4625O6012N6468M6257L5054K2782
62286B326273R930k490j3372k2369l0111l7223m3626m9349n5195o1486o6671o8592
62274A885719o7039o3892o0817n8042n5342n2799n0204m6956m3053l9337l6423
$$ plain form
62263 1311815 1277521 1244441 1211312 1177348 1143148 1110158 1079480 1051601 1026627 1003872 981698
62252 981698 958791 935523 913299 892951 874609 858565 845031 833301 822575 813532 807592 804426
62240 804426 801726 797990 794229 792143 791780 791890 791733 791559 791883 793252 796386 801832 809578 819232 830069
62225 830069 840739 849815 857217 864408 872559 881222 889588 898284 908912 922163 937324 953318 969413
62212 969413 985303 1001592 1020132 1042789 1069668 1099303 1130784 1165091 1204228 1249605 1301385
62201 1301385 1358881 1421398 1488965 1562043 1640150 1721219 1803113 1885477 1968873 2051952 2130528
62190 2130528 2199886 2257146 2301094 2331001 2346791 2349721 2341639 2323368 2294434 2254387 2203884 2144584
62178 2144584 2078486 2007464 1933067 1856583 1779272 1702277 1626254 1551552 1479206 1411239 1349277
$$ packed form
62263A311815l4294l3080l3129l3964l4200l2990l0678k7879k4974k2755k2174
62252I81698k2907k3268k2224k0348j8342j6044j3534j1730j0726r043n940l166
62240H04426k700l736l761k086l63J10j57j74L24J369L134N446P746R654J0837
62225H30069J0670R076P402P191Q151Q663Q366Q696J0628J3251J5161J5994J6095
62212I69413J5890J6289J8540K2657K6879K9635L1481L4307L9137M5377N1780
62201A301385N7496O2517O7567P3078P8107Q1069Q1894Q2364Q3396Q3079P8576
62190B130528O9358N7260M3948K9907J5790K930q082j8271k8934m0047n0503n9300
62178B144584o6098p1022p4397p6484p7311p6995p6023p4702p2346o7967o1962
$$ plain form
62167 1349277 1293017 1240744 1191345 1145232 1103401 1066384 1034249 1006719 982776 960771 939625
62156 939625 919712 902076 886935 873357 860232 847213 834878 824325 816416 811020 807016 803361
62144 803361 799960 797248 795349 794334 795118 799101 806542 815886 825148 833688 842374 852473 864820 879690
62130 879690 896884 915828 935850 956330 976581 996047 1015021 1034772 1056324 1079146 1101651
62119 1101651 1123039 1144069 1165838 1188526 1211960 1237017 1265636 1299301 1338122 1381662 1430136
62108 1430136 1484242 1544067 1608723 1676982 1747634 1819089 1889219 1955933 2017481 2071938 2116983
62097 2116983 2150785 2172755 2182999 2181661 2169661 2149437 2123489 2092047 2053437 2007060 1954766
62086 1954766 1898773 1839614 1777336 1713719 1651858 1593789 1539777 1489898 1445137 1406578 1374150
$$ packed form
62167A349277n6260n2273m9399m6113m1831l7017l2135k7530k3943k2005k1146
62156I39625j9913j7636j5141j3578j3125j3019j2335j0553p909n396m004l655
62144H03361l401k712j899j015P84L983P441R344R262Q540Q686J0099J2347J4870
62130H79690J7194J8944K0022K0480K0251J9466J8974J9751K1552K2822K2505
62119A101651K1388K1030K1769K2688K3434K5057K8619L3665L8821M3540M8474
62108A430136N4106N9825O4656O8259P0652P1455P0130O6714O1548N4457M5045
62097B116983L3802K1970J0244j338j2000k0224k5948l1442l8610m6377n2294
62086A954766n5993n9159o2278o3617o1861n8069n4012m9879m4761l8559l2428
$$ plain form
62075 1374150 1346600 1322470 1301165 1283316 1269890 1260698 1254153 1248838 1244822 1243035 1244072 1248442 1257059
62062 1257059 1270031 1285160 1299030 1309763 1317677 1323417 1326901 1328436 1329439 1331256 1334037 1337162 1339731
62049 1339731 1340202 1336685 1328492 1316836 1303513 1289709 1276446 1264930 1255508 1247282 1239890 1234867 1234069
62036 1234069 1237333 1242979 1250093 1258996 1269753 1281727 1294729 1309346 1325798 1343471 1361917 1381441
62024 1381441 1402375 1424568 1448037 1473407 1501175 1531046 1562485 1595626 1631057 1668735 1707419
62013 1707419 1745498 1782648 1820649 1861960 1907038 1953508 1998644 2042273 2086349 2131945 2177786
62002 2177786 2221806 2262875 2300349 2332816 2358201 2374833 2382057 2380318 2371179 2356717 2338096 2314729
61990 2314729 2285209 2248873 2206093 2157428 2103204 2044033 1981229 1916482 1851288 1786789 1724000
$$ packed form
62075A374150k7550k4130k1305j7849j3426r192o545n315m016j787J037M370Q617
62062A257059J2972J5129J3870J0733P914N740L484J535J003J817K781L125K569
62049A339731M71l517q193j1656j3323j3804j3263j1516r422q226p392n023p98
62036A234069L264N646P114Q903J0757J1974J3002J4617J6452J7673J8446J9524
62024A381441K0934K2193K3469K5370K7768K9871L1439L3141L5431L7678L8684
62013A707419L8079L7150L8001M1311M5078M6470M5136M3629M4076M5596M5841
62002B177786M4020M1069L7474L2467K5385J6632P224j739r139j4462j8621k3367
61990B314729k9520l6336m2780m8665n4224n9171o2804o4747o5194o4499o2789
$$ plain form
61979 1724000 1663908 1607051 1552917 1500049 1447368 1395449 1346118 1300690 1259136 1221095 1186894
61968 1186894 1156897 1130294 1105471 1081625 1059483 1040274 1024327 1010658 997570 983682 968834
61957 968834 954089 940555 928213 916287 904726 894730 887495 882915 879859 877480 875903 875873 878068
61944 878068 882518 888202 893317 896547 898286 900280 903823 908518 912914 915942 917370 917131 914891 910457
61930 910457 904162 896492 887568 877398 866543 855984 846014 835614 823429 809358 794803 781252
61918 781252 769008 757613 747068 738060 730976 725241 719835 714154 708177 702158 696474 691682 688357
61905 688357 686851 687193 689050 691701 694324 696530 698503 700603 703189 706956 712783 720740 729653 738302
61891 738302 746827 756444 768062 781915 798263 817416 839011 862226 887036 914342 944428 976111
$$ packed form
61979A724000o0092n6857n4134n2868n2681n1919m9331m5428m1554l8041l4201
61968A186894k9997k6603k4823k3846k2142j9209j5947j3669j3088j3888j4848
61957I68834j4745j3534j2342j1926j1561r996p235m580l056k379j577l0K195
61944H78068M450N684N115L230J739J994L543M695M396L028J428k39k240m434
61930I10457o295p670q924j0170j0855j0559r970j0400j2185j4071j4555j3551
61918G81252j2244j1395j0545r008p084n735n406n681n977o019n684m792l325
61905F88357j506L42J857K651K623K206J973K100K586L767N827P957Q913Q649
61891G38302Q525R617J1618J3853J6348J9153K1595K3215K4810K7306L0086L1683
$$ plain form
61879 976111 1008079 1040460 1074268 1109742 1145911 1181631 1216421 1250266 1282987 1313772 1341285
61868 1341285 1364619 1384328 1401997 1418349 1432179 1441500 1445261 1443688 1437793 1429427 1421149 1414809 1410279
61855 1410279 1406366 1402891 1401237 1403140 1409778 1421631 1438007 1456708 1475429 1493844 1513176 1533271
61843 1533271 1551313 1564260 1571668 1574954 1574430 1568326 1554925 1534813 1510627 1484949 1458771 1431681
61831 1431681 1403060 1372853 1341514 1309807 1278903 1250094 1223767 1199013 1174928 1152102 1131946
61820 1131946 1114566 1098388 1082276 1067052 1054267 1044232 1036112 1029460 1024632 1021763 1020246 1019523 1019893
61807 1019893 1022205 1026992 1034183 1043614 1055588 1070717 1089191 1110593 1134701 1162050 1193036 1226620
61795 1226620 1260902 1295251 1331163 1370683 1414631 1462664 1514051 1567526 1621031 1672758 1722209
$$ packed form
61879I76111L1968L2381L3808L5474L6169L5720L4790L3845L2721L0785K7513
61868A341285K3334J9709J7669J6352J3830R321L761j573n895q366q278o340m530
61855A410279l913l475j654J903O638J1853J6376J8701J8721J8415J9332K0095
61843A533271J8042J2947P408L286n24o104j3401k0112k4186k5678k6178k7090
61831A431681k8621l0207l1339l1707l0904k8809k6327k4754k4085k2826k0156
61820A131946j7380j6178j6112j5224j2785j0035q120o652m828k869j517p23L70
61807A019893K312M787P191R431J1974J5129J8474K1402K4108K7349L0986L3584
61795A226620L4282L4349L5912L9520M3948M8033N1387N3475N3505N1727M9451
$$ plain form
61784 1722209 1769339 1812852 1850386 1880429 1903052 1918452 1925856 1924718 1916483 1904216 1890402 1875724
61772 1875724 1860159 1844681 1831297 1821627 1816221 1815513 1820566 1831838 1847349 1863234 1876529 1886673
61760 1886673 1893900 1897071 1893960 1883083 1864243 1837639 1803583 1763180 1718309 1670470 1620102 1567214
61748 1567214 1512292 1456482 1401344 1348497 1298979 1252794 1209501 1169382 1133513 1102390 1074919
61737 1074919 1049159 1024019 1000102 979074 962247 949578 939827 931618 924116 916758 909003 901000
61725 901000 894006 889163 885834 882103 877180 872495 869987 869967 871118 872021 872114 871556 870735 869816 868516 866533
61709 866533 864307 862817 862449 862691 863295 864917 867868 870924 872397 872147 871563 871677 872253 872725 873077 873463 873758
61692 873758 873863 873852 873497 872296 870445 869217 869671 871207 872019 870943 868504 866219 865257 865779 867099 868176
$$ packed form
61784A722209M7130M3513L7534L0043K2623J5400P404j138q235j2267j3814j4678
61772A875724j5565j5478j3384r670n406p08N053J1272J5511J5885J3295J0144
61760A886673P227L171l111j0877j8840k6604l4056m0403m4871m7839n0368n2888
61748A567214n4922n5810n5138n2847m9518m6185m3293m0119l5869l1123k7471
61737A074919k5760k5140k3917k1028j6827j2669r751q209p502p358p755q003
61725I01000o994m843l329l731m923m685k508k0J151R03R3n58q21r19j300j983
61709H66533k226j490l68K42O04J622K951L056J473k50n84J14N76M72L52L86K95
61692H73758J05j1l55j201j851j228M54J536Q12j076k439k285r62N22J320J077
$$ plain form
61676 868176 868135 866711 864394 862073 860328 859058 857940 857198 857507 859046 861167 863389 866204 870143 874455
61661 874455 877757 879971 882488 886060 889639 891922 893110 894164 895068 895009 893846 892243 890386 887758 884267
61646 884267 880461 876235 870307 861675 851036 840284 831083 824270 819984 817650 816137 814526 812637 810536
61632 810536 807856 804082 799249 793919 788574 783321 777965 772117 765566 758863 753191 749298 746949 745762
61618 745762 745962 747611 749708 751015 751469 751690 751402 749695 746944 744989 744796 745176 744667 743647 743392 743850
61602 743850 743719 742452 740848 739651 738816 738510 739704 743056 747903 753013 757788 762081 765241 766363 765609
61587 765609 764643 765353 768357 772829 777396 780993 783198 784325 785285 786999 789541 791826 792309 790103 785478
61572 785478 779361 772505 765262 757968 751217 745496 740663 736087 731364 726670 722302 718252 714526 711547
$$ packed form
61676H68176m1j424k317k321j745j270j118p42L09J539K121K222K815L939M312
61661H74455L302K214K517L572L579K283J188J054R04n9j163j603j857k628l491
61646H84267l806m226n928q632j0639j0752r201o813m286k334j513j611j889k101
61632H10536k680l774m833n330n345n253n356n848o551o703n672l893k349j187
61618G45762K00J649K097J307M54K21k88j707k751j955j93L80n09j020k55M58
61602G43850j31j267j604j197q35l06J194L352M847N110M775M293L160J122p54
61587G65609r66P10L004M472M567L597K205J127R60J714K542K285M83k206m625
61572G85478o117o856p243p294o751n721m833m576m723m694m368m050l726k979
$$ plain form
61558 711547 709624 708086 705692 702119 698418 695604 693381 690873 687976 685023 681397 675714 667723 659066
61544 659066 651548 645234 638879 631782 624509 617961 612440 607688 603294 598740 593299 586231 577300 567207
61530 567207 557511 549837 544862 541906 539481 536316 532185 528032 525075 523350 521245 517007 510659 503884
61516 503884 497981 492743 487566 482697 478703 475345 471897 468221 464825 462192 460767 461177 463380 465783
61502 465783 466384 464958 463082 461777 460403 458480 457344 458619 461647 463908 464082 463484 464034 465798 467408
61487 467408 468383 469864 472823 476345 478451 478487 477998 479004 481871 485366 488420 491153 494043 496819 498592
61472 498592 498800 497635 495797 494214 493697 494224 494587 493336 490319 486852 484160 482111 479887 477392 475290
61457 475290 473829 472435 470682 468945 467682 466607 465227 463854 463346 463853 464443 464139 462824 460930 458737
$$ packed form
61558G11547j923j538k394l573l701k814k223k508k897k953l626n683p991q657
61544F59066p518o314o355p097p273o548n521m752m394m554n441p068q931j0093
61530E67207r696p674m975k956k425l165m131m153k957j725k105m238o348o775
61516E03884n903n238n177m869l994l358l448l676l396k633j425M10K203K403
61502D65783O01j426j876j305j374j923j136J275L028K261J74n98N50J764J610
61487D67408R75J481K959L522K106L6m89J006K867L495L054K733K890K776J773
61472D98592K08j165j838j583n17N27L63j251l017l467k692k049k224k495k102
61457D75290j461j394j753j737j263j075j380j373n08N07N90l04j315j894k193
$$ plain form
61442 458737 456358 454178 452882 452986 454399 456377 457922 458483 458279 457733 456658 454447 451217 448267 447028
61427 447028 447856 450097 453051 456425 459991 463203 465278 465654 464524 462971 462281 463016 464934 467637 470615
61412 470615 472663 472358 469818 467198 466517 467511 468579 469290 470637 472874 474609 474549 473104 471633 470893 470851
61396 470851 471361 472279 473348 474630 476783 480245 484303 487559 489305 489979 490321 490522 490328 489733 489437 490597
61380 490597 493986 499326 505585 511938 518062 523501 527544 530394 533935 540250 549136 557834 563638 566322
61366 566322 567721 569570 572461 576502 581777 587711 592768 595655 596634 597043 597651 598212 598603 599445 601030 602411
61350 602411 602433 601370 600624 600798 600831 599298 595916 591456 586754 582371 578925 577030 576618 576595 575520 572760
61334 572760 569007 565553 563128 561512 560195 559034 558227 558093 559141 561817 565645 569008 570517 570480 570412 571215
$$ packed form
61442D58737k379k180j296J04J413J978J545N61k04n46j075k211l230k950j239
61427D47028Q28K241K954L374L566L212K075L76j130j553o90P35J918K703K978
61412D70615K048l05k540k620o81R94J068P11J347K237J735o0j445j471p40m2
61396D70851N10R18J069J282K153L462M058L256J746O74L42K01j94n95k96J160
61380D90597L389N340O259O353O124N439M043K850L541O315Q886Q698N804K684
61366E66322J399J849K891M041N275N934N057K887R79M09O08N61L91Q42J585J381
61350F02411K2j063p46J74L3j533l382m460m702m383l446j895m12k3j075k760
61334E72760l753l454k425j616j317j161q07j34J048K676L828L363J509l7o8Q03
$$ plain form
61318 571215 572538 573847 575246 576989 578955 581078 583751 587355 591669 596041 599955 603395 606985 611749
61304 611749 618126 625205 631642 637371 643523 650466 657153 663059 669597 678407 689017 699632 709895
61291 709895 721329 734810 748948 761623 772334 782304 792746 803677 814255 823789 832297 840229
61279 840229 847690 854083 858716 861774 864432 867895 872345 876604 878709 877167 872188 865725 859887 855296
61265 855296 851221 847097 843304 840409 838320 836568 835002 833860 833434 834054 836124 839684 843910 847443 849463
61250 849463 850422 851792 855130 861222 869732 879484 889231 898412 907183 915678 923419 929794 935050 940187
61236 940187 945462 949460 950402 948271 944846 941541 938074 933695 928864 924827 921970 919563 917053 914680
61222 914680 912660 910661 908574 907216 907623 909894 913268 917263 922257 928811 936802 945466 954138 962692
$$ packed form
61318E71215J323J309J399J743J966K123K673L604M314M372L914L440L590M764
61304F11749O377P079O437N729O152O943O687N906O538Q810J0610J0615J0263
61291G09895J1434J3481J4138J2675J0711R970J0442J0931J0578R534Q508P932
61279H40229P461O393M633L058K658L463M450M259K105j542m979o463n838m591
61265H55296m075m124l793k895k089j752j566j142m26O20K070L560M226L533K020
61250H49463R59J370L338O092Q510R752R747R181Q771Q495P741O375N256N137
61236I40187N275L998R42k131l425l305l467m379m831m037k857k407k510k373
61222I14680k020j999k087j358M07K271L374L995M994O554P991Q664Q672Q554
$$ plain form
61208 962692 971302 980062 988999 998282 1008155 1018699 1029914 1042053 1055605 1070798 1087138 1103477
61196 1103477 1118465 1131100 1141186 1149335 1156261 1162028 1166139 1168287 1168594 1167129 1163733 1158452 1151695
61183 1151695 1143745 1134711 1125258 1116698 1109747 1103595 1096822 1088971 1080715 1072817 1065603 1059204 1053557 1048239
61169 1048239 1042952 1038129 1034477 1032026 1030294 1029389 1030097 1032739 1036617 1040872 1045228 1049586 1053483 1056459
61155 1056459 1058677 1060808 1063580 1067604 1073179 1079814 1086161 1090952 1094077 1096646 1099999 1104623 1109872 1114794
61141 1114794 1119469 1125434 1134392 1146592 1160954 1176764 1194489 1214692 1236805 1259492 1281742 1303114
61129 1303114 1323314 1342217 1360052 1376892 1391973 1404095 1412932 1419566 1425512 1431360 1436462 1439782
61117 1439782 1440918 1440320 1438555 1435473 1430355 1423023 1414557 1406545 1399517 1392267 1382788 1369944 1354343 1337686
$$ packed form
61208I62692Q610Q760Q937R283R873J0544J1215J2139J3552J5193J6340J6339
61196A103477J4988J2635J0086Q149O926N767M111K148L07j465l396n281o757
61183A151695p950r034r453q560o951o152o773p851q256p898p214o399n647n318
61169A048239n287m823l652k451j732r05P08K642L878M255M356M358L897K976
61155A056459K218K131K772M024N575O635O347M791L125K569L353M624N249M922
61141A114794M675N965Q958J2200J4362J5810J7725K0203K2113K2687K2250K1372
61129A303114K0200J8903J7835J6840J5081J2122Q837O634N946N848N102L320
61117A439782J136n98j765l082n118p332q466q012p028p250r479j2844j5601j6657
$$ plain form
61103 1337686 1321259 1305114 1288748 1272263 1256321 1240985 1225315 1208623 1191616 1175668 1161201
61092 1161201 1147590 1134698 1123605 1115288 1109157 1103630 1097854 1092076 1086243 1079118 1069374 1057223 1044372
61079 1044372 1032540 1022500 1014449 1008431 1004031 1000195 996073 991999 989214 988742 990881 995707 1003516 1014531
61065 1014531 1028458 1044533 1061947 1080201 1099337 1119932 1142632 1167467 1193723 1220584 1247806
61054 1247806 1275724 1304822 1335445 1367678 1401104 1434730 1467492 1498939 1529110 1557555 1582961
61043 1582961 1604302 1622161 1638077 1652321 1663044 1668159 1667528 1662635 1654601 1643520 1629510 1613222
61031 1613222 1595021 1574643 1552060 1527916 1502749 1476609 1449838 1423355 1397702 1372690 1348567
61020 1348567 1326486 1307006 1289231 1272556 1258125 1247004 1237763 1227963 1217807 1210308 1207520 1208387
$$ packed form
61103A337686j6427j6145j6366j6485j5942j5336j5670j6692j7007j5948j4467
61092A161201j3611j2892j1093q317o131n527n776n778n833p125r744j2151j2851
61079A044372j1832j0040q051o018m400l836m122m074k785m72K139M826P809J1015
61065A014531J3927J6075J7414J8254J9136K0595K2700K4835K6256K6861K7222
61054A247806K7918K9098L0623L2233L3426L3626L2762L1447L0171K8445K5406
61043A582961K1341J7859J5916J4244J0723N115o31m893q034j1081j4010j6288
61031A613222j8201k0378k2583k4144k5167k6140k6771k6483k5653k5012k4123
61020A348567k2081j9480j7775j6675j4431j1121r241r800j0156p499k788Q67
$$ plain form
61008 1208387 1210903 1214799 1221128 1230362 1241953 1255128 1269419 1284945 1302641 1323580 1347797 1374421
60996 1374421 1403106 1434340 1468128 1503643 1540776 1580849 1624951 1672624 1723096 1776873 1835089
60985 1835089 1898221 1966710 2042060 2125776 2217267 2314014 2414009 2517438 2626077 2741710 2865019
60974 2865019 2995395 3131863 3274386 3423757 3580019 3742033 3909467 4084403 4269959
60965 4269959 4468010 4679363 4905606 5149360 5412972 5698287 6007847 6345521 6716549
60956 6716549 7128572 7593010 8124565 8739213 9453018 10281665 11239125 12336805 13585923
60947 13585923 15001453 16603494 18416427 20467492 22776350 25321940 27994384 30573933
60939 30573933 32780307 34384072 35311242 35668944 35682483 35598423 35610584 35817863 36193480
$$ packed form
61008A208387K516L896O329R234J1591J3175J4291J5526J7696K0939K4217K6624
60996A374421K8685L1234L3788L5515L7133M0073M4102M7673N0472N3777N8216
60985A835089O3132O8489P5350Q3716R1491R6747R9995J03429J08639J15633J23309
60974B865019J30376J36468J42523J49371J56262J62014J67434J74936J85556
60965D269959J98051K11353K26243K43754K63612K85315L09560L37674L71028
60956F716549M12023M64438N31555O14648P13805Q28647R57460J097680J249118
60947A3585923J415530J602041J812933K051065K308858K545590K672444K579549
60939C0573933K206374J603765R27170L57702J3539q4060J2161K07279L75617
$$ plain form
60930 36193480 36569427 36672705 36229368 35088476 33285603 31008138 28499065 25968291
60922 25968291 23552250 21317262 19281891 17439462 15773757 14267756 12907612 11683580
60914 11683580 10588328 9613865 8749866 7984809 7307636 6707661 6173935 5696291 5267100
60905 5267100 4881251 4534578 4223116 3943623 3693679 3470903 3272542 3095752 2937651
60896 2937651 2795014 2664676 2544531 2433808 2332175 2238855 2152580 2072120 1996837 1926955
60886 1926955 1863085 1805143 1751915 1702128 1655746 1613590 1575739 1540902 1507414 1474268 1441127
60875 1441127 1408079 1375738 1344948 1315781 1287154 1258064 1229033 1201651 1176597 1152783 1128887
60864 1128887 1105325 1083953 1065825 1049950 1034613 1019356 1005137 992934 982979 975139 969091 963888
$$ packed form
60930C6193480L75947J03278m43337j140892j802873k277465k509073k530774
60922B5968291k416041k234988k035371j842429j665705j506001j360144j224032
60914A1683580j095252r74463q63999p65057o77173n99975n33726m77644m29191
60905E267100l85849l46673l11462k79493k49944k22776j98361j76790j58101
60896B937651j42637j30338j20145j10723j01633r3320q6275q0460p5283o9882
60886A926955o3870n7942n3228m9787m6382m2156l7851l4837l3488l3146l3141
60875A441127l3048l2341l0790k9167k8627k9090k9031k7382k5054k3814k3896
60864A128887k3562k1372j8128j5875j5337j5257j4219j2203r955p840o048n203
$$ plain form
60852 963888 958190 951435 944328 937803 932021 926751 922134 918354 914933 911073 906614 902100 898020 894485
60838 894485 891433 888494 884729 879254 872438 866055 861845 859999 859083 857291 853763 848960 843944 839350
60824 839350 835062 830766 826402 821966 817365 812905 809557 808163 808442 809220 809695 810209 811876 815689 821739
60809 821739 828991 836057 842550 849430 857649 866984 876757 887123 898531 910071 919627 926121 930862
60796 930862 936178 943200 951185 958407 963458 966400 969039 973524 980218 987349 993021 997009 1000315 1003732
60782 1003732 1007449 1011415 1015223 1017974 1019045 1018999 1019148 1020300 1022206 1023988 1024656 1023685 1021808 1021052 1023244
60767 1023244 1028453 1035411 1043339 1052645 1063839 1076540 1089770 1102719 1114978 1126503 1137547 1148409
60755 1148409 1159269 1170610 1183570 1199095 1216612 1234318 1250966 1266663 1281633 1295119 1306189
$$ packed form
60852I63888n698o755p107o525n782n270m617l780l421l860m459m514m080l535
60838H94485l052k939l765n475o816o383m210j846r16j792l528m803n016m594
60824H39350m288m296m364m436m601m460l348j394K79P78M75N14J667L813O050
60809H21739P252P066O493O880Q219R335R773J0366J1408J1540R556O494M741
60796I30862N316P022P985P222N051K942K639M485O694P131N672L988L306L417
60782A003732L717L966L808K751J071m6J49J152J906J782O68r71j877p56K192
60767A023244N209O958P928R306J1194J2701J3230J2949J2259J1525J1044J0862
60755A148409J0860J1341J2960J5525J7517J7706J6648J5697J4970J3486J1070
$$ plain form
60744 1306189 1314938 1321961 1327038 1329240 1328309 1325198 1321187 1317008 1312827 1308396 1302967 1295537 1285523 1273178
60730 1273178 1259335 1244886 1230333 1215480 1199781 1183336 1167317 1152715 1138797 1123698 1106809
60719 1106809 1089804 1074801 1062128 1050537 1039164 1028374 1018733 1009906 1000879 990941 980246 969477
60707 969477 958911 947770 934835 920041 905196 892525 882516 873711 864562 854789 844708 834088
60695 834088 822497 810509 799725 791305 784844 778990 772936 767087 762301 758774 755826 752662 749031
60682 749031 745049 740705 735934 730985 726177 721150 714973 707404 699624 693108 687972 683120 678068 673970
60668 673970 672476 673927 676976 679683 680737 680032 678608 677928 678747 680547 682182 682865 682336 680407 677062
60653 677062 673000 669396 666753 664264 660563 654925 647745 640229 633688 628600 624091 618840 612773 607320
$$ packed form
60744A306189Q749P023N077K202r31l111m011m179m181m431n429p430j0014j2345
60730A273178j3843j4449j4553j4853j5699j6445j6019j4602j3918j5099j6889
60719A106809j7005j5003j2673j1591j1373j0790r641q827r027r938j0695j0769
60707I69477j0566j1141j2935j4794j4845j2671j0009q805r149r773j0081j0620
60695H34088j1591j1988j0784q420o461n854o054n849m786l527k948l164l631
60682G49031l982m344m771m949m808n027o177p569p780o516n136m852n052m098
60668F73970j494J451L049K707J054p05j424o80Q19J800J635O83n29j929l345
60653F77062m062l604k643k489l701n638p180p516o541n088m509n251o067n453
$$ plain form
60639 607320 603531 600539 596668 591633 586732 583018 580267 577873 575833 574463 573771 573541 573605 573746 573762 573914
60623 573914 574822 576598 578523 579910 580919 582209 584126 586521 589017 591215 593073 595318 598890 603578
60609 603578 607787 610193 611138 611801 612568 613076 613480 614636 617003 620175 623613 627209 630940 634512 637671
60594 637671 640683 644388 649832 657520 666810 676314 685281 694131 703207 711546 717659 721129 722521 721980
60580 721980 719029 713893 708070 703198 699837 697354 694521 690367 685086 679929 675563 671057 665496 659959
60566 659959 656300 654208 651523 647761 645057 644601 644195 641097 635811 631139 628458 627031 626435 627394 629926
60551 629926 632518 633804 633910 633558 632845 631533 629911 628760 628657 629446 630068 629140 626277 622789 620467 619778
60535 619778 619835 619966 620496 622057 624964 629209 634128 638082 639636 639454 640046 643106 647884 652676 657001 661563
$$ packed form
60639F07320l789k992l871n035m901l714k751k394k040j370o92k30O4J41J6J52
60623E73914R08J776J925J387J009J290J917K395K496K198J858K245L572M688
60609F03578M209K406R45O63P67N08M04J156K367L172L438L596L731L572L159
60594F37671L012L705N444P688R290R504Q967Q850R076Q339O113L470J392n41
60580G21980k951n136n823m872l361k483k833m154n281n157m366m506n561n537
60566F59959l659k092k685l762k704m56m06l098n286m672k681j427n96R59K532
60551F29926K592J286J06l52p13j312j622j151j03P89O22r28k863l488k322o89
60535F19778N7J31N30J561K907M245M919L954J554j82N92L060M778M792M325M562
$$ plain form
60519 661563 666785 672358 678007 683921 690520 698384 708180 720101 733517 747751 763196 781110 802122
60506 802122 825181 848033 868483 885334 898511 908501 915562 919372 919513 916205 910479 903721 897330
60493 897330 892771 891531 894449 900942 909242 917911 927235 938862 953925 971901 991471 1012056 1033965
60480 1033965 1057381 1081906 1106917 1131477 1153703 1171107 1182241 1187679 1188973 1187089 1182306 1175176
60468 1175176 1166692 1157624 1148446 1140001 1133378 1128613 1124191 1118664 1112587 1108058 1106208 1105950 1105707 1105744 1107972
60453 1107972 1113766 1122820 1134164 1147320 1162175 1178627 1197010 1218317 1243436 1272750 1307132 1348527
60441 1348527 1398332 1455414 1516918 1581192 1648856 1720718 1795476 1869866 1940200 2003192 2055918
60430 2055918 2095752 2120280 2127184 2114790 2083190 2034616 1972537 1900689 1822853 1742458 1661668
$$ packed form
60519F61563N222N573N649N914O599P864R796J1921J3416J4234J5445J7914K1012
60506H02122K3059K2852K0450J6851J3177R990P061L810J41l308n726o758o391
60493H97330m559j240K918O493Q300Q669R324J1627J5063J7976J9570K0585K1909
60480A033965K3416K4525K5011K4560K2226J7404J1134N438J294j884m783p130
60468A175176q484r068r178q445o623m765m422n527o077m529j850k58k43L7K228
60453A107972N794R054J1344J3156J4855J6452J8383K1307K5119K9314L4382M1395
60441A348527M9805N7082O1504O4274O7664P1862P4758P4390P0334O2992N2726
60430B055918L9834K4528O904j2394l1600m8574o2079p1848p7836q0395q0790
$$ plain form
60419 1661668 1581317 1502326 1426676 1356350 1291840 1232538 1178290 1129620 1086505 1047852 1012422
60408 1012422 979614 949069 920213 892730 867190 844719 825933 810257 796205 782446 768913
60397 768913 756906 747765 741280 735716 729575 722967 716901 711566 706003 699522 692691 686392 680400 673832
60383 673832 667004 661833 659747 659762 659442 657471 654383 650911 646798 641764 636771 633416 632320 632727 633521
60368 633521 634021 633920 633155 632041 631093 630418 629608 628472 627661 628166 630130 632407 633529 633061 631845 630909 630451
60351 630451 630033 629468 629000 628753 628527 628380 628977 630968 634095 637182 639103 639788 640259 641531 643420 644711
60335 644711 644749 644532 645678 648451 651451 653399 654662 656810 661056 667292 674180 679975 683581 685052 685049 684108
60319 684108 682851 682427 683702 686054 688002 689158 690392 691863 692360 691397 690535 691372 693237 694404 694889 696379
$$ packed form
60419A661668q0351p8991p5650p0326o4510n9302n4248m8670m3115l8653l5430
60408A012422l2808l0545k8856k7483k5540k2471j8786j5676j4052j3759j3533
60397G68913j2007r141o485n564o141o608o066n335n563o481o831o299n992o568
60383F73832o828n171k086J5l20j971l088l472m113n034m993l355j096M07P94
60368F33521N00j01p65j114r48o75q10j136q11N05J964K277J122m68j216r36m58
60351F30451m18n65m68k47k26j47N97J991L127L087J921O85M71J272J889J291
60335F44711L8k17J146K773L000J948J263K148M246O236O888N795L606J471lr41
60319F84108j257m24J275K352J948J156J234J471M97r63q62Q37J865J167M85J490
$$ plain form
60303 696379 699639 703524 706628 708589 709657 710370 711989 715998 722489 729842 736522 742469 748368 754486
60289 754486 760825 767614 774779 781303 785952 788600 790330 792188 794060 794789 793280 789613 785055 780936
60275 780936 777679 775100 773235 772315 772196 772570 773625 775754 778635 781422 783898 786509 789121 790773 791123
60260 791123 791293 792673 795595 799694 804816 810961 817953 825897 835592 847990 863679 883126 906531
60247 906531 932873 960268 988397 1019705 1056517 1097061 1135685 1167158 1189711 1203904 1210022 1207391
60235 1207391 1195475 1174842 1147294 1115389 1081597 1047703 1015121 985469 959992 938413 919180
60224 919180 901176 884566 869720 856254 843775 832882 824404 817821 811312 803541 794890 786737 779886
60211 779886 774014 768492 763385 759298 756232 753022 748536 743362 739642 738824 740023 740986 740333 738329 735827
$$ packed form
60303F96379L260L885L104J961J068P13J619M009O491P353O680N947N899O118
60289G54486O339O789P165O524M649K648J730J858J872P29j509l667m558m119
60275G80936l257k579j865r20j19L74J055K129K881K787K476K611K612J652L50
60260G91123J70J380K922M099N122O145O992P944R695J2398J5689J9447K3405
60247I06531K6342K7395K8129L1308L6812M0544L8624L1473K2553J4193O118k631
60235A207391j1916k0633k7548l1905l3792l3894l2582k9652k5477k1579j9233
60224I19180j8004j6610j4846j3466j2479j0893q478o583o509p771q651q153o851
60211G79886n872n522n107m087l066l210m486n174l720q18J199R63o53k004k502
$$ plain form
60196 735827 733321 731199 730230 731125 733648 736460 738055 737940 736951 736366 736658 737143 736879 735743 734529 734219
60180 734219 735278 737458 739991 742134 743852 745926 749121 753335 757842 762169 766275 769969 772772 774588
60166 774588 776011 777711 779879 782530 785822 789629 793124 795396 796407 796954 797826 799367 801721 805065 809563
60151 809563 815350 822323 829531 835148 837940 838786 839945 842616 845987 849006 852112 856392 861682 866580
60137 866580 870242 873254 876504 879888 882508 883811 884181 884503 885306 886270 886538 885571 883657 881549 879679 877838
60121 877838 875439 872002 867569 862830 858668 855421 852835 850813 849751 849796 850210 850068 849327 848699 848659 849022
60105 849022 849297 848943 847649 846000 845545 847330 850549 853508 855774 858308 861584 864820 867388 869724 872371
60090 872371 875353 879085 884674 892314 900486 907891 915162 923295 931284 937202 941283 946022 952896 960647
$$ packed form
60196G35827k506k122r69Q95K523K812J595j15r89n85K92M85k64j136j214l10
60180G34219J059K180K533K143J718K074L195M214M507M327M106L694K803J816
60166G74588J423J700K168K651L292L807L495K272J011N47Q72J541K354L344M498
60151H09563N787O973P208N617K792Q46J159K671L371L019L106M280N290M898
60137H66580L662L012L250L384K620J303L70L22Q03R64K68r67j914k108j870j841
60121H77838k399l437m433m739m162l247k586k022j062M5M14j42p41o28m0L63
60105H49022K75l54j294j649m55J785L219K959K266K534L276L236K568K336K647
60090H72371K982L732N589P640Q172P405P271Q133P989N918M081M739O874P751
$$ plain form
60076 960647 967323 972571 977112 981142 984251 986187 986796 985779 983372 980798 979177 978256 976916 974703 972153
60061 972153 969816 967736 965934 964807 964929 966808 970612 975561 979667 980910 978959 975308 971610 968383
60047 968383 965467 962918 960880 959072 957106 955066 953154 950978 947925 944254 941020 938735 936883 935154
60033 935154 934350 935285 937325 939099 940606 943632 949772 958699 968603 977559 984168 987800 989163 990205 992376
60018 992376 994941 995648 993077 987769 981110 973899 966247 958139 949505 940062 929639 918603 907711 897545
60004 897545 888174 879285 870626 862367 854882 847984 840688 832327 823789 816813 811835 807350 801957 796309
59990 796309 792146 789859 788035 785429 782427 780299 779734 780531 782177 784227 786387 788615 791005 793374 795269
59975 795269 796663 798336 801111 804822 808300 810223 809640 805991 799290 790441 780919 771842 763471 755536
$$ packed form
60076I60647O676N248M541M030L109J936O09j017k407k574j621r21j340k213k550
60061I72153k337k080j802j127J22J879L804M949M106J243j951l651l698l227
60047I68383k916k549k038j808j966k040j912k176l053l671l234k285j852j729
60033I35154q04R35K040J774J507L026O140Q927R904Q956O609L632J363J042K171
60018I92376K565P07k571n308o659p211p652q108q634r443j0423j1036j0892j0166
60004H97545r371q889q659q259p485o898p296q361q538o976m978m485n393n648
59990G96309m163k287j824k606l002k128n65P97J646K050K160K228K390K369J895
59975G95269J394J673K775L711L478J923n83l649o701q849r522r077q371p935
$$ plain form
59961 755536 747727 739880 732171 725233 719608 714901 710021 704580 699419 695265 691464 686951 682038 678100
59947 678100 675486 672920 669478 666141 664565 664872 665573 665440 664749 664758 666578 670561 676241 682662 688891 694248
59931 694248 698110 700104 700852 701939 704320 707071 708516 708423 708199 709014 710791 713155 716226 719980 723792
59916 723792 727284 730847 734639 737881 739964 741564 743576 745543 746421 746588 747630 750026 752484 754164 756257
59901 756257 760339 765893 770631 773015 773477 773149 772245 770162 766719 762814 759850 758637 758791 759122 758650 757364
59885 757364 756084 755616 755995 756443 756054 754559 752408 750160 747969 745701 743337 741084 739325 738547 738934 739720
59869 739720 739443 737463 734876 733255 732869 733122 734424 738019 743582 748560 751064 752418 755559 761489 768535
59854 768535 774702 779491 783528 787724 793001 799804 807459 814656 820634 825310 828504 830130 831161 833035
$$ packed form
59961G55536p809p847p709o938n625m707m880n441n161m154l801m513m913l938
59947F78100k614k566l442l337j576L07P01j33o91RJ820L983N680O421O229N357
59931F94248L862J994P48J087K381K751J445r3k24Q15J777K364L071L754L812
59916G23792L492L563L792L242K083J600K012J967Q78J67J042K396K458J680K093
59901G56257M082N554M738K384M62l28r04k083l443l905k964j213J54L31m72j286
59885G57364j280m68L79M48l89j495k151k248k191k268k364k253j759p78L87P86
59869G39720k77j980k587j621l86K53J302L595N563M978K504J354L141N930P046
59854G68535O167M789M037M196N277O803P655P197N978M676L194J626J031J874
$$ plain form
59840 833035 835731 837646 837952 837834 838499 839103 837978 835253 832835 832041 832525 833631 835521 838446 841762 844509
59824 844509 846854 850355 856435 864594 872479 878161 882133 886445 891982 897525 901711 904707 907254 909090
59810 909090 909460 908539 907148 905491 903352 901251 900237 900658 902147 904595 908016 911696 914861 918205 923330
59795 923330 930512 938413 946264 954718 963909 972144 977543 979924 980203 978989 976796 974712 973655 973372 972957
59780 972957 971732 968953 963556 955284 945436 935573 926108 916974 908634 901211 893541 884796 876417 870584
59766 870584 866979 863016 857394 851501 846727 842263 836662 830237 824530 820204 816716 813734 811691 810925
59752 810925 811024 811168 810708 809271 806628 802744 798000 793280 789527 786986 785086 783218 781264 779078 776072
59737 776072 771972 767512 763572 759947 755897 751565 747780 744645 741509 738272 735329 732264 728163 723622
$$ packed form
59840H33035K696J915L06j18O65O04j125k725k418p94M84J106J890K925L316K747
59824H44509K345L501O080Q159P885N682L972M312N537N543M186K996K547J836
59810I09090L70r21j391j657k139k101j014M21J489K448L421L680L165L344N125
59795I23330P182P901P851Q454R191Q235N399K381K79j214k193k084j057k83m15
59780I72957j225k779n397q272r848r863r465r134q340p423p670q745q379n833
59766H70584l605l963n622n893m774m464n601o425n707m326l488k982k043p66
59752H10925R9J44m60j437k643l884m744m720l753k541j900j868j954k186l006
59737G76072m100m460l940l625m050m332l785l135l136l237k943l065m101m541
$$ plain form
59723 723622 720729 720189 719972 717905 714385 711258 709187 707644 706702 707037 708501 710218 712034 714404 716832
59708 716832 717874 717093 715898 716024 718091 721994 727643 734581 741560 747312 751576 754973 758124 761228 764254
59693 764254 767148 769946 772832 776011 779427 782790 785953 789149 792769 796966 801471 805800 809819 814103
59679 814103 819342 825169 830026 832630 833213 832880 832243 831426 831081 832292 835363 839461 843553 846883 848486
59664 848486 847457 844420 841902 842182 844965 847854 848944 848390 847644 847918 849487 851863 854163 855500 855386
59649 855386 854001 852192 851150 851755 853943 856811 859519 861965 864375 866437 867363 866933 866196 866753 869260
59634 869260 872718 875337 876157 875768 875382 875266 874394 871861 868401 866106 866516 869240 872538 874928 875947 875724
59618 875724 874450 872431 870126 867764 865118 861894 858113 853902 849204 843962 838297 832243 825847 819927
$$ packed form
59723G23622k893n40k17k067l520l127k071j543r42L35J464J717J816K370K428
59708G16832J042p81j195J26K067L903N649O938O979N752M264L397L151L104L026
59693G64254K894K798K886L179L416L363L163L196L620M197M505M329M019M284
59679H14103N239N827M857K604N83l33o37q17l45J211L071M098M092L330J603
59664H48486j029l037k518K80K783K889J090n54p46K74J569K376K300J337j14
59649H55386j385j809j042O05K188K868K708K446K410K062R26m30p37N57K507
59634H69260L458K619Q20l89l86j16q72k533l460k295M10K724L298K390J019k23
59618H75724j274k019k305k362k646l224l781m211m698n242n665o054o396n920
$$ plain form
59604 819927 815967 814207 812390 807940 801502 796775 796321 798895 801590 803055 803354 802106 798884 794948 792566
59589 792566 792455 793381 794380 795792 797857 799911 801601 803420 805186 805350 802994 799559 797321 796781 796683 796018
59573 796018 794696 792610 789546 786192 784024 783632 783907 783451 782264 781616 782546 784875 787556 789617 790636
59558 790636 790403 788485 784592 779452 774811 772087 771271 771375 771584 771554 771097 770425 770570 772675 776533 780342
59542 780342 782158 781343 778569 774939 771369 768496 766794 766645 768133 770596 772706 773484 773203 772898 773164 773940
59526 773940 775122 776402 776493 773796 768508 763228 760563 760636 761528 761533 760068 757059 752865 748789 746249 745029
59510 745029 743362 740266 736908 735012 734774 735206 735840 737003 738704 740403 742020 744242 747499 751294 754876
59495 754876 758014 760732 762800 764107 765381 768067 773335 781253 790831 800832 810702 820824 831842
$$ packed form
59604H19927l960j760j817m450o438m727m54K574K695J465K99j248l222l936k382
59589G92566j11R26R99J412K065K054J690J819J766J64k356l435k238n40r8o65
59573G96018j322k086l064l354k168l92K75m56j187o48R30K329K681K061J019
59558G90636k33j918l893n140m641k724q16J04K09l0m57o72J45K105L858L809
59542G80342J816q15k774l630l570k873j702j49J488K463K110P78k81l05K66P76
59526G73940J182J280R1k697n288n280k665P3Q92Nj465l009m194m076k540j220
59510G45029j667l096l358j896k38M32O34J163J701J699J617K222L257L795L582
59495G54876L138K718K068J307J274K686N268P918R578J0001R870J0122J1018
$$ plain form
59482 831842 843981 857372 872804 891405 913336 937204 960706 981095 994982 999163 993147 980677
59470 980677 967693 958393 953382 951014 949537 948124 946880 946368 946797 947665 948588 950080 952600 955068 955519
59455 955519 953420 950083 946291 940817 932308 921696 911486 903018 895557 887783 879034 869128 858197
59442 858197 847164 837568 830313 824947 820428 816188 812192 808431 804899 801878 799870 799202 799852 801600
59428 801600 804168 807278 810696 814305 818128 822312 826986 832048 837195 842345 848040 855233 864486 875356
59414 875356 886576 896939 906097 914395 921777 927051 928876 927725 926257 927081 930363 934207 937244 939969
59400 939969 943440 947698 952259 957694 965581 976681 989874 1003336 1016360 1029540 1043494 1058056
59388 1058056 1072717 1087085 1100522 1111795 1119628 1123478 1123377 1119347 1111591 1101198 1089991 1079428
$$ packed form
59482H31842J2139J3391J5432J8601K1931K3868K3502K0389J3887M181o016j2470
59470I80677j2984r300n011k368j477j413j244n12M29Q68R23J492K520K468M51
59455I55519k099l337l792n474q509j0612j0210q468p461p774q749r906j0931
59442H58197j1033r596p255n366m519m240l996l761l532l021k008o68O50J748
59428H01600K568L110L418L609L823M184M674N062N147N150N695P193R253J0870
59414H75356J1220J0363R158Q298P382N274J825j151j468Q24L282L844L037K725
59400I39969L471M258M561N435P887J1100J3193J3462J3024J3180J3954J4562
59388A058056J4661J4368J3437J1273P833L850j01m030p756j0393j1207j0563
$$ plain form
59376 1079428 1069986 1061570 1053957 1046732 1039392 1031887 1024710 1018268 1012688 1008359 1006003 1005788 1007018 1009240
59362 1009240 1013176 1019995 1030130 1043340 1059307 1077303 1095855 1114015 1133060 1155845 1183861 1215025
59350 1215025 1244221 1265641 1275241 1272371 1259829 1242089 1223159 1205903 1192488 1184239 1180958 1181060
59338 1181060 1182330 1181892 1176000 1161649 1139104 1111881 1083642 1055933 1029231 1004740 983798 966124
59326 966124 949906 933662 917367 902158 889596 880830 875514 871662 867425 863066 860570 861289 864586
59313 864586 868769 872627 875884 878862 882149 886198 890796 895007 897953 899838 902159 906697 913992 922745
59299 922745 931009 938105 945125 953554 963861 975679 988767 1003258 1019230 1036565 1055022 1074086
59287 1074086 1092954 1111096 1128663 1146054 1163400 1180728 1198088 1214948 1229966 1242071 1251451
$$ packed form
59376A079428r442q416p613p225p340p505p177o442n580m329k356k15J230K222
59362A009240L936O819J0135J3210J5967J7996J8552J8160J9045K2785K8016L1164
59350A215025K9196K1420R600k870j2542j7740j8930j7256j3415q249l281J02
59338A181060J270m38n892j4351k2545k7223k8239k7709k6702k4491k0942j7674
59326I66124j6218j6244j6295j5209j2562q766n316l852m237m359k496P19L297
59313H64586M183L858L257K978L287M049M598M211K946J885K321M538P295Q753
59299I22745Q264P096P020Q429J0307J1818J3088J4491J5972J7335J8457J9064
59287A074086J8868J8142J7567J7391J7346J7328J7360J6860J5018J2105R380
$$ plain form
59276 1251451 1258833 1264203 1267075 1267520 1265881 1261682 1254049 1243311 1231075 1218498 1205498 1191822 1177767
59263 1177767 1163502 1148847 1134260 1120996 1109578 1099045 1088551 1078880 1071440 1066478 1063265 1061541
59251 1061541 1061661 1063650 1067156 1072280 1079592 1089257 1100759 1113413 1126511 1139033 1149642 1156850 1158889
59238 1158889 1154201 1143045 1128281 1113405 1099770 1086575 1073390 1061423 1051974 1044806 1038692 1032828
59226 1032828 1027045 1021229 1015338 1009853 1005675 1003466 1003194 1004230 1005981 1008631 1013102 1019912 1028256 1036701
59212 1036701 1044609 1052342 1060411 1069224 1079362 1090948 1102716 1112873 1121077 1128373 1134952 1139395 1140668
59199 1140668 1139359 1136065 1130091 1121034 1110348 1099675 1088580 1075800 1062120 1050055 1040829 1033425
59187 1033425 1026569 1019844 1012700 1004384 995584 988641 985144 984398 984895 986144 988212 990608 992748 994902
$$ packed form
59276A251451P382N370K872M45j639m199p633j0738j2236j2577j3000j3676j4055
59263A177767j4265j4655j4587j3264j1418j0533j0494r671p440m962l213j724
59251A061541J20J989L506N124P312R665J1502J2654J3098J2522J0609P208K039
59238A158889m688j1156j4764j4876j3635j3195j3185j1967r449p168o114n864
59226A032828n783n816n891n485m178k209k72J036J751K650M471O810Q344Q445
59212A036701P908P733Q069Q813J0138J1586J1768J0157Q204P296O579M443J273
59199A140668j309l294n974r057j0686j0673j1095j2780j3680j2065r226p404
59187A033425o856o725p144q316q800o943l497p46M97J249K068K396K140K154
$$ plain form
59173 994902 997777 1001575 1005964 1010376 1013751 1014701 1012619 1008199 1002492 996110 989553 983202 976474 968213
59159 968213 958761 950363 944405 939441 933410 926704 921316 917766 914877 912161 910248 908949 906955 903903
59145 903903 900908 898529 895958 893093 891746 893582 897983 903069 907903 912616 917253 921652 925859 929576
59131 929576 931763 931973 931757 933589 938334 944538 950210 954603 958337 962504 967824 974246 981114 987744 993663
59116 993663 998372 1001527 1003707 1006320 1010260 1015190 1020626 1026992 1034760 1043164 1050858 1057594 1064177 1070929
59102 1070929 1077281 1082904 1088108 1092806 1096104 1097517 1097895 1098424 1098978 1098021 1094136 1087460 1079640 1072490 1066667
59087 1066667 1061696 1057102 1052941 1049044 1044495 1038641 1032131 1026109 1020687 1015212 1009705 1004800 1000220 994787
59073 994787 988419 982880 979729 978498 977836 977587 978636 981243 984707 988612 993406 999640 1007374 1016495 1027027
$$ packed form
59173I94902K875L798M389M412L375R50k082m420n707o382o557o351o728q261
59159I68213r452q398n958m964o031o706n388l550k889k716j913j299j994l052
59145I03903k995k379k571k865j347J836M401N086M834M713M637M399M207L717
59131I29576K187K10k16J832M745O204N672M393L734M167N320O422O868O630N919
59116I93663M709L155K180K613L940M930N436O366P768Q404P694O736O583O752
59102A070929O352N623N204M698L298J413L78N29N54r57l885o676p820p150n823
59087A066667m971m594m161l897m549n854o510o022n422n475n507m905m580n433
59073I94787o368n539l151j231o62k49J049K607L464L905M794O234P734R121J0532
$$ plain form
59058 1027027 1038850 1051342 1063483 1074440 1084462 1095250 1108665 1124476 1139978 1152631 1162642
59047 1162642 1172064 1181906 1191368 1199666 1206970 1213110 1216794 1217141 1215119 1212579 1210438 1208530 1206599 1204459
59033 1204459 1201621 1197773 1193477 1189464 1185408 1180238 1173618 1166283 1158910 1151622 1144653 1138446 1132616 1125746
59019 1125746 1116849 1106399 1095319 1083605 1070779 1057303 1044663 1034081 1025706 1018949 1012995 1007023
59007 1007023 1000477 993360 986079 979064 972609 966801 961361 956003 951291 948449 947592 946771 943918 939512
58993 939512 936012 934609 933829 931784 928541 925500 923464 922347 922127 922938 924467 926255 928586 932193 936858
58978 936858 940896 942453 941261 939094 938521 941073 946406 953234 960825 969131 977774 985965 993861 1002955
58964 1002955 1014310 1027089 1039733 1052060 1065091 1079153 1093396 1107191 1120793 1134152 1146037
$$ packed form
59058A027027J1823J2492J2141J0957J0022J0788J3415J5811J5502J2653J0011
59047A162642R422R842R462Q298P304O140L684L47k022k540k141j908j931k140
59033A204459k838l848m296m013m056n170o620p335p373p288o969o207n830o870
59019A125746q897j0450j1080j1714j2826j3476j2640j0582q375o757n954n972
59007A007023o546p117p281p015o455n808n440n358m712k842q57q21k853m406
58993I39512l500j403p80k045l243l041k036j117k20Q11J529J788K331L607M665
58978I36858M038J557j192k167n73K552N333O828P591Q306Q643Q191P896R094
58964A002955J1355J2779J2644J2327J3031J4062J4243J3795J3602J3359J1885
$$ plain form
58953 1146037 1154963 1160618 1163981 1166370 1168638 1171006 1173387 1175905 1178920 1182341 1185265 1186978 1188188 1190543
58939 1190543 1194818 1200212 1205565 1210651 1215964 1221669 1227140 1231385 1233959 1235692 1238285 1242626 1247577 1251050
58925 1251050 1252205 1251915 1251173 1250054 1248460 1246888 1245897 1245556 1246037 1248125 1252409 1258340 1264846 1271762 1280106
58910 1280106 1290941 1304320 1319402 1335317 1351672 1368096 1383488 1396405 1406655 1415994 1426474
58899 1426474 1438299 1449947 1459908 1467265 1471034 1470611 1467027 1462219 1456525 1448405 1437217 1424734 1412866
58886 1412866 1401309 1388915 1376333 1365675 1358004 1352477 1347629 1342435 1336438 1329798 1322874 1315055 1304693
58873 1304693 1291218 1276548 1263245 1251961 1241823 1232417 1223762 1215060 1205384 1195348 1186280 1178096
58861 1178096 1169881 1162327 1157333 1155081 1153796 1152784 1153287 1155536 1157486 1157901 1158497 1161271 1165631 1170251 1176161
$$ packed form
58953A146037Q926N655L363K389K268K368K381K518L015L421K924J713J210K355
58939A190543M275N394N353N086N313N705N471M245K574J733K593M341M951L473
58925A251050J155k90p42j119j594j572r91l41M81K088M284N931O506O916Q344
58910A280106J0835J3379J5082J5915J6355J6424J5392J2917J0250R339J0480
58899A426474J1825J1648R961P357L769m23l584m808n694q120j1188j2483j1868
58886A412866j1557j2394j2582j0658p671n527m848n194n997o640o924p819j0362
58873A304693j3475j4670j3303j1284j0138r406q655q702r676j0036r068q184
58861A178096q215p554m994k252j285j012N03K249J950M15N96K774M360M620N910
$$ plain form
58846 1176161 1185423 1197555 1209858 1221241 1233637 1249278 1268180 1288603 1308590 1326678 1342350
58835 1342350 1356461 1370590 1385762 1402250 1420408 1440711 1462870 1485806 1508689 1531380 1553803
58824 1553803 1575605 1596461 1615936 1632943 1646038 1654480 1658551 1658858 1655805 1649481 1639300 1624043
58812 1624043 1603320 1578979 1553974 1529645 1505208 1480149 1455795 1433792 1414063 1395341 1377131
58801 1377131 1360063 1344362 1328758 1311321 1291434 1270928 1252776 1237978 1224055 1207713 1188966
58790 1188966 1171268 1157140 1145286 1132945 1119643 1107015 1095906 1085643 1075867 1067134 1059345 1051254
58778 1051254 1042173 1033017 1024968 1018028 1011559 1005411 999827 994911 990869 988129 986545 985055 982963 981031
58764 981031 980400 980841 981067 980665 980634 981846 983839 985456 985958 985251 983715 982305 982140 983273 984128 982842 979201
$$ packed form
58846A176161R262J2132J2303J1383J2396J5641J8902K0423J9987J8088J5672
58835A342350J4111J4129J5172J6488J8158K0303K2159K2936K2883K2691K2423
58824A553803K1802K0856J9475J7007J3095Q442M071L07l053o324j0181j5257
58812A624043k0723k4341k5005k4329k4437k5059k4354k2003j9729j8722j8210
58801A377131j7068j5701j5604j7437j9887k0506j8152j4798j3923j6342j8747
58790A188966j7698j4128j1854j2341j3302j2628j1109j0263r776q733p789q091
58778A051254r081r156q049o940o469o148n584m916m042k740j584j490k092j932
58764I81031o31M41K26m02l1J212J993J617N02p07j536j410j65J133Q55j286l641
$$ plain form
58747 979201 974848 971645 970158 969641 968966 967444 965019 961937 958188 953402 947480 941255 936062 932439 929566
58732 929566 926252 922317 918692 916298 915220 914965 915016 914956 914563 914367 915768 919796 925563 930729 934002 936622
58716 936622 940688 946375 951741 955192 957080 958439 959048 957621 953528 947522 940838 934367 928914 925543
58702 925543 924955 926465 927934 927149 923637 919134 915906 914409 912996 910366 907887 908626 913985 922048 929624
58687 929624 935380 940399 946157 952887 960079 967687 976078 985047 993761 1001919 1010362 1019902 1030030 1039586
58673 1039586 1048626 1058582 1070191 1082190 1092798 1101770 1110003 1117573 1123541 1127729 1131431 1135782 1140337
58660 1140337 1143999 1146757 1149661 1153345 1157378 1161192 1165176 1170484 1177718 1185915 1193088 1198022 1201242 1203740
58646 1203740 1205063 1203525 1198300 1190339 1180892 1170107 1157670 1143767 1128474 1110960 1090579 1068412
$$ packed form
58747I79201m353l203j487n17o75j522k425l082l749m786n922o225n193l623k873
58732I29566l314l935l625k394j078k55N1o0l93j96J401M028N767N166L273K620
58716I36622M066N687N366L451J888J359O09j427m093o006o684o471n453l371
58702I25543n88J510J469p85l512m503l228j497j413k630k479P39N359Q063P576
58687I29624N756N019N758O730P192P608Q391Q969Q714Q158Q443R540J0128R556
58673A039586R040R956J1609J1999J0608Q972Q233P570N968M188L702M351M555
58660A140337L662K758K904L684M033L814L984N308P234Q197P173M934L220K498
58646A203740J323j538n225p961r447j0785j2437j3903j5293j7514k0381k2167
$$ plain form
58634 1068412 1046576 1026168 1006945 988824 972296 957203 942504 927934 914836 904527 896619
58623 896619 889749 883286 877401 871989 866666 861679 857775 855039 852743 850595 849399 850049 852500 856238
58609 856238 861321 868224 876767 885850 894482 902704 911255 920524 930006 938640 945438 949847 951822 951774 950385
58594 950385 948356 946181 944021 941713 938974 935704 932094 928482 925239 922831 921580 920939 919307 915344
58580 915344 909698 904753 902188 901189 899582 896371 892519 889519 887987 887742 888447 889752 891213 892485 893484
58565 893484 894294 895245 897155 901002 906987 914236 921763 929503 938079 947761 958103 968503 978694 988611
58551 988611 998040 1006560 1013729 1019331 1023543 1026781 1029246 1030683 1030722 1029385 1027063 1024068 1020435 1016215 1011761
58536 1011761 1007592 1004024 1001075 998760 997365 997239 998266 999794 1001456 1003982 1008714 1016118 1025187 1034634
$$ packed form
58634A068412k1836k0408j9223j8121j6528j5093j4699j4570j3098j0309p908
58623H96619o870o463n885n412n323m987l904k736k296k148j196O50K451L738
58609H56238N083O903Q543R083Q632Q222Q551R269R482Q634O798M409J975m8j389
58594I50385k029k175k160k308k739l270l610l612l243k408j251o41j632l963
58580I15344n646m945k565r99j607l211l852l000j532k45P05J305J461J272R99
58565H93484Q10R51J910L847N985P249P527P740Q576R682J0342J0400J0191R917
58551I88611R429Q520P169N602M212L238K465J437L9j337k322k995l633m220m454
58536A011761m169l568k949k315j395j26J027J528J662K526M732P404R069R447
$$ plain form
58522 1034634 1044240 1054529 1065405 1075940 1085660 1095336 1106024 1117657 1129030 1139070 1147799 1156093
58510 1156093 1164905 1174834 1186189 1199161 1213806 1229984 1247568 1266797 1288093 1311170 1334483 1356268
58498 1356268 1376273 1395772 1415406 1433648 1448379 1459647 1469575 1479174 1486452 1488670 1485786 1480459
58486 1480459 1474899 1469128 1462592 1455980 1450210 1444255 1435477 1422284 1405597 1387437 1368941 1350220 1331403
58473 1331403 1312973 1295382 1279112 1265026 1253923 1245582 1238858 1232880 1227684 1223526 1220262 1217878 1217019
58460 1217019 1218257 1221025 1223932 1226122 1227805 1229479 1231211 1232765 1233903 1234437 1234473 1234682 1235680 1236775 1235967
58445 1235967 1231753 1224614 1216302 1208119 1200558 1194107 1189225 1185252 1180304 1172990 1163998 1155452 1148754 1143483
58431 1143483 1138473 1133594 1129992 1128605 1128955 1129914 1131274 1133774 1137597 1141932 1146588 1153041 1162816 1175215
$$ packed form
58522A034634R606J0289J0876J0535R720R676J0688J1633J1373J0040Q729Q294
58510A156093Q812R929J1355J2972J4645J6178J7584J9229K1296K3077K3313K1785
58498A356268K0005J9499J9634J8242J4731J1268R928R599P278K218k884n327
58486A480459n560n771o536o612n770n955q778j3193j6687j8160j8496j8721j8817
58473A331403j8430j7591j6270j4086j1103q341o724n978n196m158l264k384q59
58460A217019J238K768K907K190J683J674J732J554J138N34L6K09R98J095q08
58445A235967m214p139q312q183p561o451m882l973m948p314q992q546o698n271
58431A143483n010m879l602j387L50R59J360K500L823M335M656O453R775J2399
$$ plain form
58417 1175215 1187703 1198359 1207058 1214538 1221562 1228970 1237173 1245063 1250503 1252588 1252600 1252161 1251296 1249016
58403 1249016 1245062 1240248 1235659 1232310 1230993 1231585 1232950 1234400 1236825 1241444 1247847 1254266 1259496 1263464
58389 1263464 1266141 1267199 1266862 1265985 1264963 1263523 1261811 1260599 1259903 1258366 1254822 1249875 1245302 1242396 1241480
58374 1241480 1242595 1245838 1251071 1257750 1265079 1272325 1279275 1286544 1294899 1304103 1312974 1320961 1329003 1338305
58360 1338305 1348785 1359328 1368995 1377101 1382592 1384618 1383825 1382019 1380185 1377715 1373980 1369697 1365872 1362048
58346 1362048 1356780 1349801 1342677 1336958 1332432 1327754 1322329 1316978 1312987 1311165 1311745 1314469 1318445 1322355
58332 1322355 1325271 1327162 1328432 1329149 1328911 1327301 1324308 1320466 1316804 1314498 1314198 1315545 1317344 1318459 1318992
58317 1318992 1320917 1327102 1338875 1354555 1371089 1387162 1403719 1421348 1438703 1454436 1469352 1485066
$$ packed form
58417A175215J2488J0656Q699P480P024P408Q203P890N440K085J2m39q65k280
58403A249016l954m814m589l349j317N92J365J450K425M619O403O419N230L968
58389A263464K677J058l37q77j022j440j712j212o96j537l544m947m573k906r16
58374A241480J115L243N233O679P329P246O950P269Q355R204Q871P987Q042R302
58360A338305J0480J0543R667Q106N491K026p93j806j834k470l735m283l825l824
58346A362048n268o979p124n719m526m678n425n351l991j822N80K724L976L910
58332A322355K916J891J270P17k38j610k993l842l662k306l00J347J799J115N33
58317A318992J925O185J1773J5680J6534J6073J6557J7629J7355J5733J4916J5714
$$ plain form
58305 1485066 1501361 1516732 1531260 1546890 1564491 1582426 1598832 1613856 1628629 1643244 1657067
58294 1657067 1670207 1683297 1696201 1708193 1719307 1730442 1742015 1753464 1764354 1775310 1787443
58283 1787443 1801268 1816502 1832689 1849691 1867583 1886209 1905087 1924045 1943854 1965821 1990541
58272 1990541 2017346 2045144 2073334 2101476 2128498 2152947 2174189 2192950 2210416 2226931 2241774
58261 2241774 2254340 2265467 2277207 2290947 2306146 2321508 2337196 2354933 2375772 2398748 2422271
58250 2422271 2446024 2470695 2496483 2522891 2549830 2578039 2608339 2641096 2676474 2714671 2755714
58239 2755714 2799307 2844876 2891445 2937663 2982523 3026254 3070271 3116021 3163869 3213022 3262503
58228 3262503 3312353 3363926 3418748 3477074 3537970 3600883 3666462 3735409 3807202 3880720 3955738
$$ packed form
58305A485066J6295J5371J4528J5630J7601J7935J6406J5024J4773J4615J3823
58294A657067J3140J3090J2904J1992J1114J1135J1573J1449J0890J0956J2133
58283A787443J3825J5234J6187J7002J7892J8626J8878J8958J9809K1967K4720
58272A990541K6805K7798K8190K8142K7022K4449K1242J8761J7466J6515J4843
58261B241774J2566J1127J1740J3740J5199J5362J5688J7737K0839K2976K3523
58250B422271K3753K4671K5788K6408K6939K8209L0300L2757L5378L8197M1043
58239B755714M3593M5569M6569M6218M4860M3731M4017M5750M7848M9153M9481
58228C262503M9850N1573N4822N8326O0896O2913O5579O8947P1793P3518P5018
$$ plain form
58217 3955738 4033043 4113140 4195662 4280147 4366859 4456668 4550457 4648691 4751281 4857944 4969049
58206 4969049 5085970 5210265 5342748 5483861 5634680 5796731 5970714 6156119 6352246
58197 6352246 6558916 6775849 7002062 7236614 7479699 7732514 7996372 8272509 8562625
58188 8562625 8868681 9191797 9531931 9889247 10265598 10664143 11087640 11537792 12016226
58179 12016226 12525261 13067191 13643376 14254719 14902693 15589243 16315933 17083983 17895204
58170 17895204 18752253 19657806 20614010 21622955 22687339 23810477 24995756 26246076
58162 26246076 27563897 28952283 30416247 31963015 33601442 35342359 37199758 39190060
58154 39190060 41328847 43628869 46101904 48761457 51623108 54704690 58028982 61626174
$$ packed form
58217C955738P7305Q0097Q2522Q4485Q6712Q9809R3789R8234J02590J06663J11105
58206D969049J16921J24295J32483J41113J50819J62051J73983J85405J96127
58197F352246K06670K16933K26213K34552K43085K52815K63858K76137K90116
58188H562625L06056L23116L40134L57316L76351L98545M23497M50152M78434
58179A2016226N09035N41930N76185O11343O47974O86550P26690P68050Q11221
58170A7895204Q57049R05553R56204J008945J064384J123138J185279J250320
58162B6246076J317821J388386J463964J546768J638427J740917J857399J990302
58154C9190060K138787K300022K473035K659553K861651L081582L324292L597192
$$ plain form
58146 61626174 65533407 69795419 74470212 79634619 85383522 91827291 99095478 107342900
58138 107342900 116748893 127512766 139854266 154011866 170221494 188678083 209507229
58131 209507229 232771499 258512377 286791736 317631552 350711632 384820826 417386149
58124 417386149 444616585 462516531 468342907 461627028 444152870 419038510 389595024
58117 389595024 358549619 327781565 298401575 270963280 245678333 222574628 201583455
58110 201583455 182580307 165411844 149918448 135946494 123352278 112005090 101789099
58103 101789099 92600038 84340489 76919766 70256165 64276074 58911166 54098026 49779101
58095 49779101 45901688 42416540 39279030 36450709 33897794 31588691 29494620 27591962
$$ packed form
58146F1626174L907233M262012M674793N164407N748903O443769P268187Q247422
58138A07342900R405993J0763873J2341500J4157600J6209628J8456589K0829146
58131B09507229K3264270K5740878K8279359L0839816L3080080L4109194L2565323
58124D17386149K7230436J7899946N826376o715879j7474158k5114360k9443486
58117C89595024l1045405l0768054k9379990k7438295k5284947k3103705k0991173
58110B01583455j9003148j7168463j5493396j3971954j2594216j1347188j0215991
58103A01789099r189061q259549p420723o663601n980091n364908m813140m318925
58095D9779101l877413l485148l137510k828321k552915k309103k094071j902658
$$ plain form
58087 27591962 25861859 24287064 22850127 21534423 20325524 19211031 18179664 17220980
58079 17220980 16326047 15488665 14705824 13976213 13297643 12666071 12077070 11527403 11014596
58070 11014596 10535405 10085303 9659372 9253629 8865918 8495786 8143361 7808363 7490256
58061 7490256 7188657 6902735 6630529 6369865 6119836 5880401 5650757 5429421 5215919
58052 5215919 5010969 4814615 4625629 4443333 4268630 4102411 3944113 3792862 3648956
58043 3648956 3513039 3384440 3261471 3142935 3028427 2917742 2811086 2709537 2614209 2525023
58033 2525023 2441173 2362500 2289276 2220718 2155132 2092176 2033865 1982194 1936148 1892117 1847334
58022 1847334 1802043 1758063 1716225 1676064 1637282 1600096 1564012 1527583 1490097 1452667 1416930
$$ packed form
58087B7591962j730103j574795j436937j315704j208899j114493j031367r58684
58079A7220980q94933q37382p82841p29611o78570o31572n89001n49667n12807
58070A1014596m79191m50102m25931m05743l87711l70132l52425l34998l18107
58061G490256l01599k85922k72206k60664k50029k39435k29644k21336k13502
58052E215919k04950j96354j88986j82296j74703j66219j58298j51251j43906
58043C648956j35917j28599j22969j18536j14508j10685j06656j01549r5328q9186
58033B525023q3850p8673p3224o8558o5586o2956n8311n1671m6046m4031m4783
58022A847334m5291m3980m1838m0161l8782l7186l6084l6429l7486l7430l5737
$$ plain form
58011 1416930 1383449 1352228 1323987 1299559 1278168 1257551 1236089 1214175 1193403 1174923 1158509
58000 1158509 1142721 1126027 1108150 1089976 1071864 1052944 1032871 1013195 995565 979250 962173
57989 962173 944044 926609 910828 895738 880447 865497 851595 838510 825845 813588 801402
57978 801402 788817 776608 766333 757782 748592 737379 725583 714998 705211 695084 685310 677476
57966 677476 671514 666009 660425 655194 649993 643849 636876 630242 624231 617829 610567 603510 597870 593424
57952 593424 588787 582839 575806 569279 564937 562793 561037 558141 554602 551922 550486 549453 548298 547236
57938 547236 546363 545658 545908 548457 553613 560083 566175 570970 574196 575784 576020 575700 575675 576089 575951 573664
57922 573664 568598 562271 557191 554243 552110 549641 547317 545507 542929 538713 534715 533392 533892 532821
$$ packed form
58011A416930l3481l1221k8241k4428k1391k0617k1462k1914k0772j8480j6414
58000A158509j5788j6694j7877j8174j8112j8920k0073j9676j7630j6315j7077
57989I62173j8129j7435j5781j5090j5291j4950j3902j3085j2665j2257j2186
57978H01402j2585j2209j0275q551r190j1213j1796j0585r787j0127r774p834
57966F77476n962n505n584n231n201o144o973o634o011o402p262p057n640m446
57952E93424m637n948p033o527m342k144j756k896l539k680j436j033j155j062
57938E47236q73p05K50K549N156O470O092M795L226J588K36l20k5M14j38k287
57922E73664n066o327n080k948k133k469k324j810k578m216l998j323N00j071
$$ plain form
57908 532821 529001 524913 522763 521564 519526 517310 516920 518495 520198 520971 521683 523369 525518 526643 526059
57893 526059 524680 524143 525213 527139 528659 529307 529364 528994 528386 528533 530683 534617 538433 540561 541314 542134
57877 542134 544117 547782 553379 560576 568164 574678 579206 581616 582597 583549 585383 587009 585989 581314 574593
57862 574593 567780 560793 552493 543062 533894 525507 517148 508485 500247 492813 485431 477529 469957 464175
57848 464175 460690 458936 458269 458334 458589 458220 456836 454801 452544 449815 446065 441515 437345 434620 433415
57833 433415 433194 433566 434199 434500 434160 433736 433791 433589 431697 428049 424247 421329 418282 413554 407229 400708
57817 400708 394850 389393 383917 378306 372373 365957 359484 353677 348541 343274 337383 331405 326282 322361
57803 322361 319178 315985 312426 308886 306230 305075 305433 307153 310351 315075 320803 326701 332237 337251
$$ packed form
57908E32821l820m088k150j199k038k216l90J575J703P73P12J686K149J125n84
57893E26059j379n37J070J926J520O48N7l70o08J47K150L934L816K128P53Q20
57877E42134J983L665N597P197P588O514M528K410R81R52J834J626j020m675o721
57862E74593o813o987q300r431r168q387q359q663q238p434p382p902p572n782
57848D64175l485j754o67O5K55l69j384k035k257k729l750m550m170k725j205
57833D33415k21L72O33L01l40m24N5k02j892l648l802k918l047m728o325o521
57817D00708n858n457n476n611n933o416o473n807n136n267n891n978n123l921
57803C22361l183l193l559l540k656j155L58J720L198M724N728N898N536N014
$$ plain form
57789 337251 341680 345585 349177 352375 354649 355722 356046 355953 354717 351402 346474 341678 338284 336278 335315
57774 335315 335470 336726 338572 340529 342415 343904 344682 345453 347758 352098 357054 361123 364668 369006 374203
57759 374203 379098 383139 386754 389799 391096 390082 387756 385230 382192 377696 371862 365865 360470 355375
57745 355375 349864 343531 336504 329470 323238 317655 311247 302836 293453 285685 280926 278120 275480 272467
57731 272467 269523 266724 263692 260413 257331 254797 253090 252732 254069 256654 259646 262720 266043 269591
57717 269591 273189 277062 281606 286739 292230 298411 305485 312160 316288 317242 316501 315299 312991 308681 303324
57702 303324 298756 295227 291397 286571 281445 276420 270568 263011 254385 246040 238366 230892 223957 219197
57688 219197 217732 218300 218044 215441 211858 209674 209246 208622 206171 202487 199317 197524 196776 196433 195824 194152
$$ packed form
57789C37251M429L905L592L198K274J073L24r3j236l315m928m796l394k006r63
57774C35315J55J256J846J957J886J489P78P71K305M340M956M069L545M338N197
57759C74203M895M041L615L045J297j014k326k526l038m496n834n997n395n095
57745C55375n511o333p027p034o232n583o408q411r383p768m759k806k640l013
57731B72467k944k799l032l279l082k534j707l58J337K585K992L074L323L548
57717B69591L598L873M544N133N491O181P074O675M128R54p41j202k308m310n357
57702C03324m568l529l830m826n126n025n852p557q626q345p674p474o935m760
57688B19197j465N68k56k603l583k184m28o24k451l684l170j793p48l43o09j672
$$ plain form
57672 194152 191157 187769 185279 184037 183574 183615 184050 184226 183518 182552 182656 183934 185065 185314 185478 186258 187025
57655 187025 187070 186955 187300 187059 184501 179702 174641 170657 167048 162635 157794 154165 152726 152829 153062 152673
57639 152673 152022 151822 152219 152856 153723 155415 158224 161403 163847 165356 166659 168277 169955 171357 172842
57624 172842 175238 179101 184406 190792 197966 206055 215744 227975 243465 262623 285863 313662 346090
57611 346090 382538 422263 465284 512436 564200 619120 673000 719435 751446 763606 754025 725236
57599 725236 683095 634073 582958 532667 485427 443073 406021 372882 341920 312798 286557
57588 286557 264244 246025 231288 218873 207276 195329 182998 171288 161284 153450 147583 142978
57576 142978 138740 134518 130866 128340 126258 123121 118428 113310 109040 105601 102264 98941 96087 93551
$$ packed form
57672A94152k995l388k490j242m63M1M35J76p08r66J04J278J131K49J64P80P67
57655A87025M5j15L45k41k558m799n061l984l609m413m841l629j439J03K33l89
57639A52673o51k00L97O37Q67J692K809L179K444J509J303J618J678J402J485
57624A72842K396L863N305O386P174Q089R689J2231J5490J9158K3240K7799L2428
57611C46090L6448L9725M3021M7152N1764N4920N3880M6435L2011J2160r581k8789
57599G25236m2141m9022n1115n0291m7240m2354l7052l3139l0962k9122k6241
57588B86557k2313j8219j4737j2415j1597j1947j2331j1710j0004p834n867m605
57576A42978m238m222l652k526k082l137m693n118m270l439l337l323k854k536
$$ plain form
57562 93551 90486 86629 83015 80922 80273 79518 77238 73665 70347 68300 66923 64961 62119 59063 56097
57547 56097 52786 49100 46085 44867 45455 46953 48457 49321 49130 48069 46922 45971 44205 40345 34509
57532 34509 28168 22569 17896 13874 10393 7358 4634 2356 781 -342 -1716 -3608 -5464 -6710 -7577
57517 -7577 -8936 -11550 -15480 -19831 -22970 -23572 -21754 -19034 -17153 -17158 -19397 -23587 -28630 -32973 -35689 -37029
57501 -37029 -37879 -38934 -40385 -41870 -42697 -42678 -42734 -43869 -45467 -45651 -43794 -41645 -41220 -42505 -44268 -46289
57485 -46289 -49382 -53451 -56954 -58550 -58289 -56996 -55452 -54510 -55045 -57024 -59144 -60075 -59949 -60150 -61701 -64169
57469 -64169 -66174 -66694 -65706 -63671 -60837 -57413 -54237 -52519 -52573 -53346 -53737 -53995 -55229 -57839 -61145 -64336
57453 -64336 -66990 -68700 -69118 -68695 -68657 -69759 -71465 -72767 -73584 -74938 -77812 -82024 -86278 -89392 -91517 -93905
$$ packed form
57562I3551l065l857l614k093o49p55k280l573l318k047j377j962k842l056k966
57547E6097l311l686l015j218N88J498J504Q64j91j061j147r51j766l860n836
57532C4509o341n599m673m022l481l035k724k278G81c42j374j892j856j246q67
57517g577j359k614l930m351l139o02J818K720J881nk239m190n043m343k716j340
57501c7029q50j055j451j485q27J9n6j135j598j84J857K149M25j285j763k021
57485d6289l093m069l503j596K61J293J544R42n35j979k120r31J26k01j551k468
57469f4169k005n20R88K035K834L424L176J718n4p73l91k58j234k610l306l191
57453f4336k654j710m18M23L8j102j706j302q17j354k874m212m254l114k125k388
$$ plain form
57437 -93905 -97321 -101048 -103893 -105785 -107632 -109823 -111805 -113338 -115242 -118447 -122779 -127123 -130349 -131807
57423 -131807 -131536 -130626 -131018 -134171 -139650 -145263 -148723 -149252 -147853 -146294 -145762 -146311 -147373 -148530 -149670 -150653
57407 -150653 -151177 -150851 -149250 -146250 -142722 -140345 -139988 -140528 -140157 -138690 -137562 -137600 -138068 -138211 -138388 -138904 -138915
57390 -138915 -137663 -136122 -136195 -138539 -142120 -145639 -148491 -150493 -151740 -152995 -155358 -159096 -163085 -165655 -165822
57375 -165822 -163802 -160737 -158035 -156603 -156455 -156962 -157411 -157384 -156988 -156866 -157643 -159142 -160498 -161264 -161903 -162767 -163134
57358 -163134 -161977 -159473 -157102 -156308 -157544 -160486 -164505 -168716 -171981 -173326 -172577 -170660 -169063 -168554 -168512
57343 -168512 -168061 -167752 -169128 -172393 -175704 -177497 -178410 -179825 -181482 -181987 -181064 -179676 -178250 -176589 -175554
57328 -175554 -176859 -180430 -183582 -183879 -181708 -179122 -177308 -176462 -177199 -180299 -185047 -189235 -191348 -192093 -193462
$$ packed form
57437i3905l416l727k845j892j847k191j982j533j904l205m332m344l226j458
57423a31807K71R10l92l153n479n613l460n29J399J559N32n49j062j157j140r83
57407a50653n24L26J601L000L528K377L57n40L71J467J128l8m68j43j77n16j1
57390a38915J252J541p3k344l581l519k852k002j247j255k363l738l989k570j67
57375a65822K020L065K702J432J48n07m49K7L96J22p77j499j356p66o39q64l67
57358a63134J157K504K371P94j236k942m019m211l265j345P49J917J597N09M2
57343a68512M51L09j376l265l311j793r13j415j657n05R23J388J426J661J035
57328a75554j305l571l152k97K171K586J814Q46p37l100m748m188k113p45j369
$$ plain form
57313 -193462 -196721 -201483 -206266 -209667 -211224 -211486 -211384 -211578 -212245 -213087 -213413 -212639 -211054 -209846 -209967 -211084
57297 -211084 -211988 -211933 -211211 -210490 -209945 -209199 -207928 -206399 -205303 -204893 -204323 -202187 -197993 -192864 -188426 -185189
57281 -185189 -182393 -179277 -175885 -172498 -168911 -164795 -160519 -156948 -154264 -151438 -147238 -141509 -135081 -128508
57267 -128508 -121517 -113956 -106719 -101028 -96872 -92806 -87516 -81026 -74027 -66529 -57958 -48458 -39214 -31168
57253 -31168 -24035 -17177 -10939 -6243 -2971 317 4862 10675 17378 25014 33223 40546 45858 50143 55528
57238 55528 62648 70300 77773 85930 95382 105106 113889 121983 130113 137761 143896 148885 154269 160850
57224 160850 168285 176394 185501 195290 204462 211979 217873 222642 226646 230280 234004 237964 242153 246820
57210 246820 251866 255925 257251 255898 254048 253762 255282 257931 261586 266433 272046 277651 282965 288203
$$ packed form
57313a93462l259m762m783l401j557k62J02j94o67q42l26P74J585J208j21j117
57297b11084r04N5P22P21N45P46J271J529J096M10N70K136M194N129M438L237
57281a85189K796L116L392L387L587M116M276L571K684K826M200N729O428O573
57267a28508O991P561P237N691M156M066N290O490O999P498Q571R500R244Q046
57253c1168P133O858O238M696b971C17M545N813O703P636Q209P323N312M285N385
57238E5528P120P652P473Q157R452R724Q783Q094Q130P648O135M989N384O581
57224A60850P435Q109R107R789R172P517N894M769M004L634L724L960M189M667
57210B46820N046M059J326j353j850k86J520K649L655M847N613N605N314N238
$$ plain form
57196 288203 293644 299736 307215 316538 327513 339912 353933 369475 385439 400585 414857 429210
57184 429210 444213 459541 474811 490206 505859 520963 533981 544007 551870 559595 568522 578323
57172 578323 588362 599634 614275 632948 653881 675096 696721 720170 745850 772943 801203
57161 801203 831550 864456 898740 932643 965595 998338 1031684 1065990 1101911 1140767 1183291
57150 1183291 1228146 1272613 1315281 1357664 1402589 1451209 1502153 1553357 1603900 1653981 1703831
57139 1703831 1753043 1800536 1845001 1885818 1923669 1959780 1994589 2027743 2059469 2091021 2123376
57128 2123376 2156176 2188389 2219402 2249076 2277552 2305641 2334834 2366160 2399411 2434034 2470236
57117 2470236 2508422 2547893 2586965 2624327 2659741 2693672 2726858 2759985 2792884 2823982 2851308
$$ packed form
57196B88203N441O092P479R323J0975J2399J4021J5542J5964J5146J4272J4353
57184D29210J5003J5328J5270J5395J5653J5104J3018J0026P863P725Q927R801
57172E78323J0039J1272J4641J8673K0933K1215K1625K3449K5680K7093K8260
57161H01203L0347L2906L4284L3903L2952L2743L3346L4306L5921L8856M2524
57150A183291M4855M4467M2668M2383M4925M8620N0944N1204N0543N0081M9850
57139A703831M9212M7493M4465M0817L7851L6111L4809L3154L1726L1552L2355
57128B123376L2800L2213L1013K9674K8476K8089K9193L1326L3251L4623L6202
57117B470236L8186L9471L9072L7362L5414L3931L3186L3127L2899L1098K7326
$$ plain form
57106 2851308 2874330 2894388 2913126 2930939 2947100 2960994 2972746 2982768 2991120 2997572 3002142 3005130
57094 3005130 3006420 3005022 2999728 2990219 2977375 2962600 2946905 2930145 2910772 2886828 2857798 2824994
57082 2824994 2789392 2749724 2703875 2651599 2594326 2532528 2465032 2390899 2309754 2219349 2114614
57071 2114614 1990384 1843836 1673285 1476151 1249601 991983 701831 375953 9842 -400540
57060 -858497 -1367424 -1930811 -2551933 -3234721 -3984569 -4807530 -5709518 -6697349 -7779917
57051 -7779917 -8967629 -10271948 -11707012 -13290884 -15043924 -16986987 -19142913 -21539269
57043 -21539269 -24208500 -27186786 -30515157 -34241610 -38420759 -43111980 -48379255 -54291856
57035 -54291856 -60923526 -68351447 -76655761 -85914431 -96189885 -107513792 -119877769 -133226743
$$ packed form
57106B851308K3022K0058J8738J7813J6161J3894J1752J0022Q352O452M570K988
57094C005130J290j398n294r509j2844j4775j5695j6760j9373k3944k9030l2804
57082B824994l5602l9668m5849n2276n7273o1798o7496p4133q1145r0405j04735
57071B114614j24230j46548j70551j97134k26550k57618k90152l25878I842d00540
57060h58497n08927n63387o21122o82788p49848q22961r01988r87831j082568
57051g779917j187712j304319j435064j583872j753040j943063k155926k396356
57043b1539269k669231k978286l328371l726453m179149m691221n267275n912601
57035e4291856o631670p427921q304314r258670j0275454j1323907j2363977j3348974
$$ plain form
57027 -133226743 -147448558 -162365412 -177736709 -193266873 -208602437 -223321520 -236938520
57020 -236938520 -248933777 -258791970 -266037342 -270279660 -271282118 -269024182 -263712294 -255723122
57012 -255723122 -245511932 -233532232 -220191167 -205841244 -190797417 -175362759 -159844844
57005 -159844844 -144553738 -129785345 -115799034 -102796413 -90906610 -80182910 -70611564
56998 -70611564 -62128492 -54638664 -48034422 -42209302 -37065122 -32514219 -28480855 -24902370
56990 -24902370 -21727647 -18913104 -16419794 -14213094 -12262449 -10539614 -9017274 -7669704
56982 -7669704 -6474191 -5411342 -4464441 -3618831 -2861600 -2181617 -1569647 -1017686 -517536
56973 -517536 -60451 361156 752134 1115021 1450716 1756949 2027110 2253755 2435030 2577163
$$ packed form
57027a33226743j4221815j4916854j5371297j5530164j5335564j4719083j3617000
57020b36938520j1995257r858193p245372m242318j002458K257936N311888P989172
57012b55723122J0211190J1979700J3341065J4349923J5043827J5434658J5517915
57005a59844844J5291106J4768393J3986311J3002621J1889803J0723700R571346
56998g0611564Q483072P489828O604242N825120N144180M550903M033364L578485
56990b4902370L174723K814543K493310K206700J950645J722835J522340J347570
56982g669704J195513J062849R46901Q45610P57231O79983O11970N51961N00150
56973e17536f0451C61156L90978L62887L35695L06233K70161K26645J81275J42133
$$ plain form
56963 2577163 2690473 2783808 2862451 2929040 2984772 3030314 3066676 3095267 3116992 3131817 3139247
56952 3139247 3138381 3127342 3103752 3066243 3014714 2948822 2867306 2769318 2655453 2527077 2386087
56941 2386087 2236302 2083734 1933703 1788084 1646488 1509553 1379493 1257744 1143901
56932 1143901 1037484 939425 851009 772279 702315 640480 586540 539781 498827 462419 429934
56921 429934 400971 374762 350205 326479 303574 282213 263101 246102 230325 215214 201408
56910 201408 190066 181323 173936 166759 160099 155060 151944 150112 149405 150778 155130 162112 170587 179843
56896 179843 189784 200122 209803 217086 220013 217326 209474 198664 187502 177594 169451 163232 159148
56883 159148 157482 158541 162287 167795 173817 180427 189525 202890 220197 239693 260435 282828 307206
$$ packed form
56963B577163J13310R3335P8643O6589N5732M5542L6362K8591K1725J4825P430
56952C139247q66j1039k3590l7509n1529o5892q1516r7988j13865j28376j40990
56941B386087j49785j52568j50031j45619j41596j36935j30060j21749j13843
56932A143901j06417r8059q8416p8730o9964o1835n3940m6759m0954l6408l2485
56921D29934k8963k6209k4557k3726k2905k1361j9112j6999j5777j5111j3806
56910B01408j1342q743p387p177o660n039l116j832p07J373M352O982Q475R256
56896A79843R941J0338R681P283K927k687p852j0810j1162r908q143o219m084
56883A59148j666J059L746N508O022O610R098J3365J7307J9496K0742K2393K4378
$$ plain form
56870 307206 332800 357953 380391 397374 406806 408674 404812 397226 387194 375708 363704 351672
56858 351672 339989 329674 321768 315763 309799 302926 296188 290939 287089 283680 280344 277359 274883 272901
56844 272901 271437 270151 268192 265085 261325 257617 254039 250526 247529 245448 243939 242635 242164 243595
56830 243595 247209 252653 260005 269648 281168 293344 305416 317602 330089 342132 352391 359847
56818 359847 364408 367193 370175 374848 380969 387072 392324 397421 403620 411620 421703 434253 449515
56805 449515 467248 487180 509570 534721 562096 590560 619380 648325 676498 701607 720839
56794 720839 732254 735275 730528 719878 706282 692685 680753 671087 664516 662237 664420 669653 676615
56781 676615 685817 698928 716734 738690 764221 793465 826576 863113 902208 942390 980774 1013061
$$ packed form
56870C07206K5594K5153K2438J6983R432J868l862p586j0032j1486j2004j2032
56858C51672j1683j0315p906o005n964o873o738n249l850l409l336k985k476j982
56844B72901j464j286j959l107l760l708l578l513k997k081j509j304m71J431
56830B43595L614N444P352R643J1520J2176J2072J2186J2487J2043J0259P456
56818C59847M561K785K982M673O121O103N252N097O199Q000J0083J2550J5262
56805D49515J7733J9932K2390K5151K7375K8464K8820K8945K8173K5109J9232
56794G20839J1415L021m747j0650j3596j3597j1932r666o571k279K183N233O962
56781F76615R202J3111J7806K1956K5531K9244L3111L6537L9095M0182L8384L2287
$$ plain form
56769 1013061 1034903 1043290 1037062 1017304 987767 953891 920279 888961 860040 833247 808468 785753
56757 785753 765874 750620 741631 738989 741473 747987 758121 771613 788046 807065 828093 849680
56745 849680 869614 885756 896306 899412 893371 877705 853728 823899 790914 757366 725531 696902
56733 696902 672028 650991 633777 619932 608249 597445 587358 579265 574831 574727 578374 584870 593801
56720 593801 604689 615767 623931 626472 622796 614154 601958 586814 569145 550096 531423 514583
56708 514583 499947 486629 473027 457990 441893 426515 413536 403118 393987 384792 375127 365356
56696 365356 355886 346961 338975 332589 328296 325900 324434 322600 319543 315590 312250 311002 311795 312984
56682 312984 313017 311824 310240 308562 306442 304056 302398 302093 302456 302212 300845 298902 297225 296160 295386 294345
$$ packed form
56769A013061K1842Q387o228j9758k9537l3876l3612l1318k8921k6793k4779k2715
56757G85753j9879j5254q989k642K484O514J0134J3492J6433J9019K1028K1587
56745H49680J9934J6142J0550L106o041j5666k3977k9829l2985l3548l1835k8629
56733F96902k4874k1037j7214j3845j1683j0804j0087q093m434j04L647O496Q931
56720E93801J0888J1078Q164K541l676q642j2196j5144j7669j9049j8673j6840
56708E14583j4636j3318j3602j5037j6097j5378j2979j0418r131r195r665r771
56696C65356r470q925p986o386m293k396j466j834l057l953l340j248P93J189
56682C12984L3j193j584j678k120k386j658l05L63k44j367j943j677j065p74j041
$$ plain form
56666 294345 292973 292062 292575 294472 296496 297195 296008 293414 290502 288476 288007 288709 289589 290112 290439 290606
56650 290606 290200 289220 288526 288864 289964 291179 292537 294361 296174 296791 295561 293003 290200 287964 286474
56635 286474 285289 283711 281403 278565 275368 271638 267446 263570 260800 259118 258128 258030 259417 262185 265259
56620 265259 267444 268207 267878 267611 268830 271922 275530 277793 278291 278158 278477 279435 281048 283609 286883 289639
56604 289639 290650 289901 288399 287078 286197 285569 285002 284572 284533 284987 285774 286802 288135 289354 289255 286929 283114
56587 283114 279778 278332 278819 280723 283609 286815 289441 291211 292775 294795 297289 300133 303471 307161
56573 307161 310507 313170 315799 319108 322807 326077 328662 330805 332505 333674 334789 336520 338737 340607
56559 340607 341723 342331 342378 341197 338602 335674 333842 333469 333813 334125 334195 333890 332895 331268 329820 329369 329682
$$ packed form
56666B94345j372r11N13J897K024O99j187k594k912k026m69P02Q80N23L27J67
56650B90606m06r80o94L38J100J215J358J824J813O17j230k558k803k236j490
56635B86474j185j578k308k838l197l730m192l876k770j682r90r8J387K768L074
56620B65259K185P63l29k67J219L092L608K263M98j33L19R58J613K561L274K756
56604B89639J011p49j502j321q81o28n67m30l9M54P87J028J333J219r9k326l815
56587B83114l336j446M87J904K886L206K626J770J564K020K494K844L338L690
56573C07161L346K663K629L309L699L270K585K143J700J169J115J731K217J870
56559C40607J116O08M7j181k595k928j832l73L44L12P0l05r95j627j448m51L13
$$ plain form
56542 329682 329614 328403 326440 324652 323593 323405 324173 325734 327359 328253 328436 328712 329803 331913 334980 338649
56526 338649 341988 343976 344597 344918 345810 347191 348845 351226 354713 358468 360874 361152 360003 358681 357889
56511 357889 357690 358115 359514 362333 366522 371225 375234 377933 379853 382377 386985 394489 404458 415252
56497 415252 424994 432715 438441 442333 444328 444597 443679 441953 439601 437282 435932 435412 434283 431754 429147
56482 429147 428367 429412 430498 430406 429480 428311 426714 424383 421605 418761 415860 413039 410852 409494 408274
56467 408274 406442 404157 402088 400464 399108 398127 397824 397897 397366 395465 392308 388548 384761 381317 378598
56452 378598 376980 376519 376730 376824 376338 375594 375334 375678 375655 374151 371366 368861 367844 367728 366863 364520 361568
56435 361568 359125 357270 355605 354485 354737 356313 358167 359839 362281 366444 371513 375345 376611 375914 374812
$$ packed form
56542C29682o8j211j963j788j059j88P68J561J625Q94J83K76J091K110L067L669
56526C38649L339J988O21L21Q92J381J654K381L487L755K406K78j149j322p92
56511C57889j99M25J399K819M189M703M009K699J920K524M608P504R969J0794
56497D15252R742P721N726L892J995K69r18j726k352k319j350n20j129k529k607
56482D29147p80J045J086r2r26j169j597k331k778k844k901k821k187j358j220
56467D08274j832k285k069j624j356r81l03P3n31j901l157l760l787l444k719
56452C78598j618m61K11R4m86p44k60L44k3j504k785k505j017j16q65k343k952
56435C61568k443j855j665j120K52J576J854J672K442M163N069L832J266o97j102
$$ plain form
56420 374812 374279 374277 374345 374230 374052 374088 374449 374964 375409 375728 375971 376166 376389 376814 377508 378352 379333 380667 382326
56401 382326 383680 384013 383338 382359 381653 381262 381041 381109 381895 383926 387371 391482 394750 396177 396413 397108 399135
56384 399135 401901 404356 406039 407013 407490 407941 409084 411230 413846 416006 417116 417102 416297 415343 414743 414286
56368 414286 413325 411902 411008 411233 411779 411601 411171 412128 415089 418701 421263 422666 424141 426389 428636 429726
56352 429726 429635 429421 429669 429575 428023 425291 422955 422038 421929 421478 420521 419836 420067 421331 423523 426238 428519
56335 428519 429400 428813 427571 426551 426361 427525 430145 433356 435920 437553 439037 440914 442842 444458 446027
56320 446027 447700 448930 449320 449597 451028 454126 458302 462425 465345 466496 466625 467330 469059 470039 468254
56305 468254 464260 460899 460182 461522 463240 464657 466071 467588 468955 470223 471842 474023 476341 477918
$$ packed form
56420C74812n33kO8j15j78L6L61N15M45L19K43J95K23M25O94Q44R81J334J659
56401C82326J354L33o75r79p06l91k21O8P86K031L445M111L268J427K36O95K027
56384C99135K766K455J683R74M77M51J143K146K616K160J110j4q05r54o00m57
56368D14286r61j423q94K25N46j78m30R57K961L612K562J403J475K248K247J090
56352D29726r1k14K48r4j552k732k336r17j09m51r57o85K31J264K192K715K281
56335D28519Q81n87j242j020j90J164K620L211K564J633J484J877J928J616J569
56320D46027J673J230L90K77J431L098M176M123K920J151J29P05J729R80j785
56305D68254l994l361p17J340J718J417J414J517J367J268J619K181K318J577
$$ plain form
56291 477918 477978 476545 474751 474062 474959 476699 478545 480682 483550 486793 489514 491382 492962 495030 497950
56276 497950 501573 505401 508913 511950 514642 516779 517688 517169 516222 516311 518076 521233 525347 529960 534094
56261 534094 536641 537600 538300 539941 542301 544217 545047 545377 546461 549112 552956 556718 559522 561872 564981
56246 564981 569090 573093 576054 578485 581675 586185 591627 597575 603915 610369 616429 621994 627527 633208
56232 633208 638342 642103 644751 647705 652327 658739 665800 672085 677002 681244 686226 692870 700856 709203
56218 709203 717544 726454 736451 747224 758304 770017 782963 796616 809332 820190 830384 842424
56206 842424 858217 877922 900055 922409 943589 964305 986944 1013414 1043664 1076535 1111379
56195 1111379 1148309 1187593 1229815 1276280 1328280 1386050 1449122 1517241 1589863 1665167 1741131
$$ packed form
56291D77918O0j433j794o89Q97J740J846K137K868L243K721J868J580K068K920
56276D97950L623L828L512L037K692K137R09n19r47Q9J765L157M114M613M134
56261E34094K547R59P00J641K360J916Q30L30J084K651L844L762K804K350L109
56246E64981M109M003K961K431L190M510N442N948O340O454O060N565N533N681
56232F33208N134L761K648K954M622O412P061O285M917M242M982O644P986Q347
56218G09203Q341Q910R997J0773J1080J1713J2946J3653J2716J0858J0194J2040
56206H42424J5793J9705K2133K2354K1180K0716K2639K6470L0250L2871L4844
56195A111379L6930L9284M2222M6465N2000N7770O3072O8119P2622P5304P5964
$$ plain form
56184 1741131 1817770 1896980 1979764 2064667 2149174 2231132 2308186 2377372 2436690 2486180 2526179
56173 2526179 2555161 2570597 2571575 2559464 2536366 2504129 2464534 2419010 2367857 2310740 2248158 2181623
56161 2181623 2112401 2041159 1969102 1898323 1830342 1765011 1701541 1640028 1581295 1525608 1472467
56150 1472467 1421720 1374325 1331687 1294332 1261317 1230878 1201637 1173281 1146359 1121845 1100848
56139 1100848 1084130 1071271 1060603 1050522 1040776 1031948 1023963 1016006 1007958 1000892 995650 991641 987643
56126 987643 983225 978689 974250 970199 967555 967334 968941 970356 970442 970304 971698 974803 978546 982672 988165
56111 988165 995389 1002995 1009331 1014177 1018457 1022915 1027968 1034353 1042759 1052839 1063459 1073969 1084511
56098 1084511 1095303 1106745 1120269 1137726 1159199 1182454 1205361 1228042 1251879 1277346 1304134
$$ packed form
56184A741131P6639P9210Q2784Q4903Q4507Q1958P7054O9186N9318M9490L9999
56173B526179K8982J5436R78j2111k3098l2237l9595m5524n1153n7117o2582o6535
56161B181623o9222p1242p2057p0779o7981o5331o3470o1513n8733n5687n3141
56150A472467n0747m7395m2638l7355l3015l0439k9241k8356k6922k4514k0997
56139A100848j6718j2859j0668j0081r746q828p985p957q048p066n242m009l998
56126I87643m418m536m439m051k644k21J607J415Q6j38J394L105L743M126N493
56111I88165P224P606O336M846M280M458N053O385Q406J0080J0620J0510J0542
56098A084511J0792J1442J3524J7457K1473K3255K2907K2681K3837K5467K6788
$$ plain form
56087 1304134 1332936 1365561 1403203 1445718 1493033 1546254 1606737 1674594 1748820 1828757 1914882
56076 1914882 2007922 2107181 2209679 2310779 2405730 2491093 2565675 2630872 2689880 2745552 2798425
56065 2798425 2846907 2889067 2923518 2948711 2962877 2965513 2958240 2943476 2922868 2897361 2867495 2832348
56053 2832348 2789023 2734784 2669704 2596317 2517294 2434838 2352025 2272836 2200177 2134843 2076744
56042 2076744 2026113 1983149 1947380 1917982 1894184 1875101 1859827 1847985 1839652 1834537 1831806 1830812
56030 1830812 1831406 1833427 1836523 1840533 1845375 1850626 1855976 1862093 1870116 1880168 1891284 1902945 1915675
56017 1915675 1929827 1944838 1960198 1976268 1993577 2012014 2031198 2051116 2071950 2093900 2117357
56006 2117357 2142611 2169228 2196553 2225062 2256195 2290531 2327127 2365080 2404642 2446219 2489343
$$ packed form
56087A304134K8802L2625L7642M2515M7315N3221O0483O7857P4226P9937Q6125
56076A914882R3040R9259J02498J01100R4951Q5363P4582O5197N9008N5672N2873
56065B798425M8482M2160L4451K5193J4166K636p273j4764k0608k5507k9866l5147
56053B832348m3325n4239o5080p3387p9023q2456q2813p9189p2659o5334n8099
56042B076744n0631m2964l5769k9398k3798j9083j5274j1842q333n115k731r94
56030A830812N94K021L096M010M842N251N350O117Q023J0052J1116J1661J2730
56017A915675J4152J5011J5360J6070J7309J8437J9184J9918K0834K1950K3457
56006B117357K5254K6617K7325K8509L1133L4336L6596L7953L9562M1577M3124
$$ plain form
55995 2489343 2533402 2578283 2623397 2667166 2708786 2749866 2793057 2839333 2887472 2935815 2983651
55984 2983651 3031335 3080149 3131870 3187439 3245985 3305796 3366198 3427910 3491900 3558628 3628333
55973 3628333 3701278 3777498 3856746 3938912 4024453 4114507 4210542 4313433 4422789 4537687 4658238
55962 4658238 4785916 4922305 5068193 5223909 5389392 5563591 5745062 5934015 6132789
55953 6132789 6343310 6564939 6795887 7036143 7287850 7553274 7833449 8128624 8439086
55944 8439086 8765712 9110450 9476079 9864936 10278148 10716510 11181443 11674425 12196006
55935 12196006 12746272 13325978 13936605 14579769 15257143 15970654 16722392 17514895 18351814
55926 18351814 19237308 20174216 21163700 22207193 23307526 24467587 25689554 26977057
$$ packed form
55995B489343M4059M4881M5114M3769M1620M1080M3191M6276M8139M8343M7836
55984B983651M7684M8814N1721N5569N8546N9811O0402O1712O3990O6728O9705
55973C628333P2945P6220P9248Q2166Q5541R0054R6035J02891J09356J14898J20551
55962D658238J27678J36389J45888J55716J65483J74199J81471J88953J98774
55953F132789K10521K21629K30948K40256K51707K65424K80175K95175L10462
55944H439086L26626L44738L65629L88857M13212M38362M64933M92982N21581
55935A2196006N50266N79706O10627O43164O77374P13511P51738P92503Q36919
55926A8351814Q85494R36908R89484J043493J100333J160061J221967J287503
$$ plain form
55918 26977057 28337486 29781285 31319944 32965419 34729911 36624653 38660020 40848429
55910 40848429 43206520 45753808 48511160 51502888 54759913 58320304 62229181 66541505
55902 66541505 71325939 76666537 82663720 89436707 97125302 105889389 115907809 127374679
55894 127374679 140486633 155422843 172330278 191319547 212462021 235775912 261175903
55887 261175903 288322121 316319034 343379335 366779242 383398255 390738615 387872215
55880 387872215 375730740 356608726 333264025 308138933 282979991 258822078 236161957
55873 236161957 215168332 195846677 178136394 161954694 147212181 133816426 121671195
55866 121671195 110677619 100739059 91764266 83665508 76357041 69759003 63802426 58428930
$$ packed form
55918B6977057J360429J443799J538659J645475J764492J894742K035367K188409
55910D0848429K358091K547288K757352K991728L257025L560391L908877M312324
55902F6541505M784434N340598N997183O772987P688595Q764087J0018420J1466870
55894A27374679J3111954J4936210J6907435J8989269K1142474K3313891K5399991
55887B61175903K7146218K7996913K7060301K3399907J6619013P340360k866400
55880C87872215j2141475j9122014k3344701k5125092k5158942k4157913k2660121
55873B36161957k0993625j9321655j7710283j6181700j4742513j3395755j2145231
55866A21671195j0993576r938560q974793q098758p308467o598038n956577n373496
$$ plain form
55858 58428930 53586715 49228214 45309510 41788730 38624623 35777914 33213466 30899812
55850 30899812 28807479 26909766 25185003 23616296 22188391 20885385 19691486 18593191
55842 18593191 17580327 16645123 15780433 14979066 14234930 13543954 12902890 12307663 11754113
55833 11754113 11239787 10762970 10319922 9905279 9515869 9151930 8813287 8496256 8195945
55824 8195945 7910098 7638949 7382588 7140525 6912882 6699613 6498454 6305084 6115085
55815 6115085 5924499 5729207 5526023 5314917 5098815 4881068 4664363 4451957 4247847
55806 4247847 4054489 3871320 3696444 3529127 3370044 3219948 3079058 2947315 2824179
55797 2824179 2708206 2597611 2491713 2391557 2298829 2214156 2136517 2064235 1996274 1932444
$$ packed form
55858E8428930m842215m358501l918704l520780l164107k846709k564448k313654
55850C0899812k092333j897713j724763j568707j427905j303006j193899j098295
55842A8593191j012864r35204q64690q01367p44136o90976o41064n95227n53550
55833A1754113n14326m76817m43048m14643l89410l63939l38643l17031l00311
55824H195945k85847k71149k56361k42063k27643k13269k01159j93370j89999
55815F115085j90586j95292k03184k11106k16102k17747k16705k12406k04110
55806D247847j93358j83169j74876j67317j59083j50096j40890j31743j23136
55797B824179j15973j10595j05898j00156r2728q4673p7639p2282o7961o3830
$$ plain form
55787 1932444 1872653 1816521 1763721 1714063 1666900 1621031 1575736 1531579 1489661 1450324 1413108
55776 1413108 1377722 1344382 1313225 1284036 1256590 1230806 1206560 1183879 1163348 1145596 1130073
55765 1130073 1114936 1098640 1081346 1064274 1047899 1031361 1013666 994869 975766 956841 938056
55754 938056 919533 901802 885151 869272 853991 839975 828118 818408 810093 802913 797404 793768
55742 793768 791149 788508 785760 783625 782727 783187 784662 786300 787123 787077 787454 789629 793482 797546 800491 801841
55726 801841 801517 799625 796706 793246 788537 780843 769344 755404 741317 728187 715723 703761 693100
55713 693100 684785 679327 676803 676938 678542 679399 677403 671834 663230 652460 640518 628865 618915 610901
55699 610901 603854 596988 590430 584321 578055 571124 564059 557550 550991 542991 533342 523425 514386 505825
$$ packed form
55787A932444n9791n6132n2800m9658m7163m5869m5295m4157m1918l9337l7216
55776A413108l5386l3340l1157k9189k7446k5784k4246k2681k0531j7752j5523
55765A130073j5137j6296j7294j7072j6375j6538j7695j8797j9103j8925j8785
55754I38056j8523j7731j6651j5879j5281j4016j1857r710q315p180n509l636
55742G93768k619k641k748k135q98M60J475J638Q23m6L77K175L853M064K945J350
55726H01841l24j892k919l460m709p694j1499j3940j4087j3130j2464j1962j0661
55713F93100q315n458k524J35J604Q57j996n569q604j0770j1942j1653r950q014
55699F10901p047o866o558o109o266o931p065o509o559q000r649r917r039q561
$$ plain form
55685 505825 496772 487209 477921 469386 461552 454515 448618 443789 439297 434419 429075 423641 418359 413179
55671 413179 408109 403499 399819 397191 395160 392895 389640 385222 380374 376279 373295 370151 365075 357913
55657 357913 350602 345296 342727 342691 345081 349421 354038 357064 358151 358327 358310 358015 357485 357057 356430 354711
55641 354711 351667 347922 343726 338670 332955 327767 323867 320795 317961 315412 312938 309638 305251 300925
55627 300925 297733 295383 293318 292098 292487 293942 295280 296251 297271 298132 298167 297301 295796 293463 290357 287694
55611 287694 286653 286603 285888 284118 282253 280741 279286 278350 279052 281232 283368 284815 286428 288416 289502
55596 289502 289283 289669 292450 296550 299372 300071 299984 300305 300969 301757 303097 305446 308647 312042 314583 314957
55580 314957 312462 307902 302968 298635 294657 290523 286124 281347 275818 269492 262999 256957 251236 245334
$$ packed form
55685E05825r053r563r288q535p834p037n897m829m492m878n344n434n282n180
55671D13179n070m610l680k628k031k265l255m418m848m095k984l144n076p162
55657C57913p311n306k569l6K390M340M617L026J087J76j7k95n30m28o27j719
55641C54711l044l745m196n056n715n188l900l072k834k549k474l300m387m326
55627C00925l192k350k065j220L89J455J338R71J020Q61L5q66j505k333l106k663
55611B87694j041n0p15j770j865j512j455r36P02K180K136J447J613J988J086
55596B89502k19L86K781M100K822O99q7L21O64P88J340K349L201L395K541L74
55580C14957k495m560m934m333l978m134m399m777n529o326o493o042n721n902
$$ plain form
55566 245334 239342 234099 230413 228346 227330 226696 225983 224941 223528 221863 219899 217167 213233 208516 204124
55551 204124 200538 197028 192968 189344 187964 189270 191767 193778 194846 195122 194351 192187 188988 185560 182431
55536 182431 179863 178220 177643 177522 176873 175308 173302 171572 170468 169875 169483 169219 169601 171389 174638 178364
55520 178364 181419 183489 184931 185925 186229 185692 184674 183934 184166 185401 186781 187317 187097 187368 189092 191826
55504 191826 194343 195935 196700 197055 197478 198283 198928 197972 194626 190200 187118 186390 186773 186458 184835 182456
55488 182456 180039 177889 175810 173305 170257 167484 166012 165722 165502 164992 165268 167055 169026 168982 166566 163852
55472 163852 163099 164624 167127 169373 170959 171772 171505 170027 167901 166048 164818 163662 162021 160322 159613
55457 159613 160202 161175 161530 161226 160602 159273 156526 152760 149417 147049 144482 140765 137266 136387 138244 140075
$$ packed form
55566B45334n992n243l686k067j016o34p13j042j413j665j964k732l934m717m392
55551B04124l586l510m060l624j380J306K497K011J068K76p71k164l199l428l129
55536A82431k568j643n77j21o49j565k006j730j104n93l92k64L82J788L249L726
55520A78364L055K070J442R94L04n37j018p40K32J235J380N36k20K71J724K734
55504A91826K517J592P65L55M23Q05O45r56l346m426l082p28L83l15j623k379
55488A82456k417k150k079k505l048k773j472k90k20n10K76J787J971m4k416k714
55472A63852p53J525K503K246J586Q13k67j478k126j853j230j156j641j699p09
55457A59613N89R73L55l04o24j329k747l766l343k368k567l717l499q79J857J831
$$ plain form
55441 140075 139533 137444 136316 137045 138434 139500 140609 142071 143090 143006 142694 143730 146549 150116 153071
55426 153071 154528 154111 152105 149558 147675 147011 147528 149082 151306 153323 154364 154648 154911 155105 154395 152588
55410 152588 150758 150146 151016 152871 155025 156526 156308 154223 151521 149591 148408 146944 144874 143097 142382
55395 142382 142247 141645 140432 139682 140426 142331 143876 143960 143176 143113 144371 145796 145978 145016 144162 144067 144208 144015
55377 144015 143623 143157 142145 140413 139037 139411 141400 143259 143638 143045 142982 144167 146171 148405 150719 152980
55361 152980 154678 155368 155262 155019 154978 154855 154368 154034 154940 157379 159921 160525 158870 157050 157351 159667 161785
55344 161785 161978 160363 157694 154033 149272 144160 139930 137218 135997 136126 137136 137830 137117 135389 134367
55329 134367 135467 138810 143638 148833 153005 155185 155864 156552 157840 158680 158255 157653 158646 161196 163395 163761
$$ packed form
55441A40075n42k089j128P29J389J066J109J462J019q4l12J036K819L567K955
55426A53071J457m17k006k547j883o64N17J554K224K017J041K84K63J94p10j807
55410A52588j830o12Q70J855K154J501k18k085k702j930j183j464k070j777p15
55395A42382j35o02j213p50P44J905J545Q4p84o3J258J425J82r62q54r5J41j93
55377A44015l92m66j012j732j376L74J989J859L79n93o3J185K004K234K314K261
55361A52980J698O90j06k43m1j23m87l34R06K439K542O04j655j820L01K316K118
55344A61785J93j615k669l661m761n112m230k712j221J29J010O94p13j728j022
55329A34367J100L343M828N195M172K180O79O88J288Q40m25o02R93K550K199L66
$$ plain form
55313 163761 162556 160568 157722 153600 148780 144751 142556 142057 142581 143771 145553 147554 148951 149009 147697
55298 147697 145814 144585 144954 146897 149263 150557 150196 148990 148224 148418 149178 150001 150754 151406 151872 152293 152957
55281 152957 153699 153804 152846 151256 149643 147961 145845 143524 141783 141075 141263 142167 143730 145468 146423 146098
55265 146098 145130 144650 145103 145897 146060 145105 143532 142691 143774 146468 148790 148773 146391 143413 141348 140088
55249 140088 138817 137708 137963 140181 143309 145541 146053 145539 145215 145648 146628 147785 148970 149951 150163 149176
55233 149176 147438 146087 145719 145685 145145 144604 145567 148421 151473 152779 152449 152380 153933 156681 159314 160846
55217 160846 160868 159649 158435 158689 160299 161198 159611 156218 153197 151493 150095 147956 145481 143748 143144
55202 143144 143357 144114 145244 146361 147064 147332 147328 146989 146223 145429 145366 146406 148133 149709 150456 150136 148884 146978
$$ packed form
55313A63761j205j988k846m122m820m029k195m99N24J190J782K001J397N8j312
55298A47697j883j229L69J943K366J294l61j206p66J94P60Q23P53O52M66M21O64
55281A52957P42J05r58j590j613j682k116k321j741p08J88R04J563J738R55l25
55265A46098r68m80M53P94J63r55j573q41J083K694K322j7k382k978k065j260
55249A40088j271j109K55K218L128K232N12n14l24M33R80J157J185R81K12r87
55233A49176j738j351l68l4n40n41R63K854L052J306l30o9J553K748K633J532
55217A60846K2j219j214K54J610Q99j587l393l021j704j398k139k475j733o04
55202A43144K13P57J130J117P03K68ml39p66p94o3J040J727J576P47l20j252j906
$$ plain form
55184 146978 144594 141917 139517 138328 138836 140368 141670 142315 143116 144936 147516 149928 151862 153810 155967
55169 155967 157617 158000 157388 156845 157125 158129 159253 159762 158966 156699 153810 151693 150984 151076 151195 151559 152997
55152 152997 155627 158450 160299 160824 160519 160097 159898 159745 159317 158707 158399 158565 158706 158387 157989 158154 158633 158485
55134 158485 157495 156638 156790 157642 158340 158671 159007 159500 160048 160898 162557 165054 167765 170035 171508 171839 170649
55117 170649 168085 165051 162598 161223 160892 161402 162462 163642 164558 165060 165122 164702 163936 163223 162862 162632 162081
55100 162081 161231 160737 161345 163365 166565 170170 172925 173717 172537 170635 169377 169061 169006 168501 167309 165632
55084 165632 164211 164305 166644 170188 172617 172522 170615 168451 166601 164733 162918 161892 162093 163177 164546
55069 164546 165758 166439 166429 166179 166446 167579 169557 172514 176392 179975 181352 179809 176634 173606 171461
$$ packed form
55184A46978k384k677k400j189N08J532J302O45Q01J820K580K412J934J948K157
55169A55967J650L83o12n43K80J004J124N09p96k267k889k117p09R2J19L64J438
55152A52997K630K823J849N25l05m22j99j53m28o10l08J66J41l19l98J65M79j48
55134A58485r90q57J52Q52O98L31L36M93N48Q50J659K497K711K270J473L31j190
55117A70649k564l034k453j375l31N10J060J180R16N02O2m20p66p13l61k30n51
55100A62081q50m94O08K020L200L605K755P92j180j902j258l16n5n05j192j677
55084A65632j421R4K339L544K429r5j907k164j850j868j815j026K01J084J369
55069A64546J212O81j0k50K67J133J978K957L878L583J377j543l175l028k145
$$ plain form
55054 171461 170211 170000 170635 170993 170096 168663 168542 170562 173706 176537 178678 180597 182551 184176 184908 184541
55038 184541 183411 182072 180804 179606 178669 178386 178705 178977 178782 178354 177820 176768 175273 174567 175628 177640
55022 177640 179009 179508 180052 180685 180411 179103 177860 177110 175985 174258 173249 173818 174830 174838 174111 173629 173140
55005 173140 171811 170171 169666 170485 171335 171399 171290 171859 173063 174137 174168 172635 170144 168396 168543 169862 170991
54988 170991 172006 173900 176341 177684 177458 177077 177491 177720 176674 175085 174434 174895 175553 175996 176515 177122 177468
54971 177468 177615 178030 178900 180048 181328 182423 182561 181218 179026 177235 176213 175072 172960 170286 168451
54956 168451 168587 170631 173463 175908 177553 178565 178944 178479 177458 176771 177020 178015 179408 181234 183423 185319
54940 185319 186181 185861 184756 183656 183802 186132 189786 192281 192138 190645 190032 190543 190634 189610 188538 188510 189381
$$ packed form
55054A71461j250k11O35L58q97j433j21K020L144K831K141J919J954J625P32l67
55038A84541j130j339j268j198r37k83L19K72j95m28n34j052j495p06J061K012
55022A77640J369M99N44O33k74j308j243p50j125j727j009N69J012Qp27m82m89
55005A73140j329j640n05Q19Q50O4j09N69J204J074L1j533k491j748J47J319J129
54988A70991J015J894K441J343k26l81M14K29j046j589o51M61O58M43N19O07L46
54971A77468J47M15Q70J148J280J095J38j343k192j791j022j141k112k674j835
54956A68451J36K044K832K445J645J012L79m65j021o87K49R95J393J826K189J896
54940A85319Q62l20j105j100J46K330L654K495j43j493o13N11R1j024j072k8Q71
$$ plain form
54923 189381 190530 191787 193186 194656 196230 197853 198822 198234 196162 193650 191507 190001 189615 190825 192922
54908 192922 194493 195525 197617 201292 204507 205047 203381 201846 201816 203011 204946 207452 210023 212098 214001
54893 214001 216347 218525 219058 217733 216071 215225 214521 212798 210352 208711 208908 210587 212521 213561 213358
54878 213358 212560 212140 212357 212696 212928 213619 215174 216877 217616 217405 217591 219467 223033 227164 230774 233840
54862 233840 237484 243082 251093 260732 270700 280070 288427 295622 301774 307334 312627 317249 320207 320836
54848 320836 319390 316640 312948 307818 300519 291285 281910 274737 270760 268763 266498 262569 257134 251314
54834 251314 246441 243535 242605 242341 241216 239176 237649 237535 237979 237798 237483 238655 241649 244720 246109 246147
54818 246147 246756 249388 254119 260451 268110 276724 285237 292242 297091 300387 303119 305326 305952 304083 299928
$$ packed form
54923A89381J149J257J399J470J574J623R69n88k072k512k143j506l86J210K097
54908A92922J571J032K092L675L215N40j666j535l0J195J935K506K571K075J903
54893B14001K346K178N33j325j662q46p04j723k446j641J97J679J934J040k03
54878B13358p98m20K17L39K32O91J555J703P39k11J86J876L566M131L610L066
54862B33840L644N598Q011R639R968R370Q357P195O152N560N293M622K958O29
54848C20836j446k750l692n130p299r234r375p173l977j997k265l929n435n820
54834B51314m873k906r30k64j125k040j527j14M44j81l15J172K994L071J389L8
54818B46147O09K632M731O332P659Q614Q513P005M849L296K732K207O26j869m155
$$ plain form
54803 299928 294274 287469 279672 271874 265718 261939 259563 256960 253204 248252 242551 237034 232860 230417
54789 230417 228836 226974 224543 221824 218867 215684 212784 210648 209020 207542 206649 206774 207031 206018 203893
54774 203893 202193 201421 200331 198123 195839 194620 193978 193077 192676 194094 196755 198441 198095 197011 196886 197772
54758 197772 198507 198455 198229 198919 200929 203421 204926 204681 203321 202024 201326 201266 202352 205337 209761 213551
54742 213551 214841 214002 213308 214545 217314 219809 220877 220775 219971 218147 215092 212082 211052 212238 213725
54727 213725 213854 213120 212969 213709 214660 215663 217155 219092 221016 223131 226141 229955 233589 236475 238919
54712 238919 241220 243397 246026 250205 256162 262795 269170 275732 283460 292423 301658 310021 316930 322851
54698 322851 329174 336627 343507 346667 344939 340429 335431 329309 320078 308313 297390 289615 283842 277643
$$ packed form
54803B99928n654o805p797p798o156l779k376k603l756m952n701n517m174k443
54789B30417j581j862k431k719k957l183k900k136j628j478q93J25K57j013k125
54774B03893j700p72j090k208k284j219o42r01m01J418K661J686l46j084j25Q86
54758A97772P35n2k26O90K010K492J505k45j360j297o98o0J086K985M424L790
54742B13551J290q39o94J237K769K495J068j02q04j824l055l010j030J186J487
54727B13725J29p34j51P40R51J003J492J937J924K115L010L814L634K886K444
54712B38919K301K177K629M179N957O633O375O562P728Q963R235Q363O909N921
54698C22851O323P453O880L160j728m510m998o122r231j1765j0923p775n773o199
$$ plain form
54684 277643 270542 264117 259693 257031 255032 252757 249685 245732 241567 238691 238603 241421 245353 247950 248293
54669 248293 247843 248831 251815 255144 256952 257405 258705 262859 269692 277182 283655 289321 295568 303128 311314
54654 311314 318737 324070 326148 324273 319005 312183 305574 299753 294636 290580 288007 286114 282962 277398
54640 277398 270362 263830 258754 254608 250865 248161 247472 248415 249079 247836 244849 241374 238032 234450 230448
54625 230448 226590 223338 220449 217689 215512 214408 214021 213574 212904 212472 212506 212756 213033 213420 213886 214166 214139
54608 214139 214051 214240 214870 215845 216811 217280 217005 216218 215388 214847 214663 214610 214139 212807 211040 210076 210756 212605
54590 212605 214357 215056 214477 213097 212078 212555 214211 215194 214273 212518 211860 212497 213010 212698 212307 212354 212194
54573 212194 211211 209699 208084 206355 204835 204361 204960 205358 204682 203809 204143 205773 207743 209472 210888 211753
$$ packed form
54684B77643p101o425m424k662j999k275l072l953m165k876q8K818L932K597L43
54669B48293m50R88K984L329J808M53J300M154O833P490O473N666O247P560Q186
54654C11314P423N333K078j875n268o822o609n821n117m056k573j893l152n564
54640B77398p036o532n076m146l743k704o89R43O64j243k987l475l342l582m002
54625B30448l858l252k889k760k177j104l87m47o70m32L4K50K77L87M66K80k7
54608B14139q8J89O30R75R66M69k75p87q30n41j84n3m71j332j767r64O80J849
54590B12605J752O99n79j380j019M77J656R83r21j755o58O37N13l12l91M7j60
54573B12194r83j512j615j729j520m74N99L98o76q73L34J630J970J729J416Q65
$$ plain form
54557 211753 211986 212311 213521 215276 216573 217174 217558 217692 217016 215717 214931 215358 216530 217672 218476 218700 217864
54540 217864 215801 212972 209917 206960 204655 203851 204833 206896 209053 210669 211299 210768 209855 210038 211797 213816
54524 213816 214625 214427 214429 214873 214878 214104 213399 213609 214572 215580 216202 216409 216421 216569 216869 216767 215870 214860 214800 215579
54504 215579 216072 216140 217194 220133 223825 226610 228366 229771 230282 228628 225301 222870 223154 225253 227083
54489 227083 227914 228507 229442 230441 231304 232595 234956 238019 240338 240569 238812 236663 235697 235988 236408 236267 236090
54472 236090 236726 238278 240199 241970 243356 244322 245038 245776 246635 247579 248725 250113 251213 251389 251010 251262
54456 251262 252428 253211 252403 250507 248873 247866 246875 245679 244710 244087 243375 242315 241022 239558 238139 237616
54440 237616 238721 240702 241695 240726 238619 236691 235356 234371 233713 233674 234460 235948 237568 238461 238331 238074 238837
$$ packed form
54557B11753K33L25J210J755J297O01L84J34o76j299p86M27J172J142Q04K24q36
54540B17864k063k829l055k957k305q04R82K063K157J616O30n31r13J83J759K019
54524B13816Q09j98KM44Np74p05K10R63J008O22K07J2J48L00j02q97j010o0P79
54504B15579M93O8J054K939L692K785J756J405N11j654l327k431K84K099J830
54489B27083Q31N93R35R99Q63J291K361L063K319K31j757k149r66K91M20j41j77
54472B36090O36J552J921J771J386R66P16P38Q59R44J146J388J100J76l79K52
54456B51262J166P83q08j896j634j007r91j196r69o23p12j060j293j464j419n23
54440B37616J105J981R93r69k107j928j335r85o58l9P86J488J620Q93j30k57P63
$$ plain form
54423 238837 240483 241818 242343 242753 243534 244299 245021 246747 250294 255086 259965 264186 266934 267032 264445 261229
54407 261229 259611 259544 259497 259181 259943 262485 265697 268053 269002 268650 267186 265140 263274 261598 259159 255352
54391 255352 250995 247653 246257 246627 247931 249376 250751 252433 254543 256302 256876 256668 256847 257584 257881 257418
54375 257418 257245 258014 258844 259003 259550 261731 264449 265167 263276 260931 260187 260776 261297 261272 261029 260568 259759 259122
54357 259122 259254 259755 259768 259499 260096 261839 263504 263984 263669 263495 263286 261947 259190 256255 254755 255253 257083
54340 257083 259208 261148 263279 266253 269966 273263 275061 275554 275745 275890 275252 273642 272361 272814 274668
54325 274668 276133 275956 274475 272784 271600 271193 271860 273930 277238 280753 282869 282506 280285 278352 278466
54310 278466 280235 281682 281483 280115 278767 277904 277263 276607 275889 275055 274219 273726 273505 272689 270621 268080 266703
$$ packed form
54423B38837J646J335N25M10P81P65P22J726L547M792M879M221K748R8k587l216
54407B61229j618o7m7l16P62K542L212K356R49l52j464k046j866j676k439l807
54391B55352m357l342j396L70J304J445J375J682K110J759N74k08J79P37K97m63
54375B57418j73P69Q30J59N47K181K718P18j891k345p44N89N21k5k43m61q09o37
54357B59122J32N01J3k69N97J743J665M80l15j74k09j339k757k935j500M98J830
54340B57083K125J940K131K974L713L297J798M93J91J45o38j610j281M53J854
54325B74668J465j77j481j691j184m07O67K070L308L515K116l63k221j933J14
54310B78466J769J447j99j368j348q63o41o56p18q34q36m93k21q16k068k541j377
$$ plain form
54293 266703 267007 267773 267713 267106 267215 268568 270467 272053 273190 274229 275408 276625 277504 277579 276718 275474 274767
54276 274767 275131 276484 278650 281667 285338 288867 291364 292661 293364 294103 294836 294789 293076 289629 285570 282253
54260 282253 279744 276838 272943 269282 267373 266760 265392 262327 258993 257315 257429 257877 257558 256821 256825 258341
54244 258341 261146 264298 267028 269265 271073 271841 270766 268218 265772 264530 264183 264132 264603 265846 267077
54229 267077 267370 267233 268107 270336 272563 273198 271722 268596 264678 260802 257270 253813 250695 249462 251526
54214 251526 256050 260497 263454 265662 267895 269331 268922 267227 265709 265027 265216 266765 269955 273327 274371
54199 274371 272193 268535 265841 265089 265738 266873 267760 267965 267741 268142 270179 273742 277505 279740 279219 275777
54183 275777 270539 265490 262304 261234 261220 261160 261017 261575 263294 265720 268106 270271 272350 273885 273901 272202
$$ packed form
54293B66703L04P66o0o07J09J353J899J586J137J039J179J217Q79P5q61j244p07
54276B74767L64J353K166L017L671L529K497J297P03P39P33m7j713l447m059l317
54260B82253k509k906l895l661j909o13j368l065l334j678J14M48l19p37MJ516
54244B58341K805L152K730K237J808P68j075k548k446j242l47n1M71J243J231
54229B67077K93j37Q74K229K227O35j476l126l918l876l532l457l118j233K064
54214B51526M524M447K957K208K233J436m09j695j518o82J89J549L190L372J044
54199B74371k178l658k694p52O49J135Q87K05k24M01K037L563L763K235n21l442
54183B75777n238n049l186j070j4o0j43N58J719K426K386K165K079J535J6j699
$$ plain form
54167 272202 270004 268746 268636 268905 269142 269494 269680 268840 266669 263916 261308 258766 256327 255075 256095 258737
54151 258737 260964 261517 260925 260278 259837 259233 258287 257093 255822 254962 255255 256758 258384 259112 259462 260894 263729
54134 263729 266482 267589 267194 266757 267234 268082 267986 266260 263498 260896 259068 257649 256045 254155 252032 249381
54118 249381 246154 243376 242436 243424 245024 246198 247065 247759 247577 246117 244442 243990 244725 245408 245508 245777 246843
54101 246843 248156 248672 248005 246674 245607 245538 246513 247901 249099 250124 251263 252418 253304 254050 255009 256171
54085 256171 257363 258872 261051 263394 264859 265179 265049 264890 264256 262756 260784 258859 256927 254712 252296
54070 252296 249934 247799 246236 245784 246628 248409 250848 254056 257939 261857 265183 267734 269431 270133 270153
54055 270153 270303 270936 271479 271355 270787 270203 269444 268197 266806 266061 266520 268399 271621 275415 278374 279515
$$ packed form
54167B72202k198j258j10K69K37L52J86q40k171k753k608k542k439j252J020K642
54151B58737K227N53n92o47m41o04r46j194j271q60K93J503J626P28L50J432K835
54134B63729K753J107l95m37M77Q48r6j726k762k602j828j419j604j890k123k651
54118B49381l227k778r40R88J600J174Q67O94j82j460j675m52P35O83J00K69J066
54101B46843J313N16o67j331j067o9R75J388J198J025J139J155Q86P46R59J162
54085B56171J192J509K179K343J465L20j30j59o34j500j972j925j932k215k416
54070B52296k362k135j563m52Q44J781K439L208L883L918L326K551J697P02K0
54055B70153J50O33N43j24n68n84p59j247j391p45M59J879L222L794K959J141
$$ plain form
54039 279515 278978 277363 275109 272960 272081 272720 273527 273357 273141 274673 277916 280915 282195 281840 280284 277695
54023 277695 274992 273926 275300 278034 280671 282936 285110 286837 287539 287450 287277 287203 287022 286950 287470 288460 289178
54006 289178 289172 288676 288205 288298 289595 292508 296573 300517 303273 304765 305711 306924 308876 311594 314655 317459
53990 317459 319774 321975 324546 327361 329816 331786 334130 337903 343173 349026 354648 360000 365431 371260
53976 371260 377923 385904 395014 404208 412699 420937 429964 440171 451389 463764 477495 491734 505030
53963 505030 517231 530018 544793 560623 574800 584990 590263 590602 586349 578148 566785 552977
53951 552977 537538 521579 506004 490846 475564 460125 445441 432645 422200 413713 406330 399271
53939 399271 392382 386320 381910 379104 376803 373944 370451 366910 363636 360541 357764 355795 354801 354198 353079
$$ packed form
54039B79515n37j615k254k149q79O39Q07j70k16J532L243K999J280l55j556k589
54023B77695k703j066J374K734K637K265K174J727P02q9j73p4j81p2N20R90P18
54006B89178om96m71R3J297K913M065L944K756J492R46J213J952K718L061K804
53990C17459K315K201K571K815K455J970K344L773N270N853N622N352N431N829
53976C71260O663P981R110R194Q491Q238R027J0207J1218J2375J3731J4239J3296
53963E05030J2201J2787J4775J5830J4177J0190N273L39m253q201j1363j3808
53951E52977j5439j5959j5575j5158j5282j5439j4684j2796j0445q487p383p059
53939C99271o889o062m410k806k301k859l493l541l274l095k777j969r94o03j119
$$ plain form
53924 353079 350735 346767 341369 335865 332340 331883 333374 334593 334341 332933 331015 329019 327743 328173 330105
53909 330105 331855 332068 331201 330500 330148 329390 328228 327947 329725 333201 336692 338726 339431 340336 342548 345278
53893 345278 346899 347349 348282 350452 352436 353067 353807 356900 361835 365679 367005 367650 370123 374761 380162
53878 380162 385236 389927 394656 399880 405807 412044 417863 422921 427295 430864 433438 435535 438093 441238
53864 441238 444308 447410 451863 458479 466305 473783 480494 487165 494534 502746 511302 519140 525308 529987
53850 529987 534281 538691 542522 545110 546772 548075 549053 549676 550145 550070 548407 545079 541663 539434 537626
53835 537626 534823 531250 528206 525752 522472 517419 511028 504204 497761 492736 489923 488749 487599 485642
53821 485642 483646 482803 483472 485287 487818 490840 494452 499124 505337 513137 522300 532734 544330 556694
$$ packed form
53924C53079k344l968n398n504l525m57J491J219k52j408j918j996j276M30J932
53909C30105J750K13q67p01l52p58j162k81J778L476L491K034P05R05K212K730
53893C45278J621M50R33K170J984O31P40L093M935L844J326O45K473M638N401
53878C80162N074M691M729N224N927O237N819N058M374L569K574K097K558L145
53864D41238L070L102M453O616P826P478O711O671P369Q212Q556P838O168M679
53850E29987M294M410L831K588J662J303R78O23M69p5j663l328l416k229j808
53835E37626k803l573l044k454l280n053o391o824o443n025k813j174j150j957
53821D85642j996q43O69J815K531L022L612M672O213P800R163J0434J1596J2364
$$ plain form
53807 556694 569425 582220 594121 603078 606971 604808 596520 582344 563396 542146 521060 501009
53795 501009 482042 465132 451628 441235 432203 423626 416015 409409 402674 395305 388395 383009 378826
53782 378826 375219 372413 370550 368687 365887 362610 359965 358157 356712 355673 355511 356080 356627 356739 356563
53767 356563 356163 355291 353845 352143 350775 350343 351090 352593 354225 356047 358721 362333 365991 368871 370921
53752 370921 372092 371830 370110 368260 367742 368543 369639 370765 372873 377009 383419 391495 399844 406738 411356
53737 411356 414601 417957 421640 424588 426243 427537 429889 433744 438226 441792 443258 442711 441593 441581 443197
53722 443197 445487 446796 445698 441688 435577 428988 423053 417807 413147 409718 408087 407541 406750 405438 404383
53707 404383 403834 403020 401421 399435 397319 394369 389900 384512 379657 376101 373285 370088 366028 361755 358494
$$ packed form
53807E56694J2731J2795J1901Q957L893k163q288j4176j8948k1250k1086k0051
53795E01009j8967j6910j3504j0393r032q577p611o606o735p369o910n386m183
53782C78826l607k806j863j863k800l277k645j808j445j039j62N69N47J12j76
53767C56563m00q72j446j702j368m32P47J503J632J822K674L612L658K880K050
53752C70921J171k62j720j850n18Q01J096J126K108M136O410Q076Q349O894M618
53737D11356L245L356L683K948J655J294K352L855M482L566J466n47j118j2J616
53722D43197K290J309j098m010o111o589n935n246m660l429j631n46p91j312j055
53707D04383n49q14j599j986k116k950m469n388m855l556k816l197m060m273l261
$$ plain form
53692 358494 356844 356063 354786 352439 349741 347851 347360 347989 348878 349137 348491 347447 346613 345997 345314 344710 344598
53675 344598 345024 345872 347499 350268 353481 355820 357076 358465 360935 364168 367675 371746 376450 380617 382898
53660 382898 383359 383151 383121 383678 385431 388593 391932 393620 393417 393063 394260 397197 401278 406164 411416 416045
53644 416045 419487 422680 427090 432640 437491 440323 442269 445833 451923 458563 462978 464592 465336 467103
53630 467103 469805 472331 474515 477117 480282 483180 485238 486642 487370 486860 485289 484206 484858 486324 486380
53615 486380 484041 480403 477009 474240 471514 468348 464876 461728 459608 458691 458370 458040 458113 459634 462664
53600 462664 465716 467275 467398 467280 467638 468228 468751 469424 470460 471539 472225 472626 473204 473942 474115 473240 472139
53583 472139 472490 475009 478457 481109 482909 485318 488979 492673 495087 496482 497603 497876 496254 493547 492258
$$ packed form
53692C58494j650p81j277k347k698j890m91O29Q89K59o46j044q34o16o83o04j12
53675C44598M26Q48J627K769L213K339J256J389K470L233L507M071M704M167K281
53660C82898M61k08l0N57J753L162L339J688k03l54J197K937M081M886N252M629
53644D16045L442L193M410N550M851K832J946L564O090O640M415J614P44J767
53630D67103K702K526K184K602L165K898K058J404P28n10j571j083O52J466N6
53615D86380k339l638l394k769k726l166l472l148k120r17l21l30P3J521L030
53600D62664L052J559J23j18L58N90N23O73J036J079O86M01N78P38J73q75j101
53583D72139L51K519L448K652J800K409L661L694K414J395J121K73j622k707j289
$$ plain form
53568 492258 493770 497012 500359 503535 506802 509465 510647 511130 513132 518108 525498 533664 541338 548015
53554 548015 553651 558491 563042 567879 573282 578898 583846 587539 590559 594287 599391 605062 610133 614449
53540 614449 618597 622703 626285 629178 631837 634642 637455 639977 642026 643387 643734 642798 640483 637063 633559
53525 633559 631416 631128 631549 631341 630727 630730 630987 629877 627123 624687 624266 625222 626096 627111 629695 634079 638861
53508 638861 642714 645179 645789 643958 640327 637070 635955 636623 637368 637131 636106 634821 633524 632501 632312
53493 632312 633280 635063 637043 639106 641745 645324 649522 653783 658139 663135 668887 674658 679701 684305
53479 684305 689724 697201 707132 718902 731447 744294 758145 773822 790545 806143 819669 832894
53467 832894 848155 865423 882889 900060 918528 939489 962203 985575 1009799 1035459 1062215
$$ packed form
53568D92258J512L242L347L176L267K663J182M83K002M976P390Q166P674O677
53554E48015N636M840M551M837N403N616M948L693L020L728N104N671N071M316
53540F14449M148M106L582K893K659K805K813K522K049J361L47r36k315l420l504
53525F33559k143k88M21k08o14LK57j110k754k436m21R56Q74J015K584M384M782
53508F38861L853K465O10j831l631l257j115O68P45k37j025j285j297j023j89
53493F32312R68J783J980K063K639L579M198M261M356M996N752N771N043M604
53479F84305N419P477R931J1770J2545J2847J3851J5677J6723J5598J3526J3225
53467H32894J5261J7268J7466J7171J8468K0961K2714K3372K4224K5660K6756
$$ plain form
53456 1062215 1089558 1118022 1148458 1180772 1214563 1250333 1288684 1328663 1368419 1407508 1447209
53445 1447209 1488383 1530165 1571100 1610602 1648931 1686582 1724007 1761127 1796942 1830463 1862253
53434 1862253 1894128 1927046 1960227 1992631 2024185 2055160 2085596 2116046 2147512 2179545 2209615
53423 2209615 2235746 2258977 2281766 2304679 2326299 2345905 2364299 2381868 2397696 2411050 2422171
53412 2422171 2430826 2435388 2434446 2428606 2419806 2409315 2396981 2381988 2363798 2342697 2319783 2296063
53400 2296063 2271462 2245326 2217957 2190716 2164151 2137047 2107987 2077087 2045382 2013290 1980745
53389 1980745 1948412 1917681 1889432 1863421 1838726 1814269 1789344 1764377 1740989 1720679 1703715
53378 1703715 1689708 1678626 1670303 1663677 1657804 1653396 1651916 1653131 1655164 1657471 1662345 1672476 1688008
$$ packed form
53456A062215K7343K8464L0436L2314L3791L5770L8351L9979L9756L9089L9701
53445A447209M1174M1782M0935L9502L8329L7651L7425L7120L5815L3521L1790
53434A862253L1875L2918L3181L2404L1554L0975L0436L0450L1466L2033L0070
53423B209615K6131K3231K2789K2913K1620J9606J8394J7569J5828J3354J1121
53412B422171Q655M562r42n840q800j0491j2334j4993j8190k1101k2914k3720
53400B296063k4601k6136k7369k7241k6565k7104k9060l0900l1705l2092l2545
53389A980745l2333l0731k8249k6011k4695k4457k4925k4967k3388k0310j6964
53378A703715j4007j1082q323o626n873m408j480J215K033K307M874J0131J5532
$$ plain form
53365 1688008 1707007 1728074 1751267 1776810 1804236 1833105 1863559 1895672 1928808 1962381 1997160
53354 1997160 2035166 2077947 2125115 2174867 2225826 2278019 2332130 2388396 2446554 2506430 2568081
53343 2568081 2631578 2697098 2765126 2836172 2910416 2987820 3068216 3150832 3234187 3317161 3399956
53332 3399956 3483400 3567572 3651830 3735775 3819176 3901168 3980664 4057514 4131971 4202926 4268139
53321 4268139 4326758 4380190 4429724 4474553 4513163 4545524 4572525 4594052 4609029 4616947 4617969 4611821
53309 4611821 4597808 4575816 4546120 4508255 4461234 4405043 4340942 4270292 4194079 4113499 4029789
53298 4029789 3943302 3854028 3763296 3673609 3586168 3499899 3413808 3328996 3247078 3167575 3088547
53287 3088547 3009422 2931518 2855764 2781587 2708633 2638178 2571747 2509154 2449039 2391005 2336072
$$ packed form
53365A688008J8999K1067K3193K5543K7426K8869L0454L2113L3136L3573L4779
53354A997160L8006M2781M7168M9752N0959N2193N4111N6266N8158N9876O1651
53343B568081O3497O5520O8028P1046P4244P7404Q0396Q2616Q3355Q2974Q2795
53332C399956Q3444Q4172Q4258Q3945Q3401Q1992P9496P6850P4457P0955O5213
53321D268139N8619N3432M9534M4829L8610L2361K7001K1527J4977P918J022o148
53309D611821j4013k1992k9696l7865m7021n6191o4101p0650p6213q0580q3710
53298D029789q6487q9274r0732q9687q7441q6269q6091q4812q1918p9503p9028
53287C088547p9125p7904p5754p4177p2954p0455o6431o2593o0115n8034n4933
$$ plain form
53276 2336072 2285013 2237302 2192169 2149978 2111819 2077984 2047489 2019104 1992362 1967431 1944374
53265 1944374 1922831 1902265 1882423 1863634 1846677 1832108 1819770 1809319 1801163 1796149 1794040 1793090
53253 1793090 1791881 1791115 1792776 1797838 1805750 1815947 1828513 1843069 1858298 1873399 1889232 1907247
53241 1907247 1927938 1951185 1977336 2006671 2038161 2070180 2102591 2136867 2173775 2212085 2250207
53230 2250207 2288043 2326311 2364805 2402477 2438806 2473884 2507242 2537770 2565045 2589725 2612090
53219 2612090 2630974 2644744 2652903 2656191 2655476 2651063 2642771 2630269 2613619 2593822 2572295 2549224
53207 2549224 2522956 2491919 2456803 2419743 2381439 2340380 2295354 2247500 2198979 2150433 2100849
53196 2100849 2049568 1997360 1945521 1894779 1845305 1797091 1750036 1704116 1659638 1616857 1575045
$$ packed form
53276B336072n1059m7711m5133m2191l8159l3835l0495k8385k6742k4931k3057
53265A944374k1543k0566j9842j8789j6957j4569j2338j0451q156n014k109r50
53253A793090j209p66J661N062P912J0197J2566J4556J5229J5101J5833J8015
53241A907247K0691K3247K6151K9335L1490L2019L2411L4276L6908L8310L8122
53230B250207L7836L8268L8494L7672L6329L5078L3358L0528K7275K4680K2365
53219B612090J8884J3770Q159L288p15m413q292j2502j6650j9797k1527k3071
53207B549224k6268l1037l5116l7060l8304m1059m5026m7854m8521m8546m9584
53196B100849n1281n2208n1839n0742m9474m8214m7055m5920m4478m2781m1812
$$ plain form
53185 1575045 1532454 1487808 1441790 1396665 1354433 1315617 1279870 1247147 1217600 1190300 1162859
53174 1162859 1133195 1101834 1071920 1046582 1026376 1009367 993276 977172 961248 945572 929484
53163 929484 912313 894526 877761 863322 850730 838129 824109 808697 792724 776985 762232
53152 762232 749117 737533 726641 716140 706791 698938 691167 681601 670165 658434 647403 636664
53140 636664 625805 615264 605422 596002 586987 579035 572299 565724 558337 550452 542719 534813 526243 517961
53126 517961 511760 508034 505294 502112 498583 495509 493048 490758 488395 486020 483648 481319 479252 477445
53112 477445 475268 472007 467807 463610 460073 457007 454111 451768 450573 450295 449950 448929 447428 445595 443007
53097 443007 439597 436524 435234 435784 436823 437218 436902 436073 434490 432022 429289 427217 426179 425798 425256 423766
$$ packed form
53185A575045m2591m4646m6018m5125m2232l8816l5747l2723k9547k7300k7441
53174A162859k9664l1361k9914k5338k0206j7009j6091j6104j5924j5676j6088
53163I29484j7171j7787j6765j4439j2592j2601j4020j5412j5973j5739j4753
53152G62232j3115j1584j0892j0501r349p853p771r566j1436j1731j1031j0739
53140F36664j0859j0541r842r420r015p952o736o575p387p885p733p906q570q282
53126E17961o201l726k740l182l529l074k461k290k363k375k372k329k067j807
53112D77445k177l261m200m197l537l066k896k343j195k78l45j021j501j833k588
53097D43007l410l073j290N50J039L95l16q29j583k468k733k072j038l81n42j490
$$ plain form
53081 423766 421317 419121 418563 419402 419826 418688 416842 415591 414799 413636 412414 412276 413296 414264 414516 414813
53065 414813 416138 418540 421469 424351 426526 427442 427351 427172 427235 426777 425094 422653 420630 419749 419876 420310 420226
53048 420226 419276 417970 417069 416604 416158 416013 416842 417947 417212 413751 409508 407020 406373 405679 403927 401820
53032 401820 400026 398191 395940 393567 391372 389349 387844 387478 388108 388860 389572 391053 393413 395342 395900
53017 395900 395928 396561 397261 396737 395264 394541 395256 396187 396065 395253 395170 396800 400050 403786 406129 405438 401643
53000 401643 396329 391372 387910 386539 387491 390073 392722 394338 395176 395964 396809 397574 398577 399917 400620 399614
52984 399614 397399 395538 394448 392917 390199 387470 386431 387205 388363 388507 387163 384635 381798 379872 379508
52969 379508 380015 379946 378536 376177 373656 371526 370257 370241 371262 372370 372747 372495 372236 372116 371591 370191 368092
$$ packed form
53081D23766k449k196n58Q39M24j138j846j251p92j163j222j38J020R68K52K97
53065D14813J325K402K929K882K175R16r1j79O3m58j683k441k023q81J27M34q4
53048D20226r50j306r01m65m46j45Q29J105p35l461m243k488o47o94j752k107
53032D01820j794j835k251k373k195k023j505l66O30P52P12J481K360J929N58
53017C95900K8O33P00n24j473p23P15R31j22q12q3J630L250L736K343o91l795
53000D01643n314m957l462j371R52K582K649J616Q38P88Q45P65J003J340P03j006
52984C99614k215j861j090j531k718k729j039P74J158J44j344k528k837j926l64
52969C79508N07o9j410k359k521k130j269j6J021J108L77k52k59j20n25j400k099
$$ plain form
52952 368092 365851 363982 363101 364091 367384 371903 375335 376051 374548 372583 371123 369837 368435 367533 367744
52937 367744 368713 369701 370647 371911 373350 374452 375247 376225 377322 377788 377389 377048 377881 380027 382801 385550
52921 385550 387994 390071 391948 393977 396186 397975 398760 398825 399084 400026 401322 402513 403621 404921 406539
52906 406539 408574 411216 414269 416741 417519 416605 415210 414428 414179 413787 413142 412712 412589 412240 411272 409748 407511
52889 407511 403856 398483 392387 387206 383809 381924 380787 379622 377819 375456 373637 373526 374870 376173
52875 376173 376528 376557 377186 378240 378927 379173 379631 380503 381083 380599 379097 377312 376001 375425 375254 374880 373938 372542
52857 372542 371025 369626 368617 368463 369460 371239 372973 374098 374635 374813 374675 374208 373707 373820 375040 376937
52841 376937 378004 376772 373438 370026 368439 368614 369189 369711 371126 373802 376250 376754 375727 375246 376354
$$ packed form
52952C68092k241j869q81R90L293M519L432P16j503j965j460j286j402r02K11
52937C67744R69R88R46J264J439J102P95R78J097M66l99l41Q33K146K774K749
52921C85550K444K077J877K029K209J789P85O5K59R42J296J191J108J300J618
52906D06539K035K642L053K472P78r14j395p82k49l92o45m30j23l49r68j524k237
52889D07511l655n373o096n181l397j885j137j165j803k363j819j11J344J303
52875C76173L55K9O29J054O87K46M58Q72N80m84j502j785j311n76j71l74r42j396
52857C72542j517j399j009j54R97J779J734J125N37J78j38m67n01J13J220J897
52841C76937J067j232l334l412j587J75N75N22J415K676K448N04j027m81J108
$$ plain form
52826 376354 377956 378710 378858 379394 380207 380282 379497 378931 379129 379117 377806 375630 374025 373738 374474 375931 378185
52809 378185 380907 383025 383596 382777 381740 381851 383817 387203 390761 393608 396080 398967 401981 403610 402586
52794 402586 398948 393662 388015 383483 381160 380665 380282 378866 377004 375785 375125 374175 372677 370902 368669
52779 368669 365644 362568 360970 361502 363349 365462 367474 369217 370297 370686 371046 371920 373031 373755 373867 373417
52763 373417 372331 370572 368517 366765 365708 365376 365547 365930 366508 367657 369555 371578 372922 373940 376052
52748 376052 379993 384842 389214 392724 395569 397222 396560 393267 388409 383518 379555 376737 374841 373448
52734 373448 372144 370615 368558 365678 362077 358475 355769 354413 354395 355589 357702 359927 361179 360981 359995
52719 359995 359470 360109 361443 362344 362159 361227 360181 359036 357442 355727 354998 355823 357347 358201 358057 357875 358795
$$ packed form
52826C76354J602P54J48N36Q13P5p85n66J98j2j311k176j605k87P36J457K254
52809C78185K722K118N71q19j037J11J966L386L558K847K472K887L014J629j024
52794D02586l638n286n647m532k323m95l83j416j862j219o60r50j498j775k233
52779C68669l025l076j598N32J847K113K012J743J080L89L60Q74J111P24J12m50
52763C73417j086j759k055j752j057l32J71L83N78J149J898K023J344J018K112
52748C76052L941M849M372L510K845J653o62l293m858m891l963k818j896j393
52734C73448j304j529k057k880l601l602k706j356j8J194K113K225J252j98r86
52719C59995n25O39J334R01j85r32j046j145j594j715p29Q25J524Q54j44j82R20
$$ plain form
52702 358795 361117 364164 366773 367969 367474 365705 363383 361364 360601 361560 363513 365056 365584 365571 365168 363650
52686 363650 361009 359009 359357 361438 363258 364257 365656 368085 370479 371691 371906 371911 372132 372977 374995 377942
52670 377942 380681 382741 385017 388066 390774 391899 392133 393103 394765 395371 394048 391895 390081 388174 385209
52655 385209 381528 378546 376975 376064 374666 372580 370704 370102 371009 372666 373953 374076 372772 370325 367686
52640 367686 366205 366643 368424 370263 371446 372097 372340 371991 371259 371088 372218 374252 376095 377118 377509 377686
52624 377686 377824 377939 378044 378116 378092 377905 377400 376337 374632 372563 370629 369330 369186 370513 372715 374105 373247
52607 373247 370597 368219 367677 368845 371133 374829 380254 386100 389988 390958 390386 390071 390363 390780 391536 393342
52591 393342 396133 399116 402004 405153 408328 410327 410237 408357 405443 401835 397955 394984 394047 394842 395869
$$ packed form
52702C58795K322L047K609J196m95j769k322k019p63R59J953J543N28j3m03j518
52686C63650k641k000L48K081J820R99J399K429K394J212K15NK21Q45K018K947
52670C77942K739K060K276L049K708J125K34R70J662O06j323k153j814j907k965
52655C85209l681k982j571r11j398k086j876o02R07J657J287J23j304k447k639
52640C67686j481M38J781J839J183O51K43l49p32j71J130K034J843J023L91J77
52624C77686J38J15J05P2k4j87n05j063j705k069j934j299j44J327K202J390q58
52607C73247k650k378n42J168K288L696N425N846L888R70n72l15K92M17P56J806
52591C93342K791K983K888L149L175J999r0j880k914l608l880k971r37P95J027
$$ plain form
52576 395869 396079 395741 395643 396089 396939 398148 399811 401835 403927 406007 408445 411586 414886 416784 416044 413473
52560 413473 411693 412522 414805 415598 413528 410220 408134 407738 407405 405698 402965 400680 399777 399920 400041 399308
52544 399308 397620 395424 393253 391567 390920 391858 394301 397153 398949 399133 398523 398381 399137 400242 401140 402067
52528 402067 403708 406260 409143 411752 414228 417143 420439 423050 423904 423080 421554 419874 417738 415136 413226
52513 413226 413292 415020 416687 417167 416974 416966 416917 416094 414676 413542 412836 411781 410059 408444 407676 407421 406880 405875
52495 405875 404861 404226 404087 404361 404568 403872 401928 399477 397598 396627 396324 396791 398359 400603 402362 403078
52479 403078 403473 404487 406030 407211 407470 407044 406537 406450 407015 408084 409072 409364 408909 408311 408151 408296 408008 406858
52461 406858 405364 404545 404831 405686 406360 406686 406885 406946 406670 406294 406572 408042 410412 412811 414600 415910 417393
$$ packed form
52576C95869K10l38r8M46Q50J209J663K024K092K080K438L141L300J898p40k571
52560D13473j780Q29K283P93k070l308k086l96l33j707k733k285r03J43J21p33
52544C99308j688k196k171j686o47R38K443K852J796J84o10j42P56J105Q98R27
52528D02067J641K552K883K609K476K915L296K611Q54q24j526j680k136k602j910
52513D13226O6J728J667M80j93qm9q23j418j134p06j055j722j615p68k55n41j005
52495D05875j014o35j39K74K07o96j944k451j879r71l03M67J568K244J759P16
52479D03078L95J014J543J181K59m26n07q7N65J069R88K92m55n98j60J45k88j150
52461D06858j494q19K86Q55O74L26J99O1k76l76K78J470K370K399J789J310J483
$$ plain form
52444 417393 419346 421138 421855 421625 421768 423286 425622 427471 428406 428930 429235 428924 427945 426810 425627 423922
52428 423922 421915 420986 422018 423861 424402 423011 421164 420648 421759 423416 424663 425802 427993 431717 435802
52413 435802 438440 439107 438844 438491 437570 435501 433152 432138 432968 434745 436508 437971 439114 440143 441968
52398 441968 445683 451061 456311 459744 461148 461202 460291 458494 456105 453362 449868 445078 439354 433997 430118
52383 430118 427854 426702 426098 425543 424627 423364 422303 421872 421641 420607 418357 415659 413668 412792 412615 412722
52367 412722 413072 413637 414319 415438 417632 420770 423447 424256 423417 422620 423467 426596 432010 439328 447633 455870
52351 455870 463726 471560 479369 486571 493113 500001 508112 517001 525389 532309 537080 538716 536352 530350
52337 530350 522322 513973 506264 499474 493348 487244 480849 474979 471002 469237 468477 467483 466484 466671 468474
$$ packed form
52444D17393J953J792P17k30J43J518K336J849R35N24L05l11r79j135j183j705
52428D23922k007r29J032J843N41j391j847n16J111J657J247J139K191L724M085
52413D35802K638O67k63l53r21k069k349j014Q30J777J763J463J143J029J825
52398D41968L715N378N250L433J404N4r11j797k389k743l494m790n724n357l879
52383D30118k264j152o04n55r16j263j061m31k31j034k250k698j991q76j77J07
52367D12722L50N65O82J119K194L138K677Q09q39p97Q47L129N414P318Q305Q237
52351D55870P856P834P809P202O542O888Q111Q889Q388O920M771J636k364o002
52337E30350q028q349p709o790o126o104o395n870l977j765p60r94r99J87J803
$$ plain form
52322 468474 470904 472630 473408 474312 476639 480580 484958 488376 490615 492745 495858 499967 504262 508070 511307
52307 511307 514264 517357 520992 525249 529551 532927 534753 535245 535233 535549 536559 538072 539632 540957 542085
52292 542085 543117 544000 544762 545824 547830 551194 556013 562319 569926 577995 585261 591109 596186 601630 607894
52277 607894 614699 622007 630370 640104 650597 661034 671703 684122 699599 717887 737445 756832
52265 756832 775545 793613 811075 828233 846088 865826 887713 910805 933807 955923 976937
52254 976937 997079 1017122 1038051 1060030 1081876 1101988 1119658 1135263 1149599 1163582 1178180
52243 1178180 1193745 1209390 1223734 1236246 1247084 1255731 1261061 1263273 1264649 1267500 1271994 1276784 1280956
52230 1280956 1284180 1285476 1283421 1277930 1270807 1264221 1259354 1256599 1255929 1256478 1256702 1255915 1255342 1256940 1261366
$$ packed form
52322D68474K430J726P78R04K327L941M378L418K239K130L113M109M295L808L237
52307E11307K957L093L635M257M302L376J826M92j2L16J010J513J560J325J128
52292E42085J032Q83P62J062K006L364M819O306P607Q069P266N848N077N444O264
52277F07894O805P308Q363R734J0493J0437J0669J2419J5477J8288J9558J9387
52265G56832J8713J8068J7462J7158J7855J9738K1887K3092K3002K2116K1014
52254I76937K0142K0043K0929K1979K1846K0112J7670J5605J4336J3983J4598
52243A178180J5565J5645J4344J2512J0838Q647N330K212J376K851M494M790M172
52230A280956L224J296k055n491p123o586m867k755o70N49K24p87n73J598M426
$$ [...]
##END NTUPLES=NMR SPECTRUM
##END=
