
##TITLE=AC1194_MCiAH12046_5946741_v1nQO1RDBa
##JCAMPDX= 6.0         $$ Bruker NMR JCAMP-DX V2.0
##DATA TYPE= NMR SPECTRUM
##DATA CLASS= NTUPLES
##ORIGIN= BRUKER
##OWNER= Administrator
$$ 1.72 TOPSPIN		Version 2.1
$$ 2012-04-11 02:22:37.859 -0500  Administrator@TOPSPIN
$$ Compression mode = diff/dup
##.OBSERVE FREQUENCY= 400.13188235
##.OBSERVE NUCLEUS= ^1H
##.ACQUISITION MODE= SIMULTANEOUS (DQD)
##.ACQUISITION SCHEME= undefined
##.AVERAGES= 8
##.DIGITISER RES= 22
##SPECTROMETER/DATA SYSTEM= spect
##.PULSE SEQUENCE= zg30
##.SOLVENT NAME= COFFEE_meoh
##.SHIFT REFERENCE= INTERNAL, COFFEE_meoh, 1, 14.98061
##AUDIT TRAIL= $$ (NUMBER, WHEN, WHO, WHERE, PROCESS, VERSION, WHAT)
$$ ##TITLE= Audit trail, TOPSPIN		Version 2.1
$$ ##JCAMPDX= 5.01
$$ ##ORIGIN= Bruker BioSpin GmbH
$$ ##OWNER= Administrator
$$ $$ C:\Bruker\TOPSPIN/data/COFFEE/nmr/AC1194_MCiAH12046_5946741_v1nQO1RDBa/10/pdata/1/auditp.txt
$$ ##AUDIT TRAIL=  $$ (NUMBER, WHEN, WHO, WHERE, PROCESS, VERSION, WHAT)
(   1,<2012-04-11 02:22:31.062 -0500>,<Administrator>,<TOPSPIN>,<go>,<TOPSPIN 2.1>,
      <created by zg
	started at 2012-04-11 02:21:24.578 -0500,
	POWCHK enabled, PULCHK disabled,
       configuration hash MD5:
       1A 1E CE 29 27 FD 77 03 67 4E F0 E3 C4 B2 CB 90
       data hash MD5: 64K
       11 82 ED CE E6 C8 67 F2 8B 55 3F 31 EA 0E 5D 84>)
(   2,<2012-04-11 02:22:33.703 -0500>,<Administrator>,<TOPSPIN>,<proc1d>,<TOPSPIN 2.1>,
      <Start of raw data processing
       efp LB = 0 FT_mod = 6 PKNL = 1 PHC0 = 0 PHC1 = 0 SI = 32K 
       data hash MD5: 32K
       64 D8 DC B7 7A FD C4 B4 F7 D9 68 24 DF 1E F5 5D>)
(   3,<2012-04-11 02:22:34.109 -0500>,<Administrator>,<TOPSPIN>,<proc1d>,<TOPSPIN 2.1>,
      <pk PHC0 = 210.4541 PHC1 = 0 
       data hash MD5: 32K
       DD 12 3F B6 3A 19 12 AA 7C 79 25 A7 EA 3E 57 5C>)
(   4,<2012-04-11 02:22:34.234 -0500>,<Administrator>,<TOPSPIN>,<proc1d>,<TOPSPIN 2.1>,
      <abs ABSG = 1 
       data hash MD5: 32K
       07 84 69 35 02 2B 15 BF D8 70 20 47 E8 DD 7E A2>)
(   5,<2012-04-11 02:22:34.265 -0500>,<Administrator>,<TOPSPIN>,<proc1d>,<TOPSPIN 2.1>,
      <abs ABSG = 2 
       data hash MD5: 32K
       3D 59 8C B6 62 24 C4 CB 71 34 6C 04 2B EF 3D DC>)
(   6,<2012-04-11 02:22:34.281 -0500>,<Administrator>,<TOPSPIN>,<proc1d>,<TOPSPIN 2.1>,
      <abs ABSG = 3 
       data hash MD5: 32K
       44 57 3A 21 37 90 C1 4F 24 92 35 8C 89 C6 2C D4>)
(   7,<2012-04-11 02:22:34.312 -0500>,<Administrator>,<TOPSPIN>,<proc1d>,<TOPSPIN 2.1>,
      <abs ABSG = 4 
       data hash MD5: 32K
       B6 C3 F1 17 F9 E8 E1 62 6B 8D 30 24 D5 85 CC 3D>)
(   8,<2012-04-11 02:22:34.343 -0500>,<Administrator>,<TOPSPIN>,<proc1d>,<TOPSPIN 2.1>,
      <abs ABSG = 5 
       data hash MD5: 32K
       E3 41 B7 11 6E 41 87 A5 28 A4 BA BF 51 04 FE 1E>)
$$ ##END=
$$ 
$$ $$ hash MD5
$$ $$ 85 51 21 A5 8F D1 AA 36 15 83 7D B7 F7 85 F0 6D
##$RELAX= 
##$RELAX= 
##$RELAX= 
##$RELAX= 
##$RELAX= 
##$RELAX= 
##$RELAX= 
$$ Bruker specific parameters
$$ --------------------------
$$ [...]
150 150 150 150 150 150 150 150
##$TP07= 0
##$TPNAME0= <>
##$TPNAME1= <>
##$TPNAME2= <>
##$TPNAME3= <>
##$TPNAME4= <>
##$TPNAME5= <>
##$TPNAME6= <>
##$TPNAME7= <>
##$TPOAL= (0..7)
0.5 0.5 0.5 0.5 0.5 0.5 0.5 0.5
##$TPOFFS= (0..7)
0 0 0 0 0 0 0 0
##$TUNHIN= 0
##$TUNHOUT= 0
##$TUNXOUT= 0
##$USERA1= <user>
##$USERA2= <user>
##$USERA3= <user>
##$USERA4= <user>
##$USERA5= <user>
##$V9= 5
##$VALIST= <valist>
##$VCLIST= <CCCCCCCCCCCCCCC>
##$VD= 0
##$VDLIST= <DDDDDDDDDDDDDDD>
##$VPLIST= <PPPPPPPPPPPPPPP>
##$VTLIST= <TTTTTTTTTTTTTTT>
##$WBST= 1024
##$WBSW= 4
##$XGAIN= (0..3)
0 0 0 0
##$XL= 0
##$YL= 0
##$YMAX_a= 492455
##$YMIN_a= -613016
##$ZGOPTNS= <>
##$ZL1= 120
##$ZL2= 120
##$ZL3= 120
##$ZL4= 120
##$ABSF1= 14.98061
##$ABSF2= -5.57192
##$ABSG= 5
##$ABSL= 3
##$ALPHA= 0
##$AQORDER= 0
##$ASSFAC= 0
##$ASSFACI= 0
##$ASSFACX= 0
##$ASSWID= 0
##$AUNMP= <proc_prof1d_extract_pilot.lims>
##$AXLEFT= 0
##$AXNAME= <>
##$AXNUC= <1H>
##$AXRIGHT= 0
##$AXTYPE= 0
##$AXUNIT= <>
##$AZFE= 0.1
##$AZFW= 0.1
##$BCFW= 0
##$BC_mod= 0
##$BYTORDP= 0
##$COROFFS= 0
##$CY= 15
##$DATMOD= 1
##$DC= 0
##$DFILT= <>
##$DTYPP= 0
##$F1P= 0
##$F2P= 0
##$FCOR= 0.5
##$FTSIZE= 32768
##$FT_mod= 6
##$GAMMA= 0
##$GB= 0
##$INTBC= 1
##$INTSCL= 1
##$ISEN= 128
##$LB= 0
##$LEV0= 0
##$LPBIN= 0
##$MAXI= 10000
##$MC2= 0
##$MEAN= 0
##$ME_mod= 0
##$MI= 0
##$NCOEF= 0
##$NC_proc= -8
##$NLEV= 6
##$NOISF1= 0
##$NOISF2= 0
##$NSP= 0
##$NTH_PI= 0
##$NZP= 0
##$OFFSET= 14.98061
##$PC= 1
##$PHC0= 210.4541
##$PHC1= 0
##$PH_mod= 1
##$PKNL= yes
##$PPARMOD= 0
##$PPDIAG= 0
##$PPIPTYP= 0
##$PPMPNUM= 2147483647
##$PPRESOL= 1
##$PSCAL= 4
##$PSIGN= 0
##$PYNMP= <proc.py>
##$REVERSE= no
##$SF= 400.13
##$SI= 32768
##$SIGF1= 0
##$SIGF2= 0
##$SINO= 400
##$SIOLD= 32768
##$SPECTYP= <>
##$SREGLST= <1H.CDCl3>
##$SSB= 0
##$STSI= 32768
##$STSR= 0
##$SW_p= 8223.68421052632
##$SYMM= 0
##$S_DEV= 0
##$TDeff= 65536
##$TDoff= 0
##$TI= <>
##$TILT= no
##$TM1= 0
##$TM2= 0
##$TOPLEV= 0
##$USERP1= <user>
##$USERP2= <user>
##$USERP3= <user>
##$USERP4= <user>
##$USERP5= <user>
##$WDW= 1
##$XDIM= 32768
##$YMAX_p= 437426858
##$YMIN_p= -691694
##$CURPLOT= <Network HP LaserJet P1505>
##$CURPRIN= <$Network HP LaserJet P1505>
##$DFORMAT= <normdp>
##$LAYOUT= <+/1D_H.xwp>
##$LFORMAT= <normlp>
##$PFORMAT= <normpl>
##$SURQMSG= 1
$$ End of Bruker specific parameters
$$ ---------------------------------
##NTUPLES= NMR SPECTRUM
##VAR_NAME=  FREQUENCY,     SPECTRUM/REAL,   SPECTRUM/IMAG
##SYMBOL=    X,             R,               I
##VAR_TYPE=  INDEPENDENT,   DEPENDENT,       DEPENDENT
##VAR_FORM=  AFFN,          ASDF,            ASDF
##VAR_DIM=   32768,         32768,           32768
##UNITS=     HZ,            ARBITRARY UNITS, ARBITRARY UNITS
##FACTOR=    0.250966925370066, 1,           1
##FIRST=     8223.43324360095, 4615,         -142892
##LAST=      0,             -4973,           -143214
##MIN=       0,             -691694,         0
##MAX=       8223.43324360095, 437426858,    0
$$ Real data points
##PAGE= N=1
##DATA TABLE= (X++(R..R)), XYDATA
$$ [...]
$$ plain form
19486 134806 200718 -9430 68779 -148796 95344 -231742 3718 -221109 -237979 -147591 -173867
19475 -173867 -254142 -147054 -209389 76567 264819 -70028 36206 41868 228889 121838 194177
19464 194177 -296958 119935 -57629 77964 -372962 -244733 218938 46769 -217856 -69535
19453 -148396 -132097 145730 -11485 -205116 -88362 -189799 27866 -190179 -262121 -267254 -126465
19441 -272661 -15343 -53836 -91001 58946 57322 77806 -99321 -288803 -129914 -71991 -166909
19430 -166909 -120098 23954 -281152 58293 -428821 -57171 -354695 56425 -153020 -519477
19420 -519477 227742 130660 -230702 -155601 169031 -49878 -25202 190545 -281999 30726
19409 -69393 64899 -258997 192604 -126606 -30556 -255607 -148768 -41552 -89319 142463
$$ packed form
19486A34806O5912i430F8779a48796I5344b31742C718b21109j6870R0388k6276
19475a73867q0275J07088o2335G6567J88252g0028C6206N662J87021j07051P2339
19464A94177b96958A19935e7629G7964c72962J28229B18938D6769b17856f9535
19453a48396J6299A45730a1485j93631h8362j01437B7866a90179p1942n133a26465
19441b72661a5343l8493l7165E8946j624K0484i9321j89482a29914N7923r4918
19430a66909M6811B3954b81152E8293d28821e7171k97524E6425a53020l66457
19420e19477B27742r7082b30702P5101A69031d9878K4676A90545b81999C0726
19409f9393F4899b58997A92604a26606c0556k25051J06839d1552m7767A42463
$$ plain form
19398 76519 -267261 9208 -122111 -177728 526 -227327 74834 -84676 -61696 -137185 58468 -166698
19385 -232900 -184072 87309 -52499 -45664 -421708 -72458 397467 -248545 -289930 236616 -313019
19373 -48276 -60359 152190 -89007 -64639 -265191 116019 -87449 177395 -37678 23089 -194706
19361 152378 -158783 -28432 7745 262581 149524 -272169 -7075 206671 -316282 -164636
19351 -164636 -123793 -59261 -76353 5374 -333346 -225234 107497 -251941 -54728 -339828 84265
19339 -81644 -239029 -111374 121962 -234258 -71522 40776 -186657 70135 383583 -187596
19328 74305 -217746 -33826 -490887 -27476 -34808 216995 291007 -307208 -142561 -215132 70503
19316 -3689 18930 323131 -231370 -462623 -227661 266652 -76521 223177 -108708 -18975
$$ packed form
19398G6519b67261I208a22111n5617E26b27327G4834h4676K2980p5489E8468a66698
19385b32900M8828H7309e2499O835l76044g2458C97467b48545m1385B36616c13019
19373d8276j2083A52190h9007K4368k00552A16019h7449A77395c7678B3089a94706
19361A52378a58783b8432G745K54836j13057b72169g075B06671c16282J51646
19351a64636M0843e9261j7092E374c33346J08112A07497b51941e4728k85100H4265
19339h1644j57385a11374A21962b34258g1522D0776a86657G0135L13448a87596
19328G4305b17746c3826m57061b7476p332B16995P4012c07208a42561p2571G0503
19316c689A8930L04201b31370k31253b27661B66652g6521B23177a08708a8975
$$ plain form
19305 -16147 192933 -77663 -105537 -234585 242616 94355 -281372 -248332 147359 197028 10551
19293 118125 -259576 -205134 -25016 -83312 240970 -156811 112085 159987 63039 -12983 46028
19281 150477 13280 -504661 124198 -139445 121619 -162833 -240630 -204707 7725 74479 73430
19270 73430 -185236 27654 -278399 450 -147029 -257999 138289 -418182 -50423 251170 61031
19258 68468 -285207 -210659 -345169 -161505 -55273 80073 -279237 120518 -198824 -42160
19247 -52873 -201800 150094 -33958 -302655 -84951 129159 51453 74883 178540 -200522
19236 -102907 -246585 -168452 -304568 -92692 -172258 -81333 14121 12710 -446912 -326025 355927
19224 -139116 -129963 -392096 -123205 -345815 -268882 -61386 32574 -27050 99947 -71120 -19799
$$ packed form
19305a6147A92933g7663k7874j29048B42616I4355b81372L3040A47359M9669A0551
19293A18125b59576N4442b5016n8296B40970a56811A12085M7902F3039a2983D6028
19281A50477A3280e04661A24198a39445A21619a62833p7797L5923G725O6754j049
19270G3430a85236B7654b78399D50a47029j10970A38289d18182e0423B51170F1031
19258F8468b85207P4548j34510a61505e5273H0073b79237A20518a98824d2160
19247e2873j48927A50094c3958k68697h4951A29159E1453K3430J03657b00522
19236a02907j43678P8133j36116i2692p9566h1333A4121j411d46912J20887C55927
19224a39116R153k62133a23205k22610P6933f1386C2574b7050I9947g1120a9799
$$ plain form
19212 128987 -44063 96936 226609 -238912 -83279 -98434 121831 -108594 9102 -445760 304456
19200 249762 -268298 -220595 224427 -77573 -211910 70246 -56975 -67020 104363 105796 -155818
19188 87525 99070 116914 100779 348032 -6883 -279973 -7014 -35583 17701 -5786 -142469 22460
19175 352575 -104686 -264868 -174035 -657421 -81916 -125294 -77447 -260886 -222562 4736 28664
19164 28664 7720 -143436 -65416 49631 81473 23756 29301 -25201 -158407 -340690 -370492
19153 -370492 -149541 -247590 190634 -373775 -131514 38829 -26744 -112567 -92045 103862
19142 -2453 3615 96584 -149575 -370113 319525 104780 -31205 10711 22694 -18248 101658
19130 -22606 -273618 76110 -62314 -186121 -88044 770 -126575 -99320 141994 -198917 -115996
$$ packed form
19212A28987d4063I6936J29673b38912h3279j5155A21831a08594I102d45760C04456
19200B49762b68298M7703B24427g7573j34337G0246e6975j0045A04363J433a55818
19188H7525J1545J7844j6135K47253f883k73090g014k8569A7701e786j36683B2460
19175C52575a04686j60182R0833m83386h1916m3378M7847j83439L8324D736K3928
19164B8664G720a43436f5416D9631L1842B3756N545b5201j33206j82283k9802
19153c70492a49541r8049A90634c73775a31514C8829b6744q5823K0522A03862
19142b453C615R2969a49575k20538C19525A04780c1205A0711J1983a8248A01658
19130b2606k51012G6110f2314j23807h8044G70a26575K7255A41994a98917Q2921
$$ plain form
19119 -115996 74255 17694 4061 17620 -163194 -51444 -89965 325950 -113613 -112251 -210027
19108 -210027 69178 -236221 -225393 18232 87605 -50525 95715 -205947 -184125 24999 -148998
19096 -188219 -41509 14909 -186092 110811 -117397 -168364 152001 212625 -200618 328233
19085 80511 -164796 28734 109740 -110815 16252 214115 -73203 -261706 -342679 -22608 -133431
19074 -133431 -159235 -5615 -294657 -43010 370551 -170370 -215625 -408905 178180 -132495
19063 22052 153759 207439 180408 49375 -149817 -181217 214170 -43013 13161 -20476 37024
19051 -201000 -59464 -418401 -145978 -28317 99453 -291676 -59490 36475 232819 -326983
19040 42477 -238595 -214294 255239 179174 -161374 -57150 -8162 -352164 -266601 39338 -191360
$$ packed form
19119a15996G4255A7694D061J3559a63194e1444l8521C25950a13613J362r7776
19108b10027F9178b36221J0828A8232O9373e0525I5715b05947K1822B4999a48998
19096a88219d1509A4909a86092A10811a17397n0967A52001O0624b00618C28233
19085H0511a64796B8734Q1006a10815A6252J97863g3203j88503q0973b2608j10823
19074a33431k5804e615k89042d3010C70551a70370m5255j93280A78180a32495
19063B2052J31707N3680k7031D9375a49817l1400B14170d3013A3161b0476C7024
19051b01000e9464l58937a45978b8317I9453b91676e9490C6475J96344c26983
19040D2477b38595K4301B55239p6065a61374e7150h162l44002Q5563C9338a91360
$$ plain form
19028 -306324 -51942 1464 -56488 -134810 -179636 -103560 147075 -40452 388816 -4877 178075
19016 103942 -48506 -101013 -136537 -17172 25227 -120835 57263 222389 17735 104293 121327
19005 121327 -421486 50379 -216491 2477 -34140 -259630 171888 -139166 196748 178259
18995 178259 -64913 -140309 28416 -437557 -219146 -104583 295670 54687 49829 250109 44842
18983 349483 -149615 149400 -47555 236331 316951 -36640 150837 -400594 -6750 -41877 -9237
18971 -63658 -124411 -39574 -46950 -178437 108054 -144727 -284068 -295366 -279709 246720 -218652
18959 182288 507869 346285 550051 266799 -225062 -143031 -342533 99263 -163844 -183893
18949 -183893 185592 28007 -97379 -154563 -566314 6579 -124041 306997 -243228 -257569 -21350
$$ packed form
19028c06324e1942A464e6488p8322m4826P6076A47075d0452C88816d877A78075
19016A03942d8506n2507l5524a7172B5227a20835E7263J65126A7735Q6558J7034
19005A21327d21486E0379b16491B477c4140k25490A71888a39166A96748j8489
18995A78259f4913p5396B8416d37557K18411a04583B95670E4687m858K00280D4842
18983C49483a49615A49400d7555B36331Q0620c6640A50837d00594f750l5127i237
18971f3658o0753c9574p376j31487A08054a44727j39341j1298J5657B46720b18652
18959A82288L25581j61584K03766B66799b25062Q2031j99502I9263a63844k0049
18949a83893A85592B8007i7379n7184m11751F579a24041C06997b43228j4341b1350
$$ plain form
18937 -85719 -144483 -188614 -58926 154288 -126163 -236716 62177 14362 -189662 8891 -91909
18925 -37541 -171700 -237725 -416484 -105032 -40530 -51697 362039 59335 32103 -52963 370297
18913 -47113 -3305 -17022 78958 221510 -75418 15961 260430 -240214 -161966 -138713 -52590
18901 -120348 37215 76160 278551 11708 422167 107960 458998 387459 355323 16263 214295
18890 214295 -26709 -189383 -260904 -103161 -169273 156054 -101205 -168708 -7028 371075 82348
18878 1082 -100240 164942 -44068 -97226 -344927 -109160 18169 -70334 10502 -46409 32170
18866 80960 101655 -44675 -295858 -7983 -66508 74341 32336 -564970 -110271 165973 76877
18854 -189015 -378054 241757 335458 -154815 62558 105353 110753 -35577 -73095 -112524 -75301
$$ packed form
18937h5719n8764m4131e8926A54288a26163j10553F2177A4362a89662H891i1909
18925c7541j34159o6025j78759a05032d0530j1167C62039E9335k7232e2963C70297
18913d7113c305j3717G8958J42552g5418A5961K44469b40214P8248K3253e2590
18901a20348C7215L8945K02391A1708M10459A07960L51038p1539l2136A6263J98032
18890B14295b6709j62674p1521a03161o6112A56054a01205o7503g028C71075H2348
18878A082a00240A64942d4068n3158k47701a09160A8169g0334A0502d6409C2170
18866H0960K0695d4675k51183g983n8525G4341C2336e64970a10271A65973G6877
18854a89015j89039B41757R3701a54815F2558M2795N400c5577l7518l9429L7223
$$ plain form
18843 -75301 -191909 69523 -514852 65319 -291010 -39701 410109 209837 -390371 -122892
18832 241282 81158 117111 370487 -147314 413714 56207 246697 22957 -207300 -81781
18821 38887 -136946 56874 -160678 244184 -120900 127285 -105340 82614 121306 -48612
18810 118191 100464 187296 -59801 46284 96935 -44038 64105 386034 115319 45434 111219
18799 111219 -74066 59075 302812 -55671 -81390 161718 196376 332399 152248 202504 -269546
18787 -63221 -192318 290589 -96889 -219366 -108483 -3891 -49517 102551 48722 -136674 7960
18775 46571 -205401 34766 399797 -321316 -73025 168749 243001 18899 81304 -89052 -110562
18764 -110562 -250468 56041 246978 -90813 -195740 173432 -432251 -376331 -117948 196996
$$ packed form
18843g5301j16608F9523e14852F5319b91010c9701D10109k00272c90371a22892
18832B41282H1158L5953K53376a47314D13714E6207J90490B2957b07300h1781
18821C8887a36946E6874a60678B44184a20900A27285a05340H2614L8692d8612
18810A18191j7727Q6832e9801D6284N0651d4038F4105L21929A15319D5434O5785
18799A11219g4066E9075K43737e5671k5719A61718L4658J36023A52248N0256b69546
18787f3221j29097B90589i6889j22477a08483c891m5626A02551D8722a36674G960
18775D6571b05401C4766L65031c21316g3025A68749P4252A8899O2405h9052k1510
18764a10562j39906E6041J90937i0813j04927A73432d32251N5920a17948A96996
$$ plain form
18753 31167 10707 59309 -204202 31149 -12977 -113645 18948 -82070 2055 -8580 -84286 6089
18740 -100735 31081 190039 -75924 -45828 -108890 -105749 -59293 137879 -113039 -185337 289019
18728 -159897 -49853 14141 -191697 -57820 176903 90638 30834 -199063 -229979 -43682 -219046
18717 -219046 -194489 -20199 -108629 -25996 9877 -177818 -344399 183977 52667 -284681 -83161
18705 37142 -183898 49335 -293261 -319696 53285 -6457 -97940 84488 -550 -536336 -317702
18694 -317702 -184836 -153632 -283212 -5655 -303366 -20105 -11680 -217530 -69531 149073 183286
18683 183286 150214 84079 -189001 99773 -554063 -51803 -58028 97244 -295111 66159 -262349
18671 -98253 6908 136947 -196964 -72830 -85443 -409655 -125894 -356688 -91868 86039 -156480
$$ packed form
18753C1167A0707M8602b04202C1149a2977j00668A8948h2070B055h580p5706F089
18740a00735C1081J58958g5924L0096o3062L141M6456A37879a13039p2298B89019
18728a59897d9853A4141a91697e7820A76903q6265C0834a99063l0916d3682j75364
18717b19046K4557b0199q8430b5996I877a77818j66581A83977E2667b84681h3161
18705C7142a83898D9335b93261k6435E3285f457r1483H4488e50n35786K18634
18694c17702J32866L1204j29580e655k97711b0105Q425k05850f9531A49073L4213
18683A83286l3072o6135a89001I9773e54063e1803o225I7244b95111F6159b62349
18671i8253F908J30039a96964g2830j2613l24212a25894k30794i1868H6039a56480
$$ plain form
18659 -22796 -183325 -69098 36397 218389 -500336 -352555 -69994 -87093 -301254 -61881 -191199
18648 -191199 -66970 -239190 -373020 -266469 -38527 -48707 135009 -170928 -8361 328843
18637 -18705 270471 156980 -233650 -57837 4787 75141 152410 -197524 -78048 216203 -365859
18625 308463 -430147 297528 -91606 -17848 194772 -144622 -48638 -218613 -96305 10215
18614 -15401 140321 -23338 -133168 -66561 40838 274852 -281228 -103644 4904 -142807 38913
18602 226944 -206702 57806 -347451 -146800 -394144 -211390 -114294 120504 -90306 -354732
18592 -354732 -251653 106539 118394 -13603 -95804 -28068 55722 -153459 83809 104924 115066
18581 115066 -301465 55005 102418 138638 220256 -307075 199455 -119823 147954 -104917
$$ packed form
18659b2796j60529f9098C6397J81992e00336J47781f9994j7099k14161f1881j29318
18648a91199f6970j72220j33830J06551c8527j0180A35009a70928h361C28843
18637a8705B70471j13491b33650e7837D787P0354P7269a97524g8048B16203c65859
18625C08463d30147B97528i1606a7848A94772a44622d8638j69975i6305A0215
18614a5401A40321b3338j09830f6561D0838K34014b81228a03644D904a42807C8913
18602B26944b06702E7806c47451a46800k47344J82754R7096A20504i0306k64426
18592c54732J03079A06539J1855a3603q2201b8068E5722a53459H3809K1115J0142
18581A15066c01465E5005M7413L6220Q1618c07075A99455a19823A47954a04917
$$ plain form
18570 49508 -291614 37957 -191806 236366 28598 191610 -123515 -208419 -64412 -229844
18560 -229844 49520 65615 -126406 -248371 -119545 -151932 45903 -104928 111356 -200630
18549 1521 -181045 -156928 28807 179505 -137553 -50999 -135027 -75775 32643 13753 217130
18538 217130 141441 -370398 -315257 70925 -23786 -115326 83763 80644 45525 -153521 -350074
18527 -350074 194340 -302326 119659 -284284 -223567 215555 41400 -175272 20643 -193293
18516 -205766 32189 -63137 -79622 -131575 -292116 224705 18719 -374043 -66341 209019 -30245
18504 -352879 258673 -62290 56830 -195670 -406727 -336901 -380733 -15703 -462085 302624
18493 -197526 -59589 -44558 166560 -27355 91193 147497 10489 179088 -90984 -98152 167556
$$ packed form
18570D9508b91614C7957a91806B36366B8598J63012a23515q4904f4412j65432
18560b29844D9520J6095a26406j21965a19545l2387D5903a04928A11356b00630
18549A521a81045K4117B8807J50698a37553e0999q4028N9252C2643A3753K03377
18538B17130p5689c70398N5141G0925b3786r1540H3763l119l5119a53521j96553
18527c50074A94340c02326A19659b84284O0717B15555D1400a75272B0643a93293
18516b05766C2189f3137j6485n1953j60541B24705A8719c74043f6341B09019c0245
18504c52879B58673f2290E6830a95670k11057O9826m3832a5703m46382C02624
18493a97526e9589J5031A66560b7355I1193N6304A0489J68599i0984p168A67556
$$ plain form
18481 -86771 131541 -16507 -285946 -221756 -387426 116377 -326112 -193955 -138922 -130289 -202256
18470 -202256 -82303 -114553 -13232 -45437 -111883 -161741 -122111 161208 169 -164647 141393
18458 -145261 349684 -235682 140608 -55915 -86324 9228 -92486 1063 95438 -137079 -202711
18447 -202711 16278 -130216 57299 94890 -378380 -59783 -109127 -62697 82702 62205 163971
18436 163971 -245717 -68851 63286 146415 -59722 38380 68500 -155566 -41013 89738 44843
18424 -110910 -98309 150748 218182 -229778 -302951 -141495 -74162 146649 -36634 -209416
18414 -209416 -39808 11072 65526 90096 509555 -69606 -315289 119435 7098 -319725 251072
18402 -255137 -172981 -12378 59883 -64301 -96798 169034 60435 37061 -103340 -47801 153764
$$ packed form
18481h6771A31541a6507k69439O4190j65670A16377c26112J32157N5033Q633p1967
18470b02256h2303l2250a3232l2205o6446m9858L9630A61208A69a64647A41393
18458a45261C49684b35682A40608e5915l0409I228i2486A063R4375a37079o5632
18447b02711A6278a30216E7299L7591c78380e9783m9344M6430H2702k0497J01766
18436A63971b45717f8851F3286Q3129e9722C8380L0120a55566d1013H9738D4843
18424a10910J2601A50748O7434b29778p3173a41495O7333A46649c6634j72782
18414b09416c9808A1072N4454K4570M19459f9606k45683A19435G098c19725B51072
18402b55137Q2156a2378E9883f4301l2497A69034F0435k3374a03340d7801A53764
$$ plain form
18390 34427 -78249 -124030 270184 67415 370621 251425 -111323 -103772 16499 40405 -30764
18378 70802 -65133 -370165 -45414 307904 224377 124448 -29342 113957 101808 -75483 111197
18366 -208024 96005 -1175 -205090 38521 22603 -132876 64963 -68227 -153836 56658 -312865
18354 -8851 -367630 -24572 -174351 -94290 121988 -396677 228481 -230326 26875 174086
18344 174086 129005 -85858 -125955 145540 -12663 -86679 -68143 351630 15625 -14720 -85096
18333 -85096 21460 -284099 -26849 148134 39498 -219734 60946 239345 -185604 57481 -372291
18321 108153 -61030 132357 -196214 -154440 350444 -307371 30366 15449 -29230 123267
18310 36369 158232 -273339 -173092 -316923 263128 -234528 56159 -24308 -166482 50490
$$ packed form
18390C4427g8249m5781B70184F7415L03206j19196a11323P551A6499K3906c0764
18378G0802f5133l05032d5414C07904q3527r9929b9342A13957j2149g5483A11197
18366b08024I6005a175k03915C8521j5918a32876F4963f8227q5609E6658c12865
18354h851l58779b4572j49779Q0061A21988c96677B28481b30326B6875J47211
18344A74086m5081h5858m0097A45540a2663p4016J8536C51630A5625a4720p0376
18333h5096B1460b84099b6849A48134C9498b19734F0946J78399a85604E7481c72291
18321A08153f1030A32357a96214M1774C50444c07371C0366j4917b9230A23267
18310C6369J21863b73339J00247j43831B63128b34528E6159b4308j42174E0490
$$ plain form
18299 193680 -183498 -127925 105321 82239 -115546 -40163 77289 108271 26132 -89749 -34041
18287 -94956 -180758 -265849 357824 23569 167906 32330 -352847 73260 -129292 -23120 1111
18275 -457459 122757 266639 286934 -94433 234911 30784 14690 61642 -19659 94105 264524
18264 264524 -6931 99948 48695 -196371 10386 -265112 144025 -188407 -210105 -173734 -264630
18253 -264630 163460 -38760 -153062 40420 -120029 -86917 206237 -219357 42746 -170330
18242 419950 -249445 -108578 191594 71952 28898 79377 136174 -249935 -47991 -45369 120734
18230 -155388 280938 338520 64249 249425 -86223 -322767 116692 312084 4018 15180 -298389
18218 -213477 132594 -303980 -149513 69328 -103549 14795 -303500 69323 -26562 -24711 14350
$$ packed form
18299A93680a83498N5573A05321k3082a15546d0163G7289L0982B6132h9749c4041
18287i4956q5802q5091C57824B3569J44337C2330c52847G3260a29292b3120A111
18275d57459A22757J43882K0295i4433B34911C0784A4690M6952a9659I4105J70419
18264B64524f931I9948D8695a96371A0386b65112A44025a88407k1698L6371r0896
18253b64630A63460c8760j14302D0420a20029L3112B06237b19357D2746a70330
18242D19950b49445a08578A91594G1952B8898N0479N6797b49935d7991K622A20734
18230a55388B80938N7582F4249J85176h6223k36544A16692J95392D018J1162b98389
18218b13477A32594c03980a49513F9328a03549A4795c03500F9323b6562J851A4350
$$ plain form
18206 -86843 86698 -242373 -149830 372816 -126531 -526 -50179 19474 152235 -61775 -55373
18195 -55373 -413164 120870 74434 -100141 380508 -62102 -117735 -227378 -268382 -239377 -192184
18184 -192184 179989 -183479 -138868 -77010 -39147 155527 -32793 130380 -17156 -137646
18174 -137646 213596 94619 -21268 436136 -18060 -62938 -44549 -119353 84435 -46493 -204035
18163 -204035 175416 -76641 135675 380046 158521 -148190 -209414 15404 -50130 -59988 -39258
18152 -39258 -202999 -53949 75934 191290 423077 83124 -35851 273532 -228004 117664
18141 11851 -72536 275379 -117814 -211853 -190070 -124527 -167830 -21241 -24359 147878 -311032
18129 291599 59590 -200023 -7874 91181 -268082 170485 92041 80501 31047 -165163 41716
$$ packed form
18206h6843H6698b42373R2543C72816a26531e26m9653A9474J32761f1775O402
18195e5373l57791A20870m6436a00141C80508f2102n5633j09643m1004K9005M7193
18184a92184A79989a83479M4611O1858L7863A55527c2793A30380a7156j20490
18174a37646B13596I4619b1268D36136a8060m4878J8389p4804H4435d6493j57542
18163b04035A75416g6641A35675K44371A58521a48190o1224A5404e0130r858K0730
18152c9258j63741e3949G5934J15356K31787H3124c5851B73532b28004A17664
18141A1851g2536B75379a17814r4039K1783O5543m3303b1241l118A47878c11032
18129B91599E9590b00023g874I1181b68082A70485p8444j1540C1047a65163D1716
$$ plain form
18117 264736 -72662 -302445 -264635 305958 45760 -161551 -87966 257326 219006 20048 360836
18106 360836 65790 -100872 -183606 41944 -54086 -39859 146728 78358 -34642 -46359 130904
18094 134313 -321876 -94041 200630 -59491 -128761 -8248 90010 -185623 -12670 239211 -29306
18082 -62712 237923 -31814 210763 220150 -380448 91590 198457 32723 87683 28222 121135
18071 121135 -158786 -15798 99932 -103264 36706 96262 -162169 -372202 -57067 -82352 46191
18059 -249583 -80222 -67426 241952 173375 12189 -5086 -152999 -3850 -168973 90353 131674
18048 131674 -242090 -162113 -268540 193123 107365 -267316 174724 -534 -432767 -166633
18037 216083 138699 -105144 45995 19837 -36556 -60984 113828 -130835 17201 -82350 -7165
$$ packed form
18117B64736g2662k29783L7810C05958D5760a61551P3585B57326l8320B0048L40788
18106C60836F5790a00872q2734D1944e4086J4227A46728o8370c4642j1717A30904
18094A34313c21876i4041B00630e9491o9270h248I0010a85623a2670B39211b9306
18082f2712B37923c1814B10763R387c80448I1590J06867C2723N4960B8222R2913
18071A21135a58786a5798I9932a03264C6706N9556a62169k10033e7067k5285D6191
18059b49583h0222J2796B41952o8577A2189e086j47913c850j65123I0353M1321
18048A31674b42090P9977j06427A93123q5758b67316A74724e34m32233a66633
18037B16083p7384a05144D5995A9837c6556k4428A13828a30835A7201h2350g165
$$ plain form
18025 159449 -4818 177010 63828 -116201 11768 4955 -194406 24290 132493 -104122 -88438
18014 -88438 212027 70019 409335 197340 -80654 -218806 126736 -52204 92669 96086 226668
18003 226668 263665 182821 -43741 -37408 412905 156630 -84630 -266656 -78861 -54133 121656
17991 -208028 68187 -271957 -172068 -172755 -56179 61457 -256521 -177596 -177938 294391 -391263
17979 57697 126524 -7303 -288319 157514 295557 -252057 150392 251413 -57203 115358
17968 150904 31315 -245967 93263 -8175 -209588 233833 -100395 -133767 98535 -58843 -104963
17957 -104963 -313115 45270 223120 96198 4616 9936 142212 -39342 91351 266722 -23077
17945 146150 67851 249116 197415 -224509 -395253 209703 421699 -176342 214101 156033
$$ packed form
18025A59449d818A77010F3828a16201A1768D955a94406B4290J08203a04122J5684
18014h8438B12027G0019L39316A97340h0654j38152A26736e2204I2669L417J30582
18003B26668L6997q0844d3741O333D12905A56630h4630j82026g8861K4728A21656
17991b08028F8187b71957R9889o87e6179F1457b56521P8925l42B94391c91263
17979E7697O8827g303k81016A57514J38043b52057A50392J01021e7203A15358
17968A50904C1315b45967I3263h175k01413B33833a00395l3372I8535e8843m6120
17957a04963k08152D5270J77850I6198D616N320J32276c9342I1351J75371b3077
17945A46150F7851J81265n1701b24509j70744B09703K11996a76342B14101n8068
$$ plain form
17935 156033 304494 119989 -183837 26991 -50126 20924 -118329 4456 102045 225263 -53366
17923 219381 -46831 -49276 -203116 -4932 -151303 -133554 -30208 97587 127560 -142931 -150694
17912 -150694 270280 -16720 -38219 177697 354696 -13064 -107802 166047 298484 381957
17902 381957 -179886 -97032 -21112 88910 -144195 91935 -113143 -73134 61836 -401714 -108023
17890 43599 28805 349783 32465 431391 95547 136000 -297031 157782 61770 194924 196664
17879 196664 91512 222156 50396 -144415 -173 78351 159535 -23810 -135089 -130053 -106311
17868 -106311 70543 188217 293090 -97141 -235944 -167890 151987 -25201 -111166 -122378 -69818
17857 -69818 -28309 56020 -150778 -91309 -185493 -105514 211481 -247761 61763 -216136 205476
$$ packed form
17935A56033J48461A19989a83837B6991e0126B0924a18329D456R7589J23218e3366
17923B19381d6831k445j53840d932j46371J7749c0208I7587K9973a42931p763
17912a50694B70280a6720k1499A77697J76999a3064r4738A66047J32437Q3473
17902C81957a79886Q2854b1112H8910a44195I1935a13143M0009F1836d01714a08023
17890D3599j4794L20978C2465L98926I5547M0453b97031A57782F1770J33154J740
17879A96664I1512J30644E0396a44415a73G8351Q1184b3810j11279N036K3742
17868a06311G0543J17674J04873i7141j38803O8054A51987b5201q5965j1212N2560
17857f9818b8309E6020a50778N9469r4184P9979B11481b47761F1763b16136B05476
$$ plain form
17845 -76500 50947 -13279 -23335 6781 -10087 -49918 179955 73561 -99498 -1021 -79049 129557
17832 280509 111720 31031 -5055 -402379 46050 42470 -103340 -59110 364922 110796 -53673
17820 109508 -153849 -182407 -311096 122693 133327 -30658 93701 162108 55196 -67930 59894
17808 -278537 158413 146828 -103910 2106 128543 106484 -22421 199201 -3011 -10207 220983
17796 236933 52019 180764 -74826 -232226 -203053 189686 181554 79757 107063 21782 -155352
17784 25239 56285 19034 309114 -125033 -191761 -206453 20041 90898 116182 36131 76621
17773 76621 182048 87151 -158233 14062 259772 223449 22199 -1720 24127 -107976 278639
17761 236329 18126 -198556 -5372 178221 -195219 82127 347781 -208466 -146382 -97533 -149699
$$ packed form
17845g6500E0947a3279j0056F781a0087l9831A79955G3561i9498a021p8028A29557
17832B80509A11720C1031e055l97324D6050l580a03340M4230C64922A10796e3673
17820A09508a53849k8558j28689A22693J0634c0658I3701O8407E5196f7930E9894
17808b78537A58413j1585a03910B106J26437k2059b2421A99201c011p196B20983
17796B36933E2019J28745g4826j57400K9173A89686q132G9757K7306B1782a55352
17784B5239L1046A9034K90080a25033o6728j4692B0041P0857K5284C6131M0490
17773G6621J05427H7151a58233A4062K45710l6323B2199a720B4127a07976B78639
17761B36329A8126a98556e372A78221a95219H2127K65654b08466O2084M8849n2166
$$ plain form
17750 -149699 155378 -42618 16184 -4771 -124740 281067 214898 -118128 305445 -169482
17739 262174 -35879 99551 -46483 -249453 234107 7205 -41680 -79543 258180 -13965 455885
17727 201607 -218683 206388 -228999 68560 -149164 -47137 128159 49368 -74427 -6442 182727
17715 128104 138069 134295 163444 -31271 -126046 68562 359912 296534 90521 -13166 192963
17703 401827 270465 96673 -24512 194310 216476 18475 -55447 -89302 271103 -8759 279548
17691 423917 -83640 227444 101011 292667 265523 -7078 184068 184923 -97029 231538 123011
17680 123011 161382 63319 264387 172363 39911 25505 -342998 33768 -37309 29133 129827
17669 129827 291698 -168802 -169226 164485 -13488 47174 250839 -98023 377238 -91085 80900
$$ packed form
17750a49699A55378d2618A6184d771j19969B81067o6169a18128C05445a69482
17739B62174c5879I9551d6483k02970B34107G205d1680l7863B58180a3965D55885
17727B01607b18683B06388b28999F8560a49164d7137A28159D9368g4427f442A82727
17715A28104R965l774K9149c1271r4775F8562K91350o3378I0521a3166A92963
17703D01827j31362I6673b4512A94310K2166A8475e5447l3855B71103h759B79548
17691D23917h3640B27444A01011J91656k7144g078A84068Q55i7029B31538j08527
17680A23011L8371F3319K01068r2024C9911j4406c42998C3768c7309B9133J00694
17669A29827J61871a68802m24A64485a3488D7174K03665i8023C77238i1085H0900
$$ plain form
17657 156952 -12738 286451 66085 388238 370790 196066 439896 119987 -123776 43561
17646 -204980 -7028 187381 277541 273380 162638 -53907 88890 -103153 252576 215810 70131
17634 230874 402862 -227998 139158 185566 -96335 244019 -233847 184305 216055 73212
17623 -66415 119600 -121037 -243431 -12891 -159074 -183871 205266 178037 -8744 -70884 -111386
17612 -111386 -70594 -110742 -178056 255725 -433664 227554 85830 125303 318410 67743 244389
17601 244389 -84331 -25832 207986 -56717 -61099 144788 5664 -233638 339382 242973 121545
17590 121545 215705 431147 -27714 125997 296793 432009 -24560 173444 87029 68832
17580 68832 126096 192849 235614 7187 86560 217645 338777 143971 176981 -52225 216267
$$ packed form
17657A56952a2738B86451F6085L22153j7448j74724K43830A19987a23776D3561
17646b04980g028A87381R0160m161j10742e3907H8890a03153B52576l6766G0131
17634B30874J71988b27998A39158M6408i6335B44019b33847A84305L1750G3212
17623f6415A19600a21037j22394a2891j46183k4797B05266k7229h744o2140m0502
17612a11386M0792m0148o7314B55725d33664B27554H5830L9473J93107F7743J76646
17601B44389h4331b5832B07986e6717m382A44788E664b33638C39382r6409j21428
17590A21545R4160K15442b7714A25997J70796J35216b4560A73444q6415j8197
17580F8832N7264O6753M2765G187P9373J31085J21132A43971L3010e2225B16267
$$ plain form
17568 -177923 189381 -152076 183807 68548 84702 212084 61241 -69973 216137 95981
17557 95316 -155514 -139706 267916 -51982 111840 213029 78028 283167 -149746 614637
17546 -42956 -174654 199978 325211 -206155 160461 76424 158799 167407 45972 -105135 35925
17534 48514 -21045 -139793 26273 213513 161601 24145 126380 510486 -90526 328017 56622
17522 335451 270674 144224 144418 335637 16030 1597 239044 318499 586618 191916 697370
17511 697370 790487 695232 926143 1028125 805688 561096 454664 368860 134565 607751
17501 607751 296311 530587 452856 538458 492337 884034 910454 665810 623181 643262 328826
17490 328826 637480 337339 411121 235121 62604 381747 293025 183025 263349 182577
$$ packed form
17568a77923A89381a52076A83807F8548J6154J27382F1241f9973B16137I5981
17557I5316a55514J5808B67916e1982A11840J01189G8028K05139a49746F14637
17546d2956j31698A99978J25233b06155A60461G6424Q2375Q608D5972a05135C5925
17534D8514b1045j18748B6273J87240n1912B4145J02235L84106i0526C28017E6622
17522C35451o4777j26450J94J91219A6030A597K37447P9455K68119A91916N05454
17511F97370R3117r5255K30911J01982k22437k44592j06432q5804A34565M73186
17501F07751B96311K34276p7731Q5602m6121L91697K6420k44644m2629K0081l14436
17490C28826L08654l00141P3782j76000F2604L19143q8722j10000Q0324q0772
$$ plain form
17480 182577 39076 196258 30489 234628 129482 331767 264403 56679 227390 220328 421353
17469 421353 308676 423880 160319 227973 232270 559166 124321 162216 180811 302557
17459 302557 225064 427603 34317 578958 335197 -74668 404062 504557 244106 33446
17448 344123 449067 220799 -60475 494286 639510 367179 151584 41878 290672 133022
17437 -62413 474282 382081 592933 483461 282464 -21257 282933 277819 524585 35269 690571
17426 690571 155901 427736 612339 150099 76397 639177 494659 279768 143815 321516
17416 321516 182614 452731 277913 230082 388601 394673 257316 551953 220534 190054
17406 190054 483894 242707 396710 650603 250540 160579 131661 533313 269593 588232
$$ packed form
17480A82577C9076J57182C0489K04139j05146K02285o7364E6679J70711p062K01025
17469D21353j12677J15204A60319O7654M297L26896A24321L7895J8595J21746
17459C02557p7493K02539C4317N44641k43761g4668D04062J00495B44106C3446
17448C44123J04944B20799f0475D94286J45224k72331A51584D1878K48794A33022
17437f2413D74282r2201K10852j09472k00997b1257B82933n114K46766C5269O55302
17426F90571A55901K71835J84603A50099p3702N62780j44518k14891j35953J77701
17416C21516j38902K70117j74818m7831J58519O072j37357K94637B20534l0480
17406A90054K93840k41187J54003K53893B50540q9961k8918M01652k63720L18639
$$ plain form
17396 588232 385402 5059 334222 335109 287936 182839 384814 -18697 394139 480481 182597
17384 -40709 237571 595783 -141741 557266 -106523 124841 69505 4354 249286 111364
17373 53613 181523 -351 375194 512056 527821 453268 207037 111958 -21364 438966 383725
17362 383725 253509 245979 38336 141817 -21804 -34089 214438 71683 201581 158118 259081
17351 259081 -31619 333155 237929 82554 304169 271019 325654 175359 -32880 287681 209938
17340 209938 321358 156985 244464 397648 289659 -40564 252335 134952 66868 130919
17330 130919 67969 402963 147822 288003 347959 130868 298634 483322 406761 -145456
17319 396037 76637 299970 77543 472159 40914 313522 206696 -120397 5524 351997
$$ packed form
17396E88232k02830E059L29163Q87m7173j05097K01975a8697C94139Q6342A82597
17384d0709B37571L58212a41741E57266a06523A24841n5336D354K44932A11364
17373E3613J27910c51C75194J36862J5765p4553B07037r5079b1364D38966n5241
17362C83725j30216p530C8336J03481b1804j2285B14438G1683J29898m3463J00963
17351B59081c1619C33155r5226H2554K21615l3150N4635j50295c2880B87681p7743
17340B09938J11420A56985Q7479J53184j07989d0564B52335j17383F6868O4051
17330A30919o2950L34994A47822J40181N9956A30868J67766J84688p6561a45456
17319C96037G6637K23333G7543L94616D0914K72608j06826a20397E524L46473
$$ plain form
17309 351997 200531 452948 376584 43281 8613 431961 264840 207224 365665 137164
17298 276681 188393 79803 73452 358015 488273 130022 -114218 51208 470483 334344
17288 334344 296516 206888 346001 593954 461130 114896 124386 335002 256828 427185
17278 427185 327548 507104 65523 345805 417036 553661 112276 352499 231831 37223
17267 311243 400050 285284 224793 238081 575977 575155 450602 502529 241358 270741 403351
17256 403351 195963 101914 371349 478579 51062 137876 391496 147629 159942 228437
17246 228437 384445 670218 197030 383139 282080 133230 401029 239420 218115 264764
17236 264764 389535 306693 551893 75227 444026 707927 220093 265384 369286 433606
$$ packed form
17309C51997j51466K52417p6364D3281H613M23348j67121n7616J58441A37164
17298B76681q8288G9803o351K84563J30258A30022a14218E1208M19275j36139
17288C34344l7828q9628J39113K47953j32824A14896R490K10616p8174J70357
17278D27185r9637J79556F5523K80282P1231J36625A12276K40223j20668C7223
17267C11243Q8807j14766o0491J3288L37896q22j24553N1927B41358K9383J32610
17256D03351A95963r4049K69435J07230E1062Q6814K53620A47629J2313O8495
17246B28437J56008K85773A97030J86109j01059A33230K67799j61609k1305M6649
17236B64764J24771q2842K45200G5227L68799K63901B20093M5291J03902O4320
$$ plain form
17226 433606 445457 276221 597562 243829 358312 520491 582108 -30531 446270 256434
17216 256434 387751 432249 476610 501824 592543 611264 272731 746761 375697 82741 323959
17205 323959 331747 497921 85342 101084 364272 155384 581190 435255 597063 77746
17194 190363 544347 266922 343946 270123 247679 746834 475095 510122 553829 281044
17184 281044 170876 707129 374294 414141 387376 76792 6133 449788 568815 273434
17173 706376 176308 351253 491045 555478 406995 254893 232240 171237 245458 715807
17163 715807 499675 679264 259019 361059 619974 244787 592564 456301 253073 529986
17153 529986 531746 537187 336949 541971 235656 318315 421786 34187 267260 357702 302648
$$ packed form
17226D33606J1851j69236L21341B43829J14483J62179O1617c0531D46270j89836
17216B56434J31317M4498M4361K5214R0719J8721B72731M74030l71064H2741K41218
17205C23959P788J66174H5342J5742K63188A55384M25806j45935J61808G7746
17194A90363L53984B66922P7024p3823k2444M99155k71739L5027M3707k72785
17184B81044j10168N36253l32835L9847k6765G6792F133M43655J19027B73434
17173G06376A76308J74945J39792O4433j48483j52102k2653o1003P4221M70349
17163G15807k16132J79589B59019J02040K58915B44787L47777j36263k03228K76913
17153E29986J760N441k00238K05022B35656Q2659J03471C4187K33073R0442n5054
$$ plain form
17142 302648 641710 565259 629427 592415 436003 726418 450114 504929 435620 587578
17132 587578 498037 554015 468949 357683 329144 411762 356987 700305 690823 352901 378812
17121 378812 608258 584778 400933 625760 639184 689940 152269 461951 515110 442545
17111 442545 584036 529932 553991 592481 299684 789222 401173 535431 543774 530904 482502
17100 482502 486962 573416 697242 677047 460888 555297 535544 761240 461688 775469 722253
17089 722253 466392 433476 786261 756269 481724 562893 496828 605196 413974 724621
17079 724621 829360 559743 896877 510603 645155 623724 948572 795726 771457 656692
17069 656692 342855 633348 815987 729379 613859 563471 903207 535460 757837 309892
$$ packed form
17142C02648L39062p6451O4168l7012j56412K90415k76304N4815o9309J51958
17132E87578q9541N5978q5066j11266k8539Q2618n4775L43318r482l37922K5911
17121C78812K29446k3480j83845K24827J3424N0756A52269L09682N3159p2565
17111D42545J41491n4104K4059L8490k92797M89538l88049J34258Q343j2870m8402
17100D82502M460Q6454J23826k0195k16159R4409j9753K25696k99552L13781n3216
17089G22253k55861l2916L52785k9992k74545Q1169o6065J08368j91222L10647
17079G24621J04739k69617L37134l86274J34552k1431L24848j52846k4269j14765
17069F56692l13837K90493J82639q6608j15520n0388L39736l67747K22377C09892
$$ plain form
17058 746084 661510 652387 894063 593529 665704 763318 573455 994329 731072 972817
17048 972817 653914 840492 602209 620427 899066 691767 401880 851476 622462 918917
17038 918917 858925 1258757 629946 815949 806707 647623 519429 622209 914196 688375
17028 688375 808694 750350 1092419 1235186 945030 1063555 907626 1180241 639758 877357
17018 877357 667913 953562 695445 975883 736141 923913 1103694 740994 1057582 724782
17008 724782 1133247 1097671 916570 1082477 1275509 866530 1082483 1273463 1148660 1164380
16998 1164380 1091511 1113058 1088883 1326780 1033609 1233195 1175383 813137 1102278 1355146
16988 1355146 855539 1073378 1084699 925417 1094343 1196903 884830 1520578 1024981 1097699
$$ packed form
17058G46084q4574r123K41676l00534P2175R7614j89863M20874k63257K41745
17048I72817l18903J86578k38283J8218K78639k07299k89887M49596k29014K96455
17038I18917n9992L99832o28811J86003r242j59084j28194J02780K91987k25821
17028F88375J20319n8344L42069J42767k90156J18525j55929K72615n40483K37599
17018H77357k09444K85649k58117K80438k39742J87772J79781l62700L16588l32800
17008G24782M08465l5576j81101J65907J93032m08979K15953J90980j24803J5720
16998A164380p2869K1547k4175K37897k93171J99586n7812l62246K89141K52868
16988A355146m99607K17839J1321j59282J68926J02560l12073O35748m95597P2718
$$ plain form
16978 1097699 1389494 1144749 1213165 1212748 1199131 1292376 1086156 1504574 1555902 1420317 1277049
16967 1277049 1065472 1326089 1210714 1371806 1210404 1395011 1625068 1345370 1170659
16958 1170659 1219172 1690242 1398771 1536797 1442364 1585557 1462538 1490129 1393623 1123754
16948 1123754 1575953 1435005 1210041 1499103 1560323 1809170 1561456 1771844 1298132 1990056
16938 1990056 1951873 1592548 1733517 1757111 1722985 1770545 1779733 1935245 1777816 1681861 1813775
16927 1813775 1891035 1610162 2002089 2025081 2318702 1985860 1933640 1678373 2093761 1772243
16917 1772243 2029812 1864432 2234677 2270306 2520650 2168515 2153517 2373814 2230722 2480000
16907 2480000 2287869 2292038 2464654 2378670 2408780 1883222 2331162 2757082 2563053 2274990
$$ packed form
16978A097699K91795k44745O8416m17j3617R3245k06220M18418N1328j35585j43268
16967A277049k11577K60617j15375J61092j61402J84607K30057k79698j74711
16958A170659M8513M71070k91471J38026r4433J43193j23019K7591r6506k69869
16948A123754M52199j40948k24964K89062O1220K48847k47714K10388m73712O91924
16938A990056l8183l59325J40969K3594l4126M7560R188J55512j57429r5955J31914
16927A813775P7260k80873L91927K2992K93621l32842n2220k55267M15388l21518
16917A772243K57569j65380L70245L5629K50344l52135j4998K20297j43092K49278
16907B480000j92131M169J72616q5984L0110n25558M47940M25920j94029k88063
$$ plain form
16897 2274990 2487720 2789084 2546976 2626988 2502460 2846149 2548863 2601578 2800595 2353371
16887 2353371 2702775 2851486 2890525 2555279 2942389 2725517 3034945 3205789 2869060 3212442
16877 3212442 3117804 3228175 3141164 3024167 3305267 3254400 3372165 3221388 3380205 3740352
16867 3740352 3259284 3732913 3713315 3754124 3765058 3748853 3678244 3897481 3747753 3907892
16857 3907892 3952034 3833998 3889858 3904515 3819787 4041992 4272586 4078644 4257607 4569786
16847 4569786 4579261 4846285 4400710 4426808 4800403 5089040 5091353 5099296 5117313 5194962 4833344
16836 4833344 4903443 5603956 5558206 5244342 5653332 5657100 5764729 5630657 5896953 6380513
16826 6380513 5901293 6113151 6345140 6307960 6431542 6656455 6791747 6936716 7016466 7081416
$$ packed form
16897B274990K12730L01364k42108Q0012j24528L43689k97286N2715J99017m47224
16887B353371L49404J48711L9039l35246L87110k16872L09428J70844l36729L43382
16877C212442r4638J10371q7011j16997K81100n0867J17765j50777J58817L60147
16867C740352m81068M73629j9598M0809J0934j6205p0609K19237j49728J60139
16857C907892M4142j18036N5860J4657q4728K22205K30594j93942J78963L12179
16847D569786R475K67024m45575K6098L73595K88637K313P943J8017P7649l61618
16836D833344P0099P00513m5750l13864M08990L768J07629j34072K66296M83560
16826F380513m79220K11858K31989l7180J23582K24913J35292J44969P9750O4950
$$ plain form
16816 7081416 7298053 7513814 7496374 7307628 7831835 7669680 8275294 8201764 8500420 8185234
16806 8185234 8721907 8406070 9158309 8925248 9225546 9584757 9633927 9945044 10081266 10341384
16796 10341384 10739296 10647334 11066482 11154148 11477192 11786295 12105298 12166930 12383332 12948449
16786 12948449 12947403 13391911 13786674 14087021 14217724 14620873 15032712 15628592 15598094 16059538
16776 16059538 16627313 17227931 17517460 17698180 18666721 18670373 19590863 20288057 20490355 21082482
16766 21082482 21561166 22470724 23131627 23582834 24145581 25185651 25622535 26890770 27595373
16757 27595373 28455200 29293815 29813603 31119087 32022007 33089588 34009137 35507152 36484154
16748 36484154 37622335 39072213 40295273 41344577 43492975 44553271 46177578 48170324
$$ packed form
16816G081416K16637K15761j7440j88746N24207j62155O05614p3530K98656l15186
16806H185234N36673l15837P52239k33061L00298L59211M9170L11117J36222K60118
16796A0341384L97912r1962M19148Q7666L23044L09103L19003O1632K16402N65117
16786A2948449j046M44508L94763L00347J30703M03149M11839N95880l0498M61444
16776A6059538N67775O00618K89529J80720R68541L652R20490O97194K02298N92127
16766B1082482M78684R09558O60903M51207N62747J040070M36884J268235P04603
16757B7595373Q59827Q38615N19788J305484R02920J067581R19549J498015R77002
16748C6484154J138181J449878J223060J049304K148398J060296J624307J992746
$$ plain form
16740 48170324 49365441 51552666 53383064 55194144 57431223 59102069 61276032 63602076
16732 63602076 65883524 68120724 70559727 73128522 75594075 78084710 80591682 83186560
16724 83186560 85876522 88614042 91062045 93901016 95862756 98374282 100511478 102822639
16716 102822639 105066775 106635677 108288187 110061610 111237568 112320462 113160940 113621091
16708 113621091 113744437 114026743 113654649 112916474 112444660 111166672 110032309 108331316 106803654
16699 106803654 104287482 102639738 100673959 98339884 95737980 93305952 90825801 88183807
16691 88183807 85600007 82826505 80454623 77849269 75339243 72730248 70318066 67863227
16683 67863227 65246481 63402789 61372548 58961327 57204303 54949698 52907415 51027627
$$ packed form
16740D8170324J195117K187225J830398J811080K237079J670846K173963K326044
16732F3602076K281448K237200K439003K568795K465553K490635K506972K594878
16724H3186560K689962K737520K448003K838971J961740K511526K137196K311161
16716A02822639K244136J568902J652510J773423J175958J082894Q40478M60151
16708A13621091J23346K82306l72094p38175m71814j277988j134363j700993j527662
16699A06803654k516172j647744j965779k334075k601904k432028k480151k641994
16691H8183807k583800k773502k371882k605354k510026k608995k412182k454839
16683F7863227k616746j843692k030241k411221j757024k254605k042283j879788
$$ plain form
16675 51027627 49037962 47579463 45942372 44312111 42766742 40958858 39843310 38469253
16667 38469253 37254406 36193593 35095529 33441696 32820810 31471566 30436993 29612639
16659 29612639 28565511 27655115 27156498 25942850 25231764 24414139 23821541 23379743 22238115
16650 22238115 22118761 21280458 20688459 20435176 19636853 18927460 18714375 18090046 17643822
16641 17643822 17041815 16786344 16279019 15597540 15545818 14801569 14521362 14486752 13982614 13828786
16631 13828786 13206444 13087669 12694263 12322972 11839151 12007114 11818620 11584924 11112638
16622 11112638 10998038 10646489 10529189 10305667 9838866 9929387 10054480 9598754 9221258
16613 9221258 9268180 8808724 8644465 8701094 8562077 8425586 8271758 7965956 7817323 8071074
$$ packed form
16675E1027627j989665j458499j637091j630261j545369j807884j115548j374057
16667C8469253j214847j060813j098064j653833o20886j349244j034573q24354
16659B9612639j047128r10396m98617j213648p11086q17625n92598m41798j141628
16650B2238115j19354q38303n91999k53283p98323p09393k13085o24329m46224
16641A7643822o02007k55471n07325o81479n1722p44249k80207l4610n04138j53828
16631A3828786o22342j18775l93406l71291m83821J67963j88494k33696m72286
16622A1112638j14600l51549j17300k23522m66801R0521J25093m55726l77496
16613I221258M6922m59456j64259N6629j39017j36491j53828l05802j48633K53751
$$ plain form
16603 8071074 7609209 7536112 7276580 7437361 7025313 6982596 7042279 6662282 6578654 6435782
16593 6435782 6031388 5998994 5982972 5701694 5827882 5855545 5723503 5756523 5900425 5608082
16583 5608082 5548551 5681736 5123846 5153093 5142416 4886236 4892282 5136491 4723477 4616950
16573 4616950 4614056 4763635 4887149 4857051 4606018 4171512 4333105 4256315 4011771 4176616
16563 4176616 4132104 3856993 4068065 3718922 3829806 3692968 4011566 3809303 3603636 3797280
16553 3797280 3671005 3326192 3446436 3528519 3227316 3013061 3362529 2952491 3263837 3193622
16543 3193622 3121183 3243987 3119700 3068946 3083147 2848884 2842577 2781362 2903391 3017862
16533 3017862 2914862 3119092 3000138 2844773 2972772 2532221 2918126 2674166 2721655 2350082
$$ packed form
16603H071074m61865p3097k59532J60781m12048m2717N9683l79997q3628j42872
16593F435782m04394l2394j6022k81278J26188K7663j32042L3020J43902k92343
16583E608082n9531J33185n57890K9247j0677k56180O046K44209m13014j06527
16573D616950k894J49579J23514l0098k51033m34506J61593p6790k44544J64845
16563D176616m4512k75111K11072l49143J10884j36838L18598k02263k05667J93644
16553C797280j26275l44813J20244Q2083l01203k14255L49468m10038L11346p0215
16543C193622p2439J22804j24287n0754J4201k34263o307o1215J22029J14471
16533C017862j03000K04230j18954j55365J27999m40551L85905k43960M7489l71573
$$ plain form
16523 2350082 2463103 2469071 2530216 2620058 2636576 2408401 2128096 2440843 1942257 2474513
16513 2474513 2286227 2250862 2222267 2225709 2106599 1912690 2227588 2014793 2380354 2228623
16503 2228623 1916223 2030883 2061741 2099227 2020526 2309894 1983810 2120339 1731945 1815057
16493 1815057 1900003 1741516 1915608 1762091 1875529 1827087 1688431 1652949 1554412 1655140
16483 1655140 1867684 1652452 1722243 2049113 1667656 1700792 1728650 1595955 1569620 1655803
16473 1655803 1325163 1578253 1529018 1483985 1483767 1599088 1463477 1411494 1876737 1734739
16463 1734739 1222487 1131499 1412343 1461898 1581255 1444820 1529332 1498676 1315684 1380530
16453 1380530 1456007 1376304 1399667 1209190 1445533 1123050 1527904 1500845 1415603 1094377
$$ packed form
16523B350082J13021N968O1145Q9842J6518k28175k80305L12747m98586N32256
16513B474513j88286l5365k8595L442j19110j93909L14898k12795L65561j51731
16503B228623l12400J14660L0858L7486p8701K89368l26084J36529l88394Q3112
16493A815057Q4946j58487J74092j53517J13438m8442j38656l5482r8537J00728
16483A655140K12544k15232O9791L26870l81457L3136K7858j32695k6335Q6183
16473A655803l30640K53090m9235m5033k18J15321j35611n1983M65243j41998
16463A734739n12252r0988K80844M9555J19357j36435Q4512l0656j82992O4846
16453A380530P5477p9703K3363j90477K36343l22483M04854k7059q5242l21226
$$ plain form
16443 1094377 1446256 1251319 1303284 1472988 1196684 835147 1184379 1382847 1345036 1036090
16433 1036090 1259060 1189731 1052201 1089292 892728 1251401 1043431 978888 867226 1244317
16423 1244317 732009 947888 800236 1094722 786551 942857 1129196 825054 861446 858295
16413 858295 1048276 873336 1178183 955015 1159414 983170 939814 1076990 1154593 1012911
16403 1012911 981439 939978 920241 876100 943270 788716 593444 909622 879492 1203716
16393 1203716 868384 875232 794682 1059852 691926 952098 942729 846962 783331 1040677 753120
16382 753120 744515 745074 647271 1109390 725582 931846 803672 857947 930402 768167 921468
16371 921468 1027188 721807 855981 957753 827731 775684 985831 943183 911015 815651
$$ packed form
16443A094377L51879j94937N1965J69704k76304l61537L49232J98468l7811l08946
16433A036090K22970o9329j37530L7091j96564L58673k07970o4543j11662L77091
16423A244317n12308K15879j47652K94486l08171J56306J86339l04142L6392l151
16413H58295J89981j74940L04847k23168K04399j76244m3356J37176P7603j41682
16403A012911l1472m1461j9737m4141O7170j54554j95272L16178l0130L24224
16393A203716l35332O848q0550K65170l67926K60172r369r5767o3631K57346k87557
16382G53120q605N59r7803M62119l83808K06264j28174N4275P2455j62235J53301
16371I21468J05720l05381J34174J01772j30022n2047K10147m2648l2168r5364
$$ plain form
16361 815651 745219 892977 565313 433877 834216 830900 882603 583502 316568 659034
16351 659034 586080 745076 634931 546111 265199 718181 625345 581119 696126 800331
16341 800331 753782 751675 768905 508186 627225 749291 711105 521419 695538 800040
16331 800040 622104 654681 324002 817115 656326 824125 549938 501955 450154 651380
16321 651380 275388 600643 730825 607203 693552 775100 931927 741715 674081 675327
16311 675327 714567 406796 510623 549742 665483 399074 256962 541600 547077 577295
16301 577295 485450 361728 669765 546062 577164 350885 541163 571067 294097 567567
16291 567567 530345 767111 429327 553391 374337 308599 696891 771532 948565 423708
$$ packed form
16361H15651p0432J47758l27664j31436M00339l316N1703k99101k66934L42466
16351F59034p2954J58996j10145q8820B65199M52982r2836m4226J15007J04205
16341H00331m6549k107J7230k60719J19039J22066l8186j89686J74119J04502
16331H00040j77936L2577C24002M93113j60789J67799k74187m7983n1801K01226
16321F51380B75388L25255J30182j23622Q6349Q1548J56827j90212o7634J246
16311F75327L9240l07771J03827L9119J15741k66409j42112K84638N477L0218
16301E77295r1845j23722L08037j23703L1102k26279J90278K9904k76970K73470
16291E67567l7222K36766l37784J24064j79054o5738L88292P4641J77033D23708
$$ plain form
16280 324196 486865 360589 663778 597725 367232 431291 664419 636573 820704 98374
16269 490706 729194 610341 291853 330231 427749 304352 520504 496144 321105 390144
16259 390144 503972 196964 438416 606699 504147 369403 529265 206443 592617 308978
16249 308978 513032 473723 478447 -96940 190445 378108 609499 578934 359773 427609 149990
16237 292393 376736 342161 206515 260916 53103 504371 490461 613000 208598 110789 400396
16226 400396 635549 108460 209342 258718 243650 185957 355617 394745 256745 205321
16216 205321 193192 531583 621921 351870 446026 140635 297211 379221 239935 71985
16205 316273 462851 648640 36364 -61669 328898 324091 606332 124888 330131 326671 407812
$$ packed form
16280C24196J62669j26276L03189o6053k30493O4059K33128k7846J84131I8374
16269D90706K38488j18853B91853L8378R7518j23397K16152k4360j75039O9039
16259C90144J13828A96964K41452J68283j02552j34744J59862B06443L86174k83639
16249C08978K04054l9309M724i6940A90445J87663K31391l0565k19161O7836A49990
16237B92393Q4343l4575j35646N4401E3103M51268j3910J22539B08598r7809K89607
16226D00396K35153A08460J00882M9376j5068n7693J69660L9128j38000n1424
16216B05321j2129L38391R0338k70051R4156A40635J56576Q2010j39286G1985
16205C16273J46578J85789C6364f1669C28898m807K82241A24888K05243l460Q1141
$$ plain form
16194 407812 419410 408694 170825 97937 84787 27875 518249 23160 645724 338906 121300
16182 440274 546617 513125 293762 346167 -30765 78972 369540 301622 164417 280502
16172 280502 580296 -57004 364798 410451 501054 171316 68646 166309 435325 289691
16162 289691 148830 260957 219701 305817 337733 54736 232529 233082 91750 180905 104486
16151 104486 469153 434879 293663 411684 26953 456252 416503 363585 218502 38028
16140 292608 171797 321191 149042 -34974 -11660 -70274 39313 -93143 -106959 -43071 351732
16128 165817 138833 355036 93976 156330 51390 180774 96728 242122 -164949 18037 -138257
16116 376276 115077 436031 -44981 78572 5420 136279 208682 333924 156324 179146 120138
$$ packed form
16194D07812J1598j0716A70825p2888j3150B7875M90374B3160O22564l06818A21300
16182D40274J06343l3492k19363N2405c0765G8972K90568o7918j37205J16085
16172B80502K99794e7004C64798M5653R0603A71316F8646R7663K69016j45634
16162B89691j40861J12127m1256Q6116L1916E4736J77793N53I1750Q9155p6419
16151A04486L64667l4274j41216J18021B6953M29299l9749n2918j45083C8028
16140B92608j20811J49394A49042c4974a1660n8614C9313i3143j3816d3071C51732
16128A65817k6984K16203I3976O2354E1390J29384q4046J45394a64949A8037a38257
16116C76276A15077L20954d4981G8572E420J30859P2403J25242A56324K2822n9008
$$ plain form
16105 120138 173868 195848 212970 -21667 -63796 318840 -93860 109460 -34501 375011 398671
16094 398671 110627 -263181 124636 -108671 284184 -99982 358243 96641 555197 221704
16083 47256 92678 -198201 23775 -8400 61471 217274 -77761 239623 220177 350066 109184
16071 279440 75189 123996 264027 153067 68432 3226 135047 136336 -9485 175616 327690
16060 327690 -38378 485817 -131479 221266 35360 51384 151987 252648 -88486 -280529
16050 -280529 -138091 298777 47523 214573 -286104 -145842 -123450 -25490 -129174 162762
16039 88666 92068 -48941 84095 343455 -164501 -12214 301889 -21321 -47103 -139096 351241
16027 190297 93190 88586 318485 9900 -157026 11239 291189 425289 311171 89534 315485
$$ packed form
16105A20138N3730K1980J7122b1667m2129C18840i3860A09460c4501C75011K3660
16094C98671A10627b63181A24636a08671B84184i9982C58243I6641M58556B21704
16083D7256M5422a98201B3775h400F1471J55803g7761B39623j9446J29889A09184
16071B79440G5189M8807J40031j10960F8432C226J31821J289i485A75616J52074
16060C27690c8378D85817a31479B21266C5360J6024J00603J00661h8486j92043
16050b80529a38091B98777D7523J67050b86104J40262K2392b5490j03684A62762
16039H8666L402d8941H4095K59360a64501a2214C01889b1321k5782r1993C51241
16027A90297I3190m604K29899I900a57026A1239K79950J34100j14118H9534K25951
$$ plain form
16016 315485 -166076 -188919 237968 266493 274198 163238 345910 225678 281840 -256072
16005 -73471 203578 -110943 117574 -236377 155626 35016 85021 192278 187997 57891 22464
15993 138180 -150206 17669 189287 178630 77858 -177275 184562 -338673 45118 28631
15983 28631 49687 376866 -230308 -5364 293485 125463 -73775 125093 227490 94072 314994
15972 314994 865955 567647 1119668 835415 475827 484486 642572 349493 355794 487528
15962 487528 -108594 -401170 213451 -62316 -114250 174589 136717 496740 -55497 247674
15951 -15736 62695 9144 194722 -354815 138853 -91373 238634 103204 117904 -96812 -25309
15939 14502 -165682 64373 -45536 401129 61703 21579 -267528 3671 267992 46924 179039
$$ packed form
16016C15485a66076k2843B37968K8525P705j10960J82672j20232N6162b56072
16005g3471B03578a10943A17574b36377A55626C5016N0005J07257m281E7891B2464
15993A38180a50206A7669J71618j0657G7858a77275A84562c38673D5118j6487
15983B8631K1056L27179b30308e364B93485A25463g3775A25093J02397I4072K20922
15972C14994N50961k98308N52021k84253l59588Q659J58086k93079O301J31734
15962D87528a08594k92576B13451f2316n1934A74589l7872L60023e5497B47674
15951a5736F2695I144J85578c54815A38853i1373B38634A03204J4700i6812b5309
15939A4502a65682F4373d5536D01129F1703B1579b67528C671K64321D6924J32115
$$ plain form
15928 179039 104589 -331554 -61486 3736 -110249 193368 140624 48707 138058 -166351 -338873
15917 -338873 -125441 245556 6752 43320 -90415 216075 48668 -167550 -146223 373036 126847
15905 -74943 -295934 58631 -113298 -194462 6433 99262 121125 286809 -115506 -199478 -301070
15894 -301070 43847 23579 -268438 200426 -72088 -162885 -21523 -85493 -111692 -22214 -148293
15883 -148293 -248558 -7096 54797 -56025 196430 177223 8952 -39673 -375139 -81745 74110
15871 -110600 11779 -110871 -77099 198046 -257383 -25272 -99743 40554 207894 -96011 372406
15859 108135 -90515 -244748 196404 21363 -14702 51406 -182615 -117325 308270 -117540
15848 -305233 -120487 125090 -178120 -166497 121266 -73112 271218 60380 -254829 216152
$$ packed form
15928A79039p4450c31554f1486C736a10249A93368n2744D8707Q9351a66351j72522
15917c38873a25441B45556F752L6568i0415B16075D8668a67550K1327C73036A26847
15905g4943k20991E8631a13298q1164F433R2829K1863J65684a15506q3972j01592
15894c01070D3847k0268b68438B00426g2088r0797b1523o3970k6199b2214j26079
15883a48293j00265g096E4797e6025A96430j9207H952c9673l35466h1745G4110
15871a10600A1779a10871L3772A98046b57383b5272p4471D0554J67340i6011C72406
15859A08135i0515j54233A96404B1363a4702E1406a82615O5290C08270a17540
15848c05233a20487A25090a78120J1623A21266g3112B71218F0380b54829B16152
$$ plain form
15837 -91644 253968 176099 -334565 301001 11805 -127975 31083 339920 -177971 27764
15826 65690 49699 152330 -124511 85971 -305574 -337837 32097 243240 -77982 -73245 -286805
15815 -286805 199399 95998 104166 371054 16646 -103053 -146298 -104682 -178722 -98045 88748
15803 -15204 -64337 395877 -120664 -108394 48958 62588 -12555 299838 -195604 -17935 99426
15791 11094 -102872 -158589 -232569 162438 233446 -94042 -228134 -54819 -141886 -264636 -549707
15780 -549707 -100577 -105899 -296 -20251 394923 -96090 -197977 -157908 -25593 -27070 98513 -25955
15767 40377 -45986 -179768 163344 255332 -210910 1482 -410465 -306461 276942 168767
15757 168767 -308974 -64327 -222994 -219148 -58527 30026 203473 -291292 125796 -121603
$$ packed form
15837i1644B53968p7869c34565C01001A1805a27975C1083L08837a77971B7764
15826F5690j5991J02631a24511H5971c05574l2263C2097K11143g7982M737k13560
15815b86805A99399I5998Q168K66888A6646a03053m3245M1616p4040Q0677H8748
15803a5204m9133C95877a20664J2270D8958J3630a2555B99838a95604a7935I9426
15791A1094a02872n5717p3980A62438P1008i4042j34092e4819q7067j22750k85071
15780e49707a00577n322b96j9955C94923i6090j01887M0069b5593j477I8513b5955
15767D0377d5986j33782A63344R1988b10910A482d10465J04004B76942j08175
15757A68767c08974f4327j58667L846e8527C0026J73447b91292A25796a21603
$$ plain form
15746 -67937 -86346 -145988 -124851 28666 -223615 301247 112763 156753 96821 217994 -195606
15734 123323 320905 302564 38716 484818 93157 -12399 47299 155555 -105818 -115393 -164509
15723 -164509 -133221 -41302 41774 138542 -425981 -308092 -13745 -40843 240342 -120107 -44664
15711 -211293 -90212 148861 152456 -37594 -100793 39015 -157715 -10109 107170 -40549 107269
15699 1871 -85521 104544 197825 -322511 -168894 275103 -117557 -125180 -4144 225313 -63465
15687 -100741 -184257 20871 168741 -314118 68550 -199365 -262863 15480 162417 70019 251322
15676 251322 -107027 189440 297906 184866 71507 254404 4899 -453 -224811 -298498 -39386
15664 -270834 208997 -506126 101208 -152131 -114424 107126 -28750 -178792 38678 -187317
$$ packed form
15746f7937j8409n9642K1137B8666b23615C01247A12763M3990n9932J21173a95606
15734A23323J97582j8341C8716M46102I3157a2399D7299J08256a05818r575m9116
15723a64509L1288d1302D1774R6768d25981J17889a3745k7098B40342a20107d4664
15711b11293i0212A48861L595c7594o3199C9015a57715a0109A07170d0549A07269
15699A871h5521A04544R3281c22511J53617B75103a17557p623d144B25313f3465
15687a00741q3516B0871J47870c14118F8550a99365o3498A5480J46937G0019J81303
15676B51322a07027A89440J08466j13040G1507J82897D899d53k24358p3687c9386
15664b70834B08997e06126A01208a52131L7707A07126b8750j50042C8678a87317
$$ plain form
15653 -339537 -107248 10066 -217516 -142995 -134694 219227 -298556 221765 -201931 -9919 -53801
15642 -53801 -55308 -141840 -182582 262054 281951 22259 178892 313575 -75636 87694 -88717
15630 -55819 -56422 266151 81132 -152257 319281 -181373 -108152 -37255 -46152 -404847 -105289
15618 -291378 42626 -103610 119490 14907 -122291 -156588 -8230 112737 508962 -98005 184776
15606 -141309 -118630 -335706 15931 151835 -40138 -335836 -136112 -113101 203980 344531
15596 344531 147919 -129525 39319 -186937 228822 -59118 107603 -246881 -39428 -13882
15585 -182745 50343 111162 104405 -32945 -101990 184989 -80230 -282351 -149123 64439 335305
15574 335305 -147103 -35773 52831 39226 -25286 56354 -151324 -213359 -129241 -359582 2569
$$ packed form
15653c39537a07248A0066b17516P4521Q301B19227b98556B21765b01931i919m3882
15642e3801j507q6532m0742B62054J9897B2259J56633J34683g5636H7694h8717
15630e5819o03B66151H1132a52257C19281a81373P3221c7255q897l58695a05289
15618b91378D2626a03610A19490A4907a22291l4297h230A12737L96225i8005A84776
15606a41309K2679k17076A5931J35904d0138k95698a36112K3011B03980J40551
15596C44531A47919a29525C9319a86937B28822e9118A07603b46881c9428a3882
15585a82745E0343O0819o757c2945o9045A84989h0230k02121J33228F4439K70866
15574C35305a47103c5773E2831j3605b5286E6354a51324o2035Q4118k30341B569
$$ plain form
15562 342113 134281 -9408 49109 -47099 266795 227175 86482 61819 172636 96166 329798
15551 329798 88565 2073 42943 -141793 -133859 -47563 9934 7762 331950 110350 -70596 -130732
15539 -130732 57949 -110518 46489 -314817 215125 -130815 -215858 -201632 -129665 -63762 48012
15527 49067 -62780 -151581 -76367 -333422 231767 -39621 167960 234136 11847 66922 -123354
15515 -94689 -4601 -42174 109786 108859 -116065 271109 -5942 -51581 93706 283849 71395 -165129
15502 76428 -39900 239242 129306 119656 484782 -228646 51916 255852 119383 57521 139235
15491 139235 447708 304029 -189983 195373 243893 100320 107240 280418 -161285 -195004
15481 -195004 35736 30104 370745 64310 -38724 -171664 250132 257026 -128414 359759 101042
$$ packed form
15562C42113A34281i408D9109d7099B66795l9620H6482k4663J10817p6470K33632
15551C29798H8565B073M0870a41793P934d7563I934k172L24188A10350g0596o0136
15539a30732E7949a10518D6489c14817B15125a30815q5043J4226P1967f3762D8012
15527D9067f2780q8801P5214k57055B31767c9621A67960O6176A1847N5075a23354
15515i4689d601l7573A09786r27a16065B71109e942m5639I3706J90143G1395a65129
15502G6428c9900B39242j09936r650L65126b28646E1916K03936A19383E7521Q1714
15491A39235L08473j43679a89983A95373M8520A00320O920J73178a61285l3719
15481a95004C5736n632L40641F4310c8724j32940B50132O894a28414C59759A01042
$$ plain form
15469 325419 26745 202307 79780 188078 95483 51250 523777 206839 53986 215741
15459 215741 376046 454457 261785 320258 332339 53939 84441 118134 -188096 -316011 -120567
15447 171905 -272395 58190 56651 -242051 221229 -3864 -237314 29906 257078 260525 -5037
15435 -213535 80079 -218503 192278 181464 241512 -45524 544898 569322 670969 1333964
15425 1333964 714110 630521 351509 466432 218212 21835 52748 212822 39399 -21085
15414 93955 -117485 -211527 10924 190917 977 -274275 335517 -64392 -441517 -123594 279027
15402 -290965 -226078 9262 -161822 -33073 -3468 45971 56167 57111 230058 -28865 40574 232119
15390 232119 56074 142079 379145 236895 235784 42190 -402838 -38549 -91920 -123700 20399
$$ packed form
15469C25419B6745J75562G9780J08298r2595m4233M72527B06839E3986J61755
15459B15741J60305P8411j92672N8473J2081E3939L0502L3693a88096j27915a20567
15447A71905b72395E8190j539b42051B21229c864k33450B9906K27172L447e037
15435b13535H0079b18503A92278j0814O0048d5524E44898K4424J01647O62995
15425A333964o19854q3589k79012J14923B18212B1835L0913J60074C9399b1085
15414I3955a17485r4042A0924J79993I77b74275C35517f4392l77125a23594B79027
15402b90965O4887I262a61822c3073c468D5971J0196R44J72947b8865D0574J91545
15390B32119E6074Q6005K37066j42250j111D2190d02838c8549n3371l1780B0399
$$ plain form
15378 46020 336166 243764 336189 -67865 -76847 -160196 302802 2507 96704 -172798 22572
15366 128726 322938 -261210 460957 118513 -97679 325749 -81965 -34737 234056 367656
15356 367656 181223 189974 187666 163255 177799 106646 -180171 138892 -38505 161534 194372
15345 194372 -45745 393345 253629 226360 76758 -155533 245010 441246 -122732 148287
15334 -44809 147390 328396 315270 -314 379437 330392 -46119 276770 78088 369858 234036
15323 234036 339029 31533 628466 303285 292015 -137182 326803 110886 351183 -142158
15312 316736 204606 131875 218211 66454 194341 127030 8452 212353 148676 -422336 207835
15300 220380 482962 -127892 -328676 -67164 280039 150520 556901 522912 156701 220996
$$ packed form
15378D6020K90146r2402R2425f7865q982q3349C02802B507R4197a72798B2572
15366A28726J94212b61210D60957A18513i7679C25749h1965c4737B34056J33600
15356C67656A81223Q751k308k4411J4544p1153a80171A38892c8505A61534L2838
15345A94372d5745C93345j39716k7269G6758a55533B45010J96236a22732A48287
15334d4809A47390J81006j3126c14C79437m9045d6119B76770G8088K91770j35822
15323B34036J04993C1533N96933C03285j1270a37182C26803A10886K40297a42158
15312C16736j12130p2731Q6336F6454J27887o7311H452K03901o3677d22336B07835
15300B20380K62582a27892k00784f7164B80039j29519M06381l3989A56701O4295
$$ plain form
15290 220996 201998 -15865 -225759 293093 106892 -49868 3925 118481 -208504 -35753 -233938
15279 -233938 -93382 -76401 -85124 78847 22120 -57827 98720 286354 327214 -48350 -348026
15268 -348026 203679 104311 -22800 -225578 -72293 -31706 -103751 205708 159943 331572 55406
15256 -9238 -137900 166255 27352 369189 267168 -355268 192085 58065 -164084 122976
15245 309732 12084 69783 -67825 28326 24743 -153345 106177 -188490 -122731 160953 38260
15233 -168559 79088 567779 322677 182189 692500 1213969 1309461 1086804 1242823 495259
15222 467966 205129 162900 259112 6983 -3567 131806 224410 48242 -49601 125461 207635
15211 207635 -20306 164574 263533 95261 181918 209938 111703 174376 -1518 67545 107130
$$ packed form
15290B20996j8998a5865k09894B93093A06892d9868C925J14556b08504c5753j98185
15279b33938i3382J6981q723G8847B2120e7827I8720J87634M0860d8350k99676
15268c48026B03679r9368b2800k02778g2293c1706p2045B05708m5765J71629E5406
15256i238j28662A66255B7352L41837j02021c55268A92085E8065a64084A22976
15245C09732A2084N7699f7825B8326l583a53345A06177a88490O5759A60953C8260
15233a68559G9088M88691k45102j40488N10311N21469R5492k22657J56019D95259
15222D67966B05129m2229R6212F983c567A31806R2604D8242d9601A25461Q2174
15211B07635b0306A64574R8959I5261Q6657K8020r8235O2673a518F7545L9585
$$ plain form
15200 107130 401712 9153 237010 278187 -10183 -254337 43235 -100172 294099 27325 86782
15189 86782 255577 -84643 54040 207622 -255913 -51323 -61655 419361 -51558 323843 46440
15177 112873 197204 20848 261476 -223355 141765 115860 -113427 316785 -149669 -90205
15167 -90205 360265 129006 99677 139952 234857 168723 245679 -94167 -75550 175230 364954
15156 364954 -59720 246047 136224 -5698 173652 165803 465288 -155455 -7768 -404979 -81341
15144 97946 125005 113971 -21826 110587 128165 140442 259549 70468 124628 -118196 25542
15132 133712 115240 140587 345656 157396 319637 -18757 -97149 105847 -268705 531274
15121 -31114 -36326 175321 -10321 4548 190222 114289 -7483 111206 460601 1981 318985
$$ packed form
15200A07130K94582I153K27857M1177a0183k44154D3235a00172B94099B7325N9457
15189H6782J68795h4643E4040J53582b55913e1323j0332D19361e1558C23843D6440
15177A12873Q4331B0848K40628b23355A41765k5905a13427C16785a49669N9464
15167i0205C60265A29006k9329M0275R4905o6134P6956i4167J8617A75230J89724
15156C64954e9720B46047j09823e698A73652p849K99485a55455g768l97211h1341
15144I7946K7059j1034b1826A10587J7578J2277J19107G0468N4160a18196B5542
15132A33712j8472K5347K05069A57396J62241a8757p8392A05847b68705E31274
15121c1114n212A75321a0321D548J85674p5933g483A11206L49395A981L17004
$$ plain form
15110 318985 -74995 177947 -85072 381557 337283 312950 253705 347273 428844 -7696 270169
15098 38494 17244 38885 528478 -107672 467875 166852 271672 406017 46737 -97165
15087 195341 -128162 267678 -298066 207931 -47304 28094 694 219626 -28055 38941 375229
15076 375229 119961 -290909 538286 330915 137352 9859 280573 67606 108252 238801
15066 238801 114335 113886 -182769 -87109 -159415 118872 75782 177004 107136 57389 124851
15055 124851 317127 -116714 206790 -198840 206485 77080 8060 465778 84971 191965
15045 191965 485015 149880 221088 38467 134995 -67941 115734 303000 152976 148748 228372
15034 228372 484998 410687 508416 370633 566405 262933 284238 167303 211592 205644 323623
$$ packed form
15110C18985g4995A77947h5072C81557m4274k4333n9245R3568Q1571g696B70169
15098C8494A7244K1641M89593a07672D67875A66852J04820J34345D6737i7165
15087A95341a28162B67678b98066B07931d7304B8094F94K18932b8055C8941L36288
15076C75229A19961b90909E38286k07371A37352I859K70714F7606M0646J30549
15066B38801A14335m49a82769h7109p2306A18872m3090J01222o9868m9747O7462
15055A24851J92276a16714B06790a98840B06485G7080H060M57718H4971J06994
15045A91965K93050A49880P1208C8467R6528f7941A15734J87266j50024m228P9624
15034B28372K56626p4311R7729j37783J95772B62933K1305j16935M4289n948J17979
$$ plain form
15023 323623 183098 301745 686045 125381 250858 180245 329999 253057 601284 601291 730977
15012 730977 394479 782376 481075 506385 436468 478358 328553 458639 698296 785048
15002 785048 235026 490201 258218 378224 414962 341295 436258 393528 258207 518162
14992 518162 215353 519878 141282 165895 715777 571169 281274 144417 400499 602281
14982 602281 338880 211017 221378 332713 444804 387364 328417 265706 762644 574124
14972 574124 740640 320270 785030 547898 649948 829989 595488 892482 739653 771049
14962 771049 484977 392986 239625 682043 678792 884923 698664 356380 534265 269810
14952 269810 371407 132784 300934 177372 332338 289724 622434 380569 430910 430345
$$ packed form
15023C23623j40525J18647L84300A25381J25477p0613J49754p6942L48227PJ29686
15012G30977l36498L87897l01301K5310o9917M1890j49805J30086K39657Q6752
15002G85048B35026K55175k31983J20006L6738p3667R4963m2730j35321K59955
14992E18162B15353L04525A41282K4613N49882j44608B81274j36857K56082K01782
14982F02281k63401j27863J0361J11335J12091n7440n8947o2711M96938j88520
14972E74124J66516C20270M64760k37132J02050J80041k34501K96994j52829L1396
14962G71049k86072r1991j53361M42418l251K06131j86259l42284J77885k64455
14952B69810J01597A32784J68150j23562J54966m2614L32710k41865N0341n65
$$ plain form
14942 430345 484253 393931 444470 470456 431153 85268 268572 589541 244197 782400 277866
14930 522682 459086 399193 439069 664382 386865 380148 368533 509067 843221 530907 572129
14919 572129 801918 522714 746993 963708 1105512 1091912 709422 1079631 1257870 1367131
14909 1367131 1665575 1351146 1574238 1415183 1294601 1238754 1678847 1821466 1749624 1476874
14899 1476874 1579030 1152244 927958 562865 862432 838426 812763 566850 650081 93828
14888 380315 573811 613006 320027 595278 535756 203775 261084 462572 257898 559558
14878 559558 768033 561441 172760 420739 403466 351039 393193 922826 899643 649461
14868 649461 923154 913505 549079 521990 721505 743062 795191 454352 629360 540540 622567
$$ packed form
14942D30345N3908r0322N0539K5986l9303H5268J83304L20969B44197N38203B77866
14930E22682o3596n9893L9876K25313k77517o717j1615J40534L34154l12314M1222
14919E72129K29789k79204K24279K16715J41804j3600l82490L70209J78239J09261
14909A367131K98444l14429K23092j59055j20582n5847M40093J42619p1842k72750
14899A476874J02156m26786k24286l65093K99567k4006k5663k45913Q3231I3828
14888C80315J93496L9195k92979K75251n9522B03775N7309K01488k04674L01660
14878E59558K08475k06592A72760K47979j7273n2427M2154N29633k3183k50182
14868F49461K73693r649l64426k7089J99515K1557N2129l40839J75008q8820Q2027
$$ plain form
14857 622567 460852 411801 432516 665151 459354 718887 679959 482864 542503 732174
14847 732174 269861 385837 603679 525187 330532 426553 631617 72873 548003 384806
14837 384806 478050 207962 666331 429885 429664 401647 606047 1024654 648076 1051354
14827 1051354 1012697 1293753 773481 835792 1028051 964072 827159 997264 622028 826302
14817 826302 350397 561000 524015 533871 880751 808386 542390 485052 719443 637385 790645
14806 790645 661534 607158 551779 919280 355166 918349 649513 725712 530089 711983
14796 711983 1261351 794387 556284 497991 621199 850915 751690 938946 840051 1221731
14786 1221731 682149 681504 689896 718770 288488 586574 609451 519819 616568 591017 566386
$$ packed form
14857F22567j61715m9051K0715K32635k05797K59533l8928j97095N9639J89671
14847G32174B69861J15976K17842p8492j94655R6021K05064G2873M75130j63197
14837C84806R3244B07962M58369k36446k21k8017K04400M18607l76578M03278
14827A051354l8657K81056n20272O2311J92259o3979j36913J70105l75236K04274
14817H26302C50397K10603l6985R856L46880p2365k65996n7338K34391q2058J53260
14806G90645j29111n4376n5379L67501C55166N63183k68836P6199j95623J81894
14796G11983N49368m66964k38103n8293J23208K29716r9225J87256r8895L81680
14786A221731n39582o45Q392K8874B88488K98086K2877q9632R6749k5551k4631
$$ plain form
14775 566386 557238 511483 682635 497923 510267 449980 633561 984257 577937 683511
14765 683511 888016 587676 530520 798747 778714 880141 790188 974893 763969 938730
14755 938730 365731 656062 412418 542598 340140 705785 525514 520177 389944 567478
14745 567478 678194 574021 661327 552317 783424 337285 933350 653307 498983 749102
14735 749102 642088 553346 845651 652083 620821 683999 393616 669211 834569 606209
14725 606209 984386 969547 377956 984911 760460 884032 925166 770446 984922 891040
14715 891040 1177402 1073613 991840 1630199 1529276 1555988 1311746 1343522 906207 1131672
14705 1131672 990066 1142283 954408 926171 702560 825946 1097620 963014 719641 1044082
$$ packed form
14775E66386r148m5755J71152j84712J2344o0287J83581L50696m06320J05574
14765F83511K04505l00340n7156K68227k0033J01427q9953J84705k10924J74761
14755I38730C65731K90331k43644J30180k02458L65645j80271n337j30233J77534
14745E67478J10716j04173Q7306j09010K31107C37285N96065k80043j54324K50119
14735G49102j07014q8742K92305j93568l1262O3178k90383K75595J65358k28360
14725F06209L78177j4839C77956O06955k24451J23572M1134j54720K14476r3882
14715H91040K86362j03789q1773O38359j00923K6712k44242L1776m37315K25465
14705A131672j41606J52217j87875k8237k23611J23386K71674j34606k43373L24441
$$ plain form
14695 1044082 1069036 1134365 999710 1077059 1142838 975509 1272630 1182465 1454589 1732335
14685 1732335 1474098 1540424 1499522 1612319 1346408 1064153 866901 826387 885462 822080
14675 822080 1027920 1010103 819064 903387 860351 915085 1000725 851176 571930 1058820
14665 1058820 745938 759596 753251 938268 831614 695850 825092 1153919 1009306 870965
14655 870965 990454 1079337 941234 936105 1031436 892246 1095066 786117 885282 840850 1213364
14644 1213364 1057157 1258813 1297552 1428542 824975 923210 1221511 1226589 1252016 1150558
14634 1150558 1066266 1305676 992972 1114594 1157539 1474995 1150129 1034952 1040851 1020310
14624 1020310 1319695 791232 1069016 1313885 1035446 1330243 1035293 1234338 1140144 1290450
$$ packed form
14695A044082K4954O5329j34655P7349O5779j67329K97121r0165K72124K77746
14685A732335k58237O6326m0902J12797k65911k82255j97252m0514N9075o3382
14675H22080K05840j7817j91039Q4323m3036N4734Q5640j49549k79246M86890
14665A058820l12882J3658o345J85017j06654j35764J29242L28827j44613j38341
14655H70965J19489Q8883j38103n129R5331j39190K02820l08949R9165m4432L72514
14644A213364j56207K01656L8739J30990o03567R8235K98301N078K5427j01458
14634A150558q4292K39410l12704J21622M2945L17456l24866j15177N899k0541
14624A020310K99385n28463K77784K44869k78439K94797k94950J99045r4194J50306
$$ plain form
14614 1290450 1271403 1147343 1228107 1388915 1345178 1195377 1331022 1250046 1446603 1840305
14604 1840305 1314345 1306100 1063697 1393536 1696126 996772 1470455 1187897 1273428 1302770
14594 1302770 1526837 1326149 1299044 1629639 2066209 1495060 1401660 1278823 1453352 1658490
14584 1658490 1702938 1651842 1566699 1545193 1406366 1544207 1539848 1814952 1729340 1658538 1845949
14573 1845949 1511713 2000124 1602919 1719053 1604380 1999025 1866823 1710883 1544442
14564 1544442 1637748 1735120 2322360 1643717 1734449 2008868 1974186 2314192 2318880 2457951
14554 2457951 2295852 2334281 2260385 2160563 2358848 2419741 2571300 2447689 2370071 2504362
14544 2504362 2720053 2922221 3550124 3581753 3867518 3905637 4779854 5272054 6116043 7342444
$$ packed form
14614A290450j9047j24060Q0764J60808m3737j49801J35645q0976J96557L93702
14604A840305n25960q245k42403L29839L02590o99354M73683k82558Q5531K9342
14594A302770K24067k00688k7105L30595M36570n71149r3400j22837J74529K05138
14584A658490M4448n1096q5143k1506j38827J37841m359K75104q5612p0802J87411
14573A845949l34236M88411l97205J16134j14673L94645j32202j55940j66441
14564A544442R3306R7372N87240o78643R0732K74419l4682L40006M688J39071
14554B457951j62099L8429p3896r9822J98285O0893J51559j23611p7618J34291
14544B504362K15691K02168O27903L1629K85765L8119Q74217M92200Q43989J226401
$$ plain form
14534 7342444 9613301 13592317 20086326 30180333 28541820 16311929 9302437 5798104
14526 5798104 4336510 4002279 4051137 4252594 3628089 2680549 2408846 2218913 2667997
14517 2667997 2396709 2026222 2059482 2288313 2062472 2253041 2152542 2381329 2100771 2021027
14507 2021027 2367185 2164581 2448780 2147114 2641568 2704269 2635443 2429200 2649943 2407992
14497 2407992 2422583 3007474 2848057 2771013 2709764 2970700 2756348 2921486 2821613 2479611
14487 2479611 2756611 2640413 2881612 3223546 2898926 2911683 3032635 3178696 3230157 3483096
14477 3483096 3484782 3097576 3517269 3336935 3344675 3302870 3513108 3559752 3619391 3455793 3904320
14466 3904320 3351022 3421284 3434353 3697626 3645572 3624697 3646091 4013572 4116598 3958563
$$ packed form
14534G342444K270857L979016O494009J0094007j638513j2229891p009492l504333
14526E798104j461594l34231M8858K01457o24505r47540k71703j89933M49084
14517B667997k71288l70487L3260K28831k25841J90569j00499K28787k80558p9744
14507B021027L46158k02604K84199l01666M94454O2701o8826k06243K20743k41951
14497B407992J4591N84891j59417p7044o1249K60936k14352J65138r9873l42002
14487B479611K77000j16198K41199L41934l24620J2757J20952J46061N1461K52939
14477C483096J686l87206M19693j80334P740m1805K10238M6644N9639j63598M48527
14466C904320n53298P0262J3069K63273n2054k0875K1394L67481J03026j58035
$$ plain form
14456 3958563 3975134 3995231 4237601 4030904 4116977 4112981 4641465 4507116 4326461 4576919
14446 4576919 4599304 4722220 4496751 4700642 4955887 4761699 4892877 4849531 4997237 4720815
14436 4720815 5056457 5072703 5172551 5371368 5423965 5645515 5609618 5431626 5712560 5591473
14426 5591473 5771314 5576524 6182563 5953055 6208147 6082558 6270940 6229924 5904228 6261480
14416 6261480 6671731 7011320 7232126 6775151 6771465 7235075 6847676 7397894 7586141 7772166
14406 7772166 7821362 7956703 8213203 8274701 7924705 8157323 8240730 8384527 8305228 8786634
14396 8786634 8656301 9062962 8919557 9289948 9240272 9209962 9258417 9988302 10048598 10313336
14386 10313336 10000425 10348537 10196563 10029217 10793573 10917054 11384225 11218739 11341851
$$ packed form
14456C958563J6571K0097K42370k06697Q6073l996N28484j34349j80655K50458
14446D576919K2385J22916k25469K03891K55245j94188J31178m3346J47706k76422
14436D720815L35642J6246R9848J98817N2597K21550l5897j77992K80934j21087
14426E591473J79841j94790O06039k29508K55092j25589J88382m1016l25696L57252
14416F261480M10251L39589K20806m56975l686M63610l87399N50218J88247J86025
14406G772166M9196J35341K56500O1498l49996K32618Q3407J43797p9299M81406
14396H786634j30333M06661j43405L70391m9676l0310M8455P29885O0296K64738
14386A0313336l12911L48112j51974j67346P64356J23481M67171j65486J23112
$$ plain form
14377 11341851 11433568 11839683 12136073 12382811 12475454 12382631 12811318 12986965 13068602 13778288
14367 13778288 13712990 14426496 14613825 14752031 15254217 15281444 15327881 15541037 15852957 16170212
14357 16170212 16420817 17107136 17671105 17858369 18301134 18500559 19014042 19648739 19678339
14348 19678339 20328582 20267629 20998919 21659959 21958026 22038477 22627072 23474088 23961926 24224654
14338 24224654 25129860 25721498 26316948 27109232 27864586 28301484 29595504 30097090 30350110
14329 30350110 31638005 32385965 33382051 34129232 35043039 36387516 37150602 38425775 39356303
14320 39356303 40353353 41786425 42953610 44227003 45872707 47082644 48794350 50239373
14312 50239373 51899007 53875840 55312811 57483478 59517743 61631548 64183702 66743699
$$ packed form
14377A1341851R1717M06115K96390K46738R2643r2823M28687J75647Q1637P09686
14367A3778288o5298P13506J87329J38206N02186K7227M6437K13156L11920L17255
14357A6170212K50605O86319N63969J87264M42765J99425N13483O34697K9600
14348A9678339O50243o0953P31290O61040K98067Q0451N88595Q47016M87838K62728
14338B4224654R05206N91638N95450P92284P55354M36898J294020N01586K53020
14329C0350110J287895P47960R96086P47181R13807J344477P63086J275173R30528
14320C9356303R97050J433072J167185J273393J645704J209937J711706J445023
14312E0239373J659634J976833J436971K170667K034265K113805K552154K559997
$$ plain form
14304 66743699 68761474 71362075 73919779 76699345 79535596 82937680 86393990 89746882
14296 89746882 93750826 97988069 101937252 106798512 111573565 116658229 122058826 127686231
14288 127686231 133926900 140217805 147313589 154634896 162245736 170511313 178993311 188456167
14280 188456167 197995608 208549811 218965324 230825493 242535043 255672188 268731572
14273 268731572 282166858 295924176 309534760 322780862 335532035 348164866 360418558
14266 360418558 371982747 383280637 393339196 402587826 410502033 418150905 425302224
14259 425302224 431478548 435487967 436770718 436228500 437426858 434148592 427946643 421524898
14251 421524898 412962924 401423651 389607465 377077005 363744694 349791806 336326167
$$ packed form
14304F6743699K017775K600601K557704K779566K836251L402084L456310L352892
14296H9746882M003944M237243L949183M861260M775053N084664N400597N627405
14288A27686231O240669O290905P095784P321307P610840Q265577Q481998R462856
14280A88456167R539441J0554203J0415513J1860169J1709550J3137145J3059384
14273B68731572J3435286J3757318J3610584J3246102J2751173J2632831J2253692
14266C60418558J1564189J1297890J0058559R248630P914207P648872P151319
14259D25302224O176324M009419J282751n42218J198358l278266o201949o421745
14251D21524898q561974j1539273j1816186j2530460j3332311j3952888j3465639
$$ plain form
14244 336326167 322334358 308774717 295830584 282630199 269587712 257830504 245707713
14237 245707713 233859409 222720181 212004603 202679748 193277032 184586414 175348157
14230 175348157 166169435 157927495 150638118 143212813 135946528 130201501 124084344 118113102
14222 118113102 113017016 108080115 103180150 98640397 94796633 90879829 87553146 83785980
14214 83785980 80595358 77277474 74475465 71260836 69283282 66261046 63811647 61517664
14206 61517664 59437716 57881534 55625147 53755213 52216288 50360168 48978309 47426142
14198 47426142 45573641 44682530 43040263 41749100 40817038 39785853 38912861 37410834
14190 37410834 36736620 35215644 34593473 33202882 32754856 31901558 31130435 29770071 29305722
$$ packed form
14244C36326167j3991809j3559641j2944133j3200385j3042487j1757208j2122791
14237B45707713j1848304j1139228j0715578r324855r402716q690618r238257
14230A75348157r178722q241940p289377p425305p266285n745027o117157n971242
14222A18113102n096086m936901m899965m539753l843764l916804l326683l767166
14214H3785980l190622l317884k802009l214629j977554l022236k449399k293983
14206F1517664k079948j556182k256387j869934j538925j856120j381859j552167
14198D7426142j852501q91111j642267j291163r32062j031185q72992j502027
14190C7410834o74214j520976o22171j390591m48026q53298p71123j360364m64349
$$ plain form
14181 29305722 28886129 28042026 27242669 26802004 26094041 24986700 24849565 24146089 23545804
14172 23545804 23097856 22363763 22229388 21412590 21123907 20649624 20285163 19587259 19080744
14163 19080744 18860722 18378679 17870508 17769028 17478021 16933211 16932857 16568223 16080778 15771829
14153 15771829 15271072 15533786 15150112 14817223 14584969 14140828 14064621 13747348 13252694
14144 13252694 13596377 13242914 12817561 12928587 12199741 11984820 11979440 12016469 11354477 11607681
14134 11607681 11355897 11271571 10604912 11004798 10705108 10458062 10155073 10212594 9641044 9762251
14124 9762251 9639078 9679054 9300566 9435800 9045225 9049881 8615545 8944317 8674068 8460223
14114 8460223 8279771 8105870 8350673 8233844 7928908 7749136 7769134 7523936 7361214 7335136
$$ packed form
14181B9305722m19593q44103p99357m40665p07963j107341j37135p03476o00285
14172B3545804m47948p34093j34375q16798k88683m74283l64461o97904n06515
14163A9080744k20022m82043n08171j01480k91007n44810l54l64634m87445l08949
14153A5771829n00757K62714l83674l32889k32254m44141p6207l17273m94654
14144A3252694L43683l53463m25353J11026p28846k14921n380L7029o61992K53204
14134A1607681k51784q4326o66659L99886k99690k47046l02989N7521n71550J21207
14124I762251j23173L9976l78488J35234l90575M656m34336L28772k70249k13845
14114H460223j80452j73901K44803j16829l04936j79772J9998k45198j62722k6078
$$ plain form
14104 7335136 7468125 7298780 7219078 7104924 6975567 6721762 6892643 6867050 6620744 6611630
14094 6611630 6119964 6392204 6083624 6011380 6245973 6019408 6250642 5720937 5739847 5756090
14084 5756090 5369583 5248215 6129700 5106378 5599188 5453182 5325144 5305672 5542734
14075 5542734 5285844 4907961 5123424 5161313 4899646 4687596 4528525 4566086 5015103 4760150
14065 4760150 4235212 4647491 4701016 4277309 4389137 4179581 4214512 4384858 3985569 4330714
14055 4330714 4443985 4230459 3888711 4424748 3934586 3998359 3647314 3989292 3888617 3933569
14045 3933569 3994907 3844344 3956416 3555140 3672914 3906343 3790027 3792844 3748436 3566448
14035 3566448 3520836 3543694 3173974 3170510 3080866 3436656 2982064 3212958 3401322 2859901
$$ packed form
14104G335136J32989j69345p9702j14154j29357k53805J70881k5593k46306r114
14094F611630m91666K72240l08580p2244K34593k26565K31234n29705J8910J6243
14084E756090l86507j21368Q81485j023322M92810j46006j28038j9472K37062
14075E542734k56890l77883K15463L7889k61667k12050j59071L7561M49017k54953
14065D760150n24938M12279N3525m23707J11828k09556L4931J70346l99289L45145
14055D330714J13271k13526l41748N36037m90162O3773l51045L41978j00675M4952
14045C933569O1338j50563J12072m01276J17774K33429j16316K817m4408j81988
14035C566448m5612K2858l69720l464q9644L55790m54592K30894J88364n41421
$$ plain form
14025 2859901 3118048 3037335 3199920 2876372 2839876 3291562 3061550 2803801 2521554 2970783
14015 2970783 2829625 2847388 2925840 2952744 2740268 2915067 2962151 2663736 2554408 2736962
14005 2736962 2503464 2476959 2231035 2425249 2212667 2491400 2348079 2440987 2345087 2225956
13995 2225956 1850882 2333205 2093460 2116605 2115386 2207157 1978933 2079866 2277068 2354349
13985 2354349 2330304 2352000 2373158 2088811 2386657 2793214 2780545 2835171 3200231 3751146
13975 3751146 4724334 6296873 9584411 15159992 25406233 30824728 20950564 13307709
13967 13307709 8678163 6415514 5291703 4725137 3636725 3512478 3258148 2821608 2947193
13958 2947193 2595774 2626652 2411640 2662941 2231225 2620735 2576079 2197697 2094262 2135604
$$ packed form
14025B859901K58147q0713J62585l23548l6496M51686k30012k57749k82247M49229
14015B970783j41158J7763P8452K6904k12476J74799M7084k98415j09328J82554
14005B736962k33498k6505k45924J94214k12582K78733j43321R2908r5900j19131
13995B225956l75074M82323k39745K3145j219R1771k28224J00933J97202P7281
13985B354349k4045K1696K1158k84347K97846M06557j2669N4626L65060N50915
13975C751146R73188J572539L287538N575581J0246241N418495r874164p642855
13967A3307709m629546k262649j123811n66566j088412j24247k54330m36540J25585
13958B947193l51419L0878k15012K51301m31716L89510m4656l78382j03435M1342
$$ plain form
13948 2135604 2646127 1963719 2060035 2154655 2145426 1971234 2179552 1741539 1663836 2064330
13938 2064330 1965914 1743758 1953494 1750639 1673749 1634162 1925352 1985433 1611751 1786535
13928 1786535 1894873 1570612 1909688 1635806 1989964 1861555 1661847 1585494 1593014 1633753
13918 1633753 1811036 1457008 1578553 1545014 1487514 1291253 1500100 1176345 1612560 1402274
13908 1402274 1786360 1685621 1540783 1438347 1514673 1210619 1493927 1347337 1529091 1692305
13898 1692305 1420940 1468005 1167037 1278828 1127317 1197971 1567608 1501531 1035172 1361016
13888 1361016 1408466 1266659 1231009 1307902 934454 1188314 1269497 1135925 1291169 1163157
13878 1163157 1207540 1162849 1076038 995007 1155155 1406514 1200243 994766 1228462 1210219
$$ packed form
13948B135604N10523o82408R6316R4620r229j74192K08318m38013p7703M00494
13938B064330r8416k22156K09736k02855p6890l9587K91190O0081l73682J74784
13928A786535J08338l24261L39076k73882L54158j28409j99708p6353P520M0739
13918A633753J77283l54028J21545l3539n7500j96261K08847l23755M36215k10286
13908A402274L84086j00739j44838j02436P6326l04054K83308j46590J81754J63214
13898A692305k71365M7065l00968J11791j51511P0654L69637o6077m66359L25844
13888A361016M7450j41807l5650P6893l73448K53860Q1183j33572J55244j28012
13878A163157M4383m4691q6811q1031J60148K51359k06271k05477K33696j8243
$$ plain form
13868 1210219 938326 1159792 995136 1259307 953196 1322295 851882 1110616 1136823 996440
13858 996440 1058108 955310 885503 1031100 1253799 860134 1083978 980644 815607 1006399
13848 1006399 612213 1062325 1042812 1317940 951526 1103585 709210 884348 1097193 1147581
13838 1147581 1138664 1131765 1256661 730715 971036 970273 807403 987309 1055220 969134 711443
13827 711443 813588 975794 1050784 530442 1122337 685566 925195 976436 1288168 872501
13817 872501 797890 804017 1095015 1040541 808661 1367470 1048576 1010514 868565 691748
13807 691748 722754 659169 1062462 849412 764872 750834 813830 652208 423791 676444
13797 676444 1010988 1180898 751974 677277 978927 769459 873081 748946 754776 1108346
$$ packed form
13868A210219k71893K21466j64656K64171l06111L69099m70413K58734K6207j40383
13858I96440O1668j02798o9807J45597K22699l93665K23844j03334j65037J90792
13848A006399l94186M50112j9513K75128l66414J52059l94375J75138K12845N0388
13838A147581q917o899J24896n25946K40321p63j62870J79906O7911q6086k57691
13827G11443J02145J62206P4990n20342N91895m36771K39629N1241L11732m15667
13817H72501p4611O127K90998n4474k31880N58809l18894l8062j41949j76817
13807F91748L1006o3585M03293k13050q4540j4038O2996j61622k28417K52653
13797F76444L34544J69910m28924p4697L01650k09468J03622j24135N830L53570
$$ plain form
13787 1108346 756788 568934 673315 917964 830938 955242 746017 877893 1051436 665862
13777 665862 898077 774954 936324 865925 789616 1060652 558884 808663 458638 612250
13767 612250 621078 395437 1000850 519097 1044227 770621 382620 542655 643523 770519
13757 770519 769098 430360 507986 636037 684524 479997 532854 517590 531360 600772 529769
13746 529769 430763 852053 484809 688941 808612 632147 823780 699727 248595 779585
13736 779585 771460 582649 542905 187415 469276 704051 520396 464677 682021 301754
13725 626098 461973 640591 304572 555770 746536 490719 452198 600134 833410 625101
13715 625101 501121 350946 707827 624492 518778 190235 508944 637032 416344 557491
$$ packed form
13787A108346l51558j87854J04381K44649q7026J24304k09225J31876J73543l85574
13777F65862K32215j23123J61370p0399p6309K71036n01768K49779l50025J53612
13767F12250Q828k25641O05413m81753N25130k73606C82620J60035J00868J26996
13757G70519j421l38738P7626J28051M8487k04527N2857j5264J3770O9412p1003
13746E29769r9006M21290l67244K04132J19671j76465J91633j24053B48595N30990
13736G79585q125j88811l9744A87415K81861K34775j83655n5719K17344C01754
13725F26098j64125J78618C04572K51198J90766k55817l8521J47936K33276k08309
13715F25101j23980j50175L56881q3335j05714A90235L18709J28088k20688J41147
$$ plain form
13705 557491 450739 632300 496913 348337 770240 665773 684936 723267 403055 554570
13695 554570 677175 618862 494681 759852 382740 698290 615848 595647 455723 604900
13685 604900 406662 773112 296068 610886 238551 470039 245791 297514 316795 698796
13675 698796 219491 489729 522046 398438 501540 561294 703736 464227 546625 385280
13665 385280 250180 180361 526665 75884 527764 490710 472718 235516 546534 202340
13654 380872 374502 405873 517514 410312 608482 579633 376387 358352 367144 423942 147831
13642 350250 789606 493615 428813 246050 830867 545890 570520 487655 453841 336157
13632 336157 454822 352567 553891 385311 293655 594248 442952 393515 484948 -12277
$$ packed form
13705E57491j06752J81561j35387j48576M21903j04467J9163L8331l20212J51515
13695E54570J22605n8313j24181K65171l77112L15550q2442k0201j39924J49177
13685F04900j98238L66450B96068L14818B38551K31488k24248N1723J9281L82001
13675F98796B19491K70238L2317j23608J03102N9754J42442k39509Q2398j61345
13665C85280j35100o9819L46304G5884M51880l7054j7992B35516L11018B02340
13654C80872o370L1371J11641j07202J98170k8849k03246j8035Q792N6798A47831
13642C50250M39356k95991o4802j82763N84817k84977K4630q2865l3814j17684
13632C36157J18665j02255K01324j68580r1656L00593j51296m9437R1433a2277
$$ plain form
13621 568422 245302 116301 546331 839765 508156 294881 537929 154522 70631 544677
13611 544677 467927 194884 441492 277844 555796 197858 300332 524352 45613 444226
13601 444226 354725 517020 -56752 490654 182683 252863 429253 611172 621659 220571
13590 241912 134628 295324 185737 390118 318665 -26136 441372 605489 109392 442816
13580 442816 349536 355248 114185 285505 53200 359388 161787 102169 188706 553468 287616
13569 287616 211753 134355 162419 27661 585223 277248 -241232 219346 357072 362153 319147
13558 319147 143928 152587 231424 55900 355325 498261 214309 375122 97693 173041 399248
13547 399248 285221 360350 250717 192392 442489 126698 161037 364915 58913 231716
$$ packed form
13621E68422B45302A16301M30030K93434l31609k13275K43048A54522G0631M74046
13611E44677p6750A94884K46608j63648K77952A97858J02474K24020D5613L98613
13601D44226q9501J62295e6752D90654A82683P0180J76390J81919J0487B20571
13590B41912j07284J60696j09587K04381p1453b6136D41372J64117A09392L33424
13580D42816r3280N712A14185J71320E3200L06188A61787n9618Q6537L64762k65852
13569B87616p5863p7398K8064B7661N57562B77248b41232B19346J37726N081m3006
13558C19147A43928Q659P8837E5900K99425J42936B14309J60813I7693P5348K26207
13547C99248j14027P5129j09633n8325K50097A26698L4339K03878E8913J72803
$$ plain form
13537 231716 382923 300879 367082 44018 234654 439526 233821 -12836 460966 162050
13526 302964 240948 251800 8087 144755 274698 574272 315740 378224 278412 112667 258932
13515 258932 259813 166721 154905 411760 445831 265985 299095 209925 404642 322859 603763
13504 603763 477133 405535 100013 173664 215405 160024 -24466 413484 369026 142661 -27429
13492 400976 292334 274132 16780 452591 132923 -77644 201981 288109 176074 174042 -110660
13480 299118 395267 -34803 633251 506091 155951 295660 56366 101611 303098 -81608
13469 160729 318505 167430 1018 106026 -83332 208455 162165 283104 156814 102812
13459 102812 293606 221160 -201729 327948 -67576 -166899 238083 273802 109350 10366
$$ packed form
13537B31716J51207q2044O6203D4018J90636K04872k05705a2836D60966A62050
13526C02964o2016J0852H087J36668J29943K99574k58532O2484r9812A12667J46265
13515B58932Q81r3092j1816K56855L4071j79846L3110q9170J94717q1783K80904
13504F03763j26630p1598A00013P3651M1741n5381b4466D13484m4458A42661b7429
13492D00976j08642j8202A6780M35811A32923g7644B01981Q6128j12035k032a10660
13480B99118R6149c4803F33251j27160A55951J39709E6366M5245K01487h1608
13469A60729J57776j51075A018J05008h3332B08455m6290J20939j26290n4002
13459A02812J90794p2446b01729C27948f7576r9323B38083L5719A09350A0366
$$ plain form
13448 483492 405715 188356 359873 144250 295960 308006 56611 43079 -13141 430407
13437 217528 534638 231654 190449 302592 171320 392640 602018 335926 224107 145053
13427 145053 -47966 229231 225483 145419 406160 215137 255037 162460 346281 355534 249547
13416 249547 149377 -21999 203493 167274 257406 82833 -134237 44043 185834 -13476 183670
13404 486396 76237 94120 97397 159349 -136148 276500 259727 152807 100246 42366 311865
13393 311865 284232 -31768 90631 34981 137596 1398 202810 149478 -249689 147155 27956
13381 374104 -133491 101591 434099 410780 268507 20472 128067 205449 111323 168058
13371 168058 235226 -7326 337844 132793 215931 102285 148489 369381 282389 261404 275088
$$ packed form
13448D83492p7777A88356J71517A44250J51710J2046E6611j3532a3141D30407
13437B17528L17110B31654m1205J12143j31272K21320K09378k66092j11819p9054
13427A45053d7966B29231l748q0064K60741j91023L9900r2577J83821R253j05987
13416B49547j00170b1999B03493l6219R0132H2833a34237D4043J41791a3476A83670
13404D86396G6237J7883L277O1952a36148B76500j6773j06920n2561D2366K69499
13393C11865k7633c1768I0631C4981J02615A398K01412n3332b49689A47155B7956
13381C74104a33491A01591L32508k3319j42273B0472J07595P7382r4126N6735
13371A68058O7168g326C37844A32793Q3138A02285M6204K20892q6992k0985J3684
$$ plain form
13360 275088 254917 38059 85641 89984 127253 92465 335462 266311 65331 -21944 51908
13348 18094 -238556 307279 156336 172117 45222 465170 147178 -103601 359869 29302
13337 262527 81469 -36534 360946 255141 360887 64572 202243 396027 114680 -98175
13326 320432 282866 428004 198062 146448 189403 193559 198213 172888 35051 408222 -185067
13314 189014 19046 352366 201105 372989 59743 159860 152464 -50682 57936 282538 491183
13303 491183 292053 340534 351788 449869 296710 -160483 166875 333718 113157 64073
13293 64073 241205 147584 -127303 228202 101517 6986 37955 193246 455155 304738
13283 304738 277367 -5075 -129145 259095 97159 188995 157927 159483 401180 127734 101487
$$ packed form
13360B75088k0171C8059M7582M343L7269l4788K42997o9151F5331b1944E1908
13348A8094b38556C07279j50943J5781D5222M19948A47178a03601C59869B9302
13337B62527H1469c6534C60946j05805J05746F4572J37671J93784A14680i8175
13326C20432l7566J45138A98062n1614M2955M156M654k5325C5051L73171a85067
13314A89014A9046L33320j51261J71884E9743J00117p396e0682E7936K24602K08645
13303D91183j99130M8481J1254R8081j53159a60483A66875J66843A13157m9084
13293F4073J77132r3621a27303B28202A01517F986L0969J55291K61909j50417
13283C04738k7371e075j24070B59095I7159R1836l1068J556K41697A27734k6247
$$ plain form
13272 101487 69381 -31663 163811 -113774 21851 -53844 -259591 10862 33499 8760 53513
13261 53513 44666 40171 186024 -7480 -26302 324485 -176575 245187 96939 -161921 384392
13249 -221701 104756 225144 188738 78495 61503 180829 212786 146679 455984 -76688 337185
13237 21773 55291 94122 -86525 -457408 98928 320810 202179 -239385 62797 328892 -156537
13225 29963 197183 -38841 -115294 237779 -413197 -96291 99071 30344 31170 93275 16862
13213 -203670 151047 74892 65537 -337625 -72419 232472 147856 115022 361101 -54203 192706
13201 60464 -270147 111886 293499 300393 29152 76890 247481 -107811 -69806 5104 478837
13190 478837 -185990 -106519 -104241 61487 -273668 -158263 119289 52286 -123669 197182
$$ packed form
13272A01487l2106c1663A63811a13774B1851e3844k05747A0862K2637H760M4753
13261E3513q847m495J45853g480j8822C24485a76575B45187I6939a61921C84392
13249b21701A04756J20388l6406G8495j6992J19326L1957o6107L09305g6688C37185
13237B1773L3518L8831h6525l70883I8928K21882j18631b39385F2797K66095a56537
13225B9963J67220c8841p6453B37779d13197i6291I9071C0344Q26O2105A6862
13213b03670A51047G4892r355c37625g2419B32472q4616l2834K46079e4203A92706
13201F0464b70147A11886J81613O894B9152M7738J70591a07811L8005E104M73733
13190D78837a85990P9471K278F1487b73668J15405A19289E2286a23669A97182
$$ plain form
13179 -54379 -177568 125461 -71751 -109206 151932 155604 105528 73086 -5062 425531 60468
13167 -76142 184533 420369 37063 198744 -203986 -41248 76213 -28342 84787 177299 128993
13156 128993 -92277 -212798 310948 40931 150844 -46365 31592 18922 -29539 56515 147163
13145 147163 -162521 116528 98889 80216 157309 165443 128076 -18063 -49277 166157 271167
13134 271167 140927 135189 243260 -297160 -190888 164157 -27487 364472 -92 35295 390209
13123 390209 44868 -79969 -86841 131753 126942 -179976 -386783 72307 70084 -91761 23604
13111 -38307 433445 -166994 431095 129907 213957 -371793 43199 221224 -304186 255214
13100 111216 116815 -88153 15765 214964 93343 -32833 -61965 99804 126341 -91472 83366
$$ packed form
13179e4379j23189A25461g1751l7455A51932L672n0076l2442e062D25531F0468
13167g6142A84533K35836C7063J61681b03986d1248G6213b8342H4787R2512m8306
13156A28993i2277j20521C10948D0931J09913d6365C1592j2670b9539E6515R0648
13145A47163a62521A16528j7639j8673P7093Q134l7367a8063l1214A66157J05010
13134B71167j30240n738J08071b97160J06272A64157b7487C64472i2C5295L54914
13123C90209D4868g9969o872A31753m811a79976k06807G2307k223i1761B3604
13111c8307D33445a66994D31095A29907Q4050c71793D3199J78025c04186B55214
13100A11216N599h8153A5765J99199I3343c2833k9132I9804K6537i1472H3366
$$ plain form
13088 118364 -137248 334420 -222173 -273966 137495 85571 153464 -259960 -60023 -83518
13078 -83518 -21913 109177 416465 -56403 121534 -50960 117945 -169596 269582 -237735
13067 680457 40024 279472 48664 -140234 39392 -63511 34090 -93608 -10234 83891 301664
13056 301664 -657 196294 -105141 -108793 126856 118895 -326280 175328 244004 -76527 -138751
13045 -138751 -4448 -23091 143992 278848 -196980 181626 347377 101272 -35529 269211
13034 226989 -75976 -159696 135551 -26671 41272 137683 98006 81547 225513 57966 -115586
13022 -74929 79285 259066 239211 98633 49637 -80258 6905 173051 55915 46078 -159778
13010 -68592 19334 158914 -267423 167828 360585 350768 -92342 159400 313948 206399
$$ packed form
13088A18364a37248C34420b22173n1793A37495n1924O7893b59960f0023k3495
13078h3518b1913A09177L07288e6403A21534e0960A17945a69596B69582b37735
13067F80457D0024K39448D8664a40234C9392f3511C4090i3608a0234H3891K17773
13056C01664f57A96294a05141l652A26856p961c26280A75328O8676g6527o2224
13045a38751d448j8643A43992J34856a96980A81626J65751A01272c5529B69211
13034B26989g5976q3720A35551b6671D1272R6411l9677j6459J43966E7966a15586
13022g4929G9285J79781j9855I8633m8996h0258F905J66146E5915r837a59778
13010f8592A9334J39580b67423A67828J92757r817i2342A59400J54548j07549
$$ plain form
13000 206399 237584 -128818 -53555 -288411 -122422 -54340 61799 -133640 112526 -92159
12989 172085 -53895 402438 129452 -149043 211309 70235 26545 -48864 241990 129126
12979 129126 310029 -161516 -5868 231883 -102597 103252 109054 -73248 -88867 -89623 299896
12967 -154966 152017 299346 58011 -313 -205540 15991 45810 127720 44597 -23816 122868
12955 -59676 204610 -158791 -133971 2999 161445 49309 273875 79091 -118138 -146126 -490161
12944 -490161 -121685 -106257 174999 -288126 -57226 -48052 176327 -202743 5580 16168 -193673
12932 86918 94863 205304 173367 85055 -279681 -21409 -166932 -184208 -302431 89402 -261198
12920 -20843 108387 -22381 41474 -215697 356346 198313 32467 259678 -114128 253905
$$ packed form
13000B06399L1185a28818e3555k34856a22422e4340F1799a33640A12526i2159
12989A72085e3895D02438A29452a49043B11309G0235B6545d8864B41990j12864
12979A29126J80903a61516e868B31883a02597A03252N802g3248j5619p56B99896
12967a54966A52017J47329E8011c13k05227A5991K9819Q1910D4597b3816A22868
12955e9676B04610a58791K4820B999J58446D9309K24566G9091a18138k7988l44035
12944d90161a21685J5428A74999b88126e7226R174A76327b02743E580J0588a93673
12932H6918P945J10441l1937H5055b79681b1409j45523j7276j18223H9402b61198
12920b0843A08387b2381D1474b15697C56346j58033C2467K27211a14128B53905
$$ plain form
12909 -161975 163137 -122093 102929 18732 590805 -124758 -141069 -78087 17977 15203 207547
12898 207547 -321194 258415 73144 251341 -54804 5064 81190 -139810 -29799 14137 145532
12887 145532 -122106 -16058 -29113 -106770 110286 97529 143443 308358 21437 -445816 52717
12875 -171592 -35025 3783 4827 292704 103827 -93138 58096 92307 -210669 -181843 83027
12863 -136103 222427 -32103 -412661 14492 152525 -61135 -46802 -7462 -124426 12847 -217402
12851 220010 -272506 -473061 250957 -93091 -54310 -191171 148844 -262683 38248 78554
12841 78554 83475 -25545 141150 330056 -165227 -98991 -226421 165010 -344477 80097 56216
12830 56216 -12950 119899 -246659 90109 -104941 1476 413046 55898 88702 166775 43204
$$ packed form
12909a61975A63137a22093A02929A8732N72073a24758j6311O2982A7977k774J92344
12898B07547c21194B58415G3144J78197e4804E064P6126a39810b9799A4137J31395
12887A45532a22106a6058j3055p7657A10286j2757M5914J64915B1437d45816E2717
12875a71592c5025C783J044K87877A03827i3138E8096L4211b10669K8826H3027
12863a36103B22427c2103l80558A4492J38033f1135J4333g462j16964A2847b17402
12851B20010b72506k00555B50957i3091L8781j36861A48844b62683C8248M0306
12841G8554M921b5545A41150J88906a65227O6236j27430A65010c44477H0097k3881
12830E6216a2950A19899b46659I0109a04941A476M11570E5898L2804P8073D3204
$$ plain form
12818 -414728 47643 272495 355281 155886 139612 283103 -42953 95178 -202634 154361
12807 12423 171449 10157 212011 -102723 -53741 -149230 -9769 -19224 -332221 108529 309139
12796 309139 33736 -289781 64752 153806 -59960 101560 -100223 -184788 161535 82379 -17525
12784 -33566 -29509 239147 77472 101606 -271802 -172422 -405498 2074 -152117 151555 167516
12773 167516 -25235 159571 -366814 -63545 1038 9191 293294 320810 198356 -3424 -83065
12762 -83065 63652 -54338 -36514 183313 9557 -81462 -473283 49395 53095 105362 31333 -52517
12749 303304 67462 -447537 -357993 124760 -148419 -164319 39422 -54158 -273096 -12921 71106
12737 4321 -42971 -170603 277193 -231877 92037 51259 -29082 42427 156193 353766 3866
$$ packed form
12818d14728D7643K24852Q2786A55886j6274J43491d2953I5178b02634A54361
12807A2423J59026A0157K01854a02723M8982r5489i769r455l12997A08529K00610
12796C09139C3736b89781F4752Q9054e9960A01560a00223q4565A61535p9156a7525
12784c3566M057B39147G7472K4134b71802R9380k33076B074a52117A51555J5961
12773A67516b5235A59571c66814f3545A038Q153K84103K7516j22454c424p9641
12762h3065F3652e4338J7824A83313I557h1462l91821D9395L700N2267C1333e2517
12749C03304F7462d47537Q9544A24760a48419j5900C9422e4158k18938a2921G1106
12737D321d2971j27632B77193b31877I2037m0778b9082D2427J13766J97573C866
$$ plain form
12725 -160635 -58069 184949 -246441 215970 248793 403841 -26877 -194954 230937 62083
12714 68379 30531 50272 -77620 -78798 -78973 124404 75776 -6617 -192496 -210297 -134041 -338320
12702 -338320 20825 -162379 65415 -39981 218717 10664 116496 20354 -50312 150497 -118483
12690 18072 -215919 135283 -208862 -243921 137156 76078 18496 240004 -16381 84668 -141207
12678 296546 90040 -125231 -67961 117748 18775 -290773 -110045 167393 -213647 -106754
12667 211002 -4616 120746 -117477 455042 95289 337031 32917 55704 -79409 -185238 1428
12655 -234238 -33120 262470 70616 211058 87591 -41550 -394509 -71899 -8279 -63394 -82331
12644 -82331 69722 139123 221703 284363 -9689 9200 56760 227095 -265520 64917 -112434
$$ packed form
12725a60635e8069A84949b46441B15970L2823J55048b6877j68077B30937F2083
12714F8379C0531J9741g7620j178j75A24404m8628f617j85879j7801P6256k04279
12702c38320B0825a62379F5415c9981B18717A0664J05832B0354e0312A50497a18483
12690A8072b15919A35283b08862l5059A37156o1078A8496K21508a6381H4668a41207
12678B96546I0040a25231N7270A17748A8775b90773a10045A67393b13647a06754
12667B11002d616A20746a17477D55042I5289K41742C2917K2787g9409j05829A428
12655b34238c3120B62470G0616J40442H7591d1550l52959g1899h279n5115j8937
12644h2331F9722O9401Q2580O2660i689I200M7560J70335b65520F4917a12434
$$ plain form
12632 214363 150626 231112 273626 144592 15272 -5341 484957 257910 -12609 123566 336531
12621 336531 8801 -121196 74922 -69448 144060 97210 -273477 263648 -308424 59738 317592
12610 317592 412837 -11127 -113880 94642 94428 379786 345478 275696 115769 166851 -159403
12598 122828 -299322 54441 -175169 123819 -78961 283636 98262 54013 -67442 291327
12587 -126172 116701 -255951 271821 62158 -47129 -166019 148157 174205 -27270 95515
12576 -268897 267618 -114441 -208202 84921 -32454 91553 -94729 -214657 164386 -147490
12565 -57418 -175219 -233942 34378 134544 -196675 61954 9202 -182085 -154607 105307 -102780
12553 -85035 -98703 -119659 158757 289678 246476 -281382 -143723 110774 -84618 70259 -285167
$$ packed form
12632B14363o3737Q0486M2514j29034A5272e341D84957k27047a2609A23566K12965
12621C36531H801a21196G4922f9448A44060m6850b73477B63648c08424E9738K57854
12610C17592R5245a1127j02753I4642k14K85358l4308o9782A15769N1082a59403
12598A22828b99322E4441a75169A23819g8961B83636I8262m4249f7442B91327
12587a26172A16701b55951B71821F2158d7129j18890A48157K6048b7270I5515
12576b68897B67618a14441r3761H4921c2454I1553i4729j19928A64386a47490
12565e7418j17801n8723C4378J00166a96675F1954I202a82085K7478A05307a02780
12553h5035j3668k0956A58757J30921m3202b81382J37659A10774h4618G0259b85167
$$ plain form
12541 28989 52917 -144976 178381 -215079 -44271 136810 -139299 -118601 -159169 -341064
12531 -341064 90929 147943 -365319 330030 -13192 -196331 50362 -254950 251427 265969
12521 265969 -71763 57090 -137746 17462 -218715 54582 -344797 64330 418783 -165456
12510 159875 -27741 218393 -190293 -13090 14894 -50220 134036 243186 250802 265571 -207980
12498 118204 -60927 -158863 104128 -109146 124127 323480 253168 39751 90821 -64956 322657
12486 -112828 -50581 -65585 144054 -129335 -11742 143414 54091 177252 -87503 -50783 -42582
12475 -42582 87786 -329106 180 28528 -89486 69902 117333 163076 -206537 -31993 -150595
12464 -150595 -2798 -10653 37015 -168056 -26762 132386 249835 67009 -10073 88842 217955
$$ packed form
12541B8989K3928a44976A78381b15079d4271A36810a39299K0698m0568j81895
12531c41064I0929N7014c65319C30030a3192j83139E0362b54950B51427J4542
12521B65969g1763E7090a37746A7462b18715E4582c44797F4330L54453a65456
12510A59875b7741B18393a90293a3090A4894e0220A34036J09150P616J4769b07980
12498A18204f0927r7936A04128a09146A24127J99353p0312C9751N1070f4956C22657
12486a12828e0581j5004A44054a29335a1742A43414E4091J23161h7503L6720Q201
12475d2582H7786c29106A80K8348h9486F9902M7431M5743b06537c1993j18602
12464a50595b798p855C7015a68056b6762A32386J17449F7009a0073H8842J29113
$$ plain form
12453 217955 28439 222381 306039 -244503 66138 78979 9191 -25739 -39760 -31784 147177
12441 -515 170582 169037 -342146 -22042 -179343 -171370 -47531 174012 76372 -33562 -157597
12430 -157597 -34674 -120671 -58480 -105099 -109117 116217 -363166 -462276 131579 -278683 -93267
12418 37196 -238146 -108212 -197234 -63771 -17267 -299415 -446794 -20902 -113790 -49655 -143269
12407 -143269 -241411 203072 -7641 263267 100178 -68099 240798 -118481 -239814 -168144
12397 -168144 223955 41049 -233047 -76575 -175715 50217 127315 45445 -49043 -298213 198055
12385 -197089 -202778 -135652 223271 82290 4190 -20786 -200702 124255 -200913 72096 144120
12374 144120 -180921 -238691 -65756 -13355 224393 362209 270007 141898 125983 123500 -154771
$$ packed form
12453B17955B8439J93942Q3658b44503F6138J2841I191b5739j4021P976A47177
12441e15A70582j545c42146b2042j57301P973d7531A74012G6372c3562j24035
12430a57597c4674q5997e8480m6619m018A16217c63166r9110A31579b78683i3267
12418C7196b38146a08212q9022f3771a7267k82148j47379b0902r2888d9655r3614
12407a43269r8142B03072g641B63267A00178f8099B40798a18481j21333P1670
12397a68144B23955D1049b33047g6575r9140E0217P7098D5445d9043k49170A98055
12385a97089n689O7126B23271H2290D190b0786j79916A24255b00913G2096P2024
12374A44120a80921n7770f5756a3355B24393J37816r2202j28109j5915k483a54771
$$ plain form
12362 292796 -77038 16600 -37951 20726 -17889 -126643 110903 -178041 -29867 -61884 -44239
12351 -44239 49011 -271273 -81402 -637 -20157 -42890 92166 -89836 -75622 215923 -211800
12339 -33380 -64517 551797 -108905 -12431 234012 -261227 -307885 204399 -61812 48002 -103757
12327 261597 -323907 -125654 226560 181550 208373 262165 105930 34714 -7251 331349 54791
12315 301348 373695 136762 -45875 426200 71540 241912 -104470 68394 266993 212644
12305 212644 92916 113678 83430 289660 119143 384918 210660 287730 -16300 251311
12294 -126494 225714 86351 62669 187497 198055 -196294 45114 63284 115612 -18203 277868
12282 -119562 221840 89502 -133989 4995 257270 -82965 125561 249299 -67110 -28598 151938
$$ packed form
12362B92796g7038A6600c7951B0726a7889j08754A10903a78041b9867l2017J7645
12351d4239D9011b71273h1402f37j9520k2733I2166h9836J4214B15923b11800
12339c3380l1137E51797a08905a2431B34012b61227m6658B04399f1812D8002a03757
12327B61597c23907a25654B26560m5010K6823N3792A05930C4714g251C31349E4791
12315C01348P2347A36762d5875D26200G1540J70372a04470F8394J98599n4349
12305B12644I2916K0762l0248K06230A19143K65775j74258P7070a6300B51311
12294a26494B25714H6351k3682J24828J0558a96294D5114J8170N2328a8203B77868
12282a19562B21840H9502a33989D995K52275h2965A25561J23738f7110b8598A51938
$$ plain form
12270 385850 228259 49561 -74430 296298 108459 94294 84484 250184 -109270 275004
12259 496099 -291577 109903 219924 396158 294969 33191 145770 -17046 182489 -4560
12248 -4618 158682 120782 181490 361548 126071 124798 -110961 -77027 -205113 55682 66336
12237 66336 43276 5034 150510 241014 241391 -119498 -4119 25489 124713 -102084 291506 101352
12224 71601 -11310 -56993 -50964 -138581 11946 169747 -52348 -31790 265746 9373 23498 12005
12212 12005 82702 86128 11006 152375 -25455 228665 47670 130275 247772 149214 319353
12201 319353 -72239 155277 146714 182206 388358 78596 -30009 272969 28939 393548 27885
12189 -31024 394663 207146 -64093 35778 180532 511823 -62408 18837 -133084 140464
$$ packed form
12270C85850j57591D9561g4430B96298A08459j4165r810J65700a09270B75004
12259D96099b91577A09903J10021J76234j01189C3191J12579a7046A82489d560
12248d618A58682l7900O0708J80058A26071j273a10961L3934j28086E5682J0654
12237F6336k3060E034J45476R0504L77a19498d119B5489R9224a02084B91506A01352
12224G1601a1310m5683O029q7617A1946J57801e2348K0558B65746I373J4125j1493
12212A2005P0697L426A1006J41369b5455B28665D7670Q2605J17497r8558J70139
12201C19353g2239A55277q563L5492K06152G8596c0009B72969B8939L64609B7885
12189c1024C94663j87517f4093C5778J44754L31291f2408A8837a33084A40464
$$ plain form
12178 -156759 118992 -15598 477257 336875 -321882 -19577 36189 40230 235843 338988
12168 338988 205372 70041 335122 130871 353278 274581 394612 -164371 35407 435885
12158 435885 -114213 109883 170789 187384 180809 56500 21303 121529 207149 313141 186693
12147 186693 559762 178373 18814 107390 339290 -351003 -109948 270304 63492 167091
12137 167091 601973 295503 193488 -66836 237358 -87747 8748 -69779 99380 361766 85356
12125 96660 -114728 186056 219831 139936 245392 -158039 478501 152469 437861 24158
12114 68955 -138162 -75302 137919 36320 110761 10839 -12539 29464 224497 502912 176052
12102 343572 -35766 -35003 -162321 66056 -301436 240831 357333 215377 30006 211835 38270
$$ packed form
12178a56759A18992a5598D77257j40382c21882a9577C6189M041J95613J03145
12168C38988j33616G0041K65081A30871K22407p8697J20031a64371C5407M00478
12158D35885a14213A09883O0906J6595o575E6500B1303J00226Q5620J05992j26448
12147A86693L73069A78373A8814Q8576K31900c51003a09948B70304F3492J03599
12137A67091M34882B95503j02015f6836B37358h7747H748f9779I9380K62386H5356
12125I6660a14728A86056L3775p9895J05456a58039D78501A52469K85392B4158
12114F8955a38162O2860A37919C6320P4441A0839a2539B9464J95033K78415A76052
12102C43572c5766P63j27318F6056c01436B40831J16502j41956C0006J81829C8270
$$ plain form
12090 -246118 -58889 101285 -88549 84485 36645 130132 -53721 33938 214762 133546 117106
12079 117106 116107 -68208 -60046 123407 223114 138473 -2603 225967 84911 251529 396389
12068 396389 126420 286772 154056 59643 513064 -111507 -63015 -58505 205991 -15506
12057 178064 -99151 43122 14136 267053 -189182 75184 259496 -5216 -55341 105100 10611
12045 87145 -2365 41470 135535 96974 44079 -175369 74154 -135268 -95070 -137169 234839
12033 -65977 -5843 -90185 101573 175527 -73978 147143 147805 302662 -28098 -212657 -109355
12022 -109355 14984 88409 -108073 228988 161506 123063 74346 289152 -153866 -107543 -269846
12011 -269846 39464 222141 8906 174905 40013 265148 404013 102779 6732 -267516 -229926
$$ packed form
12090b46118e8889A01285h8549H4485C6645R3487e3721C3938J80824q1216j6440
12079A17106r99f8208Q162A23407R9707q4641b603B25967H4911J66618J44860
12068C96389A26420J60352j32716E9643M53421a11507M8492M510B05991a5506
12057A78064i9151D3122A4136K52917a89182G5184J84312e216n0125A05100A0611
12045H7145b365D1470R4065l8561D4079a75369G4154a35268M0198m2099B34839
12033f5977e843q4342A01573P3954g3978A47143O62J54857b8098j84559J03302
12022a09355A4984P3425a08073B28988o7482l8443m8717K14806a53866M6323j62303
12011b69846C9464J82677H906J65999D0013K25135J38865A02779F732b67516L7590
$$ plain form
12000 -229926 156040 206058 125127 -20469 -77253 205294 -148 75054 -14514 113650 248693
11989 248693 -99303 29470 -93398 60398 186053 182471 245383 -168823 -578904 -52147 163176
11977 -4188 20460 -213718 -187604 -14546 -109047 173755 189588 15112 -247747 -134753 -156432
11966 -156432 -184354 111535 -179804 248270 136322 -174400 290530 59570 31705 -163118
11955 -96360 -160057 65998 -463789 -44337 573080 -140354 113550 250544 44299 -67866 -192178
11944 -192178 90245 85801 304756 -293456 -122699 -298413 -229208 101112 -157470 -132548
11934 -132548 121307 -83552 -264719 144941 -147767 -237190 -111073 -4175 -107296 69072
11923 17045 -172345 -131582 16028 -3043 122499 171459 -174837 73301 -332806 -97113 -50934
$$ packed form
12000b29926A56040N0018q0931b0469n6784B05294a48G5054a4514A13650J35043
11989B48693i9303B9470i3398F0398J25655l582O2912a68823m10081e2147A63176
11977d188B0460b13718K6114a4546r4501A73755J5833A5112b47747J12994k1679
11966a56432k7922A11535a79804B48270j11948a74400B90530E9570k7865a63118
11955i6360o3697F5998d63789d4337E73080a40354A13550J36994D4299f7866j24312
11944a92178I0245m444K18955b93456a22699j75714O9205A01112a57470K4922
11934a32548A21307h3552j81167A44941a47767q9423a11073d175j03121F9072
11923A7045a72345M0763A6028c043A22499M8960a74837G3301c32806i7113M6179
$$ plain form
11912 -50934 139362 -247838 17917 -133113 -1765 24154 81474 -4040 -189931 -23354 -75323
11901 -75323 -19125 -53358 -17170 218886 469404 145942 212004 241353 88988 133782 11672
11889 176207 -55562 -190281 -28204 -163584 -127659 170765 190055 164083 -145624 6734 189174
11878 189174 -47905 7789 -302002 228118 103166 103352 94387 -116048 -57347 231780 16154
11866 -113163 32618 -307565 311104 -381920 128203 -92725 9758 -120057 -172367 71554 -313682
11854 -259934 14924 -27571 -214378 -224987 37208 121316 -66450 -7855 -300884 -79232 147297
11842 -144963 -60443 -126848 -143593 166750 233325 -228154 57861 -167731 68117 266886 60839
11830 -89454 13941 -32075 86816 202885 43502 -24819 -293781 -86253 -73175 -79727 -76872 -180701
$$ packed form
11912e0934A39362b47838A7917a33113a765B4154N7320d040j85891b3354n1969
11901g5323a9125l4233a7170B18886K50518A45942O6062K9349H8988M4794A1672
11889A76207e5562j34719b8204j35380L5925A70765J9290k5972a45624F734J82440
11878A89174d7905G789c02002B28118A03166J86q965a16048e7347B31780A6154
11866a13163C2618c07565C11104c81920A28203i2725I758a20057n2310G1554c13682
11854b59934A4924b7571j86807j0609C7208Q4108f6450g855k93029g9232A47297
11842a44963f0443o6405j6745A66750O6575b28154E7861a67731F8117J98769F0839
11830h9454A3941c2075H6816J16069D3502b4819k68962h6253J3078o552K855j03829
$$ plain form
11818 -180701 35870 -140193 -362803 -440499 -220598 -47386 -93117 131080 -81083 -263022
11808 -263022 -181330 342794 -180094 -384820 56333 -314973 19218 -98957 -92581 64010 105549
11797 105549 -134964 -165861 199798 -136509 -130210 -181303 -165749 -44893 50860 -138150 -4554
11785 -190922 -102641 -231468 301188 36964 -160617 -30764 -241716 145950 292006 -56919
11774 -8255 216899 33152 -228521 -151333 -101656 -43063 -51423 87982 45807 91619 222296
11763 222296 -272676 171551 -135804 105622 -297339 -157707 -93337 147649 87372 -270977
11752 -53276 279188 -89492 -23471 49649 215640 -466276 -209622 232339 -13012 -74316 -375538
11741 -375538 -92875 98500 -131992 -13093 -36058 35103 116887 64968 120029 -25217 -68052
$$ packed form
11818a80701C5870a40193k22610p7696K19901d7386m5731A31080h1083j81939
11808b63022Q1692C42794a80094k04726E6333c14973A9218i8957O376F4010M1539
11797A05549a34964l0897A99798a36509O299n1093J5554d4893E0860a38150d554
11785a90922Q8281j28827C01188C6964a60617c0764k10952A45950J46056e6919
11774h255B16899C3152b28521P7188M9677d3063q360H7982m2175M5812J30677
11763B22296b72676A71551a35804A05622b97339J39632O4370A47649o0277b70977
11752e3276B79188h9492b3471D9649J65991d66276b09622B32339a3012o1304l01222
11741c75538i2875I8500a31992a3093k2965C5103Q1784n1919N5061b5217m2835
$$ plain form
11730 -68052 110711 -244598 -308844 96764 203417 47550 44324 -57733 272335 -43767 73498
11718 44758 -162825 54639 -150381 43736 -21419 -78572 221328 256642 186103 189330 -175371
11706 236754 -114754 -232834 33644 87287 -207139 192320 56296 -67901 36251 66939 11905
11694 227567 -162133 255075 217819 -89615 39128 80333 -141674 -53757 -85645 169157 -113340
11682 65735 -304939 64904 215692 234583 -48224 268429 -59519 84799 110218 116916 97548
11671 97548 -380506 -115158 1168 -52460 385307 -93993 -9019 -293416 -92575 427064 -19851
11659 162424 -91722 -201690 428486 -264623 53034 -254531 32522 -249048 34859 -74469
11648 197976 164661 -44639 -55573 -110288 43185 31981 160092 136076 241865 -63150 172347
$$ packed form
11730f8052A10711b44598o4246I6764J06653D7550l226e7733B72335d3767G3498
11718D4758a62825E4639a50381D3736b1419n7153B21328L5314p0539L227a75371
11706B36754a14754j18080C3644N3643b07139A92320E6296f7901C6251L0688A1905
11694B27567a62133B55075l7256h9615C9128M1205a41674e3757l1888A69157a13340
11682F5735c04939F4904J50788J8891d8224B68429e9519H4799K5419O698j9368
11671I7548c80506a15158A168e2460C85307i3993i019k84397i2575D27064a9851
11659A62424i1722j09968D28486b64623E3034b54531C2522b49048C4859g4469
11648A97976l3315d4639j0934n4715D3185j1204J28111k4016J05789f3150A72347
$$ plain form
11636 86222 -179575 8074 256088 87202 -63713 377550 -100608 -140525 -94962 -538398 -234588
11624 -183423 -179860 -155668 -180147 133284 940 -142765 118774 193374 -198047 -65461 110987
11612 80242 -92844 147268 276542 274429 -237406 -42470 138429 322630 204005 34064 -409872
11600 -36248 209084 -64978 -224740 121872 136543 49252 237422 -36776 -66252 65506 129539
11589 129539 97688 32090 -274059 147367 44196 39876 87674 148186 48346 109776 312981
11578 312981 -302418 16836 325096 -258251 141448 360884 73927 -103588 54105 120638
11568 120638 13174 152095 16246 96945 56422 -44555 -13731 -83906 -180118 -196201 203058
11556 -30989 -454991 236057 -158540 131544 -377167 314469 -54576 80585 302658 60899
$$ packed form
11636H6222a79575H074K48014H7202f3713C77550a00608l9917M5563m43436b34588
11624a83423L563K4192k4479A33284I40a42765A18774P4600a98047f5461A10987
11612H0242i2844A47268J29274k113b37406d2470A38429J84201j18625C4064d09872
11600c6248B09084f4978j59762A21872J4671D9252J88170c6776k9476F5506O4033
11589A29539l1851C2090b74059A47367D4196m320M7798O0512D8346O1430K03205
11578C12981c02418A6836L08260b58251A41448K19436G3927a03588E4105O6533
11568A20638A3174J38921A6246Q0699m0523d4555a3731p0175r6212j6083B03058
11556c0989m24002B36057a58540A31544c77167C14469e4576H0585K22073F0899
$$ plain form
11545 338954 162720 380160 180988 -61855 140739 -46302 106670 -201928 246754 -58263
11534 -66310 -360600 31954 62709 -90133 -312339 82136 159079 24126 -212405 -4217 245776
11522 130536 -105795 499286 55525 66792 22884 177912 121642 -4149 406462 109190 112377
11511 112377 -65306 21447 156035 -173528 268773 296945 -59746 171898 -141887 142620
11500 288078 194131 164719 292567 -312956 132110 60388 -32526 229073 -60020 -155164 135827
11488 -22467 185518 278033 -45162 74906 111889 -101246 -193772 93073 372697 187678 317333
11477 317333 271899 -66780 50615 368099 -25732 165990 224936 201176 170619 61051 22252
11465 132001 -124700 -30656 -11343 187748 202401 22308 -107662 -196866 122137 -73703 335635
$$ packed form
11545C38954A62720K17440A80988f1855A40739d6302A06670b01928B46754e8263
11534f6310k94290C1954L0755i0133k22206H2136P6943B4126b12405d217B45776
11522A30536a05795D99286E5525J1267B2884J55028n6270d149D06462A09190L187
11511A12377f5306B1447J34588a73528B68773K8172e9746A71898a41887A42620
11500B88078r3947k9412J27848c12956A32110F0388c2526B29073f0020r5144A35827
11488b2467A85518R2515d5162G4906L6983a01246r2526I3073K79624j85019J29655
11477C17333m5434f6780E0615L17484b5732A65990N8946k3760l0557F1051B2252
11465A32001a24700c0656a1343A87748J4653B2308a07662q9204A22137g3703C35635
$$ plain form
11453 43241 -76785 -350409 200609 172950 -25215 142335 117171 288013 -947 75753 79062
11442 79062 -144437 25684 23513 40292 63129 347998 -221329 -9555 -157833 209201 -159269
11430 2044 -154800 98403 -143380 138657 -19960 146637 109674 -79737 -2268 -32200 142710
11418 6540 29517 -91874 -92803 237154 241654 -220826 304247 406991 -20350 -27956 43419 175183
11406 175183 162665 153422 -113966 110386 -280263 12623 -82531 -37706 -134034 102289 -16013
11394 24212 -14150 70947 -45151 -171686 -243407 -110564 214319 106405 -135287 -74429 107578
11382 -167589 8216 -265731 90049 15406 78571 171571 115704 -292049 383000 355730 237679
11371 237679 -496469 -203394 -88556 -83665 180982 -297645 -149462 230162 81468 -38994
$$ packed form
11453D3241g6785k73624B00609k7659b5215A42335k5164J70842i47G5753L309
11442G9062a44437B5684k171J6779K2837K84869b21329i555j48278B09201a59269
11430B044a54800I8403a43380A38657a9960A46637l6963g9737b268k9932A42710
11418F540K2977i1874r29B37154M500b20826C04247J02744b0350p606D3419J31764
11406A75183j2518r243a13966A10386b80263A2623h2531c7706r6328A02289a6013
11394B4212a4150G0947d5151j26535p1721a10564B14319A06405a35287O0858A07578
11382a67589H216b65731I0049A5406O3165R3000n5867b92049C83000k7270j18051
11371B37679d96469b03394h8556M891A80982b97645J48183B30162H1468c8994
$$ plain form
11360 -177738 6793 12124 -90494 -21447 150358 -3276 91010 -127383 184540 122863 -193182
11348 -281844 -91580 -150487 3117 -175224 -488660 285652 -229941 -74832 138969 122566 317064
11337 317064 143273 -160860 96563 -193364 -76518 45410 -19260 -136215 -56606 90796 -178047
11325 328044 33904 -106704 103477 31270 57583 -50596 -307723 45616 -221483 -176326 -77180
11313 -199528 54184 -126302 -82240 137966 -394040 167978 -134545 170779 -79010 97569
11302 107182 40614 37638 -174144 -254537 -4715 -197444 147246 -13143 -45359 -43111 -144914
11291 -144914 -211870 -149581 -208449 -65920 -222439 -7098 215189 -519407 24796 236491 -468
11279 93372 355 -44605 83152 -75678 36959 -55619 -69781 -421282 290173 75947 -262119
$$ packed form
11360a77738F793N331i0494b1447A50358c276I1010a27383A84540o1677a93182
11348b81844i1580n8907C117a75224l13436B85652b29941g4832A38969j6403J94498
11337C17064A43273a60860I6563a93364g6518D5410a9260j16955e6606I0796a78047
11325C28044C3904a06704A03477C1270K6313e0596k57127D5616b21483M5157g7180
11313a99528E4184a26302M4062A37966c94040A67978a34545A70779g9010I7569
11302A07182D0614k976a74144q0393d715j92729A47246a3143l2216K248j01803
11291a44914o6956O2289n8868f5920j56519g098B15189e19407B4796K11695d68
11279I3372C55d4605H3152g5678C6959e5619j4162l51501B90173G5947b62119
$$ plain form
11267 -111862 -143768 -295672 25122 -97963 -39761 17159 -15150 -59950 -30464 73924 -171396
11255 28472 70530 -3005 93332 -206483 178533 -42495 -287331 107653 -135792 72762 129924
11244 129924 47382 -110663 -213197 -312998 237401 -102722 -383173 -200929 -263699 -374716
11234 -374716 -240274 -374328 -58135 -160947 -8545 -7010 -178792 193691 152782 -268610 -334105
11223 -334105 7283 -185647 -39732 -46215 -56994 189605 -55764 4775 199846 -139864 -381781
11212 -381781 18418 -44300 19857 85799 -85604 -108129 19156 168078 -156192 -266013 -210334
11201 -210334 191847 39647 38845 -92494 -26507 282766 -82634 -76175 -34493 -43967 -124424 -70151
11189 -70151 56282 91462 7556 74809 75453 -91733 47017 -126890 156720 46130 -71888 174543
$$ packed form
11267a11862l1906j51904B5122i7963c9761A7159a5150m4800K9486G3924a71396
11255B8472M2058c005I3332b06483A78533d2495k44836A07653a35792G2762N7162
11244A29924D7382a10663j02534r9801B37401a02722k80451J82244o2770j11017
11234c74716J34442j34054e8135j02812h545J535j71782A93691m0909b68610o5495
11223c34105G283a85647c9732o483j0779A89605e5764D775J95071a39864k41917
11212c81781A8418d4300A9857O5942h5604k2525A9156J48922a56192j09821N5679
11201b10334A91847C9647q02i2494b6507B82766h2634O459c4493r474q0457N4273
11189g0151E6282L5180G556O7253O44i1733D7017a26890A56720D6130g1888A74543
$$ plain form
11176 181912 -118868 -186698 -131022 -208664 153699 57815 -226831 -139287 80856 216187 55771
11164 -167858 171961 -259876 172179 -163794 87766 -340666 -47569 -249126 -142616 -20624
11153 -52865 197066 -262653 -98399 -97820 -196173 86142 -70835 127473 -1021 38196 12602 21483
11141 21483 131934 -7972 -39357 -38839 -138450 -68004 62361 134035 28041 -96084 47801 277673
11129 277673 -198348 -104812 -259831 -49392 6642 11104 -311491 -40168 -83019 263000 179478
11118 179478 -90060 -202889 42277 85012 -114824 169492 322 148447 123613 95319 180912
11107 180912 76320 73833 -194913 -101698 -91983 12693 239791 -51395 15658 -126586 -21571
11095 101829 6557 223109 -31151 -137717 47071 -182880 99695 -306333 121820 -189517
$$ packed form
11176A81912a18868o7830N5676p7642A53699E7815b26831Q7544H0856J35331E5771
11164a67858A71961b59876A72179a63794H7766c40666d7569k01557J06510b0624
11153e2865A97066b62653i8399N79r8353H6142g0835A27473a021C8196A2602Q881
11141B1483J10451g972l1385N18r9611f8004F2361P1674B8041i6084D7801K29872
11129B77673a98348R3536j55019d9392F642M462c11491d0168m2851B63000q3522
11118A79478i0060j12829D2277M2735a14824A69492C22J48125k4834k8294Q5593
11107A80912G6320k487a94913R3215R715A2693K27098e1395A5658a26586b1571
11095A01829F557K16552c1151j06566D7071a82880I9695c06333A21820a89517
$$ plain form
11084 -65003 -198488 -70983 82882 -15426 -155118 27478 1359 35181 114473 -21978 500962
11072 -174340 31273 233091 -56734 -13042 357228 363534 178241 66785 -33557 108664 121886
11061 121886 240506 95176 136472 42634 -35102 30715 54515 237245 74830 367879 142079
11049 286670 226448 247707 322397 294267 223832 293091 199827 298306 471162 643951 584365
11038 584365 667405 678971 292810 557163 315227 455803 529633 173406 421238 316411
11028 316411 676587 648753 280212 415094 551639 259277 387809 547395 465620 287264
11018 287264 701566 240574 394275 409789 812586 545773 551075 572626 809010 640561
11008 640561 568927 528659 648938 521428 414011 444759 543461 595378 319899 633860
$$ packed form
11084f5003j33485g0983H2882a5426j39692B7478A359L3822P9292b1978E00962
11072a74340C1273K01818e6734a3042C57228O306A78241F6785c3557A08664J3222
11061A21886J18620I5176M1296D2634c5102C0715K3800J82730G4830K93049A42079
11049B86670o0222K1259P4690k8130p0435O9259r3264R8479J72856J72789n9586
11038E84365Q3040J1566B92810K64353k41936J40576P3830A73406K47832j04827
11028C16411L60176k7834B80212J34882J36545B59277J28532J59586q1775j78356
11018B87264M14302B40574J53701J5514M02797k66813N302K1551K36384j68449
11008F40561p1634m0268J20279j27510j07417L0748R8702N1917k75479L13961
$$ plain form
10998 633860 592010 261374 155830 222971 208015 141365 290013 711623 770316 310390
10987 334784 582480 472127 39158 343643 207104 372403 311217 128124 406551 485035
10977 485035 417195 296410 330291 623613 641429 364260 400844 672380 626577 595523 629908
10966 629908 420325 533790 804434 1005528 546301 1059761 987912 1036802 965632 1327498
10956 1327498 1202400 1186186 1652694 1595279 1785980 2052831 1783971 1554892 1331480 1410999
10946 1410999 1171596 1101088 1222188 1246708 1036534 1336784 1327565 1386379 1156301 1300726
10936 1300726 1670103 1380986 1111813 902987 1097911 615373 497648 824970 665073
10927 665073 433162 490007 108555 625337 134958 249490 39120 302452 -17686 -48130
$$ packed form
10998F33860m1850B61374j05544O7141j4956o6650J48648M21610N8693C10390
10987C34784K47696j10353C9158L04485j36539J65299o1186A28124K78427P8484
10977D85035o7840j20785L3881K93322J7816k77169L6584K71536m5803l1054L4385
10966F29908k09583J13465K70644K01094m59227N13460p1849M8890p1170L61866
10956A327498j25098j6214M66508n7415J90701K66851k68860k29079k23412P9519
10946A410999k39403p0508J21100K4520k10174L00250r219N8814k30078J44425
10936A300726L69377k89117k69173k08826J94924m82538j17725L27322j59897
10927F65073k31911N6845A08555N16782A34958J14532C9120K63332a7686l0444
$$ plain form
10917 -48130 125987 182019 124586 -20772 294333 -56079 217636 21208 200616 63186 -50132
10905 124809 -54092 179610 -243085 -119962 -136885 -168940 -121655 -167693 -104298 -69642 -136573
10894 -136573 -322287 -404459 77747 38046 61237 -111399 -79477 65717 94611 119607 -375672
10882 -181874 -69845 -196508 149371 -56393 75221 35648 -254655 -328788 -354039 -213457 235186
10870 -139848 232666 -157624 -23336 -341200 -175160 133322 166418 242410 30808 220213
10860 220213 30502 279256 144101 206193 -195829 -178544 -78877 26063 -118037 -95196 359335
10848 -34955 -24586 -130784 68444 364883 -79610 -180351 69460 -347067 40086 -156240 7546
10836 263341 -246951 87978 -83912 117015 -54516 -522965 -29425 69420 -99030 -328234 -74356
$$ packed form
10917d8130A25987N6032n7433b0772B94333e6079B17636B1208J79408F3186e0132
10905A24809e4092A79610b43085a19962j6923l2055M7285m6038O3395L4656o6931
10894a36573j85714q2172G7747C8046K3191a11399L1922F5717K8894K4996c75672
10882a81874f9845j26663A49371e6393G5221C5648b54655p4133k5251J40582B35186
10870a39848B32666a57624b3336l17864J66040A33322L3096P5992C0808J89405
10860B20213C0502K48754j35155O2092a95829J7285g8877B6063a18037K2841C59335
10848c4955J0369j06198F8444K96439g9610j00741F9460c47067D0086a56240G546
10836B63341b46951H7978h3912A17015e4516m68449b9425F9420i9030k29204g4356
$$ plain form
10824 -92682 -355412 178195 -209002 -157304 40284 -107900 201551 -139311 -53082 -188102
10814 -188102 -20185 -207146 -216889 -234900 86990 -96970 56559 8211 -365807 -332920 -19828
10802 -221826 -80177 -66394 -32055 -301566 21234 48941 38759 983 29717 -97254 352234
10790 182104 -126069 -11925 -10764 163765 -125786 -172509 199797 -131235 135195 38877
10779 -38536 -29974 28733 101869 -112700 -151965 -87920 135951 -231080 -1027 175826 -163250
10767 30331 -6246 231462 -295162 -30807 -119293 24774 -8334 46327 -233575 -211261 -222064
10756 -222064 -116983 -251918 125048 -265657 -76755 -318615 -56560 -26782 -328409 -78555
10745 65862 -157051 86039 352812 -247258 64383 194177 182695 -19378 45925 87834 -137695
$$ packed form
10824i2682k62730A78195b09002N1698D0284a07900B01551a39311e3082j35020
10814a88102b0185j86961r743j8011H6990i6970E6559H211c65807L2887a9828
10802b21826h0177J3783c2055k69511B1234K7707j0182I83K8734i7254C52234
10790A82104a26069a1925J161A63765a25786m6723A99797a31235A35195C8877
10779c8536Q562B8733P3136a12700l9265O4045A35951b31080a027A75826a63250
10767C0331f246B31462b95162c0807q8486B4774h334D6327b33575K2314j0803
10756b22064J05081j34935A25048b65657g6755k41860e6560b6782l01627g8555
10745F5862a57051H6039K66773b47258F4383J29794j1482a9378D5925M1909a37695
$$ plain form
10733 -102874 -100645 84694 -73022 -36604 43278 -46982 -80354 -142651 -173096 -193585 23239 47493
10721 47493 12045 34619 -173692 33242 -202379 -191700 -40614 -156265 -234958 -40938 146984
10709 2240 -223425 -178338 -112300 270248 -208819 -184183 -29730 78678 150734 -280625 -126348
10697 52421 -185804 -54134 -13494 116227 127478 22524 97192 56223 -10993 261842 -150317
10685 41728 186842 -552155 -87557 -120570 -214795 -153360 77745 -46171 -72350 -33315 -195625
10674 -195625 -41288 -110820 -148540 -220808 56067 -19675 8232 -267718 -68930 -208881 88579
10662 -343246 -222544 -17855 -211746 338765 -104651 30780 132630 123738 -231792 -277919
10652 -277919 43164 160687 -153041 -208398 63976 95187 -102618 13346 -110497 -326443
$$ packed form
10733a02874K229H4694g3022L6418D3278d6982l3372o2297l0445k0489B3239K4254
10721D7493A2045K2574a73692C3242b02379J0679d0614j15651p8693d0938A46984
10709B240b23425M5087O6038B70248b08819K4636b9730G8678P2056b80625a26348
10697E2421a85804e4134a3494A16227J1251B2524P4668m0969a0993B61842a50317
10685D1728J45114e52155h7557l3013r4225O1435G7745d6171k6179c3315j62310
10674a95625d1288o9532l7720p2268E6067a9675H232b67718f8930j39951H8579
10662c43246J20702a7855j93891C38765a04651C0780J01850q892b31792m6127
10652b77919D3164J17523a53041n5357F3976L1211a02618A3346a10497k15946
$$ plain form
10642 -326443 58537 -284115 -341263 -280814 206562 -328116 -241609 -28442 -80617 -349419 270065
10630 -82176 -142616 -105479 -100543 31080 107605 33692 -12072 -283122 -27377 160346 -154148
10618 -236788 40602 -2345 -115931 -125577 -43637 118673 -31634 683 41231 351801 53140 -7586
10605 99484 -277865 -193204 42011 -191694 177320 65713 29972 -131899 56553 -176624 99500
10593 -48385 -36288 161894 71835 116796 -115350 333886 124450 -297238 -12041 -277205
10583 -277205 -78601 -285653 295626 -139908 93921 37752 -130765 -134603 -366919 -168734
10572 72512 -47039 -165300 12135 110651 62426 105419 33891 327040 100430 -168284 -85377
10561 -85377 324069 130975 -111094 146329 38125 -39314 -199771 -83088 -164324 -88842 -181073
$$ packed form
10642c26443E8537b84115n7148O0449B06562c28116Q6507b8442n2175k68802B70065
10630h2176o0440L7137M936C1080P6525C3692a2072k71050b7377A60346a54148
10618b36788D0602b345j13586r646d3637A18673c1634F83M0548L10570E3140g586
10605I9484b77865Q4661D2011a91694A77320F5713B9972a31899E6553a76624I9500
10593d8385J2097A61894G1835M4961a15350C33886A24450b97238a2041k65164
10583b77205g8601k07052B95626a39908I3921C7752a30765l838k32316a68734
10572G2512d7039j18261A2135R8516m8225M2993C3891K93149A00430a68284Q2907
10561h5377C24069A30975a11094A46329C8125c9314j60457h3088q1236P5482r2231
$$ plain form
10550 -181073 34053 -167280 84200 -117782 -4758 39789 165149 -344459 -44132 4182 167289
10539 167289 166890 52633 -43078 -519127 181794 132210 103393 313933 -270104 -23737 182658
10527 138766 -149214 61424 334104 -241842 40191 -238819 -179279 224393 -137233 -289900
10517 -289900 117443 15674 -156004 93440 242638 -329493 -177667 -110537 -109722 -237485 -144464
10506 -144464 347803 -91296 -2401 105611 -247594 -72189 -96695 -330177 -89418 -158538 321107
10494 -209994 190442 56655 -40824 -372309 140783 -266331 -71355 -80074 -193858 -221135 -334789
10483 -334789 88013 -145802 78989 179636 118841 -196997 -55175 63917 -79174 -131663 -85951
10472 -85951 180987 233900 -317302 72057 35375 -128757 -61063 -74543 296956 199641 -171172
$$ packed form
10550a81073C4053a67280H4200a17782d758C9789J25360c44459d4132D182J63107
10539A67289l99E2633d3078m76049A81794m9584k8817K10540b70104b3737A82658
10527A38766a49214F1424K72680b41842D0191b38819N9540B24393a37233j52667
10517b89900A17443A5674a56004I3440J49198c29493J51826O7130Q15j27763R3021
10506a44464C47803i1296b401A05611b47594g2189k4506k33482h9418o9120C21107
10494b09994A90442E6655d0824l31485A40783b66331g1355q719j13784k7277j13654
10483c34789H8013a45802G8989J00647o0795a96997e5175F3917g9174n2489M5712
10472h5951A80987N2913c17302G2057C5375a28757f1063j3480B96956r7315a71172
$$ plain form
10460 183250 390755 629575 436618 -11108 -15030 359555 83332 6678 -41693 39302 -52198
10448 -45310 -239221 222945 -332934 103741 -133330 48016 170686 118407 -131891 25799
10437 -219918 452719 77042 -120642 -66306 -295130 209454 -164341 141599 -59551 -82757
10427 -82757 -94548 -336059 36018 31216 -89641 -93465 325419 39103 50516 57986 -147909 59217
10414 372304 28150 -147736 5496 135104 -123334 -89216 -169739 260053 33679 -51234 -177507
10403 -177507 -106124 -168557 -76148 60709 -451338 -194449 -126994 -104071 -10973 -192400 -153759
10392 -153759 8701 -14991 -136508 -4834 -160506 -426429 -319830 113007 39856 -60609 -22936
10380 130616 -87624 91766 -136811 -153965 -8776 -58647 -7702 18860 -43523 -105903 164619
$$ packed form
10460A83250K07505K38820j92957a1108l922C59555H3332F678d1693C9302e2198
10448d5310j93911B22945c32934A03741a33330D8016J22670n2279a31891B5799
10437b19918D52719G7042a20642N4336k28824B09454a64341A41599e9551k3206
10427h2757j1791k41511C6018m802h9641l824C25419C9103J1413P470a47909E9217
10414C72304B8150a47736E496J29608a23334L4118q0523B60053C3679e1234j26273
10403a77507P1383o2433g6148F0709d51338a94449O7455K2923a0973j81427L8641
10392a53759H701a4991j21517d834j55672k65923J06599A13007C9856f0609b2936
10380A30616h7624I1766a36811j7154h776m9871g702A8860d3523o2380A64619
$$ plain form
10368 -201900 114685 -97382 216402 60866 189323 9494 24387 54452 167021 39628 -20487
10356 206449 92742 -132900 -19998 102212 -7028 351912 12557 244013 376334 180488
10345 46923 328801 -22584 53567 86851 277743 297657 124068 -30931 27774 -95173 341358
10333 188164 403487 186015 41547 350775 200700 312094 286922 395691 306209 86842
10322 462576 334225 -51682 -88342 395087 135739 -156086 454425 165641 547863 -243442
10311 -186970 -48403 148349 -120983 413 -25410 -55232 195567 -30247 59680 5510 -45091
10299 6301 -120309 -14390 382828 430733 43524 266005 -159121 -187067 401548 88446 106680
10288 106680 -442086 168023 -83892 -140932 156952 16922 -250883 51314 -120663 63019
$$ packed form
10368b01900A14685i7382B16402F0866J28457I494J4893L0065J12569C9628b0487
10356B06449I2742a32900a9998A02212g028C51912A2557K31456J32321A80488
10345D6923K81878b2584E3567L3284J90892J9914A24068c0931B7774i5173C41358
10333A88164K15323A86015D1547L09228j50075J11394k5172J08769q9482H6842
10322D62576j28351e1682l6660C95087A35739a56086D54425A65641L82222b43442
10311a86970d8403A48349a20983D13b5410k9822A95567c0247E9680E510d5091
10299F301a20309a4390C82828M7905D3524K22481a59121k7946D01548H8446J8234
10288A06680d42086A68023h3892n7040A56952A6922b50883E1314a20663F3019
$$ plain form
10277 86006 14372 16938 63317 -92713 55476 115191 367951 29914 39547 -16655 -94113 -240590
10265 -240590 -104055 -29173 -280053 -75068 -184096 -28648 183284 -123719 -51878 -36768
10255 -36768 113193 87454 -85352 -285761 208817 37537 -72845 112292 -40849 -148914 84306
10243 -35217 300024 9092 -88767 135265 83871 -46928 145602 223535 180169 147894 -147132
10231 131080 24308 -88665 -30427 115981 52540 -187323 379387 63699 -15110 1368 -243676
10219 -87503 -10299 -46697 150291 -26995 104838 -6195 104199 -85790 99736 116477 44317
10207 -96432 -48809 300594 202711 -9268 -4380 258956 -102675 -123439 -73057 -231462 -190789
10196 -190789 426752 112608 -50810 -132227 193994 -125386 -243818 102859 -214524 -352689
$$ packed form
10277H6006A4372K566M6379i2713E5476N9715K52760B9914R633a6655p7458j46477
10265b40590a04055b9173k50880g5068j09028b8648A83284a23719e1878J5110
10255c6768A13193k5739h5352k00409B08817C7537g2845A12292d0849j08065H4306
10243c5217C00024I092h8767A35265n1394d6928A45602P7933m3366l2275a47132
10231A31080B4308h8665c0427A15981E2540a87323C79387F3699a5110A368b43676
10219h7503a0299l6398A50291b6995A04838f195A04199h5790I9736J6741D4317
10207i6432M7623C00594r7883i268d380B58956a02675k0764N0382j58405M0673
10196a90789D26752A12608e0810q1417A93994a25386j18432A02859b14524j38165
$$ plain form
10186 -352689 -198553 -74970 15502 -71268 -175084 -2641 -69501 70623 -183265 -71390 72725
10174 -169386 242089 -78120 -183214 141169 204360 87406 103321 -37008 -174863 29271 26476
10163 26476 -32378 -46624 -101144 -206901 -79441 -71988 -184547 71683 140460 66045 33099
10152 33099 132493 -195683 -130162 29493 54281 -189008 204879 23325 79290 -145471 -194966
10141 -194966 184632 -57244 115265 -100142 162249 26609 -188844 304707 -43155 -302117
10131 -302117 -369722 85367 125453 -38670 -350478 -242715 -1642 -48257 274583 -277429 219824
10119 -339016 144930 142834 441359 -293900 92245 -84347 -49744 -124346 -28 14920 69386 -88750
10106 -142734 -231307 161985 201901 32823 -133246 -374106 -262925 -501986 138888 -107354
$$ packed form
10186c52689J54136g4970A5502g1268j03816b641o6860G0623a83265g1390G2725
10174a69386B42089g8120j05094A41169O3191H7406J5915c7008j37855B9271k795
10163B6476c2378j4246n4520j05757g9441P453j12559G1683O8777F6045l2946
10152C3099R9394a95683O5521B9493K4788a89008B04879B3325N5965a45471m9495
10141a94966A84632e7244A15265a00142A62249B6609a88844C04707d3155k58962
10131c02117o7605H5367M0086c8670l11808J07763a642m6615B74583b77429B19824
10119c39016A44930k096K98525b93900I2245h4347L4603p4602b8A4920N4466h8750
10106a42734q8573A61985L9916C2823a33246k40860J11181k39061A38888a07354
$$ plain form
10095 -233561 -189055 -332946 110131 -93548 -124729 193927 -184863 -137154 -287338 23152
10084 -96184 -122410 -67513 -51712 234296 -461437 -135132 -155956 115579 -331446 103923
10073 95651 201121 18606 -176551 -114333 -194637 -188331 -223067 -102375 91534 -219766 -76813
10061 -76726 -491375 183284 25204 -152225 22126 -132918 88066 -40215 -295955 131027
10050 -132487 83180 -221012 -158579 -108 -231604 -61823 -30920 -107282 -452630 -67368 -47109
10039 -47109 -226854 116859 176892 64892 -46573 -243779 -136184 -14214 -241390 -109575
10028 68482 -254454 44231 50210 70931 23725 -542236 -250286 44922 -369704 273786 44805
10016 -289443 70419 160530 148602 167615 -40813 -101371 -66626 -385286 56524 -337597 74957
$$ packed form
10095b33561M4506j43891A10131i3548l1181A93927a84863M7709j50184B3152
10084i6184k6226N4897J5801B34296d61437a35132k0824A15579c31446A03923
10073I5651J05470A8606a76551O2218q0304O306l4736a02375I1534b19766g6813
10061g6726m14649A83284B5204a52225B2126a32918H8066d0215k55740A31027
10050a32487H3180b21012O2433a08k31496f1823L0903p6362l45348f7368K0259
10039d7109j79745A16859O0033F4892d6573j97206J07595a4214k27176a09575
10028F8482b54454D4231N979K0721B3725e42236b50286D4922c69704B73786D4805
10016b89443G0419R0111j1928J9013d0813o0558L4745l18660E6524c37597G4957
$$ plain form
10004 -14296 -109710 165221 185554 -181336 47345 72532 -290950 217084 -204386 -420030
9994 -420030 165198 -165448 -241584 -118162 -190582 31318 -13576 -158864 -155964 -243198 -87617
9982 -486456 -255571 167712 -161981 17961 390330 39723 84324 180998 -78514 281134 152470
9971 152470 -123204 172108 -199409 -307134 -31280 -72524 147842 -18800 57599 -265420
9960 -7582 -10707 -187630 -86906 -75550 89594 27234 -22980 102566 -52487 -278179 35370 77899
9948 77899 10929 66593 -221405 -80139 73519 -202859 272233 81122 240866 -244526 -86691
9936 210458 464531 -228399 -141907 -164601 111191 -470002 -282730 11056 -302681 69956
9925 -66263 -44739 -52426 -77198 182950 77583 -323399 -10351 135074 150935 -288212 -36514
$$ packed form
10004a4296r5414A65221K0333a81336D7345K5187b90950B17084b04386k15644
9994d20030A65198a65448p6136a18162p2420C1318a3576j45288K900q7234h7617
9982d86456K30885A67712a61981A7961L72369C9723M4601R6674g8514B81134j28664
9971A52470a23204A72108a99409j07725c1280m1244A47842a8800E7599b65420
9960g582l125j76923h6906J1356H9594B7234b2980A02566e2487k25692C5370M2529
9948G7899A0929N5664b21405h0139G3519b02859B72233H1122J59744b44526h6691
9936B10458K54073b28399Q6492k2694A11191d70002J87272A1056c02681F9956
9925f6263K1524p687k4772A82950G7583c23399a0351A35074J5861b88212c6514
$$ plain form
9913 -126085 -233526 -27572 72154 -158686 -184604 -70546 -191653 -130247 -55416 -32796 -217043
9902 -217043 -94317 -158256 29052 -185147 15680 -191152 86585 -68264 -41776 168707 76200
9890 -194113 -449383 -103577 -273982 -247988 -177851 -137196 122620 106439 -60624 -303505 -110544
9878 -55853 -224292 114088 33099 2949 -10283 22948 -109606 -41120 -125921 70792 -96371
9866 -89352 -170438 53606 -164692 94379 -166922 -271612 -36184 76044 -177889 -87819 -209827
9855 -209827 113013 -266515 134830 -74231 45718 -19243 24751 -257630 19305 -28010 -82629
9844 -82629 -180652 -108736 -118208 64350 -21141 128254 223856 8038 129849 75529 -247660 -284430
9832 -284430 -226903 -59697 185752 17258 64436 -192000 -146907 213832 43167 -178399 -442258
$$ packed form
9913a26085j07441b7572G2154a58686k5918g0546j21107O1406e5416K2620j84247
9902b17043i4317o3939B9052a85147A5680a91152H6585f8264K6488A68707G6200
9890a94113k55270a03577j70405K5994P0137M0655A22620j6181f0624k42881a10544
9878e5853j68439A14088C3099B949a0283B2948a09606d1120q4801G0792i6371
9866h9352q1086E3606a64692I4379a66922j04690c6184G6044a77889h7819j22008
9855b09827A13013b66515A34830g4231D5718a9243B4751b57630A9305b8010n4619
9844h2629r8023P1916r472F4350b1141A28254R5602H038J21811n4320b47660l6770
9832b84430N7527e9697A85752A7258M7178a92000M5093B13832D3167a78399k63859
$$ plain form
9821 -442258 2356 271371 -131137 -5181 -297798 -153960 16073 -415698 -391837 174820 -279025
9809 228521 135503 -113282 -34305 -160946 -147148 354114 -27551 -184206 -375015 -190734
9799 -190734 -98349 -174335 -335515 125920 -123263 -29405 -349018 66448 203380 -294637
9788 71555 -100208 -307994 209036 -236143 -77481 -73337 149580 34109 32407 152256 -125320
9776 -221817 -98114 39184 -9369 125368 -53642 -157691 -2678 -28617 -81118 70065 -302256
9764 -330167 -12771 3415 -143660 158797 -137836 11703 -68888 166467 -178837 184761 104580
9753 104580 -216312 -467535 -28580 51698 166474 -245416 92380 207070 -228864 -119863
9743 -119863 -160257 -28299 -2565 -164904 204553 132887 -121932 111215 -198810 -182484 -295418
$$ packed form
9821d42258B356K69015a31137e181k92617J43838A6073d15698K3861A74820b79025
9809B28521r3018a13282c4305j26641J3798C54114b7551j56655j90809J84281
9799a90734R2385p5986j61180A25920a23263b9405l19613F6448J36932b94637
9788G1555a00208k07786B09036b36143g7481M144A49580C4109j702J19849a25320
9776b21817i8114C9184i369A25368e3642j04049b678k5939n2501G0065c02256
9764c30167a2771C415a43660A58797a37836A1703f8888A66467a78837A84761q0181
9753A04580b16312k51223b8580E1698J14776b45416I2380J14690b28864J09001
9743a19863m0394b8299b565j62339B04553p1666a21932A11215a98810J6326j12934
$$ plain form
9732 -295418 203296 -20057 -144355 -32425 -139789 -90516 -518239 75110 47874 86623 -5482
9720 121221 -45506 -23477 -222286 -136949 128005 -35496 -352277 35041 -85040 -438951 -183906
9708 57988 -74881 -300478 -28415 204220 70482 -27638 -46086 -113728 65694 -155302 155127
9696 -121228 238078 -26677 170897 -240776 -83470 -348605 -205784 -93579 -32804 42175 -269764
9684 105734 -40954 -358579 -164121 51914 75470 273803 196057 108620 -280291 -66181 -365677
9673 -365677 -39183 -152725 -112705 -323563 187092 -35184 -260946 396842 -48 55651 4678
9661 -57070 -249936 -30137 -141912 -28349 -315454 -56899 -189691 184303 487536 22782 40217
9650 40217 115351 243453 -22388 196725 -72620 -199673 63764 -7588 -153096 -300271 -286708
$$ packed form
9732b95418B03296b0057j24298c2425j07364M9273m27723G5110k7236L8749e482
9720A21221d5506K2029j98809Q5337A28005c5496l16781C5041h5040l53911a83906
9708E7988g4881k25597b8415B04220G0482b7638j8448o7642F5694a55302A55127
9696a21228B38078b6677A70897b40776h3470k65135J42821i3579c2804D2175b69764
9684A05734d0954l17625a64121E1914K3556J98333p7746q7437b80291f6181k99496
9673c65677c9183j13542M0020k10858A87092c5184k25762C96842d8E5651D678
9661e7070j92866c0137j11775b8349k87105e6899j32792A84303L03233B2782J7435
9650D0217P5134J28102b2388A96725g2620j27053F3764g588j45508j47175J3563
$$ plain form
9639 -286708 -68435 -350213 80102 -34838 -73324 -89911 -10148 -75256 -147233 -78160 -209177
9628 -209177 -128962 -268635 -194122 -240351 -185833 29237 -82064 -91930 -238564 -77583 -213972
9617 -213972 -260208 -346052 -369079 146698 -131395 -87321 -91211 155959 14516 -294390 -87025
9605 -117835 31724 45 -78669 -33580 96593 -335241 67312 -118969 38441 38143 -64732 -21308
9592 -6099 -337265 104756 254928 241692 71143 -68838 255689 180754 -62106 -121714 -483889
9581 -483889 -175641 49659 305084 -141236 211298 156126 -175664 -83087 67088 -219151
9570 -105403 116060 80837 -142040 -191834 -208464 -89456 -169775 41946 -263662 -61858 -125769
9559 -125769 -95783 177047 -119441 -352235 128362 -54696 262250 -151572 -127526 -142997
$$ packed form
9639b86708f8435k81778H0102c4838l8486j6587a0148o5108p1977O9073j31017
9628b09177Q0215j39673P4513m6229N4518B9237h2064r866j46634g7583j36389
9617b13972m6236q5844k3027A46698a31395M4074l890A55959A4516b94390h7025
9605a17835C1724D5g8669c3580I6593c35241F7312a18969C8441k98f4732b1308
9592f099l31166A04756J50172j3236G1143f8838B55689p4935f2106n9608l62175
9581d83889a75641D9659K55425a41236B11298n5172a75664h3087F7088b19151
9570a05403A16060l5223a42040m9794j6630h9456q0319D1946b63662f1858o3911
9559a25769K9986A77047a19441k32794A28362e4696B62250a51572K4046j5471
$$ plain form
9549 -142997 -207702 90508 -115731 -21369 -151448 -91895 -45398 -5378 13744 -304762 -214835
9538 -214835 336203 157372 60432 18659 -26514 122518 -82028 -32971 177337 211985 -207896
9526 55831 -192230 -123755 5588 -119405 -173149 -175364 -324050 -151774 -75510 388700 5196
9514 291848 -222648 131083 -37310 -269976 -45029 114586 -126522 156563 -1403 -428872
9504 -428872 -121053 137976 -298560 -154076 -36594 -71487 -9202 -3596 115130 -158684 -122371
9493 -122371 -87823 -72490 -54845 -115112 27728 65669 -221169 -34900 61721 232832 -87955
9481 -75289 -133365 -252860 -184900 71654 -58838 -152299 -1144 -85073 -412556 -119485 -224312
9470 -224312 31868 70341 102795 -213592 -113537 -77826 -453291 -204750 -291317 -20514 294462
$$ packed form
9549a42997o4705I0508a15731b1369j30079N9553d5398e378A3744c04762Q9927
9538b14835C36203A57372F0432A8659b6514A22518h2028c2971A77337L4648b07896
9526E5831a92230O8475E588a19405n3744k215j48686a51774g5510C88700E196
9514B91848b22648A31083c7310k32666d5029A14586a26522A56563a403m27469
9504d28872a21053A37976b98560J44484c6594l4893i202c596A15130a58684L6313
9493a22371L4548J5333J7645o0267B7728L7941b21169c4900F1721J71111h7955
9481g5289n8076j19495O7960G1654e8838r3461a144q3929l27483a19485j04827
9470b24312C1868L8473L2454b13592J00055L5711l75465b04750q6567b0514B94462
$$ plain form
9458 -12381 168359 231598 -139364 -206125 83959 179414 125237 -180233 -114620 -443905 -267257
9447 -267257 -269510 34037 98288 164088 -68583 -262841 -60096 -242470 -330101 -42849 -38271 -205273
9435 -205273 -301152 -275810 -86269 146364 89255 125274 -41333 -15822 -280599 261823 41028
9423 -349473 183647 -159476 114271 31171 -13479 -350914 314172 -119667 -125439 -214203 146800
9411 -437855 37833 -15484 200519 -169263 -169205 -73746 -102028 34295 60002 -67454 188424 -77404
9398 -79966 -148149 -261436 -191818 -58482 36671 -43513 -334594 -69400 137191 -236841 60182
9386 -286470 210742 -4668 114445 -65462 -296770 -188342 -90628 232095 -51749 -91728 -309044
9375 -309044 -108106 59401 -101096 -94722 36339 233797 -102532 -266926 -175130 -217298 50656
$$ packed form
9458a2381A68359O3239a39364o6761H3959R5455n4177a80233O5613l29285J76648
9447b67257k253C4037O4251O5800f8583j94258f0096j82374q7631d2849M578j67002
9435b05273r5879K5342h6269A46364n7109L6019d1333a5822k64777B61823D1028
9423c49473A83647a59476A14271C1171a3479l37435C14172a19667n772q8764A46800
9411d37855C7833a5484B00519a69263N8g3746k8282C4295K5707f7454A88424g7404
9398g9966o8183j13287O9618e8482C6671d3513k91081f9400A37191b36841F0182
9386b86470B10742d668A14445f5462k31308J08428i0628B32095e1749l9979k17316
9375c09044a08106E9401a01096O374C6339J97458a02532j64394R1796m2168E0656
$$ plain form
9363 223443 -265147 44000 27501 -336402 126176 -420627 190305 103602 163151 -330766
9352 -118517 -139196 -77399 -210813 -278438 159088 -66478 -46933 -1477 -295004 218794 -182724
9340 295820 181282 -22512 -176173 -200441 93501 -52887 4850 115358 -179188 -40644 -105370
9329 -105370 37162 -426567 -319093 -147297 141101 -178431 77437 45844 154811 32315
9318 -96964 149305 -134081 40700 25720 268980 -164876 -207870 -31848 -87818 140570 -83725
9306 85796 -157801 -78384 114356 -35795 78146 -251849 -251914 81716 4009 156606 -77207 -39097
9294 -39097 -18879 -175208 -158975 -35528 28756 -101457 16716 -103959 -8294 -127896 -177635
9283 -177635 32631 -191128 -150129 -170591 -173968 -302169 -239919 15343 91981 160582 22534
$$ packed form
9363B23443b65147D4000j6499c36402A26176d20627A90305q6703N9549c30766
9352a18517k0679O1797j33414o7625A59088f6478J9545a477k93527B18794a82724
9340B95820j14538b2512j53661k4268I3501e2887D850J10508a79188d0644o4726
9329a05370C7162d26567J07474a47297A41101a78431G7437l1593J08967C2315
9318i6964A49305a34081D0700j4980K43260a64876m2994c1848n5970A40570h3725
9306H5796a57801g8384A14356c5795G8146b51849o5H1716D009J52597g7207L8110
9294c9097a8879j56329J6233c5528B8756a01457A6716a03959h294j19602m9739
9283a77635C2631a91128M0999k0462l377j28201O2250A5343P6638O8601B2534
$$ plain form
9271 112992 237290 -12396 180057 315704 -131716 -529300 -336659 207117 -79484 161690
9260 154149 -299234 269639 17564 -401500 -11670 -24102 16254 -156896 29656 -32869 37743
9248 -594 99946 -158128 -75491 -359793 -60654 16933 30019 155213 -124788 68365 -66494
9236 -35170 -21029 16368 -213608 305978 -53518 -185528 51612 44228 33773 -34574 -291314
9225 -291314 416147 -133640 481238 248883 60788 170009 -136786 -406712 -101398 -327030
9215 -327030 -357780 -12730 101336 79977 14111 -268654 84768 -282690 -167773 80329 116872
9204 116872 -158217 139045 306239 -48038 63420 -86110 -231557 75240 146576 76097 -269790
9192 -91492 -117128 -314505 -25288 46697 -71589 46812 117520 265728 18342 -79814 328280
$$ packed form
9271A12992J24298a2396A80057J35647a31716l97584J92641B07117g9484A61690
9260A54149b99234B69639A7564d01500a1670j2432A6254a56896B9656c2869C7743
9248e94I9946a58128g5491k84302f0654A6933J3086J25194a24788F8365f6494
9236c5170J4141A6368b13608C05978e3518j32010E1612p384j0455c4574k56740
9225b91314D16147a33640D81238k32355F0788J09221a36786k69926a01398k25632
9215c27030l0750a2730A01336k1359A4111b68654H4768b82690J14917H0329L6543
9204A16872a58217A39045J67194d8038F3420h6110j45447G5240P1336p0479b69790
9192i1492k5636j97377b5288D6697g1589D6812P0708J48208A8342g9814C28280
$$ plain form
9180 -259014 60040 -235274 169118 -200633 -191146 -135784 64218 8388 -465248 -317909 -42041
9168 -329099 -109499 126542 -180165 -186118 -441916 124551 244811 3390 -138111 -330049
9158 -330049 -97138 149858 -41195 -87790 -122102 10979 -156695 74548 -302825 85761 109261
9147 109261 -225352 23518 -132427 -279551 -33183 -52219 -411983 -157587 102351 -228994
9136 15839 -1955 42423 -81535 -597405 -159051 -56345 -116191 226484 -19458 -181911 -101191
9125 -101191 153742 147227 -225022 -165150 -369330 -112852 -44182 64987 -98234 -321245 -136950
9113 -5171 -47664 -374793 -937 15207 109328 -219830 200318 32628 89125 -350609 -111681
9101 -186815 -317705 167458 -274537 -187121 122165 -116984 20180 -321037 18007 -45803
$$ packed form
9180b59014F0040b35274A69118b00633R487N5362F4218H388d65248J47339d2041
9168c29099a09499A26542a80165n953k55798A24551J20260C390a38111j91938
9158c30049i7138A49858d1195m6595l4312A0979a56695G4548c02825H5761K3500
9147A09261b25352B3518a32427j47124c3183j9036l59764a57587A02351b28994
9136A5839a955D2423h1535n15870a59051e6345n9846B26484a9458j62453Q0720
9125a01191A53742o515b25022N9872k04180a12852d4182F4987i8234k23011a36950
9113e171m2493l27129i37A5207R4121b19830B00318C2628N6497c50609a11681
9101a86815j30890A67458b74537Q7416A22165a16984B0180c21037A8007d5803
$$ plain form
9090 27328 282406 274713 194742 -124417 32183 101573 4253 -129543 -328860 -147342 -233648
9079 -233648 -157708 -44313 -42878 -12386 -139811 -25154 -221165 -118114 -8858 84451 -362673
9067 -295652 147540 -410664 -142793 91183 -103584 14066 120257 223730 9485 18719 -114319
9055 -65711 -6787 195595 -118900 -180645 -297019 35871 -150183 54183 -242022 107953 35293
9043 -390381 -101868 -212113 193430 -53270 -81904 233135 -184594 48012 -204373 -118944
9033 -118944 -233313 -176174 175889 -249188 -84769 1984 201779 40472 -60733 -453761 193580
9021 -131272 -88157 -26065 -79015 134141 -117573 -75754 170763 -322334 -62969 -206296 176799
9009 142921 -49381 -169755 -308593 -166370 8658 317355 13919 -201589 -84991 74858 -12008
$$ packed form
9090B7328K55078p693p9971a24417C2183O9390D253a29543j99317a47342q6306
9079b33648P5940d4313J435a2386j27425b5154j96011J03051h858H4451c62673
9067b95652A47540d10664a42793I1183a03584A4066J06191J03473I485R234a14319
9055f5711f787A95595a18900o1745j16374C5871a50183E4183b42022A07953C5293
9043c90381a01868j10245A93430e3270k8634B33135a84594D8012b04373Q5429
9033a18944j14369N7139A75889b49188h4769A984J99795D0472f0733l93028A93580
9021a31272M3115b6065n2950A34141a17573M1819A70763c22334f2969j43327A76799
9009A42921d9381j20374j38838J42223H658L08697A3919b01589h4991G4858a2008
$$ plain form
8997 138980 -242046 11746 -154181 126376 55728 -414329 -47224 -163413 406 119197 -113098
8985 323904 -6205 -147408 28609 -80153 31107 112106 -127275 -201973 -141347 -231539 -153061
8974 -153061 -32458 -143100 -187163 -245830 -45900 168905 -54250 -7077 -8639 106015 -382717
8962 -127117 144902 -274497 538088 -275226 -162744 -45454 -281567 65911 -76077 168382
8951 -461499 -126065 -239042 123902 -150544 -39007 18432 -272950 -384712 -116429 -227319
8941 -227319 -203591 2502 -163452 162785 -338702 7126 -194013 15300 -207768 -175882 22642
8929 127607 -188940 45219 -51084 -292061 137534 -57299 83831 -179247 -134044 158588 -22447
8917 -118906 -132017 -106880 137845 274065 186637 -320082 238021 105613 323534 542109
$$ packed form
8997A38980b42046A1746a54181A26376E5728d14329d7224j16189D06J18791a13098
8985C23904f205j41203B8609h0153C1107Q0999a27275p4698O0626r0192P8478
8974a53061c2458j10642m4063n8667d5900A68905e4250g077j562A06015c82717
8962a27117A44902b74497E38088b75226J12482d5454k36113F5911g6077A68382
8951d61499a26065j12977A23902a50544c9007A8432b72950j11762a16429j10890
8941b27319K3728B502a63452A62785c38702G126a94013A5300b07768L1886B2642
8929A27607a88940D5219e1084k40977A37534e7299H3831a79247M5203A58588b2447
8917a18906j3111K5137A37845J36220q7428c20082B38021A05613K17921K18575
$$ plain form
8907 542109 196881 839061 1738892 3143924 6507197 5239812 2384239 1317408 596456
8897 638676 613675 281991 27763 132819 -2763 233700 197682 385101 255826 99786 -105979
8885 24129 -220024 52624 43449 80263 9976 139395 -288230 -21721 -117306 429398 -119749
8873 -123787 -107166 -337908 -16421 -189918 -172499 -73392 -40894 -425696 -152117 -217382 -169122
8862 -169122 -80117 -100537 2973 -107692 -277818 103094 284901 -121340 229135 -67459 -152717
$$ packed form
8907E42109A96881O42180Q99831J405032L363273j267385B384239j066831E96456
8897F38676k5001B81991B7763J05056b763B33700l6018J87419j29275I9786a05979
8885B4129b20024E2624r175L6814I976J29419b88230b1721r5585D29398a19749
8873a23787J6621k30742a6421j73497J7419g3392L2498l84802a52117o5265M8260
8862a69122h0117k0420B973a07692j70126A03094J81807a21340B29135f7459q5258
$$ [...]
##END NTUPLES=NMR SPECTRUM
##END=
