
##TITLE=AC1194_MCiAH12046_5946741_v1nQO1RDBa
##JCAMPDX= 6.0         $$ Bruker NMR JCAMP-DX V2.0
##DATA TYPE= NMR SPECTRUM
##DATA CLASS= NTUPLES
##ORIGIN= BRUKER
##OWNER= Administrator
$$ 1.72 TOPSPIN		Version 2.1
$$ 2012-04-11 02:36:13.156 -0500  Administrator@TOPSPIN
$$ Compression mode = diff/dup
##.OBSERVE FREQUENCY= 400.13188235
##.OBSERVE NUCLEUS= ^1H
##.ACQUISITION MODE= SIMULTANEOUS (DQD)
##.ACQUISITION SCHEME= undefined
##.AVERAGES= 64
##.DIGITISER RES= 22
##SPECTROMETER/DATA SYSTEM= spect
##.PULSE SEQUENCE= noesygpps1d.comp
##.SOLVENT NAME= COFFEE_meoh
##.SHIFT REFERENCE= INTERNAL, COFFEE_meoh, 1, 14.9686
##AUDIT TRAIL= $$ (NUMBER, WHEN, WHO, WHERE, PROCESS, VERSION, WHAT)
$$ ##TITLE= Audit trail, TOPSPIN		Version 2.1
$$ ##JCAMPDX= 5.01
$$ ##ORIGIN= Bruker BioSpin GmbH
$$ ##OWNER= Administrator
$$ $$ C:\Bruker\TOPSPIN/data/COFFEE/nmr/AC1194_MCiAH12046_5946741_v1nQO1RDBa/12/pdata/1/auditp.txt
$$ ##AUDIT TRAIL=  $$ (NUMBER, WHEN, WHO, WHERE, PROCESS, VERSION, WHAT)
(   1,<2012-04-11 02:36:08.437 -0500>,<Administrator>,<TOPSPIN>,<go>,<TOPSPIN 2.1>,
      <created by zg
	started at 2012-04-11 02:24:36.718 -0500,
	POWCHK enabled, PULCHK disabled,
       configuration hash MD5:
       1A 1E CE 29 27 FD 77 03 67 4E F0 E3 C4 B2 CB 90
       data hash MD5: 64K
       2E 82 88 FC 2E 55 F7 5E D9 A3 0E 8F 0A CC 1D D7>)
(   2,<2012-04-11 02:36:11.218 -0500>,<Administrator>,<TOPSPIN>,<proc1d>,<TOPSPIN 2.1>,
      <Start of raw data processing
       efp LB = 0.3 FT_mod = 6 PKNL = 1 PHC0 = 0 PHC1 = 0 SI = 128K 
       data hash MD5: 128K
       C4 19 38 75 40 67 84 8F 6E A5 12 23 96 C0 A8 B4>)
(   3,<2012-04-11 02:36:12.421 -0500>,<Administrator>,<TOPSPIN>,<proc1d>,<TOPSPIN 2.1>,
      <pk PHC0 = 31.62415 PHC1 = 0 
       data hash MD5: 128K
       6D FD 39 76 E9 C8 86 EA C3 66 B6 9C DD 9B B0 A6>)
(   4,<2012-04-11 02:36:12.656 -0500>,<Administrator>,<TOPSPIN>,<proc1d>,<TOPSPIN 2.1>,
      <abs ABSG = 1 
       data hash MD5: 128K
       A3 4E 0E 68 8F 4E 53 8B 6C 6D EE FD 3F 03 68 77>)
(   5,<2012-04-11 02:36:12.734 -0500>,<Administrator>,<TOPSPIN>,<proc1d>,<TOPSPIN 2.1>,
      <abs ABSG = 2 
       data hash MD5: 128K
       B1 DB AE A2 23 F6 4E 16 B2 24 53 45 BF 2D 10 3B>)
(   6,<2012-04-11 02:36:12.843 -0500>,<Administrator>,<TOPSPIN>,<proc1d>,<TOPSPIN 2.1>,
      <abs ABSG = 3 
       data hash MD5: 128K
       88 5F 97 C6 FC 1E 11 70 4F 03 6A 9D 19 35 76 3B>)
(   7,<2012-04-11 02:36:13.015 -0500>,<Administrator>,<TOPSPIN>,<proc1d>,<TOPSPIN 2.1>,
      <abs ABSG = 4 
       data hash MD5: 128K
       48 37 31 DB 04 47 07 20 C9 E0 78 03 E0 78 D3 9B>)
(   8,<2012-04-11 02:36:13.078 -0500>,<Administrator>,<TOPSPIN>,<proc1d>,<TOPSPIN 2.1>,
      <abs ABSG = 5 
       data hash MD5: 128K
       ED 8F 85 A1 B9 37 D9 4B F0 E8 ED 59 FE F3 80 78>)
$$ ##END=
$$ 
$$ $$ hash MD5
$$ $$ AC 11 DA 21 A3 14 29 58 AB 41 0A C6 54 92 09 42
##$RELAX= 
##$RELAX= 
##$RELAX= 
##$RELAX= 
##$RELAX= 
##$RELAX= 
##$RELAX= 
##$RELAX= 
$$ Bruker specific parameters
$$ [...]
##$TP07= 0
##$TPNAME0= <>
##$TPNAME1= <>
##$TPNAME2= <>
##$TPNAME3= <>
##$TPNAME4= <>
##$TPNAME5= <>
##$TPNAME6= <>
##$TPNAME7= <>
##$TPOAL= (0..7)
0.5 0.5 0.5 0.5 0.5 0.5 0.5 0.5
##$TPOFFS= (0..7)
0 0 0 0 0 0 0 0
##$TUNHIN= 0
##$TUNHOUT= 0
##$TUNXOUT= 0
##$USERA1= <user>
##$USERA2= <user>
##$USERA3= <user>
##$USERA4= <user>
##$USERA5= <user>
##$V9= 5
##$VALIST= <valist>
##$VCLIST= <CCCCCCCCCCCCCCC>
##$VD= 0
##$VDLIST= <DDDDDDDDDDDDDDD>
##$VPLIST= <PPPPPPPPPPPPPPP>
##$VTLIST= <TTTTTTTTTTTTTTT>
##$WBST= 1024
##$WBSW= 4
##$XGAIN= (0..3)
0 0 0 0
##$XL= 0
##$YL= 0
##$YMAX_a= 13465652
##$YMIN_a= -5704854
##$ZGOPTNS= <>
##$ZL1= 120
##$ZL2= 120
##$ZL3= 120
##$ZL4= 120
##$ABSF1= 14.9686
##$ABSF2= -5.58393
##$ABSG= 5
##$ABSL= 3
##$ALPHA= 0
##$AQORDER= 0
##$ASSFAC= 0
##$ASSFACI= 0
##$ASSFACX= 0
##$ASSWID= 0
##$AUNMP= <proc_prof1d_extract.lims>
##$AXLEFT= 0
##$AXNAME= <>
##$AXNUC= <1H>
##$AXRIGHT= 0
##$AXTYPE= 0
##$AXUNIT= <>
##$AZFE= 0.1
##$AZFW= 0.1
##$BCFW= 0
##$BC_mod= 0
##$BYTORDP= 0
##$COROFFS= 0
##$CY= 15
##$DATMOD= 1
##$DC= 0
##$DFILT= <>
##$DTYPP= 0
##$F1P= 0
##$F2P= 0
##$FCOR= 0.5
##$FTSIZE= 131072
##$FT_mod= 6
##$GAMMA= 0
##$GB= 0
##$INTBC= 1
##$INTSCL= 1
##$ISEN= 128
##$LB= 0.3
##$LEV0= 0
##$LPBIN= 0
##$MAXI= 10000
##$MC2= 0
##$MEAN= 0
##$ME_mod= 0
##$MI= 0
##$NCOEF= 0
##$NC_proc= -3
##$NLEV= 6
##$NOISF1= 0
##$NOISF2= 0
##$NSP= 0
##$NTH_PI= 0
##$NZP= 0
##$OFFSET= 14.9686
##$PC= 1
##$PHC0= 31.62415
##$PHC1= 0
##$PH_mod= 1
##$PKNL= yes
##$PPARMOD= 0
##$PPDIAG= 0
##$PPIPTYP= 0
##$PPMPNUM= 2147483647
##$PPRESOL= 1
##$PSCAL= 4
##$PSIGN= 0
##$PYNMP= <proc.py>
##$REVERSE= no
##$SF= 400.130004804765
##$SI= 131072
##$SIGF1= 0
##$SIGF2= 0
##$SINO= 400
##$SIOLD= 131072
##$SPECTYP= <>
##$SREGLST= <1H.CDCl3>
##$SSB= 0
##$STSI= 131072
##$STSR= 0
##$SW_p= 8223.68421052632
##$SYMM= 0
##$S_DEV= 0
##$TDeff= 65536
##$TDoff= 0
##$TI= <>
##$TILT= no
##$TM1= 0
##$TM2= 0
##$TOPLEV= 0
##$USERP1= <user>
##$USERP2= <user>
##$USERP3= <user>
##$USERP4= <user>
##$USERP5= <user>
##$WDW= 1
##$XDIM= 131072
##$YMAX_p= 510709548
##$YMIN_p= -372602854
##$CURPLOT= <Network HP LaserJet P1505>
##$CURPRIN= <$Network HP LaserJet P1505>
##$DFORMAT= <normdp>
##$LAYOUT= <+/1D_H.xwp>
##$LFORMAT= <normlp>
##$PFORMAT= <normpl>
##$SURQMSG= 1
$$ End of Bruker specific parameters
$$ ---------------------------------
##NTUPLES= NMR SPECTRUM
##VAR_NAME=  FREQUENCY,     SPECTRUM/REAL,   SPECTRUM/IMAG
##SYMBOL=    X,             R,               I
##VAR_TYPE=  INDEPENDENT,   DEPENDENT,       DEPENDENT
##VAR_FORM=  AFFN,          ASDF,            ASDF
##VAR_DIM=   131072,        131072,          131072
##UNITS=     HZ,            ARBITRARY UNITS, ARBITRARY UNITS
##FACTOR=    0.0627417313425165, 1,          1
##FIRST=     8223.62146879498, 571,          -89452
##LAST=      0,             1845,            -89439
##MIN=       0,             -372602854,      0
##MAX=       8223.62146879498, 510709548,    0
$$ Real data points
##PAGE= N=1
##DATA TABLE= (X++(R..R)), XYDATA
$$ [...]
$$ plain form
60694 1815899 1816906 1818416 1820012 1821420 1822538 1823238 1823396 1823195 1822783 1821336 1817174 1809586 1800140 1791444 1784819
60679 1784819 1779688 1774671 1768529 1760617 1751430 1742446 1734418 1726087 1715627 1703251 1691286 1681645 1674263
60666 1674263 1668132 1662757 1658295 1655143 1653777 1654288 1655814 1657077 1657772 1658824 1661088 1664419 1668149 1671778
60652 1671778 1674952 1677285 1678425 1677842 1674569 1667867 1658357 1647854 1637854 1628642 1619960 1611879 1604749 1598789
60638 1598789 1594034 1590304 1587089 1583772 1580104 1576145 1571724 1566155 1558537 1548403 1536480 1524758 1514755
60625 1514755 1505222 1492757 1475636 1455923 1436422 1416870 1395291 1372253 1350955 1332996 1316867
60614 1316867 1301481 1288543 1279882 1274540 1270362 1266897 1264770 1263485 1262092 1261369 1263162 1267702 1273395 1279246
60600 1279246 1285743 1293072 1300113 1305816 1310372 1314369 1317832 1320845 1324240 1328702 1333697 1338230 1342516 1347938
$$ packed form
60694A815899J007J510J596J408J118P00J58k01m12j447m162p588r446q696o625
60679A784819n131n017o142p912r187q984q028q331j0460j2376j1965r641p382
60666A674263o131n375m462l152j366N11J526J263O95J052K264L331L730L629
60652A671778L174K333J140n83l273o702r510j0503j0000r212q682q081p130n960
60638A598789m755l730l215l317l668l959m421n569p618j0134j1923j1722j0003
60625A514755r533j2465j7121j9713j9501j9552k1579k3038k1298j7959j6129
60614A316867j5386j2938q661n342m178l465k127j285j393p23J793M540N693N851
60600A279246O497P329P041N703M556L997L463L013L395M462M995M533M286N422
$$ plain form
60586 1347938 1355125 1362773 1368897 1372906 1376027 1379902 1385370 1392467 1400800 1409521 1417625 1424897 1432255 1440705
60572 1440705 1450322 1460755 1472131 1484705 1498109 1512092 1527810 1547221 1570970 1597631 1625018
60561 1625018 1651443 1675911 1698348 1719855 1741524 1762588 1780757 1794736 1805363 1813850 1820127 1823602
60549 1823602 1824420 1823057 1819501 1813751 1806406 1797863 1787531 1774647 1759265 1741650 1721374 1698054 1672624
60536 1672624 1646946 1622389 1599534 1578857 1560714 1544789 1530387 1517426 1506639 1498883 1494586 1493544
60524 1493544 1494727 1496530 1497773 1498330 1498564 1498584 1498520 1498969 1500389 1502331 1503854 1504615 1505128 1506263 1508851 1513330
60508 1513330 1519214 1525345 1531247 1537805 1545960 1555256 1564448 1573081 1581461 1589323 1595725 1600375 1604125 1607788
60494 1607788 1611223 1613964 1616148 1618382 1621046 1624169 1627860 1632561 1638920 1647622 1659370 1674912 1694817
$$ packed form
60586A347938P187P648O124M009L121L875N468P097Q333Q721Q104P272P358Q450
60572A440705R617J0433J1376J2574J3404J3983J5718J9411K3749K6661K7387
60561A625018K6425K4468K2437K1507K1669K1064J8169J3979J0627Q487O277L475
60549A823602Q18j363l556n750p345q543j0332j2884j5382j7615k0276k3320k5430
60536A672624k5678k4557k2855k0677j8143j5925j4402j2961j0787p756m297j042
60524A493544J183J803J243N57K34K0o4M49J420J942J523P61N13J135K588M479
60508A513330N884O131N902O558Q155R296R192Q633Q380P862O402M650L750L663
60494A607788L435K741K184K234K664L123L691M701O359Q702J1748J5542J9905
$$ plain form
60481 1694817 1719164 1747611 1779970 1816496 1857330 1901841 1948765 1996508 2042652 2083719 2116633
60470 2116633 2140396 2155273 2160475 2154433 2137967 2115528 2091988 2069213 2047041 2026605 2010866 2001976
60458 2001976 1999543 2001807 2007726 2017708 2032865 2053545 2078330 2104874 2132111 2161070 2193024 2227669
60446 2227669 2264046 2302498 2344478 2390915 2442210 2499696 2565710 2641974 2728938 2826969 2937215
60435 2937215 3060982 3199004 3351640 3519237 3702270 3901733 4119417 4357112 4615629
60426 4615629 4895440 5198338 5527355 5884474 6268537 6674764 7094289 7512515 7908026
60417 7908026 8254456 8525051 8697557 8757403 8698852 8525014 8247719 7886748 7466886 7012918
60407 7012918 6545577 6080971 5631971 5208289 4815182 4453683 4123164 3823526 3554870
$$ packed form
60481A694817K4347K8447L2359L6526M0834M4511M6924M7743M6144M1067L2914
60470B116633K3763J4877N202o042j6466k2439k3540k2775k2172k0436j5739q890
60458B001976k433K264N919R982J5157K0680K4785K6544K7237K8959L1954L4645
60446B227669L6377L8452M1980M6437N1295N7486O6014P6264Q6964R8031J10246
60435B937215J23767J38022J52636J67597J83033J99463K17684K37695K58517
60426D615629K79811L02898L29017L57119L84063M06227M19525M18226L95511
60417G908026L46430K70595J72506N9846n8551j73838k77295l60971m19862m53968
60407G012918m67341m64606m49000m23682l93107l61499l30519k99638k68656
$$ plain form
60398 3554870 3315971 3103917 2915188 2746853 2596874 2463554 2344885 2238718 2143673 2059403
60388 2059403 1985469 1920208 1861302 1807230 1757515 1711699 1668928 1628644 1590917 1555706 1522395
60377 1522395 1490438 1460104 1432192 1407150 1384590 1363570 1343323 1323933 1306313 1291337 1279052
60366 1279052 1268866 1260273 1253105 1247307 1242756 1239090 1235441 1230786 1225245 1220704 1219312 1221297 1224854 1228221
60352 1228221 1231209 1234615 1238897 1243793 1248784 1253490 1257879 1262380 1267605 1273716 1280134 1286072 1291315 1296405
60338 1296405 1302102 1308718 1315999 1323617 1331611 1340247 1349590 1359458 1369626 1379740 1389132 1397103 1403295
60325 1403295 1407468 1409278 1408920 1407634 1406673 1405978 1404797 1403261 1401899 1399862 1395641 1389971 1385949 1385294 1386390
60310 1386390 1387269 1388536 1391501 1395271 1398173 1400945 1405831 1412952 1420093 1425982 1431454 1437283 1443155 1449208
$$ packed form
60398C554870k38899k12054j88729j68335j49979j33320j18669j06167r5045q4270
60388B059403p3934o5261n8906n4072m9715m5816m2771m0284l7727l5211l3311
60377A522395l1957l0334k7912k5042k2560k1020k0247j9390j7620j4976j2285
60366A279052j0186q593p168n798m551l666l649m655n541m541j392J985L557L367
60352A228221K988L406M282M896M991M706M389M501N225O111O418N938N243N090
60338A296405N697O616P281P618P994Q636R343R868J0168J0114R392P971O192
60325A403295M173J810l58j286r61o95j181j536j362k037m221n670m022o55J096
60310A386390Q79J267K965L770K902K772M886P121P141N889N472N829N872O053
$$ plain form
60296 1449208 1456519 1465289 1474314 1483012 1492495 1503865 1516781 1530411 1544543 1559063 1573548 1588126
60284 1588126 1603673 1620359 1636869 1651702 1664473 1675499 1684985 1693148 1700295 1706318 1710840 1714154
60272 1714154 1717155 1720271 1723565 1727955 1734862 1744201 1754183 1763644 1772941 1781686 1787384 1787853 1783607 1776250
60258 1776250 1765627 1750748 1732950 1715860 1701686 1689194 1676118 1662467 1650542 1642306 1637582 1634641
60246 1634641 1631848 1628635 1625537 1623818 1624788 1628739 1634324 1639665 1644418 1650151 1658257 1668241 1678767 1689496
60232 1689496 1700675 1711592 1721002 1728908 1736472 1744188 1751546 1758417 1765149 1771134 1775054 1777041 1778962
60219 1778962 1781903 1784932 1787167 1789518 1793366 1798872 1805651 1813909 1823855 1835086 1847718 1862995 1881618
60206 1881618 1902596 1925045 1949977 1978739 2010675 2044196 2079721 2119644 2165441 2216309 2270847
$$ packed form
60296A449208P311Q770R025Q698R483J1370J2916J3630J4132J4520J4485J4578
60284A588126J5547J6686J6510J4833J2771J1026R486Q163P147O023M522L314
60272A714154L001L116L294M390O907R339R982R461R297Q745N698M69m246p357
60258A776250j0623j4879j7798j7090j4174j2492j3076j3651j1925q236m724k941
60246A634641k793l213l098j719R70L951N585N341M753N733Q106R984J0526J0729
60232A689496J1179J0917R410P906P564P716P358O871O732N985L920J987J921
60219A778962K941L029K235K351L848N506O779Q258R946J1231J2632J5277J8623
60206A881618K0978K2449K4932K8762L1936L3521L5525L9923M5797N0868N4538
$$ plain form
60195 2270847 2328781 2390796 2457772 2530665 2610452 2697804 2793035 2896293 3007546 3126741 3254343
60184 3254343 3391255 3537822 3693528 3858075 4031725 4213614 4400503 4588428 4775054
60175 4775054 4959273 5138979 5310676 5471167 5618328 5750235 5864910 5961314 6039541 6099443
60165 6099443 6139906 6160201 6161756 6148077 6122972 6088972 6047481 6000319 5950835 5903121 5860251
60154 5860251 5823950 5796068 5779475 5777011 5790261 5819919 5866650 5930870 6012232 6110069 6223911
60143 6223911 6353063 6496236 6652141 6819562 6996007 7176931 7357114 7532087 7697394
60134 7697394 7847592 7977685 8085234 8169755 8230422 8265750 8275185 8259369 8218839 8154208 8068132
60123 8068132 7965749 7852427 7731952 7607301 7482189 7361191 7249059 7150422 7069423 7008854
$$ packed form
60195B270847N7934O2015O6976P2893P9787Q7352R5231J03258J11253J19195J27602
60184C254343J36912J46567J55706J64547J73650J81889J86889J87925J86626
60175D775054J84219J79706J71697J60491J47161J31907J14675R6404P8227N9902
60165F099443M0463K0295J555j3679k5105l4000m1491m7162m9484m7714m2870
60154E860251l6301k7882j6593k464J3250K9658M6731O4220Q1362R7837J13842
60143F223911J29152J43173J55905J67421J76445J80924J80183J74973J65307
60134G697394J50198J30093J07549Q4521O0667L5328R435j5816m0530o4631q6076
60123H068132j02383j13322j20475j24651j25112j20998j12132r8637q0999o0569
$$ plain form
60113 7008854 6969731 6951969 6955263 6979390 7024296 7090127 7176574 7281671 7401335 7530290 7663440
60102 7663440 7796517 7925850 8047723 8158025 8252838 8329690 8388169 8429319 8454790 8466638
60092 8466638 8467211 8458816 8444079 8427110 8413474 8408126 8413827 8432277 8466147 8519001 8593744 8692261
60080 8692261 8816162 8966729 9144395 9349501 9583568 9848790 10146318 10476086 10838264
60071 10838264 11233722 11662828 12124551 12616562 13135009 13673979 14226039 14783513 15338582
60062 15338582 15882619 16406834 16903620 17365970 17785500 18152650 18459442 18700838 18873078
60053 18873078 18972365 18996367 18945781 18823185 18631111 18372615 18053364 17682105 17269175 16825301
60043 16825301 16361555 15889418 15420332 14965127 14533504 14133490 13771228 13451212 13176460
$$ packed form
60113G008854l9123j7762L294K4127M4906O5831Q6447J05097J19664J28955J33150
60102G663440J33077J29333J21873J10302R4813P6852N8479M1150K5471J1848
60092H466638N73q395j4737j6969j3636n348N701J8450L3870N2854P4743R8517
60080H692261J23901J50567J77666K05106K34067K65222K97528L29768L62178
60071A0838264L95458M29106M61723M92011N18447N38970N52060N57474N55069
60062A5338582N44037N24215M96786M62350M19530L67150L06792K41396J72240
60053A8873078R9287K4002n0586j22596j92074k58496l19251l71259m12930m43874
60043A6825301m63746m72137m69086m55205m31623m00014l62262l20016k74752
$$ plain form
60034 13176460 12948495 12767658 12633679 12545548 12500821 12495745 12526367 12588895 12678471 12788077
60024 12788077 12909167 13033072 13151578 13256915 13342237 13402371 13433860 13434353 13402337 13337347 13240055
60013 13240055 13111935 12954864 12771066 12563322 12335024 12089752 11830813 11561505 11285901
60004 11285901 11008781 10734406 10465888 10206341 9960190 9732449 9526761 9344733 9186950
59995 9186950 9053994 8946814 8867038 8816788 8797189 8806944 8843191 8903701 8987409 9093068 9218640
59984 9218640 9361864 9519665 9686410 9854286 10016458 10168812 10307803 10427868 10522452 10586991
59974 10586991 10619705 10619958 10587171 10521281 10423159 10294567 10138609 9960351 9766171 9562208
59964 9562208 9353774 9146059 8944407 8753365 8575870 8413844 8269569 8146188 8046729 7972706
$$ packed form
60034A3176460k27965j80837j33979q8131m4727n076L0622O2528Q9576J09606
60024A2788077J21090J23905J18506J05337Q5322O0134L1489M93l2016o4990r7292
60013A3240055j28120j57071j83798k07744k28298k45272k58939k69308k75604
60004A1285901k77120k74375k68518k59547k46151k27741k05688j82028j57783
59995I186950j32956j07180p9776n0250j9599R755L6247O0510Q3708J05659J25572
59984I218640J43224J57801J66745J67876J62172J52354J38991J20065R4584O4539
59974A0586991L2714K53l2787o5890r8122j28592j55958j78258j94180k03963
59964I562208k08434k07715k01652j91042j77495j62026j44275j23381r9459p4023
$$ plain form
59954 7972706 7923958 7900111 7901953 7930956 7987563 8070735 8179342 8313259 8472679 8656826 8863784
59943 8863784 9091043 9335496 9592967 9857951 10123607 10381958 10624956 10846094 11040936
59934 11040936 11205932 11337389 11432074 11488186 11505109 11482829 11422336 11326051 11196869 11037406
59924 11037406 10851536 10646521 10432053 10216701 10006193 9805358 9620146 9456626 9318739
59915 9318739 9208231 9126317 9074277 9052520 9060066 9095195 9155954 9240058 9345156 9469472 9611289
59904 9611289 9767247 9931924 10100044 10268779 10437027 10602578 10760975 10907484 11039492
59895 11039492 11156728 11259944 11350016 11427913 11494769 11552099 11602389 11649460 11697864 11752021 11816243
59884 11816243 11895313 11994500 12119082 12274300 12465569 12697813 12974026 13294874 13660095 14070099
$$ packed form
59954G972706m8748k3847J842K9003N6607Q3172J08607J33917J59420J84147K06958
59943H863784K27259K44453K57471K64984K65656K58351K42998K21138J94842
59934A1040936J64996J31457R4685N6112J6923k2280o0493r6285j29182j59463
59924A1037406j85870k05015k14468k15352k10508k00835j85212j63520j37887
59915I318739j10508q1914n2040k1757P546L5129O0759Q4104J05098J24316J41817
59904I611289J55958J64677J68120J68735J68248J65551J58397J46509J32008
59895A1039492J17236J03216R0072P7897O6856N7330N0290M7071M8404N4157O4222
59884A1816243P9070R9187J24582J55218J91269K32244K76213L20848L65221M10004
$$ plain form
59874 14070099 14525624 15025551 15565047 16135803 16727784 17330330 17931327 18515667 19065143
59865 19065143 19560188 19981761 20312219 20536157 20642319 20625771 20488582 20238857 19889320
59856 19889320 19456212 18958228 18415102 17845860 17267122 16692378 16132891 15599110 15100575
59847 15100575 14644252 14233841 13871420 13559276 13299506 13092395 12936197 12828642 12768205
59838 12768205 12754159 12785818 12861367 12976766 13125952 13302374 13499722 13710477 13924565 14130521
59828 14130521 14317553 14475471 14593422 14660598 14668576 14612044 14487755 14294817 14036587 13720729
59818 13720729 13356628 12953716 12522420 12074495 11620685 11168801 10725210 10296978 9890805
59809 9890805 9510313 9156129 8828715 8529634 8259682 8017189 7799141 7603371 7428713
$$ packed form
59874A4070099M55525M99927N39496N70756N91981O02546O00997N84340N49476
59865A9065143M95045M21573L30458K23938J06162j6548j37189k49725l49537
59856A9889320m33108m97984n43126n69242n78738n74744n59487n33781m98535
59847A5100575m56323m10411l62421l12144k59770k07111j56198j07555o0437
59838A2768205j4046L1659P5549J15399J49186J76422J97348K10755K14088K05956
59828A4130521J87032J57918J17951O7176P978n6532j24289j92938k58230l15858
59818A3720729l64101m02912m31296m47925m53810m51884m43591m28232m06173
59809I890805l80492l54184l27414k99081k69952k42493k18048j95770j74658
$$ plain form
59800 7428713 7273170 7132821 7003014 6880413 6763589 6651877 6544399 6440556 6340933 6246931
59790 6246931 6159620 6079594 6007775 5945305 5892113 5846258 5805258 5767610 5732301 5697189 5658853
59779 5658853 5614464 5563384 5506662 5445343 5379952 5311698 5243347 5178109 5117836 5063052 5014676
59768 5014676 4974600 4944175 4923144 4910824 4907460 4913410 4927741 4948994 4977019 5012871 5057134 5109659
59756 5109659 5170853 5241716 5322188 5410515 5504617 5602937 5703522 5803362 5899512 5990311 6074973
59745 6074973 6152512 6221497 6280611 6329431 6369228 6403026 6434018 6463759 6492632 6522204 6556268
59734 6556268 6599401 6655261 6726241 6813571 6917451 7038342 7178840 7343503 7536393 7759597
59724 7759597 8014435 8302935 8627367 8989162 9388799 9825801 10297830 10800016 11324890
$$ packed form
59800G428713j55543j40349j29807j22601j16824j11712j07478j03843r9623r4002
59790F246931q7311q0026p1819o2470n3192m5855m1000l7648l5309l5112l8336
59779E658853m4389n1080n6722o1319o5391o8254o8351o5238o0273n4784m8376
59768E014676m0076l0425k1031j2320l364N950J4331K1253K8025L5852M4263N2525
59756E109659O1194P0863Q0472Q8327R4102R8320J00585R9840R6150R0799Q4662
59745F074973P7539O8985N9114M8820L9797L3798L0992K9741K8873K9572L4064
59734F556268M3133N5860P0980Q7330J03880J20891J40498J64663J92890K23204
59724G759597K54838K88500L24432L61795L99637M37002M72029N02186N24874
$$ plain form
59715 11324890 11861211 12391536 12891517 13332691 13686724 13929308 14044704 14030671 13899772
59706 13899772 13674632 13380896 13042915 12682387 12317430 11962078 11627337 11322363 11053710
59697 11053710 10823977 10632587 10478130 10359664 10276620 10228691 10215744 10237010 10290544 10374226
59687 10374226 10487102 10629242 10800880 11002468 11234967 11499118 11794828 12122151 12482423
59678 12482423 12877520 13308689 13777417 14287087 14842142 15445335 16096917 16796792 17546451
59669 17546451 18348219 19203220 20110377 21066687 22067725 23107710 24178983 25271357 26372240
59660 26372240 27467769 28544151 29588862 30592347 31550071 32463184 33337197 34180517 35004035
59651 35004035 35820362 36641713 37478103 38337033 39222838 40134475 41064158 41998932 42922796
$$ packed form
59715A1324890N36321N30325M99981M41174L54033K42584J15396j4033j30899
59706A3899772k25140k93736l37981l60528l64957l55352l34741l04974k68653
59697A1053710k29733j91390j54457j18466q3044m7929j2947K1266N3534Q3682
59687A0374226J12876J42140J71638K01588K32499K64151K95710L27323L60272
59678A2482423L95097M31169M68728N09670N55055O03193O51582O99875P49659
59669A7546451Q01768Q55001R07157R56310J001038J039985J071273J092374J100883
59660B6372240J095529J076382J044711J003485R57724R13113Q74013Q43320Q23518
59651C5004035Q16327Q21351Q36390Q58930Q85805R11637R29683R34774R23864
$$ plain form
59642 42922796 43816483 44656901 45419684 46083573 46632521 47055426 47346654 47507749 47547703
59633 47547703 47481547 47329425 47115975 46867874 46610446 46366817 46159440 46010061 45937147 45954511
59623 45954511 46073103 46302926 46652428 47127160 47730099 48462423 49322547 50304045 51394596
59614 51394596 52576085 53824699 55110466 56396430 57637688 58781329 59768816 60541032
59606 60541032 61044282 61235884 61089103 60596768 59772093 58646439 57265378 55684036 53961625
59597 53961625 52155784 50318350 48493097 46714339 45005923 43381099 41842937 40383973
59589 40383973 38985770 37621348 36261677 34883225 33472663 32027886 30556951 29075853
59581 29075853 27604920 26164487 24771723 23439714 22178057 20993320 19888852 18864783
$$ packed form
59642D2922796Q93687Q40418P62783O63889N48948M22905K91228J61095L9954
59633D7547703o6156j52122k13450k48101k57428k43629k07377j49379p2914J7364
59623D5954511J18592K29823L49502M74732O02939P32324Q60124R81498J090551
59614E1394596J181489J248614J285767J285964J241258J143641R87487P72216
59606F0541032N03250J91602j46781m92335q24675j125654j381061j581342j722411
59597E3961625j805841j837434j825253j778758j708416j624824j538162j458964
59589D0383973j398203j364422j359671j378452j410562j444777j470935j481098
59581B9075853j470933j440433j392764j332009j261657j184737j104468j024069
$$ plain form
59573 18864783 17918949 17048277 16249467 15518851 14852136 14244438 13690373 13184496 12722413
59564 12722413 12301520 11920050 11575311 11263584 10981769 10728026 10500265 10294979 10108205
59555 10108205 9936812 9778021 9628453 9484647 9344059 9204664 9064038 8919600 8769425
59546 8769425 8612348 8448203 8278958 8108689 7940935 7776372 7614205 7455331 7302743
59537 7302743 7159180 7025989 6904225 6795145 6699124 6615335 6543101 6482782 6435045 6400116
59527 6400116 6377821 6367349 6366766 6373865 6387918 6409758 6439816 6476940 6519527 6566931 6619133 6675652
59515 6675652 6735328 6796963 6860068 6925500 6995488 7072485 7157772 7251535 7354245 7467435 7593050
59504 7593050 7732654 7887268 8057495 8243808 8447182 8669354 8911952 9175558 9460156
$$ packed form
59573A8864783r45834q70672p98810p30616o66715o07698n54065n05877m62083
59564A2722413m20893l81470l44739l11727k81815k53743k27761k05286j86774
59555A0108205j71393j58791j49568j43806j40588j39395j40626j44438j50175
59546H769425j57077j64145j69245j70269j67754j64563j62167j58874j52588
59537G302743j43563j33191j21764j09080r6021q3789p2234o0319m7737l4929
59527F400116k2295j0472n83P099J4053K1840L0058L7124M2587M7404N2202N6519
59515F675652N9676O1635O3105O5432O9988P6997Q5287R3763J02710J13190J25615
59504G593050J39604J54614J70227J86313K03374K22172K42598K63606K84598
$$ plain form
59495 9460156 9766199 10094577 10445881 10820313 11217762 11636909 12074481 12526168 12987882
59486 12987882 13455273 13922794 14384570 14835657 15271211 15685389 16073395 16434296 16769139
59477 16769139 17075654 17347038 17577218 17765788 17917131 18036805 18130406 18204399 18265778 18320826
59467 18320826 18375034 18433781 18502270 18585105 18686128 18807455 18947486 19100071 19255966 19404349
59457 19404349 19532782 19627293 19674185 19661865 19580963 19424250 19187947 18872790 18482889 18023993
59447 18023993 17503740 16933058 16325986 15697502 15061375 14429338 13811417 13216561 12652605
59438 12652605 12125223 11637252 11189816 10783788 10419172 10093684 9804103 9549473 9331099
59429 9331099 9148753 8999140 8879498 8790535 8733557 8706259 8704166 8725696 8773144 8848651 8951600
$$ packed form
59495I460156L06043L28378L51304L74432L97449M19147M37572M51687M61714
59486A2987882M67391M67521M61776M51087M35554M14178L88006L60901L34843
59477A6769139L06515K71384K30180J88570J51343J19674R3601P3993O1379N5048
59467A8320826N4208N8747O8489Q2835J01023J21327J40031J52585J55895J48383
59457A9404349J28433R4511M6892j2320q0902j56713k36303l15157l89901m58896
59447A8023993n20253n70682o07072o28484o36127o32037o17921n94856n63956
59438A2652605n27382m87971m47436m06028l64616l25488k89581k54630k18374
59429I331099j82346j49613j19642q8963n6978k7298k093K1530M7448P5507J02949
$$ plain form
59418 8951600 9080497 9235129 9415669 9621273 9850871 10104302 10381303 10679802 10996051
59409 10996051 11325726 11663729 12003100 12335281 12651588 12943524 13201346 13413535 13569079
59400 13569079 13660580 13684731 13640157 13526060 13343559 13097382 12795221 12445900 12058987 11645438
59390 11645438 11216634 10781912 10347606 9918602 9499942 9096608 8712615 8350771 8012610
59381 8012610 7698213 7406847 7138285 6892949 6670608 6469793 6288895 6127076 5983726
59372 5983726 5857877 5748549 5654684 5574331 5505061 5446012 5398471 5363481 5339865 5325676 5320472
59361 5320472 5324604 5337026 5355705 5380078 5411346 5450163 5495697 5547650 5607589 5676835 5753508
59350 5753508 5832816 5910318 5984585 6057217 6131513 6211382 6300463 6401127 6514450 6641956 6787129
$$ packed form
59418H951600J28897J54632J80540K05604K29598K53431K77001K98499L16249
59409A0996051L29675L38003L39371L32181L16307K91936K57822K12189J55544
59400A3569079R1501K4151m4574j14097j82501k46177l02161l49321l86913m13549
59390A1645438m28804m34722m34306m29004m18660m03334l83993l61844l38161
59381H012610l14397k91366k68562k45336k22341k00815j80898j61819j43350
59372E983726j25849j09328r3865q0353o9270n9049m7541l4990k3616j4189n204
59361E320472M132J2422J8679K4373L1268L8817M5534N1953N9939O9246P6673
59350E753508P9308P7502P4267P2632P4296P9869Q9081J00664J13323J27506J45173
$$ plain form
59339 6787129 6953617 7140989 7343425 7554327 7772435 8002716 8251857 8524454 8823431
59330 8823431 9151989 9513787 9912161 10350255 10831313 11357892 11931104 12551304 13219225
59321 13219225 13935800 14700835 15511638 16362031 17242100 18139214 19039564 19928632 20791027
59312 20791027 21611856 22379493 23086741 23729288 24304210 24810305 25248486 25620657 25928758
59303 25928758 26175230 26362990 26493572 26565684 26576251 26522156 26400420 26208080 25943603 25608504
59293 25608504 25207213 24746285 24234478 23682182 23098961 22491660 21865517 21225872 20577129
59284 20577129 19920740 19256150 18584012 17907430 17230638 16558172 15895391 15248039 14620576
59275 14620576 14015953 13437348 12888974 12374598 11896050 11453726 11047705 10677666 10342246
$$ packed form
59339F787129J66488J87372K02436K10902K18108K30281K49141K72597K98977
59330H823431L28558L61798L98374M38094M81058N26579N73212O20200O67921
59321A3219225P16575P65035Q10803Q50393Q80069Q97114R00350Q89068Q62395
59312B0791027Q20829P67637P07248O42547N74922N06095M38181L72171L08101
59303B5928758K46472J87760J30582P2112J0567n4095j21736j92340k64477l35099
59293B5608504m01291m60928n11807n52296n83221o07301o26143o39645o48743
59284B0577129o56389o64590o72138o76582o76792o72466o62781o47352o27463
59275A4620576o04623n78605n48374n14376m78548m42324m06021l70039l35420
$$ plain form
59266 10342246 10039346 9767231 9525099 9312605 9128973 8972613 8841537 8733940 8648087
59257 8648087 8581900 8533354 8501547 8486755 8489062 8507395 8540209 8586452 8645281 8715124 8793440
59246 8793440 8877160 8963359 9050152 9137034 9223432 9306623 9382157 9446898 9500707 9544640 9578765
59235 9578765 9602738 9617464 9625104 9628326 9630585 9636080 9647914 9666892 9693412 9729898 9780034 9846216
59223 9846216 9929207 10029739 10148898 10287090 10443860 10618169 10807297 11005900 11207924 11409366
59213 11409366 11607346 11796386 11967558 12112045 12224419 12302275 12344499 12351066 12323749 12266052
59203 12266052 12182643 12078950 11960663 11833255 11702038 11572034 11446815 11327824 11215806
59194 11215806 11112486 11019606 10936747 10861759 10793386 10731824 10676498 10625013 10574951 10525374 10476114
$$ packed form
59266A0342246l02900k72115k42132k12494j83632j56360j31076j07597q5853
59257H648087o6187m8546l1807j4792K307J8333L2814M6243N8829O9843P8316
59246H793440Q3720Q6199Q6793Q6882Q6398Q3191P5534O4741N3809M3933L4125
59235I578765K3973J4726P640L222K259N495J1834J8978K6520L6486N0136O6182
59223I846216Q2991J00532J19159J38192J56770J74309J89128J98603K02024K01442
59213A1409366J97980J89040J71172J44487J12374P7856M2224O567k7317n7697
59203A2266052q3409j03693j18287j27408j31217j30004j25219j18991j12018
59194A1215806j03320r2880q2859p4988o8373o1562n5326n1485n0062m9577m9260
$$ plain form
59183 10476114 10427268 10380447 10339416 10308381 10290250 10287066 10301162 10335153 10391784 10474679 10588392
59172 10588392 10736755 10921722 11144598 11407595 11713024 12061178 12449762 12874944 13331852
59163 13331852 13813870 14311838 14813738 15304574 15766723 16181289 16529898 16796064 16966086
59154 16966086 17029866 16981574 16819920 16548252 16174473 15710362 15170476 14571428 13931378 13268729
59144 13268729 12600115 11939203 11296913 10681819 10099957 9554893 9048634 8582321 8155866
59135 8155866 7767606 7415029 7095737 6807339 6546847 6311070 6097679 5905330 5732605
59126 5732605 5577439 5437922 5313148 5202641 5105227 5019205 4943570 4878169 4822326 4774309
59116 4774309 4732948 4699047 4674061 4657847 4649055 4647528 4654587 4670605 4693875 4722781 4757812 4800398
$$ packed form
59183A0476114m8846m6821m1031l1035j8131l184J4096L3991N6631Q2895J13713
59172A0588392J48363J84967K22876K62997L05429L48154L88584M25182M56908
59163A3331852M82018M97968N01900M90836M62149M14566L48609K66166J70022
59154A6966086O3780m8292j61654k71668l73779m64111n39886n99048o40050o62649
59144A3268729o68614o60912o42290o15094n81862n45064n06259m66313m26455
59135H155866l88260l52577l19292k88398k60492k35777k13391j92349j72725
59126E732605j55166j39517j24774j10507r7414q6022p5635o5401n5843m8017
59116D774309m1361l3901k4986j6214q792j527P059J6018K3270K8906L5031M2586
$$ plain form
59104 4800398 4850787 4908239 4972470 5043637 5121401 5205215 5295295 5392304 5496235 5606400 5722204
59093 5722204 5843201 5968723 6098013 6230163 6363178 6493818 6619340 6738832 6851837
59084 6851837 6956349 7049439 7129408 7196037 7248952 7287064 7309736 7317665 7312776 7297894 7275963
59073 7275963 7248662 7216452 7181000 7146650 7118059 7097154 7084187 7081111 7091642 7118037 7159993
59062 7159993 7217189 7291003 7383072 7493781 7622923 7770518 7936323 8119832 8321499 8542885
59052 8542885 8784879 9046554 9326015 9621275 9930003 10249601 10577913 10912379 11247551
59043 11247551 11574362 11882526 12162796 12406411 12603794 12745420 12824099 12836224 12781552 12662565
59033 12662565 12483804 12251376 11972903 11657298 11313347 10948091 10567077 10176015 9781224
$$ packed form
59104D800398N0389N7452O4231P1167P7764Q3814R0080R7009J03931J10165J15804
59093E722204J20997J25522J29290J32150J33015J30640J25522J19492J13005
59084F851837J04512R3090P9969O6629N2915L8112K2672P929m889j4882k1931
59073G275963k7301l2210l5452l4350k8591k0905j2967l076J0531K6395M1956
59062G159993N7196P3814R2069J10709J29142J47595J65805J83509K01667K21386
59052H542885K41994K61675K79461K95260L08728L19598L28312L34466L35172
59043A1247551L26811L08164K80270K43615J97383J41626P8679J2125n4672j18987
59033A2662565j78761k32428k78473l15605l43951l65256l81014l91062l94791
$$ plain form
59024 9781224 9388309 9001275 8623001 8255577 7899998 7556625 7226423 6911147 6612192
59015 6612192 6329937 6064152 5814173 5578852 5357477 5150793 4959959 4784425 4621883
59006 4621883 4470249 4328419 4195273 4069741 3952244 3844388 3746553 3657124 3574530 3498462
58996 3498462 3428317 3362096 3298135 3236893 3179875 3127405 3078019 3029289 2978756 2925183 2869566
58985 2869566 2813948 2758776 2702677 2645455 2589717 2538354 2491523 2447421 2405193 2365734 2330110
58974 2330110 2298459 2270294 2245055 2222422 2202551 2185738 2171669 2159513 2148928 2140245 2133546 2128536
58962 2128536 2125546 2125406 2127742 2130577 2132385 2133593 2135422 2138223 2141799 2146320 2151959 2158334 2165194 2173021
58948 2173021 2182234 2192451 2203227 2214851 2227727 2241647 2256375 2272260 2289636 2308137 2327211
$$ packed form
59024I781224l92915l87034l78274l67424l55579l43373l30202l15276k98955
59015F612192k82255k65785k49979k35321k21375k06684j90834j75534j62542
59006D621883j51634j41830j33146j25532j17497j07856r7835q9429q2594p6068
58996C498462p0145o6221o3961o1242n7018n2470m9386m8730n0533n3573n5617
58985B869566n5618n5172n6099n7222n5738n1363m6831m4102m2228l9459l5624
58974B330110l1651k8165k5239k2633j9871j6813j4069j2156j0585q683o699n010
58962B128536k990j40K336K835J808J208J829K801L576M521N639O375O860P827
58948B173021R213J0217J0776J1624J2876J3920J4728J5885J7376J8501J9074
$$ plain form
58937 2327211 2346743 2366793 2387414 2409008 2431986 2455706 2478805 2501080 2523980 2548706 2574932
58926 2574932 2602067 2630480 2660516 2691351 2721961 2752486 2783706 2815959 2849490 2885120 2923535
58915 2923535 2964395 3007006 3051493 3098622 3148847 3202095 3258142 3316880 3378622 3444112 3513554
58904 3513554 3585784 3659489 3735131 3814277 3896973 3981456 4066675 4153264 4241581 4330858 4421201
58893 4421201 4514438 4611893 4713208 4818624 4930472 5050803 5179249 5314966 5459100 5613520
58883 5613520 5778517 5953735 6140155 6339220 6551139 6776101 7016094 7273369 7547966
58874 7547966 7839023 8147913 8477930 8831364 9209087 9612731 10045029 10507956 11002573
58865 11002573 11530974 12096630 12702514 13350295 14041555 14778382 15562600 16395548 17278538
$$ packed form
58937B327211J9532K0050K0621K1594K2978K3720K3099K2275K2900K4726K6226
58926B574932K7135K8413L0036L0835L0610L0525L1220L2253L3531L5630L8415
58915B923535M0860M2611M4487M7129N0225N3248N6047N8738O1742O5490O9442
58904C513554P2230P3705P5642P9146Q2696Q4483Q5219Q6589Q8317Q9277R0343
58893D421201R3237R7455J01315J05416J11848J20331J28446J35717J44134J54420
58883E613520J64997J75218J86420J99065K11919K24962K39993K57275K74597
58874G547966K91057L08890L30017L53434L77723M03644M32298M62927M94617
58865A1002573N28401N65656O05884O47781O91260P36827P84218Q32948Q82990
$$ plain form
58856 17278538 18211952 19193462 20217850 21278163 22365571 23467926 24569543 25652296
58848 25652296 26695681 27675756 28565386 29336368 29961682 30417519 30685968 30757370 30630298
58839 30630298 30310146 29808912 29145775 28345703 27435995 26443566 25394158 24311923 23218522
58830 23218522 22132612 21069786 20042183 19058186 18123162 17240671 16412835 15640106 14921329
58821 14921329 14253880 13633781 13056707 12519485 12019837 11554318 11117865 10706399 10318721
58812 10318721 9954861 9613814 9294283 8996325 8720368 8465251 8228863 8010072 7808537
58803 7808537 7623357 7453748 7300446 7164499 7044861 6938973 6845563 6765238 6698475 6644769
58793 6644769 6603724 6575230 6558368 6551893 6556233 6573549 6605145 6649874 6705673 6771905 6849804 6941098
$$ packed form
58856A7278538R33414R81510J024388J060313J087408J102355J101617J082753
58848B5652296J043385R80075Q89630P70982O25314M55837K68449P1402j27072
58839C0630298l20152n01234o63137q00072r09708r92429j049408j082235j093401
58830B3218522j085910j062826j027603r83997r35024q82491q27836p72729p18777
58821A4921329o67449o20099n77074n37222m99648m65519m36453m11466l87678
58812A0318721l63860l41047l19531k97958k75957k55117k36388k18791k01535
58803G808537j85180j69609j53302j35947j19638j05888r3410q0325o6763n3706
58793F644769m1045k8494j6862o475M340J7316L1596M4729N5799O6232P7899R1294
$$ plain form
58781 6941098 7046418 7164782 7294912 7437299 7594263 7767465 7956382 8160144 8379743
58772 8379743 8616992 8872176 9144474 9434314 9743777 10075024 10429896 10810946 11221296
58763 11221296 11663445 12139294 12651215 13201886 13793195 14426532 15104192 15829483 16605234
58754 16605234 17432540 18310260 19234950 20201633 21204850 22237442 23287107 24335185 25359853
58745 25359853 26339018 27248934 28062247 28750525 29288702 29656195 29836359 29818988 29603972
58736 29603972 29200616 28623876 27893178 27033497 26073422 25040460 23959096 22852272 21741307
58727 21741307 20643332 19570637 18532877 17537966 16590658 15692525 14844204 14046375 13298598
58718 13298598 12599129 11946192 11337860 10770808 10241160 9746685 9286247 8857164 8455183
$$ packed form
58781F941098J05320J18364J30130J42387J56964J73202J88917K03762K19599
58772H379743K37249K55184K72298K89840L09463L31247L54872L81050M10350
58763A1221296M42149M75849N11921N50671N91309O33337O77660P25291P75751
58754A6605234Q27306Q77720R24690R66683J003217J032592J049665J048078J024668
58745B5359853R79165R09916Q13313O88278N38177L67493J80164j7371k15016
58736B9603972m03356n76740p30698q59681r60075j032962j081364j106824j110965
58727B1741307j097975j072695j037760r94911r47308q98133q48321p97829p47777
58718A3298598o99469o52937o08332n67052n29648m94475m60438m29083m01981
$$ plain form
58709 8455183 8077324 7722746 7390613 7079146 6786987 6513493 6257417 6017333 5793511
58700 5793511 5587172 5397546 5221809 5058247 4907235 4768727 4641168 4523513 4415975
58691 4415975 4317891 4226985 4141693 4062337 3989191 3921193 3857274 3797164 3740311 3685877 3634365
58680 3634365 3587288 3544687 3504916 3467238 3432260 3399222 3365431 3329504 3292931 3257379 3222629
58669 3222629 3188141 3154187 3120021 3083182 3042265 2998557 2953554 2906769 2857355 2805920 2753023
58658 2753023 2697693 2639225 2579061 2519369 2461109 2404696 2350904 2299574 2249077 2198829 2151027
58647 2151027 2108184 2069971 2033990 1998771 1964714 1932944 1904354 1878831 1854588 1829443 1803468
58636 1803468 1778923 1756836 1735529 1713602 1692374 1673711 1657203 1641402 1626539 1614083 1604537
$$ packed form
58709H455183l77859l54578l32133l11467k92159k73494k56076k40084k23822
58700E793511k06339j89626j75737j63562j51012j38508j27559j17655j07538
58691D415975r8084r0906q5292p9356p3146o7998o3919o0110n6853n4434n1512
58680C634365m7077m2601l9771l7678l4978l3038l3791l5927l6573l5552l4750
58669C222629l4488l3954l4166l6839m0917m3708m5003m6785m9414n1435n2897
58658B753023n5330n8468o0164n9692n8260n6413n3792n1330n0497n0248m7802
58647B151027m2843l8213l5981l5219l4057l1770k8590k5523k4243k5145k5975
58636A803468k4545k2087k1307k1927k1228j8663j6508j5801j4863j2456r546
$$ plain form
58625 1604537 1597322 1592076 1588497 1585609 1582500 1579292 1576450 1573780 1570820 1567267 1562500 1556001 1548937 1543770
58611 1543770 1541352 1539912 1537844 1535772 1534657 1533665 1531622 1529228 1528197 1529205 1531977 1536270 1541527 1546737
58597 1546737 1551900 1558441 1567090 1576709 1586428 1597509 1611664 1628815 1647893 1668572 1690964 1714925
58585 1714925 1740990 1770542 1803752 1838868 1875015 1914078 1958201 2006933 2058630 2113213 2171738
58574 2171738 2234710 2302835 2378056 2461559 2551781 2646527 2746302 2853713 2970497 3097184 3234956
58563 3234956 3385658 3550216 3728610 3921064 4128080 4350110 4588441 4845307 5121448
58554 5121448 5414175 5719013 6032060 6349251 6664543 6970374 7258602 7519209 7739609
58545 7739609 7907896 8016630 8062328 8043072 7959340 7816610 7624701 7394425 7136006 6859272
$$ packed form
58625A604537p215n246l579k888l109l208k842k670k960l553m767o499p064n167
58611A543770k418j440k068k072j115r92k043k394j031J008K772M293N257N210
58597A546737N163O541Q649R619R719J1081J4155J7151J9078K0679K2392K3961
58585A714925K6065K9552L3210L5116L6147L9063M4123M8732N1697N4583N8525
58574B171738O2972O8125P5221Q3503R0222R4746R9775J07411J16784J26687J37772
58563C234956J50702J64558J78394J92454K07016K22030K38331K56866K76141
58554E121448K92727L04838L13047L17191L15292L05831K88228K60607K20400
58545G739609J68287J08734M5698j9256q3732j42730j91909k30276k58419k76734
$$ plain form
58535 6859272 6572732 6282474 5993623 5712190 5443626 5190304 4952503 4731324 4528600
58526 4528600 4344453 4177166 4025344 3888275 3764526 3652212 3550557 3459330 3376852 3300307
58516 3300307 3227870 3158829 3091975 3025878 2960777 2898230 2838602 2780388 2722147 2663641 2604985
58505 2604985 2546269 2488321 2432497 2379266 2327843 2277249 2227007 2176958 2127350 2079051 2032977
58494 2032977 1989523 1949015 1912026 1878571 1847719 1818746 1791829 1766919 1743021 1719454 1696773
58483 1696773 1675655 1656248 1639425 1626860 1618412 1611144 1602579 1593409 1585279 1577810 1570142 1563745 1560848
58470 1560848 1560823 1560655 1558376 1553761 1546364 1535421 1521447 1505818 1488885 1470268 1450421 1430098 1408954
58457 1408954 1386650 1364574 1344384 1325564 1306676 1288378 1272716 1259853 1247902 1235845 1224247
$$ packed form
58535F859272k86540k90258k88851k81433k68564k53322k37801k21179k02724
58526D528600j84147j67287j51822j37069j23749j12314j01655r1227q2478p6545
58516C300307p2437o9041o6854o6097o5101o2547n9628n8214n8241n8506n8656
58505B604985n8716n7948n5824n3231n1423n0594n0242n0049m9608m8299m6074
58494B032977m3454m0508l6989l3455l0852k8973k6917k4910k3898k3567k2681
58483A696773k1118j9407j6823j2565q448p268q565r170q130p469p668o397k897
58470A560848k5j68k279m615p397j0943j3974j5629j6933j8617j9847k0323k1144
58457A408954k2304k2076k0190j8820j8888j8298j5662j2863j1951j2057j1598
$$ plain form
58446 1224247 1213263 1202379 1192267 1184632 1179736 1175852 1171453 1166484 1161524 1157258 1154721 1154484 1155590
58433 1155590 1156499 1156742 1156425 1154935 1151765 1148006 1145228 1143304 1140886 1137452 1133319 1128570 1123725 1120588 1120425
58418 1120425 1122063 1123712 1125720 1129389 1134056 1137860 1140792 1144582 1149952 1156109 1162402 1168243 1172123 1173097
58404 1173097 1172761 1173491 1175382 1177137 1178917 1181477 1183421 1182569 1179760 1177971 1177476 1174949 1167919 1157552 1146441
58389 1146441 1135869 1125701 1115072 1102939 1089605 1077341 1067765 1059380 1049886 1039959 1031993 1025951
58377 1025951 1019685 1012988 1007957 1005156 1002565 998851 994922 991829 989673 988908 990233 992934 995715 999200
58363 999200 1005090 1012884 1020169 1026249 1032729 1040302 1047840 1055100 1063551 1073941 1085479 1097754 1111008
58350 1111008 1124218 1135578 1145469 1156505 1170041 1184774 1199081 1212548 1224879 1235341 1243598 1249458
$$ packed form
58446A224247j0984j0884j0112p635m896l884m399m969m960m266k537k37J106
58433A155590R09K43l17j490l170l759k778j924k418l434m133m749m845l137j63
58418A120425J638J649K008L669M667L804K932L790N370O157O293N841L880R74
58404A173097l36P30J891J755J780K560J944q52k809j789m95k527p030j0367j1111
58389A146441j0572j0168j0629j2133j3334j2264r576q385r494r927p966o042
58377A025951o266o697n031k801k591l714l929l093k156p65J325K701K781L485
58363I99200N890P794P285O080O480P573P538P260Q451J0390J1538J2275J3254
58350A111008J3210J1360R891J1036J3536J4733J4307J3467J2331J0462Q257N860
$$ plain form
58338 1249458 1252267 1252463 1252821 1255564 1258982 1259708 1257624 1255538 1254796 1254573 1254996 1257247 1260629 1262986 1264132
58323 1264132 1265632 1267366 1267741 1267138 1267607 1269179 1270125 1270796 1273450 1278191 1282970 1287665 1294180 1302336 1309832
58308 1309832 1316751 1325885 1337918 1350340 1361812 1373507 1385356 1395051 1401623 1406139 1408317 1406775 1403301
58295 1403301 1402240 1404506 1406610 1406735 1407127 1409206 1411158 1412290 1415157 1421110 1427864 1433637 1439826 1447523
58281 1447523 1455299 1462545 1471226 1482131 1492983 1502362 1512103 1523939 1537195 1551531 1568349 1587596
58269 1587596 1606636 1624158 1641877 1660887 1679921 1698633 1718786 1740435 1760687 1778061 1794663
58258 1794663 1812497 1830973 1849259 1867524 1884875 1899829 1913655 1929360 1947014 1964466 1982745
58247 1982745 2005331 2031576 2056828 2080154 2105831 2135759 2166698 2196844 2228621 2262769 2296312
$$ packed form
58338A249458K809J96L58K743L418P26k084k086p42k23M23K251L382K357J146
58323A264132J500J734L75o03M69J572R46O71K654M741M779M695O515Q156P496
58308A309832O919R134J2033J2422J1472J1695J1849R695O572M516K178j542l474
58295A403301j061K266K104J25L92K079J952J132K867N953O754N773O189P697
58281A447523P776P246Q681J0905J0852R379R741J1836J3256J4336J6818J9247
58269A587596J9040J7522J7719J9010J9034J8712K0153K1649K0252J7374J6602
58258A794663J7834J8476J8286J8265J7351J4954J3826J5705J7654J7452J8279
58247A982745K2586K6245K5252K3326K5677K9928L0939L0146L1777L4148L3543
$$ plain form
58236 2296312 2328998 2365188 2406346 2448131 2487946 2528747 2571931 2613335 2650388 2686841 2726151
58225 2726151 2766393 2806129 2849075 2898070 2950144 3002370 3057212 3117480 3181367 3246997 3316543
58214 3316543 3391408 3468750 3546986 3629224 3717119 3807372 3898708 3996107 4103369 4217572 4335542
58203 4335542 4459606 4592241 4731553 4876992 5033013 5202192 5381526 5570375 5774567
58194 5774567 5997248 6233373 6479115 6738878 7016753 7309091 7612407 7930810 8268534
58185 8268534 8622879 8991660 9379684 9790518 10220039 10665761 11134177 11631092 12153442
58176 12153442 12698920 13274549 13886639 14530940 15201696 15901725 16635093 17400086 18199122
58167 18199122 19045569 19950874 20915368 21941142 23041827 24228773 25500513 26857651
$$ packed form
58236B296312L2686L6190M1158M1785L9815M0801M3184M1404L7053L6453L9310
58225B726151M0242L9736M2946M8995N2074N2226N4842O0268O3887O5630O9546
58214C316543P4865P7342P8236Q2238Q7895R0253R1336R7399J07262J14203J17970
58203D335542J24064J32635J39312J45439J56021J69179J79334J88849K04192
58194E774567K22681K36125K45742K59763K77875K92338L03316L18403L37724
58185H268534L54345L68781L88024M10834M29521M45722M68416M96915N22350
58176A2153442N45478N75629O12090O44301O70756P00029P33368P64993P99036
58167A8199122Q46447R05305R64494J025774J100685J186946J271740J357138
$$ plain form
58159 26857651 28314167 29880545 31550027 33316087 35188704 37177954 39278183 41487370
58151 41487370 43828046 46332311 49024640 51939791 55138311 58680084 62600064 66933374
58143 66933374 71743917 77104489 83077252 89750171 97272937 105828727 115603986 126822772
58135 126822772 139763841 154676727 171698384 190887214 212282932 235905519 261866035
58128 261866035 290638750 322935165 358588995 395039290 427074073 448715141 456021494
58121 456021494 448635048 429199366 401657997 369833395 336754089 304466509 274109383
58114 274109383 246190287 220899195 198268457 178206971 160551166 145135849 131798872
58107 131798872 120346532 110571300 102300840 95393442 89700200 85075877 81416371 78636187
$$ packed form
58159B6857651J456516J566378J669482J766060J872617J989250K100229K209187
58151D1487370K340676K504265K692329K915151L198520L541773L919980M333310
58143F6933374M810543N360572N972763O672919P522766Q555790R775259J1218786
58135A26822772J2941069J4912886J7021657J9188830K1395718K3622587K5960516
58128B61866035K8772715L2296415L5653830L6450295L2034783K1641068P306353
58121D56021494p386446j9435682k7541369l1824602l3079306l2287580l0357126
58114B74109383k7919096k5291092k2630738k0061486j7655805j5415317j3336977
58107A31798872j1452340r775232q270460o907398n693242m624323l659506k780184
$$ plain form
58099 78636187 76610098 75188014 74275140 73832796 73740710 73665463 73110532 71635542 69062763
58090 69062763 65517868 61312201 56787403 52224251 47824210 43716054 39961823 36573511
58082 36573511 33541858 30852365 28479432 26383264 24524214 22873967 21407643 20095374
58074 20095374 18910249 17836570 16862001 15968985 15141973 14375646 13667160 13006666 12384023
58065 12384023 11798509 11252802 10742656 10261204 9808374 9387106 8994421 8624725 8278116
58056 8278116 7957288 7659560 7379360 7114815 6864514 6621800 6380466 6143058 5915895
58047 5915895 5698910 5487912 5283716 5090842 4909362 4735889 4570934 4417717 4274964
58038 4274964 4137974 4005820 3880711 3761161 3642458 3523429 3406661 3292444 3178391
$$ packed form
58099G8636187k026089j422084r12874m42344r2086p5247n54931j474990k572779
58090F9062763l544895m205667m524798m563152m400041m108156l754231l388312
58082C6573511l031653k689493k372933k096168j859050j650247j466324j312269
58074B0095374j185125j073679r74569q93016q27012p66327p08486o60494o22643
58065A2384023n85514n45707n10146m81452m52830m21268l92685l69696l46609
58056H278116l20828k97728k80200k64545k50301k42714k41334k37408k27163
58047E915895k16985k10998k04196j92874j81480j73473j64955j53217j42753
58038D274964j36990j32154j25109j19550j18703j19029j16768j14217j14053
$$ plain form
58029 3178391 3064953 2955859 2853011 2755491 2663291 2577557 2497553 2421545 2350075 2284483 2223130
58018 2223130 2163018 2104128 2048385 1995689 1944822 1896809 1853393 1813591 1775653 1740717 1710350
58007 1710350 1682312 1653284 1624396 1599422 1578702 1559371 1540481 1523204 1506741 1488679 1469130
57996 1469130 1450493 1433473 1416992 1401311 1387469 1374416 1360451 1346656 1335141 1324807 1312826
57985 1312826 1299456 1287361 1276880 1266126 1255307 1246848 1241393 1237366 1234228 1232544 1231374 1229394 1228264
57972 1228264 1230931 1236628 1241301 1242955 1242947 1242012 1238915 1233545 1227810 1222611 1216841 1209938 1202858 1196171 1189518
57957 1189518 1182982 1176745 1169671 1160483 1149951 1139696 1129678 1119228 1109337 1101108 1093159 1083669 1073790
57944 1073790 1065654 1058302 1049375 1039739 1032223 1026487 1019591 1011443 1005190 1002015 999800 997259 995105 992590
$$ packed form
58029C178391j13438j09094j02848r7520r2200q5734q0004p6008p1470o5592o1353
58018B223130o0112n8890n5743n2696n0867m8013m3416l9802l7938l4936l0367
58007A710350k8038k9028k8888k4974k0720j9331j8890j7277j6463j8062j9549
57996A469130j8637j7020j6481j5681j3842j3053j3965j3795j1515j0334j1981
57985A312826j3370j2095j0481j0754j0819q459n455m027l138j684j170j980j130
57972A228264K667N697M673J654qr35l097n370n735n199n770o903p080o687o653
57957A189518o536o237p074r188j0532j0255j0018j0450r891q229p949r490r879
57944A073790q136p352q927r636p516n736o896q148o253l175k215k541k154k515
$$ plain form
57930 992590 987367 979887 973733 970230 966602 961056 955942 954006 954814 956834 959978 964063 967486 969599
57916 969599 972136 976357 980723 983019 982871 980701 976320 970188 964245 959697 955288 949159 941205 932585
57902 932585 924223 916749 910571 905067 898887 891698 884402 877358 869984 862564 856640 852915 850300 847615
57888 847615 844806 842103 839615 838026 837950 838359 837623 836396 837272 841009 845372 848466 850874 853287 854245 851909
57872 851909 846633 840329 834389 829226 824665 819747 813136 804581 795257 786521 779373 774999 774020 774957 775301
57857 775301 774614 774883 777459 781674 787045 794484 804170 814230 822938 830743 838900 847573 856369 865255
57843 865255 873751 880562 885151 888486 891176 892162 890288 885975 880287 873600 866224 859126 852896 846973
57829 846973 840770 834401 827464 818536 807161 795240 785205 777704 772063 767954 765338 763583 761875
$$ packed form
57930I92590n223p480o154l503l628n546n114j936Q08K020L144M085L423K113
57916I69599K537M221M366K296j48k170m381o132n943m548m409o129p954q620
57902I32585q362p474o178n504o180p189p296p044p374p420n924l725k615k685
57888H47615k809k703k488j589p6M09p36j227Q76L737M363L094K408K413R58k336
57872H51909n276o304n940n163m561m918o611q555r324q736p148m374r79R37L44
57857G75301o87K69K576M215N371P439R686J0060Q708P805Q157Q673Q796Q886
57843H65255Q496O811M589L335K690R86j874m313n688o687p376p098o230n923
57829H46973o203o369o937q928j1375j1921j0035p501n641m109k616j755j708
$$ plain form
57816 761875 760073 758485 757586 758427 762078 767721 772580 775058 776944 781166 788199 796129 803590 810954 818733
57801 818733 826210 832079 835763 837903 839795 842214 844568 845511 844443 841917 838568 834411 829239 822775
57787 822775 814344 803571 791825 781740 774638 769414 764454 759412 754245 747797 738723 727315 715429
57774 715429 704879 696501 690178 685013 679818 673965 667439 660054 651444 642079 633193 625190 617116 608288
57760 608288 599392 591255 583645 576186 569466 564094 559447 554487 549248 544470 540257 536252 532780 530683
57746 530683 530073 530148 530348 531089 533258 537315 542910 549200 555615 562256 569252 576001 581751 586802 592085
57731 592085 597470 601639 604034 605843 608444 611807 614956 617031 617336 615546 612765 611350 612553 614972
57717 614972 616278 615754 614097 611549 607660 602577 597211 592040 586896 582103 578875 578078 579155 580695 581849
$$ packed form
57816G61875j802j588q99Q41L651N643M859K478J886M222P033P930P461P364P779
57801H18733P477N869L684K140J892K419K354R43j068k526l349m157n172o464
57787H22775q431j0773j1746j0085p102n224m960n042n167o448r074j1408j1886
57774G15429j0550q378o323n165n195n853o526p385q610r365q886q003q074q828
57760F08288q896q137p610p459o720n372m647m960n239m778m213m005l472k097
57746E30683o10P5K00P41K169M057N595O290O415O641O996O749N750N051N283
57731E92085N385M169K395J809K601L363L149K075L05j790k781j415J203K419
57717F14972J306n24j657k548l889n083n366n171n144m793l228p97J077J540J154
$$ plain form
57702 581849 582836 584202 585949 587742 589905 593619 599663 607416 615745 624470 634050 644120 653527 661877
57688 661877 669887 678014 685913 693504 701385 709729 717943 726010 734907 744944 754816 763289 770950 779242
57674 779242 788492 797891 806956 816109 826191 838062 852272 868489 885706 903540 922764 944085
57662 944085 966997 990436 1013879 1037253 1060512 1084092 1109166 1136637 1166366 1198098 1232532
57651 1232532 1270562 1311819 1354823 1398501 1443052 1489585 1539366 1593128 1650683 1711425 1775398
57640 1775398 1843560 1916978 1996367 2082376 2175536 2275884 2383710 2500768 2629536 2771083
57630 2771083 2925056 3092177 3274983 3475050 3690987 3920462 4162962 4419018 4687411
57621 4687411 4964259 5243830 5518903 5781043 6022022 6234803 6412814 6549986 6643394 6695262
$$ packed form
57702E81849R87J366J747J793K163L714O044P753Q329Q725R580J0070R407Q350
57688F61877Q010Q127P899P591P881Q344Q214Q067Q897J0037R872Q473P661Q292
57674G79242R250R399R065R153J0082J1871J4210J6217J7217J7834J9224K1321
57662I44085K2912K3439K3443K3374K3259K3580K5074K7471K9729L1732L4434
57651A232532L8030M1257M3004M3678M4551M6533M9781N3762N7555O0742O3973
57640A775398O8162P3418P9389Q6009R3160J00348J07826J17058J28768J41547
57630B771083J53973J67121J82806K00067K15937K29475K42500K56056K68393
57621D687411K76848K79571K75073K62140K40979K12781J78011J37172R3408N1868
$$ plain form
57611 6695262 6711089 6696626 6657726 6600738 6529042 6438326 6317829 6158143 5957960 5724292
57601 5724292 5468371 5201762 4934198 4672864 4423082 4189312 3974916 3781257 3608115
57592 3608115 3455047 3321595 3206459 3107772 3024397 2955935 2901294 2858319 2825204 2801363 2786613
57581 2786613 2780403 2782400 2793182 2813739 2844441 2884697 2933448 2990068 3055117 3130202 3216903 3316051
57569 3316051 3428232 3554325 3694936 3849631 4017328 4196933 4386973 4584976 4787829
57560 4787829 4991999 5192488 5382029 5552333 5695854 5805795 5875462 5899464 5875796 5805895
57550 5805895 5693055 5541906 5359032 5152536 4930494 4700266 4468505 4240300 4018284
57541 4018284 3803732 3598389 3404170 3221627 3050426 2891255 2745537 2613128 2492011
$$ packed form
57611F695262J5827j4463l8900n6988p1696r0716j20497j59686k00183k33668
57601E724292k55921k66609k67564k61334k49782k33770k14396j93659j73142
57592C608115j53068j33452j15136r8687q3375o8462n4641m2975l3115k3841j4750
57581B786613o210J997J0782K0557L0702M0256M8751N6620O5049P5085Q6701R9148
57569C316051J12181J26093J40611J54695J67697J79605J90040J98003K02853
57560D787829K04170K00489J89541J70304J43521J09941O9667K4002k3668o9901
57550E805895j12840j51149j82874k06496k22042k30228k31761k28205k22016
57541D018284k14552k05343j94219j82543j71201j59171j45718j32409j21117
$$ plain form
57532 2492011 2380583 2278569 2185336 2099238 2019554 1947412 1883560 1826434 1773598 1724147 1678569
57521 1678569 1637049 1599169 1564778 1534063 1506863 1482608 1460716 1440707 1422299 1405799 1391872
57510 1391872 1380506 1370732 1361819 1354268 1349121 1346679 1346334 1347315 1349226 1352178 1356670 1363189 1371929 1383095
57496 1383095 1397209 1414492 1434223 1455482 1478270 1503027 1529428 1556970 1586633 1620353 1658637
57485 1658637 1700251 1744748 1793638 1848294 1908232 1972669 2042524 2119531 2204223 2295996 2394463
57474 2394463 2499622 2611412 2730235 2857397 2993928 3139257 3291750 3449674 3610359
57465 3610359 3769003 3919714 4057690 4179409 4280940 4357273 4403504 4416071 4393319 4336125
57455 4336125 4248239 4135212 4002615 3855391 3698473 3536970 3375532 3217843 3066633 2923836
$$ packed form
57532B492011j11428j02014r3233q6098p9684p2142o3852n7126n2836m9451m5578
57521A678569m1520l7880l4391l0715k7200k4255k1892k0009j8408j6500j3927
57510A391872j1366r774q913p551n147k442l45R81J911K952M492O519Q740J1166
57496A383095J4114J7283J9731K1259K2788K4757K6401K7542K9663L3720L8284
57485A658637M1614M4497M8890N4656N9938O4437O9855P7007Q4692R1773R8467
57474B394463J05159J11790J18823J27162J36531J45329J52493J57924J60685
57465C610359J58644J50711J37976J21719J01531P6333M6231J2567k2752n7194
57455D336125q7886j13027j32597j47224j56918j61503j61438j57689j51210j42797
$$ plain form
57445 2923836 2790883 2669070 2559216 2460774 2372113 2292282 2221677 2160211 2105836 2056346 2012087
57434 2012087 1975333 1947115 1926091 1910571 1900141 1894833 1894110 1897602 1905970 1920119 1939910 1964276
57422 1964276 1992408 2024428 2061058 2102972 2150428 2203543 2263052 2330553 2407469 2493762 2588205
57411 2588205 2690054 2799950 2918909 3046766 3181925 3322330 3466094 3610737 3751737
57402 3751737 3882267 3994960 4084005 4145240 4174621 4168075 4123766 4043871 3933269 3797056 3640221
57391 3640221 3469017 3290856 3111982 2935674 2762989 2594916 2433734 2282573 2143700
57382 2143700 2017109 1900974 1793516 1693984 1601847 1516173 1436507 1363414 1297056 1235987 1178600
57371 1178600 1125248 1077565 1035932 998878 964742 932520 901311 870513 840818 813596 789026
$$ packed form
57445B923836j32953j21813j09854r8442q8661p9831p0605o1466n4375m9490m4259
57434B012087l6754k8218k1024j5520j0430n308p23L492Q368J4149J9791K4366
57422A964276K8132L2020L6630M1914M7456N3115N9509O7501P6916Q6293R4443
57411B588205J01849J09896J18959J27857J35159J40405J43764J44643J41000
57402C751737J30530J12693Q9045O1235K9381o546m4309p9895j10602j36213j56835
57391C640221j71204j78161j78874j76308j72685j68073j61182j51161j38873
57382B143700j26591j16135j07458r9532r2137q5674p9666p3093o6358o1069n7387
57371A178600n3352m7683m1633l7054l4136l2222l1209l0798k9695k7222k4570
$$ plain form
57360 789026 766023 744170 724169 706000 688182 669646 651073 633645 617656 603049 590021
57349 590021 578152 566135 553614 542276 533802 527451 520972 513394 505615 498546 492042 485801 480172
57336 480172 475663 472148 468772 464439 458587 451924 446240 443013 442152 442183 441479 439322 436377 434383 434811
57321 434811 437377 440280 442120 443079 443963 444905 445541 445788 445831 445813 446088 447301 449626 452423 455180 458251 462141
57304 462141 466484 470355 473238 475340 477372 480314 484798 490432 496401 502844 510596 519264 526922 532551
57290 532551 537575 543997 552092 560965 570224 579823 589340 598892 609886 623254 637647 651073 663698
57277 663698 677303 692410 707780 722600 737337 752426 767716 783339 799571 815663 830211
57266 830211 842906 854661 865998 876744 887336 898797 911052 922705 932978 942752 953356 965474
$$ packed form
57360G89026k3003k1853k0001j8169j7818j8536j8573j7428j5989j4607j3028
57349E90021j1869j2017j2521j1338q474o351o479p578p779p069o504o241n629
57336D80172m509l515l376m333n852o663n684l227q61L1p04k157k945j994M28
57321D34811K566K903J840R59Q84R42O36K47M3j8K75J213K325K797K757L071L890
57304D62141M343L871K883K102K032K942M484N634N969O443P752Q668P658N629
57290E32551N024O422Q095Q873R259R599R517R552J0994J3368J4393J3426J2625
57277F63698J3605J5107J5370J4820J4737J5089J5290J5623J6232J6092J4548
57266H30211J2695J1755J1337J0746J0592J1461J2255J1653J0273R774J0604J2118
$$ plain form
57254 965474 979368 994878 1010883 1026038 1040417 1055347 1071401 1087800 1104034 1120814 1139112
57243 1139112 1159447 1182258 1207689 1234791 1262307 1290449 1320573 1352931 1386326 1420179 1455238
57232 1455238 1491958 1530048 1570076 1613497 1660232 1708049 1755236 1802157 1849265 1895531 1940001
57221 1940001 1982987 2024299 2062064 2094945 2123912 2149999 2171674 2186273 2192889 2192047 2183701 2167643
57209 2167643 2145165 2118296 2087817 2053772 2017512 1981539 1947594 1916308 1888279 1863821 1841857
57198 1841857 1820723 1800296 1782227 1768136 1758467 1752802 1750139 1749102 1748973 1750434 1754442 1760653 1767773
57185 1767773 1775046 1782432 1789833 1797224 1805244 1814580 1824943 1835518 1846211 1857652 1870195 1883641
57173 1883641 1897691 1912129 1927031 1943210 1961764 1982604 2004324 2026195 2049307 2074981 2103101
$$ packed form
57254I65474J3894J5510J6005J5155J4379J4930J6054J6399J6234J6780J8298
57243A139112K0335K2811K5431K7102K7516K8142L0124L2358L3395L3853L5059
57232A455238L6720L8090M0028M3421M6735M7817M7187M6921M7108M6266M4470
57221A940001M2986M1312L7765L2881K8967K6087K1675J4599O616q42q346j6058
57209B167643k2478k6869l0479l4045l6260l5973l3945l1286k8029k4458k1964
57198A841857k1134k0427j8069j4091r669n665k663j037j29J461M008O211P120
57185A767773P273P386P401P391Q020R336J0363J0575J0693J1441J2543J3446
57173A883641J4050J4438J4902J6179J8554K0840K1720K1871K3112K5674K8120
$$ plain form
57162 2103101 2133066 2165278 2200398 2237924 2276746 2316491 2357189 2398330 2439416 2481017 2524369
57151 2524369 2570369 2619537 2672100 2727469 2784573 2843178 2903638 2965040 3025544 3085382 3147416
57140 3147416 3213480 3282417 3353269 3427963 3508390 3592762 3677433 3760918 3843821 3926401 4008814
57129 4008814 4092272 4177196 4261350 4342428 4421274 4499792 4577040 4650581 4720699 4789953 4859089
57118 4859089 4926611 4992003 5056221 5119052 5178826 5234839 5287591 5336955 5382464 5424961 5465535
57107 5465535 5503546 5538212 5571208 5604813 5638600 5671235 5704695 5743088 5787640 5836365 5888377
57096 5888377 5945128 6007525 6075069 6147536 6224192 6301580 6375148 6442500 6502070 6549995 6582380
57085 6582380 6599578 6603981 6594423 6567242 6521871 6460241 6381286 6281417 6160228 6020215 5860881
$$ packed form
57162B103101K9965L2212L5120L7526L8822L9745M0698M1141M1086M1601M3352
57151B524369M6000M9168N2563N5369N7104N8605O0460O1402O0504N9838O2034
57140C147416O6064O8937P0852P4694Q0427Q4372Q4671Q3485Q2903Q2580Q2413
57129D008814Q3458Q4924Q4154Q1078P8846P8518P7248P3541P0118O9254O9136
57118D859089O7522O5392O4218O2831N9774N6013N2752M9364M5509M2497M0574
57107E465535L8011L4666L2996L3605L3787L2635L3460L8393M4552M8725N2012
57096E888377N6751O2397O7544P2467P6656P7388P3568O7352N9570M7925L2385
57085F582380J7198M403r558k7181m5371o1630p8955r9869j21189j40013j59334
$$ plain form
57074 5860881 5678829 5473926 5249396 5004866 4734826 4434517 4101627 3731750 3318567
57065 3318567 2859785 2356988 1808480 1207958 550331 -168348 -957597 -1831530 -2799728
57056 -2799728 -3866256 -5038882 -6330997 -7752527 -9307526 -11003296 -12853619 -14871078
57048 -14871078 -17066122 -19457661 -22076482 -24956350 -28132433 -31651768 -35573948 -39956656
57040 -39956656 -44849992 -50306437 -56382202 -63125059 -70577768 -78802301 -87888624 -97935665
57032 -97935665 -109038676 -121292213 -134768404 -149463381 -165267301 -181982426 -199356798
57025 -199356798 -217158221 -235360763 -254328249 -274646341 -296461628 -318794456 -339545483
57018 -339545483 -356338084 -367526236 -372602854 -371911166 -366143936 -356052668 -342394689
$$ packed form
57074E860881j82052k04903k24530k44530k70040l00309l32890l69877m13183
57065C318567m58782n02797n48508o00522E50331a68348p89249q73933r68198
57056b799728j066528j172626j292115j421530j554999j695770j850323k017459
57048a4871078k195044k391539k618821k879868l176083l519335l922180m382708
57040c9956656m893336n456445o075765o742857p452709q224533r086323j0047041
57032i7935665j1103011j2253537j3476191j4694977j5803920j6715125j7374372
57025a99356798j7801423j8202542j8967486k0318092k1815287k2332828k0751027
57018c39545483j6792601j1188152n076618O91688N767230J0091268J3657979
$$ plain form
57011 -342394689 -325953147 -307529716 -287893231 -267695323 -247401275 -227297488 -207568638
57004 -207568638 -188370112 -169853342 -152170367 -135480604 -119941139 -105673300 -92737933
56997 -92737933 -81139960 -70841735 -61767489 -53812073 -46861902 -40808830 -35546316 -30966169
56989 -30966169 -26968404 -23469428 -20397283 -17687003 -15285752 -13155620 -11265632 -9585298
56981 -9585298 -8088172 -6754206 -5563561 -4493189 -3523170 -2641096 -1836825 -1098435 -416949
56971 210317 784869 1310630 1789541 2219405 2600745 2941417 3250469 3531489 3785470 4015422
56961 4015422 4223574 4407896 4566065 4700107 4813365 4905994 4977533 5031414 5073328 5107651
56951 5107651 5138909 5173921 5218156 5271466 5330837 5395778 5468032 5548207 5637163 5740011 5863772
$$ packed form
57011c42394689J6441542J8423431J9636485K0197908K0294048K0103787J9728850
57004b07568638J9198526J8516770J7682975J6689763J5539465J4267839J2935367
56997i2737933J1597973J0298225R074246P955416O950171O053072N262514M580147
56989c0966169L997765L498976L072145K710280K401251K130132J889988J680334
56981i585298J497126J333966J190645J070372R70019Q82074Q04271P38390d16949
56971B10317N74552N25761M78911M29864L81340L40672L09052K81020K53981K29952
56961D015422K08152J84322J58169J34042J13258R2629P1539N3881M1914L4323
56951E107651L1258L5012M4235N3310N9371O4941P2254Q0175Q8956J02848J23761
$$ plain form
56940 5863772 6007682 6155032 6274849 6334311 6315081 6221811 6075373 5897796 5703832 5503209
56930 5503209 5303363 5106445 4907324 4698188 4473952 4232688 3975123 3706949 3438802
56921 3438802 3180444 2936122 2707188 2496217 2305632 2134566 1980394 1841971 1718761
56912 1718761 1608264 1506939 1412530 1323403 1237265 1152960 1072411 998726 933653 878484 835334
56901 835334 804903 784399 770147 761038 757137 756119 753489 745512 730040 705645 672136 631126
56889 631126 584436 532897 478072 423506 372366 325262 282008 243564 210265 180242 152390
56878 152390 129199 113737 105127 99979 97272 98845 105847 117566 133041 150665 166272 174410 172033
56865 172033 159273 137204 107179 71992 35136 -1386 -36979 -70656 -101320 -129351 -155649 -179408
$$ packed form
56940E863772J43910J47350J19817N9462j9230r3270j46438j77577j93964k00623
56930E503209j99846j96918j99121k09136k24236k41264k57565k68174k68147
56921C438802k58358k44322k28934k10971j90585j71066j54172j38423j23210
56912A718761j10497j01325r4409q9127q6138q4305q0549p3685o5073n5169m3150
56901H35334l0431k0504j4252r109l901j018k630p977j5472k4395l3509m1010
56889F31126m6690n1539n4825n4566n1140m7104m3254l8444l3299l0023k7852
56878A52390k3191j5462q610n148k707J573P002J1719J5475J7624J5607Q138k377
56865A72033j2760k2069l0025l5187C5136a386l5593l3677l0664k8031k6298k3759
$$ plain form
56853 -179408 -198968 -214569 -228054 -240149 -250257 -258740 -266943 -274839 -280980 -285104 -288616 -292101 -294391
56840 -294391 -294611 -293306 -290970 -287016 -280706 -271815 -260221 -246228 -231360 -217283 -203867 -189721 -174528
56827 -174528 -159196 -143869 -127780 -111338 -96562 -85126 -77657 -75086 -78511 -86955 -97013 -105690
56815 -105690 -112297 -117008 -119139 -117804 -112998 -105052 -93840 -79149 -60992 -39090 -12981 16936 49584
56802 49584 85018 125010 170784 220553 269681 312855 345881 366267 373068 366706 349204 324454
56790 324454 297260 271184 247540 226693 209508 196896 189176 187039 192178 205620 226424 253562
56778 253562 288011 331163 382197 439244 502032 570243 639353 701101 748677 779191 791183
56767 791183 783426 757754 720214 677067 631101 583241 535923 492893 456806 428657 408621 396045
$$ packed form
56853a79408j9560j5601j3485j2095j0108q483q203p896o141m124l512l485k290
56840b94391k20J305K336L954O310Q891J1594J3993J4868J4077J3416J4146J5193
56827a74528J5332J5327J6089J6442J4776J1436P469K571l425q444j0058q677
56815a05690o607m711k131J335M806P946J1212J4691J8157K1902a2981A6936L2648
56802D9584L5434L9992M5774M9769M9128M3174L3026K0386O801o362j7502k4750
56790C24454k7194k6076k3644k0847j7185j2612p720k137N139J3442K0804K7138
56778B53562L4449M3152N1034N7047O2788O8211O9110O1748M7576L0514J1992
56767G91183p757k5672l7540m3147m5966m7860m7318m3030l6087k8149k0036j2576
$$ plain form
56755 396045 389507 388351 393629 406514 426483 452010 482159 516465 553853 592502 630016 662869
56743 662869 686588 697596 694616 678039 649152 610812 567635 524008 482209 442990 407126 375533
56731 375533 348855 327980 314090 307099 304936 305607 309337 317508 330182 346009 363981 383628 403558
56718 403558 421087 433439 438454 434500 421085 399758 373503 344950 315697 286973 259772 234160
56706 234160 209459 185569 163528 144522 128884 116203 105806 96852 88434 80094 72103 65093
56694 65093 59460 55103 51598 48616 46277 45033 45114 46215 47765 49233 50073 49747 48141 45784 43387
56679 43387 41298 39583 38384 37914 38069 38287 37834 36346 34184 32110 30408 28504 25756 22407 19331
56664 19331 17032 15473 14667 14673 14963 14604 13346 11929 11047 10495 9611 8107 6285 4684 3555 2296 -310
$$ packed form
56755C96045o538j156N278J2885J9969K5527L0149L4306L7388L8649L7514L2853
56743F62869K3719J1008k980j6577k8887l8340m3177m3627m1799l9219l5864l1593
56731C75533k6678k0875j3890o991k163O71L730Q171J2674J5827J7972J9647J9930
56718D03558J7529J2352N015l954j3415k1327k6255k8553k9253k8724k7201k5612
56706B34160k4701k3890k2041j9006j5638j2681j0397q954q418q340p991p010
56694F5093n633m357l505k982k339j244Q1J101J550J468Q40l26j606k357k397
56679D3387k089j715j199m70J55K18m53j488k162k074j702j904k748l349l076
56664A9331k299j559q06OK90l59j258j417q82n52q84j504j822j601j129j259c10
$$ plain form
56646 -4723 -9739 -13739 -16634 -19618 -23138 -26428 -29179 -32279 -36284 -40369 -43508 -45814 -47996 -50243 -52398
56631 -52398 -54591 -57100 -60034 -63473 -67110 -69506 -68733 -64435 -58260 -51683 -44532 -36501 -28738 -22503 -17086
56616 -17086 -10693 -3005 4617 11279 17455 23624 29292 33888 37752 41691 45993 50245 53851 56586
56602 56586 58806 61163 63971 66887 69215 70270 69508 66895 63460 60936 60382 61458 63247 65247 67176
56587 67176 68459 68583 67657 66139 64258 62076 59799 57675 55869 54612 54054 53720 52781 51190 50020 50296
56571 50296 51976 54276 56344 57412 57110 56100 55661 56243 57121 57733 58353 59035 59152 58816 59568 62589 67013
56554 67013 71052 74009 76184 77613 78121 78130 78324 78859 79702 81123 83092 85018 87037 90493 95816 100830
56538 100830 102890 102200 101389 102120 103814 105572 107591 110368 113882 118029 122794 127669 131723 134547 136587
$$ packed form
56646d723n016m000k895k984l520l290k751l100m005m085l139k306k182k247k155
56631e2398k193k509k934l439l637k396P73M298O175O577P151Q031P763O235N417
56616a7086O393c005D617O662O176O169N668M596L864L939M302M252L606K735
56602E6586K220K357K808K916K328J055p62k613l435k524n54J076J789K000J929
56587F7176J283J24r26j518j881k182k277k124j806j257n58l34r39j591j170K76
56571E0296J680K300K068J068l02j010m39N82Q78O12O20O82J17l36P52L021M424
56554F7013M039K957K175J429N08RJ94N35Q43J421J969J926K019L456N323N014
56538A00830K060o90q11P31J694J758K019K777L514M147M765M875M054K824K040
$$ plain form
56523 136587 138675 141694 146145 151193 154848 156378 157990 162622 170392 178812 186298 193621 201816 210571
56509 210571 219272 228066 237223 246815 257608 270795 286032 301171 314987 329003 345373 363891
56497 363891 382362 399259 414612 428670 441242 452567 463557 474433 483875 490366 494110 496729
56485 496729 498985 499631 497104 491701 485048 477678 468394 456248 441937 426731 411185 395749 381663
56472 381663 370061 360777 352744 344805 335455 323126 308254 294165 284089 277694 272004 265254 258115
56459 258115 251494 245174 238809 232518 226128 219310 212896 208714 207582 208474 209896 211036 211523 211314 211172
56444 211172 212072 213842 215355 216160 216873 217952 219307 221127 223814 227072 230405 234393 239798 245350 248363
56429 248363 248100 246825 246850 248193 249809 251404 252988 254158 255033 256775 260149 264542 269196 274222 279554
$$ packed form
56523A36587K088L019M451N048L655J530J612M632P770Q420P486P323Q195Q755
56509B10571Q701Q794R157R592J0793J3187J5237J5139J3816J4016J6370J8518
56497C63891J8471J6897J5353J4058J2572J1325J0990J0876R442O491L744K619
56485D96729K256O46k527n403o653p370r284j2146j4311j5206j5546j5436j4086
56472C81663j1602r284q033p939r350j2329j4872j4089j0076o395n690o750p139
56459B58115o621o320o365o291o390o818o414m182j132Q92J422J140M87k09j42
56444B11172R00J770J513Q05P13J079J355J820K687L258L333L988N405N552L013
56429B48363k63j275K5J343J616J595J584J170Q75J742L374M393M654N026N332
$$ plain form
56414 279554 284299 288281 293127 300411 309491 318393 326275 333908 342240 351518 361511 371722 381555 390889
56400 390889 400269 410167 420398 430453 439832 447867 453957 458278 461663 464626 467084 468819 469352 467635
56386 467635 463314 458235 455108 454476 454552 454166 453927 453928 452481 448245 441867 434341 425408 414885 404146 394731
56370 394731 386626 379220 372788 367623 362725 356833 350028 343186 336641 330396 324762 319769 314885 310183
56356 310183 306621 304254 301591 297917 294755 293465 292738 290285 286014 281743 278609 276472 275255 275201 276230
56341 276230 278323 281790 285937 288521 288162 286388 285615 286012 286226 286327 287789 290879 294133 296374 297604
56326 297604 298092 298329 299622 302994 307469 311061 313379 315748 318910 322295 325574 329262 333464 337488 341024
56311 341024 344606 348679 353171 357980 362926 367489 371577 376154 381855 387473 391332 393830 396980 401477
$$ packed form
56414B79554M745L982M846P284R080Q902P882P633Q332R278R993J0211R833R334
56400C90889R380R898J0231J0055R379Q035O090M321L385K963K458J735N33j717
56386D67635m321n079l127o32P6l86k39Jj447m236o378p526q933j0523j0739r415
56370C94731q105p406o432n165m898n892o805o842o545o245n634m993m884m702
56356C10183l562k367k663l674l162j290p27k453m271m271l134k137j217n4J029
56341B76230K093L467M147K584l59j774p73L97K14J01J462L090L254K241J230
56326B97604M88K37J293L372M475L592K318K369L162L385L279L688M202M024L536
56311C41024L582M073M492M809M946M563M088M577N701N618L859K498L150M497
$$ plain form
56297 401477 405814 408411 409122 408578 407601 407545 409689 413698 417728 420484 422326 424296 427142 431426 437366
56282 437366 444131 450301 455500 460898 467753 476055 484779 493007 500672 508546 517465 527404 537628 547888
56268 547888 558758 570406 582029 593150 604528 616995 630405 644592 660248 677706 695934
56257 695934 713925 731953 750151 767052 781078 792538 802635 811674 819858 828434 837997 846815
56245 846815 853074 857683 862439 866669 868736 870163 874848 884057 895210 906095 917456 930753 945951
56232 945951 962450 980149 998710 1017670 1037954 1061435 1088393 1117229 1147275 1180071 1217184
56221 1217184 1258461 1303145 1351170 1402596 1457109 1514747 1576172 1642099 1713477 1791819 1877812
56210 1877812 1970031 2067058 2170653 2284598 2410417 2546616 2692364 2849394 3019607 3203160
$$ packed form
56297D01477M337K597P11n44r77n6K144M009M030K756J842J970K846M284N940
56282D37366O765O170N199N398O855Q302Q724Q228P665P874Q919R939J0224J0260
56268E47888J0870J1648J1623J1121J1378J2467J3410J4187J5656J7458J8228
56257F95934J7991J8028J8198J6901J4026J1460J0097R039Q184Q576R563Q818
56245H46815O259M609M756M230K067J427M685R209J1153J0885J1361J3297J5198
56232I45951J6499J7699J8561J8960K0284K3481K6958K8836L0046L2796L7113
56221A217184M1277M4684M8025N1426N4513N7638O1425O5927P1378P8342Q5993
56210A877812R2219R7027J03595J13945J25819J36199J45748J57030J70213J83553
$$ plain form
56200 3203160 3399883 3610617 3836070 4075701 4328268 4591958 4863715 5140118 5419006
56191 5419006 5698299 5973070 6235905 6480404 6702198 6896568 7058005 7183091 7271404 7322921
56181 7322921 7337108 7315500 7262482 7182148 7076634 6948856 6804435 6649090 6485819 6316010
56171 6316010 6141485 5963990 5784370 5603658 5423383 5243589 5062286 4878250 4692909
56162 4692909 4508219 4324334 4140689 3957998 3777840 3601509 3430287 3265518 3107526
56153 3107526 2955843 2811252 2675973 2551007 2435062 2326983 2227343 2136495 2052950 1975162
56143 1975162 1903422 1838568 1780022 1726266 1676323 1630076 1588245 1552322 1522939 1498010 1474385
56132 1474385 1451807 1433084 1419736 1409784 1400755 1392693 1387156 1385309 1387993 1395664 1407193 1420541 1435422
$$ packed form
56200C203160J96723K10734K25453K39631K52567K63690K71757K76403K78888
56191E419006K79293K74771K62835K44499K21794J94370J61437J25086Q8313N1517
56181G322921J4187k1608n3018q0334j05514j27778j44421j55345j63271j69809
56171F316010j74525j77495j79620j80712j80275j79794j81303j84036j85341
56162D692909j84690j83885j83645j82691j80158j76331j71222j64769j57992
56153C107526j51683j44591j35279j24966j15945j08079r9640r0848q3545p7788
56143A975162p1740o4854n8546n3756m9943m6247m1831l5923k9383k4929k3625
56132A474385k2578j8723j3348r952r029q062n537j847K684P671J1529J3348J4881
$$ plain form
56119 1435422 1453445 1475236 1499784 1527170 1559208 1596487 1637408 1680955 1727604 1776612 1825535
56108 1825535 1873682 1922896 1973478 2022507 2067689 2109547 2147952 2179857 2202785 2217559 2225349
56097 2225349 2225171 2216832 2203479 2188450 2172074 2154045 2136343 2121298 2109287 2100909 2098776 2104535
56085 2104535 2116825 2134975 2161973 2200671 2249547 2305488 2368657 2441476 2525006 2619554 2726814
56074 2726814 2847746 2979457 3116721 3254889 3389020 3512724 3621580 3716631 3801939 3879963
56064 3879963 3951044 4014778 4068962 4109233 4132548 4139338 4130546 4105517 4065456 4015570 3960171 3898062
56052 3898062 3825878 3743147 3650680 3547112 3431499 3307229 3179514 3051090 2924049 2803357
56042 2803357 2694111 2596956 2509958 2433005 2366590 2308461 2255663 2208224 2167113 2130574 2096220
$$ packed form
56119A435422J8023K1791K4548K7386L2038L7279M0921M3547M6649M9008M8923
56108A825535M8147M9214N0582M9029M5182M1858L8405L1905K2928J4774P790
56097B225349j78q339j3353j5029j6376j8029j7702j5045j2011q378k133N759
56085B104535J2290J8150K6998L8698M8876N5941O3169P2819Q3530R4548J07260
56074B726814J20932J31711J37264J38168J34131J23704J08856R5051Q5308P8024
56064C879963P1081O3734N4184M0271K3315O790q792k5029m0061m9886n5399o2109
56052C898062p2184q2731r2467j03568j15613j24270j27715j28424j27041j20692
56042B803357j09246r7155q6998p6953o6415n8129n2798m7439m1111l6539l4354
$$ plain form
56031 2096220 2064607 2036862 2011063 1984965 1959949 1938265 1918899 1900539 1885811 1877718 1874211 1871106
56019 1871106 1868057 1866841 1866433 1865260 1866006 1872452 1883425 1895349 1908784 1926639 1947755 1968305 1988058
56006 1988058 2009388 2031572 2052077 2072303 2095986 2122966 2150333 2178536 2210341 2244809 2278406
55995 2278406 2311201 2346016 2382418 2417654 2452642 2490880 2532129 2573207 2614296 2658505 2706033
55984 2706033 2754698 2805197 2859814 2917143 2974253 3032755 3096389 3164224 3232974 3304381 3383046
55973 3383046 3468388 3556156 3646501 3743021 3845239 3950023 4059132 4177137 4302972 4431894
55963 4431894 4564711 4706457 4857162 5013048 5175865 5351612 5540656 5738606 5946147
55954 5946147 6168100 6403482 6647141 6900991 7172768 7463455 7767003 8082986 8418282
$$ packed form
56031B096220l1613k7745k5799k6098k5016k1684j9366j8360j4728q093l507l105
56019A871106l049j216m08j173P46O446J0973J1924J3435J7855K1116K0550J9753
56006A988058K1330K2184K0505K0226K3683K6980K7367K8203L1805L4468L3597
55995B278406L2795L4815L6402L5236L4988L8238M1249M1078M1089M4209M7528
55984B706033M8665N0499N4617N7329N7110N8502O3634O7835O8750P1407P8665
55973C383046Q5342Q7768R0345R6520J02218J04784J09109J18005J25835J28922
55963D431894J32817J41746J50705J55886J62817J75747J89044J97950K07541
55954E946147K21953K35382K43659K53850K71777K90687L03548L15983L35296
$$ plain form
55945 8418282 8775265 9149545 9540555 9953324 10388758 10843430 11319916 11825843 12361937
55936 12361937 12922939 13510781 14134022 14793355 15481185 16196802 16948334 17738556 18563426
55927 18563426 19426611 20340915 21313688 22346099 23448197 24637961 25922895 27299060
55919 27299060 28769950 30348242 32036797 33827502 35721918 37733199 39865344 42113559
55911 42113559 44490404 47030568 49767776 52732532 55976340 59569672 63569359 68015857
55903 68015857 72968133 78511471 84729556 91710086 99589382 108554922 118799478 130520739
55895 130520739 143972782 159457976 177252815 197605141 220812723 247213214 277074077
55888 277074077 310582088 347836704 388331098 429850905 467831677 496383200 510709548
$$ packed form
55945H418282L56983L74280L91010M12769M35434M54672M76486N05927N36094
55936A2361937N61002N87842O23241O59333O87830P15617P51532P90222Q24870
55927A8563426Q63185R14304R72773J032411J102098J189764J284934J376165
55919B7299060J470890J578292J688555J790705J894416K011281K132145K248215
55911D2113559K376845K540164K737208K964756L243808L593332L999687M446498
55903F8015857M952276N543338O218085O980530P879296Q965540J0244556J1721261
55895A30520739J3452043J5485194J7794839K0352326K3207582K6400491K9860863
55888B77074077L3508011L7254616M0494394M1519807L7980772K8551523J4326348
$$ plain form
55881 510709548 509134259 493277101 466680815 433255403 396404982 358748193 322090500
55874 322090500 287543607 255744234 227025456 201477299 178993118 159359531 142321632
55867 142321632 127587902 114840985 103785030 94170569 85773226 78384489 71838257
55860 71838257 66019977 60836323 56195773 52023732 48269459 44885321 41818098 39028003
55852 39028003 36495288 34198489 32103453 30180810 28416036 26794306 25292436 23894064
55844 23894064 22597310 21399212 20286175 19246555 18278922 17380661 16540732 15750173 15008150
55835 15008150 14311959 13652641 13025959 12436543 11885883 11366912 10875044 10413476 9982603
55826 9982603 9574989 9186053 8819340 8476101 8149761 7835987 7538546 7259846 6994911
$$ packed form
55881E10709548j575289j5857158k6596286l3425412l6850421l7656789l6657693
55874C22090500l4546893l1799373k8718778k5548157k2484181j9633587j7037899
55867A42321632j4733730j2746917j1055955r614461q397343p388737o546232
55860G1838257n818280n183654m640550m172041l754273l384138l067223k790095
55852C9028003k532715k296799k095036j922643j764774j621730j501870j398372
55844B3894064j296754j198098j113037j039620r67633q98261q39929p90559p42023
55835A5008150o96191o59318o26682n89416n50660n18971m91868m61568m30873
55826I982603m07614l88936l66713l43239l26340l13774k97441k78700k64935
$$ plain form
55817 6994911 6740005 6498386 6272266 6057462 5851070 5656314 5474804 5301741 5133467
55808 5133467 4972129 4818422 4667689 4518171 4375699 4245034 4123225 4006131 3894876
55799 3894876 3791394 3694105 3602175 3517349 3437240 3353342 3260362 3161661 3061712 2959846 2855768
55788 2855768 2754383 2659861 2570537 2484504 2404696 2333741 2269068 2207897 2152091 2103498 2059221
55777 2059221 2015967 1974536 1935872 1897251 1856599 1816186 1778032 1739864 1699491 1658866 1620043
55766 1620043 1581354 1541330 1502203 1465881 1430556 1394784 1360620 1329279 1298233 1266225 1236605
55755 1236605 1211771 1188813 1164767 1141845 1123091 1107008 1090974 1076257 1065118 1056363 1048144 1041953
55743 1041953 1039597 1039260 1038585 1038562 1040252 1040697 1036254 1027406 1016522 1003606 988100 972026 957317 942404
$$ packed form
55817F994911k54906k41619k26120k14804k06392j94756j81510j73063j68274
55808E133467j61338j53707j50733j49518j42472j30665j21809j17094j11255
55799C894876j03482r7289r1930q4826q0109q3898r2980r8701r9949j01866j04078
55788B855768j01385r4522q9324q6033p9808p0955o4673o1171n5806m8593m4277
55777B059221m3254m1431l8664l8621m0652m0413l8154l8168m0373m0625l8823
55766A620043l8689m0024l9127l6322l5325l5772l4164l1341l1046l2008k9620
55755A236605k4834k2958k4046k2922j8754j6083j6034j4717j1139q755q219o191
55743A041953k356l37o75k3J690M45m443q848j0884j2916j5506j6074j4709j4913
$$ plain form
55729 942404 925105 906488 888520 870745 852926 837983 828156 820652 811271 800261 790758 783393
55717 783393 776315 768747 760712 750767 737489 721990 706109 689779 672824 657202 644440 632882
55705 632882 620537 608605 598999 590431 580222 568283 556194 544129 531679 519836 509171 497951
55693 497951 485026 472500 462345 452505 439860 425199 411469 398713 384762 370092 358168 351045
55681 351045 347500 345251 342662 338737 333630 328833 325425 323108 321946 323077 326213 328750 329287 329517 330548
55666 330548 330051 325844 319693 314471 309865 304244 298681 295448 294009 291869 288335 284487 280756 277350
55652 277350 275641 276319 277617 278095 279542 284250 291108 297519 303515 310624 318073 323627 327252 330875 335389
55637 335389 340632 347135 355080 362755 368783 374468 381200 387351 390902 393326 397298 402020 404521 404317
$$ packed form
55729I42404j7299j8617j7968j7775j7819j4943r827p504r381j1010r503p365
55717G83393p078p568q035r945j3278j5499j5881j6330j6955j5622j2762j1558
55705F32882j2345j1932r606q568j0209j1939j2089j2065j2450j1843j0665j1220
55693D97951j2925j2526j0155r840j2645j4661j3730j2756j3951j4670j1924p123
55681C51045l545k249k589l925n107m797l408k317j162J131L136K537N37K30J031
55666C30548m97m207o151n222m606n621n563l233j439k140l534l848l731l406
55652B77350j709O78J298M78J447M708O858O411N996P109P449N554L625L623M514
55637C35389N243O503P945P675O028N685O732O151L551K424L972M722K501k04
$$ plain form
55623 404317 403078 400890 396773 392043 389256 388394 387623 387065 388020 389227 387907 384225 380853 378333 374759
55608 374759 369954 366065 363851 362111 361068 362483 365898 368324 368378 367513 366682 365152 363237 362810 364192
55593 364192 365488 365741 365734 365056 361711 355677 349703 345270 340652 334233 326950 319829 311822 301915 291278
55578 291278 281454 272077 261954 251075 240201 229647 219549 210316 202045 194445 187723 182320 177539
55565 177539 171900 165188 158775 153630 149372 145414 141562 137341 132389 127704 124934 124189 124092 123987 124326
55550 124326 124799 124042 121741 119277 117704 116461 114510 111539 107783 103895 101073 100122 100425 100871 101328 101817
55534 101817 101054 97785 93119 89522 87773 86960 86970 88564 91136 92998 93992 95370 96870 96636 94623 93391
55518 93391 94443 96031 95791 93715 91273 89182 87202 84995 82396 79799 78585 79866 82657 84804 85875
$$ packed form
55623D04317j239k188m117m730k787q62p71n58R55J207j320l682l372k520l574
55608C74759m805l889k214j740j043J415L415K426N4q65q31j530j915m27J382
55593C64192J296K53po78l345o034n974m433m618o419p283p121q007r907j0637
55578B91278r824r377j0123j0879j0874j0554j0098r233q271p600o722n403m781
55565A77539n639o712o413n145m258l958l852m221m952m685k770p45r7j05L39
55550A24326M73p57k301k464j573j243j951k971l756l888k822r51L03M46M57M89
55534A01817p63l269m666l597j749q13J0J594K572J862R94J378J500k34k013j232
55518I3391J052J588k40k076k442k091j980k207k599k597j214J281K791K147J071
$$ plain form
55503 85875 87414 90088 92500 93398 93278 93014 92453 91284 90097 89871 91154 93800 96580 97419 95419 92321
55487 92321 90378 89392 87840 86211 86377 87767 87360 84231 81193 80846 82617 85086 88600 93738 99279
55472 99279 103754 107536 111536 115097 117013 117743 118945 121362 124414 127377 129817 131259 131314 129994 127543
55457 127543 124391 121305 118802 116326 113047 109510 107168 106009 104055 99846 94260 89237 85620 82760
55443 82760 79351 74365 68099 62525 59575 58866 58095 55739 52289 48817 45738 43151 41084 39044 36451
55428 36451 33657 31545 30260 29474 29500 30549 31253 29888 27019 24973 24579 24400 23378 22080 20869 19031
55412 19031 16445 14254 13116 12538 12492 13810 16286 18284 19036 19543 20397 20552 19257 17462 16255 15416
55396 15416 14513 13917 13725 13018 11141 8592 6096 4049 3232 4371 6460 7333 6527 5799 6127 6240 4989
$$ packed form
55503H5875J539K674K412Q98j20k64n61j169j187k26J283K646K780Q39k000l098
55487I2321j943r86j552j629J66J390m07l129l038l47J771K469L514N138N541
55472I9279M475L782M000L561J916P30J202K417L052K963K440J442N5j320k451
55457A27543l152l086k503k476l279l537k342j159j954m209n586n023l617k860
55443H2760l409m986o266n574k950p09p71k356l450l472l079k587k067k040k593
55428C6451k794k112j285p86K6J049P04j365k869k046l94j79j022j298j211j838
55412A9031k586k191j138n78m6J318K476J998P52N07Q54J55j295j795j207q39
55396A5416r03n96j92p07j877k549k496k047q17J139K089Q73q06p28L28J13j251
$$ plain form
55379 4989 3156 1743 325 -1618 -3380 -4270 -4625 -4452 -2764 571 3931 6137 8010 10525 13031 14607
55363 14607 15629 16590 16832 15892 14756 14390 14269 13680 13253 13881 15219 16412 17080 16658 14264 10449 7593
55346 7593 7271 8548 9991 11725 14135 16252 17123 17430 18068 18396 17600 16545 16580 17451 17984 17835 17212 15952
55328 15952 14255 13166 12936 12168 10042 8043 7845 8758 8984 8167 6922 5100 2560 582 469 1494
55312 1494 2079 2261 3112 4484 5195 4847 3736 1604 -1748 -5244 -7570 -8913 -10246 -11732 -13327 -15797
55296 -15797 -19093 -20698 -17987 -11852 -5914 -2522 -1445 -1961 -3735 -5719 -6502 -6273 -6607 -7949 -8908 -8478
55280 -8478 -7483 -7344 -8515 -10485 -12358 -13249 -12959 -12310 -12132 -12103 -11237 -9075 -5717 -1350 3309 6858 8635
55263 8635 9633 10838 11445 10096 7123 4077 1636 -477 -1999 -2212 -1331 -422 -89 -337 -1155 -2004 -1451 1109
$$ packed form
55379D989j833j413C25a618j762q90l55J73J688E71L360K206J873K515K506J576
55363A4607J022R61K42r40j136l66j21n89m27O28J338J193O68m22k394l815k856
55346G593l22J277J443J734K410K117Q71L07O38L28p96j055L5Q71N33j49o23j260
55328A5952j697j089k30p68k126j999j98R13K26q17j245j822k540E82j13J025
55312A494N85J82Q51J372P11l48j111A604a748l496k326j343j333j486j595k470
55296a5797l296j605K711O135e914b522J077n16j774j984p83K29l34j342r59M30
55280h478R95J39j171j970j873q91K90O49J78K9Q66K162L358a350C309L549J777
55263H635R98J205O07j349k973l046A636d77j522k13Q81d22h9k48q18q49N53A109
$$ plain form
55244 3865 4262 1987 -1103 -3503 -4989 -5617 -5550 -5706 -6943 -8636 -9339 -8591 -6927 -4730 -2495 -1473
55228 -1473 -2292 -3428 -2884 -944 530 1062 1651 2261 1572 -548 -2533 -3551 -4547 -6244 -7817 -8206 -7382 -5736
55210 -5736 -3441 -829 1564 3569 4968 4767 2264 -1120 -2606 -984 2284 5010 6217 6269 6244 7090 8332
55193 8332 7966 4857 598 -2562 -4785 -7546 -10156 -10189 -7435 -4703 -3961 -4174 -3891 -3531 -3682 -3104 -217
55175 4541 9293 12741 14573 14803 13817 12429 11059 9310 6903 4380 2550 1860 2457 4088 5833 6874
55159 6874 7584 8887 10619 11730 11990 12070 11923 10777 8975 8129 8963 10584 12307 14483 16853 17852 16632
55142 16632 14424 12937 12580 13013 14102 15454 16280 16671 17781 19805 21027 20024 17727 16142 15867 15938
55126 15938 15374 13945 12121 11023 11638 13392 14483 14397 14935 17682 21479 23694 23310 21540 19887 18792
$$ packed form
55244C865L97A987a103k400j486o28O7j56j237j693p03P48J664K197K235J022
55228a473q19j136N44i44E30N32N89O10o89e48j985j018r96j697j573l89Q24J646
55210e736K295h29A564K005J399k01B264a120j486i84B284K726J207N2k5Q46J242
55193H332l66l109E98b562k223k761k610l3K754K732P42k13K83L60j51N78b17
55175D541M752L448J832K30r86j388j370j749k407k523j830o90N97J631J745J041
55159F874P10J303J732J111K60Q0j47j146j802q46Q34J621J723K176K370R99j220
55142A6632k208j487l57M33J089J352Q26L91J110K024J222j003k297j585k75P1
55126A5938n64j429j824j098O15J754J091q6N38K747L797K215l84j770j653j095
$$ plain form
55110 18792 17912 16727 14926 12718 10568 8478 6185 4332 4329 6384 8645 9162 7940 6297 5090 4472
55094 4472 4462 4579 3653 1234 -1268 -2017 -991 152 156 -927 -2562 -4316 -5661 -6035 -5296 -3663 -1399 987
55075 2659 3315 3863 5478 8139 10771 12547 13391 13444 12938 12638 13601 16132 19386 22199 24142 25734 27857
55058 27857 30895 34241 36707 37551 36963 35593 34060 33021 33113 34252 35411 35657 35299 35542 37093 39515
55042 39515 41921 43923 45821 48137 51085 54376 57387 59396 59815 58500 56041 53427 51127 48739 45924
55027 45924 43393 42443 43592 46078 48555 49923 49832 48988 48746 49703 50878 50960 50135 49876 51008 52907 54574
55010 54574 55574 55837 55554 55577 56909 59271 60935 60588 58890 57626 57645 58104 57622 55936 54219 53670 53860
54993 53860 53127 50905 48827 48816 50751 52997 54572 55541 55772 54886 53453 52833 53547 54926 56423 58091
$$ packed form
55110A8792q80j185j801k208k150k090k293j853lK055K261N17j222j643j207o18
55094D472j0J17r26A234a268p49i91A52Mi27j635j754j345l74P39J633a399I87
55075B659O56N48J615K661K632J776Q44N3n06l00R63K531L254K813J943J592K123
55058B7857L038L346K466Q44n88j370j533j039R2J139J159K46l58K43J551K422
55042C9515K406K002J898K316K948L291L011K009M19j315k459k614k300k388k815
55027D5924k531r50J149K486K477J368r1q44k42R57J175Q2q25k59J132J899J667
55010E4574J000K63k83K3J332K362J664l47j698j264J9M59m82j686j717n49J90
54993E3860p33k222k078j1J935K246J575R69K31q86j433o20P14J379J497J668
$$ plain form
54977 58091 59745 60971 62248 64691 68249 71230 72205 71518 70610 70615 71713 73022 73193 72076 71454 72839
54961 72839 74920 75030 72982 71323 71520 72237 72219 72570 74799 78449 82117 85327 87983 89430 89550 89496 89842
54944 89842 89325 87112 85025 85470 87921 89440 88354 85654 83016 81162 80165 79864 79703 79174 78462 77906
54928 77906 77251 76478 76905 79941 84761 88661 90021 89707 89240 88753 87569 85858 84652 84335 84083 83223 82725
54911 82725 84575 89498 95922 101713 106330 110509 114388 117318 119488 122190 126020 130122 133936 138525
54897 138525 145305 154343 164861 176689 190256 205586 222093 239106 256221 273503 291439 309972
54885 309972 327491 341820 352432 360326 365292 364918 357421 344105 327877 310513 292732 275614
54873 275614 259982 244955 229009 212530 197911 186983 179372 173359 167416 160883 154039 147838 143185
$$ packed form
54977E8091J654J226J277K443L558K981R75o87r08NJ098J309J71j117o22J385
54961G2839K081J10k048j659J97P17j8L51K229L650L668L210K656J447J20n4L46
54944H9842n17k213k087M45K451J519j086k700k638j854r97l01j61n29p12n56
54928G7906o55p73M27L036M820L900J360l14m67m87j184j711j206l17k52q60m98
54911H2725J850M923O424N791M617M179L879K930K170K702L830M102L814M589
54897A38525O780R038J0518J1828J3567J5330J6507J7013J7115J7282J7936J8533
54885C09972J7519J4329J0612P894M966l74p497j3316j6228j7364j7781j7118
54873B75614j5632j5027j5946j6479j4619j0928p611o013n943o533o844o201m653
$$ plain form
54860 143185 140425 139570 140467 142519 144962 147899 152324 158611 165785 172871 180125 188292 197731 209021
54846 209021 223219 240163 257440 272509 285379 297784 310140 320701 327610 330451 329525 324623
54834 324623 315024 300472 282090 262289 243393 226236 210557 196543 184837 174938 165087 154441
54822 154441 144184 135833 129636 125268 122605 120898 118694 115667 113118 111610 109777 106785 104121 103171
54808 103171 102775 101327 99690 99530 100031 99087 96930 95649 95429 94077 90395 85598 81159 77501 75041
54793 75041 74379 75053 75941 77024 78813 80052 78339 73495 68229 64818 63117 62338 62632 63933 65093 65383
54777 65383 65410 65670 65532 64515 63174 61902 60163 57823 55913 55154 54895 54451 54374 55415 57238 59282 62009
54760 62009 66122 71101 75613 79170 82593 86857 91980 97007 101058 104478 108739 114793 121949 129036
$$ packed form
54860A43185k760q55Q97K052K443K937M425O287P174P086P254Q167R439J1290
54846B09021J4198J6944J7277J5069J2870J2405J2356J0561O909K841r26m902
54834C24623r599j4552j8382j9801j8896j7157j5679j4014j1706r899r851j0646
54822A54441j0257q351o197m368k663j707k204l027k549j508j833k992k664r50
54808A03171l96j448j637j60N01r44k157j281k20j352l682m797m439l658k460
54793G5041o62O74Q88J083J789J239j713m844n266l411j701p79K94J301J160K90
54777F5383K7K60j38j017j341j272j739k340j910p59k59m44p7J041J823K044K727
54760F2009M113M979M512L557L423M264N123N027M051L420M261O054P156P087
$$ plain form
54746 129036 136032 143387 150378 155809 160412 166810 176629 189007 202381 216356 231202 246811 262951
54733 262951 279610 296415 312598 328013 343181 357747 369875 377803 381233 380713 376627 369427 360098
54720 360098 349710 339021 328706 319216 310138 300631 290838 281986 274905 269526 266106 265473 267302 269378
54706 269378 269732 268865 268956 271440 276042 281702 287639 293755 300534 308591 318389 330640 346505 366421
54692 366421 388973 412149 435840 461850 491125 522125 552242 579557 602830 621091 634154
54681 634154 642601 646683 646057 640967 632495 621016 605461 584789 559372 530508 499753 469199 440969
54668 440969 415406 390915 366659 344319 326026 311416 298037 284102 269679 255635 242677
54657 242677 231371 222113 214843 209028 203850 198423 192483 187067 183703 182650 182627 182472 182040 181063 178496
$$ packed form
54746A29036O996P355O991N431M603O398R819J2378J3374J3975J4846J5609J6140
54733B62951J6659J6805J6183J5415J5168J4566J2128P928L430n20m086p200r329
54720C60098j0388j0689j0315r490r078r507r793q852p081n379l420o33J829K076
54706B69378L54q67R1K484M602N660N937O116O779Q057R798J2251J5865J9916
54692C66421K2552K3176K3691K6010K9275L1000L0117K7315K3273J8261J3063
54681F34154Q447M082o26n090q472j1479j5555k0672k5417k8864l0755l0554k8230
54668D40969k5563k4491k4256k2340j8293j4610j3379j3935j4423j4044j2958
54657B42677j1306r258p270n815n178n427n940n416l364j053k3j55m32r77k567
$$ plain form
54642 178496 173961 168901 165259 163556 163058 163169 163756 164574 165258 165686 165913 166040 166493 167842 170066 172527
54626 172527 174850 177095 179020 180259 181376 183428 186089 187666 187615 187568 189016 191526 194324 198076 203454
54611 203454 209205 213561 216853 220916 226302 231824 236848 242460 249987 259271 268764 276863 283227 289054
54597 289054 295880 304055 313098 323391 336027 350379 363638 374058 383270 393786 405512 416711
54585 416711 427556 440384 456599 475366 495581 517435 541702 568866 599330 633193 669395
54574 669395 705990 741611 775953 808683 838478 863022 879290 884427 877556 860703 836961 807910
54562 807910 773689 735118 694289 653170 612981 574899 539877 507539 476688 447390 421257
54551 421257 399222 380321 363417 348957 338058 330591 325055 319893 314227 307715 300452 292872 285399
$$ packed form
54642A78496m535n060l642j703m98J11N87Q18O84M28K27J27M53J349K224K461
54626A72527K323K245J925J239J117K052K661J577n1m7J448K510K798L752N378
54611B03454N751M356L292M063N386N522N024N612P527R284R493Q099O364N827
54597B89054O826Q175R043J0293J2636J4352J3259J0420R212J0516J1726J1199
54585D16711J0845J2828J6215J8767K0215K1854K4267K7164L0464L3863L6202
54574F69395L6595L5621L4342L2730K9795K4544J6268N137o871j6853k3742k9051
54562H07910l4221l8571m0829m1119m0189l8082l5022l2338l0851k9298k6133
54551D21257k2035j8901j6904j4460j0899p467n536n162n666o512p263p580p473
$$ plain form
54538 285399 278259 271676 265688 259608 252280 243412 234301 226843 222018 219444 217903 215902 212286 207055
54524 207055 201503 197013 193608 190102 185723 181091 177223 173904 169757 164109 158085 153312 149882 146445
54510 146445 142254 138243 135728 134758 134290 133556 132720 132440 133230 135100 137429 139281 139980 139396 137839 136111
54494 136111 135516 137021 140149 143320 145560 147373 149794 153323 158015 163691 169557 174466 178299 182480
54480 182480 188414 195941 203931 211849 219952 228336 236630 244566 252408 260879 270855 282794 296388 311132
54466 311132 327157 344752 363130 380733 396882 411916 425328 435079 439436 438409 432905 423785
54454 423785 412282 399678 385542 367952 346741 324965 305651 288625 272316 257149 244761
54443 244761 234899 225618 216254 207887 201065 195110 189662 185040 181125 177638 175299 174784 174710 172818 169275
$$ packed form
54538B85399p140o583n988o080p328q868r111p458m825k574j541k001l616n231
54524B07055n552m490l405l506m379m632l868l319m147n648o024m773l430l437
54510A46445m191m011k515r70m68p34q36k80P90J870K329J852O99n84j557j728
54494A36111n95J505L128L171K240J813K421L529M692N676N866M909L833M181
54480A82480N934P527P990P918Q103Q384Q294P936P842Q471R976J1939J3594J4744
54466C11132J6025J7595J8378J7603J6149J5034J3412R751M357j027n504r120
54454D23785j1503j2604j4136j7590k1211k1776j9314j7026j6309j5167j2388
54443B44761r862r281r364q367o822n955n448m622l915l487k339n15p4j892l543
$$ plain form
54428 169275 166632 166274 167063 167978 169738 172829 176021 178275 180522 184088 188401 191658 193034 193143 192851
54413 192851 192625 192803 193872 196499 201137 207012 211729 213020 210962 207590 204417 201571 199263 198261 198357
54398 198357 197882 195637 192149 188366 184345 180094 176612 175026 175376 176849 178389 178602 176287 172020 168231
54383 168231 166738 166985 167504 168050 169037 169691 168385 164747 160222 156348 153294 150387 147497 145479 145257 146599
54367 146599 148075 148429 147724 146698 145514 144040 143029 143712 146008 148332 149576 150303 151576 153734 156875
54352 156875 161372 167078 172846 177675 181612 184878 186999 187743 188211 189865 192750 195524 197215 198404 200748
54337 200748 205518 212212 218377 221473 221299 220106 220020 221061 221948 221911 220968 219162 216365 212480 207296 200553
54321 200553 192705 185125 178993 174328 170497 167145 164192 161450 158675 155591 151609 146282 140479 136236
$$ packed form
54428A69275k643l58P89R15J760L091L192K254K247L566M313L257J376J09k92
54413A92851k26J78J069K627M638N875M717J291k058l372l173k846k308j002R6
54398A98357m75k245l488l783m021m251l482j586L50J473J540K13k315m267l789
54383A68231j493K47N19N46R87O54j306l638m525l874l054k907k890k018k22J342
54367A46599J476L54p05j026j184j474j011O83K296K324J244P27J273K158L141
54352A56875M497N706N768M829L937L266K121P44M68J654K885K774J691J189K344
54337B00748M770O694O165L096j74j193q6J041Q87l7r43j806k797l885n184o743
54321B00553p848p580o132m665l831l352k953k742k775l084l982n327n803m243
$$ plain form
54307 136236 134715 134828 134544 133041 131071 129768 129721 130722 131790 131878 131093 130763 131878 133975 135945 137258
54291 137258 137842 137506 136288 134942 134418 135134 137096 140201 143996 147781 151371 155105 158693 160871 160749
54276 160749 158794 156069 153439 151998 152989 156212 159492 160814 160321 159248 157814 155384 151939 147941 143318
54261 143318 137878 132373 127845 124191 120583 117013 114154 111886 109190 105599 101713 98251 95468 93438
54247 93438 92048 90732 88913 86609 84086 81377 78872 77740 78696 80847 82744 83996 84775 84571 83046
54232 83046 81467 81355 81934 80999 78362 76335 76348 77138 77210 77154 78248 80240 82001 83354 84776 85950 86091
54215 86091 85513 85734 87905 91775 96164 99977 102764 104675 105989 106836 107580 109073 111768 114678 116289
54200 116289 116629 117346 119404 121819 123256 123705 123716 123043 121394 119805 119794 121182 121946 120481 117250 113985
$$ packed form
54307A36236j521J13k84j503j970j303m7J001J068Q8p85l30J115K097J970J313
54291A37258N84l36j218j346n24P16J962L105L795L785L590L734L588K178j22
54276A60749j955k725k630j441R91L223L280J322m93j073j434k430l445l998m623
54261A43318n440n505m528l654l608l570k859k268k696l591l886l462k783k030
54247I3438j390j316j819k304k523k709k505j132R56K151J897J252P79k04j525
54232H3046j579j12N79r35k637k027J3P90P2n6J094J992J761J353J422J174J41
54215H6091n78K21K171L870M389L813K787J911J314Q47P44J493K695K910J611
54200A16289L40P17K058K415J437M49J1o73j649j589j1J388P64j465l231l265
$$ plain form
54184 113985 111854 110731 109976 109612 110525 113162 116227 117537 116521 114921 114330 114013 112395 109903 108626
54169 108626 109286 110410 111027 112393 115827 120093 122635 122919 122872 123865 124794 123849 121167 118678 117827 118480 119967
54152 119967 122236 125496 129328 132754 135090 136316 136599 135830 133799 130579 126598 122473 119035 117327 118028
54137 118028 120652 123729 126151 128116 130209 131850 131526 128783 125081 122158 120275 118849 118013 118244 118744
54122 118744 117665 114307 109890 105656 101326 96233 91089 87504 86193 86520 87491 88302 88226 87019 85502
54107 85502 84949 85776 87454 89617 92274 94735 95447 93743 91197 90314 91995 94966 97666 99838 101974
54092 101974 104008 105437 106479 108077 110415 112159 111699 108692 103939 98358 92864 88712 86717 86126 85263
54077 85263 83401 81075 78667 76083 74073 74252 76853 79746 80874 80620 80509 80500 79234 76392 73113 70212
$$ packed form
54184A13985k131j123p55l64R13K637L065J310j016j600n91l17j618k492j277
54169A08626O60J124O17J366L434M266K542K84m7R93R29r45k682k489q51O53J487
54152A19967K269L260L832L426K336J226K83p69k031l220l981m125l438j708P01
54137A18028K624L077K422J965K093J641l24k743l702k923j883j426q36K31N00
54122A18744j079l358m417m234m330n093n144l585j311L27R71Q11p6j207j517
54107H5502n53Q27J678K163K657K461P12j704k546q83J681K971K700K172K136
54092A01974K034J429J042J598K338J744m60l007m753n581n494m152j995n91q63
54077H5263j862k326k408k584k010J79K601K893J128k54j11rj266k842l279k901
$$ plain form
54061 70212 67653 65821 65676 67069 68291 68080 67253 67642 69988 73266 75558 75398 73069 70873 71336 74696
54045 74696 78723 81290 82362 83231 84806 87165 89804 91491 90753 87584 84145 82699 83096 83302 82151
54030 82151 80453 79369 78880 78293 77390 76455 75706 75276 75397 76122 77089 78007 79124 80750 82567 83927 84694
54013 84694 85150 85121 84054 82228 81064 81621 83343 84980 86237 87605 88958 89581 89606 90192 91851 93698
53997 93698 94985 96411 99036 102596 105832 108053 109492 110512 111352 112434 114044 115913 117835 120380 124081
53982 124081 128151 131205 133303 136146 140809 146209 150407 152897 155093 158928 165270 173396 181704 189093
53968 189093 195712 202306 209193 216304 223746 231479 238724 244718 249967 255659 261694 266587 269745 272531
53954 272531 276212 279886 281593 280909 279338 278428 278480 278902 278902 277685 274756 270451 265943 262543 260807 259964
$$ packed form
54061G0212k559j832j45J393J222k11q27L89K346L278K292j60k329k196M63L360
54045G4696M027K567J072Q69J575K359K639J687p38l169l439j446L97K06j151
54030H2151j698j084m89n87r03r35p49m30J21P25R67R18J117J626J817J360P67
54013H4694M56k9j067j826j164N57J722J637J257J368J353O23K5N86J659J847
53997I3698J287J426K625L560L236K221J439J020Q40J082J610J869J922K545L701
53982A24081M070L054K098K843M663N400M198K490K196L835O342Q126Q308P389
53968A89093O619O594O887P111P442P733P245N994N249N692O035M893L158K786
53954B72531L681L674J707o84j571r10N2M22%j217k929m305m508l400j736q43
$$ plain form
53938 259964 258172 254011 248142 242907 239740 237531 234248 229592 224902 220862 216746 212284 208904 208196
53924 208196 209794 211611 211816 209970 206565 202369 198331 195379 193899 193503 193477 193225 192373 190872 189243 188352
53908 188352 188541 189138 189217 188830 188999 190434 192714 195065 197507 200619 204229 207027 207859 207118 206447 207183 209370
53891 209370 212267 215389 218847 222908 227611 232779 238167 243482 248515 253374 258426 263806 269131 273962
53877 273962 278502 283638 290258 298566 307875 316993 324991 331779 337654 342272 344754 345299 345870 348188 351397
53862 351397 353008 352167 350717 350728 352262 354148 355676 356602 356535 355609 355184 356685 360048 364207 368741 374103
53846 374103 380501 387494 394459 400588 404801 406679 407255 407879 408451 407845 405853 403435 401008 397814 393367
53831 393367 388417 383922 379904 375734 370872 364942 357763 349684 341337 332890 324143 315386 307258 299643
$$ packed form
53938B59964j792m161n869n235l167k209l283m656m690m040m116m462l380p08
53924B08196J598J817K05j846l405m196m038k952j480l96k6k52q52j501j629q91
53908A88352J89N97P9l87J69J435K280K351K442L112L610K798Q32p41o71P36K187
53891B09370K897L122L458M061M703N168N388N315N033M859N052N380N325M831
53877B73962M540N136O620Q308R309R118P998O788N875M618K482N45N71K318L209
53862C51397J611q41j450J1J534J886J528R26o7r26m25J501L363M159M534N362
53846C74103O398O993O965O129M213J878N76O24N72o06j992k418k427l194m447
53831C93367m950m495m018m170m862n930p179q079q347q447q747q757q128p615
$$ plain form
53817 299643 291724 283552 276531 271648 268051 264143 259432 254478 249457 243716 236756 229108 222066 216595
53803 216595 212437 208358 203541 198528 194330 190912 187371 183393 179479 175639 171138 165975 161451 158539
53789 158539 156618 154570 152281 150166 147936 144898 141100 137308 134109 131681 130123 129247 128332 126827 125114
53774 125114 124067 124075 125001 126775 129347 132202 134502 135623 135257 133338 130378 127640 126428 127162 129322 132049
53758 132049 134623 136811 139046 141782 144489 145960 146004 146051 147443 149865 152224 154421 157265 161050 165233
53743 165233 169351 173471 177937 183320 190222 198340 206041 211793 215858 219815 224690 230377 236467 242526
53729 242526 247662 251129 253559 256596 260947 265550 268928 270728 271701 272742 274039 274690 273247 269366 264785
53714 264785 261812 260852 260380 259236 257719 256170 253899 250349 246260 242674 239425 235643 231383 227781 225619
$$ packed form
53817B99643p919q172p021m883l597l908m711m954n021n741o960p648p042n471
53803B16595m158m079m817n013m198l418l541l978l914l840m501n163m524k912
53789A58539j921k048k289k115k230l038l798l792l199k428j558q76r15j505j713
53774A25114j047QR26J774K572K855K300J121l66j919k960k738j212P34K160K727
53758A32049K574K188K235K736K707J471M4M7J392K422K359K197K844L785M183
53743A65233M118M120M466N383O902Q118P701N752M065L957M875N687O090O059
53729B42526N136L467K430L037M351M603L378J800R73J041J297O51j443l881m581
53714B64785k973r60m72j144j517j549k271l550m089l586l249l782m260l602k162
$$ plain form
53699 225619 224424 223048 220824 218143 216075 215299 215278 214771 213180 210950 208555 205868 202927 200566 199502
53684 199502 199223 198641 197673 197387 198489 200289 201290 200413 197613 193773 190281 188392 188639 190624 193221 195054
53668 195054 195253 194153 193046 192836 193124 192985 192278 191507 190511 188248 184319 180137 177950 178865 182104 185846
53652 185846 188385 188835 187508 185749 184933 185367 186392 187543 189106 191305 193409 194310 193912 193445 194204 196264
53636 196264 198734 201126 204015 208150 213168 217635 220436 221750 222437 222898 223073 223348 224661 227435 230946
53621 230946 234048 236130 237197 237686 238638 241347 246005 251075 254850 257366 259928 262961 265395 266304 266064
53606 266064 265463 264521 262805 260356 257768 255796 255268 256819 260124 263629 265547 264985 262115 257814 253490
53591 253490 250516 249095 248059 246468 245073 245454 247844 250571 251828 251459 250848 251395 253249 255381 256780
$$ packed form
53699B25619j195j376k224k681k068p76k1n07j591k230k395k687k941k361j064
53684A99502k79n82r68k86J102J800J001q77k800l840l492j889K47J985K597J833
53668A95054J99j100j107k10K88j39p07p71r96k263l929m182k187R15L239L742
53652A85846K539M50j327j759q16M34J025J151J563K199K104R01l98m67P59K060
53636A96264K470K392K889M135N018M467K801J314O87M61J75K75J313K774L511
53621B30946L102K082J067M89R52K709M658N070L775K516K562L033K434R09k40
53606B66064o01r42j716k449k588j972n28J551L305L505J918n62k870m301m324
53591B53490k974j421j036j591j395L81K390K727J257l69o11N47J854K132J399
$$ plain form
53576 256780 257562 258722 260819 263307 265343 266743 267816 268798 270034 272336 276286 281240 285638 288498 290114
53561 290114 291216 291988 292258 292315 293063 295245 298667 302422 305896 309235 312668 315804 318233 320577 324036
53546 324036 328815 333901 338697 343842 349807 355708 360446 364341 368568 373534 378913 384801 391510 398361
53532 398361 404006 408246 412322 417057 421676 424999 427011 428659 430702 433322 436411 439687 442730 445340
53518 445340 447748 450297 453083 456022 458948 461511 463199 463654 462873 461283 459944 460440 463872 469739 476220
53503 476220 481703 485684 488291 489691 490320 491194 493397 497281 502188 506790 509823 511071 511757 513526 516849
53488 516849 520910 525160 530230 536856 544490 551719 557820 563299 568992 575285 582207 589649 597176 604049
53474 604049 609923 615488 621980 629910 638498 646598 654070 661900 670999 681246 691929 702692 713652
$$ packed form
53576B56780P82J160K097K488K036J400J073R82J236K302L950M954M398K860J616
53561B90114J102P72K70N7P48K182L422L755L474L339L433L136K429K344L459
53546C24036M779N086M796N145N965N901M738L895M227M966N379N888O709O851
53532C98361N645M240M076M735M619L323K012J648K043K620L089L276L043K610
53518D45340K408K549K786K939K926K563J688M55p81j590j339M96L432N867O481
53503D76220N483L981K607J400O29Q74K203L884M907M602L033J248O86J769L323
53488E16849M061M250N070O626P634P229O101N479N693O293O922P442P527O873
53474F04049N874N565O492P930Q588Q100P472P830R099J0247J0683J0763J0960
$$ plain form
53461 713652 724867 736222 747878 760410 774420 790189 807668 826440 845644 864295 881955
53450 881955 899035 916455 935125 955679 978337 1002848 1028647 1055222 1082374 1110198 1138878
53439 1138878 1168512 1199098 1230666 1263211 1296326 1329222 1361632 1394464 1428787 1464091 1498560
53428 1498560 1531522 1564626 1599693 1636072 1671236 1703676 1734149 1764271 1794996 1826618 1859178
53417 1859178 1892443 1926069 1960010 1994246 2028078 2060433 2091060 2120638 2149450 2176741 2201893
53406 2201893 2225534 2248756 2271577 2292885 2311757 2328298 2343044 2355986 2366475 2373998 2378739 2381183
53394 2381183 2381244 2378173 2371396 2361070 2347670 2331574 2313488 2294695 2276198 2257924 2239409 2220865
53382 2220865 2202653 2183994 2163364 2140308 2115879 2090925 2064901 2036943 2007479 1978127 1950365
$$ packed form
53461G13652J1215J1355J1656J2532J4010J5769J7479J8772J9204J8651J7660
53450H81955J7080J7420J8670K0554K2658K4511K5799K6575K7152K7824K8680
53439A138878K9634L0586L1568L2545L3115L2896L2410L2832L4323L5304L4469
53428A498560L2962L3104L5067L6379L5164L2440L0473L0122L0725L1622L2560
53417A859178L3265L3626L3941L4236L3832L2355L0627K9578K8812K7291K5152
53406B201893K3641K3222K2821K1308J8872J6541J4746J2942J0489P523M741K444
53394B381183O1l071o777j0326j3400j6096j8086j8793j8497j8274j8515j8544
53382B220865j8212j8659k0630k3056k4429k4954k6024k7958k9464k9352k7762
$$ plain form
53371 1950365 1924757 1901202 1879446 1859417 1841324 1825456 1811966 1800908 1792288 1785797 1780704 1776406
53359 1776406 1772926 1770521 1769206 1769178 1771196 1775634 1781527 1787622 1794194 1802583 1812974 1824078 1835386 1848281
53345 1848281 1864145 1882546 1902286 1923304 1946335 1971345 1997619 2025296 2055656 2089567 2126309
53334 2126309 2164287 2202637 2241991 2283834 2329200 2377955 2429172 2482009 2536158 2591809 2649490
53323 2649490 2709576 2771464 2833646 2895216 2956880 3019611 3082767 3144755 3205272 3265307 3324753
53312 3324753 3381803 3435422 3486957 3538166 3588716 3636716 3680870 3720976 3756991 3788736 3816056
53301 3816056 3838282 3853925 3861954 3863132 3859284 3851474 3839580 3823210 3802127 3775965 3744432 3707782
53289 3707782 3666598 3621326 3572548 3521340 3468689 3414878 3360147 3305535 3252262 3200472 3149377
$$ packed form
53371A950365k5608k3555k1756k0029j8093j5868j3490j1058q620o491n093m298
53359A776406l480k405j315k8K018M438N893O095O572Q389J0391J1104J1308J2895
53345A848281J5864J8401J9740K1018K3031K5010K6274K7677L0360L3911L6742
53334B126309L7978L8350L9354M1843M5366M8755N1217N2837N4149N5651N7681
53323B649490O0086O1888O2182O1570O1664O2731O3156O1988O0517O0035N9446
53312C324753N7050N3619N1535N1209N0550M8000M4154M0106L6015L1745K7320
53301C816056K2226J5643Q029J178l848p810j1894j6370k1083k6162l1533l6650
53289C707782m1184m5272m8778n1208n2651n3811n4731n4612n3273n1790n1095
$$ plain form
53278 3149377 3098551 3048355 2999276 2951616 2905752 2861876 2819364 2777079 2734579 2692660 2652566
53267 2652566 2614891 2579220 2544719 2511179 2479560 2451077 2425606 2401609 2378017 2355510 2335446
53256 2335446 2318203 2303301 2290379 2278942 2267499 2254123 2238001 2219754 2200418 2180863 2162018
53245 2162018 2144642 2128680 2113496 2098893 2085365 2073349 2062742 2053221 2044669 2037326 2031778 2028526
53233 2028526 2027269 2027092 2027834 2030651 2036567 2045078 2055099 2066615 2080156 2095107 2110120 2125344 2142784
53220 2142784 2163974 2188287 2213994 2239972 2265835 2291232 2315812 2339460 2361957 2382666 2400901
53209 2400901 2416467 2429627 2440723 2449824 2456551 2460471 2461956 2462315 2462423 2461473 2457890 2451276 2442514 2431960
53195 2431960 2418639 2401647 2381493 2359503 2336474 2312396 2287028 2260230 2231947 2202252 2171391
$$ packed form
53278C149377n0826n0196m9079m7660m5864m3876m2512m2285m2500m1919m0094
53267B652566l7675l5671l4501l3540l1619k8483k5471k3997k3592k2507k0064
53256B335446j7243j4902j2922j1437j1443j3376j6122j8247j9336j9555j8845
53245B162018j7376j5962j5184j4603j3528j2016j0607r521q552p343n548l252
53233B028526j257j77P42K817N916Q511J0021J1516J3541J4951J5013J5224J7440
53220B142784K1190K4313K5707K5978K5863K5397K4580K3648K2497K0709J8235
53209B400901J5566J3160J1096R101O727L920J485L59J08r50l583o614q762j0554
53195B431960j3321j6992k0154k1990k3029k4078k5368k6798k8283k9695l0861
$$ plain form
53184 2171391 2139825 2108349 2077930 2048907 2020495 1991627 1962255 1933406 1906089 1880648 1856957
53173 1856957 1834577 1812951 1792119 1772935 1755671 1738804 1720453 1700924 1682467 1666338 1651547
53162 1651547 1636906 1622713 1609524 1596646 1583200 1569915 1558522 1549655 1542294 1535083 1527367 1519164
53150 1519164 1510717 1501965 1492079 1479976 1465741 1450967 1437065 1423685 1409477 1393783 1376719 1358142
53138 1358142 1337833 1316756 1296936 1279556 1263736 1247597 1230215 1212280 1195098 1179146 1163546
53127 1163546 1146790 1127936 1107020 1084480 1060777 1036739 1013565 991808 970641 948752 925832
53116 925832 902724 880363 859226 839653 821898 805719 790603 776570 764074 752750 740923
53105 740923 727094 711678 696639 683361 671412 659473 646850 633758 620638 607954 596376
$$ packed form
53184B171391l1566l1476l0419k9023k8412k8868k9372k8849k7317k5441k3691
53173A856957k2380k1626k0832j9184j7264j6867j8351j9529j8457j6129j4791
53162A651547j4641j4193j3189j2878j3446j3285j1393q867p361p211p716q203
53150A519164q447q752r886j2103j4235j4774j3902j3380j4208j5694j7064j8577
53138A358142k0309k1077j9820j7380j5820j6139j7382j7935j7182j5952j5600
53127A163546j6756j8854k0916k2540k3703k4038k3174k1757k1167k1889k2920
53116I25832k3108k2361k1137j9573j7755j6179j5116j4033j2496j1324j1827
53105G40923j3829j5416j5039j3278j1949j1939j2623j3092j3120j2684j1578
$$ plain form
53094 596376 586341 577160 567347 556228 544689 533901 524039 514962 507341 501800 497176 491127 482891
53081 482891 474284 467393 462244 457448 452330 447426 443323 439872 436363 431915 426022 419311 413405 409323
53067 409323 406274 402738 398497 394741 392301 390698 389095 387342 385687 384156 382757 381894 381911 382344 382055
53052 382055 380262 377328 374404 372339 370968 369620 368236 367547 367902 368352 367553 365363 362917 361067 359535
53037 359535 357786 355936 354262 352399 349801 346603 343275 339570 334688 328562 322144 316170 310326 304005
53023 304005 297275 290579 284136 278273 273759 270927 268821 266263 263570 262088 261921 261421 259440 256940 255469
53008 255469 254938 254014 252276 250776 250442 250846 250892 250125 249088 248541 248410 247557 244924 240936 237261 234974 233583
52991 233583 232207 230828 229669 228203 225940 223647 222580 222804 223411 224066 224968 225451 224179 221012 217427
$$ packed form
53094E96376j0035r181r813j1119j1539j0788r862r077p621n541m624o049q236
53081D82891q607o891n149m796n118m904m103l451l509m448n893o711n906m082
53067D09323l049l536m241l756k440j603j603j753j655j531j399q63J7M33k89
53052C82055j793k934k924k065j371j348j384o89L55M50p99k190k446j850j532
53037C59535j749j850j674j863k598l198l328l705m882o126o418n974n844o321
53023C04005o730o696o443n863m514k832k106k558k693j482j67n00j981k500j471
53008B55469n31r24j738j500l34M04M6p67j037n47j31q53k633l988l675k287j391
52991B33583j376j379j159j466k263k293j067K24O07O55R02M83j272l167l585
$$ plain form
52976 217427 214713 212945 211951 211866 212152 211474 209435 207366 206497 206346 205911 205502 206223 208249 210680 212628 213447
52959 213447 212420 209363 205371 201997 199746 198088 196753 196158 196695 198299 200588 202826 204015 203829 203308
52944 203308 203804 205263 206292 205956 204751 203787 203756 204856 207005 209613 211548 211844 210550 208839 208198 209246
52928 209246 211143 212407 212525 212468 213369 215114 216621 217146 216785 216053 215639 216430 218998 222883 226733 229281
52912 229281 230115 229763 229284 229456 230127 230700 231507 233944 238597 243903 247696 249787 252001 255777 260747 265690
52896 265690 269837 272924 274795 275478 275296 274680 274174 274503 275982 277880 278982 278804 277698 275907 273428 270948
52880 270948 269844 270701 272492 273717 273770 272782 270863 268275 265969 265108 265943 267521 268486 268003 266169 263848
52864 263848 262017 261029 260537 260199 260187 260805 261882 262878 263585 264473 266185 268650 270816 271520 270716 269568 269225
$$ packed form
52976B17427k714j768r94q5K86o78k039k069q69j51m35m09P21K026K431J948Q19
52959B13447j027l057l992l374k251j658j335n95N37J604K289K238J189j86n21
52944B03308M96J459J029l36j205r64l1J100K149K608J935K96j294j711o41J048
52928B09246J897J264J18n7R01J745J507N25l61p32m14P91K568L885L850K548
52912B29281Q34l52m79J72O71N73Q07K437M653N306L793K091K214L776M970M943
52896B65690M147L087J871O83j82o16n06L29J479J898J102j78j106j791k479k480
52880B70948j104Q57J791J225N3r88j919k588k306q61Q35J578R65m83j834k321
52864B63848j831r88m92l38j2O18J077R96P07Q88J712K465K166P04q04j148l43
$$ plain form
52847 269225 269879 271224 273182 275564 277644 278981 280288 282345 284280 284347 282609 281332 282088 283755 284421
52832 284421 284227 284995 287646 291251 294365 296187 296582 296114 296105 297640 300256 302417 303434 304042 304863 305412 305190
52815 305190 304955 305944 308257 310909 313278 315632 318046 319676 319690 318526 317604 317805 318771 319866 321250 323446
52799 323446 326076 327882 328333 328613 330371 333699 337067 339267 340708 342481 344758 346683 347571 347612 347546 348193
52783 348193 350331 354284 359295 363826 367007 369590 372983 377527 382184 385729 387599 387631 385869 383049 380587
52768 380587 379356 378728 377436 375198 372940 371568 371083 370807 369790 367014 362014 355664 349708 345024 340767
52753 340767 335654 329668 323951 319344 315712 312613 309893 307461 304942 301888 298104 293667 288889 284392
52739 284392 280979 279219 279173 280419 282041 282635 280979 277175 272827 269537 267310 264895 261672 258456 256082
$$ packed form
52847B69225O54J345J958K382K080J337J307K057J935O7j738j277P56J667O66
52832B84421j94P68K651L605L114J822L95m68rJ535K616K161J017O08Q21N49k22
52815C05190k35R89K313K652K369K354K414J630J4j164r22K01R66J095J384K196
52799C23446K630J806M51K80J758L328L368K200J441J773K277J925Q88M1o6O47
52783C48193K138L953N011M531L181K583L393M544M657L545J870L2j762k820k462
52768C80587j231o28j292k238k258j372m85k76j017k776n000o350n956m684m257
52753C40767n113n986n717m607l632l099k720k432k519l054l784m437m778m497
52739B84392l413j760m6J246J622N94j656l804m348l290k227k415l223l216k374
$$ plain form
52724 256082 253824 250046 244339 238235 233412 229718 225554 220055 214307 210310 209152 210365 212630 214679
52710 214679 215768 215834 215339 214614 213184 210106 205227 199866 195840 193853 193160 192675 191874 190505 188049 184155
52694 184155 179480 175508 173247 172281 171275 169247 166254 162924 159624 156235 152661 149297 146727 144964
52680 144964 143255 140852 137880 135254 133736 133231 133041 132697 132353 132311 132323 131789 130801 130471 131585 133207 133556
52663 133556 132379 131391 131897 133021 133219 132657 132697 133497 133693 132567 131064 130154 129486 128440 127499 127522 128256 128581
52645 128581 128023 127301 127478 129021 131512 133850 135033 135158 135381 136573 138391 140028 141243 142139 142533 142438
52629 142438 142731 144368 147102 149907 152523 155547 158989 161886 163749 165347 167259 168379 166840 162356
52615 162356 156901 152868 150932 149805 147837 144673 141413 139356 138726 138605 137960 136583 135046 133860 132715
$$ packed form
52724B56082k258l778n707o104m823l694m164n499n748l997j158J213K265K049
52710B14679J089O6m95p25j430l078m879n361m026j987o93m85q01j369k456l894
52694A84155m675l972k261r66j006k028k993l330l300l389l574l364k570j763
52680A44964j709k403k972k626j518n05j90l44l44m2J2n34r88l30J114J622L49
52663A33556j177r88N06J124J98n62M0Q00J96j126j503r10o68j046r41K3P34L25
52645A28581n58p22J77J543K491K338J183J25K23J192J818J637J215Q96L94r5
52629A42438K93J637K734K805K616L024L442K897J863J598J912J120j539m484
52615A62356n455m033j936j127j968l164l260k057o30j21o45j377j537j186j145
$$ plain form
52600 132715 130637 127030 122532 118559 116013 114699 114102 114179 115065 116443 117759 118809 119636 119956 119298 117654
52584 117654 115543 113416 111424 109862 109231 109671 110650 111449 111749 111573 111021 110418 110583 112435 116021 120028
52568 120028 122600 122877 121724 120861 121370 123037 124758 125267 123764 120548 117022 114544 113258 112578 112690 114510
52552 114510 117903 121007 122163 121850 121928 123326 125184 126045 125333 123889 123382 124773 127042 128059 127092 125737
52536 125737 125831 127375 129326 131388 133810 136187 137949 139531 141628 143579 144146 143827 144731 147746 151169
52521 151169 152670 151707 149766 149142 151559 156813 162472 165907 166779 166654 166504 166223 166544 169213 174301 179199
52505 179199 181635 182359 183468 185261 186384 186315 186053 186620 188209 190658 193616 196347 198377 200305 203088
52490 203088 206514 209153 209846 208713 206855 205615 205930 207756 210137 212180 213793 215211 216374 217309 218564
$$ packed form
52600A32715k078l607m498l973k546j314n97P7Q86J378J316J050Q27L20o58j644
52584A17654k111k127j992j562o31M40R79P99L00j76n52o03J65J852L586M007
52568A20028K572K77j153q63N09J667J721N09j503l216l526k478j286o80J12J820
52552A14510L393L104J156l13P8J398J858Q61p12j444n07J391K269J017r67j355
52536A25737R4J544J951K062K422K377J762J582K097J951N67l19R04L015L423
52521A51169J501r63j941o24K417N254N659L435Q72j25j50k81L21K669N088M898
52505A79199K436P24J109J793J123o9k62N67J589K449K958K731K030J928K783
52490B03088L426K639O93j133j858j240L15J826K381K043J613J418J163R35J255
$$ plain form
52475 218564 220577 223088 225855 229350 233832 238225 241122 242687 244342 246584 248272 248365 247293 246109 245184
52460 245184 244385 243889 244038 244622 244988 244935 245089 246130 247786 248833 248323 246702 245459 245639 246957 248276 248418
52443 248418 246455 242135 236663 232452 231210 232391 234051 234934 235146 235208 235429 236165 237768 239984 242029 243533
52427 243533 244875 246296 247150 246542 244580 242674 242412 244132 246657 248580 249667 250684 251991 253085 253780
52412 253780 254897 257103 259727 261670 263028 264748 266943 268827 270476 273309 278167 283690 287420 288139
52398 288139 286538 283964 281234 278697 276842 276357 277567 279923 282255 283600 283838 283587 283582 284036 284341 283558
52382 283558 281757 280810 282985 288310 294141 297901 299471 300155 300312 299475 298264 298310 300013 301949 303068 304096
52366 304096 305910 307715 308069 307008 305831 305062 303862 301623 299191 298089 299014 301400 304109 306264 307673
$$ packed form
52475B18564K013K511K767L495M482M393K897J565J655K242J688R3j072j184r25
52460B45184p99m96J49N84L66n3J54J041J656J047n10j621j243J80J318J319J42
52443B48418j963m320n472m211j242J181J660Q83K12O2K21P36J603K216K045J504
52427B43533J342J421Q54o08j962j906k62J720K525J923J087J017J307J094O95
52412B53780J117K206K624J943J358J720K195J884J649K833M858N523L730P19
52398B88139j601k574k730k537j855m85J210K356K332J345K38k51nM54L05p83
52382B83558j801r47K175N325N831L760J570O84J57q37j211M6J703J936J119J028
52366C04096J814J805L54j061j177p69j200k239k432j102R25K386K709K155J409
$$ plain form
52351 307673 308704 309759 310808 311570 312190 313471 316095 319516 321963 321966 319956 317982 317576 318255 318414 317354
52335 317354 315816 314705 314117 313844 314119 315305 317177 319009 320243 320771 320707 320253 319626 318811 317503 315722
52319 315722 314489 315336 318724 323128 326092 326393 325012 323938 324250 325587 327247 329133 331335 333319 334347
52304 334347 334711 335827 338648 342495 346119 349593 354250 360536 366918 371678 375174 379225 384422 389339
52290 389339 392741 395399 398894 403567 408667 413846 419254 424647 429819 435612 442826 450062 454528 455726
52276 455726 456623 460094 465695 471302 476596 483023 491081 499726 508262 516855 524992 531330 535740 539969
52262 539969 545384 551256 556277 560857 566773 575051 585247 596478 608212 620119 632019 644165 656979
52249 656979 670286 683360 695989 709164 724278 741694 760435 779292 797977 817023 836913
$$ packed form
52351C07673J031J055J049P62O20J281K624L421K447Lk010j974m06O79J59j060
52335C17354j538j111n88k73K75J186J872J832J234N28o4m54o27q15j308j781
52319C15722j233Q47L388M404K964L01j381j074L12J337J660J886K202J984J028
52304C34347L64J116K821L847L624L474M657O286O382M760L496M051N197M917
52290C89339L402K658L495M673N100N179N408N393N172N793P214P236M466J198
52276D55726Q97L471N601N607N294O427Q058Q645Q536Q593Q137O338M410M229
52262E39969N415N872N021M580N916Q278J0196J1231J1734J1907J1900J2146J2814
52249F56979J3307J3074J2629J3175J5114J7416J8741J8857J8685J9046J9890
$$ plain form
52238 836913 857723 879698 903645 930334 959505 989695 1019148 1047122 1074485 1102991 1133633
52227 1133633 1165626 1197209 1227306 1256131 1284450 1313012 1342575 1373491 1404966 1435682 1465534
52216 1465534 1495757 1526675 1556293 1582165 1603959 1623233 1641288 1658257 1673799 1687434 1698489
52205 1698489 1706830 1713543 1719973 1726271 1731660 1735668 1738012 1737868 1734761 1730078 1726159 1723766 1721807 1719631
52191 1719631 1718068 1717821 1718405 1719351 1721225 1724618 1729099 1733949 1739209 1745459 1753233 1763010 1775014 1788731
52177 1788731 1803452 1819449 1837516 1857155 1876554 1894803 1912727 1930867 1948173 1963711 1978323
52166 1978323 1993314 2008412 2022265 2034079 2043644 2050586 2054778 2056732 2056447 2052710 2044870 2034490 2023682
52153 2023682 2012436 1999186 1983586 1966882 1949582 1930548 1908814 1884836 1859485 1833013 1805673
$$ packed form
52238H36913K0810K1975K3947K6689K9171L0190K9453K7974K7363K8506L0642
52227A133633L1993L1583L0097K8825K8319K8562K9563L0916L1475L0716K9852
52216A465534L0223L0918K9618K5872K1794J9274J8055J6969J5542J3635J1055
52205A698489Q341O713O430O298N389M008K344j44l107m683l919k393j959k176
52191A719631j563k47N84R46J874L393M481M850N260O250P774R777J2004J3717
52177A788731J4721J5997J8067J9639J9399J8249J7924J8140J7306J5538J4612
52166A978323J4991J5098J3853J1814R565O942M192J954k85l737p840j0380j0808
52153B023682j1246j3250j5600j6704j7300j9034k1734k3978k5351k6472k7340
$$ plain form
52142 1805673 1778444 1752416 1727922 1704672 1682362 1660902 1640343 1620656 1601496 1582552 1564473
52131 1564473 1548858 1536567 1526453 1516520 1505937 1495039 1483967 1472668 1462083 1453911 1448778 1445438
52119 1445438 1441979 1437191 1431040 1424666 1419631 1416160 1412509 1407278 1401796 1398401 1396542 1392850 1385554 1376690
52105 1376690 1369033 1362870 1357127 1351800 1347341 1342912 1337234 1330615 1324467 1319352 1315002 1311729 1310058 1309165
52091 1309165 1307304 1303762 1299024 1293253 1286331 1279453 1274803 1272965 1272135 1270556 1268343 1266083 1263092 1258378
52077 1258378 1252394 1246522 1241414 1237090 1234213 1233786 1235494 1237336 1237143 1233889 1227763 1220061 1213032 1208690
52063 1208690 1207110 1206439 1205041 1203145 1202103 1202632 1204386 1206791 1209581 1212584 1215596 1218671 1222296 1227260
52049 1227260 1234427 1244520 1257701 1273206 1289531 1305324 1320431 1336312 1355193 1378403 1405387
$$ packed form
52142A805673k7229k6028k4494k3250k2310k1460k0559j9687j9160j8944j8079
52131A564473j5615j2291j0114r933j0583j0898j1072j1299j0585q172n133l340
52119A445438l459m788o151o374n035l471l651n231n482l395j859l692p296q864
52105A376690p657o163n743n327m459m429n678o619o148n115m350l273j671q93
52091A309165j861l542m738n771o922o878m650j838q30j579k213k260k991m714
52077A258378n984n872n108m324k877m27J708J842j93l254o126p702p029m342
52063A208690j580o71j398j896j042N29J754K405K790L003L012L075L625M964
52049A227260P167J0093J3181J5505J6325J5793J5107J5881J8881K3210K6984
$$ plain form
52038 1405387 1434494 1464589 1495567 1527548 1560497 1594861 1631645 1671138 1712051 1752702 1792657
52027 1792657 1832486 1872255 1911211 1948810 1985110 2020004 2052929 2083529 2111887 2137825 2160747
52016 2160747 2180585 2198164 2214060 2227562 2237193 2241982 2242047 2238513 2233140 2227288 2220655 2211583 2199205
52003 2199205 2184690 2169725 2154473 2138091 2120755 2103744 2087479 2070867 2053183 2035576 2019898
51992 2019898 2006669 1995026 1984322 1974883 1967247 1961466 1957410 1955187 1954857 1956107 1958731 1963245 1970396
51979 1970396 1979887 1990089 1999491 2008165 2017380 2027984 2039636 2051543 2063279 2074768 2086017 2097064
51967 2097064 2107608 2116465 2122083 2124139 2124078 2123386 2121756 2117728 2110884 2102314 2092776 2081313 2066386 2047908
51953 2047908 2027558 2007079 1986631 1964915 1940680 1913899 1885470 1856039 1825496 1793585 1760427
$$ packed form
52038A405387K9107L0095L0978L1981L2949L4364L6784L9493M0913M0651L9955
52027A792657L9829L9769L8956L7599L6300L4894L2925L0600K8358K5938K2922
52016B160747J9838J7579J5896J3502R631M789O5l534n373n852o633r072j2378
52003B199205j4515j4965j5252j6382j7336j7011j6265j6612j7684j7607j5678
51992B019898j3229j1643j0704r439p636n781m056k223l30J250K624M514P151
51979A970396R491J0202R402Q674R215J0604J1652J1907J1736J1489J1249J1047
51967B097064J0544Q857N618K056o1o92j630m028o844q570r538j1463j4927j8478
51953B047908k0350k0479k0448k1716k4235k6781k8429k9431l0543l1911l3158
$$ plain form
51942 1760427 1725976 1689358 1649514 1606658 1562623 1519479 1478054 1437919 1398450 1359483 1321016
51931 1321016 1282783 1244524 1206518 1169484 1133771 1098991 1064699 1031159 998980 968164 938144
51920 938144 908743 880357 853024 826106 799399 773889 750681 729569 709301 688979 668603
51909 668603 648534 629191 611202 595104 580764 567556 555116 543549 533039 523800 516100 509656
51897 509656 503126 495165 486091 477617 470622 464051 456571 448467 441101 434976 429218 422865 415865 408717
51883 408717 401720 394948 388700 383633 380331 378738 377974 376869 374748 371678 367957 363651 358775 353682
51869 353682 348927 344816 341445 339117 338247 338607 339045 338528 337481 337532 339613 342622 344363 343652 341063 337730
51853 337730 334114 330158 326078 322358 319063 315611 311333 306139 300715 296130 293150 291717 291086 290408 289070
$$ packed form
51942A760427l4451l6618l9844m2856m4035m3144m1425m0135l9469l8967l8467
51931A321016l8233l8259l8006l7034l5713l4780l4292l3540l2179l0816l0020
51920I38144k9401k8386k7333k6918k6707k5510k3208k1112k0268k0322k0376
51909F68603k0069j9343j7989j6098j4340j3208j2440j1567j0510r239p700o444
51897E09656o530p961r074q474o995o571p480q104p366o125n758o353p000p148
51883D08717o997o772o248n067l302j593p64j105k121l070l721m306m876n093
51869C53682m755m111l371k328q70L60M38n17j047N1K081L009J741p11k589l333
51853C37730l616l956m080l720l295l452m278n194n424m585k980j433o31o78j338
$$ plain form
51838 289070 286706 283449 280271 278439 278110 277806 275767 271720 267009 263223 261068 260308 260239 260155 259677 258757
51822 258757 257415 255716 254053 252974 252446 251734 250417 249080 248479 248442 248285 248053 248546 250139 252196 253730
51806 253730 254227 253855 253320 253417 254341 255583 256842 258732 262023 266555 271550 276669 281847 286300 288823 289233
51790 289233 288594 287821 286964 286226 286706 289342 293485 297130 298510 297410 295250 294001 294567 296166 297576 298797
51774 298797 300767 303505 305585 305799 304587 303260 302430 301791 301058 300485 300479 300944 300988 299498 296418 293278 291778
51757 291778 291880 292043 291219 289640 287620 284995 282284 281119 282418 284953 286766 287391 287776 288622 289898 291563
51741 291563 293611 295526 296709 297415 298397 299626 300269 300105 300215 301936 305543 309942 313273 313914 311609 307909
51725 307909 305096 304416 305384 306570 306678 305198 302704 300597 300036 300991 302571 304086 305355 306268 306766 307221
$$ packed form
51838B89070k364l257l178j832l29l04k039m047m711l786k155p60o9q4m78r20
51822B58757j342j699j663j079n28p12j317j337o01l7j57k32M93J593K057J534
51806B53730M97l72n35R7R24J242J259J890L291M532M995N119N178M453K523M10
51790B89233o39p73q57p38M80K636M143L645J380j100k160j249N66J599J410J221
51774B98797J970K738K080K14j212j327q30o39p33n73oM65M4j490l080l140j500
51757B91778J02J63q24j579k020k625k711j165J299K535J813O25L85Q46J276J665
51741B91563K048J915J183P06R82J229O43j64J10J721L607M399L331O41k305l700
51725C07909k813o80R68J186J08j480k494k107n61R55J580J515J269R13M98M55
$$ plain form
51709 307221 308112 309262 310026 310357 310973 312346 314236 316520 319628 323615 327406 329771 330764 331523 332873 334788
51693 334788 337096 339922 343269 346857 350733 355467 361320 367720 374132 381128 389676 399380 408407 415627
51679 415627 422202 430370 441078 453530 466775 480771 495747 511292 526466 540365 552383 562327
51667 562327 570461 577041 581676 583743 583534 582288 580686 578066 573742 568511 563997 560872 558530 556376
51653 556376 554579 553483 552965 552583 551912 550564 548283 545296 542402 540538 540192 541006 541793 541251 539101 536421
51637 536421 534691 534666 536228 538749 541183 542418 542367 542394 543959 547113 551092 555878 562020 569108 576003 582839
51621 582839 591365 602515 614794 625897 634773 640948 642963 639416 631474 622681 615779 610676 605817
51608 605817 600425 594858 589681 585290 581995 579825 578499 578117 579484 583167 588517 594207 599497 604346
$$ packed form
51709C07221Q91J150P64L31O16J373J890K284L108L987L791K365R93P59J350J915
51693C34788K308K826L347L588L876M734N853O400O412O996Q548R704R027P220
51679D15627O575Q168J0708J2452J3245J3996J4976J5545J5174J3899J2018R944
51667E62327Q134O580M635K067k09j246j602k620m324n231m514l125k342k154
51653E56376j797j096n18l82o71j348k281k987k894j864l46Q14P87n42k150k680
51637E36421j730k5J562K521K434J235n1K7J565L154L979M786O142P088O895O836
51621E82839Q526J1150J2279J1103Q876O175K015l547p942q793o902n103m859
51608F05817n392n567n177m391l295k170j326l82J367L683N350N690N290M849
$$ plain form
51594 604346 608361 610436 609681 606199 600816 594377 587420 580122 572320 563860 554992 546091 537082 527657
51580 527657 518149 509548 502422 496423 491098 486273 481169 474051 463990 452608 442921 436398 431995 428009
51566 428009 423824 419628 415460 411211 407009 402954 398861 394677 390847 387824 385368 382701 379314 375467
51552 375467 372006 369771 369058 369644 371284 373814 376440 377491 375818 372313 369103 367077 365202 362535 359810
51537 359810 358295 357981 357916 357934 359040 362055 366438 370564 372962 373496 373626 375286 379263 384859 391071 397466
51521 397466 403848 410018 416340 423651 431906 439742 446234 452293 459224 466555 472666 477229 481573 486602
51507 486602 491662 495726 498428 499559 498717 496171 493136 490397 487272 482685 476787 470811 465733 461767
51493 461767 458934 457276 456469 455883 455319 455358 456732 459548 463243 467202 471238 475561 480490 486266 492972
$$ packed form
51594F04346M015K075p55l482n383o439o957p298p802q460q868q901r009r425
51580E27657r508q601p126n999n325m825n104p118j0061j1382r687o523m403l986
51566D28009m185m196m168m249m202m055m093m184l830l023k456k667l387l847
51552C75467l461k235p13N86J640K530K626J051j673l505l210k026j875k667k725
51537C59810j515l14o5J8J106L015M383M126K398N34J30J660L977N596O212O395
51521C97466O382O170O322P311Q255P836O492O059O931P331O111M563M344N029
51507D86602N060M064K702J131q42k546l035k739l125m587n898n976n078l966
51493D61767k833j658q07n86n64L9J374K816L695L959M036M323M929N776O706
$$ plain form
51478 492972 500471 508468 516788 525544 534850 544352 553313 561174 567751 572890 576281 577802 577743 576590 574891
51463 574891 573361 572606 572517 572413 572001 571644 571406 570660 569276 568495 569617 572091 573889 573768 572464 571492 571337
51446 571337 570972 568818 564223 558274 552901 548899 545139 540145 533929 527619 521810 516161 510349 504449
51432 504449 498441 492216 486061 480335 474837 469377 464840 462416 461693 460729 458451 455894 454533 454513 455338
51417 455338 457269 460796 465099 468247 469173 468876 469519 472667 478405 485779 493766 501831 509748 517331 524664
51402 524664 532397 541320 551658 563046 574981 586901 598071 608043 617269 626663 636579 646626 656282
51389 656282 665069 672312 677606 681502 684949 688085 690423 692195 694411 697366 700136 701902 702749 702814 701817
51374 701817 700132 699282 700368 702641 704574 705886 707648 710564 713848 715889 715780 714241 712909 712287 710610
$$ packed form
51478D92972P499P997Q320Q756R306R502Q961P861O577N139L391J521n9j153j699
51463E74891j530p55q9j04m12l57k38p46j384p81J122K474J798j21j304r72j55
51446E71337l65k154m595n949n373m002l760m994o216o310n809n649n812n900
51432E04449o008o225o155n726n498n460m537k424p23r64k278k557j361k0Q25
51417D55338J931L527M303L148R26k97O43L148N738P374P987Q065P917P583P333
51402E24664P733Q923J0338J1388J1935J1920J1170R972R226R394R916J0047R656
51389F56282Q787P243N294L896L447L136K338J772K216K955K770J766Q47O5r97
51374G01817j685q50J086K273J933J312J762K916L284K041j09j539j332o22j677
$$ plain form
51359 710610 705611 697333 688096 679582 671295 662318 653072 644391 636167 628040 620379 613413 606410 599050
51345 599050 592721 588946 587224 585900 584503 583598 582877 581317 579146 577817 577804 577984 577446 576452 575332 573930
51329 573930 572555 572046 572396 572624 572549 573186 574720 575581 574560 572502 570676 568561 564664 558633 551070 541899
51313 541899 530582 517726 504993 493348 482636 472808 463998 455110 443948 429744 414625 401512
51301 401512 391141 382036 372815 363432 354372 345907 338518 333154 330291 329081 327889 325569 322025 317868
51287 317868 313897 310715 308423 306715 305419 304643 304116 302863 300264 297143 294922 293655 291900 288874 285817
51272 285817 284473 284907 285645 285596 284885 283970 282873 281568 280572 280810 283049 287428 293212 299001 303489 306228
51256 306228 307752 309206 311792 315952 320752 324641 327325 330318 334972 340600 345478 349214 352892 357206
$$ packed form
51359G10610m999q278r237q514q287q977r246q681q224q127p661o966p003p360
51345E99050o329l775j722j324j397r05p21j560k171j329j3J80n38r94j120j402
51329E73930j375n09L50K28p5O37J534Q61j021k058j826k115l897o031p563r171
51313E41899j1317j2856j2733j1645j0712r828q810q888j1162j4204j5119j3113
51301D01512j0371r105r221r383r060q465p389n364k863j210j192k320l544m157
51287C17868l971l182k292j708j296p76n27j253k599l121k221j267j755l026l057
51272B85817j344M34P38m9p11r15j097j305r96K38K239M379N784N789M488K739
51256C06228J524J454K586M160M800L889K684K993M654N628M878L736L678M314
$$ plain form
51242 357206 361812 366628 372119 377788 381764 382905 382388 382233 382826 382822 380942 377025 371773 366361 361981 358813
51226 358813 355616 351020 345015 338441 331432 323518 315160 307937 302821 299188 295894 292467 288740 284208
51212 284208 278614 272654 267217 262201 256878 251258 246300 242629 239780 236992 234196 231790 229759 227519
51198 227519 224650 221469 218832 217430 217292 217905 218824 220130 222122 224608 226837 228372 229817 232286 236116
51183 236116 240385 243817 245956 247223 248057 248362 247943 247086 246386 246101 246129 246686 248496 251819 255591 258117
51167 258117 258759 258497 258738 260075 262291 264834 266773 266962 265164 262839 261879 262451 262872 261823 260008 259169
51151 259169 260066 262022 264016 265540 266373 266252 265170 263835 263355 264170 265369 265486 264112 262224 260621 258734
51135 258734 255880 253192 252780 254783 256705 256554 255433 255797 257954 259808 259748 258240 256382 254374 252169
$$ packed form
51242C57206M606M816N491N669L976J141n17j55N93mj880l917n252n412m380l168
51226C58813l197m596o005o574p009p914q358p223n116l633l294l427l727m532
51212B84208n594n960n437n016n323n620m958l671k849k788k796k406k031k240
51198B27519k869l181k637j402j38O13R19J306J992K486K229J535J445K469L830
51183B36116M269L432K139J267Q34L05m19q57p00k85K8N57J810L323L772K526
51167B58117O42k62K41J337K216K543J939J89j798k325r60N72M21j049j815q39
51151B59169Q97J956J994J524Q33j21j082j335m80Q15J199J17j374j888j603j887
51135B58734k854k688m12K003J922j51j121L64K157J854o0j508j858k008k205
$$ plain form
51120 252169 250581 250636 252067 253224 252531 249717 245672 241523 237926 235032 232772 230971 229281 227345 225278
51105 225278 223777 223543 224738 227064 229956 232484 233655 233369 232667 232393 232086 231045 230067 230745 232938 234356
51089 234356 233308 230740 228672 227453 225618 222025 217050 211836 207376 204383 203209 203506 204433 205378 206136
51074 206136 206409 205775 204439 203484 203974 205957 208632 211339 214121 217451 221583 226170 230443 233852 236613
51059 236613 239475 242883 246564 249980 252881 255214 256741 257170 256591 255422 253965 252359 251000 250487 250900
51044 250900 251430 251135 249941 248716 248395 249195 250534 251603 252118 252592 253633 255006 255937 256546 258187 261682
51028 261682 265806 268555 269552 270021 270504 270110 268465 266967 267087 268346 269110 268770 268080 267818 268240 269537 271611
51011 271611 273409 273660 272468 271200 270569 269841 268408 267070 266882 267361 266878 264739 262078 260501 260478 261381
$$ packed form
51120B52169j588N5J431J157o93k814m045m149l597k894k260j801j690j936k067
51105B25278j501k34J195K326K892K528J171k86p02k74l07j041r78O78K193J418
51089B34356j048k568k068j219j835l593m975n214m460k993j174K97R27R45P58
51074B06136K73o34j336r55M90J983K675K707K782L330M132M587M273L409K761
51059B36613K862L408L681L416K901K333J527M29n79j169j457j606j359n13M13
51044B50900N30k95j194j225l21Q00J339J069N15M74J041J373R31O09J641L495
51028B61682M124K749R97M69M83l94j645j498J20J259P64l40o90k62M22J297K074
51011B71611J798K51j192j268o31p28j433j338j88M79m83k139k661j577k3R03
$$ plain form
50995 261381 262655 264287 266100 267275 267159 266405 266590 268564 271665 274651 276763 277711 277537 277078 277752 279975
50979 279975 282500 284343 286603 290951 296816 301868 305471 309765 316637 325011 332113 336318 337898 338048
50965 338048 338257 339755 342396 344642 345646 346628 349005 351910 353176 352559 352331 354389 358221 362265 366010
50950 366010 369946 374323 378994 384135 390304 397870 406745 416552 426681 436390 445228 453358 461277 469363
50936 469363 477915 487464 498754 512351 528272 545979 564788 584438 605212 627339 650516 674454
50924 674454 699754 727496 757797 789514 821901 855938 893355 934737 979443 1027277 1079222
50913 1079222 1136234 1198127 1264146 1334160 1408705 1488198 1572741 1662598 1758304 1860048 1967135
50902 1967135 2077966 2190307 2301850 2411030 2517503 2621450 2722230 2817819 2905527 2982956
$$ packed form
50995B61381J274J632J813J175j16p54J85J974L101K986K112R48j74m59O74K223
50979B79975K525J843K260M348N865N052L603M294O872Q374P102M205J580J50
50965C38048K09J498K641K246J004R82K377K905J266o17k28K058L832M044L745
50950C66010L936M377M671N141O169P566Q875R807J0129R709Q838Q130P919Q086
50936D69363Q552R549J1290J3597J5921J7707J8809J9650K0774K2127K3177K3938
50924F74454K5300K7742L0301L1717L2387L4037L7417M1382M4706M7834N1945
50913A079222N7012O1893O6019P0014P4545P9493Q4543Q9857R5706J01744J07087
50902A967135J10831J12341J11543J09180J06473J03947J00780R5589Q7708P7429
$$ plain form
50892 2982956 3048379 3100799 3140004 3166312 3180037 3181478 3171554 3152052 3124909 3091487 3052776 3009870
50880 3009870 2963862 2915668 2866455 2817948 2771594 2727418 2684159 2640438 2595399 2548404 2498869
50869 2498869 2446510 2391197 2332382 2269172 2201294 2129646 2055706 1980574 1904741 1828453 1752194
50858 1752194 1676995 1604276 1535053 1469277 1406284 1346015 1289451 1237747 1191275 1149659 1112384
50847 1112384 1079136 1049668 1023455 999509 976910 955879 937902 924073 913506 904278 895980 890185
50835 890185 887988 888228 889028 890303 893519 899270 906297 913081 919624 927248 937106 949200 962607 976479
50821 976479 990896 1006867 1025476 1047072 1071259 1097311 1124342 1151519 1178735 1207189 1238806
50810 1238806 1274842 1315086 1358496 1404476 1453559 1506958 1565508 1628977 1696509 1767882 1844306
$$ packed form
50892B982956O5423N2420L9205K6308J3725J441r924j9502k7143l3422l8711m2906
50880C009870m6008m8194m9213m8507m6354m4176m3259m3721m5039m6995m9535
50869B498869n2359n5313n8815o3210o7878p1648p3940p5132p5833p6288p6259
50858A752194p5199p2719o9223o5776o2993o0269n6564n1704m6472m1616l7275
50847A112384l3248k9468k6213k3946k2599k1031j7977j3829j0567r228q298n795
50835H90185k197K40Q00J275L216N751P027O784O543P624R858J2094J3407J3872
50821I76479J4417J5971J8609K1596K4187K6052K7031K7177K7216K8454L1617
50810A238806L6036M0244M3410M5980M9083N3399N8550O3469O7532P1373P6424
$$ plain form
50799 1844306 1927903 2020440 2122569 2234185 2355349 2486838 2629809 2785025 2952660 3132915
50789 3132915 3326396 3533360 3752683 3982123 4219554 4463307 4711133 4959488 5204322
50780 5204322 5442035 5669207 5881756 6074928 6244014 6384853 6494133 6569937 6612155 6622138
50770 6622138 6602093 6555042 6484968 6396342 6293420 6180303 6061581 5942292 5826776 5717432
50760 5717432 5614503 5516959 5423603 5333413 5244926 5155609 5062245 4961979 4852743 4732929
50750 4732929 4601396 4458152 4304537 4142342 3973132 3798743 3621862 3445470 3271740
50741 3271740 3101830 2936567 2777071 2624982 2482277 2350435 2229334 2117323 2012953
50732 2012953 1916434 1828957 1750812 1680750 1617159 1559407 1507957 1463363 1425139 1391543 1360708
$$ packed form
50799A844306Q3597R2537J02129J11616J21164J31489J42971J55216J67635J80255
50789C132915J93481K06964K19323K29440K37431K43753K47826K48355K44834
50780E204322K37713K27172K12549J93172J69086J40839J09280P5804M2218R983
50770F622138k0045m7051p0074q8626j02922j13117j18722j19289j15516j09344
50760E717432j02929r7544r3356r0190q8487q9317r3364j00266j09236j19814
50750D732929j31533j43244j53615j62195j69210j74389j76881j76392j73730
50741C271740j69910j65263j59496j52089j42705j31842j21101j12011j04370
50732B012953r6519q7477p8145p0062o3591n7752n1450m4594l8224l3596l0835
$$ plain form
50721 1360708 1332092 1306441 1284291 1265095 1248140 1233547 1221660 1211907 1203044 1194362 1186114 1178948
50709 1178948 1173453 1169974 1168362 1168103 1169063 1171694 1176159 1181862 1188540 1197146 1208741 1222940 1238495 1255062
50695 1255062 1273407 1294128 1317336 1343419 1372801 1404905 1438658 1474419 1514286 1559865 1610546
50684 1610546 1664620 1721587 1782905 1850835 1926802 2010553 2100802 2196945 2299869 2410633 2528881
50673 2528881 2653560 2784823 2923828 3070377 3221895 3375070 3527567 3677888 3824656
50664 3824656 3966360 4100784 4224284 4332652 4423172 4494938 4546854 4576655 4582602 4565125 4526236
50653 4526236 4468499 4395181 4310070 4216156 4115601 4011792 3909882 3813848 3724185 3640017 3562186
50642 3562186 3492254 3429264 3369821 3311205 3252366 3191803 3126631 3054619 2975735 2891002 2800908
$$ packed form
50721A360708k8616k5651k2150j9196j6955j4593j1887r753q863q682q248p166
50709A178948n495l479j612k59R60K631M465N703O678Q606J1595J4199J5555J6567
50695A255062J8345K0721K3208K6083K9382L2104L3753L5761L9867M5579N0681
50684A610546N4074N6967O1318O7930P5967Q3751R0249R6143J02924J10764J18248
50673B528881J24679J31263J39005J46549J51518J53175J52497J50321J46768
50664C824656J41704J34424J23500J08368R0520P1766N1916K9801N947j7477l8889
50653D526236n7737p3318q5111r3914j00555j03809j01910r6034q9663q4168p7831
50642C562186o9932o2990n9443n8616n8839o0563o5172p2012p8884q4733r0094
$$ plain form
50631 2800908 2705618 2605792 2502671 2398012 2294117 2192986 2095147 2000209 1908888 1823549
50621 1823549 1746383 1677817 1616915 1562382 1512843 1467255 1425688 1388970 1357184 1329366 1305057
50610 1305057 1285069 1270054 1259340 1252001 1248083 1247763 1250040 1253508 1258093 1265060 1275597 1290119 1308515
50597 1308515 1330090 1353557 1378129 1404484 1433821 1466208 1500886 1538150 1579672 1626648 1678600
50586 1678600 1734500 1794302 1858732 1928120 2002163 2080543 2163181 2249809 2339765 2432423 2527626
50575 2527626 2625329 2724686 2823755 2920551 3014332 3105308 3192934 3275103 3349377 3414399 3469640
50564 3469640 3514528 3548628 3572184 3585590 3588827 3582547 3569298 3552310 3533075 3511436 3488100 3465520
50552 3465520 3445748 3428814 3414041 3401635 3391962 3384242 3377236 3370459 3363530 3354953 3342826 3326471
$$ packed form
50631B800908r5290r9826j03121j04659j03895j01131r7839r4938r1321q5339
50621A823549p7166o8566o0902n4533m9539m5588m1567l6718l1786k7818k4309
50610A305057j9988j5015j0714p339l918l20K277L468M585O967J0537J4522J8396
50597A308515K1575K3467K4572K6355K9337L2387L4678L7264M1522M6976N1952
50586A678600N5900N9802O4430O9388P4043P8380Q2638Q6628Q9956R2658R5203
50575B527626R7703R9357R9069R6796R3781R0976Q7626Q2169P4274O5022N5241
50564C469640M4888L4100K3556J3406L237o280j3249j6988j9235k1639k3336k2580
50552C465520j9772j6934j4773j2406r673p720p006o777o929q577j2127j6355
$$ plain form
50540 3326471 3306133 3281264 3250153 3211058 3162677 3103879 3034406 2956043 2871919 2784440 2694810
50529 2694810 2604422 2515168 2427948 2342227 2257814 2175945 2097854 2023402 1952214 1885358 1824683
50518 1824683 1770834 1722915 1679828 1641078 1606502 1576165 1550495 1529818 1513815 1501993 1494475
50507 1494475 1491605 1492873 1497054 1503548 1512925 1525962 1542641 1562220 1583899 1607339 1632934 1661635
50495 1661635 1694036 1729528 1766674 1804442 1842724 1881752 1921536 1962005 2003204 2045132 2087638
50484 2087638 2130539 2173610 2216509 2259248 2302808 2348790 2398197 2450813 2505892 2563165 2623107
50473 2623107 2686754 2755562 2831068 2914300 3005545 3104820 3212424 3328997 3455190 3591177
50463 3591177 3736018 3887486 4042978 4200775 4359911 4518802 4674727 4825107 4968496
$$ packed form
50540C326471k0338k4869l1111l9095m8381n8798o9473p8363q4124q7479q9630
50529B694810r0388q9254q7220q5721q4413q1869p8091p4452p1188o6856o0675
50518A824683n3849m7919m3087l8750l4576l0337k5670k0677j6003j1822p518
50507A494475k870J268M181O494R377J3037J6679J9579K1679K3440K5595K8701
50495A661635L2401L5492L7146L7768L8282L9028L9784M0469M1199M1928M2506
50484B087638M2901M3071M2899M2739M3560M5982M9407N2616N5079N7273N9942
50473B623107O3647O8808P5506Q3232R1245R9275J07604J16573J26193J35987
50463C591177J44841J51468J55492J57797J59136J58891J55925J50380J43389
$$ plain form
50454 4968496 5103331 5225960 5330896 5413325 5470956 5503537 5511462 5495322 5456165 5395436 5314754
50443 5314754 5216302 5103386 4980151 4850729 4719082 4589597 4467054 4355377 4256611 4171529
50433 4171529 4100952 4045958 4007002 3983527 3974516 3978765 3994262 4017697 4044870 4071206 4091775 4101562
50421 4101562 4096510 4074271 4033649 3973676 3893906 3795581 3681980 3557362 3425595 3289548 3151371
50410 3151371 3013206 2877664 2747490 2624732 2510442 2405110 2308726 2220259 2137959 2061119
50400 2061119 1991221 1930579 1879935 1837919 1802611 1772866 1748337 1729046 1715168 1706653 1702957 1703479
50388 1703479 1708138 1717042 1729947 1746688 1767776 1793449 1822244 1851742 1881132 1912178 1947177 1986602
50376 1986602 2028983 2072381 2115614 2158677 2202359 2246976 2291383 2333791 2373422 2410467 2444527
$$ packed form
50454D968496J34835J22629J04936Q2429N7631L2581P925j6140l9157o0729q0682
50443E314754r8452j12916j23235j29422j31647j29485j22543j11677r8766q5082
50433D171529p0577n4994l8956k3475r011M249J5497K3435K7173K6336K0569R787
50421D101562n052k2239m0622n9973p9770r8325j13601j24618j31767j36047j38177
50410C151371j38165j35542j30174j22758j14290j05332r6384q8467q2300p6840
50400B061119o9898o0642n0644m2016l5308k9745k4529j9291j3878q515l696N22
50388A703479M659Q904J2905J6741K1088K5673K8795K9498K9390L1046L4999L9425
50376A986602M2381M3398M3233M3063M3682M4617M4407M2408L9631L7045L4060
$$ plain form
50365 2444527 2474541 2500609 2524269 2546039 2564042 2576434 2584174 2589882 2594703 2598008 2600000 2602822
50353 2602822 2608788 2618840 2633254 2652711 2677792 2708046 2742393 2780299 2822032 2867646 2915972
50342 2915972 2964842 3012506 3058674 3103764 3146942 3185392 3215812 3236249 3246170 3245395 3233575 3210247
50330 3210247 3174616 3125649 3063282 2989581 2908111 2822233 2734466 2647078 2562239 2481526 2406089
50319 2406089 2337488 2277556 2227118 2185505 2151714 2125777 2108779 2101769 2104603 2115409 2131144 2148985
50307 2148985 2167041 2183329 2194698 2197929 2192074 2178605 2158919 2132577 2098526 2057069 2009721 1957813
50295 1957813 1902328 1845042 1788801 1736307 1688824 1645906 1605949 1567221 1529105 1492702 1459872
50284 1459872 1431486 1406818 1384728 1365042 1348437 1335171 1324432 1315123 1306962 1300492 1296159 1293823
$$ packed form
50365B444527L0014K6068K3660K1770J8003J2392P740N708M821L305J992K822
50353B602822N966J0052J4414J9457K5081L0254L4347L7906M1733M5614M8326
50342B915972M8870M7664M6168M5090M3178L8450L0420K0437R921p75j1820k3328
50330C210247l5631m8967o2367p3701q1470q5878q7767q7388q4839q0713p5437
50319B406089o8601n9932n0438m1613l3791k5937j6998p010K834J0806J5735J7841
50307B148985J8056J6288J1369L231n855j3469j9686k6342l4051m1457m7348n1908
50295A957813n5485n7286n6241n2494m7483m2918l9957l8728l8116l6403l2830
50284A459872k8386k4668k2090j9686j6605j3266j0739r309q161o470m333k336
$$ plain form
50272 1293823 1293277 1294894 1299396 1307064 1317425 1329685 1343387 1358734 1376358 1396518 1418417 1440649
50260 1440649 1462581 1484914 1508461 1532808 1556958 1581033 1606331 1633400 1660929 1687052 1711115
50249 1711115 1733518 1754360 1773207 1790058 1805568 1819911 1831934 1839854 1842612 1840410 1834405 1826197
50237 1826197 1817063 1806977 1794574 1778922 1761343 1744508 1729302 1713526 1694493 1672215 1648879
50226 1648879 1625710 1601880 1576735 1551602 1528526 1508135 1489639 1472223 1455528 1439164 1422618
50215 1422618 1405505 1387406 1367838 1346908 1325537 1304340 1282819 1260516 1238454 1218418 1201019
50204 1201019 1185507 1171259 1158374 1146950 1137019 1129324 1124893 1123475 1123491 1123907 1125051 1127114 1129133 1130354
50190 1130354 1131581 1133992 1137184 1139519 1140081 1139387 1138392 1137643 1137254 1136886 1135777 1133556 1131035 1129474 1128908 1127797
$$ packed form
50272A293823n46J617M502P668J0361J2260J3702J5347J7624K0160K1899K2232
50260A440649K1932K2333K3547K4347K4150K4075K5298K7069K7529K6123K4063
50249A711115K2403K0842J8847J6851J5510J4343J2023P920K758k202o005q208
50237A826197r134j0086j2403j5652j7579j6835j5206j5776j9033k2278k3336
50226A648879k3169k3830k5145k5133k3076k0391j8496j7416j6695j6364j6546
50215A422618j7113j8099j9568k0930k1371k1197k1521k2303k2062k0036j7399
50204A201019j5512j4248j2885j1424r931p695m431j418J6M16J144K063K019J221
50190A130354J227K411L192K335N62o94r95p49l89l68j109k221k521j561n66j111
$$ plain form
50174 1127797 1124613 1119332 1113207 1107399 1102099 1096780 1091107 1085559 1081077 1078038 1075763 1073191 1069856 1066095
50160 1066095 1062602 1060091 1059029 1059278 1060210 1061644 1064410 1069290 1075547 1081296 1085563 1089204 1093447 1098211
50146 1098211 1102532 1106141 1109646 1113160 1115597 1115760 1113685 1110454 1106943 1103192 1098782 1093324 1086603 1078805
50132 1078805 1070855 1064032 1058842 1054484 1049740 1044090 1037570 1029884 1020522 1009885 999596 991163 984603
50119 984603 978693 972266 964945 956878 948360 939862 932091 925695 920779 916786 913071 909754 907782 907744 908663
50104 908663 908546 906386 903140 900275 897705 893765 887139 878250 868696 859813 851949 844713 837556 830229
50090 830229 822883 815687 808436 800848 793307 786907 782491 779961 778802 778886 780163 781832 782718 782721 783148 785087
50074 785087 787926 790061 790766 790784 791263 792759 795293 798685 802542 806307 809722 813282 818243 826148 837782
$$ packed form
50174A127797l184n281o125n808n300n319n673n548m482l039k275k572l335l761
50160A066095l493k511j062K49R32J434K766M880O257N749M267L641M243M764
50146A098211M321L609L505L514K437J63k075l231l511l751m410n458o721p798
50132A078805p950o823n190m358m744n650o520p686r362j0637j0289q433o560
50119I84603n910o427p321q067q518q498p771o396m916l993l715l317j972l8R19
50104I08663j17k160l246k865k570l940o626q889r554q883p864p236p157p327
50090H30229p346p196p251p588p541o400m416k530j159Q4J277J669Q86LM27J939
50074G85087K839K135P05J8M79J496K534L392L857L765L415L560M961P905J1634
$$ plain form
50059 837782 852064 866329 878490 888872 899204 910127 920837 931094 941990 954089 966234
50048 966234 977268 987748 998696 1009536 1018804 1026298 1032996 1039119 1043979 1047633 1051029 1054280 1056391
50035 1056391 1057227 1058265 1060570 1063361 1065554 1067626 1070763 1075017 1079676 1084988 1092102 1101294 1111418 1121334
50021 1121334 1131012 1140837 1150564 1159608 1168060 1176879 1186934 1198211 1210224 1223101 1237838 1255220
50009 1255220 1274801 1295262 1315546 1335212 1353958 1371574 1388319 1404626 1420287 1434624 1447778
49998 1447778 1461169 1476125 1492390 1508278 1522072 1533169 1542322 1550957 1559894 1568578 1575861 1581395
49986 1581395 1585544 1588026 1587721 1584306 1579106 1573641 1568007 1561353 1553315 1544113 1533751 1521964 1508793
49973 1508793 1494469 1479006 1462515 1445719 1429540 1414226 1399378 1384584 1369607 1354284 1338837
$$ packed form
50059H37782J4282J4265J2161J0382J0332J0923J0710J0257J0896J2099J2145
50048I66234J1034J0480J0948J0840R268P494O698O123M860L654L396L251K111
50035A056391Q36J038K305K791K193K072L137M254M659N312P114R192J0124R916
50021A121334R678R825R727R044Q452Q819J0055J1277J2013J2877J4737J7382
50009A255220J9581K0461K0284J9666J8746J7616J6745J6307J5661J4337J3154
49998A447778J3391J4956J6265J5888J3794J1097R153Q635Q937Q684P283N534
49986A581395M149K482l05l415n200n465n634o654q038r202j0362j1787j3171
49973A508793j4324j5463j6491j6796j6179j5314j4848j4794j4977j5323j5447
$$ plain form
49962 1338837 1324076 1310768 1299015 1288694 1280130 1273665 1268754 1264262 1259596 1255045 1251051 1247669 1244835
49949 1244835 1242734 1241816 1242493 1244559 1246893 1248268 1248751 1249570 1251109 1251852 1250211 1246735 1243366 1240894 1238393
49934 1238393 1235020 1231018 1226678 1221446 1214660 1206461 1197502 1188292 1179170 1170471 1162358 1154790 1147697 1140908
49920 1140908 1133939 1126433 1118846 1112164 1106776 1102009 1096766 1090248 1082225 1073247 1064488 1056560 1048378 1037877
49906 1037877 1024030 1007599 989977 972193 955188 939986 926785 914539 902130 889652 877993
49895 877993 867433 857213 846351 834464 821738 808422 794512 780131 766144 753897 743916 735291
49883 735291 726953 719128 712529 706471 699233 690555 682332 676141 671278 666240 661116 657267 655302 654652
49869 654652 654816 655610 656192 655252 652760 650642 650978 653882 657517 659886 660278 659323 658185 657640 657644 657660 657476 657639
$$ packed form
49962A338837j4761j3308j1753j0321q564o465m911m492m666m551l994l382k834
49949A244835k101r18O77K066K334J375M83Q19J539P43j641l476l369k472k501
49934A238393l373m002m340n232o786q199q959r210r122q699q113p568p093o789
49920A140908o969p506p587o682n388m767n243o518q023q978q759p928q182j0501
49906A037877j3847j6431j7622j7784j7005j5202j3201j2246j2409j2478j1659
49895H77993j0560j0220j0862j1887j2726j3316j3910j4381j3987j2247r981q625
49883G35291q338p825o599o058p238q678q223o191m863n038n124l849j965o50
49869F54652J64P94N82r40k492k118L36K904L635K369L92r55j138n45MJ6j84J63
$$ plain form
49851 657639 658965 661596 664684 667176 668939 670888 673733 676694 677851 676013 672081 668352 666447 666015
$$ packed form
49851F57639J326K631L088K492J763J949K845K961J157j838l932l729j905m32
$$ [...]
##END NTUPLES=NMR SPECTRUM
##END=
