
##TITLE=AC1194_MCiAH12046_7165515_KZ9By2GxYe
##JCAMPDX= 6.0         $$ Bruker NMR JCAMP-DX V2.0
##DATA TYPE= NMR SPECTRUM
##DATA CLASS= NTUPLES
##ORIGIN= BRUKER
##OWNER= Administrator
$$ 1.72 TOPSPIN		Version 2.1
$$ 2012-12-02 01:29:23.378 -0500  Administrator@X
$$ Compression mode = diff/dup
##.OBSERVE FREQUENCY= 400.02188249412
##.OBSERVE NUCLEUS= ^1H
##.ACQUISITION MODE= SIMULTANEOUS (DQD)
##.ACQUISITION SCHEME= undefined
##.AVERAGES= 8
##.DIGITISER RES= 22
##SPECTROMETER/DATA SYSTEM= spect
##.PULSE SEQUENCE= zg30
##.SOLVENT NAME= COFFEE_meoh
##.SHIFT REFERENCE= INTERNAL, COFFEE_meoh, 1, 14.98509
##AUDIT TRAIL= $$ (NUMBER, WHEN, WHO, WHERE, PROCESS, VERSION, WHAT)
$$ ##TITLE= Audit trail, TOPSPIN		Version 2.1
$$ ##JCAMPDX= 5.01
$$ ##ORIGIN= Bruker BioSpin GmbH
$$ ##OWNER= Administrator
$$ $$ E:\/data/COFFEE/nmr/AC1194_MCiAH12046_7165515_KZ9By2GxYe/10/pdata/1/auditp.txt
$$ ##AUDIT TRAIL=  $$ (NUMBER, WHEN, WHO, WHERE, PROCESS, VERSION, WHAT)
(   1,<2012-12-02 01:29:15.159 -0500>,<Administrator>,<X>,<go>,<TOPSPIN 2.1>,
      <created by zg
	started at 2012-12-02 01:28:08.519 -0500,
	POWCHK enabled, PULCHK disabled,
       configuration hash MD5:
       86 BA 57 50 F2 9D 5C 9B 26 00 A9 28 5F 66 2E 89
       data hash MD5: 64K
       4D AD 2B E4 22 EB 66 06 52 C6 2F 5B AD 6B FE 23>)
(   2,<2012-12-02 01:29:18.237 -0500>,<Administrator>,<X>,<proc1d>,<TOPSPIN 2.1>,
      <Start of raw data processing
       efp LB = 0 FT_mod = 6 PKNL = 1 PHC0 = 0 PHC1 = 0 SI = 32K 
       data hash MD5: 32K
       2B B7 E8 53 64 EC A0 25 0A 83 34 99 9C 18 F7 5C>)
(   3,<2012-12-02 01:29:18.706 -0500>,<Administrator>,<X>,<proc1d>,<TOPSPIN 2.1>,
      <pk PHC0 = 96.83899 PHC1 = 0 
       data hash MD5: 32K
       DE B4 9B 59 A1 01 D8 3D CD 23 1B D1 48 D6 CF C1>)
(   4,<2012-12-02 01:29:18.956 -0500>,<Administrator>,<X>,<proc1d>,<TOPSPIN 2.1>,
      <abs ABSG = 1 
       data hash MD5: 32K
       28 97 4B 2E F9 D5 79 E7 CF 6E 1C BD 56 7C 9B EE>)
(   5,<2012-12-02 01:29:19.097 -0500>,<Administrator>,<X>,<proc1d>,<TOPSPIN 2.1>,
      <abs ABSG = 2 
       data hash MD5: 32K
       94 BE DD 5F 79 79 BD 8F 7E 75 20 40 FB F0 D6 DD>)
(   6,<2012-12-02 01:29:19.253 -0500>,<Administrator>,<X>,<proc1d>,<TOPSPIN 2.1>,
      <abs ABSG = 3 
       data hash MD5: 32K
       86 D3 40 2B 12 BD 13 39 0D 45 E5 9A CB 1E DF A4>)
(   7,<2012-12-02 01:29:19.394 -0500>,<Administrator>,<X>,<proc1d>,<TOPSPIN 2.1>,
      <abs ABSG = 4 
       data hash MD5: 32K
       6E 55 6B D4 D9 87 B5 F1 24 C1 EB E2 6F CD 1C 4A>)
(   8,<2012-12-02 01:29:19.534 -0500>,<Administrator>,<X>,<proc1d>,<TOPSPIN 2.1>,
      <abs ABSG = 5 
       data hash MD5: 32K
       94 12 E7 1F 8C CB FC BA 08 55 75 EC CC 1E CD BE>)
$$ ##END=
$$ 
$$ $$ hash MD5
$$ $$ 93 A3 40 27 60 6E 72 CD B5 CA C4 CF 7A 57 4A C5
##$RELAX= 
##$RELAX= 
##$RELAX= 
##$RELAX= 
##$RELAX= 
##$RELAX= 
##$RELAX= 
$$ Bruker specific parameters
$$ --------------------------
##$DU= <E:\>
##$EXPNO= 10
##$NAME= <AC1194_MCiAH12046_7165515_KZ9By2GxYe>
$$ [...]
##$TP= (0..7)
150 150 150 150 150 150 150 150
##$TP07= 0
##$TPNAME0= <>
##$TPNAME1= <>
##$TPNAME2= <>
##$TPNAME3= <>
##$TPNAME4= <>
##$TPNAME5= <>
##$TPNAME6= <>
##$TPNAME7= <>
##$TPOAL= (0..7)
0.5 0.5 0.5 0.5 0.5 0.5 0.5 0.5
##$TPOFFS= (0..7)
0 0 0 0 0 0 0 0
##$TUNHIN= 0
##$TUNHOUT= 0
##$TUNXOUT= 0
##$USERA1= <user>
##$USERA2= <user>
##$USERA3= <user>
##$USERA4= <user>
##$USERA5= <user>
##$V9= 5
##$VALIST= <valist>
##$VCLIST= <CCCCCCCCCCCCCCC>
##$VD= 0
##$VDLIST= <DDDDDDDDDDDDDDD>
##$VPLIST= <PPPPPPPPPPPPPPP>
##$VTLIST= <TTTTTTTTTTTTTTT>
##$WBST= 1024
##$WBSW= 4
##$XGAIN= (0..3)
0 0 0 0
##$XL= 0
##$YL= 0
##$YMAX_a= 663193
##$YMIN_a= -558445
##$ZGOPTNS= <>
##$ZL1= 120
##$ZL2= 120
##$ZL3= 120
##$ZL4= 120
##$ABSF1= 14.98509
##$ABSF2= -5.573092
##$ABSG= 5
##$ABSL= 3
##$ALPHA= 0
##$AQORDER= 0
##$ASSFAC= 0
##$ASSFACI= 0
##$ASSFACX= 0
##$ASSWID= 0
##$AUNMP= <proc_prof1d_extract_pilot.lims>
##$AXLEFT= 0
##$AXNAME= <>
##$AXNUC= <1H>
##$AXRIGHT= 0
##$AXTYPE= 0
##$AXUNIT= <>
##$AZFE= 0.1
##$AZFW= 0.1
##$BCFW= 0
##$BC_mod= 0
##$BYTORDP= 0
##$COROFFS= 0
##$CY= 15
##$DATMOD= 1
##$DC= 0
##$DFILT= <>
##$DTYPP= 0
##$F1P= 0
##$F2P= 0
##$FCOR= 0.5
##$FTSIZE= 32768
##$FT_mod= 6
##$GAMMA= 0
##$GB= 0
##$INTBC= 1
##$INTSCL= 1
##$ISEN= 128
##$LB= 0
##$LEV0= 0
##$LPBIN= 0
##$MAXI= 10000
##$MC2= 0
##$MEAN= 0
##$ME_mod= 0
##$MI= 0
##$NCOEF= 0
##$NC_proc= -8
##$NLEV= 6
##$NOISF1= 0
##$NOISF2= 0
##$NSP= 0
##$NTH_PI= 0
##$NZP= 0
##$OFFSET= 14.98509
##$PC= 1
##$PHC0= 96.83899
##$PHC1= 0
##$PH_mod= 1
##$PKNL= yes
##$PPARMOD= 0
##$PPDIAG= 0
##$PPIPTYP= 0
##$PPMPNUM= 2147483647
##$PPRESOL= 1
##$PSCAL= 4
##$PSIGN= 0
##$PYNMP= <proc.py>
##$REVERSE= no
##$SF= 400.02
##$SI= 32768
##$SIGF1= 0
##$SIGF2= 0
##$SINO= 400
##$SIOLD= 32768
##$SPECTYP= <>
##$SREGLST= <1H.CDCl3>
##$SSB= 0
##$STSI= 32768
##$STSR= 0
##$SW_p= 8223.68421052631
##$SYMM= 0
##$S_DEV= 0
##$TDeff= 65536
##$TDoff= 0
##$TI= <>
##$TILT= no
##$TM1= 0
##$TM2= 0
##$TOPLEV= 0
##$USERP1= <user>
##$USERP2= <user>
##$USERP3= <user>
##$USERP4= <user>
##$USERP5= <user>
##$WDW= 1
##$XDIM= 32768
##$YMAX_p= 470395459
##$YMIN_p= -740189
##$CURPLOT= <Network HP LaserJet P1505>
##$CURPRIN= <$Network HP LaserJet P1505>
##$DFORMAT= <normdp>
##$LAYOUT= <+/1D_H.xwp>
##$LFORMAT= <normlp>
##$PFORMAT= <normpl>
##$SURQMSG= 1
$$ End of Bruker specific parameters
$$ ---------------------------------
##NTUPLES= NMR SPECTRUM
##VAR_NAME=  FREQUENCY,     SPECTRUM/REAL,   SPECTRUM/IMAG
##SYMBOL=    X,             R,               I
##VAR_TYPE=  INDEPENDENT,   DEPENDENT,       DEPENDENT
##VAR_FORM=  AFFN,          ASDF,            ASDF
##VAR_DIM=   32768,         32768,           32768
##UNITS=     HZ,            ARBITRARY UNITS, ARBITRARY UNITS
##FACTOR=    0.250966925370066, 1,           1
##FIRST=     8223.43324360094, -134750,      -79823
##LAST=      0,             -22181,          -59545
##MIN=       0,             -740189,         0
##MAX=       8223.43324360094, 470395459,    0
$$ Real data points
##PAGE= N=1
##DATA TABLE= (X++(R..R)), XYDATA
$$ [...]
23769 -21826 36358 153313 -41407 -176246 4562 23287 3080 -301184 -253708 31316 174827
23758 174827 57432 57773 111539 117914 -185171 -87858 61249 -251968 -106431 -129480 90067
23746 115559 297720 -105915 -34225 -32645 112834 -75073 323496 -43796 99037 -221962 -41876
23734 193359 -113326 -273969 -201676 117669 141856 -52284 424107 55216 -52594 52480 -153830
23722 40384 -242579 104837 59431 69575 136674 -58769 158052 94188 131351 -60817 173030
23710 -14167 175399 -67838 27095 -132302 -136917 36606 105720 -23687 183626 6146 -358041
23698 -392549 -89853 35150 -45036 -225129 -19364 -84618 247938 149098 -225153 -224564 289176
23686 -290444 249364 54039 -26904 -5626 -41963 -293812 171568 20319 -245922 -324746 -228417
23675 -228417 -16455 6822 -149003 -236992 62348 76165 -28252 138209 14042 270377 -173827
23663 -98269 204519 181854 172905 20133 65778 -447167 160163 -92298 -99038 19508 96159
23652 96159 246139 -196975 67301 -56162 37626 72863 99105 -77348 -37727 34602 156592
23641 156592 -175250 52428 82505 290615 -89793 -190835 -55591 -71737 -23993 -26223 11179
23629 129608 -55949 233829 91135 -493389 242087 238162 16842 21736 229087 -42670 -50649
23618 -50649 52693 67631 13507 -165854 119393 -63622 49470 -166265 -78016 -64950 -80093
23607 -80093 -13851 -77521 -307164 116938 -117244 -154578 -21799 -130243 156931 -249714
23596 284533 885 57615 -127889 93442 32655 -7883 60850 191433 176454 409561 -14010
23584 162363 -167527 -29056 219298 -87768 90227 167368 -177551 -154385 -120965 -462399 402853
23572 139205 19610 75508 299803 345820 -78804 -75686 -263415 -158600 23238 135788 63203
23560 119026 -269781 -185092 475540 -236516 204652 -36823 -106979 -71834 232113 -159364
23549 43689 -31200 -110917 74120 -82342 -105278 65573 -40000 -17677 -226026 243784 199661
23538 199661 141539 -234747 82443 -261318 -186733 -231682 -37151 -149605 -8896 25158 -93697
23526 -29316 -382653 69040 18848 -200407 80180 124264 181592 73111 -298326 -85166 -33351
23514 -411495 -227876 -287110 240784 -88255 191282 227186 -327498 91341 -96828 -46598 13490
23502 62956 -25485 -57668 65557 -56861 -162975 -206159 -96368 126096 -50084 -80315 -374039
23491 -374039 -102354 150393 -229479 -6404 140784 207275 -84787 -43674 -57452 165091 160829
23480 160829 -174504 -173273 -162364 -60426 -184596 17600 -30887 241704 -165860 123942 186604
23469 186604 -124190 142622 -1495 -17512 -9104 -95980 107655 -172806 -2684 198121 -9319
23457 477098 131610 -15578 -45596 -251069 43357 -124931 259088 -7274 -284318 -158001
23447 -158001 301050 -273755 -159891 89298 166581 -101360 -126825 -200206 198260 138256
23437 138256 -461921 100678 232066 -254618 -6972 -72607 61565 -116998 -180233 -88307 464248
23425 -287513 38049 -91550 40242 -164560 9147 -79199 -125603 -215549 -204797 -211310 -9543 77748
23412 -305757 -44182 -45412 -116174 -119745 -98362 24551 1102 -280142 -189366 52839 286 -92648
23399 -309489 -129999 200729 12637 64202 49425 90841 163327 68813 -190595 -117259 -240286
23388 -240286 -125168 -182135 65971 -11584 -141310 86605 -111347 -62840 -33980 8443 -99647
23376 -32664 -267284 26120 -106747 -18979 16048 -124910 -98296 99957 41577 -27519 242065
23364 -47532 226516 -143548 15730 224373 118578 177139 10543 260115 -127150 130872
23353 182898 77033 -311664 39531 -136037 17181 139312 -112169 244924 56626 -286114
23342 112749 -417522 65896 -161490 237477 -61026 -117985 48600 -20388 105811 -27765 -176340
23331 -176340 110846 40201 -226707 -114918 157051 -117709 -186796 -18853 -18093 -60342 -236116
23320 -236116 255334 324018 88345 214189 -171047 -465315 -180494 -73945 430228 -241629
23309 -396545 129009 -437139 -261222 -72614 23789 -196474 -19032 345374 -17093 -241215
23299 -241215 58500 -138603 114206 28321 -219972 242043 144534 -3064 76022 61522 -87807
23287 133486 -107687 94281 -119394 -147133 105283 82625 -52932 71082 -172443 -273015
23277 -273015 -29871 -5601 246307 243354 -195955 79042 -110205 -569 162357 -87824 111054
23265 168981 234502 -22397 11698 -42705 -245941 -66448 144735 -143177 -43899 -261768 -182240
23254 -182240 -179445 13764 -28172 -316251 167174 -12520 72641 24798 -120186 -152369 28975
23242 -77476 -339463 -175674 78358 284303 -5415 -105571 -51729 21712 11791 266818 -88404
23230 70801 109594 99053 27954 -188342 -37037 -6893 -145717 -23100 -162612 -18189 -57653
23219 -57653 -92478 -30462 67094 -387327 50626 31269 -132824 100986 6989 78349 82311
23208 82311 -174942 67788 -220972 129068 -170260 76072 -103142 -146229 130129 -45817
23197 48421 182423 -28471 139709 27610 -145721 -221120 396630 -88968 -110097 106522 109264
23186 109264 98880 -59082 -10726 61394 280090 140179 488046 103910 4486 -153860 163385
23174 -74966 -25830 -252398 136899 82870 85643 9737 -17182 182527 -66717 36056 282731
23163 282731 61130 -127361 -225998 204566 57978 -33353 -160264 124455 -392048 -220194
23153 -220194 -170226 191483 17290 -40009 -43188 -125061 -46556 197568 135142 304524 -247962
23141 -142120 38924 244469 250601 -22880 301091 -145941 -40733 -296217 -119616 373883
23130 -74899 -62858 -242823 -135114 199833 -276265 27178 -162332 -34204 72593 -51213 -208980
23119 -208980 -50354 60384 111465 -430365 111460 -226251 334250 -186480 -237336 -41846
23108 151629 -85374 27732 -30576 -43214 -90526 181223 110705 149802 -52543 62559 13201
23096 -91110 40851 420813 59092 363161 -108442 386995 171801 112431 6674 -4743 12597
23084 34272 -360579 -162940 -19212 -147095 282120 60782 -37159 -66296 -176930 -86310 15336
23072 -157716 102027 -112200 -244782 -246477 -44357 -118732 159488 -25473 224250 28706 134583
23061 134583 -131242 -302965 -290006 -172487 -54162 173489 123019 -160176 -34059 151850
23050 110230 295652 304072 -98330 -105611 -259542 -14482 -114400 -85933 177189 191181 -321644
23038 269552 60741 -152476 -25992 -365697 333818 283864 221235 -108264 102585 30405
23027 327388 285952 -292771 -66495 154957 -96410 24197 -126139 -203791 -141462 465958 180411
23015 -308324 -73002 177243 -120827 -4372 413078 21267 -148346 -93531 69298 77078 -121042
23003 -117483 55228 -291841 -66915 -104030 370893 23621 -132273 -90498 -86367 -284055 133301
22991 -23057 -67649 17275 -127729 246768 -82019 180175 -156140 143422 -129114 -60732
22980 -31969 13837 -42494 -338651 -312945 -251764 114022 -234358 89660 -249927 -17327 -167890
22969 -167890 -209195 91209 518267 39409 -194626 62897 -112876 94529 4107 -64174 -70754
22958 -70754 -97489 -68257 138830 -386506 133811 165241 226559 -284748 -286377 -61628 51498
22946 34671 -67578 50437 45264 59738 -322164 163294 -406334 10576 -45797 241746 205802
22935 205802 -147501 -32445 16092 -72657 104557 -249286 -4006 -289202 440163 141060
22924 -291980 -80794 680 -78917 -94502 237053 153718 224565 275827 -260797 -55115 -76591
22913 -76591 -110903 372266 -91101 81097 -260152 -227664 21613 -32574 54565 -184680 -36652
22901 367229 -366610 62642 69221 -13635 -284923 -314435 -15276 -152442 253887 -184089 -163342
22890 -163342 -313128 260412 -222786 83376 -28864 -173019 -95358 -176326 -107012 95692 -199342
22878 227879 93612 88986 -133209 -168252 -55251 -192382 -75808 39199 -147954 -262211 82860
22866 -324378 -8133 146612 -291954 33739 81417 91313 -110501 -72991 185827 155015 -188657
22854 -62259 28306 -53017 164877 -79030 -62631 129920 174820 182900 18312 -210796 -248878
22843 -248878 126663 28781 -89112 -296816 -135578 -25155 -156294 -234684 -15178 310757
22832 -66993 17031 -93254 183431 -8911 90134 -11242 14691 12636 85693 78002 131235 -38555
22819 -101172 -34070 -35800 196685 95031 -220899 248130 -324153 31251 130461 -60291 -346963
22808 -346963 45752 101516 -389068 -83763 -121908 142 -22915 13538 116937 -66526 157995
22796 276050 -67205 41001 472280 -100177 -124416 -111568 214462 46126 -172226 148340
22785 -22950 -168242 -325095 -227566 -9396 -85711 -347720 -41811 -82946 -237151 -151211 120135
22773 -242182 -213192 85288 40225 -154754 182888 140543 -174523 37078 290314 31186 -177482
22761 -176350 -133384 152694 56788 15427 182005 58074 -14743 -19367 -52690 79833 -302666
22749 -362162 -21374 -102376 -121136 -215020 20898 183214 24179 -275137 -43758 -71128 -147369
22738 -147369 -59461 -34308 160048 -182635 -170694 -85690 122740 -66906 -93555 291 -58046
22726 -76047 132757 1206 -215920 -145296 -145728 -109556 -249893 57074 61118 52800 -95282 -50557
22714 -50557 -290298 -113194 108871 39845 166806 -89153 46645 -190727 200894 -22809
22703 -14971 -53045 -49482 -181942 267464 -101018 106730 -85193 114731 294193 17557 7677
22691 -333011 -254842 -397951 2056 -240739 -175759 365467 106986 114490 -175008 -379078 -240043
22680 -240043 -188541 93289 -178891 369722 -215058 -79408 297600 72760 123808 -11833 69142
22668 29926 27212 484844 48758 84594 13411 -37618 -47893 112495 -369950 44999 -285543
22656 233735 250262 -15206 -314683 73902 7713 -36877 -536574 27232 -578 15401 -74973 -52442
22644 -52442 -143495 203581 -155434 -91971 54419 -12884 -119084 -104216 -110207 -61181 82616
22632 -149224 46411 -29042 -24918 -19690 191101 179727 67346 61855 -50958 -384453 181895
22620 -31311 -22297 113476 -219394 -124416 -104845 -95494 -125601 -121273 -339496 49146 59080 -33767
22607 -215698 -26906 -135213 -244856 -26735 2030 4900 -165541 249226 119483 -65630 -99700
22596 -99700 -241368 -183410 -301180 -223947 -89770 -131583 14997 -80854 -11328 -235338 -149363
22585 -149363 -330757 -113643 -94999 232774 -244753 -45567 -89007 -241965 -286845 -161942
22575 -161942 87846 -307470 20586 149769 -255263 135971 49648 -21567 -88758 22028 149286
22564 149286 -159980 -500649 217878 -66235 237613 203915 -150104 -68446 -108679 -181226
22554 -181226 -188287 85062 -210797 -193000 111026 177002 297665 43898 -166258 -241721 -315290
22543 -315290 40516 99622 206413 -240081 -67231 -65399 -102304 54033 28172 -203114 77103
22531 -289237 -64229 -87154 -236480 -16562 129141 -137584 -22913 60899 155687 -120017 71468
22519 151327 14026 -146387 -107540 -47560 -494456 265159 60522 -216733 139559 353514
22509 353514 -272182 100050 70779 -202098 -277355 48193 -59896 22602 408397 140676
22498 193052 93970 127780 -48335 119827 -72472 -267596 91527 -40313 15800 -28398 -32785
22487 -32785 -391900 -450 -106464 -266674 47112 -1804 -209575 275745 -190450 123029 -740189
22475 127524 -174534 153078 -195525 116553 -349520 321657 -107687 -11336 -14701 -74255
22465 -74255 -13806 177110 -180452 167726 -140377 -320773 -25494 -335100 -16701 65190
22454 -59691 -69769 73150 86067 -245478 -1189 105946 107613 197839 83780 43913 -103836
22442 -296472 -269613 -444099 136646 -27540 -125448 166288 -344799 -43143 -7650 -36789 -33778
22431 -33778 129184 -59016 -239634 172383 -26462 29247 219391 282340 2723 28691 90676
22420 90676 -514861 -361036 37375 -202420 -96181 -175298 -180674 -113683 473023 -135647 18081
22408 -262828 80960 -92283 -66396 -56131 -9561 10333 -303484 188330 -87865 -493 -62493 -114477
22396 -114477 -443231 57413 276614 -85398 -149615 111442 -173264 165128 20483 110508
22386 110508 94368 -172261 -52969 -111885 -34478 -276359 262679 17600 -45959 126341 12483
22374 171669 -61467 81866 406462 383 -27833 31167 -177704 -118007 -209611 -125514 -143702
22363 -143702 -167787 -57250 -34571 125526 345846 -40578 -192905 135637 -191661 -39320
22352 -152274 -51612 -74311 -60344 -33046 -59342 -420369 -236128 142027 62461 -393732 152063
22340 22852 -195957 -160340 -224173 130839 -151467 -40443 -82508 -55908 72666 -175565 -184091
22329 -184091 -213337 -75459 53231 -224589 -51098 -193342 -224697 61619 152542 39029 -269253
22317 -70683 -245909 273838 145017 173228 -265966 56189 -243014 178111 -233657 -183859
22307 -183859 -47080 -314787 -95714 -308187 195950 -288200 -153413 -111415 -183971 302140
22296 124483 -253178 -273017 392686 128458 -278367 145052 20384 -96397 264348 48120
22285 -204800 -259929 -253440 -127385 -24922 -157057 136483 13865 -55004 207546 197685 -66897
22273 80420 74296 146065 144117 63164 -50230 -95534 79153 -259224 49326 65666 -309828 -365433
22261 -365433 -69875 -119239 107469 -195414 -82885 -11647 -103262 -8898 -133413 -173813 162714
22249 -252136 -274259 -218943 -259 -4464 -77272 -1349 -389932 1671 -260778 177914 -73134 -155532
22237 -155532 -255038 -65718 153148 176879 -168443 -170115 216519 -193143 -236062 169202 -13232
22225 -123020 -83427 142800 -105713 155228 -118448 -91697 -348824 108618 -302620 26266
22214 -77144 -127134 162558 109928 240627 -66886 54391 185972 -26442 473397 14346 -89594
22202 -133486 -168927 -342497 208667 -154236 -64439 169128 90261 -68074 -293071 48419
22191 -168400 143732 9839 -86133 -219092 327128 175915 -72341 -49916 333152 303771 43575
22179 132111 -328208 -125556 -91640 -151435 -196838 174129 81315 -4673 -9271 -97383 -8092
22167 -316237 -327680 -715 -371488 122993 30628 73270 -241863 -77560 -113291 217416 86573
22155 -196852 -113665 -294410 215589 -104010 325243 -116662 -111804 183266 -147877 488827
22144 58585 42128 -79762 -541946 400896 -7276 45322 202715 94478 -546619 -187263 -62427
22132 -58442 25350 -118287 -299527 -173032 435311 -144078 -13483 1698 65154 -221372 -264393
22121 -264393 -73819 34353 -213832 122216 140945 14863 -27763 66168 139152 103816 -320872
22109 -281651 91102 182014 -86613 -128276 -520894 279842 -102237 -241074 -242087 132217 -151476
22097 -200796 -86688 166521 96643 -449889 -322631 105869 -114755 -124487 -391526 -235021
22087 -235021 -131201 257933 -106998 -38444 73983 -67349 -87278 -131306 -40906 -105424 2542
22075 -403873 51331 773 -60834 -40663 -74356 263770 -380116 -10715 -170352 -175436 -345021
22064 -345021 -57715 -42149 -81390 -98519 -109327 -91077 -173367 -191197 -250371 61163 -136451
22052 -188592 -12579 106192 208660 205705 147401 -350328 170912 -357377 69226 -8828 -81189
22041 -81189 -26446 -130893 86321 -118289 13362 -183934 -94765 -226495 -171076 -147242 267835
22029 196075 -109559 -172566 -89643 72027 -168466 -140723 171950 -162139 89996 -106414
22018 -7037 -28550 -152886 -80335 44474 228008 96650 -261403 -84188 -9155 -366440 78339
22006 -319063 -227353 -163129 3479 -231176 -48384 -15949 -184306 2188 -262701 -271155 -352132
21995 -352132 -86854 -282102 16778 -58540 -242519 -99534 -68484 43802 95451 317537 -27221
21983 69840 -39534 -207687 80071 -160657 62701 -76973 -35846 -11221 -160587 -354226 -58206
21971 -134605 60587 -381040 149748 239161 -205567 -320065 -336563 -192706 -53902 34091
21960 -238112 -130019 -328089 -36475 -121662 -148188 -134392 70269 -111548 -97207 -131106 -25142
21948 81594 -251160 -129826 -363738 -108063 63125 -17983 13816 42312 -377513 55090 -322639
21936 236365 15357 11694 -95425 -260004 61855 90930 -120100 -241053 51709 18595 30670
21925 30670 103857 189215 131927 -190884 109279 98102 118395 -160344 -138760 -247776 -320269
21914 -320269 9915 -56599 -195126 54866 60374 24182 -115605 88568 21686 -549825 -228439
21902 -224267 -11389 129754 -55565 -177316 15914 -41042 -171711 -376370 131361 25806
21891 -159930 -285881 -136844 -69764 -225687 -30264 -21350 212160 -242602 -148690 -67362 226604
21879 -168334 64989 -70151 -442173 166193 -303285 -183494 55863 183608 219391 -204452
21868 132946 -98106 91651 37598 54560 -35389 -276848 -66399 123281 -97147 -4353 -40131
21857 -40131 120849 -146122 -66826 -15986 -15385 5037 -164590 -70351 381058 2195 277506
21846 277506 -77957 -276666 -82876 -117610 157885 106785 155463 -121996 169381 -10482 42232
21834 81022 34725 -387975 -15310 -92757 55941 -204380 246353 -66585 122020 109897 218045
21823 218045 94500 -346196 -66683 -264539 -186984 251521 -194939 41111 -253504 85408
21812 36827 -217375 -193328 -210158 114327 -229530 270284 -93654 -109736 -215009 -154269 -12209
21800 -268045 -9610 -174279 -326126 -163600 -128362 122501 -9903 140807 -447297 -148428
21789 135082 89351 -227993 32742 -23879 437164 -64974 -185122 -28873 -380322 7203 248287
21778 248287 -57549 -3354 -22759 136756 -146010 -183013 158136 291430 -39349 -84891 -119436
21767 -119436 -75600 -287285 10878 142857 94687 -432410 78758 -6612 -350150 -226955 -119052
21756 -119052 -22375 244893 53074 -398283 5205 102060 47377 -36321 149475 64662 46255
21745 46255 131276 -245975 -132368 -28081 35286 -43024 22671 -163217 -267177 -78901 119520
21733 -92737 -52892 -420454 114943 -155674 -263369 144533 30674 -213495 -226119 -217969 -180407
21722 -180407 206040 -299279 46208 -80315 40658 -154978 108380 -21989 62286 -233272
21711 -168170 62540 -10372 -82998 88307 -189330 102934 -118469 -105829 -350193 186355
21700 -305244 89788 -28361 40023 160961 137553 251960 -222780 -184503 62845 -248982 -13689
21688 -168179 130817 -29860 104299 -70468 -20319 -186108 139594 157626 -313655 -21135
21677 -90709 -117580 -24015 -79294 -24989 -47512 -7904 72727 -277719 34653 -311810 -10444
21665 -84346 185955 -304014 147758 33011 -53737 61414 75908 -212274 197491 -499464
21654 -383554 90059 145482 33690 -126644 -54401 -195459 -112714 190277 -12155 86241 79247
21643 79247 -113285 -407073 -166060 -6084 -183243 -302599 216059 -112332 115062 -153445
21632 228432 19296 249326 -70472 26655 -405641 7158 361465 245585 56377 -74553 42353
21620 -167365 43805 -17415 -105750 -235469 -294285 -158090 -114769 -16993 -138389 -160621 -75716
21608 -219669 84414 325083 -205164 235251 -221646 105696 -136891 19158 129335 -18989
21597 307911 -434531 338119 115721 -700803 127396 -188931 -164275 -34473 -199279 283585
21586 -89188 -248308 10008 -83669 -25151 -181672 95316 12300 28811 -56927 -222332 25881
21574 -275872 -200774 -246176 -211904 64194 -225113 -223786 -50830 426480 108058 -12006 20697
21562 -298510 143840 -40260 118839 327 -87203 -40189 -95392 151820 367574 -98984 -160053
21551 -160053 -90562 311011 5027 88438 102471 -42417 -3622 -155264 -10383 250455 -493576
21539 -149147 -363848 -63146 -239612 33278 -235613 -165391 -112538 -205430 -13057 -166584 -509
21527 -72326 83634 -1411 -211404 -91299 -133660 -80804 -224896 297272 178195 -13123 -129829
21516 -129829 -284896 -59735 189618 285268 -10249 101539 -259641 79063 2844 -61740 -219796
21505 -219796 273612 -284411 -197712 -312516 -285551 173142 -240103 184193 -199291 -226427
21495 -226427 -74391 -277607 -296650 -228327 -332586 47694 270251 -60777 -321898 235316
21484 -301728 84539 -83164 -265425 70676 44574 -139956 23269 -209977 -187858 92150 -24503
21472 116868 -82012 -55801 37112 224072 -396819 228995 -138854 -277197 -17537 -157846
21462 -157846 -161427 -187579 -130860 -35148 -37379 -396782 -269300 -25865 -113400 -26939 -45846
21451 -45846 191127 -119038 -217929 -60341 3996 -2289 -156136 -135923 358120 226538 -317833
21439 377019 197968 -58351 84527 274925 561309 304377 575049 104324 287460 115620
21428 -155420 127192 38714 -135018 -52923 102896 -96609 -233788 165620 -66415 -4902 127057
21416 5834 -232524 -213935 160338 -23273 -272943 260520 -80470 -223886 -115973 78946 86618
21405 86618 -314145 -156494 129524 -271343 -145295 87683 52069 55342 118218 314077 66502
21393 -31289 -11366 -154810 -85241 -15011 70980 46944 -13167 174917 -285878 65616 -174361
21381 67033 35404 39111 68701 -219506 -163152 -125282 187651 -8187 -157413 -62050 120378
21369 -41771 -175158 -150036 -296078 107796 -49301 -280934 -166238 -409153 133030 -113259
21358 280617 103681 -408290 82490 -133453 -25829 -256991 11494 -134600 94733 -121563
21347 -186789 -107292 208013 20928 -110209 209152 30724 -61264 360680 -117360 -153996
21337 -153996 -11483 126291 11273 -189653 1929 -70116 -513041 32073 267642 -202635 -387405
21326 -387405 158335 -139542 -213970 -287367 134329 -425354 -158030 -172787 -34864 170694
21315 -4007 -229176 176219 276245 364444 328444 -99826 68925 81235 -427577 101089 -128761
21303 -242494 -221905 -6458 126624 40510 -279338 -68532 -401258 -324982 -137935 -145485 8267
21291 -83718 75979 164826 -140812 839 236677 -61133 -36352 413 4076 356357 -232723 -20835
21278 34865 233582 185471 156394 -225424 25508 -211038 67216 106358 -248597 -42914 -183787
21267 -183787 -200077 -3542 -110435 -76010 -13682 230570 -263330 -165867 -252145 -196607 -102670
21256 -102670 161529 -9287 104829 -131018 74029 104518 -114453 -147207 531 -288857 -201610
21245 -201610 -171868 -218427 -368933 -375798 -236754 -11119 -161265 -105706 -37456 -141638 -55778
21233 -78412 52646 -126167 113395 -158967 -15841 -48696 57808 -406036 -262995 -27080 -154433
21222 -154433 -175572 -36202 93674 -244054 -354847 -140788 -141514 -11882 -145905 -35179 -220329
21211 -220329 -283798 -322998 -26305 -280909 -218346 169445 -4728 -56968 -211167 43462 -67267
21199 -89618 194346 -263965 -44026 -328878 96748 -457706 -22371 127040 -114770 156398
21188 18753 -12963 -78745 -129492 31687 -189600 -108272 -155872 270732 -71807 1700 -109617
21176 -268615 -160266 -64596 -172904 -28467 -263158 -394445 128717 -41646 349171 -11326
21165 -246782 -10768 -235735 -135368 -140861 -83049 -146674 -123051 56776 123493 19062 -162011
21153 -16578 -19291 235205 -405133 26254 -58114 -161514 -142521 -104292 -213626 48926 -106170
21141 -171581 -58350 60001 137690 29517 -392855 -56778 309323 117452 -467893 -137385
21130 -243182 -141986 53810 -296949 -208660 19213 50077 46518 -31635 -69260 -12038 -193696
21119 -193696 22486 -136762 134317 254599 -23353 -119458 20616 -62564 -224752 -211832 19833
21107 -86586 61818 -60562 -206209 477011 -295071 144556 -115167 242915 15818 -232798
21096 -247695 135695 162355 -144542 -326287 -132417 -34263 -85769 -22506 27315 -31243 -401034
21085 -401034 -174512 -141665 32891 -338855 -201570 129157 13845 -226179 -57527 27968
21074 304827 -10507 -81006 -135495 -244373 -169103 -61458 -34532 -102972 -158134 15786 344228
21063 344228 64672 76670 267438 -29855 -134260 -29969 134080 19659 -265276 -9522 -362840
21052 -362840 86131 108028 -283788 -260548 -37759 -94825 43317 -129765 106005 -125357 68445
21040 303049 86680 37458 -28535 -1687 19348 75084 70991 102136 38699 117646 3237 -139784
21027 37781 -298202 -60499 97676 -129805 -58969 -66884 -285661 452230 -80550 -99094 192553
21015 99651 111073 195290 176774 -212979 127941 56996 -30801 96479 4434 770552 455010
21004 455010 61599 186375 175907 -16761 142929 -359289 -187763 -35330 -361014 -132173
20993 172616 -427948 127024 -81454 -275971 -178618 -178491 175405 -164508 72261 -163804 17570
20981 152964 -153932 73829 220963 -13121 135263 -131665 188315 398744 -97431 53129
20970 97969 168061 153325 -460157 67243 -173103 -14245 -13141 -30381 -210867 -78165 -248755
20959 -248755 14823 -113649 55023 13304 -213597 -190859 -186585 -3882 -40249 209042 327304
20948 327304 -199293 94558 108020 148887 297979 420684 490408 76265 377017 266348
20938 266348 504690 -43619 -33498 -246373 129382 -65589 -287275 -68149 358204 -566520
20927 -2357 225910 -45086 -72518 -121915 -65742 120291 -276262 -136910 -242528 -43416 -300642
20916 -300642 -39766 8638 -21779 -113378 -201780 -177691 61055 -196278 390883 59448 -27276
20904 -326055 -198903 163866 116953 -271525 -35441 301239 -118464 193074 -293649 -209336
20894 -209336 -138885 -27013 -70608 -49339 -159760 -162554 -268364 -176592 -338746 -37786 -355662
20883 -355662 -178502 -267962 -231152 -6043 -316111 14404 -270999 -62729 -73919 230533 -295938
20871 -211380 -91653 -39928 9835 225986 75917 38088 -372057 -106891 56315 -50935 42287
20859 -102710 -58657 72335 93720 -143888 -472973 -1218 -40129 -158873 -128551 -15093 -37845
20848 -37845 -150892 111014 -59587 -502324 -114766 -271659 -430029 -179882 257 61452 194538
20837 194538 -270511 13501 43811 2431 -18208 -320004 -167045 44709 -87164 -106542 -126122
20826 -126122 58765 18116 -111366 -204703 185887 -255762 -53243 -50794 -84944 -230463 30201
20814 -210037 -130744 -112651 -26819 -113300 81126 -347481 -223764 49572 -179345 46621 -165362
20802 20647 53951 -220588 218508 209098 -183253 -100820 -267808 105908 69510 -97853 -402903
20791 -402903 101354 -203713 89924 -98651 133288 302291 2809 -172086 -121332 -263284
20781 -263284 428160 -79585 -163323 12016 -220054 -332698 -122646 -268339 -203100 335357
20770 -268784 48934 83894 -233623 -163180 3862 203326 39570 33181 -220785 -101517 -4684
20758 -443287 -205359 -26325 -54562 -229904 -164467 -17671 -173045 -312357 149727 -112974
20747 -68690 -111404 149112 -212103 -20260 -196606 139573 87043 -112007 40487 25964 12509
20735 186720 -36286 181529 84430 -96123 -80281 -236534 -37314 -83469 91386 -79445 -194090
20724 -194090 -85525 126772 193544 -237335 -274907 -110637 -199194 -215860 41179 -246329 7891
20712 -192558 132162 -69270 -87508 -246816 47869 -152954 -141338 -195099 -132897 105449 -292363
20700 -72086 -391672 -337322 -142766 -23585 -342978 -330438 -214164 209163 -259574 194136
20689 115706 -222932 160062 179366 -153891 -189671 77870 115303 -15129 -51038 -177313 95721
20677 -201154 -166192 170294 -98363 15148 -152469 255109 -144893 -78626 198770 62784
20666 49805 -249628 53372 -83491 -303112 87948 258148 104272 100715 -251736 54172 -60920
20654 -66238 -25476 -35580 -74709 -105356 -178043 10633 66032 11124 -306393 -248237 -246449 -79436
20641 -129456 -136253 -28401 -290036 -143778 295861 189618 57957 16250 -57321 7222 153645
20630 153645 -22909 202400 -50399 -212343 -129811 28511 -322912 -162511 -90433 -23405 -211668
20619 -211668 -86072 -120579 -6741 -217625 157224 -206684 -318609 -263384 144925 -21372 -174478
20608 -174478 2241 -161354 20979 -128130 284102 -194832 -426616 -87263 -265005 80407
20597 -104529 -125674 12795 216201 98262 394090 -51293 -165613 8654 66102 -199287 153223
20585 -182095 422829 -184061 56242 -186227 -85549 300042 -165611 130003 -50748 272399
20574 9746 -91299 -70929 172024 -430275 -137498 130087 164629 -195773 275022 70116 -288352
20562 113283 -160626 -41572 -253793 -42472 -205091 147002 -81356 112724 -4563 29760 -339373
20550 -245688 57790 -326840 41257 -272519 -14182 130556 -55666 80859 -56980 -139721 -93917
20539 -93917 -313840 70397 -173855 -247553 -29655 -152035 -315592 -189623 -125887 -154403 -442981
20528 -442981 24736 -64949 189313 77878 -154245 -96690 35199 333322 109893 -253081
20517 -55654 -293714 42773 -67345 -59875 -517076 268916 61647 -144577 -93564 -30155 -55826
20506 -55826 -166325 -253690 -57661 329890 -224993 13006 -194768 3208 67438 89860 -270177
20494 -91731 -95355 114993 -33371 127416 -205444 -124317 -195204 527007 -97514 -106578 60025
20482 -499057 -167060 -104565 -443492 -22602 317413 12594 130935 227171 262420 -153407
20471 -374324 46542 26089 -41492 -66484 347945 -196850 -346256 -134080 146413 8177 36602
20460 36602 -153565 60982 -86269 262654 -59958 -132974 -345242 77546 -155273 -85825 101195
20448 -860 -136501 -364921 186598 -196962 97918 -403376 -65412 -145762 -451952 -140786 -300254
20437 -300254 -98984 205874 -150664 203213 -354622 3195 -45458 195963 -195644 213207
20426 -247602 -45225 40425 -43913 182736 76421 -347029 -185401 -409757 139561 56252
20415 -15758 -62424 -72900 -307473 283711 -97945 -128645 -126246 -172360 -334240 -141729 500022
20403 -356537 -64878 -121151 -44752 -226649 -218824 26483 -18889 -154579 -482206 291702 -240648
20391 28698 -334661 66720 134787 -96493 -271308 -146828 -246718 -292833 -206067 191547 -355420
20379 -118919 22235 -96412 301145 -2586 70810 60147 84276 -189464 -242813 151247 -66400
20367 119418 97019 -238810 15306 191705 -116513 205088 85635 -4369 -7728 160052 -256076
20355 -73370 133751 -144588 -186399 -421510 -29764 7179 -152239 -201050 -258459 -43341 226569
20343 -430778 -23696 -27516 -162030 45944 -72202 -53112 110192 161051 -227606 -39030 95205
20331 194869 342192 -30290 -36786 105951 -253971 -270911 -132229 38324 -323669 -208778
20321 -208778 10663 -234272 17488 -335079 -39773 -337058 69216 -432646 -316821 -26109
20310 -134963 -570221 -196504 76124 -91927 183025 -93905 211294 148598 -164062 62945
20299 -130276 20199 -266207 298932 -90848 190316 -89021 -379430 171239 -101222 7942
20288 40578 -130097 -47277 -144359 -14182 -183168 37627 325520 -149878 -282303 -203088 187275
20276 6994 -8617 -91608 4372 262216 -26672 -269650 -25116 -218349 214027 -102984 -648033
20265 -648033 -116522 -140316 -88280 229240 156996 61522 -220480 -420867 -166843 -143226
20255 -143226 -39810 99499 -39677 -59210 -18223 81616 -85076 -145513 -1959 -29647 -156017
20244 -156017 69579 -396955 -448674 36138 104880 -15636 -396573 -375859 -293922 84363 -144865
20232 192839 30308 262396 -165253 127685 -106127 -251977 222166 229630 -83706 122917
20221 48434 -341598 130559 -75827 -227022 -55232 -116184 47967 151342 135640 59279 -141550
20209 -72778 -111111 -101742 102201 97286 -360951 64068 -52184 -49297 299070 51008 -299773
20197 -105424 -127102 -8419 26439 114102 200449 254336 -238860 154157 -74874 318500 242547
20186 242547 80060 34639 -115148 285311 -92450 -28654 -131161 -67559 -276880 -60646 21687
20174 -71712 -365935 -65654 101610 21872 212825 123221 156673 55291 -311569 118476 -142562
20162 124402 264847 -42444 68330 68086 20399 -66125 -92855 -151610 -133199 240698 -32337
20150 221171 116197 34323 468835 410214 838069 419361 90580 354697 357127 233071
20140 233071 -8897 242112 798161 418817 591931 151123 -77430 240525 -60065 -194667
20130 -194667 -65961 -202988 263773 -202974 173942 189926 -253283 -181641 -35945 -156915
20120 -156915 48296 -488032 -171957 -704537 -36540 29372 -50714 -22370 54572 -267935 -138687
20109 -138687 309132 -27679 -84334 -45247 -287608 -446495 -96474 -60310 101380 -3026 -318463
20098 -318463 -616 34977 -168409 -19057 -41068 -389436 -176801 217049 -327920 -118077 12054
20086 -171624 -48229 -53022 -53915 -18969 196321 -85482 97730 -92116 -51492 127829 -512182
20074 -181792 -122856 -219991 93793 -277630 -200044 -49532 -111546 -20408 12957 -271109 -65337
20062 -31020 9821 17916 -53932 82758 -106769 -27977 -40176 -19967 73530 38488 -270183 64389
20049 -180030 -192666 -246449 -300309 -395394 -19715 -219381 -202300 -240924 -214840 -286488 -193228
20038 -193228 -66219 -110006 176568 72788 129665 -66487 108654 -347282 -3009 146598 -67500
20026 47368 -178745 268098 -62061 -184973 61410 -90775 269987 142297 20807 118207 -15561
20014 28313 -212727 -158694 -133377 -173223 361146 288201 38334 145863 -206853 -89486 137219
20002 -23925 -174175 -171163 232831 280069 108459 353073 186789 122570 10632 -67522 122052
19990 251702 244983 7657 -238194 20154 55010 352123 192632 328730 45551 238940 187828
19979 187828 227542 17451 12161 -126988 -33419 -281873 7740 -184245 -10994 225593 -147938
19967 -3309 162462 262180 -244954 151422 232008 89912 456220 279366 18864 225935 -339978
19955 -32436 -163278 165853 402532 247586 151146 24260 43161 -330261 -40561 25874 218188
19944 218188 -723612 -304389 -23142 27828 62928 20077 199453 -66022 371592 61359 -88046
19932 -392867 -30646 -33417 244313 -47493 44764 -35284 -77548 -79362 -27906 -73962 41026 10565
19919 -63052 -237992 -107274 -60127 94086 -262876 -54895 116336 -108543 -245573 21744
19908 191147 -58783 179809 45958 -75211 -370627 166624 -338619 59777 -66171 85589 -26070
19896 -186726 190001 -57821 106671 -377789 32654 -281253 98962 -237067 112978 -135480
19885 -241813 -213262 -118668 -60 -112725 -97774 50960 -68689 -97308 -560708 -49068 9360 -181469
19872 -179730 -46070 -199050 -275013 -59710 221195 167291 -5016 -17980 -243047 20932 -67016
19860 -135772 169914 109375 -94897 23579 -97461 -30478 -833 125705 9657 56034 -115650
19848 70861 181542 -66396 -218461 276111 71221 -80367 -80427 -334350 53675 -313331 -73950
19836 -198127 15176 -375595 -20094 38428 -296853 -362629 -668871 -181244 -188584 79991 -11415
19824 -48416 -270449 -116964 16153 -216490 217997 -108115 46909 22932 -227056 -314117
19814 -314117 -101923 -8938 -148826 -135469 196689 -54796 279549 10741 61476 -35114 -134651
19803 -134651 -267674 34000 -145689 -307933 -15927 -34971 -192916 70488 121950 -69463 308829
19791 307716 138267 -118018 -38259 72225 -9556 -256943 208398 -387080 30114 -17058 -216778
19780 -216778 -414718 246485 -148900 -954 -94236 -91862 11692 -72199 -171705 -78398 103635
19768 168067 -229146 80010 19445 -245700 -164136 169339 258039 97984 -112723 -98436 122263
19756 259655 39445 -60289 20780 159587 277133 37062 -218279 199956 -67260 -49483 186611
19744 225214 -117809 -206282 112407 89832 257533 75124 -172305 111095 -178310 164467
19733 427168 168261 148422 204130 367203 484185 438599 328443 217470 -97097 212545
19722 -160584 -17481 78701 146436 -45047 -46199 -33178 -156293 -106347 -119878 -141137 -65955
19710 -346795 56976 145413 173259 470766 37311 -218245 -181437 309057 -27301 411859 -70509
19698 -75946 300937 361441 486742 686588 237702 199222 -74592 139977 91104 -89978 174702
19686 -84059 -32451 191282 168401 -58818 91364 -112913 -37758 -227456 -32866 -75027 -520361
19675 -520361 149190 437930 44984 -184385 -68787 -36342 -2824 108536 72503 -93621 -294564
19664 -294564 173010 -57336 -179721 55744 -315529 -98983 137393 -439182 -198209 95303
19653 -436006 -20351 -12836 -33451 -81167 333105 -219178 -8598 46440 -106009 -59185 -101120
19642 -101120 -56061 -174912 -154297 -12939 -232026 -84861 -53868 -296875 -108221 -25340 -125382
19631 -125382 -168309 126600 138686 -293476 -126998 -673621 -139344 -30513 -41878 25439
19620 94279 -663087 66452 47260 53851 -13940 -197737 -267275 20616 -398979 -145494 271381
19608 -135587 -227126 141875 -71590 -138292 142414 -212776 -289718 74248 -33158 -357780 -235686
19597 -235686 135577 -75837 34658 -329205 -1178 -351333 -506916 144658 47464 -83343 145305
19585 116891 243514 -225280 -35004 -221423 -46162 -128255 155474 -91071 53072 -46297 17319
19573 -10871 -61807 -15742 -262731 -397940 -138827 258140 -146574 -2876 139303 -371348
19562 -16990 -283147 -123572 8116 -369101 -137193 -213605 218835 -236012 198369 -225141
19551 15719 48298 31499 -359169 -45650 -201980 101976 -279470 50226 -76647 -114812 40910
19539 -265437 -14465 -139018 -247177 182276 -178645 -338140 112785 61438 37030 230074
19529 230074 62130 -164042 -239096 -148263 48464 -6845 -42775 -9454 54492 -70537 -357643
19518 -357643 201200 185642 -186565 -26241 -308278 -227948 -95410 -81318 -23307 -485481 289045
19506 -130270 26624 103136 167882 -151650 170835 -169137 -119016 -248561 -180266 2060 -185014
19494 -42960 286821 -162026 -264793 -27615 158592 71384 -109000 -307479 51751 58044 240198
19483 240198 -57705 180359 205349 166081 -84087 -122576 122477 11656 -154690 11436 -171929
19471 52536 -267573 162547 73005 -246661 70609 61652 -168195 -174209 204620 -84998 34676
19459 -77279 -21313 -122875 -294882 -151469 -6230 -200074 87998 -35070 -310743 -133059 104523
19447 -47639 -338099 -9961 6722 94283 -561875 -396881 186913 144951 186962 -78719 -88351
19436 -88351 -494879 128694 -195423 446461 -42763 -101215 33570 -151070 124678 -139097
19425 -106509 -197528 -301771 249486 -84256 -69047 -73723 -55937 -25364 -11617 77208 66745
19414 66745 -82314 124668 -89299 -185756 -58041 -47338 50073 -121415 -172777 -93201 14032
19402 128476 -50640 -387602 88808 179642 -292074 -147931 80506 27309 396896 -209875
19391 165012 -63014 -50211 -214409 -168442 168586 -356963 -73737 194763 -374734 -109687
19380 240365 -98650 -128188 -124842 91001 -248649 -21901 -394607 149328 -341119 23239 -352129
19368 -91783 -52681 200390 -45114 -248109 -215694 -152203 -221626 -94265 -33068 -108914 -19486
19356 59396 116807 2677 -11191 359090 -173454 -29350 -241914 -223210 6489 -102140 -271730
19345 -271730 -165147 116913 -122840 26453 167805 -6121 188232 223487 23918 -73960 -271359
19334 -271359 -205490 -189921 180349 -69951 -69039 75410 -276337 -172417 241472 48798 -195220
19322 -371996 -46987 38316 -60647 70904 108130 -38401 27235 119640 55297 -90815 -442226
19311 -442226 328349 -22484 -238475 156233 54968 105331 119562 -350452 -270618 -196414 33771
19299 -389504 -129740 -232804 -92121 300304 -13204 63236 128898 -100801 20797 -194111
19288 -227695 -73720 -599238 335548 -89823 -105485 -12721 -208856 93106 -399962 -216111
19278 -216111 -254536 -264286 18084 -170254 -232866 42438 -87118 23422 -338821 13125 -255647
19266 -19873 -502223 127090 -96685 -207611 -36092 -336323 130676 -68458 30076 -3811 -41049
19255 -41049 -145505 98202 -21264 -58268 -92858 8807 -56945 -219306 -317876 -563410 -204853
19243 -147038 -43324 -316106 -147370 125243 -2443 -408215 -68 2461 3683 72265 -186719 -89406
19230 127232 -341176 -29412 -283039 94915 120633 -230021 105207 -137304 -423500 -343628
19220 -343628 -94970 205264 213630 -238235 107664 168669 -52422 -311759 -136861 -117144 -96892
19209 -96892 92868 -107899 -28463 137449 -456580 -102253 -201153 -376838 -242362 14986
19198 -51653 107839 -144754 300983 -307082 -70325 -303464 174014 77382 -63668 24095
19187 51804 -168186 -39489 -76407 133267 28663 11287 -128330 243716 169809 151417 -162330
19175 -71876 -29247 -301892 -117975 115962 2785 100556 -253327 32038 99476 -39308 76837
19163 -113524 41452 -212061 -198444 -17996 42860 36138 -130324 -146006 -141381 120045 -174800
19151 -37750 -71771 -218962 -142806 123155 -299320 -33574 -32963 -43146 55893 -52430 -120718
19140 -120718 77274 -64361 92055 -60641 -218699 -97898 -40500 -156506 104353 -234087 -282399
19129 -282399 286186 -130462 -237812 124522 102115 241852 24347 83040 80590 -302714
19118 158452 -265377 227693 -292620 -266813 128365 -1421 -256159 -54685 -24368 -198036
19108 -198036 -178573 168872 -458490 -378629 -627926 -141840 -60460 -146510 -245951 25428 65117
19097 65117 -168508 40336 -145232 -199154 81550 57076 167175 -49575 115297 158977 -261078
19085 94250 -90651 -253285 -187456 210406 -136719 -47872 264690 67840 -217398 50935 -17878
19073 -245794 55418 -20288 47801 -112619 -129042 -32486 -220870 219643 72793 -242382 71673
19061 -127850 -100969 -485973 -257627 -47044 -28796 -58102 -19486 235175 -283136 -99260 485
19049 3168 -9200 -244945 176802 -182415 134440 192217 141750 -164314 3417 -93369 236062
19037 -262353 -168236 42653 -351379 61072 95981 -28932 -51771 94472 97048 12417 77739
19026 77739 -84101 -89202 -145066 -145823 166088 129886 -73235 -15673 94969 -163079 -70473 1594
19013 170153 -175979 -107492 259887 110594 -166315 217318 -270284 -154393 7429 -353425
19002 74068 192432 -53289 34884 74543 -110167 -3422 -73342 -144671 -16996 134163 -277471
18990 103061 34881 -105854 -69105 201844 111546 97360 -339845 -69051 -138254 -262877 -132616
18979 -132616 -177408 298721 -52655 1869 -64105 5222 233737 80029 846777 936776 388856
18967 199844 -15788 -126601 -118374 -226969 -61048 -186295 -257715 -520249 -220398 -303091 -198353
18956 -198353 183311 -339050 -27076 55690 9030 2678 -469964 -24363 -197994 168291 -41960
18944 10458 -263745 -60502 -160124 237084 -96061 11299 -132014 138264 34639 262848 45660
18932 -64627 -394244 -136129 -240131 -55243 49040 143355 59574 -151201 325763 -235790
18921 189506 154677 54175 -77170 -18013 -46046 134924 -201520 -276424 -334088 128539 25721
18909 -276328 187464 351056 714644 617948 374034 185900 14970 -55541 -213746 143051
18898 -103420 104551 -119005 -25025 254887 -95612 89781 -108531 181520 -302797 -156058
18888 -156058 220577 -162288 192107 163339 -338017 -331446 -109959 -87801 -35669 199106
18877 -162246 35838 194732 -318851 81219 54512 -71390 -25881 232553 150753 -58595 -109604
18866 -109604 73808 -295969 -232745 123180 -13375 -117379 -94305 -99961 -266321 37373 -109
18854 -206061 -194714 -27545 -139493 3510 -314241 -112709 -38570 165627 -9667 312387 -112317
18842 -347392 125643 130154 -245811 -247677 -247020 -17146 17042 -354813 -229468 36538 277827
18831 277827 180188 -186672 149624 -21238 221063 -231979 -65169 -66103 83150 -65014 -263062
18820 -263062 -280505 243154 444888 -48592 8590 -107337 109787 -158592 53344 164926
18810 164926 269727 87626 -57442 271531 18813 38026 -50102 -53958 -87761 -31809 -268983
18799 -268983 -124756 1979 -135613 -80588 -19747 19250 -132395 102914 -396862 -456071 -99472
18787 1347 -84694 -167996 -377549 -135951 -207539 -84808 -245368 101619 -136374 -19567 140023
18775 -137857 81456 176484 -119565 -127104 -114954 -260216 -237861 -327197 131868 -206538 -31509
18763 -100066 -183088 88903 -171228 -401 -18848 2615 -142667 -327333 -240045 -190218 -65851
18751 -134210 -186558 -245785 -431600 -61358 -110259 -313645 -36735 -148919 -40803 -60858 11391
18739 46936 -46436 -133520 -127401 -70147 -225828 64130 -139341 -135302 -173109 -251161 104318
18727 -182264 116584 -15877 145249 -34951 -10611 -12393 -119906 -296500 -178880 118004
18716 -165173 -122925 210657 182965 -181670 167775 44210 -516042 -39151 -206247 107782
18705 -169394 115031 103072 7220 201950 -350434 -131341 -125853 -20934 203299 165641 -70355
18693 50617 88293 -234539 153344 42555 -98093 -76292 -27943 -79202 81184 -192095 -158978
18682 -158978 -114633 64299 -102726 -20867 -72733 -305152 -413455 -295796 189013 -112468
18671 -90448 266069 -28127 26477 -282722 -67613 68603 -13786 279709 -144484 92287 -49499
18659 -151691 -164428 236625 135516 -9237 -60199 -90374 78561 -183363 -38989 311433 -148200
18647 -204411 128005 -139375 -83492 -157108 -82255 -210786 296968 -34249 307620 194429
18637 194429 -228791 175208 -154170 -25824 8830 50347 -63604 222570 -439202 -119027
18626 -161526 -73607 -132917 -134538 -269294 -43614 164551 152925 74441 -233074 97697 -83207
18614 -464453 -83186 87324 -221170 -109022 60175 -99799 -99660 -63221 41740 -228296 -55755
18602 173700 132079 -141315 -254013 -182449 154414 81001 -7987 69492 -96751 -168128 -193637
18591 -193637 87756 -301932 193 -188733 -32177 -198634 -429997 9020 3961 -218782 50455
18579 -77824 186341 69788 -30178 -165708 6833 79032 321301 -71916 171835 -71885 -99565
18568 -99565 -170988 221946 200091 -89996 220790 108062 -283116 -319048 -61634 -167779 -303420
18557 -303420 -81460 43629 -95886 -203648 -171772 205295 -41603 -130955 -148566 -63420 -222854
18546 -222854 -57240 -186566 61951 13794 -149879 1081 -43868 26253 -186695 -264973 43956
18534 -290654 -103184 7937 -213277 64495 -165929 -37723 -117646 -250082 130221 -11836 -83277
18523 -83277 -297351 -57768 67205 -72675 -19432 -314223 -170125 140759 5849 428435 223145
18512 223145 -33183 15921 9539 78255 14116 212038 158267 -7436 -325954 -173819 310666
18500 -167519 221312 -115218 -104432 86665 26151 88881 233888 -51668 -133131 -15071 -47031
18489 -47031 -113012 59868 -147795 -37352 25516 -95701 53316 -283455 -105739 -68666 196304
18477 -3299 -82917 -192154 -79678 -219489 -428084 -332983 -18801 8429 247381 -114953 -103079
18466 -103079 -64967 416445 -72402 -186895 -135534 -89666 -292537 227036 302979 -73163 5636
18454 211234 171666 -20077 76994 -15307 72583 199225 -367980 -202446 249634 28196 -21030
18442 341178 -172843 133512 -297386 -159654 17197 -124892 -12077 66536 -386743 -305386
18432 -305386 107161 54404 19095 -77728 -97215 -77354 -313657 49255 62835 -223297 99549
18420 -25553 -104973 8093 -99825 36814 -112001 -290125 116312 -16633 296845 -44193 -361678
18409 -361678 -276766 -88292 -128769 117650 -91466 -47184 35156 -126744 242717 285449 116003
18397 -97148 -156639 77445 -29531 180446 43001 -169107 100815 165505 -132267 73108 38547
18386 38547 -44812 226065 -410470 -315239 -271057 65904 -13300 29492 12029 -27233 -15014
18375 -15014 -128368 63522 -110122 45669 9885 5504 -64290 -190255 -172299 -196139 -150958
18364 -150958 -189224 -139776 103506 492220 -268783 246610 185583 -20015 -26685 131982 -144407
18352 -144221 -38662 80097 -310480 -112732 -48237 63849 -153070 -422051 -125812 -57458
18341 -316682 99536 -250928 199849 -65167 260960 -314706 112240 -124424 -146409 -383214
18331 -383214 -32068 84942 -567091 -227358 -216973 21432 -22682 99832 176918 101828 -52766
18319 -141107 -12245 -12464 187299 322441 -296913 -180753 -382906 348126 -58386 208763
18308 -71200 90331 11545 -179846 -336146 -8569 57017 -53402 283121 17046 -96265 -88191
18297 -88191 25750 -159776 89368 -171418 344050 206944 -8444 -369188 -45197 16603 -49876
18285 -89179 25407 60866 67298 -120314 127852 -53708 -56972 -32467 16464 -8509 82298 -223463
18272 -184278 -99503 -357384 344378 134251 -55489 28881 148403 -240011 -317591 141290
18261 -96722 -32812 -51782 -180825 63771 -68335 241171 170798 -45463 -66402 -66106 12089 -141324
18248 159099 -10646 -101054 202995 68422 -118454 257283 275663 236647 120008 85210 -14472
18236 -91043 -267742 -190788 -184423 82376 -121561 -25695 -189831 -142159 7266 94080 -41341
18224 -44559 -40112 89493 268638 -59882 -15690 -250542 34889 -8165 -108669 -347892 120933
18212 -376715 -429058 66475 -79261 -321248 36898 396766 -142966 83817 -36125 -241256 -186770
18201 -186770 129933 -68351 98563 111741 89321 202681 -59690 -1131 -48288 143756 98114
18190 98114 -129007 100988 -297295 -45166 83560 139233 80495 -213743 -182767 492491 -8334
18178 -50403 -274342 -114739 206197 193597 -202654 -63256 -161147 -214238 -428764 81699 -80005
18166 68439 292552 -93115 138484 237458 -250076 -212374 -221323 -13785 -163219 -6795 -91270
18155 -91270 122384 -170992 -41746 106020 237675 102983 -175011 39734 170700 -371858
18144 -96848 126120 294343 97758 35524 106539 -192393 -93932 279080 167558 160794 6603
18132 52531 -21191 24270 -114750 -177678 -201676 -86602 411856 -172735 -437610 -243094 16611
18120 16419 27304 -186616 -61579 251841 -145090 -29706 155516 -273606 23215 219057
18110 219057 84711 280675 -188381 -90375 -73806 -245833 -79466 -166029 8478 126515 -81911
18098 -126317 152841 -242780 126338 99070 206218 153698 -164207 -52859 588248 -90163
18087 79963 -35427 -89145 89244 -106422 -259172 21004 65884 -97754 -301475 78770 244653
18076 244653 -8293 -206391 -124555 -9185 72086 -42062 -88190 67867 -29493 -30688 33022 -190338
18063 -133198 -123511 81954 180098 154961 233706 187789 365467 -145517 -114192 29240 359105
18052 359105 -104589 155145 147722 -60919 128047 -16779 236320 -159026 -253181 68121 178172
18041 178172 -298407 -90907 134461 -22429 -77648 -48187 -44864 214168 28056 162279 -175219
18029 107112 -34275 -98806 -294910 221830 -21753 -182552 168584 8572 -144432 -85533 145244
18017 -121439 -253441 321917 -68774 28004 -72682 419688 117984 -272696 -41341 -170732
18007 -170732 -142233 -70957 -172182 255182 38101 98524 87378 -89389 99435 78 -3015 -190376
17995 -190376 57860 -12682 271169 98419 -320970 41465 -148969 94198 291025 115679
17984 185737 109211 -172799 82604 -108070 -87148 -57794 -1046 25473 -66820 71908 258350
17973 258350 14452 192366 33847 213326 166834 239468 -38436 32038 48597 -128218 51586
17961 9337 -121564 114742 -144672 157643 -79928 29547 136730 -134963 126929 -107535
17950 102382 299923 259882 235656 123859 125597 -140347 84906 18504 11412 -257603 173283
17938 -77297 50759 -16122 -47216 28749 139350 -129614 -78703 -92410 -215505 140505 -198136
17926 -163573 142882 92101 -153831 -132601 21677 194002 -134114 -227199 -84627 297535
17915 7473 163957 -188664 -45566 -289550 180279 109842 218106 -136858 89072 -323519
17904 -314265 -75886 -7157 152475 31488 -206967 -27553 79440 246622 -86570 271264 -209019
17892 179615 53550 -238026 159548 100996 163487 -36279 43315 143670 -122298 -81345 111954
17880 -56406 -93379 -28799 24853 245222 326658 -144144 -44001 -89710 -193370 148967 -4666
17868 -2743 -135023 -157148 -140710 162519 -135322 408822 -97222 -165701 146661 140396 -247802
17856 76032 99679 141962 178837 -242464 113484 41704 -199340 -187229 -139557 -235601 -11655
17844 52426 577523 114572 131216 -362884 99262 240884 -73561 172032 23011 17503 -99702
17832 24242 292172 172131 -222614 173161 -36884 -272522 -33825 -69333 28176 203121
17822 203121 217514 -231919 288681 166084 -95538 -23795 -233906 22318 -26094 131387
17811 -70472 -83489 28606 168268 25889 20910 147874 -12011 174637 243490 3052 50809
17800 50809 -52190 412492 296737 -40141 78972 -187811 25556 228694 178303 -23215 73158
17788 -137496 -176038 89402 102170 127663 -35556 -15816 -5270 104433 65359 51506 184343
17777 184343 -35500 193337 209931 -81256 -173843 246630 -36579 25450 -131041 -34141 131468
17765 375057 -115756 -35844 -325013 193690 76285 183251 -98991 296586 -269010 -165273
17755 -165273 390542 -35840 133636 -129358 378606 153566 160990 83869 73944 252502 65114
17743 162343 226240 2762 55990 232511 294473 94198 82844 -69503 -190803 70544 -105119
17731 69807 175381 190175 -202009 -38717 186799 -84734 407194 136566 210329 226444 97606
17719 51889 207576 -211940 310719 -52888 130959 -106565 -85222 -102751 -250680 174132
17708 127872 -362980 -26285 33483 323371 217953 -50558 311034 427170 19414 403847
17698 403847 163857 4677 209255 -30755 267121 274755 -69469 570763 241650 2106 -8436
17686 -60142 647128 -184911 38679 315693 -55260 50017 219790 343474 24467 -146137
17675 130238 72130 86447 -22508 55525 17105 149013 -304622 21616 166346 72683 140627
17664 140627 171519 -261810 74148 191372 98659 286414 92607 186690 245990 134297 345427
17653 345427 319241 48015 68417 155515 440115 341598 389911 35449 -204253 99271 -83520
17641 -74421 139009 186717 69124 222093 132798 243984 -26015 -34962 -25525 205310 -91931
17629 138663 253575 15199 16369 -91418 219576 240046 90704 295926 103713 327927 136592
17617 152121 -38822 -112918 -92165 99214 110233 235559 -308495 364440 7718 369012 53629
17605 434431 -106822 105150 188818 150638 238131 376476 -177082 120261 116464 456746
17595 456746 137458 125109 -156119 95944 -35206 273934 93840 263650 115152 309725
17585 309725 -130744 183248 194402 251876 225716 148252 142532 -109593 124868 137029 -188670
17573 112126 264099 101981 44137 307386 124725 118581 24210 316979 82386 143779 -114733
17561 401796 -106919 157137 238143 -276894 164450 25842 -161875 141289 58256 132143
17551 132143 96839 233568 62381 171521 16407 -82775 237401 195250 98759 44217 17056
17539 427979 92601 149222 261506 135913 361724 252893 167483 253421 235674 169188 659909
17528 659909 63170 463231 879076 799521 906087 1141839 1029171 974572 979209 629637
17518 629637 449958 160111 114524 411490 405122 292038 482661 748353 964989 1015686
17508 1015686 1082831 1103064 758439 772207 777904 384101 383834 256360 65588 383665 678864
17497 678864 264571 55671 470974 311574 427465 2471 382335 306447 139343 275031
17487 275031 225363 72248 416665 407809 405623 244930 415158 457755 615099 339223 218037
17476 218037 607067 450822 294540 131306 233597 553657 399273 39292 165134 254630
17466 254630 351384 161262 325869 474301 336760 346234 325068 450028 -188511 156237
17455 59177 94648 456878 494965 249340 340172 -17397 386985 469663 659911 333266 316083
17444 316083 450393 277262 824779 324798 332308 320809 335119 319051 500908 56279 471068
17433 471068 201654 507166 501190 191939 243855 319733 467103 370100 95831 168292 114599
17422 114599 127396 307661 310430 240361 318255 297458 -38102 353381 483755 554161 302010
17411 302010 388711 150473 221639 385879 283691 217092 -157826 267861 199127 43626
17400 475233 175609 175222 386828 613237 182367 315772 -124085 215731 185425 495967
17390 495967 217942 324697 198112 300611 78752 483866 197215 -74725 -27067 517202
17379 394131 529394 401553 359316 232847 337506 361669 230754 84424 69128 232171
17369 232171 78886 408234 135692 206125 345743 389573 180813 75001 193308 65083
17358 162193 181126 110122 225150 164055 285506 135488 511185 160820 345186 195608
17348 195608 83411 269789 -24088 477723 335276 212702 82084 239181 602955 333497
17338 333497 326991 443172 419013 417935 397864 434834 442441 -26549 334483 294908 214113 125776
17326 125776 466961 431110 477919 593925 388595 264783 99200 370051 87201 123672
17316 123672 398750 191879 68606 528001 379834 55639 253108 258461 -23248 404761
17305 136668 83989 101992 504813 200428 28882 357841 409124 541653 51934 265154
17295 265154 229894 349056 16229 388889 427284 -66303 400472 216983 646389 603129
17285 603129 404774 688541 217850 326492 405736 263024 333391 402297 401491 515622 322884
17274 322884 330288 318297 290317 534786 317015 379818 373575 232415 419553 282264 313695
17263 313695 393583 123239 258680 297080 331758 260013 395959 50794 451492 630609
17253 630609 332770 542840 316304 54550 414814 509812 31461 52240 437232 462022
17243 462022 351950 458878 388801 797467 244643 232267 478780 510317 500917 319729
17233 319729 303631 417470 221104 43804 156954 518571 678487 355556 90055 257352
17223 257352 380483 360611 419938 584784 297849 444896 430997 343167 87095 718578
17213 718578 636156 388892 434700 510195 459309 470447 248398 474518 230263 317814 307365
17202 307365 175484 403191 375721 387725 477392 459635 699506 400514 622517 342879
17192 342879 276760 442658 410779 206238 336347 603832 672423 380582 446273 503073
17182 503073 142521 371177 725960 247356 556543 491837 234557 395258 580754 220587
17171 806287 444824 392501 313409 333582 797489 608459 698508 859464 526840 514136
17161 514136 414244 616826 853013 479971 634220 319408 328745 444007 374027 497906
17151 497906 641719 830980 554718 412447 283780 363677 560356 593653 262383 484439
17141 484439 527481 498529 308607 771328 442926 633132 702350 408352 718046 664909
17131 664909 512703 563059 -18535 412723 775020 176555 596545 689307 497854 739462
17121 739462 652055 697249 794313 754884 609618 512624 551433 701279 657432 426916 785105
17110 785105 615605 721952 544256 942609 804071 624114 637562 855599 531128 824818
17100 824818 787594 582883 576645 709587 641027 621339 760982 656504 559884 838286 1042106
17089 1042106 978316 604593 561092 1039276 1014362 655539 611949 596258 629531 898231
17079 898231 514189 617839 739954 603824 635569 943153 1046056 996192 772083 694742
17069 694742 698649 830966 904658 976276 777846 908269 894196 793429 866915 754223 1000194
17058 1000194 647786 746530 790651 810828 1092744 673194 946715 756635 834753 845449
17048 845449 1011251 919902 650532 1216535 945294 773137 935895 1023937 883335 981202
17038 981202 865330 1102405 1102239 846188 914200 1117333 1018963 712277 1072659 1208974
17028 1208974 1199335 849576 873485 886785 794665 954463 946602 1137539 1056055 1066531 805430
17017 805430 1031740 1092111 1224259 837824 830956 1116883 1050327 1121353 763050 1163245
17007 1163245 1039946 1060057 1113463 1206730 1478864 1446674 1307302 1170667 1212914 916360
16997 916360 1546919 1270116 1312661 1381515 1166371 1457684 1157623 1118665 1504586 1765505
16987 1765505 1602350 1202995 1659475 1692653 1103246 1642940 1540264 1477335 1429231 1453206
16977 1453206 1485852 1578801 1877976 1181110 1459222 1489753 1684647 1653993 1328513 1835142
16967 1835142 1423916 1926280 1713729 2019282 2082589 1774992 1813827 1691142 1748737 1667594
16957 1667594 1718761 2126911 1574959 1904762 2003224 1759425 1575059 1808840 1632213 1958779
16947 1958779 1874052 1888431 2142594 1768549 2236389 1896203 2232426 2086118 1949931 1780756
16937 1780756 1884466 1991174 2000932 2180322 2241455 2191645 1969001 2303195 1896878 2165622
16927 2165622 2469347 2067610 2154259 2258888 2624929 2306968 2330072 2403484 2344849 2528167
16917 2528167 2404846 2612576 2586690 2615429 2417464 2580468 2678958 3092540 2549843 2830977
16907 2830977 2664334 2745238 3127606 2738119 3127861 2625877 3287729 3063203 2774299 3265182
16897 3265182 2974612 3042078 2995277 3367276 3141840 3230801 2957051 3182814 3165643 3101537
16887 3101537 3870044 3548355 3639765 3754141 3479039 4013192 3915247 3493933 3887405 4050789
16877 4050789 3844148 3802765 4016611 3910223 4451852 4113305 4342071 4386400 4281192 4653844
16867 4653844 4229627 4347507 4730237 4447705 4776003 4884365 4613779 4786560 5253104
16858 5253104 5073969 5096897 4723204 5137617 5181870 5443218 5416271 5315170 5684144 5640878
16848 5640878 5790183 5669224 5623833 5781023 5953317 5851754 6237422 6561483 6607539 6739107
16838 6739107 6738663 7145597 6927739 6960654 6972678 7599068 7446129 7747117 7627633 7717042
16828 7717042 7727420 7835860 8114539 8539605 8523142 8390314 9133738 8829831 8987845 9506925
16818 9506925 9326787 9624765 9989500 10309403 10318273 10561013 10612510 10792151 11027293 11141231
16808 11141231 11587065 11689580 11948774 12353335 12570481 13097209 13229718 13339130 13525162
16799 13525162 13850920 13893753 14840727 14908485 15494801 15703727 16196111 16583412 16914490 17531102
16789 17531102 17980417 18212666 18449517 19350277 19704344 20171632 20780455 21155393 22081878
16780 22081878 22389097 23095814 23658576 24548372 25188079 26005303 26545331 27555093 28435062
16771 28435062 29361083 30227265 31141394 32037907 33321164 34267106 35200617 36538066 37547945
16762 37547945 39089471 40149388 41488217 43102023 44350592 45641343 47928207 49422061
16754 49422061 51091516 53027813 54838881 56638307 58921273 61216564 63154622 65504897
16746 65504897 68008459 70161969 72865741 75415503 77802431 80804521 83450795 85681367
16738 85681367 88740819 91301378 94662569 97137013 100089259 102381160 104748719 107330931
16730 107330931 110028234 111761700 113772228 115400905 117077140 118558846 119725378 119895233
16722 119895233 120494612 120720524 120377933 119942574 119209582 118204515 116798980 115408701 113584285
16713 113584285 111592053 109558399 107148754 104745705 101774538 99372505 96503758 93974393
16705 93974393 90950696 88405543 85435667 82751485 80072096 77615091 74576907 72055371
16697 72055371 69815348 67313736 64759064 62888832 60402857 58287113 55932107 53930856
16689 53930856 52174271 50335537 48855831 46818859 45596891 43697347 42192718 41035795
16681 41035795 39528645 38218966 36925593 35792899 34142833 33261646 32372716 31492243
16673 31492243 30543282 29349854 28600198 28114902 26852135 26020096 25527737 24762169 23782900
16664 23782900 23437492 22609298 22014982 21642480 20730283 20207378 19642183 19427646 18528030
16655 18528030 18382437 17829926 16981054 16759197 16560691 15879992 15577982 15680176 14829724
16646 14829724 14576947 14614641 14079428 13529195 13197850 12735123 12533120 12073904 12622982
16637 12622982 11703727 11592163 11431888 11302466 10745051 10842693 10182623 10329301 9963693
16628 9963693 9490975 9753094 9156084 9383707 9165120 8697728 8531281 8504888 8272397 8346332
16618 8346332 8105806 7848794 7883622 7677096 7369093 7391102 6966512 7160323 7032037 7209169
16608 7209169 6761633 6756082 6578969 6523441 6444311 6353970 6295142 6348278 5853767 5804987 5639373
16597 5639373 5865657 5183324 5661956 5496155 5084121 5311271 5198701 5188781 5066084 4946272
16587 4946272 4944871 4702139 4906633 4551091 4250084 4461990 4847405 4689760 4425053 4522702
16577 4522702 4645613 4219404 4103785 4224912 3936346 4300663 3858676 3889612 3328673 4172463
16567 4172463 3708166 3982372 3302165 3666527 3477781 3215364 3398423 3358975 3343461 3358986
16557 3358986 3191532 3241250 3383181 2880629 3021409 3008231 3093262 2762605 2974425 2993642
16547 2993642 3042356 2915230 2564938 2842186 2813135 2623610 2527130 2783946 2866756 2765706
16537 2765706 2739998 2514726 2960884 2829022 2578536 2388489 2364673 2599264 2235524 2366089
16527 2366089 2494943 2063726 2343584 2198408 2140159 2267252 2494131 2149187 2241407 1825087
16517 1825087 2195223 2308744 2045918 2010019 2017802 1985095 2221556 1813199 2055678 1942221
16507 1942221 1652953 2225943 2017121 1555907 2164091 1978644 1890493 2033392 1771468 1873907
16497 1873907 1724392 2055013 1918403 1640772 1671234 1733437 1224515 1640178 1812320 1622090
16487 1622090 1758232 1563529 1609672 1516336 1820124 1661207 1414794 1569788 1292236 1586113
16477 1586113 1329778 1273367 1563647 1434028 1457373 1454345 1351615 1346853 1392003 1275486 1317193
16466 1317193 1181030 1599571 1009845 1358826 1234040 1479215 1521882 1571567 1320475 1377395
16456 1377395 1019849 1360315 1316967 1217387 1201591 1457399 1085008 1101904 1170035 1076416
16446 1076416 801087 753097 1169236 1101346 1024263 1083368 1291710 1147490 930944 1231450
16436 1231450 1362929 988622 920464 800478 1062095 884730 1382172 907840 1086651 949695
16426 949695 848934 1531331 1043678 1286648 869561 993938 797602 1201217 599110 871989
16416 871989 816136 956280 1014310 1424171 797772 1066928 855152 720026 709580 952186
16406 952186 724688 847293 840872 750608 829232 619447 756544 1072732 1062518 1189121
16396 1189121 363021 542145 681906 844856 882825 863638 696170 1045679 833647 312118
16385 649654 510260 761772 600634 743533 600071 775153 556476 1055117 552906 950103
16375 950103 686656 591196 732859 208456 662499 626523 536298 715907 1191588 458167
16364 637527 634553 677402 910404 645173 412947 568584 597855 469061 597919 617211
16354 617211 551985 427024 593247 1037851 632139 541556 731570 771407 450974 574512
16344 574512 364902 360221 728217 681910 575489 715107 584228 768547 425063 473481
16334 473481 495117 645779 580675 772050 601196 363575 431090 365447 634343 706304
16324 706304 525644 340312 294131 283358 472396 212500 439303 561381 399040 555861
16314 555861 285998 436506 645548 221388 482319 561697 446420 461526 438979 122292
16303 303801 656601 679241 602274 242219 330626 497350 714358 433406 112934 611357
16293 611357 224480 639863 604033 611779 99410 612763 497761 666622 373164 290798
16283 290798 425942 406702 537348 328362 284146 616262 351000 403546 545093 599886
16273 599886 564424 176688 196890 518168 352875 350860 205261 367441 279080 469140
16263 469140 455085 539002 297184 472701 224583 351054 354035 175481 295112 168891
16253 168891 456943 181563 193718 274000 160562 378439 470949 412387 162583 161616 362396
16242 362396 257942 528651 438123 62488 305810 519236 293590 583229 383288 375078
16232 375078 171113 270305 393562 259086 96151 94593 562775 420825 341967 405308 536746
16221 536746 323637 430770 226747 412639 329047 293866 301969 236879 439429 91431 229228
16210 229228 209031 -43592 217122 353792 403452 83466 52067 56085 -12108 42926 224216
16199 224216 -13802 138558 387387 363129 371928 427331 449938 427444 331703 -124585 338728
16187 72828 271003 31036 187075 441842 350553 288402 139119 156230 214838 166871 122771
16176 122771 -140198 90598 127303 104946 112083 -70265 85139 396538 148604 269515 282316
16165 282316 -96027 478928 70321 191775 220100 174386 209214 472736 176384 -177238
16154 75824 390000 265394 340109 246009 141768 76049 100272 536269 200731 255994 134728
16143 134728 194403 375416 167025 153228 -3129 -250680 2992 113764 239954 28950 -49097
16131 -203002 -44642 156740 285696 130765 114875 -161026 291895 203049 291021 239561
16121 239561 -16672 -3094 -51173 423140 -50596 -207550 -68088 241073 390612 328936 131169
16109 -269743 168689 381358 362823 85320 548936 242090 211520 282649 135755 195277
16099 195277 58730 166287 89249 138853 245733 50476 -11667 -173945 145556 452672
16089 452672 -116545 7214 190611 287851 -21645 119392 -77200 -159018 180011 -161236 64702
16077 236669 126106 -47148 188469 166365 -184908 -29532 13425 -124733 419010 208410
16066 329130 -9323 286891 -42237 45552 -58977 238023 -59346 143692 422152 -310241 5546
16054 23710 -38810 -148656 -146534 132003 116352 116346 -23593 -195060 257623 329437 559350 172607
16041 -30675 55214 121543 119116 240877 41239 53829 139491 208190 228235 -88349 134007
16029 24068 325154 -58659 88285 77438 143518 -22182 225750 127531 -142159 -7520 299592
16017 -100001 -83188 224418 -9702 92961 81035 -2860 310903 20241 37851 -243760 -87289
16005 64676 459196 80262 242341 -203787 -208831 108266 310751 -120629 27163 -166363
15994 -98229 78157 190190 97232 -80668 393605 332188 207311 560136 622760 877714 1219475
15983 1219475 1104852 1004734 630601 507293 312042 362899 -132168 -60805 -182450 -154452
15973 -154452 235215 323932 -147397 -115609 71737 -72437 55522 133513 154849 -112287 431911
15961 -25686 -142683 116214 76779 284385 234899 88371 -128946 -160930 -205722 -92724 283647
15949 114464 242465 -124214 -42847 160077 234928 130955 -237098 126574 -112890 -37689
15938 -162870 183941 108950 -123717 -137269 64919 22529 115217 -304199 -82291 166875 67033
15926 -231728 -12408 49740 150427 280958 -75684 97601 -205224 -327090 -24328 107174
15915 -17838 175780 167856 201328 -36154 -123820 -129731 -151324 -101880 -272384 -186967 6964 63609
15903 63609 109819 300368 -95826 84822 844 70493 -107395 302626 210 -76050 -113610 274461
15890 -176125 56606 -343836 274190 262182 57191 -181217 -175141 346053 154199 -95873 -139196
15879 -139196 -180093 -26877 49616 -100256 -51920 -121909 66041 -82251 -45084 -32757 -132443
15868 -132443 122602 -283481 -53856 -48945 -32877 -188727 -67810 -193303 190995 -78788 -75204
15857 -75204 -601481 -25761 291148 -144218 26239 234663 -212 -253386 -258768 168390 -103407
15845 -77186 -382927 -197288 -186904 99739 202995 -148207 90173 244497 -305782 -68177
15834 -198548 191614 19864 203538 75741 160786 17618 -39016 138030 78762 -118554 155598
15822 -267679 264850 -108882 -134684 -117387 -76345 34790 -289230 -290870 -118392 253819 63119
15810 -7669 -255347 -361750 186440 -49409 108079 -41610 82928 -154695 -83319 182055 -73084
15798 -270805 -2606 -56239 -171469 -39277 -254400 -124272 239023 56201 192502 130600 148551
15787 148551 -107706 -16763 -14585 -78349 -489090 46249 -345251 -79470 -53250 -151526 -255433
15776 -255433 95202 22276 239109 -176002 188674 36669 -241645 -124866 -51743 -294374
15766 -294374 -201217 36110 -253367 -180212 -8846 111717 -27100 -266881 202143 274266 141523
15755 141523 -88589 -38494 437923 78213 137883 204561 70197 89504 -84066 128968 -67460
15743 -38542 99282 372107 666336 5403 14042 -8223 -261356 9039 -273133 -83243 -112516 -55469
15730 -69619 60921 -351007 -190453 -228268 -159559 484550 -62446 26055 87126 158607 109713
15719 109713 -497163 -70058 -110895 402355 153648 117390 -171246 -66341 39968 45520 354354
15708 354354 -234241 -23333 -39253 3079 -152724 -12217 -82334 30930 -53338 -258353 42196
15696 213152 53287 563 341213 -4453 -54808 -184716 264456 139223 570555 -12161 -64608
15685 -64608 -136944 -148872 -47396 32022 -15422 -154885 157654 39662 -97359 146121 85972
15674 85972 -164584 10757 10582 -277411 12277 -80081 -64544 -132976 138643 -257410 28057
15662 142758 174523 -23246 151247 -92982 197023 -99817 -140944 211551 -76820 -407485 -38696
15650 33768 -36341 -308020 -392504 125069 -108609 86735 14373 -174065 40068 -98531 -112404
15639 -112404 -105508 177894 -77221 -35983 -202668 24657 203738 -148615 177508 -92947 -107868
15628 -107868 85645 83824 -13507 -168931 57979 -255519 130000 -76301 -87551 -78530 -322441
15617 -322441 116802 -63242 -9635 -30810 408348 61894 -233251 55098 -326488 -57132 -39642
15606 -39642 67773 -75772 13410 142485 165884 -14632 -255529 123220 445685 72053 -204745
15594 71645 -214889 168116 -25364 -88174 101463 113347 -33111 -181174 1871 -138953 268024
15582 125711 -26716 -89904 144980 67878 -234001 23231 -417082 -820 -195390 -122276 403968
15570 -343487 275592 105462 -162261 -158905 -157841 -163968 171053 33521 127706 147664 290257
15559 290257 113848 4629 193871 -129645 -73709 17411 -247252 -144688 -238412 -23789 141553
15547 351235 182294 -40598 -39546 -369614 50603 56285 -85505 -107669 -24950 -5690 359034
15535 -185666 237618 -80206 -331468 299631 -157164 180449 251980 -8619 81274 228950
15525 228950 161863 45360 156363 65605 102420 452737 237008 165857 278944 419094
15515 419094 -111876 64396 -203781 128951 195398 -92800 -142620 98792 402713 322852 350540
15504 350540 -134200 334434 187320 168091 -90491 -49026 385322 73264 -158681 -212494
15494 -212494 -22677 -35516 -35703 -186797 144636 42329 34879 49273 251530 -128611 -223240
15483 -223240 336655 -20517 32968 95480 196594 -68325 284136 188058 24262 524889 258086
15471 800137 336710 230501 -67160 -248397 76602 222860 -126082 137671 89800 -134734
15460 59465 141827 157682 -75828 -211379 41283 322366 281428 169786 242636 -112016 -66181
15449 -66181 153153 227287 213915 10291 130569 16288 424610 1169669 1203232 949199 1150445
15438 1150445 606803 287832 304146 23761 352271 263151 9783 116170 -239648 25492
15427 -285461 87677 135978 -252187 -14778 46630 -121591 -230450 73779 48822 -22819 -52871
15416 -52871 206610 98383 -269483 -265559 180507 20609 28043 19939 322966 113910 215553
15405 215553 -7583 119998 -104688 -119133 66596 -142752 412585 -60102 32723 -303836 15883
15393 70254 85808 151287 95417 -107588 214006 96100 -437517 316912 501594 -38782 309437
15381 -96013 47894 -525364 277863 -97116 -88673 -30762 327118 236765 40778 610390 -4664
15369 133684 163092 115048 -217410 127215 59739 59623 -4008 364109 359930 431441 -90553 345643
15356 119020 219601 176688 138859 228142 138653 75104 -85361 141744 154502 347839 306899
15345 306899 144945 447852 257475 184232 378321 115728 153598 404594 -64844 206050
15334 -69188 -174848 366629 311660 237967 -75141 -15152 180393 81417 228310 323025 241232
15323 241232 543363 174215 62038 219125 110320 165092 -257014 15171 177122 314245
15313 314245 130359 271195 88081 347812 -67247 569800 -171073 170965 -379159 -84746
15302 21481 173519 306289 -6512 160774 120764 356618 288385 120029 379133 28145 330584
15291 330584 -117526 88164 167059 -688 -84804 -218844 115659 -238343 -323000 102369 -168181
15279 293339 28106 38642 -40423 82286 -97986 -237908 -289676 91101 -224 -276561 135063
15267 -97745 -41546 409905 161918 -75556 6620 -126068 233994 -251479 194030 109817 -106357
15255 208357 -116229 307718 49526 96987 -6497 247929 109599 99921 191158 128992 180710
15244 180710 237570 638193 989501 1873776 1329006 1582709 1289665 470914 20271 -238222
15233 -6137 57985 120326 -146453 -223694 185599 -49977 53645 93152 227529 -130421 -101382
15222 -101382 140397 235756 110506 436703 98553 15993 -74056 -113183 49002 -200191 53766
15210 22750 247016 271428 82175 -26132 108227 351050 -50260 205588 208395 -191095 69289
15198 155465 -48496 -177882 36029 -115128 34708 147177 66782 285240 265737 143289
15188 143289 63043 -73168 29396 59027 2047 238308 -159386 -151879 135175 55036 266646
15177 266646 134604 66731 250515 -13604 85289 113558 -5967 -21690 403609 -338030 214023
15165 56722 128949 -177 -179017 35035 308307 -108685 123463 64820 278853 11271 545656
15154 545656 52415 34731 89936 162982 263731 153165 341130 -144414 165897 -249365
15143 196042 -30978 375966 159405 212814 291562 -92285 42283 -27127 6809 228462 122780
15132 122780 -72099 164716 330642 233541 399414 -119628 155728 32666 186715 237640
15122 237640 -8609 -26878 247951 151536 437452 181843 559045 105677 327376 111127
15111 406093 157017 233169 63230 329980 140831 119641 227668 230472 296115 -52675 29704
15099 -254808 172003 61431 40679 136524 502142 -18997 168205 -125577 -54792 -41274 49532
15087 -80158 50031 180707 -39650 206578 120475 103169 143451 532471 -207095 232697 443381
15076 443381 89652 101818 58868 -125869 238270 50362 34641 53388 221446 59689 291373
15065 291373 285500 10137 -76983 154296 48125 45881 236925 323856 49397 517733 -107386
15053 134207 615186 348789 358680 35212 232383 -37089 300140 383469 350645 582231 691599
15042 691599 192436 394508 306103 447654 375983 345047 191672 501436 490253 346852
15032 346852 672104 423585 545093 521868 661684 574598 697067 369723 271905 407535
15022 407535 323679 486597 518409 608674 507386 374602 637266 511797 220958 216737
15012 216737 199409 446632 385649 32919 713766 497910 594463 268822 182508 200346 361325
15001 361325 513697 576233 741768 869432 649019 128707 309253 270833 250534 239220
14991 239220 403123 693123 550726 538213 685837 593341 563818 454110 687830 682601
14981 682601 732248 592251 1187761 766357 518888 498359 120956 373619 197170 777286
14971 777286 612925 352903 680870 421802 345239 339131 461254 248163 201025 545778
14961 545778 198501 210887 636550 389966 579580 506773 112233 454393 129714 23799
14950 641291 432216 377872 298113 577579 306431 270455 610271 693645 816475 574553
14940 574553 858570 436946 308394 224461 531867 441188 539140 660193 732223 891738
14930 891738 954392 1197947 1235272 1593194 1423607 1524453 1798820 1719232 1244975 1536860
14920 1536860 1164785 1512458 1910297 2502719 2301466 1802052 1669727 1415793 1442728 1027075
14910 1027075 885269 460227 622969 142660 772508 214070 285410 317295 443157 343769
14900 343769 192673 413894 443188 800751 445269 752059 513496 483787 561390 352971
14890 352971 280337 -3246 681906 238954 394664 782564 955540 1188228 774742 853598
14880 853598 1062224 680743 699366 993715 1062505 525015 672824 158655 525213 790970
14870 790970 617642 653745 415072 607898 492114 785929 555256 727994 510168 588166
14860 588166 579995 800042 362885 393409 291629 606036 473077 316886 486481 531277
14850 531277 430524 249217 604251 799139 652303 555324 707067 1333743 975576 1429388
14840 1429388 934714 1147859 921813 988056 902580 664236 817447 912406 895128 335876
14829 621180 554154 458262 614273 592741 579670 409491 887846 246591 630958 347227
14819 347227 602163 506879 905338 744659 784093 1100615 343185 595177 730373 175725
14808 605322 749882 538760 776362 622934 1080111 1077018 1180303 786757 888055 613603
14798 613603 460147 641676 511991 788532 559777 522100 797222 190483 932694 659592
14788 659592 698525 779286 876447 824211 442054 600244 385255 434660 621062 715636 571943
14777 571943 492745 675238 1020486 932535 617411 860184 572880 723901 662184 627427
14767 627427 739835 925524 510606 506468 646234 542173 446605 696372 550014 693940
14757 693940 447171 515225 882016 686681 936240 490119 982152 535481 682777 677058
14747 677058 588374 441846 659313 788102 723846 928164 548237 716845 427030 487526
14737 487526 887748 755800 630143 809634 1074610 976907 1116866 1177568 1022937 1257865
14727 1257865 1440968 1732774 1570982 1894961 1636277 1327920 842449 992165 899724 838172
14717 838172 845685 687149 809557 1126348 841038 756706 959149 814567 965788 683490
14707 683490 945381 1276136 1034061 1196442 1402512 1601344 1781242 1788291 1736251 1567233
14697 1567233 1470449 1528842 1157789 1021952 1229513 899045 1222498 769708 982645 1172880
14687 1172880 875018 909955 1170288 893935 1429394 662141 1313346 1071044 905004 1362543
14677 1362543 946333 1042669 970284 704494 648926 1123537 1248152 939538 926115 1067486
14667 1067486 1070254 660013 1018907 1087886 1215140 1145421 1006356 724975 881542 1327111
14657 1327111 823013 1066116 996065 1088957 955624 1183160 1315774 1172947 1422005 1228779
14647 1228779 1352172 926089 1223883 1493618 1395590 1241687 708624 1247629 1281517 1431283
14637 1431283 1178712 1113746 1311737 1098845 1407507 1061119 1538016 1229391 1111181 1294339
14627 1294339 1114076 1453231 1189108 1274606 1169883 1487195 1166734 1406116 1440108 1771722
14617 1771722 1341352 1410066 1222602 1616263 1243190 1364107 1794127 1136045 1577828 1634950
14607 1634950 1459858 1563916 1417703 1572989 1595406 1662857 1601763 1037355 1449736 1566730
14597 1566730 1505832 1431642 1554252 1562157 1670376 1121273 1798888 1795037 1849850 1821895 1671553
14586 1671553 2011274 1793619 1774177 2180349 1861128 1823448 2018002 1771914 1588791 2337259
14576 2337259 1805575 1628685 2239295 1829741 2205443 2149080 2371595 2635493 2266416 2156505
14566 2156505 2558637 2183358 2548279 2793918 2337872 2816542 2721115 2761334 2993873 2956127
14556 2956127 3032607 3036325 3300878 3727921 3693694 4475926 5471032 6982603 10326826 19059257
14546 19059257 39750674 48567917 20947985 9204870 4825743 3110613 2550349 2732367
14538 2732367 3276141 5255514 3778220 2854792 2029875 1983753 1869450 1957868 1774411
14529 1774411 2095606 2098990 2182268 2730496 2140993 2413108 2294848 2251926 2467890 2353118
14519 2353118 2201064 2243384 2289848 2613272 2612446 2542696 2711626 2810698 2604771 3061132 2966265
14508 2966265 2730435 2945597 3070974 2931678 2683013 2885858 2939044 2786872 3187253 2893834
14498 2893834 2984800 3361931 3527723 3226656 3298908 3563970 3299338 3599374 3757630 3324178
14488 3324178 3495804 3781205 3538152 3773600 3960907 3542281 3717957 3974777 3806893
14479 3806893 4097917 3726152 3977737 4144109 4059387 3948545 4143829 4049135 4307600 4168942
14469 4168942 4095332 4497451 4622516 4491800 4272308 4466246 4618192 4493930 4730312 4781326
14459 4781326 4556497 5036125 5053681 4986157 5108011 4984908 5104465 5267825 5238528 5584853
14449 5584853 5632030 5121739 5470003 5403496 5692789 5434533 6256967 5989554 6381938 5973210
14439 5973210 6053976 5994785 6395913 6712942 6398399 6495431 6580793 7024570 6938583 6987309
14429 6987309 7147111 7193199 7193528 7323957 7245198 7391680 7879737 7992621 8222868 8351674
14419 8351674 8460141 8508489 8450298 8652322 8648480 8848949 8793256 8653351 9174942 8849517
14409 8849517 9506771 9662466 9662282 9978845 10114947 10445371 10714880 10507616 10334626 10680186
14399 10680186 10745907 11019849 11127171 11323590 11604107 11648767 11836197 12096428 11805609 12454414
14389 12454414 12664635 13058836 13243475 13504870 13573553 13905527 13827171 14564999 14857388 15145050
14379 15145050 15644577 15453736 15744386 16060965 16401611 16561827 16922621 17274193 17765395
14370 17765395 17865819 18222434 18798691 19172128 19483569 20119646 20714054 20502336 21092057
14361 21092057 21342905 21642507 22743363 23050009 23553323 23934268 24391962 24934773 25613896
14352 25613896 26420940 26728220 27574193 28788314 28977230 29940304 30537735 31247515 31814041
14343 31814041 33233099 34000726 35226824 35746592 36761893 38024309 38844225 40054196
14335 40054196 41352824 42368310 43457088 44959142 46179981 47665764 49112262 50885289
14327 50885289 52700560 53841242 55839063 57731844 60202340 62110649 64180804 66730540
14319 66730540 69162016 71208773 74063629 76705414 79931089 82531942 86018056 89474855
14311 89474855 93271781 96767507 101118020 105340869 110083999 115002263 120041807 125389131
14303 125389131 131728793 137627649 144081359 151561591 158713592 166525612 174782664 183336283
14295 183336283 192659565 202524362 213078906 223787601 235262071 247479496 260042152
14288 260042152 273325760 286933566 301194164 316063799 330964337 346136884 361640485
14281 361640485 376893352 392091023 406392643 420300487 433314190 444879135 455204011
14274 455204011 463434626 468766026 470395459 469592765 468423775 464785212 459021025 453779722
14266 453779722 448311264 439711113 428941234 417210927 403315113 388348328 372459325
14259 372459325 356472744 340207944 324796527 309158287 293979923 279875164 265967979
14252 265967979 252975073 239991450 227645750 216274143 206707540 197393250 187331764
14245 187331764 178181768 170391596 161974163 154393334 147246570 140404085 134199600 128367917
14237 128367917 123273208 117476589 112423207 107778205 103115833 99326595 95435283 91960293
14229 91960293 88247111 84694975 81283819 78714157 75800556 72807377 70195102 68056778
14221 68056778 65177771 63390695 61395894 59160235 57122138 55419953 53668733 52007600
14213 52007600 50962250 49198368 47472903 45843499 44216850 43633737 42570508 41483333
14205 41483333 40159850 38852870 37355124 36703767 35670691 35599657 34259717 33299223 32294160
14196 32294160 31739299 30780820 30096510 29621431 28769468 27926572 27285159 26305355 25673380
14187 25673380 25479085 24699068 24250231 23581116 22786565 22768788 22334605 21490928 21259248
14178 21259248 20534481 20189472 19846195 19533720 19253885 18514707 18267702 18031106 17726407
14169 17726407 17464725 17354604 17125185 16596354 16099507 15740037 15555127 15378744 14987750
14160 14987750 14754188 14540159 14299117 13966800 13886611 13450505 13216347 13352490 12789145
14151 12789145 12697924 12399710 12054079 11885892 12035705 11889938 11471775 11388450 11560508 11130439
14141 11130439 10799077 10292495 10629222 10376665 9932984 10124192 9816415 9592985 9563169
14132 9563169 9408460 8945224 8996239 8987797 8871834 8887741 8811231 8647751 8548901 8072374
14122 8072374 8172348 7987773 8026287 7877824 7622382 7645046 7541158 7674783 7559997 7474254
14112 7474254 7346926 7057659 7231185 6927457 6857436 6943870 6643253 6514325 6539912 6733844
14102 6733844 6498485 6211624 6156823 6005885 6218627 5978333 5844339 5660901 6111529 6003961
14092 6003961 5668446 5615377 5557881 5654854 5234623 5498412 5345914 4990652 5463621 5289974
14082 5289974 4924040 4843884 5238538 4868185 5114570 5070911 4505519 4974061 4885896 4818246
14072 4818246 4559131 4585104 4523669 4587514 4249449 4671122 4490413 4371170 4510802 4425001
14062 4425001 4634943 4356448 4686240 4353699 4273934 4195346 4149317 4057922 4062277 4256640
14052 4256640 4023470 3589850 3685985 3565456 3203627 3565469 3533462 3443666 3388847 3395240
14042 3395240 3443184 3314884 3481366 3445149 3372908 3478473 3290938 2885486 3017451 3085937
14032 3085937 3473289 3293505 3123774 3200986 3214852 3087861 2866560 2897749 2973922 3071152
14022 3071152 3040724 2644007 2801410 2723195 3076657 3108810 2673675 2711647 2644984 2434553
14012 2434553 2416674 2443286 2442223 2502021 2265650 2667597 2312669 2395798 2248515 2231806 2339859
14001 2339859 2027847 2363960 2276721 2291374 2305480 1965052 2099921 1954793 1892306 2214555
13991 2214555 2164594 2520484 3067585 5008280 11030037 28880370 51273803 29028233
13983 29028233 15774810 9135619 6142908 5045078 4284876 3732445 3620559 3370707
13975 3370707 3198626 2896596 2939667 2604161 2924571 2450409 2629332 2347295 2457271 2501794
13965 2501794 2291307 1845657 2190992 2255244 2045759 2048541 2277258 2217553 2085889 2036920
13955 2036920 1765366 2225695 2496136 1921391 1880587 2155960 1913890 2047410 1673736 1724569
13945 1724569 1663971 1883154 2396456 2026282 2006933 1772000 2008387 1358712 1813682 1881194
13935 1881194 1913275 1647545 1820208 1964429 1810699 1781204 1500164 1522414 1453308 1729107
13925 1729107 1576369 2055953 1345613 1763641 1975447 1751774 1578439 1722383 1588693
13916 1588693 1538940 1667326 1101518 1191430 1835597 1571841 1365204 1428190 1591813 1456351
13906 1456351 1311439 1053746 1446267 1324872 1245938 1388408 1250000 1591853 1399631 1133863
13896 1133863 1526738 1149661 1230653 1320586 1172809 1515569 1530084 1226417 1594551 1509322
13886 1509322 1211362 1223396 1128004 1330707 1574465 1514688 1619973 1257086 1541922 1269653
13876 1269653 997006 1319357 1036963 1400750 1266888 1392377 1086252 1228838 985761
13867 985761 1300408 1056406 1195019 1075607 1124264 1515442 1434259 1163648 1351163 1182102
13857 1182102 1337677 1153380 1160176 1005534 1209702 972116 1058723 1184413 1381035 842090
13847 842090 1311350 811907 883405 1202624 1138842 1186275 1136023 1252387 1256517 1031584 1103191
13836 1103191 827888 751677 711870 1058568 989310 963071 1307299 970518 972396 870930
13826 870930 1039538 923603 881644 1137843 783028 1125500 727517 1073374 1244977 876627
13816 876627 705638 1017635 760540 536318 960584 829219 794607 566159 723173 1280568
13806 1280568 1015011 798448 917608 840693 887899 971519 627429 738689 955212 839752
13796 839752 881279 630033 1336414 954811 699106 942394 1050879 894486 982098 945959
13786 945959 377168 922421 761548 800528 841742 605259 646319 884841 961117 858994
13776 858994 842639 950177 653045 677011 597155 1099419 919241 582033 574524 309262
13766 309262 512475 946504 746763 553792 703967 659743 766511 651835 548291 474548
13756 474548 418449 731565 854955 991244 933492 360034 745617 623145 380206 746840
13746 746840 559352 711040 682123 764131 649364 1039883 809642 669337 685303 741734
13736 741734 440103 418735 609451 536792 586115 612551 878316 545765 1006325 489126
13725 604562 743731 515292 575454 422400 419390 400659 303987 601087 590537 606786 529411
13714 529411 357063 328539 823673 644512 308577 545732 150537 501392 625016 816262
13704 816262 454834 527894 418585 369140 477322 602650 657774 338806 940176 585227
13694 585227 833250 339804 424858 503481 619919 511821 520968 632851 239127 229529 568804
13683 568804 500957 409234 600778 457661 683782 510506 494851 430906 413273 450065 211940
13671 443442 284522 882913 324015 343446 550934 522736 -34384 170487 299796 527623
13661 527623 362832 538934 499846 207085 659547 671831 692000 152111 775992 482058
13651 482058 436877 493981 219240 773213 456015 447657 588751 182024 295253 211840
13641 211840 372392 504255 529917 207603 462181 339490 697731 496069 307234 452396
13631 452396 407181 345579 393490 372655 122059 508385 431429 245778 545572 102426
13620 383699 561002 442676 337178 371166 459775 510453 319383 236493 816315 472283
13610 472283 319238 585238 160115 378553 340954 743662 332122 91208 215770 289100
13600 289100 516218 567554 421985 198087 397916 117487 22367 241198 184801 538934
13590 538934 296340 215832 393250 313490 470819 374798 70872 539526 503279 234751
13579 492510 644682 254628 447786 419362 370780 395952 590319 230781 167707 739961
13569 739961 258052 384234 561772 641759 155667 155496 326038 394507 428946 481821 -203649
13557 363595 96921 118442 269458 48956 279375 601848 142959 205230 296876 210007 240556
13546 240556 214157 125522 392357 207757 188131 20156 377620 646538 143375 327885
13536 327885 376946 526922 368334 176411 366455 670098 261434 402128 439884 405453
13526 405453 249791 135233 177877 308834 264916 620269 147123 319794 470564 188503
13515 342462 704903 268558 521030 390270 90808 236737 242000 31146 112449 115446 -101901
13503 611514 148499 1942 447365 514904 530471 216591 235628 594294 181112 135727 153500
13492 153500 257980 147251 -106671 302836 186480 249733 532636 -43311 367270 96317
13481 301999 297990 231007 284138 52615 515398 244065 364748 -5593 54194 156152 361503
13470 361503 596067 501509 421819 21528 288824 83214 140941 212346 387871 -30046 445215
13458 322038 92605 50266 189537 8196 170507 271907 285746 396960 200809 134667 -62117
13446 275772 188992 338448 320695 300670 77357 366692 363221 389208 423105 317567 312107
13435 312107 124773 389572 -44889 59653 117252 -166693 306189 404638 322216 586906
13425 586906 63214 -67115 -808 -93912 371548 95244 -87487 18800 389518 227653 -121818
13413 385707 263883 49310 -38559 275107 -4413 315632 -99770 -59831 285217 529085 211462
13401 177261 62076 206748 236711 230977 87287 103894 132641 384536 155386 -183459 295679
13389 162870 222520 321715 261966 404644 208677 39207 -46049 64466 269851 223530 402547
13378 402547 -73193 199480 170658 16772 -104063 303569 412584 471573 441357 556004
13368 556004 411340 118059 492093 150286 64258 578820 178522 163871 328080 291157
13358 291157 176913 329899 190604 285563 237452 317790 371559 361109 116494 -86337 -24390
13346 324178 115616 705257 571927 -80663 128523 754709 259916 329232 328136 317127
13336 317127 328200 503647 175654 325239 -231627 -61210 127532 280194 164270 125820
13326 125820 -85003 194737 109197 145024 190657 -60250 559047 265150 313072 8280 169360
13315 169360 94835 329266 164236 354817 411704 281909 154351 356592 275877 240595
13305 240595 229307 -342092 286282 254586 424999 169259 150655 288662 253980 449554
13295 449554 233763 -1865 -95185 251527 397482 132694 209390 -88884 257953 -224256
13284 116364 20782 70741 48515 210491 133164 15019 426423 367241 -103404 195098 -108541
13272 175322 368696 95967 282768 43876 302758 367026 33593 361323 168478 -26290
13261 -244620 391644 -36626 494108 218528 205239 -107017 -79746 229449 474163 -45980
13250 164323 -7975 84691 431028 149424 253276 74039 -67191 59060 268252 111108 195679
13239 195679 107325 348399 88132 12926 40441 246967 357193 -142917 40359 170114
13229 170114 59421 108246 -106686 79356 -32017 179085 126945 31826 153424 200067 -52879
13217 89828 242597 239225 81314 286024 -153962 103235 99680 145578 -164411 71083 86176
13206 86176 13183 -251070 199483 134677 -199293 194048 -113785 302284 6194 324853
13196 324853 79624 50894 -88768 214726 383202 7203 2582 140914 304342 376197 -70023
13184 -24752 210994 117547 483198 167007 -85747 5329 72922 -40953 5205 74573 -303882
13172 154689 4528 193208 301142 18276 -422902 220317 -346144 -140770 -27618 -234348
13162 -234348 175560 224806 27378 232961 -22553 -95242 12100 -136679 -343373 -339631 -55161
13150 168901 -42806 -22078 308540 76593 539050 382661 -202352 331100 194449 11196
13139 36516 -300084 115727 -11554 447160 152281 141035 -3771 64651 77121 146212 123943
13128 123943 35479 88028 79149 308180 219618 -18704 164352 151863 -144397 -180047 -92400
13117 -92400 44838 63207 201326 -37114 259159 50047 60086 151904 59342 26424 96493
13106 96493 -33234 188961 110322 126231 76072 -47826 318464 3610 192621 -97556 203091
13094 193084 47821 175168 107878 -71933 292272 103889 281317 -382346 -60911 -71282
13084 -71282 26998 -6600 -105228 172450 -296500 179952 247635 514303 37922 42786 293778
13073 293778 230753 316689 324460 -195993 381560 266760 439951 206746 -65966 276696
13062 26589 -24836 356636 182218 193584 -164507 -107604 315369 23970 238208 176314 148544
13051 148544 327660 66389 290389 86702 180930 187122 -140336 162830 1964 -19246 183273
13039 -138010 38793 -94868 35806 120516 57704 143683 185513 60234 18191 29260 -4423 334663
13026 296322 29520 52892 -7871 103359 8625 115413 -171162 -81941 15650 109601 -165009
13014 360912 29324 333116 21129 229624 10432 -206098 207064 55756 116706 547761
13004 547761 435053 -48105 -21545 -49869 159044 225750 -16339 204152 -170824 336369
12993 167132 70040 91515 -122978 63639 57205 -120977 -58423 180970 -629 71105 146156
12982 146156 153171 279615 -105094 272124 -174660 -74404 -92801 12972 18554 -49290 -47710
12971 -47710 143804 68326 12381 -93681 -71908 27064 -243257 92104 320189 246377 -36913
12959 -340289 -27525 -58228 60960 -209286 -123425 -241089 89915 -15084 11716 41976 -149180
12947 -167806 -30503 -59968 -165765 -25223 -151807 -200125 191924 314214 18184 46367 22580
12935 287894 317798 -105460 49509 150138 -38503 187360 -61780 -178217 -192403 -314806
12925 -314806 1688 -4670 -167142 -39441 104660 153796 -75030 252265 21599 -100677 149428
12913 99117 76865 -124626 369289 -251674 149883 76825 355525 -14219 -664 -148721 -78351
12902 -78351 57014 -90466 -228756 168535 -189509 -215838 4101 -58015 103706 29283 -94270
12890 -195638 -9866 19551 -139908 669300 266082 225154 315893 -142021 227471 -11707 152346
12878 261908 -56968 -123666 77320 -114241 -146342 -213812 -128929 -74640 76322 -369531 11982
12866 156085 -59601 92380 12964 -119671 -120503 -2261 -154822 153825 168362 68484 137492
12855 137492 203224 -37653 221506 199820 171690 94863 211446 232707 -65947 -59534 100494
12843 236253 18419 161540 -255463 -40125 -37548 -77309 90400 227743 41419 -133953 -232967
12832 -232967 44540 -65532 50791 -50092 -192322 250061 8853 -327449 -1182 -13419 -248137
12821 -248137 77060 42301 51397 -5445 86525 16065 -2228 -47750 -85786 -359114 96588 -125342
12808 -302973 205693 -5775 -53839 284777 84871 125646 317762 -95673 191508 243090 -220511
12796 -141655 44304 152277 -216621 22019 -54038 -53104 -206527 -163572 -312680 377345 89807
12784 287989 14244 -148079 -199802 -380203 118623 -49431 -146619 -66762 193925 -282127
12773 75309 121078 44188 53850 233625 125355 37138 -414175 -323725 -147196 39032 288667
12762 288667 76343 62422 -407152 65464 103912 359477 306630 -53506 76745 66846 26229
12750 20501 -189159 -111198 -126259 80682 153321 -36632 -163870 -105046 211279 128557 100500
12739 100500 4370 -43416 176952 194342 50625 12490 -187867 89547 -177355 -49022 173189
12727 -107093 111336 -274969 100606 -64250 298824 -92226 -131733 -143493 -17922 12381 -181269
12715 -9682 107283 192477 -217890 -57568 69592 177312 93517 307648 87035 -83885 347566
12703 449027 142434 25359 -3474 -75023 184604 -153768 59259 212224 -87422 314017 -132009
12691 -1670 90721 -26304 313821 147457 -44814 234901 110829 -8188 254258 3593 214665
12680 214665 124518 208821 -14543 64102 20723 -51565 81829 -264214 62529 69165 -28993
12668 186233 -46787 -109259 -249061 -206726 285847 215666 298793 -112806 -143154 189184 -149871
12656 176321 -166394 -104658 -104759 -161593 58165 370495 80580 268249 -119453 -26778 -85028
12645 -85028 -96993 300788 50372 140802 11219 -7147 -201280 118502 -111079 81162 133383
12634 133383 -185228 -57337 107719 166587 104447 199609 146258 199052 79804 -54382 140463
12622 14736 170693 630210 349426 -36632 383430 -97336 -329811 -8669 -67557 -139885 282958
12610 -205220 -139503 13111 -120909 393763 109868 103445 -124133 4548 -15000 -109718 45360
12598 226897 394737 -73864 132547 42468 14983 91660 -200870 264312 29369 -300668
12587 5092 203470 -74585 -248955 -88031 -73248 -237329 100576 -45816 21445 -199042 16797
12575 -369406 -67060 -110228 -169753 221600 -186896 -16777 35536 84473 307485 125730 79974
12564 79974 91364 26259 45651 82906 92184 -7073 121394 221830 272257 206966 248233 150902
12552 150902 -3372 53399 508173 179739 113133 -372493 176672 14620 263924 -32181 239445
12540 102323 -58874 -101376 61899 -90350 -38100 -448997 140401 14686 -302750 358856 -45733
12528 -12803 -89212 -70463 84696 10804 -68876 64270 64684 190851 -272108 -55225 141329
12516 -77210 -117402 -131284 -46172 142018 68642 -16072 -107648 -132531 23144 -26616 -87068
12505 -87068 -108364 83783 229983 -266851 243776 39263 68535 -17340 -289809 348121 -225083
12493 19575 138411 25357 1794 -198576 -66345 -296708 133867 -58869 169167 21613 67116
12482 67116 65982 -193520 127841 295707 72951 -4563 163881 138970 186524 189449 101833
12471 101833 68492 60438 -86396 -417803 -60001 46456 -39155 25103 -289330 -142084 134565
12459 -337242 76638 10505 126942 93460 -11210 -170903 63012 209347 -174769 -260489 -255649
12448 -255649 151194 -91884 35570 334500 -40604 65375 37481 -205890 -245240 -137708 -106700
12437 -106700 -10377 -22899 -1928 -226470 20391 -896 388653 31636 129538 -236046 78209
12425 261371 -56024 9872 -111139 -181586 229971 -311551 31879 -12119 -127436 -41087 -3010
12413 268426 195699 26797 48674 -62731 -281627 -282345 111388 107632 -15102 -79855 428755
12401 114512 129026 253106 -110303 -129089 107625 34726 174420 6946 -55867 283050 87121
12389 38375 280280 -71805 84944 320628 194004 -97545 -299695 154267 293532 -29346
12378 -200196 -27832 122172 135963 302590 -38351 211527 125282 135087 176636 138315 101050
12367 101050 291094 -197421 123341 176361 -112449 17494 78208 9258 -210856 -91435 354533
12355 -108912 109352 -5590 53383 -159589 321543 350811 -249844 171984 96460 -53377 195421
12343 -113630 251208 -80230 245954 388622 -26098 -73571 -116908 73695 -181243 212820
12332 530587 281637 37411 73864 160434 188990 286319 192011 128428 -212439 81160 154101
12321 154101 226168 252151 231143 380143 40346 364871 -57763 317947 62347 301321 -63707
12309 129914 -105409 -33548 -60218 90132 -609 423764 -118365 61260 -231685 10163 -114310
12297 22967 -75497 162274 -122329 -10213 31998 201774 -19104 -36960 319843 -317 140802
12285 287109 172572 819 87176 387767 260099 410317 -61966 173252 41996 -32035 598146
12273 366326 289498 235581 -64854 123622 65011 488013 277437 228781 379804 -15367 -85459
12262 -85459 32784 -81230 -91468 7040 -35314 220862 61670 -3633 142155 264024 87385
12250 231649 707 190616 101523 208804 -97444 333379 30865 -25840 339910 94180 -52933
12238 -90829 194676 284153 328098 -68971 5014 52580 -96957 80900 49513 231996 -178159
12226 -8028 361490 3907 90726 262457 124846 144178 512753 -19602 329017 -106778 293702
12214 331389 113755 120764 -118219 -135527 121316 63638 145584 232114 378200 -85577 153092
12202 664153 244703 238053 110452 132949 360882 258925 171071 174939 188741 190348 135853
12191 135853 193486 -85169 127932 286357 -26595 -7320 310277 364792 129892 107124 -112091
12179 -64950 176277 -197043 207354 -34670 263316 -128726 173521 3320 379553 407487
12169 407487 204630 215413 321046 275334 282967 243785 663309 234157 190576 33532 46927
12158 46927 120731 -27853 -220964 464365 45091 164117 -5362 219611 -14123 189936 148309
12147 148309 42047 62882 -226902 219567 -160306 -112760 102929 472292 -17904 -109830
12137 -109830 -138235 114408 -77082 367266 86585 -30118 350866 -14095 -327603 284585
12126 59222 51235 -112940 201332 20545 110752 128579 70556 239307 284843 248524 22069
12114 337428 21190 166975 -22879 -230278 128032 -197877 -56450 -133562 389328 -110861
12103 -109446 49195 2980 -52178 186637 220876 74905 80651 82331 373493 242747 103265
12091 82156 -131522 -65847 354037 472633 302950 117212 177052 170148 127395 -66932 507873
12079 1619 -7250 137141 -77538 137289 -20423 269891 248116 237612 -26476 20646 -47136
12067 -156301 -20960 72295 84071 214010 88789 -55818 38337 36963 164330 -249936 -342613
12056 -342613 311870 -62031 -186847 -259487 -25897 -95958 -198337 192648 42606 -67315 -40360
12045 -40360 233765 141649 -48261 13046 27128 67853 88179 -58383 -8704 415578 56503
12033 48121 107451 394193 -123406 122923 -177269 -248945 -403583 228683 251862 293366
12023 293366 194854 -116741 -164110 87993 120029 231643 325541 164517 58550 162267 119567
12012 119567 125507 206834 229174 316679 108611 -27990 -182208 68397 303986 -76456 183813
12000 86553 146106 -219581 290218 -84718 8453 -259972 158232 -64181 -103426 312580 -36471
11988 -52215 -116225 38999 -130925 88266 -131954 -319923 92606 404050 -158853 -109278 -144611
11977 -144611 173939 -13266 -128217 -76287 204598 141964 -39618 -139730 -27809 217589
11966 -77265 95000 140286 -135075 -236193 83048 -183683 -100552 -99266 -86797 -159228 -39788
11954 2678 16301 -111349 -46857 78049 -29724 -98518 363553 -190445 -43765 100312 -80580
11942 -34924 -31037 -53210 -55077 60864 -4459 -121977 168621 -24554 109075 23043 9846 -20518
11929 -172297 190005 -146824 -279069 -69287 3579 20786 -100336 -96651 -287942 86680 58273
11918 58273 77002 122029 204344 36810 -174479 236125 -24239 174556 130169 -99345 119235
11906 161692 -82533 11345 74762 -140362 -158022 23484 -54789 -29091 -87564 -147000 -123057
11895 -123057 160548 7013 -80228 -52083 -113583 205221 454922 103483 5126 -285157 -252458
11884 -252458 -393088 -161380 -345697 -66097 -47102 -115654 133189 26391 54379 37999 -107644
11872 -59121 -204398 107065 14396 92028 91589 -257880 -139217 -67975 -276810 -45752 45402
11860 -168387 -321554 15162 44380 94157 -78695 -21664 251387 7916 -62326 -150861 3683
11848 131706 -218832 152603 355112 209949 -126442 -49926 -154137 280244 49926 9676
11837 -68084 -109667 -5113 -28437 54385 -271393 181009 -168629 -187607 -307366 -25413 143732
11825 -162590 40058 8150 -442625 -276958 69195 -158344 -117340 -109483 84869 60724 -238470
11813 -291417 67465 -173821 -103587 -402028 -23514 -96715 226357 -182538 81034 -56775 36116
11801 -249165 -33330 -69996 168440 -253354 158203 118222 -24156 -67275 3253 -22825 94839
11789 -132548 11790 278906 175279 -65637 -90433 -36298 100509 -299180 -201217 48277 46328
11778 46328 -426743 28253 42160 -277901 -48941 -144949 -43732 -233949 -15590 -316473 7449
11766 -28258 45097 -208325 1718 229325 -134604 -282258 26029 -142247 -234239 -50783 133784
11754 -184528 141918 -54793 6200 25719 318375 -33364 1774 310242 -197181 227504 20867
11742 -188141 -44150 90851 -258952 65025 -183486 237615 71702 -30857 -164847 -42567 -125640
11731 -125640 -25903 225826 129723 225796 6415 363124 -170977 146088 -172689 -55750 144904
11719 156551 -114333 -112994 100675 226221 168695 20582 -126045 -20114 -250965 -175477 -105009
11708 -105009 52990 -132585 52245 342838 206922 -360498 1288 200415 132118 122704 -45633
11696 193758 145686 359253 -179332 -27675 -85689 144856 -365790 131933 118783 -273701
11685 345179 -41384 149675 -30687 -47518 -59580 33506 175771 -69669 32276 -64908 -162005
11674 -162005 377487 156878 45668 204647 -111041 226719 -33 164040 17875 -388699 103525
11662 -148077 -190980 336240 64178 -120634 -157013 -210410 107223 75713 -178605 -67332 -1599
11650 145249 125404 -114124 167631 210783 47745 218941 -202074 -30840 -86289 -181354 37583
11638 -302086 -123217 40294 182119 -325008 -98537 -7104 -196861 31704 74945 -129619 263503
11626 111881 105206 -118459 14143 989 -130057 66272 -85681 -334148 52614 -116516 109224
11614 -50451 -151610 31507 250180 96032 -39450 -34581 -163783 187628 -206903 -125626 -126068
11603 -126068 -574092 87056 99021 -308085 -49652 -30944 -42914 3162 -61413 58331 438143
11592 438143 70357 200181 41669 7609 -10145 -62210 -244706 34734 -39892 123862 -194367
11580 201472 259315 178556 -79565 167493 112516 -70815 180187 105244 13712 249276 182233
11569 182233 30171 165559 -46808 250263 -171090 214148 91656 316544 168232 -53532
11558 221242 196404 221878 -171883 257644 -244188 507924 81769 -156868 -130682 46055
11547 -372281 258469 11688 -69487 50923 60151 174479 159681 -233437 -64405 60865 5471
11535 172982 -94769 242920 145436 443101 39020 169560 2344 183261 170059 -38209 303642
11523 330408 42236 -38001 392125 -308824 126027 155329 354863 80387 219038 86422
11512 45981 235895 -196561 33708 -207764 178395 -222609 258872 56077 158254 -142809
11501 62923 -200714 -304762 -308931 230955 -366012 -61293 -36658 -62429 123573 303338 85711
11489 254458 212195 -36806 -86596 -646 6347 100461 222185 -4978 -209989 57682 40082 -97629
11476 -132062 284818 377226 -47127 118229 276982 10473 -65185 416027 94019 -207053
11465 168963 291544 203009 100218 7343 112335 270125 -148332 -112676 -258700 187251
11454 84470 149726 -41489 -60503 187173 233090 11207 -331007 -162813 266030 367415 147005
11442 -146115 56178 -52656 -159502 -48050 -28934 -5606 -243853 270483 -86235 -43506 -299179
11431 -299179 222910 139065 57123 245493 -341805 355543 -217920 251688 -203509 -78959
11420 -163736 -65640 95223 197525 -190663 131998 115623 8502 -130951 51779 -7828 174064
11408 108005 345781 239540 151224 -359421 254188 -21401 88091 -102252 57291 154398
11398 154398 37850 130501 -108728 84340 355306 -60732 80857 -8201 -107665 107113 -293152
11386 -59166 -145246 -99936 31783 -16643 -89801 19107 -379324 -125879 -15095 -89202 -202024
11375 -202024 -34713 106045 150594 176536 -202594 437879 -293696 -228754 72142 1809 -557602
11363 34663 -195767 210862 -104485 403333 -274696 10714 58544 -30689 -186186 -30323
11352 -266570 -128089 60612 88679 -230670 -133951 20211 -62116 188521 25865 178010 225590
11341 225590 165732 216115 134064 -80768 -266378 -315777 -138889 78559 -404244 158479 138492
11330 138492 -97995 -146575 -10209 -264579 -159955 -196237 -112685 -57381 -214277 -60019 96170
11318 -169784 -40096 42966 -151829 133623 292310 45801 -93883 -2189 -283307 -265447 -25680
11306 -311757 -52359 -160301 159052 -81984 -266181 -176574 -64798 -226424 -264430 -126309
11295 103624 148755 -306572 -99549 -231648 282375 74215 60784 16612 112312 221327 125601
11284 125601 -64860 85532 -128594 -244656 -106803 -73278 -77667 -89356 49087 -157535 -39142
11272 -24582 -48269 124969 -116392 -117030 -143810 -99144 180593 -411 -59546 85792 -123687 -284410
11260 -284410 -149429 -403142 11937 -23829 -149436 -89340 -4526 -176781 -40218 139916 -28994
11248 -391318 -136775 -306556 -114922 151971 166998 261992 -76943 -317506 141880 -258377
11237 88561 -57959 -145696 22157 276621 246614 51200 54313 2109 -10150 351857 -92924 -342977
11225 -342977 -156691 -40818 -52410 -311760 -47989 27332 -252647 -237896 55886 31273 41365
11214 41365 -36125 339104 107571 -201585 58043 169046 -165547 -119107 77543 -346477
11203 42880 -76674 -85223 -201633 -49929 -251470 -41800 -125243 -165438 163065 30339 133443
11192 133443 -112404 -237507 -290742 -1796 -252079 -108673 -213472 -132538 189997 100264
11182 100264 59549 -319778 -66951 -40510 -71569 94978 253651 -70961 -471729 -26150 -69413
11171 -69413 -321168 -115483 135383 116345 -212914 23811 -115231 -143398 364 -342911 -223504
11160 -223504 115772 -13388 -296766 154008 -25836 -162879 260047 41415 -206941 -336346
11150 -336346 -181230 167591 -165961 -203197 -13224 -311150 10625 -40116 35516 -85271 -83846
11139 -83846 -219494 415497 -223026 18516 -63286 -90271 67069 296803 -90054 -323016 98692
11127 112086 34907 155997 -273876 -236511 -68772 200081 324431 208649 -264982 26075
11116 -51583 377779 312869 -132280 177540 55595 320138 -26971 66956 56631 90834 -261388
11104 76258 179283 438672 100809 99848 60643 -22716 241017 164476 110678 298911 122575
11092 33234 205635 50936 -207471 166404 101170 29669 62802 144178 -5402 -120809 541912
11080 118151 153731 106022 132532 195461 299829 -31680 264703 46140 305167 -2085 149868
11068 168966 411621 15935 415615 287689 310737 443340 67872 373959 142659 138328
11058 138328 424144 636295 368887 460555 778663 474119 490554 217309 606356 439242
11048 439242 442259 768844 724536 838448 807483 610995 923526 1009892 621108 743407
11038 743407 641864 1059506 419918 531747 672036 672654 682504 732911 465014 325111 587141
11027 587141 1288043 760721 584820 638952 278642 620355 775992 860857 532175 623934
11017 623934 420567 491464 562030 563111 104642 475343 395401 632413 340349 394288 504059
11006 504059 656686 451327 370118 470349 611550 394667 410151 569490 361368 697804
10996 697804 513681 526277 594898 624345 543475 459341 406909 565714 708619 638102 758338
10985 758338 841529 572167 414602 996998 605214 1042671 502269 706189 979714 1282349
10975 1282349 1203207 1252547 1660823 1596391 1461534 2302668 2077996 2248998 2445021 2358969
10965 2358969 2063582 1848613 2177983 1536660 1882053 1652211 1282495 1273232 1462992 1493443
10955 1493443 1472138 1505579 1715690 1471855 1446756 1536856 1221295 965792 951796 776189
10945 776189 746165 657663 539787 300641 397731 357687 310898 27984 534794 431985 52925
10933 -27573 -23343 379503 56278 301309 256954 60993 11855 170122 139741 -219427 -42131
10921 70744 -308428 -153077 10841 -4233 -88978 197698 -85598 385457 -289943 -56663 -146055
10910 -146055 -231801 -183891 3542 -82614 -102876 96688 -113960 -174966 65402 -137895 178100
10898 40267 115947 -34815 -18660 11962 -156772 106295 -162068 174727 31061 67037 -307715
10886 -59943 13068 198739 -135273 88603 -187684 132789 95451 77601 72290 90690 194941
10875 194941 -72060 -99015 29072 -199619 -155230 -151005 -19398 -267110 -169400 -207240 179956
10863 121797 50256 -136193 -205405 -41161 -319786 210250 -244227 114200 -60609 -132147
10853 -132147 129245 -69011 -62965 -14430 -226771 -280853 67843 151195 -31203 38637 263582
10842 263582 -326037 -254871 -55027 -149535 -16677 -121140 168886 79947 239590 -123301
10831 175881 -162356 -320132 139302 -396501 -89328 -62019 70540 141538 75179 103635 125026
10820 125026 -73148 245076 -18182 357191 58965 -268248 46102 50072 -11710 270738 161706
10809 161706 -99980 -42893 33433 -324071 105416 141954 -245757 -460059 -74707 -174578 31243
10797 -53531 147541 -59195 -279888 -478777 -153417 -36100 -251426 2846 -93762 -76523 345120
10785 42771 51118 -196390 101979 -99805 -3301 -19746 101686 117397 149370 70833 208563
10774 208563 -357761 -155704 53439 -87742 -110205 7833 199406 16863 -76819 214865 -120336
10762 133923 52399 192157 365905 -167199 116061 33980 -209674 47139 113572 -226296
10751 146418 -98982 -23265 -305525 -29489 -206956 -65186 -669 120146 213086 59645 9996
10739 435691 -49965 16956 86507 -214108 121644 -119640 60686 -151038 -29618 -373940
10729 -373940 -110945 -190855 343924 -62904 107321 18516 91923 69303 -93477 -94606 -37379
10717 -261877 -174595 -35157 99814 -305544 -153941 -182433 211194 161424 26440 130433 -304105
10705 -68753 -63394 -96736 -239104 -183557 73582 -89930 97407 -11262 162402 -231311 -6360
10693 -156200 20467 158271 103010 -173060 -10290 -290592 108488 -174502 -153428 -130024
10683 -130024 -301762 -84529 -286103 88896 -277086 32459 94646 -69587 -100953 89823 -147849
10671 -172861 9414 -113052 -263393 -376514 -200922 115662 -238662 -263035 313497 156026
10660 -405717 101103 -25321 -3908 -173324 -167777 -18896 -98748 -160548 -78806 95746 58374
10649 58374 -347778 411758 118049 -56851 91406 -661372 119740 211946 -388344 365320
10638 -266253 -51242 291326 133870 -154856 -275110 -149098 -158868 -325363 41000 -253172
10627 -101806 147537 -121143 61317 -231117 185041 12986 -245830 246508 -147306 -110033
10617 -110033 89178 103023 -31719 332054 -42383 122319 -29133 -135666 -157508 -84787 -7288
10605 -9337 114935 -201761 -231303 236923 -271964 -111320 -153611 148584 -104636 150134
10594 -279252 -463055 539 -114401 76205 -190511 54724 191606 139137 54487 158951 -95035
10582 74283 -273520 16348 -176854 205384 15145 -136902 -397005 -32208 -39651 -248924 213276
10570 116790 -12141 -44509 -77701 73488 -172428 3206 -16375 -107056 -118593 122285 -12389
10558 -235302 -23316 92989 -12942 4649 10288 21726 221118 142082 -18313 -44690 -195618
10547 -195618 255618 32793 -165531 238370 -411775 5268 289288 -158069 88185 54423
10537 54423 -166323 -387358 -228684 -111971 -40799 -237803 -102486 29356 131497 -126519
10526 -40318 24017 -111117 67479 -128808 151661 -145523 -48325 -92839 -48971 160085 -200257
10514 133664 -233135 -117152 72301 89499 -27485 -316162 165334 -340873 122594 -211134
10503 84714 -217406 -213725 155808 -36072 -34592 69327 -122284 -179207 -163731 -156560 345655
10491 -190562 -234904 -22629 43362 58587 276408 -4768 242763 -47342 -119103 33078 -268608
10479 357289 278777 102379 46585 375185 542391 587432 960957 213593 391462 13619
10468 291763 203099 243772 -83281 152987 -207177 -79354 36369 -330440 -160917 -17590 -148370
10457 -148370 -117951 16561 252634 40709 -202865 -3525 26642 534346 107006 239359 -102942
10445 -380612 -95894 266116 213475 337408 -137600 207406 48146 243426 -91316 -79521
10435 -79521 91954 223774 56389 -377611 -193306 -215026 -179499 -45424 -98050 -128385 -127044
10424 -127044 17063 102485 -28222 -94676 40347 88226 -71324 -145617 -15576 -340428 93650
10412 -442766 221445 72421 -260939 -223126 -25807 -127338 -35904 -234029 -133189 -136320 -218510
10401 -218510 -60898 89312 51640 180448 -92413 -211388 -229480 -1778 -321991 149697 234028
10390 234028 -202596 32796 -209220 97811 -160203 -189593 -158581 261107 -40494 52314 -362540
10378 -61385 50336 91098 -47250 248727 184263 150926 162782 313641 -197255 314470 284226
10367 284226 220348 121438 170911 10178 723476 417271 323356 -153897 485408 104918
10356 108657 346310 89161 -189385 205677 -87603 56533 181122 313324 393369 415392
10346 415392 278369 84583 448607 -11643 229751 585135 163605 218493 405492 221566
10336 221566 50333 437456 330330 360050 322130 177534 -134479 -147051 219548 182681
10326 182681 -49519 -12440 35655 3319 174304 33429 349569 284632 94008 -47178 183623
10314 257826 142426 -19131 -162155 16071 94774 -164717 155419 -305551 -29973 -81836
10304 -81836 -120536 49069 290657 336684 -257636 459759 -204564 -41621 111624 376246
10294 376246 -93997 -262285 3971 -188557 -304296 -101671 350729 -186993 42027 209806
10284 209806 -97814 -126730 158066 393937 250307 -30844 -111199 -280461 -57361 -124225 -286669
10273 -286669 -185474 319822 -76663 130283 -262330 -182505 23827 -1014 198888 231128 141017
10262 141017 -87604 -164375 78607 -86222 -62477 -36885 174661 96035 27725 275742 271385
10251 271385 391702 90105 106431 293808 -138306 -109311 62216 300469 15263 95627 6646
10239 -118910 335211 171407 -158692 -35805 213355 -113463 148056 -395938 -19147 -275394
10229 -275394 -35435 82951 185088 140026 -382207 5136 316605 135235 -352782 69417 -176001
10217 -156308 1776 -152628 105185 -34117 354413 141495 -133547 159219 -144203 60730
10206 -127899 2740 -263318 -201138 -42494 -321574 -153797 -129018 -104721 77915 -170388 -227408
10195 -227408 -463156 -203640 197117 -299662 -255883 -101735 -110917 63900 -163288 -70241
10184 306546 -367059 -40114 -42007 -259228 -85914 100090 48765 -92881 39035 -4246 -121427
10173 -121427 338631 76901 163749 22792 -380026 -62919 -24361 -160552 -342756 6233 -147755
10161 153249 233890 -71895 140029 -13122 -81788 137705 -107840 -211734 108282 80097
10151 80097 51376 -175766 -414556 69595 173854 -77401 -141587 -124598 -151393 -10666 -242518
10140 -242518 -158211 120652 62767 74749 -25735 151471 92358 -244563 -21556 -274028 22686
10128 -70468 -308170 -11921 -142679 201936 -639813 290150 -45946 -24543 20836 -323449
10117 145445 87387 -150106 19923 -184493 -7370 -200260 -349830 21250 -182123 -105691 393150
10105 -264089 97673 306000 -58238 -11865 -174254 220863 -413233 158386 168023 300425
10095 300425 -299538 -311805 -207769 102448 -187414 -148087 -171819 -221393 -42860 5318 326008
10084 326008 82656 193350 -211715 -270303 -67049 -168915 61798 -232073 -90141 -266416
10074 -266416 22353 -217226 -106840 -94560 -210573 47191 -46129 147754 80520 -63008 -454996
10063 -454996 65865 92671 -4025 -161192 138687 -113229 -42372 261945 -391659 -175254
10052 -4325 -47625 -208163 75838 61182 -147406 -240961 -38630 -262898 -54541 -198879 -44028
10040 -104365 41054 -117796 -85959 -524128 107831 -151407 30466 -515651 -130584 -211171
10030 -211171 -143138 55589 -70141 -33959 14502 -22202 -137426 -55584 27185 -344772 -305456
10019 -305456 4899 57173 -208783 -36117 -296539 -289969 24805 -19362 -102345 -143248 312 -259249
10006 42955 -198 -193914 -293182 -52371 -41259 33111 -187394 -351309 -252671 46027 -209646
9994 37845 -182230 -133600 282261 42223 -131884 47625 166866 69018 -165449 -249309 -73615
9982 152101 -11468 -69850 41119 202446 65845 211392 53529 -111842 2885 -330950 141990
9970 170559 -275470 106536 -231624 57369 221477 73108 -355178 -99137 -116350 12932 -47366
9958 29380 -317603 -364532 130582 156765 -66623 37587 224132 105318 315846 -137668 90084
9946 178769 -55304 -204610 -44369 694 25727 89827 159590 -80831 -73326 210685 -168176 175387
9933 -40235 202476 -8517 -176863 -213111 -101181 -195040 -24574 -238397 131643 34623 -218275
9921 -208062 -52716 385519 294344 -35603 350725 -14909 405858 182115 -241621 11929 -188012
9909 -18887 -77226 177870 -154104 191035 -107898 -96044 29926 90510 -369023 -225920 -92746
9897 -200446 35739 -8098 55831 -292190 -306979 -206850 -109744 -141168 -242689 -251405 -261269 -101009
9884 123855 -62329 -85865 -138291 -127251 -119877 129610 41505 -250594 -327719 -286842 -70106
9872 -105746 -498755 -50260 -110373 -420112 -457523 61767 -58449 -38190 144594 -344463 -142877
9860 71825 -81835 -38162 -181216 -53540 -198162 -110403 -138298 -301237 382036 78163 -92803
9848 -10789 69293 -54665 309468 -65348 49219 142659 225745 45766 180733 -32497 227917
9836 -74106 25471 64020 -435035 -151113 49834 -104168 -105396 -25302 172310 102070 -133140
9824 -147786 9919 183172 -100769 -37159 83361 -196206 -152499 -76359 -206126 112768 265826
9813 265826 -39856 -218179 -320420 -126152 -101249 178182 329599 -146237 -11779 -103029
9803 -103029 -219526 -417956 -93022 5675 -131325 -105483 284652 172381 -256859 -154101
9793 -154101 -118262 96663 30787 220237 -169983 36886 -270612 139331 -63488 -151552 -31958
9781 -56156 -189237 -203508 -329597 16055 86510 182552 -334161 41925 222400 56445 -213210
9769 -127399 -124725 -257718 -189020 173878 -279173 15012 25341 -57527 -318346 210318 -252929
9757 -64381 42787 -69720 -344841 -34553 -285649 -373506 -32961 190101 -144336 302314 -171504
9745 -116461 66303 68809 18208 16768 69564 -173228 -245603 -128539 -203522 -22604 -368971
9734 -368971 -71211 58754 -453746 -302400 230479 43254 -122708 -50662 253637 -147628
9723 -278306 -112804 -113364 -85227 -16774 -27372 -60012 30647 -41928 129832 113741 -4538 2184
9710 -169645 140445 222990 -419339 285452 31466 216707 6626 135889 -214455 -355044
9700 -355044 150780 -95615 -25862 -244718 -498925 -162953 -212303 -707 -316850 -314470 -78140
9688 -128734 136303 101294 258615 64925 -49258 -107634 -111068 -169981 -37766 -134882 -318177
9677 -318177 -102904 -166793 121712 14858 106081 -145082 -159420 -34930 -210257 -999 -54991
9666 -54991 -91533 64873 283332 -173277 -68102 -272275 -30468 -273588 -184011 -155953 -28851
9654 252683 247512 -199732 -90434 178516 -35092 -12140 158160 -250477 -516038 40096 -224405
9642 -144024 -202004 -56648 -126723 63510 -208372 -120702 37808 -169379 159857 -44227 -78573
9631 -78573 -174719 -277006 -82122 45263 -64623 -15145 -88788 113990 77414 296155 166366
9620 166366 193300 108326 -103409 -391319 -21785 -144795 -42721 113218 -205758 155267
9609 -378935 -205470 146946 136361 -167393 -85701 -178146 -19871 -125780 -102947 68739 229682
9598 229682 -4472 92979 -67439 65861 77370 -2105 196512 21768 120383 92777 -151892 241223
9585 -121521 26439 -39267 -231035 -261489 -192569 28266 260330 59951 -62167 91700 -188014
9573 -187154 265950 335842 149909 303996 -253672 -273129 -248968 -390875 -208754 26284
9562 162829 -396458 213003 -127602 5635 -191737 -97775 -10429 -95632 2198 -289946 -185795
9551 -185795 169266 38671 -58507 -251536 62712 -197840 -435651 81810 -337297 71121 -96510
9539 -526279 282266 70208 9253 -132501 -230106 -20197 -323886 30411 -289441 -112332 -213253
9528 -213253 107713 -121089 -209865 -205472 32973 240525 -442427 -103865 8435 -364064 -210346
9517 -210346 -244436 -132484 -67030 -199137 -17460 58456 -279331 -124272 -382317 -150709
9506 -186303 -22334 -63452 -222679 170281 -74296 246846 -134623 -447031 -8125 -115596 32665
9494 -344477 -104476 -79925 -47788 -52130 147859 75977 -36531 235578 -149518 98931 -151310
9482 60504 7819 -169773 195174 -261533 -40473 -181589 53771 -4481 -365020 -99429 -75553
9471 -75553 -270562 250543 -128879 -238037 16390 -50261 64810 -359280 -132370 -105552 -15129
9459 -94765 -261805 45221 18290 -37020 103645 -119368 -475407 -222312 325105 48256 -431564
9447 -106842 -213876 -342280 -80408 -69286 -147511 -280930 112964 121542 103282 89954 258712
9436 258712 -2838 -78699 -85557 -182309 -9075 -95194 -250640 -97357 -139229 11505 46914 373715
9424 373715 -59872 273045 -294868 13598 269063 -138126 195244 -35225 -81687 -253836
9414 -253836 -175590 -165852 88385 -150162 66934 -68374 -186522 -402605 127938 3575 9893
9403 9893 -295007 136395 20923 -291812 -38776 -244239 -79131 166440 -87736 -160627 -57556
9391 344334 408635 -208807 -12659 -260660 -244213 -159682 -164568 1927 -91551 6127 283660 206152
9379 206152 -352209 -271887 -631 -234663 144177 -46885 90884 -258362 -143833 -163209 18089
9367 -101030 136899 175817 66293 -89664 163062 -85944 -170610 60880 164495 -51977 24382
9355 -222437 -223548 -82644 -97708 -316483 -218846 -276104 101421 -176391 -175732 5196 150734 -53235
9342 -667376 -113997 28128 77352 17400 11442 110796 -277401 62672 -95333 -89804 -214106
9331 -214106 -109368 -12168 -17455 73128 -186460 -100081 -82695 -210485 -308998 72229 -488266
9319 122254 -103017 -48715 -268455 -41713 124406 110673 -63065 -63208 166529 361129 -243795
9307 242854 -91599 -106701 261622 -129789 -120820 55904 56310 -201143 -214076 -318812 -118845
9295 178999 350938 52648 111053 -339332 -84328 -156953 -109942 -73719 -11034 349194 16489
9283 -81798 -224774 130075 -85576 -81035 -139463 -95383 -89925 492163 -179834 54074 159501
9272 159501 -105120 317831 -97481 102178 -155112 110516 -104896 -8589 283753 11202
9261 39760 -197948 -11847 -87982 222927 -122337 88894 -98187 -3689 -41262 -369617 -232852
9250 -232852 -250822 -295242 -34515 44306 -28285 -237375 -261598 -10742 21844 -82200 142358
9238 -49492 144460 35921 -384256 -173018 -54617 145348 188534 -58357 -400656 65291 -475123
9226 20680 -231508 88417 -405639 -279287 -63380 200550 -23198 110946 59457 -289258 -11822
9214 -223609 -2609 -88541 -54840 -16124 -51859 -424907 -128849 66902 396594 131619 -49145
9202 3119 -94633 -13020 -305466 26924 104324 -323967 -46690 16866 129868 148679 -148507
9190 -120419 -152647 -52423 -92337 240859 -140297 83871 -93039 -48473 326613 -272761 -168777
9179 -168777 124131 -158646 23171 -107816 -151572 -442911 -92929 -158789 -426399 -411012 -144000
9167 23770 -108867 -171093 88448 -103242 -201363 61230 -1918 165037 41899 102540 157620
9156 157620 64870 172145 -99615 -70280 19740 -159931 116390 220064 -23773 -242471 120243
9144 55393 -8669 -81220 36020 -338942 81981 -206932 -115315 86736 -51352 -234942 -34683
9132 82421 -13246 -208135 167216 -79703 -3743 40163 -41740 -71322 870 -63898 -243354 -93816
9119 -363043 -39014 132164 -205664 210326 -147407 212570 126323 7587 220917 -166628
9108 -111789 279911 -279975 -159954 -26689 -281966 -566173 -132754 -301169 -80335 47591
9097 -199631 7187 -225464 -117684 175933 -192513 53424 -312049 -63634 275017 -6804 102816
9085 -181234 41279 163612 172891 255172 -215270 15679 -59751 115456 -45433 -212730 -99683
9073 -34132 32225 26913 10315 -234933 -376994 236232 -40396 -73951 -344935 -172175 -125549
9062 -125549 49949 32341 258086 -504920 -39773 47204 -346169 -187778 79185 40159 183019
9051 183019 -265499 -65597 60523 -265115 214935 -38360 141521 8480 30798 164700 198207
9040 198207 -173416 -113203 -307289 -93396 -169562 16731 -104627 31602 -112299 169855 -326257
9028 -202553 -33730 -309618 -205599 -29117 -90886 -316545 -57894 151812 20498 -25996 398843
9016 120335 -173637 -168078 15627 30205 -205304 -160717 -141393 -61532 -154543 113308 -40771
9004 53930 223190 -88694 -257863 -107229 -298547 35173 52441 137805 116825 -138065 22562
8992 139338 13484 -196192 66231 -209667 -135589 -236801 -137796 -406980 207123 -278505
8981 32822 -356842 -95465 281455 -139973 -234808 63172 -5017 -6221 77149 1603 216499 185002
8969 185002 62231 -438841 -71759 -168198 118591 -115087 247423 -185212 -105538 1135 -5151
8957 -34322 814 -322852 -281315 60543 182718 -136531 10387 -4813 184518 -31577 108930
8945 -66287 -271943 66192 -44320 519118 -155026 97265 -49439 -145826 -474499 -58070 -135402
8934 -135402 -189318 -157289 385532 297153 105176 205681 24249 -86044 102937 46590 -18858
8922 424566 445280 1093238 3177502 11927758 6387476 1940367 766458 346180 444278
8913 444278 114589 -275150 164354 196782 -67786 -80688 -59259 175619 -142705 -63428 -254168
8902 -254168 -87771 9799 -128434 -186927 85871 -28302 -30742 -219016 148396 -189843 -265646
8891 -265646 170309 56118 -127866 -126518 27349 -187142 1835 -251822 179374 -232186 163074
8879 -56258 -191364 -95468 -84144 -17748 3787 -110524 171354 96024 -239128 56974 -170711
8867 -85110 142820 -58765 119358 -116201 -271518 -81976 156623 103744 -89470 -3555 97458
8855 -75273 -289161 338782 -17109 -247094 229238 -75309 27186 -233282 203086 -46341 335983
8843 -93201 -32635 108950 -71634 -282190 -178402 -557 343452 89960 -50832 19845 24606 -85171
8830 214660 -101807 -108647 -9942 -65942 17283 -71211 54481 -87881 67810 161498 -27553 -127742
8818 -127742 -91617 29796 38822 130077 47559 -188914 -182456 -202485 59158 110996 -215259 -38420
8805 -13 103676 -59598 -92699 -28626 -107621 -535897 -143358 206248 -212579 21350 -178104
8793 17971 -2793 -204785 273709 -70487 -193908 -82167 56918 -88492 -55341 209554 -128980
8781 -49021 -134500 -62769 -84182 22595 -234520 597459 171819 -186146 -199940 -33510 -181082
8770 -181082 -313566 136000 -382676 -25737 -39850 -353400 -12118 -80957 166052 -89273 -90528
8759 -90528 -30810 -226695 -167395 -298895 -120848 54975 -66349 -87800 209818 -103627 37693
8747 213053 -10865 -23165 -19558 -231350 -338954 -272278 -116593 -66597 -362356 -67828 71969
8735 -11515 209101 -250946 -142121 -174603 18757 -220848 -29002 -57058 -196332 -157008 -159669
8724 -159669 123734 1642 9580 127047 -292181 -60404 31367 -141018 68223 -171032 -173710
8713 -173710 -318292 181388 -146121 55284 65969 177739 -77188 7256 93765 31138 -197964
8701 187758 -37891 -99993 116501 -87384 152786 16670 -237671 32909 31007 147564 18734
8689 -54579 -111375 -283821 317707 79203 57379 112543 -138215 198147 -123305 220809 11182
8677 -143402 184158 -64446 139269 -82832 81238 -143617 -380615 -16225 228119 85863 -205986
8665 113692 -195129 90264 -236355 -316709 -420206 -148233 -89161 -349833 312712 -466363
8654 -65325 186107 -160686 31826 -19836 443112 -136375 112707 -299290 166974 117718
8644 117718 237378 38103 95456 50199 -140701 87738 -277476 -497586 -283158 103517
8633 -5505 148539 204216 -124121 -191358 -235147 18563 -2117 148307 199567 -114036 -52611
8621 -50956 169007 -241679 11724 305445 32026 249309 -1664 22751 -150875 90477 -76275
8609 -140511 23176 -215242 142039 -253153 -437136 114883 -61386 -153747 253525 -144462
8598 -81674 -339189 21140 -302676 -206803 -230708 -170158 -399823 -194461 -24196 -1684 -108456
8587 -108456 116563 -59060 176171 62881 75064 -495050 296672 156867 -310580 -28601
8576 76000 -264718 -175991 -200608 74246 132241 -19152 -63210 48399 150679 128122 -106308
8564 -293905 62974 -118370 23259 128357 -24921 368406 373553 167000 -61943 -287732 188060
8552 -67240 13540 -159077 206541 112005 32923 25077 -253918 92827 50736 -34080 -237786
8541 -237786 -269003 26529 122080 44609 -181327 -159262 -20222 -37534 -70605 -284511 -86048
8529 -78886 26486 5006 67288 36278 81454 134778 -126927 -140925 123597 -206597 -360849
8518 -360849 -148416 1572 -228193 -133418 -5297 139879 95357 -391083 -116921 -81090 -148356
8507 -148356 -375825 -240859 148686 250246 -3858 78482 108214 -114335 67234 -98472 -342787
8496 -342787 -178741 -261701 135166 -12429 -62074 -272610 25039 -391651 -215027 60160 -120587
8484 -12794 179608 -22145 226256 51519 -44259 50942 -81990 787 -136694 340748 -149280
8472 51078 377876 72186 346662 184880 184432 5377 69314 117243 -133706 -63919 98630 -182452
8459 364957 -158408 -3206 -72632 -187264 197782 -130355 -23810 -53813 -176461 -17883 140689
8447 -231458 386660 -36576 -172414 245278 -190557 48484 -52886 -137641 195100 -321954
8436 -47623 -78635 168539 27604 -74288 225698 110925 2159 17424 129700 -100008 -186381
8425 -186381 -249640 -127315 28235 -128787 64005 206247 -143023 -137144 58042 108189 49024
8413 -351830 -264356 86763 -487570 98566 -165220 -150238 126753 -24743 -23249 -84520 110601
8401 -18937 160242 -85656 62270 -268726 -126438 -50047 229350 -84003 12747 -352077 -140335
8389 22614 -31034 126464 27948 -265888 116299 133313 127622 69809 -243030 -118864 -93544
8378 -93544 -281458 -53505 -254539 203233 -190521 193245 7445 49591 -121175 -18949 -946
8366 -185803 66127 49130 -133403 200941 -109968 1007 188202 -166496 417153 -31044 123849
8354 -21355 -154264 -8473 -272952 -84956 -48908 240365 -149119 -229908 -87339 -275031 -17451
8342 -300648 223463 109911 -27798 -239205 -78637 128169 -562437 -310423 -115618 -357 17135
8330 -440602 -65298 -86680 31746 -145809 149339 -165795 -95806 -67806 149800 6279 -72323
8318 -50911 141201 -55466 -27988 -89207 -43147 44784 145803 -102108 58199 -28777 -43785
8307 -43785 -243436 9677 -52487 -4124 120492 -311858 40259 -34185 25113 -105242 -67721
8296 -67721 -128837 -5193 -267920 -279368 -78077 -218477 23428 -255880 -163603 134623 99845
8285 99845 58701 -210013 -194986 -324088 119975 -244141 -282989 -58808 10628 -244018 -77941
8273 -39966 -290178 262126 -28216 -127645 13928 -128474 178669 39562 -23407 63652 206809
8262 206809 118257 -288148 68827 -209630 -121037 341760 -60261 -277645 -27970 -24835 -179888
8251 -179888 -98833 -132372 -97102 70927 168608 -31314 -144522 106866 -4050 132563 -120871
8239 -113322 18152 -167717 120174 41607 61912 35821 -89567 150383 -112520 -252318 -170847
8228 -170847 176796 -49124 -49067 39769 -376981 254907 216688 -385753 208570 -167980 -136912
8217 -136912 63863 -513480 -225172 -437170 -25715 -353647 -139296 295434 57748 140544
8207 140544 181098 -13092 194219 178236 197484 -93304 -165540 -23334 -142474 177649 -91189
8195 -270714 -273601 -32272 57479 -196237 77895 -78017 -54000 -8965 54946 176427 185632 123605
8183 123605 -310875 137472 -249975 105109 95666 -37680 -203437 -108060 78783 -319063 -120841
8171 -146140 -164782 -26073 -142980 53046 -469735 -351189 24921 206707 -71665 -93045 -96253
8160 -96253 -40327 16181 234778 9050 -71782 2781 37948 -50844 191758 82993 181609 -28749
8147 2350 -314390 157159 -225269 -63963 7877 580040 -197977 69912 -130650 -42573 459684
8135 123150 -30678 310994 -225873 -115815 -32776 29048 -151927 142048 -120276 71914
8124 -190257 -228121 -40619 -123541 48673 -132336 -190774 69242 200467 -113864 145074 -550055
8112 -66517 67828 -67408 -31628 5605 -34343 -180795 -89857 -296148 276865 10032 167518
8101 167518 14127 -151292 -229832 113863 338310 83540 19226 -183732 -49718 -32291 -153382
8090 -153382 286805 -377316 -74114 47431 -71589 123323 -238868 -181876 320648 -204842
8079 -61791 238724 -78818 125403 -74642 -157833 -349896 -42414 202172 8685 -266626 128113
8067 -284114 -49161 -13285 -281982 52692 205254 -43326 125691 131171 -315224 97216 -189672
8055 -134998 -63538 -234934 -87402 167133 -211883 -360481 -447323 225755 93992 -96117 267163
8043 136019 -166912 -199330 -297548 -119579 -216019 56954 -161534 -125612 -231751 21085 128030
8032 128030 -128030 325568 -83046 17427 22011 54821 144377 -31227 -151905 125492 -36508
8020 -147146 -250984 154761 -5015 243048 264146 115820 -219074 22454 182091 -390528
8009 34677 -246522 -75684 -91638 -399358 -32815 -183987 -245146 159433 93534 -6062 138652
7997 39904 -27317 -78343 129293 56718 -35639 -154346 -53134 -50421 -11229 14276 34848 -231367
7984 -30238 -113907 -181884 144401 -14536 -69914 -235566 -152119 95774 -91842 2259 -173738
7972 16728 -39016 -116243 69848 70179 -93464 -360153 74446 294875 -151941 148266 203299
7961 203299 -285726 19646 311072 -206605 -105030 -238564 260974 100881 -220048 -403650
7951 -403650 14737 -10586 -85887 -78388 -255772 -33531 -90140 -35059 -381041 24023 -147180
7939 65371 -16867 -230391 -188459 -278725 -25989 92829 200012 103873 52494 -45502 -5736 108038
7926 -128916 -246512 53956 257441 34488 -257344 94410 7579 30902 -1162 -64752 140073
7914 -234630 302407 -298168 33563 33434 -16466 -301034 -168697 144827 -101448 9355 109393
7903 109393 -108040 -202482 27346 -94135 94621 -192755 -256360 -269597 171588 -403357 -311365
7892 -311365 11895 68689 122497 113078 -187550 -9705 -57399 61810 91830 -261442 28985 -198001
7879 -9710 128816 96508 22188 49073 173077 -21753 -238076 56314 -202584 -285077 253490
7867 26359 -46392 -10634 193958 -435635 -206923 -51938 55752 -79514 -29361 -182648 -76547
7855 110973 209545 -160088 -64447 -111173 -283683 -182638 -186272 -128334 -125685 -306726 -11003
7843 -326756 179914 124069 -49940 -38528 333773 -284151 -123950 370832 26344 -81063 -168145
7832 -168145 -80511 -156101 -128640 -37018 -45298 -84926 -63602 46695 -103712 -24315 -225411
7821 -225411 100013 94899 -52431 93325 -199036 -146894 99151 -353039 -271427 -186369 224307
7809 -315779 -106575 -46939 138061 95364 76087 126793 -5325 -111550 -158364 73267 86043
7798 86043 -265534 24444 58074 183073 283012 -465476 -30499 250448 251221 343240 -94620
7786 -60658 -177227 34084 -190057 243852 207187 56626 -62522 -232589 27530 139267 69829
7775 69829 -163993 20816 14067 329080 173296 175455 -155558 233394 -145267 -103267 98316
7763 -4466 -184942 -228803 203911 70660 88770 -115328 -2994 -288109 -363926 -58932 13907
7751 -197902 -141697 -46272 -312993 -323532 -66724 265305 139149 -13258 -193210 -52325 215009
7739 52508 179685 -9453 -54293 -253054 -36720 35243 -71862 -207331 13271 88430 83590 -147987
7726 -10806 -89723 55521 121824 167566 50406 -129274 54672 -363358 -93408 241580 135794
7715 135794 220527 -358094 -175005 187023 -56530 201845 -167190 246928 235807 146371
7705 146371 210251 215869 -52769 -222 26726 30632 -116850 -33391 -131016 224420 -344820 378379
7692 37275 -11082 -111476 -71790 -222433 -164395 -183120 171811 -71801 -191046 -95488 -42490
7680 -175214 -41030 -148937 36523 274370 -24576 226802 -202264 -482560 307882 -126692
7669 148283 -6963 -20242 -75762 -306638 20776 -105926 -91895 -121382 -74878 -1182 17764 -111797
7656 -40932 -85031 146580 -94600 -52429 138518 92816 -51337 -136561 84977 7183 -64456 -178546
7644 -178546 45682 99869 72704 -159560 194148 132599 9709 37338 51613 -220186 158907
7632 167923 203663 89710 219309 47038 78215 166547 -410869 107648 -51720 -70325 95664
7620 -181635 151151 62283 -21360 120556 -184381 305553 8741 -29693 -64871 -51454 43718
7608 -177617 -80383 430055 -102332 -20955 -201530 70569 -29262 326795 -221718 173254
7597 -326055 17328 -78073 104289 -286737 -130322 -226754 78396 293330 36328 111501 -64486
7585 -41949 -218070 195442 -3288 -61338 47328 19947 1905 134144 -244580 -55024 6932 -46419
7572 -109623 265024 -131972 -95403 145630 5646 -299512 48519 -63384 194178 15836 -310282
7560 66776 -140637 -20012 -56017 -182618 17640 -35265 -142247 -196774 -308769 -222279 106830
7548 260111 -408079 -36661 -98493 -206007 -149409 52541 -404695 -137144 -130069 102601 -93948
7536 -23361 -212743 -183831 -22282 -93432 -79602 -163831 -298784 139266 94657 -34960 -99980
7525 -99980 -47215 -75479 -81025 34180 -310708 -14006 -30669 118788 146561 -209081 -182510
7514 -182510 285056 34162 341655 -212675 -11224 -31949 -84297 -72402 -191261 -21530 137519
7502 -235370 369944 52907 -116811 48085 235787 -110726 31383 -266942 67887 -156513
7491 4285 153557 -122328 107231 -185333 -93239 -75200 75484 234400 -350956 -330704 6191
7479 62468 80061 149287 175284 -884 291625 142929 34214 145353 73470 26042 -275278
7467 143724 -23258 120443 22034 -50194 -20586 -93287 44621 -383800 153374 228020 37976
7455 233208 -66919 88409 -113098 118875 -101919 -141695 -158380 255424 -230577 -164983 -335419
7444 -335419 57162 61656 -163817 -201920 -174635 -58641 -344408 -194960 -16020 259505 -278412
7432 1714 334184 -29735 -78605 37467 -145479 107996 -23439 -414748 -10205 68069 209954
7421 209954 -345204 -127654 -160390 -204897 -55420 59277 -51522 32168 -11900 -133731 226032
7409 -128166 38309 -86693 -259244 -47092 146588 -113853 148351 -799 -308291 -76765 -255992
7398 -255992 81154 -257619 -148290 326031 -160263 -3099 293110 73760 -46419 -263729 116042
7386 -355714 -155468 -78550 -243988 308033 -13091 56433 -381920 -379829 -297929 4466 295032
7375 295032 28397 73208 -156452 -1291 -151753 -98897 93728 -260037 265966 22853 261225
7364 261225 38499 22424 -1341 39368 -200242 63539 197597 -149578 220053 -111301 -232301
7353 -232301 -49058 243294 -47091 -54779 -119176 -323009 -285919 6317 130319 -184316 150125
7341 51305 -13982 163807 -67194 -195254 -57824 -178617 -9297 -64915 128300 155578 170875
7330 170875 -124328 25933 54093 -293147 62288 295021 143609 -107860 -77635 -165783 108148
7318 202686 -162867 -122716 45380 -107449 -9558 -140266 -128904 -291867 133917 -130318 82904
7306 -268142 97559 148814 -52739 113024 -127947 -97872 50486 249186 -35955 415858 -163560
7294 149623 -166609 -367268 804 -189519 83353 -190510 52295 52308 141745 -105516 170069
7282 50630 152213 -46495 250155 30703 -80971 -26391 -28017 51751 189159 238542 8241 451389
7270 451389 -71601 30127 142902 -21229 148486 -64716 196439 3221 -376906 -32818 -52429
7259 -52429 168803 -80218 -1682 -64725 -58771 -68054 -259388 45644 238618 -109432 -208069 980
7246 -98434 -184226 81324 -42197 -89877 91823 23436 -273535 15318 24422 -86910 -76997 -2271
7233 -141728 -179920 -144147 -94982 209036 -182237 158939 326412 44767 -51954 100980 -139698
7221 -58900 275832 36788 17967 -132414 33657 -185126 109943 -101746 180110 52975 -7786
7209 136029 -229153 -91079 -35989 104424 9046 -247814 248977 -305180 -57026 -61276 -46051
7198 -46051 -73265 -235373 -37078 -35275 43234 -379339 -164542 -352332 -157916 -43330 -145946
7187 -145946 -62026 114097 -117383 85100 53795 -180882 77528 243029 -462999 -132834
7176 -30230 165580 -49265 160323 -122415 -217050 -55170 22038 40038 40691 -193895 56916
7164 -141521 30112 -212236 230944 81493 -240943 -41230 82828 138863 -86806 -226811 119795
7152 180868 127296 -280746 -26817 -69042 135582 -135450 156662 272180 436570 -63974
7141 27717 50863 57020 -4563 -397862 144684 150372 -82334 161553 114905 -101821 -200910 -7174
7128 -119734 -84779 17364 -286697 16178 -222906 140892 -70619 -344516 155877 206450 -72087
7116 -94953 -28050 121645 -265236 -172387 -5864 77473 246372 -134635 -69020 -189639 -181608
7105 -181608 354156 -207177 117765 -95428 -189225 -492058 149355 -94249 -97699 -20777 -262725
7094 -262725 -74323 -53434 -65185 49285 -56676 -20605 136521 -95074 -119519 -173776 161092
7082 -191996 -280725 -304484 -19169 -176748 97585 -158922 233847 -184512 -114170 200710 104720
7071 104720 -57956 170281 -272821 -181413 -8254 -178243 -223760 -252662 39789 -42432 128764
7059 200038 -215559 -150614 -114871 -94270 156236 -126016 -93407 -236954 -80772 75623 11361
7047 2719 -232418 -187058 61486 311688 -187970 -77145 -10245 -136287 -53305 33315 -260409
7035 -220826 -5076 -90154 -8541 6794 -212606 -44429 -26202 151377 -150692 -216490 -155026 325573
7022 -88009 199158 -25525 220286 -154494 -339407 -81965 -131497 -33 169562 3922 73227 -115779
7009 -276117 -46302 108674 -155158 -134278 -155929 73357 196267 22300 -218884 228870 -111421
6997 -202447 -75042 -136711 53562 -79017 100806 40376 176631 -74188 112361 72437 -39446
6985 56274 73337 -60232 25150 -38916 157079 57510 -38670 -2040 243727 -43462 -32366 -129663
6973 -129663 -224736 -102259 269755 82546 287768 228658 41172 -127833 -23818 222988 148367
6962 148367 -240201 79813 -136557 -204793 -155689 78553 -20913 54946 -63561 -7811 -108401
6951 -108401 -168585 82566 12759 351594 -23271 -176255 96251 -247306 -173328 -137376 -49810
6939 -77658 382936 158773 -136338 52337 238413 338996 256733 -271169 -18860 42116 -195917
6927 -295712 -37185 -136782 -139903 -19696 -99874 -56414 -332607 167545 -20480 17918 -225170
6915 -144444 -36545 21402 115804 -79516 -262041 -125244 -209125 -438191 165944 -84034 -56422
6904 -56422 -28665 135903 260204 312914 71187 30832 -153794 -43702 -252406 52268 -40306
6892 -2253 -75909 252436 37134 -83952 128588 -187339 -66117 170966 73466 63861 75126
6881 75126 -27695 -81042 197907 285967 -165401 -103408 253492 -401355 -145575 -228338 93323
6869 38311 -407421 -155641 -265775 -34649 -41216 -143042 255654 65414 3762 281828 -124891
6857 -52154 102107 -21152 57930 -138464 82461 168794 36106 16 -115499 -189832 -179705 -44041
6844 96530 129572 -376660 -86857 -350485 -264633 -45151 -37312 279505 10638 185482 104487
6833 104487 -232209 48764 -45688 -141459 -214460 -84833 59773 -51384 271603 74438 -109450
6821 54989 100118 -250807 162991 134658 12518 66314 -16083 -138179 -391069 -370016 112814
6809 64777 331690 -77130 56769 48992 7245 165223 -96203 -44455 588927 -159333 7972 -35599
6796 -209868 -161996 199572 -96793 -138807 -310182 69302 38723 98704 -286320 -30356 198042
6784 -131225 -108126 -274121 223677 -1299 213978 4356 -32109 -175935 -192203 222203 -23372
6772 -339930 94756 -113396 -408208 13293 -190922 -223720 6943 38374 -223211 8728 133208
6761 133208 -137121 -334458 320943 82393 -73336 -317842 222071 87295 -234507 242901
6750 30585 139921 33820 -150979 -134447 -361309 234770 351607 289786 -216427 -113210
6740 -113210 202070 -95682 -74030 -9234 61884 -227227 37361 130358 62860 -205904 -324969
6729 -324969 -207254 -72022 330852 -16962 214995 -105818 14453 -60529 133433 270022
6719 270022 77587 -157806 -365124 201838 -30862 -54907 -39518 208959 23921 112518 -419719
6707 228377 -107248 -227241 -32078 170384 -236934 101839 -118751 296036 -73286 -45908
6697 -45908 -214204 141694 347514 -257931 -126352 -265648 12246 -171640 -32933 94848
6686 -158887 -68218 -152426 32463 76301 -3650 119456 117025 -85245 -259799 258262 85151
6674 -66865 -40229 205280 157769 150509 -220573 -100600 114132 -210072 -23002 64152 -320077
6662 198736 -162979 209941 -134427 -129108 -1423 87445 228816 -285504 -89378 -382771 -385356
6651 -385356 -119851 159293 -80994 34402 -248185 228775 84223 85229 59360 195009 -180353
6639 -7084 -164765 -137061 142444 -216972 257792 -142115 -179726 -225940 -203646 -109713 101379
6627 -105061 -35776 -205712 -136829 69618 -44202 -34091 92788 -348115 -128738 -25776 -321285
6616 -321285 -18198 -95964 80655 -286623 -227390 -70008 37983 -312492 -122490 281568 75026
6604 -125301 93129 -220102 5438 -160246 -79996 130 291991 195611 163090 137326 154247 -299287
6591 241652 -74683 156700 59393 -350817 -141672 106301 -81821 310737 169613 -298873
6580 -149592 -63988 270624 42963 51175 264604 -193772 -20964 23781 112917 -287430 86285
6568 -126016 115067 90063 312277 29435 313 -50770 -179508 76921 -110490 -81770 -298986
6557 -298986 57491 224908 147224 228109 -207756 74775 107562 -138984 -74048 -62649 32485
6545 -7729 186301 -175442 -114539 356188 206716 -330092 -114154 -101024 163267 291994
6535 291994 415610 -157551 -101695 165212 141024 -35271 210655 -161300 -291193 -161805
6525 -161805 -4401 111671 176926 -93256 -12749 -36352 -291521 99070 -155263 -204216 226587
6513 -354136 -275092 -319479 -54832 107169 25444 17376 -99758 -274161 -155722 -23370 -331527
6502 -331527 -352469 -96415 1195 -277774 -360715 -1541 -244547 -13699 173869 -81582 -285769
6491 -285769 41977 -36597 91282 386138 94459 51987 290242 -37233 -95504 54725 -64361
6479 73826 -175226 6335 -291527 -6866 -262802 103670 105537 94905 83499 -84132 32166 -293038
6466 -85912 -39629 38118 49571 -8653 -48069 -173479 -247948 -89912 216186 -108370 -34103
6454 64573 -80707 -71708 39014 -213495 -137055 14016 29678 263642 -68942 77321 53571 108986
6442 108986 -54151 -158238 181322 -34008 80195 20439 45677 -307808 -259694 264485 233663
6431 233663 -54334 -67874 388606 -98117 166341 -29123 -301747 223696 -3007 -45886 -10063
6419 -87768 -167642 23795 -54282 356477 -208418 449507 144044 7864 -225206 4512 -312748
6407 42216 -282571 63826 -205863 -53566 -58308 169697 -146494 81488 121353 -173376 85280
6395 61432 18654 -120987 3049 -172164 21203 -84906 82970 27804 42009 -208961 -32332
6383 -168058 75717 217535 440435 -41513 -16444 -161959 -281461 -44386 -19057 -126281 -42494
6371 2110 -73769 -135607 38484 50541 78260 -257790 -446455 -196526 169492 -79204 -143888
6360 -143888 -320082 -37804 -47821 9005 11271 81171 -191567 -15167 -97942 119294 141521
6349 141521 -13572 -76632 -221189 -129621 -263786 -190365 -217020 -197412 -194048 -193793 310256 -408147
6336 -209721 -270758 18007 118842 225893 -32023 -192479 -197542 130459 -469596 -318809 -156261
6324 -99727 -215348 20216 275219 1831 38579 -175387 -40152 246287 30352 15032 -205609
6312 251862 -193195 101259 226137 -9098 -121085 -49780 -235560 92573 286436 108864
6301 5122 -116926 147655 -90509 -15423 -108171 -165637 55180 12270 -226364 112415 -55912
6289 -222923 54615 60749 216238 302564 -45005 -73465 -244021 38460 -264229 109573 194818
6278 194818 -110336 295639 96352 -105642 16528 -92703 -206395 -78946 -189093 -122588 -119156
6267 -119156 38436 91479 -129673 -202225 -71545 232646 -60577 9880 -145315 238641 -92752
6255 242009 -178547 140532 55584 -1845 -220387 -112491 167297 -31816 97180 162427 -20106
6243 -3367 -101357 -268558 163935 42028 19023 16854 -22425 219287 186578 -352886 187006
6231 324269 -4835 105347 -17762 48271 -1633 26582 -277172 35214 78586 75193 -385596 174812
6218 154279 -287430 -59255 85927 298879 179274 -81170 -194272 -88711 -395020 32141 114278
6207 114278 344922 -2240 -266076 -13002 9475 -123279 12435 166796 -185634 46475 57590
6196 57590 93640 206394 141859 -61256 -141749 -245464 -140745 92121 -120150 41399 -151175
6184 -32250 367425 -193716 -152314 -65921 9349 891 -81474 87207 -344995 -15503 40162 29688
6172 29688 165732 220865 -77767 -148113 71064 -199013 123081 6112 93005 -114742 131084
6160 -78205 97050 85073 -243892 19779 53853 -121273 -21855 30846 -353106 116576 -91924
6148 279953 -338699 335650 43732 261838 -26395 28402 279855 226231 -101697 69599 -190028
6136 102628 163884 126639 -168546 -99183 -318521 -120440 271231 106731 217387 63620
6125 400714 181360 -457495 -498464 -224622 -150578 -28606 -59238 -391658 -347431 -113858 -249306
6114 -249306 168069 -85377 -56071 -32188 99803 -132253 -248692 55572 177221 -156098 -20209
6102 -102730 140004 -94770 32870 -152599 196432 -270862 241136 -90512 -211138 40216
6091 -19655 170904 -64953 53774 41731 56011 10573 -280631 175125 37310 90603 -325207
6079 224134 94920 142571 154813 30517 -109376 231091 -18001 279757 19044 63343 -28084
6067 -109968 18046 -180561 20001 209112 123929 -134057 262420 -98616 -49937 -237398 -194476
6056 -194476 367259 402952 -282565 201270 -64340 195046 185829 176727 313642 68800 29662
6044 109185 40143 87932 208420 -23120 91739 12346 -63862 123561 330279 -42962 -107667
6033 -107667 89328 -21050 -30658 161438 -216355 33339 102679 556170 -130279 50960 214018
6022 214018 -129645 104272 -267829 -132448 157709 -62711 112074 31652 -168578 68944
6011 -43743 103135 -220612 28595 157941 147220 140045 110392 -113536 -249350 -252432 5944
5999 162094 -17558 16530 -2268 179130 76452 -256201 -150087 -171647 -149805 -191828 250117
5987 -162886 -106083 125464 -39546 -46468 -222218 -12984 141148 125387 160763 73258 -499672
5975 133080 67214 278497 103010 69010 -97277 -15698 -135189 77415 -209251 141826 -156277
5963 314590 -94334 53924 145850 -25988 -394424 -223594 -5580 -87461 -401936 -503866 -196441
5951 14686 49019 133407 -24104 82575 -9886 -129625 -107029 -214763 -130524 -158870 -267778
5940 -267778 -164073 -126512 75244 154205 -79832 58078 134041 143336 -436375 23423 -12077
5928 99317 -140192 32596 -268760 -343640 -171204 -12506 62412 -42419 29413 -57689 -34664
5917 -34664 -164031 101752 84722 -110117 38739 5311 -49964 -204264 328244 2608 -2588
5905 88339 -171685 154250 72216 175593 75195 100893 -11785 408181 -69269 -96779 42236
5893 -73908 17434 -98656 4893 -116310 -37184 20912 229055 132036 -183468 -484417 164232
5881 -138598 41870 -74049 76097 191934 -212806 151818 -339957 -20004 -110493 146187 60903
5869 135965 -126677 7605 106981 266634 -103934 -33060 11078 -275934 126425 115985 155277
5858 155277 -110549 72068 -369062 -221284 -167068 -70663 18606 50510 12497 125909 -15930
5846 -64409 108374 -15926 22566 148648 -215406 151282 17391 170648 425769 -361716
5835 284496 140164 -15314 256844 -66565 154303 -166085 -120696 111157 -170447 40192
5824 -13226 223048 -136982 270291 61850 -142065 -141835 -138337 79052 -135378 -51681 -51313 254303
5811 157564 197630 195228 160172 82727 256014 -141728 111467 203356 -65162 267684 136477
5800 136477 45420 -124197 10897 134414 103405 -97322 -42479 256926 175587 230817 -20910
5788 -161021 134479 186531 -95339 -210542 -197731 123280 54721 157531 84695 181682 -236673
5776 -255183 -312176 -9363 -159482 154397 -94476 -292998 179252 79371 336435 142894 43918
5764 351747 -103501 -109882 102189 -225321 -5652 55504 102066 239918 193595 -246985 -14225
5752 292106 -253042 2544 406475 -106195 288239 163157 -59087 -116138 -191403 -196109 31109
5740 -141458 -49848 50119 180682 175745 -129323 -64539 74746 74449 18198 -242518 -37303 -333632
5728 -333632 -219297 -142608 139021 170720 -368327 -70348 173962 -272183 -78481 82133 -220368
5716 -238706 59966 -328867 -249675 103964 205351 87751 220837 -10390 89931 -19181 -180660
5705 -180660 -31844 251471 -54227 -250218 318764 80613 85703 223005 -86567 122749 250167
5694 250167 359803 -313435 26303 40765 45868 241786 -227989 -96808 -109994 -18355 139732
5682 139081 -145264 -127902 150159 8816 263487 -294450 -187708 374948 -144841 198989
5671 -108248 399457 81056 -303183 -121011 151152 -94173 163205 101875 288622 -4261 157681
5659 45233 -197413 89826 -363945 -151253 -68591 -100952 -5556 -11786 81581 -66369 -79426 -290577
5647 -290577 4573 207231 279053 36222 -235656 147163 -24239 180502 -267762 15679 -84753
5635 450788 -23285 -248702 -170635 75283 -303332 103744 212089 287664 18911 214407 -22703
5623 -223863 -112547 -7566 -45692 150319 -199398 -150204 81024 54932 -9310 -114239 -46884
5611 210796 -104855 -176116 -8732 -256153 -49347 283333 21473 -63917 -12332 4787 -232748
5599 -35648 -105135 84865 151874 259160 -215569 -336221 84873 51147 -244556 38305 -14786
5587 -210452 88156 -229741 -604474 60928 159928 -326746 183908 85035 226404 334508
5577 334508 307718 39697 9949 -29388 -83337 64607 -19916 42081 -98356 225822 -167876
5565 -355487 45395 21755 246645 -172316 450 -291889 361717 87627 160669 308798 -178799
5553 66101 -210294 -60115 -438938 -71464 -340525 313688 208389 287586 -97389 326973 -12327
5541 79909 -197805 -242317 95514 424956 -261981 -274811 -104558 79657 327875 357443 -324417
5529 280472 -16212 130106 62182 106540 417374 -42305 257631 460794 -154401 196294
5518 -133738 -79997 56861 -60397 63955 -38658 166120 -253745 -174918 -67631 5598 -133758
5506 -9828 -117668 -76347 104368 294181 -85698 -223633 -72011 -86877 83475 225834 -222569
5494 -162384 68650 365199 155034 -150943 79876 -153890 354039 223187 -35295 -89865
5484 -89865 205762 -56192 167325 -189035 -73703 -74268 374758 -168689 -112932 -157226 211749
5472 -45041 303578 -137140 -26611 8537 -145398 -32771 -27705 -20716 -129694 -146464 -91041 21289
5459 170885 -12098 -48840 -84722 -134177 97346 254620 -75795 18947 262105 107814 95868
5448 95868 -129584 -250965 145010 -151399 -102744 -236273 -126276 227291 -97971 98946
5437 543751 -259637 136080 -51741 -43503 257142 33771 15148 188531 131628 188920 168082
5426 168082 20074 33249 -430957 24637 46594 -27840 5663 84527 116026 -24165 -2660 27470
5413 -115749 223680 161379 11419 -19818 -8182 -161259 -101094 79312 -101488 -298806 -88573
5401 103795 206293 -114173 83171 -20595 143086 200858 -198381 22380 246998 41874 -68240
5389 132872 532335 282092 199293 21199 21499 114636 -148918 -15394 370952 -55653 62402
5377 -81199 122067 205401 25435 51467 67664 90825 129087 19493 50569 -306208 218487
5365 -162165 149854 64309 197212 182560 177739 85402 65172 -252029 -138719 -74170 -51698
5354 -51698 78922 33900 211226 -230681 -60607 -21246 48908 111855 21443 25667 21381 139086
5342 139086 -67741 -206879 -198653 -251408 -19354 237108 -291211 267391 -213298 65949 34156
5331 34156 28963 -199336 53965 328963 -295235 8079 -115061 -43860 -3571 31915 -113242
5319 -56338 205855 -181464 -242853 76398 33744 146051 148054 47400 113791 -186646 -252830
5308 -252830 -151093 1824 264832 206161 -78004 384470 -389588 -154235 -76820 -116393 99827
5296 43046 -78292 -13530 91685 128541 13663 -240394 -36190 -107464 -82541 -91656 465221 -179170
5283 -23567 -172271 -79662 139954 156932 -51785 -48012 164110 85956 -235134 -68869 -10452
5271 -462905 -205344 17610 -129549 7010 131461 191504 111346 122983 251816 276582 -119736
5259 299696 -179227 -338337 41011 -286767 -402332 -119652 349034 -86624 -146838 -222378
5249 -222378 32632 -110757 343015 26502 -303013 133664 64373 363110 -229856 350486
5238 463334 108256 66183 -94483 55793 108902 -296399 50899 -24344 228204 18486 -12322
5226 -241329 -32995 -289357 186667 89303 151922 286997 -204607 -361190 -75399 68183 59162
5215 59162 235244 44215 -229728 71837 -6593 153592 -44122 -30162 19462 -198776 184127
5203 93328 -197937 442826 -19966 100305 91129 -244152 -84693 5207 -18155 -266252 187360
5191 -72474 -193745 -59635 171185 -349589 -211449 -33294 107793 -151482 193448 45593
5180 -79088 -361849 -34148 522782 33447 -159389 33579 -50409 36838 -195890 -112449 13005
5168 -274626 217600 -347907 197446 222133 252455 30617 286167 260981 -61066 -43836 25841
5156 241448 -278246 71863 258751 134788 -8115 -120344 202233 -91668 -100803 163040 -99254
5144 -156760 43369 -55076 375852 50314 266267 373 185451 -109705 12896 131465 -195696
5132 180133 -204057 -440140 69562 267602 195440 -59251 458846 -198677 -262280 91748 -146249
5120 -164807 -18603 -137325 -66004 -182266 -176974 230118 -180934 76407 -129201 235293 -18840
5108 -50275 25718 198249 -46160 -282715 -89642 -32673 34636 37764 267265 34797 -112108
5096 -42557 127934 146549 32393 83046 77761 -86325 -96802 -46840 -307514 30963 228550
5085 228550 160531 -5989 -35830 -61110 -209456 -456105 5231 -220278 -119850 -84735 115937
5073 -119512 49524 -161477 -105231 -22516 78929 -40019 155235 -10193 -258581 24829 -48511
5061 125682 -67155 185049 -47231 -64243 282830 -69219 -74387 57732 -53373 -20069 -151748
5050 -151748 -99919 -122837 -163806 -12691 -132320 312217 126326 61671 43366 65181 -194438
5038 98789 -73564 -1097 -162234 -165315 -156325 -236269 -380159 -113982 -105445 -3068 -373693 -126259
5025 55543 102442 -25748 -239001 -74190 20421 55732 148004 394011 77580 -176612 -377581
5014 -377581 -315382 128058 -181444 149655 -373443 173392 16618 -11970 133350 111658
5004 111658 -143326 -232736 36335 175124 -86062 -291127 90181 -228029 4582 -285816 -295137
4993 -295137 -201288 -94735 -114007 -92484 37356 -91742 115092 -106645 216686 -67600 17776
4981 178031 273587 -135063 147701 -190827 124300 -125625 -206278 97952 -1692 63968 -197512
4969 -101526 -161541 149505 354619 -143222 92344 -122522 -398449 26336 -85576 -12029 115019
4957 139131 -129416 98622 176322 165910 -174175 -336594 50718 49803 -277661 165345 99826
4946 99826 -212611 130404 205256 -17910 25308 371582 77102 98902 94366 6075 -289601
4934 -145518 -124206 52024 -81389 -27276 15343 -154280 -272064 103889 133379 -173425 -16820
4922 37945 -107139 -25413 -45506 394597 -159881 259561 -64888 -203353 81960 -128842 64066
4910 393104 88760 -14938 22940 -243135 222592 -67962 -18746 -78623 38780 1666 244270
4899 244270 255755 198810 -37599 143582 41777 55760 -131614 33497 35463 -387407 -58338
4887 198532 -48283 -80531 -8259 -87648 105329 140987 9496 72889 54963 -35339 45214 -30171
4874 185432 -57261 -94050 298884 125492 -172745 155049 120451 81126 -8378 145337 -19939
4862 -115088 105553 420512 54765 171335 -78127 -197534 287995 -34928 -152669 253557
4851 322690 27063 -215583 73311 -286439 183923 -216092 -177536 -150327 -96303 -191532 241984
4839 198783 286179 -48621 72911 188955 158151 121650 -61896 -7809 -163678 -401331 24714
4827 7932 -68707 -11361 -221001 67988 13023 -144906 33661 -71425 195202 296276 -87959
4815 -71923 -21547 -8691 -138033 -232524 -63158 34575 -21343 -92050 -25636 41689 -185938 -207997
4803 -207997 -279851 -165901 6589 -109725 59692 -7991 244416 48336 104923 -159612 -139956
4792 -139956 128458 55707 -280786 -99934 -201423 131414 -234422 -154590 41498 211710
4782 211710 -108100 -51070 272857 132017 18871 162827 105554 -233852 -167587 13110 -266272
4770 39742 -95792 202362 -86366 -62576 71493 99702 42874 8016 194076 144762 -198511
4758 147924 200681 -358782 -180747 159700 -207116 -56936 121665 273237 124635 7170
4747 -70482 -253489 46778 104156 47549 382716 -76944 -98883 22861 142782 240024 -14147
4735 -180456 154291 68318 85442 27006 138023 65872 62061 -56318 -66309 105791 -258677
4723 158361 -162009 -42557 -194435 141913 103641 -64632 -2005 -139288 248061 225997 385694
4712 385694 194199 305576 -116657 11780 17231 52630 4360 -58848 -68008 -94371 -469079
4701 -469079 132222 30474 -595 290706 -262751 88607 -96008 101164 133899 -121338 -1535
4689 83896 -102896 362921 174159 194655 -156977 21701 -83790 -125468 19679 -245513 -29909
4677 179950 -97075 85573 -71626 114655 61795 252301 -232492 223956 -236857 -10395 240726
4665 365072 232764 217849 -82640 -64892 -22839 439264 76807 43188 193695 52159 -172424
4653 -272071 -124237 -131778 365841 -382998 -48776 142288 14231 -251213 -173417 -231706 115131
4641 97823 64561 36454 182922 -129323 -243235 287694 89495 40692 -138490 154599 -140530
4629 -238086 25019 -270381 -16546 141728 244715 280584 211017 100028 -36126 -219862 167985
4617 -83989 275997 181183 -219537 455349 -76978 174628 -166960 96862 -75431 -172079 -18389
4605 -306622 -285366 2749 15175 31281 36504 339477 79850 79117 419503 -173308 69574 232821
4593 232821 -130617 -364407 34789 -67568 -469906 145481 88837 151228 -8248 -152151 60878
4581 45051 217482 146093 -72774 43831 139762 -13189 -152792 -23171 -61644 -265304 154590
4569 15926 70947 2336 110083 322399 187342 -172186 -116105 -79993 112672 -249253 -107217
4557 49384 -88789 332819 24783 104829 411612 64598 240882 -119985 -56279 -127057 -44751
4545 273984 -143259 -267288 61822 -250345 116815 -165091 -17336 -263368 45050 289412
4535 289412 155895 248823 176516 -266507 -100525 -205064 -263216 -73011 28644 -88045 -25578
4523 73651 55042 113824 113004 -2338 -167138 -47420 -138794 -134755 96762 37503 42088 -472371
4510 20636 -106373 57571 -61941 170203 131800 -20278 -97689 164842 -140679 -27130 297522
4498 123828 -149395 -137920 -140689 96154 85049 15951 -385169 110764 -58642 29569 87454
4487 87454 -35902 -76453 -12428 -167129 -82630 -47302 -246583 -44523 -436309 -38688 293354
$$ [...]
##END NTUPLES=NMR SPECTRUM
##END=
