
##TITLE=AC1194_MCiAH12046_7165515_KZ9By2GxYe
##JCAMPDX= 6.0         $$ Bruker NMR JCAMP-DX V2.0
##DATA TYPE= NMR SPECTRUM
##DATA CLASS= NTUPLES
##ORIGIN= BRUKER
##OWNER= Administrator
$$ 1.72 TOPSPIN		Version 2.1
$$ 2012-12-02 01:42:25.942 -0500  Administrator@X
$$ Compression mode = diff/dup
##.OBSERVE FREQUENCY= 400.02188249412
##.OBSERVE NUCLEUS= ^1H
##.ACQUISITION MODE= SIMULTANEOUS (DQD)
##.ACQUISITION SCHEME= undefined
##.AVERAGES= 64
##.DIGITISER RES= 22
##SPECTROMETER/DATA SYSTEM= spect
##.PULSE SEQUENCE= noesygpps1d.comp
##.SOLVENT NAME= COFFEE_meoh
##.SHIFT REFERENCE= INTERNAL, COFFEE_meoh, 1, 14.9626
##AUDIT TRAIL= $$ (NUMBER, WHEN, WHO, WHERE, PROCESS, VERSION, WHAT)
$$ ##TITLE= Audit trail, TOPSPIN		Version 2.1
$$ ##JCAMPDX= 5.01
$$ ##ORIGIN= Bruker BioSpin GmbH
$$ ##OWNER= Administrator
$$ $$ E:\/data/COFFEE/nmr/AC1194_MCiAH12046_7165515_KZ9By2GxYe/12/pdata/1/auditp.txt
$$ ##AUDIT TRAIL=  $$ (NUMBER, WHEN, WHO, WHERE, PROCESS, VERSION, WHAT)
(   1,<2012-12-02 01:42:20.005 -0500>,<Administrator>,<X>,<go>,<TOPSPIN 2.1>,
      <created by zg
	started at 2012-12-02 01:30:49.784 -0500,
	POWCHK enabled, PULCHK disabled,
       configuration hash MD5:
       86 BA 57 50 F2 9D 5C 9B 26 00 A9 28 5F 66 2E 89
       data hash MD5: 64K
       2E 7B FD AC C7 20 9A E7 82 83 48 81 1C 24 90 85>)
(   2,<2012-12-02 01:42:23.067 -0500>,<Administrator>,<X>,<proc1d>,<TOPSPIN 2.1>,
      <Start of raw data processing
       efp LB = 0.3 FT_mod = 6 PKNL = 1 PHC0 = 0 PHC1 = 0 SI = 128K 
       data hash MD5: 128K
       12 7A 13 6B 97 49 F3 56 0A 46 52 93 A2 D1 6D 09>)
(   3,<2012-12-02 01:42:24.114 -0500>,<Administrator>,<X>,<proc1d>,<TOPSPIN 2.1>,
      <pk PHC0 = -80.9967 PHC1 = 0 
       data hash MD5: 128K
       84 1B 0A 4C 81 AC 71 85 AC B5 4E 32 7E D9 D4 E0>)
(   4,<2012-12-02 01:42:24.848 -0500>,<Administrator>,<X>,<proc1d>,<TOPSPIN 2.1>,
      <abs ABSG = 1 
       data hash MD5: 128K
       35 71 4F 5C 1A F7 3B FA 00 79 F7 82 95 59 3E 85>)
(   5,<2012-12-02 01:42:25.052 -0500>,<Administrator>,<X>,<proc1d>,<TOPSPIN 2.1>,
      <abs ABSG = 2 
       data hash MD5: 128K
       E6 CB 9C C7 74 FA A6 02 33 FF 1F C3 E6 B3 79 00>)
(   6,<2012-12-02 01:42:25.223 -0500>,<Administrator>,<X>,<proc1d>,<TOPSPIN 2.1>,
      <abs ABSG = 3 
       data hash MD5: 128K
       AF 80 32 4A 31 06 96 53 42 68 7C 05 ED 2E EC 02>)
(   7,<2012-12-02 01:42:25.427 -0500>,<Administrator>,<X>,<proc1d>,<TOPSPIN 2.1>,
      <abs ABSG = 4 
       data hash MD5: 128K
       FA CE 27 2A 8E B8 F1 AA 04 8D 05 67 F7 F3 F6 C6>)
(   8,<2012-12-02 01:42:25.598 -0500>,<Administrator>,<X>,<proc1d>,<TOPSPIN 2.1>,
      <abs ABSG = 5 
       data hash MD5: 128K
       77 F4 21 AE 28 F6 A6 5D B0 96 76 53 36 17 2A F3>)
$$ ##END=
$$ 
$$ $$ hash MD5
$$ $$ FF EF 36 92 3A D5 50 ED ED F3 B8 36 9C B0 99 BE
##$RELAX= 
##$RELAX= 
##$RELAX= 
##$RELAX= 
##$RELAX= 
##$RELAX= 
##$RELAX= 
##$RELAX= 
$$ Bruker specific parameters
$$ --------------------------
##$DU= <E:\>
##$EXPNO= 12
$$ [...]
150 150 150 150 150 150 150 150
##$TP07= 0
##$TPNAME0= <>
##$TPNAME1= <>
##$TPNAME2= <>
##$TPNAME3= <>
##$TPNAME4= <>
##$TPNAME5= <>
##$TPNAME6= <>
##$TPNAME7= <>
##$TPOAL= (0..7)
0.5 0.5 0.5 0.5 0.5 0.5 0.5 0.5
##$TPOFFS= (0..7)
0 0 0 0 0 0 0 0
##$TUNHIN= 0
##$TUNHOUT= 0
##$TUNXOUT= 0
##$USERA1= <user>
##$USERA2= <user>
##$USERA3= <user>
##$USERA4= <user>
##$USERA5= <user>
##$V9= 5
##$VALIST= <valist>
##$VCLIST= <CCCCCCCCCCCCCCC>
##$VD= 0
##$VDLIST= <DDDDDDDDDDDDDDD>
##$VPLIST= <PPPPPPPPPPPPPPP>
##$VTLIST= <TTTTTTTTTTTTTTT>
##$WBST= 1024
##$WBSW= 4
##$XGAIN= (0..3)
0 0 0 0
##$XL= 0
##$YL= 0
##$YMAX_a= 8104807
##$YMIN_a= -17461281
##$ZGOPTNS= <>
##$ZL1= 120
##$ZL2= 120
##$ZL3= 120
##$ZL4= 120
##$ABSF1= 14.9626
##$ABSF2= -5.595582
##$ABSG= 5
##$ABSL= 3
##$ALPHA= 0
##$AQORDER= 0
##$ASSFAC= 0
##$ASSFACI= 0
##$ASSFACX= 0
##$ASSWID= 0
##$AUNMP= <proc_prof1d_extract.lims>
##$AXLEFT= 0
##$AXNAME= <>
##$AXNUC= <1H>
##$AXRIGHT= 0
##$AXTYPE= 0
##$AXUNIT= <>
##$AZFE= 0.1
##$AZFW= 0.1
##$BCFW= 0
##$BC_mod= 0
##$BYTORDP= 0
##$COROFFS= 0
##$CY= 15
##$DATMOD= 1
##$DC= 0
##$DFILT= <>
##$DTYPP= 0
##$F1P= 0
##$F2P= 0
##$FCOR= 0.5
##$FTSIZE= 131072
##$FT_mod= 6
##$GAMMA= 0
##$GB= 0
##$INTBC= 1
##$INTSCL= 1
##$ISEN= 128
##$LB= 0.3
##$LEV0= 0
##$LPBIN= 0
##$MAXI= 10000
##$MC2= 0
##$MEAN= 0
##$ME_mod= 0
##$MI= 0
##$NCOEF= 0
##$NC_proc= -2
##$NLEV= 6
##$NOISF1= 0
##$NOISF2= 0
##$NSP= 0
##$NTH_PI= 0
##$NZP= 0
##$OFFSET= 14.9626
##$PC= 1
##$PHC0= -80.9967
##$PHC1= 0
##$PH_mod= 1
##$PKNL= yes
##$PPARMOD= 0
##$PPDIAG= 0
##$PPIPTYP= 0
##$PPMPNUM= 2147483647
##$PPRESOL= 1
##$PSCAL= 4
##$PSIGN= 0
##$PYNMP= <proc.py>
##$REVERSE= no
##$SF= 400.020008998043
##$SI= 131072
##$SIGF1= 0
##$SIGF2= 0
##$SINO= 400
##$SIOLD= 131072
##$SPECTYP= <>
##$SREGLST= <1H.CDCl3>
##$SSB= 0
##$STSI= 131072
##$STSR= 0
##$SW_p= 8223.68421052631
##$SYMM= 0
##$S_DEV= 0
##$TDeff= 65536
##$TDoff= 0
##$TI= <>
##$TILT= no
##$TM1= 0
##$TM2= 0
##$TOPLEV= 0
##$USERP1= <user>
##$USERP2= <user>
##$USERP3= <user>
##$USERP4= <user>
##$USERP5= <user>
##$WDW= 1
##$XDIM= 131072
##$YMAX_p= 441459834
##$YMIN_p= -41530
##$CURPLOT= <Network HP LaserJet P1505>
##$CURPRIN= <$Network HP LaserJet P1505>
##$DFORMAT= <normdp>
##$LAYOUT= <+/1D_H.xwp>
##$LFORMAT= <normlp>
##$PFORMAT= <normpl>
##$SURQMSG= 1
$$ End of Bruker specific parameters
$$ ---------------------------------
##NTUPLES= NMR SPECTRUM
##VAR_NAME=  FREQUENCY,     SPECTRUM/REAL,   SPECTRUM/IMAG
##SYMBOL=    X,             R,               I
##VAR_TYPE=  INDEPENDENT,   DEPENDENT,       DEPENDENT
##VAR_FORM=  AFFN,          ASDF,            ASDF
##VAR_DIM=   131072,        131072,          131072
##UNITS=     HZ,            ARBITRARY UNITS, ARBITRARY UNITS
##FACTOR=    0.0627417313425164, 1,          1
##FIRST=     8223.62146879497, 1336,         -58296
##LAST=      0,             4168,            -58537
##MIN=       0,             -41530,          0
##MAX=       8223.62146879497, 441459834,    0
$$ Real data points
##PAGE= N=1
##DATA TABLE= (X++(R..R)), XYDATA
$$ [...]
63268C42792K05M45N88N38K46R8N89J535K172K188K016J977J808J396J324K107
$$ 342792 342997 343442 344030 344568 344814 344912 345501 347036 349208 351396 353412 355389 357197 358593 359917 362024
63252C62024L368M307M659M674M506M231M222M914O167P377Q219Q911R711J0576
$$ 362024 365392 369699 374358 379032 383538 387769 391991 396905 403072 410449 418668 427579 437290 447866
63238D47866J1400J2328J3644J5481J7641J9693K1338K2796K4588K6753K8594
$$ 447866 459266 471594 485238 500719 518360 538053 559391 582187 606775 633528 662122
63227F62122K9502K9693K9731K9575K8736K7321K6137K5584K5073K3892K2226
$$ 662122 691624 721317 751048 780623 809359 836680 862817 888401 913474 937366 959592
63216I59592K0897K0384K0571K1159K1804K1988K1211J9416J6853J3418Q582K153
$$ 959592 980489 1000873 1021444 1042603 1064407 1086395 1107606 1127022 1143875 1157293 1165875 1168028
63204A168028n196j2433j9004k4852k9806l3447l5648l6876l7620l7741l6643
$$ 1168028 1162832 1150399 1131395 1106543 1076737 1043290 1007642 970766 933146 895405 858762
63193H58762l4124l0770k7447k4538k1728j8434j4462j0206o294l001j42K469
$$ 858762 824638 793868 766421 741883 720155 701721 687259 677053 670759 667758 667616 670085
63181F70085M695O406P863R494J1338J3092J4645J6113J7294J7637J6978J5977
$$ 670085 674780 681186 689049 698543 709881 722973 737618 753731 771025 788662 805640 821617
63169H21617J5403J5350J5415J5377J5221J4717J3493J1494Q959O035K775n48
$$ 821617 837020 852370 867785 883162 898383 913100 926593 938087 947046 953081 955856 955308
63157I55308l661o830j0622j4973j8947k1666k3110k3728k3746k3253k2638k2349
$$ 955308 951647 944817 934195 919222 900275 878609 855499 831771 808025 784772 762134 739785
63145G39785k2206k1458j9647j7149j4745j2863j1450j0325r428q576p318n349
$$ 739785 717579 696121 676474 659325 644580 631717 620267 609942 600514 591938 584620 579271
63133E79271l110j537j036r42m17M16P81N61N92J466K687L425L565L533L559L635
$$ 579271 576161 574624 573588 572646 572229 572645 573426 573987 574579 576045 578732 582157 585722 589255 592814 596449
63117E96449L894M390M748M588M199M145M375M337L970L839M127M290L968L632
$$ 596449 600343 604733 609481 614069 618268 622413 626788 631125 635095 638934 643061 647351 651319 654951
63103F54951L846M387M515L844K606J260K22k87m24n38o84n64j93j54q05j646
$$ 654951 658797 663184 667699 671543 674149 675409 675631 675344 674920 674382 673698 673134 672941 672787 671982 670336
63087F70336j890j447p77n3R46K210L276L786L817L694L771M381N659P305Q819
$$ 670336 668446 666999 666222 666169 667115 669325 672601 676387 680204 683898 687669 692050 697709 705014 713833
63072G13833R945J0734J1298J1848J2694J3837J4700J4831J4757J5441J6984J8497
$$ 713833 723778 734512 745810 757658 770352 784189 798889 813720 828477 843918 860902 879399
63060H79399J9485K0576K2553K5208K7778L0068L2527L5364L8225M0824M3464
$$ 879399 898884 919460 942013 967221 994999 1025067 1057594 1092958 1131183 1172007 1215471
63049A215471M6638N0252N3507N5684N6916N7930N8990N9410N8518N6726N5149
$$ 1215471 1262109 1312361 1365868 1421552 1478468 1536398 1595388 1654798 1713316 1770042 1825191
63038A825191N4235N3335N1778M9831M8408M8204M9264N1040N2621N3210N2521
$$ 1825191 1879426 1932761 1984539 2034370 2082778 2130982 2180246 2231286 2283907 2337117 2389638
63027B389638N0504M6754M0651L2131K1758R958l212j7372l1479m4532n6062o5731
$$ 2389638 2440142 2486896 2527547 2559678 2581436 2591394 2588182 2570810 2539331 2494799 2438737 2373006
63015B373006p3075p8027q1024q2165q0925p7245p2207o6939o1436n5196m8452
$$ 2373006 2299931 2221904 2140880 2058715 1977790 1900545 1828338 1761399 1699963 1644767 1596315
63004A596315m1778l4984k7546j9916j3288q059l439J273N915J0118J3888J7213
$$ 1596315 1554537 1519553 1492007 1472091 1458803 1450744 1447305 1448578 1454493 1464611 1478499 1495712
62992A495712J9772K1371K2222K2602K2665K2684K2904K3039K2499K1170J9469
$$ 1495712 1515484 1536855 1559077 1581679 1604344 1627028 1649932 1672971 1695470 1716640 1736109
62981A736109J7582J5176J2020Q172L471k488r586j7031k4202l1084l7683m3629
$$ 1736109 1753691 1768867 1780887 1789059 1792530 1790042 1780456 1763425 1739223 1708139 1670456 1626827
62969A626827m8713n3109n6657n8537n8224n6277n3676n0786m7484m3864m0257
$$ 1626827 1578114 1525005 1468348 1409811 1351587 1295310 1241634 1190848 1143364 1099500 1059243
62958A059243l6741l3232k9874k6919k4352k1969j9670j7430j5201j3078j1354
$$ 1059243 1022502 989270 959396 932477 908125 886156 866486 849056 833855 820777 809423
62947H09423j0154r273q583q232q204q123p823p721q193q900r221r039q668q232
$$ 809423 799269 789996 781413 773181 764977 756854 749031 741310 733117 724217 714996 705957 697289 689057
62933F89057p672p176p021p051o774o021n110m415m045l925l843l511k872k351
$$ 689057 681385 674209 667188 660137 653363 647342 642232 637817 633772 629847 626004 622493 619621 617270
62919F17270k474l262m256n040n509n600n182m271l218k488k260k254k060j657
$$ 617270 614796 611534 607278 602238 596729 591129 585947 581676 578458 575970 573710 571456 569396 567739
62905E67739j461j707j961j657r67n88o51m85L60J391J838J496O58l79j383k216
$$ 567739 566278 564571 562610 560953 559986 559398 558747 558262 558622 560013 561851 563347 564005 563626 562243 560027
62889E60027l007l918m548m198l023k115k013j906j016Ljr69j819k005j892j803
$$ 560027 557020 553102 548554 544356 541333 539218 537205 535299 534283 534286 534285 533316 531497 529492 527600 525797
62873E25797j642j376j048m35N46J285J149N55M01O54M89j54l54K43P80N44l1
$$ 525797 524155 522779 521731 521296 521842 523127 524276 524831 525232 525886 526375 526221 525867 526110 526890 527434 527403
62856E27403k33j67l80r35j410j534j416j438k002l043l815l650k914k515k542
$$ 527403 527170 527003 526623 525688 524278 522744 521328 519890 517888 514845 511030 507380 504466 501951 499409
62841D99409k283j579j157j273j174m16K84K05k03j84R0j5l93m98l65m70p81q34
$$ 499409 497126 495547 494390 493117 491943 491527 491811 492016 491813 491629 491719 491704 491311 490813 490448 489978 489197 488363
62823D88363n64k81JM35O80K03p88j467j485j261j100p69q4P19J461K288L174
$$ 488363 487799 487518 487519 487954 488634 488837 488049 486582 485097 483836 482736 481967 481883 482602 484063 486351 489525
62806D89525L666L582L561M442O186P865Q679Q753Q791R166R621R807R865J0211
$$ 489525 493191 496773 500334 504776 510962 518827 527506 536259 545050 554216 563837 573644 583509 593720
62792E93720J0958J1954J3275J5151J7262J8737J9256J9746K1492K4737K8683
$$ 593720 604678 616632 629907 645058 662320 681057 700313 720059 741551 766288 794971
62781G94971L2557L6267M0125M4551M9938N6304O3031O9377P5278Q1198Q7248
$$ 794971 827528 863795 903920 948471 998409 1054713 1117744 1187121 1262399 1343597 1430845
62770A430845R2959R7957J02173J05247J06268J04547J00181R3510Q4328P2165
$$ 1430845 1523804 1621761 1723934 1829181 1935449 2039996 2140177 2233687 2318015 2390180
62760B390180N7218M0425K2675M329j4319l2452m8938o3043p4767q4450r2240
$$ 2390180 2447398 2487823 2510498 2514827 2500508 2468056 2419118 2356075 2281308 2196858 2104618
62749B104618r7930j01219j02040j00722r7879r4129q9809q4982p9717p4278o8925
$$ 2104618 2006688 1905469 1803429 1702707 1604828 1510699 1420890 1335908 1256191 1181913 1112988
62738A112988o3693n8503n3395m8484m3831l9561l5959l3066l0288k6961k3271
$$ 1112988 1049295 990792 937397 888913 845082 805521 769562 736496 706208 679247 655976
62727F55976k0164j8156j6772j5363j3948j2838j1895j0698r121p375n690m354
$$ 655976 635812 617656 600884 585521 571573 558735 546840 536142 527021 519646 513956 509602
62715E09602l691l550l140j945n03M45J249K942N531P729Q674R111J0360J2654
$$ 509602 505911 502361 499221 497276 496773 497218 498467 501409 506940 514669 523343 532454 542814 555468
62701E55468J5185J7367J9413K1797K4667K7911L1421L5096L8717M2026M4982
$$ 555468 570653 588020 607433 629230 653897 681808 713229 748325 787042 829068 874050
62690H74050M7946N1402N5287N8664O0358N9973N8030N5078N1004M5399L8221
$$ 874050 921996 973398 1028685 1087349 1147707 1207680 1265710 1320788 1371792 1417191 1455412
62679A455412K9831K0598J0790O39r725k0228l0373l9021m5195m9118n2024n4695
$$ 1455412 1485243 1505841 1516631 1517270 1507545 1487317 1456944 1417923 1372728 1323610 1271586 1216891
62667A216891n6595n6780n5336n3375n1671m9838m7145m3713m0415l7674l4951
$$ 1216891 1160296 1103516 1048180 994805 943134 893296 846151 802438 762023 724349 689398
62656F89398l1663k8165k5356k3478k1841j9797j7577j5825j4627j3469j2109
$$ 689398 657735 629570 604214 580736 558895 539098 521521 505696 491069 477600 465491
62645D65491j0997j0565j0508j0165r455q906q702q207o840n061l969m075m908
$$ 465491 454494 443929 433421 423256 413801 404895 396193 387986 381146 376085 372116 368041 363133
62632C63133n778o395o598o086m793l231k090j641j684j929k106j987j551j074
$$ 363133 357355 350960 344362 338276 333483 330252 328162 326521 324837 322908 320802 318815 317264 316190
62618C16190p55m61KM92P50R17J416K376L436M172M500M662M990N712O695P533
$$ 316190 315435 314974 314976 315468 316218 317135 318551 320927 324363 328535 333035 337697 342687 348399 355094 362627
62602C62627Q009Q490R559J1294J3166J4739J6228J8236K1064K4342K7376K9828
$$ 362627 370636 379126 388685 399979 413145 427884 444112 462348 483412 507754 535130 564958
62590E64958L2153L5175L9217M3693M7687N0769N3067N4715N5525N5103N3064
$$ 564958 597111 632286 671503 715196 762883 813652 866719 921434 976959 1032062 1085126
62579A085126M9184M3530L6415K8151J8996R377j77r471j8630k7283l4308l8860
$$ 1085126 1134310 1177840 1214255 1242406 1261402 1270779 1270602 1261131 1242501 1215218 1180910 1142050
62567A142050m1439m3222m4603m5077m4446m3211m1667l9492l6639l3883l1925
$$ 1142050 1100611 1057389 1012786 967709 923263 880052 838385 798893 762254 728371 696446
62556F96446l0430k8519k5956k3332k1296j9979j9064j8137j6999j5890j5204
$$ 696446 666016 637497 611541 588209 566913 546934 527870 509733 492734 476844 461640
62545D61640j4920j4492j3497j2077j0572r068p589o417n763n372m810m015l216
$$ 461640 446720 432228 418731 406654 396082 387014 379425 373008 367245 361873 357063 353048 349832
62532C49832k445j547o24k5J68L42R26J934K995L737M109M467N249O516P862Q949
$$ 349832 347387 345840 345216 345191 345359 345701 346627 348561 351556 355293 359402 363869 369118 375634 383496 392445
62516C92445R923J1131J2590J4076J5657J7729K0369K3048K5188K6840K8489L0338
$$ 392445 402368 413499 426089 440165 455822 473551 493920 516968 542156 568996 597485 627823
62504F27823L2109L3527L4607L5177L4500L1897K7715K3015J8228J2692N929j179
$$ 627823 659932 693459 728066 763243 797743 829640 857355 880370 898598 911290 917219 916040
62492I16040p233j1979j6273k0533k4133k6530k8097k9325k9930k9384k7916k6299
$$ 916040 908807 896828 880555 860022 835889 809359 781262 751937 722007 692623 664707 638408
62480F38408k4917k3489k1632j9204j6369j3672j1810j0913j0179q688o413m042
$$ 638408 613491 590002 568370 549166 532797 519125 507315 496402 486223 477535 471122 467080
62468D67080k074n97K55L66J66M57J480K638L277L442L634M170M960N668N979
$$ 467080 465006 464409 464664 465030 465196 465653 467133 469771 473048 476490 480124 484294 489254 494922 500901
62453E00901N904N899O460P556Q714R624J0348J0896J0990J0415R269P711N714
$$ 500901 506805 512704 519164 526720 535434 545058 555406 566302 577292 587707 596976 604687 610401
62440F10401L252N01k358n320q361j1213j3532j5239j6518j7495j7969j7462j5687
$$ 610401 613653 614154 611796 606476 598115 586902 573370 558131 541613 524118 506149 488687 473000
62427D73000j3112j0895r893r755r352q106o501n219m231l117j827o31M61J749
$$ 473000 459888 448993 439100 429345 419993 411887 405386 400167 395936 392819 390992 390361 390822 392571
62413C92571L236M455N023N167N474O218P072P582P760Q102Q901R751R870Q931
$$ 392571 395807 400262 405285 410452 415926 422144 429216 436798 444558 452660 461561 471312 481182 490113
62399D90113P377N930M927M153L105J365j003l331m806n215n147n333n932o562
$$ 490113 497490 503420 508347 512500 515605 516970 515967 512636 507830 502615 497468 492135 486203 479641
62385D79641o878o868o641o088m897k990q55P77J764K819M676P135R396J1210
$$ 479641 472763 465895 459254 453166 448269 445279 444424 445201 446965 449784 454460 461595 470991 482201
62371D82201J3153J5659J8424K1063K3738K6768L0087L3584L7525M1978M6200
$$ 482201 495354 511013 529437 550500 574238 601006 631093 664677 702202 744180 790380
62360G90380M9357N1726N4263N6898N8125N6625N2654M7333M1179L3955K5646
$$ 790380 839737 891463 945726 1002624 1060749 1117374 1170028 1217361 1258540 1292495 1318141
62349A318141J6783P888q52r111j6239k1838k6245l0100l3542l6167l7760l8674
$$ 1318141 1334924 1342812 1341960 1332849 1316610 1294772 1268527 1238427 1204885 1168718 1130958 1092284
62337A092284l9333l9567l8797l6785l3972l0997k8168k5496k3025k0965j9545
$$ 1092284 1052951 1013384 974587 937802 903830 872833 844665 819169 796144 775179 755634
62326G55634j8852j8639j8265j7144j5403j3833j2848j1797r799p034m691l580
$$ 755634 736782 718143 699878 682734 667331 653498 640650 628853 619054 612020 607329 603749
62314F03749l377l320l024k399j407l79j29j092k625l738m354n179o407p345p475
$$ 603749 600372 597052 594028 591629 590222 589843 589714 588622 585997 582259 577905 572726 566319 558974 551499
62299E51499p212p162p192o820o103n495m944l938k454j202o22k02P64K118L051
$$ 551499 544287 537125 529933 523113 517010 511515 506571 502633 500179 498977 498355 498153 498917 501035 504086
62284E04086L184K930K873L328M416O098P899R118R518R563R822J0462J1432J2673
$$ 504086 507270 510200 513073 516401 520817 526915 534814 543932 553450 563013 572835 583297 594729 607402
62270F07402J3899J4658J5005J5666J7135J9047K0952K3227K6390K9968L3083
$$ 607402 621301 635959 650964 666630 683765 702812 723764 746991 773381 803349 836432
62259H36432L6032L9986M4938M9119N1071N1243N0679M9060M5191L8919L1336
$$ 836432 872464 912450 957388 1006507 1057578 1108821 1159500 1208560 1253751 1292670 1324006
62248A324006K3229J4523N322l538j1261j7738k3104k7436l1127l4807l8393m0851
$$ 1324006 1347235 1361758 1367080 1363542 1352281 1334543 1311439 1284003 1252876 1218069 1179676 1138825
62236A138825m1420m0532l8929l6464l2571k7709k3334k0315j8046j5415j2196
$$ 1138825 1097405 1056873 1017944 981480 948909 921200 897866 877551 859505 844090 831894
62225H31894r138o993n804n000l980k657j571j326j869k460k583k609l270m575
$$ 831894 822756 815763 809959 804959 800979 798322 796751 795425 793556 791096 788513 785904 782634 778059
62211G78059n598n532m573l575l051k825k558k091j298k3J558K849L514M000N031
$$ 778059 772461 766929 762356 758781 755730 752905 750347 748256 746958 746935 748493 751342 754856 758856 763887
62196G63887O625Q129R227J0414J2237J4404J6110J7115J8117J9892K2217K3918
$$ 763887 770512 778641 787868 798282 810519 824923 841033 858148 876265 896157 918374 942292
62184I42292K4012K2594K0516J8408J6381J4548J3195J2193J0925R377Q749J0210
$$ 942292 966304 988898 1009414 1027822 1044203 1058751 1071946 1084139 1095064 1104441 1113190 1123400
62172A123400J3208J6061J8127K0445K3916K7924L1311L3875L5998L7372L7090
$$ 1123400 1136608 1152669 1170796 1191241 1215157 1243081 1274392 1308267 1344265 1381637 1418727
62161A418727L4812L1070K6396K0974J5181R844N637K579K35j859m008o267q436
$$ 1418727 1453539 1484609 1511005 1531979 1547160 1557004 1562641 1565220 1565455 1563596 1559588 1553321 1544885
62148A544885j0305j1805j2685j2373j0654q248o136m352k171N07K755L795L947
$$ 1544885 1534580 1522775 1510090 1497717 1487063 1478815 1472679 1468327 1466156 1466663 1469418 1473213 1477160
62135A477160M017M320M735N238N835O298O546P036Q316J0283J2322J4044J5522
$$ 1477160 1481177 1485497 1490232 1495470 1501305 1507603 1514149 1521185 1529501 1539784 1552106 1566150 1581672
62122A581672J6901J8209J9564K1066K2465K3302K3566K3838K4625K5764K6681
$$ 1581672 1598573 1616782 1636346 1657412 1679877 1703179 1726745 1750583 1775208 1800972 1827653
62111A827653K7096K7225K7383K7635K7933K8357K9036K9858L0499L0860L1263
$$ 1827653 1854749 1881974 1909357 1936992 1964925 1993282 2022318 2052176 2082675 2113535 2144798
62100B144798L1993L2779L3114L3070L3418L4740L6796L8964M1096M3511M6251
$$ 2144798 2176791 2209570 2242684 2275754 2309172 2343912 2380708 2419672 2460768 2504279 2550530
62089B550530M8691M9931M9454M7484M4909M2838M2028M2614M4394M7148N0435
$$ 2550530 2599221 2649152 2698606 2746090 2790999 2833837 2875865 2918479 2962873 3010021 3060456
62078C060456N3226N4185N2574M8849M4295M0205L7425L6419L7344L9930M3357
$$ 3060456 3113682 3167867 3220441 3269290 3313585 3353790 3391215 3427634 3464978 3504908 3548265
62067C548265M6624M9185N1203N2951N4055N3583N0977M6606M1244L5280K8743
$$ 3548265 3594889 3644074 3695277 3748228 3802283 3855866 3906843 3953449 3994693 4029973 4058716
62056D058716K1898J5354R546M417l01m725q875j2875j6910k1023k5029k8520
$$ 4058716 4080614 4095968 4105514 4109931 4109630 4104905 4096030 4083155 4066245 4045222 4020193 3991673
62044C991673l0979l2076l1941l1060k9802k8239k6425k4647k3173k1910k0548
$$ 3991673 3960694 3928618 3896677 3865617 3835815 3807576 3781151 3756504 3733331 3711421 3690873
62033C690873j8977j7280j5404j3225j0989r317q489q042p328o322n422m711l849
$$ 3690873 3671896 3654616 3639212 3625987 3614998 3605681 3597192 3589150 3581822 3575500 3570078 3565367 3561518
62020C561518k776j964j728j727j476j049r08j266k055l266m871o489p657q465
$$ 3561518 3558742 3556778 3555050 3553323 3551847 3550798 3549890 3548624 3546569 3543303 3538432 3531943 3524286 3515821
62006C515821r401j0478j1029j0708j0240j0796j2800j5581j8039j9466j9976
$$ 3515821 3506420 3495942 3484913 3474205 3463965 3453169 3440369 3424788 3406749 3387283 3367307
61995C367307k0502k2187k5428k9563l3658l7354m0690m3411m4989m5400m5272
$$ 3367307 3346805 3324618 3299190 3269627 3235969 3198615 3157925 3114514 3069525 3024125 2978853
61984B978853m5047m4430m2940m0815l8915l7747l6933l5757l4044l2280l0943
$$ 2978853 2933806 2889376 2846436 2805621 2766706 2728959 2692026 2656269 2622225 2589945 2559002
61973B559002k9959k8931k7719k6537k5559k4698k3829k3002k2294k1612k0847
$$ 2559002 2529043 2500112 2472393 2445856 2420297 2395599 2371770 2348768 2326474 2304862 2284015
61962B284015k0073j9474j9137j9032j9016j8809j8145j7133j6318j6102j6265
$$ 2284015 2263942 2244468 2225331 2206299 2187283 2168474 2150329 2133196 2116878 2100776 2084511
61951B084511j6300j6133j6121j6321j6169j5056j2957j0389p924n892m392l346
$$ 2084511 2068211 2052078 2035957 2019636 2003467 1988411 1975454 1965065 1957141 1951249 1946857 1943511
61939A943511k548j786q67M19K233M448O731Q932J1266J3929J6770J9578K2562
$$ 1943511 1940963 1939177 1938310 1938729 1940962 1945410 1952141 1961073 1972339 1986268 2003038 2022616 2045178
61926B045178K6071K9940L3618L7121M1321M6930N3591O0564O7986P6766Q7339
$$ 2045178 2071249 2101189 2134807 2171928 2213249 2260179 2313770 2374334 2442320 2519086 2606425
61915B606425R9436J13249J29848J49880J72640J97322K24708K56607K93887L36100
$$ 2606425 2705861 2819110 2948958 3098838 3271478 3468800 3693508 3950115 4244002 4580102
61905D580102L82997M35187M92806N54298O17029O78091P33572P77080P99565
$$ 4580102 4963099 5398286 5891092 6445390 7062419 7740510 8474082 9251162 10050727
61896A0050727P90653P40649O43176M98231L14051J06177j05870l02607m68386
$$ 10050727 10841380 11582029 12225205 12723436 13037487 13143664 13037794 12735187 12266801
61887A2266801n94222o78429p24620p38973p28648p00968o62112o16217n66175
$$ 12266801 11672579 10994150 10269530 9530557 8801909 8100941 7438829 6822612 6256437
61878F256437n15049m65746m19593l76437l36401l00494k69169k41458k16233
$$ 6256437 5741388 5275642 4856049 4479612 4143211 3842717 3573548 3332090 3115857
61869C115857j93511j73707j56299j40258j25405j12357j01241r1320q1958p3218
$$ 3115857 2922346 2748639 2592340 2452082 2326677 2214320 2113079 2021759 1939801 1866583
61859A866583o5329n8111n1226m4630l8592l3420k9197k5572k1963j8199j4830
$$ 1866583 1801254 1743143 1691917 1647287 1608695 1575275 1546078 1520506 1498543 1480344 1465514
61848A465514j2403j0639q847o995n687n013m267l167k527l039l987m013k892
$$ 1465514 1453111 1442472 1433625 1426630 1420943 1415930 1411663 1408496 1405969 1402930 1398943 1394930 1392038
61835A392038j660j030n70L14J506K677M013N734P359Q129P971P473O962O297
$$ 1392038 1390378 1389348 1388778 1389092 1390598 1393275 1397288 1403022 1410381 1418510 1426481 1433954 1440916 1447213
61821A447213N482M795M286L739L381L979N827Q179J0108J1587J3279J5546J8215
$$ 1447213 1452695 1457490 1461776 1465515 1468896 1472875 1478702 1486881 1496989 1508576 1521855 1537401 1555616
61808A555616K1103K4209K7515L1050L5085L9818M4872M9595N3902N8370O3413
$$ 1555616 1576719 1600928 1628443 1659493 1694578 1734396 1779268 1828863 1882765 1941135 2004548
61797B004548O8840P4398Q0369Q7311R5392J04264J13515J23204J34004J46731
$$ 2004548 2073388 2147786 2228155 2315466 2410858 2515122 2628637 2751841 2885845 3032576
61787C032576J61636J78238J96258K16492K40318K68406L00570L37108L79507
$$ 3032576 3194212 3372450 3568708 3785200 4025518 4293924 4594494 4931602 5311109
61778E311109M29332M86985N52195O25380P07701P99700R00419J007665J118106
$$ 5311109 5740441 6227426 6779621 7405001 8112702 8912402 9812821 10820486 11938592
61769A1938592J226228J323157J396519J431196J410508J318479J144119Q86868
$$ 11938592 13164820 14487977 15884496 17315692 18726200 20044679 21188798 22075666
61761B2075666N60324J91360j85565n36451q34607j064143j220174j306879j334525
$$ 22075666 22635990 22827350 22641785 22105334 21270727 20206584 18986410 17679531 16345006
61752A6345006j316115j264507j190831j104234j012090r19944q31332p48018
$$ 16345006 15028891 13764384 12573553 11469319 10457229 9537285 8705953 7957935
61744G957935o70729n99841n35588m77952m26599l81044l40869l05678k74889
$$ 7957935 7287206 6687365 6151777 5673825 5247226 4866182 4525313 4219635 3944746
61735C944746k47604k22869k00116j79319j60635j44069j29523j16990j06328
$$ 3944746 3697142 3474273 3274157 3094838 2934203 2790134 2660611 2543621 2437293
61726B437293r6933q8104p9848p2920o7694o3434n9136n4756n0988m7989m5099
$$ 2437293 2340360 2252256 2172408 2099488 2031794 1968360 1909224 1854468 1803480 1755491 1710392
61715A710392m1967l9150l7135l5401l3020k9900k6858k4606k3103k1801k0270
$$ 1710392 1668425 1629275 1592140 1556739 1523719 1493819 1466961 1442355 1419252 1397451 1377181
61704A377181j8557j7200j6646j6575j6117j4986j3952j3744j3965j3700j2844
$$ 1377181 1358624 1341424 1324778 1308203 1292086 1277100 1263148 1249404 1235439 1221739 1208895
61693A208895j2101j1863j1843j1750j1590j1231j0501r798r833j0562j1098j0955
$$ 1208895 1196794 1184931 1173088 1161338 1149748 1138517 1128016 1118218 1108385 1097823 1086725 1075770
61681A075770j0672j0752j0771j0134r129q509q397q329q154q176q447q564q215
$$ 1075770 1065098 1054346 1043575 1033441 1024312 1015803 1007406 999077 990923 982747 974300 965736 957521
61668I57521p517o708n879n108m634m718n388o318o958o923o367n776n289m574
$$ 957521 950004 943296 937417 932309 927675 922957 917569 911251 904293 897370 891003 885227 879938 875364
61654H75364l473k424j853j519r00NP98J448K319L305L533K318J98j411j547n09
$$ 875364 871891 869467 867614 866095 865195 865200 865998 867446 869765 873070 876603 878921 879119 877708 876161 875652
61638H75652O79J421J968K695L348L286K396J309O68N33O41Q13R00P05K66j88
$$ 875652 876331 877752 879720 882415 885763 889049 891445 892754 893422 893955 894596 895409 896309 897014 897280 897092
61622H97092q11k202m416o356o913o380n993o208o344n954n514n369n001m047
$$ 897092 896281 894079 889663 883307 876394 870014 864021 857813 851469 845515 840001 834632 829631 825584
61608H25584l373m152o112p659p778p023o465o356o259n940n497m851l773k411
$$ 825584 822211 818059 811947 804288 796510 789487 783022 776666 770407 764467 758970 754119 750346 747935
61594G47935j307p22k82M67J471K329K906L427M112M919N649O079O108N989O315
$$ 747935 746628 745906 745624 746091 747562 749891 752797 756224 760336 765255 770904 776983 783091 789080 795395
61579G95395P532R419J1301J2723J3659J4233J4619J5307J6896J9395K2023K3988
$$ 795395 802927 812346 823647 836370 850029 864262 878881 894188 911084 930479 952502 976490
61567I76490K5254K6281K7289K8124K8691K9115K9464K9516K8912K7547K5776
$$ 976490 1001744 1028025 1055314 1083438 1112129 1141244 1170708 1200224 1229136 1256683 1282459
61556A282459K4219K3253K2652K1904K0803J9532J8261J6947J5484J3669J1046
$$ 1282459 1306678 1329931 1352583 1374487 1395290 1414822 1433083 1450030 1465514 1479183 1490229
61545A490229P362L224k12k527m478o922r825j2659j5112j6878j7389j6541j5244
$$ 1490229 1497591 1500815 1500603 1498076 1493598 1486676 1476851 1464192 1449080 1432202 1414813 1398272 1383028
61532A383028j4393j3648j2108r935q290p626p087n746l555p09K947P305J1522
$$ 1383028 1368635 1354987 1342879 1332944 1324654 1317028 1309941 1304195 1300640 1299931 1302878 1310183 1321705
61519A321705J4981J8230K2369K7695L3534L9297M5170N1821N9813O9249P9686
$$ 1321705 1336686 1354916 1377285 1404980 1438514 1477811 1522981 1574802 1634615 1703864 1783550
61508A783550R0525J01690J13909J27969J43897J61098J79204J98327K18304K38004
$$ 1783550 1874075 1975765 2089674 2217643 2361540 2522638 2701842 2900169 3118473 3356477
61498C356477K55554K69015K76628K76502K66461K44691K10790J66280J14183
$$ 3356477 3612031 3881046 4157674 4434176 4700637 4945328 5156118 5322398 5436581
61489E436581N8313K831m8274r2115j27561j54712j73902j85536j90769j91359
$$ 5436581 5494894 5497725 5449451 5357336 5229775 5075063 4901161 4715625 4524856 4333497
61479D333497j88465j82057j71938j58922j44446j29426j14113r8888q4427p0944
$$ 4333497 4145032 3962975 3791037 3632115 3487669 3358243 3244130 3145242 3060815 2989871
61469B989871n7867m4622l1399j8914p666K366J1497K0125K8577L6805M4201M9900
$$ 2989871 2932004 2887382 2855983 2837069 2829403 2831769 2843266 2863391 2891968 2928773 2972974 3022874
61457C022874N3453N5166N5737N5595N4655N2664M9708M6252M2871M0044L8234
$$ 3022874 3076327 3131493 3187230 3242825 3297480 3350144 3399852 3446104 3488975 3529019 3567253
61446C567253L7862L9006M1244M3961M6720M9233N1160N2227N2472N2077N0922
$$ 3567253 3605115 3644121 3685365 3729326 3776046 3825279 3876439 3928666 3981138 4033215 4084137
61435D084137M8553M4715L9580L3423K6298J8266R703J078p404j5726k3703l0932
$$ 4084137 4132690 4177405 4216985 4250408 4276706 4294972 4304675 4305753 4298349 4282623 4258920 4227988
61423D227988l7044m1776m4872m6301m6487m5977m4742m2150l7778l2120k6287
$$ 4227988 4190944 4149168 4104296 4057995 4011508 3965531 3920789 3878639 3840861 3808741 3782454
61412C782454k1142j6702j2213o917j114L574N511M770K936J092j282m936r242
$$ 3782454 3761312 3744610 3732397 3725480 3724366 3727940 3733451 3738221 3741157 3742249 3740967 3736031 3726789
61399C726789j2935j5866j8839k1798k3379k2491j9312j4397p619J421J2640K5630
$$ 3726789 3713854 3697988 3679149 3657351 3633972 3611481 3592169 3577772 3570153 3571574 3584214 3609844
61387C609844M0061N5587P1897Q9322J08732J30351J53243J76511K00265K24633
$$ 3609844 3649905 3705492 3777389 3866711 3975443 4105794 4259037 4435548 4635813 4860446
61377D860446K48387K69433K86278K97948L02651K97707K81107K52650K13598
$$ 4860446 5108833 5378266 5664544 5962492 6265143 6562850 6843957 7096607 7310205
61368G310205J66099J13124N8196M603m5151q9422j27624j60324j88515k12630
$$ 7310205 7476304 7589428 7647624 7652227 7607076 7517654 7390030 7229706 7041191 6828561
61358F828561k32556k48276k59678k65954k66286k61458k53755k44900k34851
$$ 6828561 6596005 6347729 6088051 5822097 5555811 5294353 5040598 4795698 4560847
61349D560847k23046k09898j96197j81957j66840j51304j36274j21887j07533
$$ 4560847 4337801 4127903 3931706 3749749 3582909 3431605 3295331 3173444 3065911
61340C065911r3123p9388o6743n4686m2653l0844j9804r663j83Q820J7402K5542
$$ 3065911 2972788 2893400 2826657 2771971 2729318 2698474 2678670 2669007 2668824 2677644 2695046 2720588
61328B720588L2873L8768M3099M6635N0131N3208N4767N4446N2955N0872M7972
$$ 2720588 2753461 2792229 2835328 2881963 2932094 2985302 3040069 3094515 3147470 3198342 3246314
61317C246314M4211M0555L7958L5978L3403L0127K7370K5874K4880K3185K0336
$$ 3246314 3290525 3331080 3369038 3405016 3438419 3468546 3495916 3521790 3546670 3569855 3590191
61306C590191J6278J0806M164k541q427j3907j9740k5521l0192l3864l7844m2726
$$ 3590191 3606469 3617275 3621439 3618898 3610471 3596564 3576824 3551303 3521111 3487247 3449403 3406677
61294C406677m7575n1339n4124n6540n8526n9486n9080n7398n4690n1334m7688
$$ 3406677 3359102 3307763 3253639 3197099 3138573 3079087 3020007 2962609 2907919 2856585 2808897
61283B808897m3619l8578l2536k6400k1121j6762j2892r556p295o412o783q235
$$ 2808897 2765278 2726700 2694164 2667764 2646643 2629881 2616989 2607433 2600138 2593726 2586943 2578708
61271B578708j0598j3350j5656j7031j7745j8373j8991j8947j7576j5137j2727
$$ 2578708 2568110 2554760 2539104 2522073 2504328 2485955 2466964 2448017 2430441 2415304 2402577
61260B402577j0981r118n736l73O341J4021K3154L4080M6137N8434P0924Q4040
$$ 2402577 2391596 2382478 2376742 2376369 2382710 2396731 2419885 2453965 2500102 2558536 2629460 2713500
61248B713500R7615J10794J22832J33188J40923J44589J42869J35018J20546R8934
$$ 2713500 2811115 2921909 3044741 3177929 3318852 3463441 3606310 3741328 3861874 3960808
61238C960808O9951L4426n305m5651q2830j14041j37943j54313j63616j66840
$$ 3960808 4030759 4065185 4059880 4014229 3931399 3817358 3679415 3525102 3361486 3194646
61228C194646j65210j59756j51390j41294j30662j19912j08752r7334q6641p7309
$$ 3194646 3029436 2869680 2718290 2576996 2446334 2326422 2217670 2120336 2033695 1956386
61218A956386o8832o0597n3089m7127m2408l7859l3095k8479k3900j8797j3573
$$ 1956386 1887554 1826957 1773868 1726741 1684333 1646474 1613379 1584900 1561000 1542203 1528630
61207A528630r588p214m924j173L648Q015J1416J4536J7610J9782K0347J9687
$$ 1528630 1519042 1511828 1506904 1505731 1509379 1517394 1528810 1543346 1560956 1580738 1601085 1620772
61195A620772J8457J6472J3086Q468L831K47k323m626p033r267j1158j3150j5775
$$ 1620772 1639229 1655701 1668787 1677255 1681086 1681333 1679010 1674384 1667351 1658084 1646926 1633776 1618001
61182A618001j8850k1544k3321k4498k5788k7393k8766k9200k8561k7330k6045
$$ 1618001 1599151 1577607 1554286 1529788 1504000 1476607 1447841 1418641 1390080 1362750 1336705
61171A336705k4899k3955k3481k3704k4289k4564k4346k4201k4578k5131k5189
$$ 1336705 1311806 1287851 1264370 1240666 1216377 1191813 1167467 1143266 1118688 1093557 1068368
61160A068368k4631k3753k2590k0939j9002j7385j6347j5561j4829j4555j5228
$$ 1068368 1043737 1019984 997394 976455 957453 940068 923721 908160 893331 878776 863548
61149H63548j6785j8715k0470k1512k1357k0041j8289j6795j5422j3527j1008
$$ 863548 846763 828048 807578 786066 764709 744668 726379 709584 694162 680635 669627
61138F69627q535o690n326l999k644j467l94R44K698M591O223P392Q100Q510Q930
$$ 669627 661092 654402 649076 645077 642433 640966 640572 641516 644214 648805 655028 662420 670520 679030 687960
61123F87960R672J0725J1793J2624J3195J3467J3310J2790J2259J1901J1453J0753
$$ 687960 697632 708357 720150 732774 745969 759436 772746 785536 797795 809696 821149 831902
61111H31902J0243J0504J1313J1743J1156R651P430M384O30l045n793p482q517
$$ 831902 842145 852649 863962 875705 886861 896512 903942 908326 908956 905911 900118 892636 884119
61098H84119r067r046q708q698r299j0053j0385j0360j0524j1105j1697j1800
$$ 884119 875052 866006 857298 848600 839301 829248 818863 808503 797979 786874 775177 763377
61086G63377j1471j1292j1726j2642j3449j3565j2767j1279r669q576q229q197
$$ 763377 751906 740614 728888 716246 702797 689232 676465 665186 655517 646941 638712 630515
61074F30515p788o709n298m089l271k602j726n11Q70K068K797K966K714K401K474
$$ 630515 622727 616018 610720 606631 603360 600758 599032 598521 599391 601459 604256 607222 609936 612337 614811
61059F14811L046L660L658K958K138J711J575J365R50M00j81m36J90J752L464
$$ 614811 617857 621517 625175 628133 630271 631982 633557 634922 635872 636272 636091 635655 635845 637597 641061
61044F41061M485M785M836M948N373O540Q391J0014J0820J1712J3824J6409J7424
$$ 641061 645546 650331 655167 660115 665488 672028 680419 690433 701253 712965 726789 743198 760622
61031G60622J6342J4895J4555J4707J4065J2756J1745J1168J0355R137Q029P366
$$ 760622 776964 791859 806414 821121 835186 847942 859687 870855 881210 890347 898376 905742
61019I05742P053P026P184P090O474N960O610Q694J1372J3663J5311J6726J8420
$$ 905742 912795 919821 927005 934095 940569 946529 953139 961833 973205 986868 1002179 1018905 1037325
61006A037325K0659K3462K6871L1044L5942M1085M5939N0413N4454N7521N9388
$$ 1037325 1057984 1081446 1108317 1139361 1175303 1216388 1262327 1312740 1367194 1424715 1484103
60995A484103O1417O5929P3940Q4375R5811J07940J20827J33833J46169J58015
$$ 1484103 1545520 1611449 1685389 1769764 1865575 1973515 2094342 2228175 2374344 2532359
60985B532359J70699J86503K08554K39822K81869L35657M03602M89035N93762
$$ 2532359 2703058 2889561 3098115 3337937 3619806 3955463 4359065 4848100 5441862
60976E441862P19305Q71590J061042J296598J583539J925492K310020K669864
$$ 5441862 6161167 7032757 8093799 9390397 10973936 12899428 15209448 17879312
60968A7879312K861604K720506K181087J361284N16731j05824l87102l40722n1106
$$ 17879312 20740916 23461422 25642509 27003793 27520524 27414700 27027598 26686876 26635770
60959B6635770L58200P10960P97938M76433k21663j087969j859783k362455k562703
$$ 26635770 26993970 27704930 28502868 28979301 28757638 27669669 25809886 23447431 20884728
60950B0884728k524544k338961k083806j814072j561338j336559j139071r66332
$$ 20884728 18360184 16021223 13937417 12123345 10562007 9225448 8086377 7120045
60942G120045q16719o87861n77072m83343m06646l45630k97698k60633k32464
$$ 7120045 6303326 5615465 5038393 4555050 4148404 3802774 3505076 3244443 3011979
60933C011979k10315j91148j73612j57881j43853j30691j17873j05553r3952q3328
$$ 3011979 2801664 2610516 2436904 2279023 2135170 2004479 1886606 1781053 1687101 1603773
60923A603773p4448o8117o4168o1561n9403n7256n4685n1274m7121m2750l8530
$$ 1603773 1529325 1461208 1397040 1335479 1276076 1218820 1164135 1112861 1065740 1022990 984460
60912I84460l4578l1053k8056k5368k2713k0176j8014j6190j4443j2616j0728
$$ 984460 949882 918829 890773 865405 842692 822516 804502 788312 773869 761253 750525
60901G50525q938p595o914o385n067k830p88J1j60j88N59J935L536M862N337M810
$$ 750525 741587 733992 727078 720693 715626 712796 712008 712019 711859 711671 712230 714165 717701 722563 727900 732710
60885G32710L889L259K829K036P41o79j979l227m538n963p525r005r929j0107
$$ 732710 736599 739858 742687 744723 745464 744785 742806 739579 735041 729078 721553 712548 702619 692512
60871F92512r946r843r590q755p459o277n495m860l980k776j618j045j036o57
$$ 692512 682566 672723 663133 654378 646919 640642 635147 630287 626307 623531 621913 620868 619832 619175
60857F19175J061L713N718O170N809N806O415P335Q619J0316J1929J3096J4367
$$ 619175 620236 623949 629667 635837 641646 647452 653867 661202 669821 680137 692066 705162 719529
60844G19529J6386J8609J9874J9985J9732J9464J8603J6719J4233J1804R610P538
$$ 719529 735915 754524 774398 794383 814115 833579 852182 868901 883134 894938 904548 912086
60832I12086N621M060L081K769K839K671J877O16q48k524m267n492n969o410p510
$$ 912086 917707 921767 924848 927617 930456 933127 935004 935620 934772 932248 927981 922489 916520 910110 902600
60817I02600q741r080q692q821r939j1127j1556j1607j1963j2363j1968j0618
$$ 902600 893859 884779 876087 867266 857327 846200 834644 823037 811074 798711 786743 776125
60805G76125r031p933p464p330p174o665n537l839k152j306j540j960j226J054
$$ 776125 767094 759161 751697 744367 737193 730528 724991 721152 719000 717694 716154 714194 712968 714022
60791G14022L953O421Q339J0033J1328J1879J2117J2975J4604J6024J6313J5599
$$ 714022 717975 724396 732735 742768 754096 765975 778092 791067 805671 821695 838008 853607
60779H53607J4654J3946J3384J2760J2066J1418J0822J0092R040P784O705O058
$$ 853607 868261 882207 895591 908351 920417 931835 942657 952749 961789 969573 976278 982336
60767I82336N771N636N525N319M921M369L669K591J023m84j176j233j644k698
$$ 982336 988107 993743 999268 1004587 1009508 1013877 1017546 1020137 1021160 1020676 1019500 1018267 1016623 1013925
60753A013925l410l028k246k145k665k995k917k739k385j629j030j498k960m451
$$ 1013925 1010515 1007487 1005241 1003096 1000431 997436 994519 991780 989395 987766 986736 985238 982278 977827
60739I77827n501o453p403p819p513p076o980o874o139m659k867j428q72j076
$$ 977827 972326 965873 958470 950651 943138 936062 929082 922208 916069 911410 908543 907115 906243 905167
60725I05167j130k93R67J553J252Q78Q76P31k6j014j633j798j734j521j250j134
$$ 905167 904037 903744 904711 906264 907516 908394 909270 910001 909975 908961 907328 905530 903796 902275 901025 899891
60709H99891j160j081r54j226j997k684k763k401k152k320k867l535l935l899
$$ 899891 898731 897650 896696 895470 893473 890789 888026 885625 883473 881153 878286 874751 870816 866917
60695H66917l881m544n852p054p784q519r690j0872j1400j1321j1257j1510j1849
$$ 866917 863036 858492 852640 845586 837802 829283 819593 808721 797321 786000 774743 763233 751384
60682G51384j2041j2148j2257j2163j1515j0204q524o869n295l648k088j088o04
$$ 751384 739343 727195 714938 702775 691260 681056 672532 665663 660368 656720 654632 653544 652940
60669F52940J93J942M122N681O331O610O896P050O958O703O229N464M705M269
$$ 652940 653133 655075 659197 664878 671209 677819 684715 691765 698723 705426 711655 717119 721824 726093
60655G26093L917L279K731K992L879M450M446M619N474O563P298P535P145N947
$$ 726093 730010 733289 736020 739012 742891 747341 751787 756406 761880 768443 775741 783276 790421 796368
60641G96368M489L850M264M829N042N611P118Q857R925J0569J1497J2527J2985
$$ 796368 800857 804707 808971 813800 818842 824453 831571 840428 850353 860922 872419 884946 897931
60628H97931J3021J3296J3639J3134J1587R925Q845P853N991L108l8k701m867
$$ 897931 910952 924248 937887 951021 962608 972533 981378 989231 995222 998330 998292 995591 990724
60615I90724o950r037j0712j1737j2512j3332j3588j2448j0245q213o752m988
$$ 990724 983774 974737 964025 952288 939776 926444 912856 900408 890163 881950 875198 870210
60603H70210k460j60P71N66J09n59j916l734n229o271p359q409q515p137m812
$$ 870210 867750 867590 868361 868927 869036 868477 866561 862827 857598 851327 843968 835559 827044 819907 815095
60588H15095k520q35J58P25J363K412L570M181M065L714L603L685L693L556L325
$$ 815095 812575 811740 811898 812623 813986 816398 819968 824149 828214 831928 835531 839216 842909 846465 849790
60573H49790K945K357J774J581J903K332K257J547P19K39j88j243l058n077o794
$$ 849790 852735 855092 856866 858447 860350 862682 864939 866486 867205 867444 867256 866013 862955 857878 851084
60558H51084q116q934r057q750q713r097r160q241o626m953l355j654M5J542K930
$$ 851084 842968 834034 824977 816227 807514 798417 789257 781016 774390 769437 766082 764428 764473 766015 768945
60543G68945M257N232N824O791Q878J1896J5236J8963K3506K8592L3363L7492
$$ 768945 773202 778434 784258 791049 799927 811823 827059 846022 869528 898120 931483 968975
60531I68975M1157M3722M3423L8905L0610K0250R402j108j0882j9489k6289l0392
$$ 968975 1010132 1053854 1097277 1136182 1166792 1187042 1196444 1195336 1184454 1164965 1138676 1108284
60519A108284l1025k8202k3016j7104j1669o938k461J994N846Q139Q534P703O580
$$ 1108284 1077259 1049057 1026041 1008937 997268 990330 987869 989863 995709 1003848 1012382 1020085 1026665
60506A026665N583M767M357M652N569O787Q362J0831J4573J9366K4743L0573L7110
$$ 1026665 1032248 1037015 1041372 1046024 1051593 1058380 1066742 1077573 1092146 1111512 1136255 1166828 1203938
60493A203938M4526N2500O0435O8111P5944Q4441R3557J03051J13407J25975J42096
$$ 1203938 1248464 1300964 1361399 1429510 1505454 1589895 1683452 1786503 1899910 2025885 2167981
60482B167981J62491J87598K17892K53409K92925L33376L69279L92591L94362
$$ 2167981 2330472 2518070 2735962 2989371 3282296 3615672 3984951 4377542 4771904
60473D771904L68053L12041K29514J27008J3553r9906k02229k84589l42025l73608
$$ 4771904 5139957 5451998 5681512 5808520 5822073 5722167 5519938 5235349 4893324 4519716
60463D519716l81947l72277l50813l22989k92586k61853k32031k03937j78419
$$ 4519716 4137769 3765492 3414679 3091690 2799104 2537251 2305220 2101283 1922864
60454A922864j56171j37009j19927j04158q9859p7373o6498n6962m9096m3219
$$ 1922864 1766693 1629684 1509757 1405599 1315740 1238367 1171869 1114907 1065811 1022592
60444A022592l8697l4431l0152k6446k3653k1438j9471j7807j6565j5698j5169
$$ 1022592 983895 949464 919312 892866 869213 847775 828304 810497 793932 778234 763065
60433G63065j4891j4518j3726j2634j1542j0372q880p255n954n057m306l636l139
$$ 763065 748174 733656 719930 707296 695754 685382 676502 669247 663293 658236 653930 650294 647155
60420F47155k545j389K28J615K304K509K678K970L205L080K498J833J664K020
$$ 647155 644610 643221 643449 645064 647368 649877 652555 655525 658730 661810 664308 666141 667805 669825
60406F69825K299K286K620L713M771M779L998L525L702L960M071M425N096N576
$$ 669825 672124 674410 677030 680743 685514 690293 694291 697816 701518 705478 709549 713974 719070 724646
60392G24646N647N595N505N190M864M926N016M312K907J821J431R36k13j508k401
$$ 724646 730293 735888 741393 746583 751447 756373 761389 765701 768608 770429 771860 772796 772583 771075 768674
60377G68674l097l698l637k667j541r21n21n4q2q77j365m16J354K373K313K201
$$ 768674 765577 761879 758242 755575 754034 753113 752592 752538 752456 751579 750214 749798 751152 753525 755838 758039
60361G58039K547K720K365K131K519L022L049K963L491M564N458N870O287P236
$$ 758039 760586 763306 765671 767802 770321 773343 776392 779355 782846 787410 792868 798738 805025 812261
60347H12261Q621R914J0751J1194J1549J2030J2492J2398J1228R138P074N870
$$ 812261 820882 830796 841547 852741 864290 876320 888812 901210 912438 921576 928650 934520
60335I34520N227M107K278P92N35R47J001R08J766L700N589O838Q026R328R440
$$ 934520 939747 943854 946132 946924 947459 948406 949407 950315 952081 955781 961370 968208 976234 985562 995002
60320I95002P127K976j308m845p812j0277j1885j2589j2659j1981j0269q049o483
$$ 995002 1002129 1005105 1003797 998952 991140 980863 968978 956389 943730 931749 921480 913431 906948
60307I06948n963n655m760l541k662k150j578q55k04M83J694L693O154Q444R990
$$ 906948 900985 895330 890570 887029 884367 882217 880639 879784 879580 880063 881757 885450 891604 900048 910038
60292I10038J0459R889Q724P544O565N605M485L302K209J161P8q97j598k206l047
$$ 910038 920497 930386 939110 946654 953219 958824 963309 966611 968820 969981 970059 969162 967564 965358 962311
60277I62311m015m555m451m179m151l949k859r91P14J628K080K744L900N485P394
$$ 962311 958296 953741 949290 945111 940960 937011 934152 933161 933875 935503 937583 940327 944227 949712 957106
60262I57106R464J1423J3187J4949J6824J8736K0824K3516K6845L0120L2831L5556
$$ 957106 966570 977993 991180 1006129 1022953 1041689 1062513 1086029 1112874 1142994 1175825 1211381
60250A211381L9387M4546N0251N5938O1979O8954P6748Q4767R2659J00400J07876
$$ 1211381 1250768 1295314 1345565 1401503 1463482 1532436 1609184 1693951 1786610 1887010 1994886
60239A994886J14811J21032J26434J30595J32775J32332J29025J22862J13980
$$ 1994886 2109697 2230729 2357163 2487758 2620533 2752865 2881890 3004752 3118732
60230C118732J02811R0027P6105O1081M5027K8487J2216l365j8019l1179m2066
$$ 3118732 3221543 3311570 3387675 3448756 3493783 3522270 3534486 3531121 3513102 3481923 3439857
60219C439857n0301n5931n8870n8915n6432n2305m6869l9501k9710j8055n489
$$ 3439857 3389556 3333625 3274755 3215840 3159408 3107103 3060234 3020733 2991023 2972968 2967479
60208B967479P660K1415L5401M9193O3035P7323R1499J04410J15586J25241J32929
$$ 2967479 2975139 2996554 3031955 3081148 3144183 3221506 3313005 3417415 3533001 3658242 3791171
60197C791171J37273J37333J33388J26002J15100J00522Q2904O3422M3014K2162
$$ 3791171 3928444 4065777 4199165 4325167 4440267 4540789 4623693 4687115 4730129 4752291
60187D752291J062k0241m1461o1520p8877r2734j03344j10775j14131j12680j07194
$$ 4752291 4753353 4733112 4691651 4630131 4551254 4458520 4355176 4244401 4130270 4017590 3910396
60176C910396r9296q9689p7826o3299m6759k9285j1411O883K5541M4069O1676
$$ 3910396 3811100 3721411 3643585 3580286 3533527 3504242 3492831 3499714 3525255 3569324 3631000
60165C631000P7562R1017J01287J07485J08867J05250R7034Q4845O9470N2070
$$ 3631000 3708562 3799579 3900866 4008351 4117218 4222468 4319502 4404347 4473817 4525887
60155D525887L4015J6270p89j6828l1087m2639n0708n4716n4482n0552m3834l4593
$$ 4525887 4559902 4576172 4575383 4558555 4527468 4484829 4434121 4379405 4324923 4274371 4230537 4195944
60143D195944k2369p293R231K5755M2207N9460P7975R7839J19710J44473J71793
$$ 4195944 4173575 4166282 4175513 4201268 4243475 4302935 4380910 4478749 4598459 4742932 4914725
60132D914725K00085K28299K56828K86165L15463L43150L68305L90519M08630
$$ 4914725 5114810 5343109 5599937 5886102 6201565 6544715 6913020 7303539 7712169
60123G712169M20667M25163M21866M10850L91649L63831L28104K86190K39630
$$ 7712169 8132836 8557999 8979865 9390715 9782364 10146195 10474299 10760489 11000119
60114A1000119J89080J34770P7193J7160m4359j06002j65804k21572k71443l13853
$$ 11000119 11189199 11323969 11401162 11418322 11373963 11267961 11102157 10880585 10609142 10295289
60104A0295289l47089l69423l79993l79458l69575l52122l28252k98772k64779
$$ 10295289 9948200 9578777 9198784 8819326 8449751 8097629 7769377 7470605 7205826
60095G205826k27806j89265j49922j10171p0698l2504L698L7523O8196R4313J14701
$$ 7205826 6978020 6788755 6638833 6528662 6457964 6425460 6429158 6466681 6534877 6629190 6743891
60084F743891J29001J36981J37843J30983J17101R7761P4064M6673J6961j2909
$$ 6743891 6872892 7009873 7147716 7278699 7395800 7493561 7567625 7614298 7631259 7618350
60074G618350m1289o7604r1550j12694j31162j47714j62556j74907j84236j91060
$$ 7618350 7577061 7509457 7417907 7305213 7174051 7026337 6863781 6688874 6504638 6313578
60064F313578j95738j97298j94598j88181j79821j70330j58873j44626j28153
$$ 6313578 6117840 5920542 5725944 5537763 5357942 5187612 5028739 4884113 4755960
60055D755960j10724r2778p3637n2642l0225p758J3697L4342N5089P6071R6083
$$ 4755960 4645236 4552458 4478821 4426179 4395954 4388196 4401893 4436235 4491324 4567395 4663478
60044D663478J13683J28291J39819J47659J50693J48134J39892J26233J07683
$$ 4663478 4777161 4905452 5045271 5192930 5343623 5491757 5631649 5757882 5865565
60035E865565Q5228O0128L3382N673k2380n0205p7390j03188j25947j43705j55639
$$ 5865565 5950793 6010921 6044303 6049976 6027596 5977391 5900001 5796813 5670866 5527161 5371522
60024E371522j62560j65669j65206j60645j51974j40225j26693j11957r5944p8762
$$ 5371522 5208962 5043293 4878087 4717442 4565468 4425243 4298550 4186593 4090649 4011887
60014D011887o1068m3488k5928p804J1199L0925N1268P2393R4279J16339J37792
$$ 4011887 3950819 3907331 3881403 3873599 3884798 3915723 3966991 4039384 4133663 4250002 4387794
60003D387794J58120J76861J93151K05759K13472K15231K10096J97575J78256
$$ 4387794 4545914 4722775 4915926 5121685 5335157 5550388 5760484 5958059 6136315
59994F136315J53919J26679R7818O7443L5418K518k9692o0131q8797j15571j38946
$$ 6136315 6290234 6416913 6514731 6582174 6617592 6620110 6590418 6530287 6441490 6325919 6186973
59983F186973j56831j68493j74829j76628j73492j64894j51478j34622j15257
$$ 6186973 6030142 5861649 5686820 5510192 5336700 5171806 5020328 4885706 4770449
59974D770449r3806p0987m7907k5382l576J7638L8176N7544P5002Q9993J02431
$$ 4770449 4676643 4605656 4557749 4532367 4528791 4546429 4584605 4642149 4717151 4807144 4909575
59963D909575J12373J19434J23040J23231J20590J15221J06468R4115P9336O3938
$$ 4909575 5021948 5141382 5264422 5387653 5508243 5623464 5729932 5824047 5903383 5967321
59953E967321M9051L4924K1530Q987k230j0991j5901j6444j3276o898L404J8672
$$ 5967321 6016372 6051296 6072826 6081813 6079583 6068592 6052691 6036247 6022971 6016073 6019477 6038149
59941F038149L8883O3271R1652J24452J61515K01724K43866K87173L30914L73964
$$ 6038149 6077032 6140303 6231955 6356407 6517922 6719646 6963512 7250685 7581599 7955563
59931G955563M14871M51799M82273N03219N11212N02708M74667M25753L56970
$$ 7955563 8370434 8822233 9304506 9807725 10318937 10821645 11296312 11722065 12079035
59922A2079035K70931J71102O2339m8558j54132k48532l28069l90204m33361m58021
$$ 12079035 12349966 12521068 12583407 12534849 12380717 12132185 11804116 11413912 10980551 10522530
59912A0522530m66908m63307m49470m26850l97121l62391l24678k85508k45790
$$ 10522530 10055622 9592315 9142845 8715995 8318874 7956483 7631805 7346297 7100507
59903G100507k05792j65484j25110q5318m6587q796K8497O5360J01112J34542
$$ 7100507 6894715 6729231 6604121 6518803 6472216 6463420 6491917 6557277 6658389 6792931
59893F792931J64536J90458K11645K26454K32362K27407K11244J84338J46741
$$ 6792931 6957467 7147925 7359570 7586024 7818386 8045793 8257037 8441375 8588116
59884H588116R8545M1405k1182q5200j47031k03269k50847k88014l14690l31430
$$ 8588116 8686661 8728066 8706884 8621684 8474653 8271384 8020537 7732523 7417833 7086403
59874G086403l38526l36558l27209l12750k94773k73917k50713k26186k01506
$$ 7086403 6747877 6411319 6084110 5771360 5476587 5202670 4951957 4725771 4524265
59865D524265j77413j54290j32595j12991r6049q2053p1156o3420n8566n5902
$$ 4524265 4346852 4192562 4059967 3946976 3850927 3768874 3697718 3634298 3575732 3519830
59855C519830n4820n5143n6484n7517n6574n3152m8160m2455l5821k7867j9282
$$ 3519830 3465010 3409867 3353383 3295866 3239292 3186140 3137980 3095525 3059704 3031837 3012555
59844C012555j1566n783k264j246l201q468j6827k7219l7661m5938n1012n3515
$$ 3012555 3000989 2995206 2992942 2991696 2988495 2980027 2963200 2935981 2898320 2852382 2801370 2747855
59832B747855n4528n4200n2035m8072m3002l7274l0753k3273j5121o891Q22P841
$$ 2747855 2693327 2639127 2587092 2539020 2496018 2458744 2427991 2404718 2389597 2382706 2383528 2391369
59820B391369J4690K2067K9730L6385M1140M4646M8306N2841N8189O4146P0194
$$ 2391369 2406059 2428126 2457856 2494241 2535381 2580027 2628333 2681174 2739363 2803509 2873703
59809B873703P5017P7036P5404P0024O1132M9544L6811K4236J2200J133p579j2838
$$ 2873703 2948720 3025756 3101160 3171184 3232316 3281860 3318671 3342907 3355107 3356240 3348661 3335823
59797C335823j5421j6881j7126j4534q412R5R741K0458L2569M5996O0748P7300
$$ 3335823 3320402 3303521 3286395 3271861 3263449 3263544 3273285 3293743 3326312 3372308 3433056 3510356
59785C510356R6012J17022J40932J68731K00689K36132K74552L15955L59656M03299
$$ 3510356 3606368 3723390 3864322 4033053 4233742 4469874 4744426 5060381 5420037 5823336
59775E823336M42852M72226M82612M63919M08968L17486J97142O1932p1033j86028
$$ 5823336 6266188 6738414 7221026 7684945 8093913 8411399 8608541 8670473 8599440 8413412
59765H413412k73129l29680l58243l63740l52018l29067k99937k68115k35785
$$ 8413412 8140283 7810603 7452360 7088620 6736602 6407535 6107598 5839483 5603698
59756E603698k04147j73547j44290j17477r4072p3209n2777l2097j2615M630K0802
$$ 5603698 5399551 5226004 5081714 4964237 4870165 4796956 4744179 4712082 4699467 4704097 4724899
59745D724899L7595N5064P2289Q9207J06464J24161J42062J60718J81171K03700
$$ 4724899 4762494 4817558 4889847 4979054 5085518 5209679 5351741 5512459 5693630 5897330
59735E897330K27830K53408K80962L11028L43803L79375M17724M58563N01439
$$ 5897330 6125160 6378568 6659530 6970558 7314361 7693736 8111460 8570023 9071462
59726I071462N45589N89412O30435O66155O94422P12718P18016P08199O83445
$$ 9071462 9617051 10206463 10836898 11503053 12197475 12910193 13628209 14336408 15019853
59717A5019853O46019N99522N48974N00738M61013M34117M22395M26945M47395
$$ 15019853 15665872 16265394 16814368 17315106 17776119 18210236 18632631 19059576 19506971
59708A9506971M81236N24175N71241O17243O56620O83737O93457O81449O44604
$$ 19506971 19988207 20512382 21083623 21700866 22357486 23041223 23734680 24416129 25060733
59699B5060733N82033M95694L89896K70480J44634K0496r4077j92611k70303l24246
$$ 25060733 25642766 26138460 26528356 26798836 26943470 26963966 26869889 26677278 26406975 26082729
59689B6082729l53954l60841l46522l12127k59627j92613j14638k7495O8065J70715
$$ 26082729 25728775 25367934 25021412 24709285 24449658 24257045 24142407 24114912 24182977 24353692
59679B4353692K79049L92990N13133O38390P65163Q88548J003076J102114J177380
$$ 24353692 24632741 25025731 25538864 26177254 26942417 27830965 28834041 29936155 31113535
59670C1113535J219348J217685J162046J044408Q62251O20399L30886J2043l13156
$$ 31113535 32332883 33550568 34712614 35757022 36619273 37239672 37570558 37582601 37269445
59661C7269445o20490q88986j103961j257631j348536j380730j362399j303983
$$ 37269445 36648955 35759969 34656008 33398377 32049841 30669111 29306712 28002729
59653B8002729j216688j111846j000793q95203q07563p50171p31476p51771q01986
$$ 28002729 26786041 25674195 24673402 23778199 22970636 22220465 21488989 20737218 19935232
59644A9935232q66769r29532r76673r99955r97077r70613r26037q69763q07576
$$ 19935232 19068463 18138931 17162258 16162303 15165226 14194613 13268576 12398813 11591237
59635A1591237p43592o80195o18858n60780n06683m56652m10699l69129l31841
$$ 11591237 10847645 10167450 9548592 8987812 8481129 8024477 7613778 7244649 6912808
59626F912808k97795k65869k35963k08678j84150j61868j41368j22483j05069
$$ 6912808 6615013 6349144 6113181 5904503 5720353 5558485 5417117 5294634 5189565
59617E189565q9159p5227o3725n4494m7218m2254m0365m1752m5891n2207o0222
$$ 5189565 5100406 5025179 4961454 4906960 4859742 4817488 4777123 4735371 4689480 4637273 4577051
59606D577051o9210p8229q6553r3645r8954j02156j03359j02567r9436r4052q7516
$$ 4577051 4507841 4429612 4343059 4249414 4150460 4048304 3944945 3842378 3742942 3648890 3561374
59595C561374q0886p3943o5874n6837m7887l9574l1638k3936j6667r637k372M876
$$ 3561374 3480488 3406545 3340671 3283834 3235947 3196373 3164735 3140799 3124132 3114495 3112123 3116999
59583C116999J1175J6125K0164K3508K5689K6488K6463K6175K5548K4402K3074
$$ 3116999 3128174 3144299 3164463 3187971 3213660 3240148 3266611 3292786 3318334 3342736 3365810
59572C365810K2176K2178K3442K6155L0044L4642L9931M6377N4217O3238P3214
$$ 3365810 3387986 3410164 3433606 3459761 3489805 3524447 3564378 3610755 3664972 3728210 3801424
59561C801424Q4033R5412J07164J19741J33862J49596J66480J84471K03874K24209
$$ 3801424 3885457 3980869 4088033 4207774 4341636 4491232 4657712 4842183 5046057 5270266
59551E270266K44163K62981K80850K97566L11708L21832L27647L29381L26660
$$ 5270266 5514429 5777410 6058260 6355826 6667534 6989366 7317013 7646394 7973054
59542G973054L18903L06356K89926K70397K48572K25852K03677J82052J59298
$$ 7973054 8291957 8598313 8888239 9158636 9407208 9633060 9836737 10018789 10178087
59533A0178087J33749J05762P8106N4551L7947K9362K8752L5976N0770P1829R6501
$$ 10178087 10311836 10417598 10495704 10550255 10588202 10617564 10646316 10682292 10733062 10804891 10901392
59522A0901392J21670J44593J62569J72295J70216J53855J22747P8247K2666m1357
$$ 10901392 11023062 11167655 11330224 11502519 11672735 11826590 11949337 12027584 12050250 12008893
59512A2008893j10800j82035k51176l14915l70904m17224m51890m73471m82100
$$ 12008893 11898093 11716058 11464882 11149967 10779063 10361839 9909949 9436478 8954378
59503H954378m79487m67824m49012m24765l96854l66811l35625l03929k72335
$$ 8954378 8474891 8007067 7558055 7133290 6736436 6369625 6034000 5730071 5457736
59494E457736k41500k12026j84431j59114j36201j15363r5852p6825n7884l9303
$$ 5457736 5216236 5004210 4819779 4660665 4524464 4409101 4313249 4236424 4178540 4139237
59484D139237k1572m735J1596K7747M3925O0590P8203R6507J14746J32947J52212
$$ 4139237 4117665 4112930 4124526 4152273 4196198 4256788 4334991 4431498 4546244 4679191 4831403
59473D831403J73300J95482K17359K38154K57480K74356K87279K94904K95913
$$ 4831403 5004703 5200185 5417544 5655698 5913178 6187534 6474813 6769717 7065630
59464G065630K88616K71419K43620K05266J56851J00011L8021k5409q7590j46421
$$ 7065630 7354246 7625665 7869285 8074551 8231402 8331413 8369434 8344025 8256435 8110014
59454H110014j99183k43114k77112l01716l17489l24605l24019l17659l07049
$$ 8110014 7910831 7667717 7390605 7088889 6771400 6446795 6122776 5805117 5498068
59445E498068k92795k75736k57475k39173k20710k01733j82925j65544j50080
$$ 5498068 5205273 4929537 4672062 4432889 4212179 4010446 3827521 3661977 3511897
59436C511897j35892j22034j08259r5262q3970p4390o5396n6095m6927l8933l2154
$$ 3511897 3376005 3253971 3145712 3050450 2966480 2892090 2826694 2770599 2723672 2684739 2652585
59425B652585k5682j9032j2631p008k304J502M638P810J1511J5219J8157K0712
$$ 2652585 2626903 2607871 2595240 2588232 2585928 2587430 2592068 2599878 2611389 2626608 2644765 2665477
59413B665477K4157K9015L4573L9764M3244M2971L7573K8783K1121J8361K1079
$$ 2665477 2689634 2718649 2753222 2792986 2836230 2879201 2916774 2945557 2966678 2985039 3006118
59402C006118K7797L7130M8281O0777P4602Q9546J03718J14011J19240J22169
$$ 3006118 3033915 3071045 3119326 3180103 3254705 3344251 3447969 3561980 3681220 3803389
59392C803389J27506J38407J55488J78143K05556K36781K71059L08228L48456
$$ 3803389 3930895 4069302 4224790 4402933 4608489 4845270 5116329 5424557 5773013
59383E773013L91697M37586M85314N33157N78434O18114O49087O68022O72066
$$ 5773013 6164710 6602296 7087610 7620767 8199201 8817315 9466402 10134424 10806490
59374A0806490O60190O33420N93805N44166M88733M32383L78314L27368K79914
$$ 10806490 11466680 12100100 12693905 13238071 13726804 14159187 14537501 14864869 15144783
59365A5144783K36960J98674J63258J28389R2674N4638J1766l7759r2939j50884
$$ 15144783 15381743 15580417 15743675 15872064 15964738 16019376 16031142 15993383 15900444 15749560
59355A5749560k08918k64359l13202l51236l76729l90836l95633l93270l86866
$$ 15749560 15540642 15276283 14963081 14611845 14235116 13844280 13448647 13055377 12668511
59346A2668511l80450l77182l78319l83827l92811m03156m12002m17296m18407
$$ 12668511 12288061 11910879 11532560 11148733 10755922 10352766 9940764 9523468 9105061
59337I105061m15143m06974l93610l75635l54156l30199l04602k78145k51511
$$ 9105061 8689918 8282944 7889334 7513699 7159543 6829344 6524742 6246597 5995086
59328E995086k25333k00220j76453j53837j32184j11729r2653p4571n7018m0208
$$ 5995086 5769753 5569533 5393080 5239243 5107059 4995330 4902677 4828106 4771088 4730880
59318D730880k4672j0434K694J4347K3963L1812L8724M4681M8557M9511M7838
$$ 4730880 4706208 4695774 4698468 4712815 4736778 4768590 4807314 4851995 4900552 4950063 4997901
59307D997901M4114L8222K9779J9151P466m221j5446k6091l5859m4093n0093n3623
$$ 4997901 5042015 5080237 5110016 5129167 5136633 5132412 5116966 5090875 5055016 5010923 4960830 4907207
59295D907207n4984n4449n1788m6526l8594k8551j7169m947Q126K2385L7891N4027
$$ 4907207 4852223 4797774 4745986 4699460 4660866 4632315 4615146 4610199 4618325 4640710 4678601 4732628
59283D732628O9963Q5638J01782J18789J35971J52181J66739J79348J89509J96483
$$ 4732628 4802591 4888229 4990011 5108800 5244771 5396952 5563691 5743039 5932548 6129031
59273F129031J99549J98007J91280J79420J63064J42304J16056Q3380M5542O262
$$ 6129031 6328580 6526587 6717867 6897287 7060351 7202655 7318711 7402091 7447633 7453895
59263G453895l0131o0689q4439j01811j13785j21367j25596j27733j28989j29923
$$ 7453895 7423764 7363075 7278636 7176825 7063040 6941673 6816077 6688344 6559355 6429432
59253F429432j30408j30347j29971j29323j27956j25567j22440j18821j14302
$$ 6429432 6299024 6168677 6038706 5909383 5781427 5655860 5533420 5414599 5300297
59244E300297j08173j00136r0212p8416o4875m9885l3408j4879O076K9100N3791
$$ 5300297 5192124 5091988 5001776 4923360 4858485 4808600 4775192 4760313 4766389 4795489 4849280
59233D849280Q0450J09704J41697J76173K13031K52178K92968L34209L74468M11914
$$ 4849280 4929730 5039434 5181131 5357304 5570335 5822513 6115481 6449690 6824158 7236072
59223G236072M43918M67094M77647M71943M47508M04056L43186K66958J77434
$$ 7236072 7679990 8147084 8624731 9096674 9544182 9948238 10291424 10558382 10735816
59214A0735816P7720k7385j32397k32157l21699l96345m53083m91351n11928n15933
$$ 10735816 10813536 10786151 10653754 10421597 10099898 9703553 9250470 8759119 8247191 7731258
59204G731258n05637m85084m58370m27682l93988l58944l24647k91954k60526
$$ 7731258 7225621 6740537 6282167 5854485 5460497 5101553 4776906 4484952 4224426
59195D224426k30609k03412j79616j58609j39580j22420j07354r4344q3133p3272
$$ 4224426 3993817 3790405 3610789 3452180 3312600 3190180 3082826 2988482 2905349 2832077
59185B832077o4109n5353m7469m0933l5254k9489k3530j8076j3438r156m795l59
$$ 2832077 2767968 2712615 2665146 2624213 2588959 2559470 2535940 2517864 2504426 2495270 2490475 2490116
59173B490116M112Q672J3268J7934K2973K8428L3655L8170M2511M7475N2919N8277
$$ 2490116 2494228 2502900 2516168 2534102 2557075 2585503 2619158 2657328 2699839 2747314 2800233 2858510
59161B858510O3787O9936P6017Q0571Q3335Q5366Q7157Q7816Q6422Q3004P7809
$$ 2858510 2922297 2992233 3068250 3148821 3232156 3317522 3404679 3492495 3578917 3661921 3739730
59150C739730P0743O1934N1915M0765K8040J3976l5j2678k3696l3314m1528m8283
$$ 3739730 3810473 3872407 3924322 3965087 3993127 4007103 4007068 3994390 3970694 3937380 3895852 3847569
59138C847569n3629n7219n8382n7092n4174n0194m4871l7904k9634k0496j0521
$$ 3847569 3793940 3736721 3678339 3621247 3567073 3516879 3472008 3434104 3404470 3383974 3373453
59127C373453O2J0614K0924L1706M3622N6420O9530Q2924R6773J10829J24827
$$ 3373453 3373515 3384129 3405053 3436759 3480381 3536801 3606331 3689255 3786028 3896857 4021684
59116D021684J39083J54110J69912J86169K02772K19631K36290K52308K67700
$$ 4021684 4160767 4314877 4484789 4670958 4873730 5093361 5329651 5581959 5849659
59107E849659K82241K94415L01698L01961K94148K77431K50361K11434J60655
$$ 5849659 6131900 6426315 6728013 7029974 7324122 7601553 7851914 8063348 8224003
59098H224003J00308L4118l4120j00952j62894k16663k60280k93556l17131l31505
$$ 8224003 8324311 8358429 8324309 8223357 8060463 7843800 7583520 7289964 6972833 6641328
59088F641328l37369l36218l29767l19091l05005k88936k72391k55764k38600
$$ 6641328 6303959 5967741 5637974 5318883 5013878 4724942 4452551 4196787 3958187
59079C958187k21019k03954j87866j72347j57191j43018j30438j19356j09424
$$ 3958187 3737168 3533214 3345348 3173001 3015810 2872792 2742354 2622998 2513574
59070B513574j00448r2012q3468p4816o6976o0663n5553n0886m6310m1724l6935
$$ 2513574 2413126 2321114 2237646 2162830 2095854 2035191 1979638 1928752 1882442 1840718 1803783
59059A803783l2108k8039k5275k3296k1150j8693j6644j5560j5352j5821j7074
$$ 1803783 1771675 1743636 1718361 1695065 1673915 1655222 1638578 1623018 1607666 1591845 1574771
59048A574771j9213k1897k4502k6683k8552l0209l1253l0997k9262k6666k3963
$$ 1574771 1555558 1533661 1509159 1482476 1453924 1423715 1392462 1361465 1332203 1305537 1281574
59037A281574k1358j8622j5594j2349r086o180l957k169l5K814N814Q240J0012
$$ 1281574 1260216 1241594 1226000 1213651 1204565 1198385 1194428 1192259 1192224 1195038 1200852 1209092 1219104
59024A219104J1259J1661J0917R409P648N545L058J058M07N68K56n70o07Q90L203
$$ 1219104 1230363 1242024 1252941 1262350 1269998 1275543 1278601 1279659 1280066 1280634 1280890 1280320 1279713 1280603 1283806
59009A283806N342P120Q667R905J0834J1616J2087J1815J0851R718Q612P353O103
$$ 1283806 1289148 1296268 1304935 1314840 1325674 1337290 1349377 1361192 1372043 1381761 1390373 1397726 1403829
58996A403829N266M640L656K548K246K904L594L801M110M967N891O464P137Q282
$$ 1403829 1409095 1413735 1417391 1419939 1422185 1425089 1428683 1432484 1436594 1441561 1447452 1453916 1461053 1469335
58982A469335R332R639R533R774J0505J1384J2267J3121J3726J4099J4874J6656
$$ 1469335 1478667 1488306 1497839 1507613 1518118 1529502 1541769 1554890 1568616 1582715 1597589 1614245
58970A614245J9253K1998K4553K7037K9619L2322L4955L7105L8364L8707L8418
$$ 1614245 1633498 1655496 1680049 1707086 1736705 1769027 1803982 1841087 1879451 1918158 1956576
58959A956576L7720L6788L5942L5264L4293L2838L1746L2049L3537L5263L7318
$$ 1956576 1994296 2031084 2067026 2102290 2136583 2169421 2201167 2233216 2266753 2302016 2339334
58948B339334M0722M5450N0088N3962N8242O4131P1179P8257Q5256R2748J00802
$$ 2339334 2380056 2425506 2475594 2529556 2587798 2651929 2723108 2801365 2886621 2979369 3080171
58937C080171J09135J17922J27486J37617J48023J59196J72081J87076K03905
$$ 3080171 3189306 3307228 3434714 3572331 3720354 3879550 4051631 4238707 4442612
58928D442612K22255K42157K63953K88203L15302L45124L77381M12400M50836
$$ 4442612 4664867 4907024 5170977 5459180 5774482 6119606 6496987 6909387 7360223
58919G360223M92596N36806N82966O31116O80537P29209P75019Q16315Q50483
$$ 7360223 7852819 8389625 8972591 9603707 10284244 11013453 11788472 12604787 13455270
58910A3455270Q72879Q78065Q61662Q20624P52754O57229N35450L90939K29036
$$ 13455270 14328149 15206214 16067876 16888500 17641254 18298483 18833933 19224872 19453908
58901A9453908N7249j14985k78191m24932n50264o51227p26730p77547q05682
$$ 19453908 19511157 19396172 19117981 18693049 18142785 17491558 16764828 15987281 15181599
58892A5181599q13863q05591p84677p54110p15824o71887o25029n77518n30447
$$ 15181599 14367736 13562145 12777468 12023358 11307534 10635647 10010618 9433100 8902653
58883H902653m84768m42107m03707l69427l38667l11585k88529k68957k51999
$$ 8902653 8417885 7975778 7572071 7202644 6863977 6552392 6263863 5994906 5742907
58874E742907k37423k25027k13561k01483j88488j75434j62939j50973j39506
$$ 5742907 5505484 5280457 5066896 4865413 4676925 4501491 4338552 4187579 4048073
58865D048073j28618j18054j07482r7154q7625p8927p0667o2771n5505m8851m2481
$$ 4048073 3919455 3801401 3693919 3596765 3509140 3430213 3359546 3296775 3241270 3192419 3149938
58854C149938l6265l0293k4458j8468j2195n820L04N744J0414J5065K0837K7997
$$ 3149938 3113673 3083380 3058922 3040454 3028259 3022439 3022743 3028487 3038901 3053966 3074803 3102800
58842C102800L5545M2430M8693N5020O1820O9132P6878Q4726R2227R9553J07654
$$ 3102800 3138345 3180775 3229468 3284488 3346308 3415440 3492318 3577044 3669271 3768824 3876478
58831C876478J17231J28068J39690J52125J65663J80442J96668K14687K34550
$$ 3876478 3993709 4121777 4261467 4413592 4579255 4759697 4956365 5171052 5405602
58822E405602K56210K80374L08272L40227L75304M12878M53481M97566N44394
$$ 5405602 5661812 5942186 6250458 6590685 6965989 7378867 7832348 8329914 8874308
58813H874308N92872O42432O92192P40000P82971Q18072Q41410Q48051Q33620
$$ 8874308 9467180 10109612 10801804 11541804 12324775 13142847 13984257 14832308 15665928
58804A5665928P95385P31231O38967N18366L73452K11727M1629j28578k90716
$$ 15665928 16461313 17192544 17831511 18349877 18723329 18935056 18976685 18848107 18557391
58795A8557391m37438n63287o64595p39222p87472q12501q18548q09029p86963
$$ 18557391 18119953 17556666 16892071 16152849 15365377 14552876 13734328 12925299 12138336
58786A2138336p56038p19700o79762o37265n94092n52338n12526m73968m36641
$$ 12138336 11382298 10662598 9982836 9345571 8751479 8199141 7686615 7212647 6776006
58777F776006m01361l68451l37658l09326k84336k62828k44029k27330k12479
$$ 6776006 6374645 6006194 5668536 5359210 5074874 4812046 4568017 4340687 4128208
58768D128208j98890j85787j73068j61131j49953j39192j28953j19573j10816
$$ 4128208 3929318 3743531 3570463 3409332 3259379 3120187 2991234 2871661 2760845
58759B760845j02120r3363q4697p6055o7619o0162n4016m8330m2383l6927l2938
$$ 2760845 2658725 2565362 2480665 2404610 2336991 2276829 2222813 2174483 2132100 2095173 2062235
58748B062235k9857k6527k3321k1525k0908j9695j7106j4236j2139j0480q642
$$ 2062235 2032378 2005851 1982530 1961005 1940097 1920402 1903296 1889060 1876921 1866441 1857799
58737A857799o929o063o249p165q236q822q719q499q813r657j0898j3004j6343
$$ 1857799 1850870 1844807 1838558 1831393 1823157 1814335 1805616 1797117 1788304 1778647 1767749 1754745 1738402
58724A738402k0209k3606k6674l0209l4025l7037l8840m0019m0909m1102m0243
$$ 1738402 1718193 1694587 1667913 1637704 1603679 1566642 1527802 1487783 1446874 1405772 1365529
58713A365529l8428l5876l2964l0379k8380k6320k3741k1406k0160j9330j7710
$$ 1365529 1327101 1291225 1258261 1227882 1199502 1173182 1149441 1128035 1107875 1088545 1070835
58702A070835j5575j4253j3840j3082j1450r871r161q998q764q226p310o093n126
$$ 1070835 1055260 1041007 1027167 1014085 1002635 992764 983603 974605 965841 957615 950305 944212 939086
58689I39086m790m546l782l093l474m588n295n639o717q542r701r362q220p089
$$ 939086 934296 929750 925968 922875 919401 914813 909518 903879 897162 888620 878919 869557 861337 854248
58675H54248n930m580l229j847k33J100J184j5j473k413k728k142l07K073L448
$$ 854248 848318 843738 840509 838662 838429 839529 840713 840698 839225 836812 834084 831942 831635 833708 837156
58660H37156L143J865M84p21j578j906k002k191j956n67J572L411M869O664Q712
$$ 837156 840299 842164 842648 841927 840349 838443 836441 834250 832294 831727 833299 836710 841579 848243 856955
58645H56955J0257J1423J3041J4862J5693J5543J5896J7524J9650K1757K4522
$$ 856955 867212 878635 891676 906538 922231 937774 953670 971194 990844 1012601 1037123
58634A037123K8287L2076L4970L7287L9757M2612M6105N0790N6712O3314P0572
$$ 1037123 1065410 1097486 1132456 1169743 1209500 1252112 1298217 1349007 1405719 1469033 1539605
58623A539605P9241Q9592J00946J12925J26103J41104J57898J76311J96181K16672
$$ 1539605 1618846 1708438 1809384 1922309 2048412 2189516 2347414 2523725 2719906 2936578
58613B936578K36291K53686K67569K75890K76236K67041K47410K16132J72486
$$ 2936578 3172869 3426555 3694124 3970014 4246250 4513291 4760701 4976833 5149319
58604E149319J18210N7365n709o6954j21712j65731j97784k19627k32902k37702
$$ 5149319 5267529 5324894 5319185 5252231 5130519 4964788 4767004 4547377 4314475 4076773
58594D076773k34582k26001k14665k01764j87622j72800j57806j42837j28440
$$ 4076773 3842191 3616190 3401525 3199761 3012139 2839339 2681533 2538696 2410256
58585B410256j15361j03325r1185p8629o6631n5947m6511l8490l2509k8468k5608
$$ 2410256 2294895 2191570 2100385 2021756 1955125 1899178 1852667 1814177 1781668 1753200 1727592
58574A727592k3992k4382k6439k8732l0829l3581l6887l9078l9152l7815l5789
$$ 1727592 1703600 1679218 1652779 1624047 1593218 1559637 1522750 1483672 1444520 1406705 1370916
58563A370916l2933k9702k7481k6495k5278k3188k1612k1500k1515k0024j7360
$$ 1370916 1337983 1308281 1280800 1254305 1229027 1205839 1184227 1162727 1141212 1121188 1103828
58552A103828j4716j2244r592p252n891n286m978n167o026p067p966r055j0355
$$ 1103828 1089112 1076868 1067276 1060024 1054133 1048847 1043869 1038702 1032676 1025609 1017643 1008588 998233
58539I98233j1131j1135j1194j1927j2882j3438j3479j2851j1354r619q721q629
$$ 998233 987102 975967 964773 952846 939964 926526 913047 900196 888842 879223 870502 861873
58527H61873q404q097q681j0025j0808j0789j1191j2297j2826j2261j1645j1374
$$ 861873 853469 845372 836691 826666 815858 805069 793878 781581 768755 756494 744849 733475
58515G33475j0485q889q013q136p528n350l146k146j455k95L40q5j13J231K576
$$ 733475 722990 714101 706088 697952 690424 685074 681928 679782 678327 678032 678372 678287 678174 679405 681981
58500F81981K672K618L609M535M069L281L837N079N285M589M381M897N462O118
$$ 681981 684653 687271 690880 695415 699484 702765 706602 711681 716966 721555 725936 730833 736295 742413
58486G42413P111P688P093N973N220M419K929J314K80o47k006l177l727m551o270
$$ 742413 749524 757212 764305 770278 775498 779917 782846 784160 784440 783793 781787 778610 774883 770332 764062
58471G64062p869q398q560r128r399q779q272q640q710p365n670n089n054m284
$$ 764062 756193 747795 739235 730107 720708 711929 703657 695017 686307 678942 673272 668183 663129 658845
58457F58845l204k975l380l523l502l707l659l116k947l411l195j692l93l17r7
$$ 658845 655641 652666 649286 645763 642261 638554 634895 631779 628832 625421 622226 620534 620141 619824 619727
58442F19727J385K675K344J782K744M108L997L358M298O207O772N856N267N401
$$ 619727 621112 623787 626131 627913 630657 634765 638762 642120 646418 652625 659397 665253 670520 675921
58428F75921N070M144L730L996M205M373M861M971L896K390J528Q83k18r56n87
$$ 675921 680991 685135 688865 692861 697066 701439 706300 711271 715167 717557 719085 719968 719750 718794 718207
58413G18207l41j477k836k758j934j865j937q44N48O33K10J043K461K446J189
$$ 718207 717866 716389 713553 710795 708861 706996 705059 704215 704763 705396 705606 706649 709110 711556 712745
58398G12745N26N97J01p95q03j80j49k44Q86K694L567L805M915O517O928O295
$$ 712745 713271 713868 713969 713174 712371 712191 712042 711798 712684 715378 718945 722750 727665 734182 741110 747405
58382G47405O291P117P555P517P863Q111P069N332M589M871M908M603M726N017
$$ 747405 753696 760813 768368 775885 783748 791859 798928 804260 808849 813720 818628 823231 827957 832974
58368H32974M989N624P664R396Q906P302O823P022N999M118L079K450P49j046
$$ 832974 837963 843587 851251 860647 869553 876855 883678 890700 896699 900817 903896 906346 907095 906049
58354I06049p99P89J296R22J924M124M951L784K581K253J897J505K126L377L929
$$ 906049 905250 906039 907335 908257 910181 914305 919256 923040 925621 927874 929771 931276 933402 936779 940708
58339I40708M115N057N877M992L492L794N661O964P580Q906J0456J0676J0359
$$ 940708 944823 949880 955757 960749 964241 968035 973696 980660 988240 997146 1007602 1018278 1028637
58326A028637J1328J2698J2322J1038J1262J2326J1683R839R438J0196R585Q008
$$ 1028637 1039965 1052663 1064985 1076023 1087285 1099611 1111294 1121133 1130571 1140767 1150352 1158360
58314A158360Q228J0012J0415R339R615J1461J1881J0100Q726Q941R158Q871R394
$$ 1158360 1166588 1176600 1187015 1196354 1205969 1217430 1229311 1239411 1248137 1257078 1266236 1275107 1284501
58301A284501J0461J0451J0086J1452J3609J3821J2818J3782J6442J7515J6842
$$ 1284501 1294962 1305413 1315499 1326951 1340560 1354381 1367199 1380981 1397423 1414938 1431780
58290A431780J7490J9684K0335J9041J8810K0375K1298K1247K2554K5031K5827
$$ 1431780 1449270 1468954 1489289 1508330 1527140 1547515 1568813 1590060 1612614 1637645 1663472
58279A663472K4976K5529K7785K9002K9119L0810L3645L4378L3317L4142L6968
$$ 1663472 1688448 1713977 1741762 1770764 1799883 1830693 1864338 1898716 1932033 1966175 2003143
58268B003143L8139L7275L7859M0288M1279M0767M2362M6228M8594M9048N1121
$$ 2003143 2041282 2078557 2116416 2156704 2197983 2238750 2281112 2327340 2375934 2424982 2476103
58257B476103N4938N6808N6833N9201O4156O7499O8755P1751P6498P9055Q0039
$$ 2476103 2531041 2587849 2644682 2703883 2768039 2835538 2904293 2976044 3052542 3131597 3211636
58246C211636Q4245R1204R5495R7218J02111J10363J15956J18365J23935J33825
$$ 3211636 3295881 3387085 3482580 3579798 3681909 3792272 3908228 4026593 4150528 4284353
58236D284353J42044J47455J56031J68710J79122J86151J96452K11603K25272
$$ 4284353 4426397 4573852 4729883 4898593 5077715 5263866 5460318 5671921 5897193
58227E897193K36280K51320K71505K89856L05654L27079L55981L84781M12227
$$ 5897193 6133473 6384793 6656298 6946154 7251808 7578887 7934868 8319649 8731876
58218H731876M46610M89403N32285N74783O27330O92303P60571Q31725R17850
$$ 8731876 9178486 9667889 10200174 10774957 11402287 12094590 12855161 13686886 14604736
58209A4604736J022355J136689J263637J420631J614185J836827K096183K419657
$$ 14604736 15627091 16763780 18027417 19448048 21062233 22899060 24995243 27414900
58201B7414900K824055L312544L910091M667684N623627O800383Q248304J0047277
$$ 27414900 30238955 33551499 37461590 42129274 47752901 54553284 62801588 72848865
58193G2848865J2258563J4932382J8171194K2115216K6853765L2399021L8593705
$$ 72848865 85107428 100039810 118211004 140326220 167179985 199579006 238172711
58186B38172711M4616807M8341716M6621447L7097358K0333383J64068j8349900
$$ 238172711 282789518 331131234 377752681 414850039 435183422 435347490 416997590
58179D16997590l1617291l8706056m0655227l9166281l5786613l1661458k7499766
$$ 416997590 385380299 346674243 306019016 266852735 231066122 199404664 171904898
58172A71904898k3633905k0176323j7157018j4555994j2310745j0366543q703667
$$ 171904898 148270993 128094670 110937652 96381658 84070913 73704370 65000703
58165F5000703p300047o106493n078883m197634l436802k749508k100629j479365
$$ 65000703 57700656 51594163 46515280 42317646 38880844 36131336 34030707 32551342
58157C2551342q65803k21052M78785J237671K063500K911057L552421L586727
$$ 32551342 31685539 31464487 31943272 33180943 35244443 38155500 41707921 45294648
58149D5294648K708357J010460j008068k754769l872575m329408m294162l976075
$$ 45294648 48003005 49013465 48005397 45250628 41378053 37048645 32754483 28778408
58141B8778408l536885l074407k639000k253402j923072j641752j400491j194685
$$ 28778408 25241523 22167116 19528116 17274714 15351642 13709890 12309399 11114714
58133A1114714j021109q73147p44698o35419n46564m75108m16828l71005l36799
$$ 11114714 10093605 9220458 8475760 7840341 7293777 6818669 6401841 6030836 5694037
58124E694037l09253k84339k63813k49684k38001k23576k06847j90724j74557
$$ 5694037 5384784 5100445 4836632 4586948 4348947 4125371 3918524 3727800 3553243
58115C553243j56649j39062j24532j11778r8797q7667q1495p9635p9904q2124
$$ 3553243 3396594 3257532 3133000 3021222 2922425 2834758 2753263 2673628 2593724 2511600
58105B511600q5528q6462q2954p8119p5047p1975o6444o0362n6538n3719m9609
$$ 2511600 2426072 2339610 2256656 2178537 2103490 2031515 1965071 1904709 1848171 1794452 1744843
58094A744843m5475m3407m1975l8993l5726l4269l3375l0929k7959k6479k5777
$$ 1744843 1699368 1655961 1613986 1574993 1539267 1504998 1471623 1440694 1412735 1386256 1360479
58083A360479k4435k3506k4250k5213k4843k4420k5233k5576k3832k1715k1165
$$ 1360479 1336044 1312538 1288288 1263075 1238232 1213812 1188579 1163003 1139171 1117456 1096291
58072A096291k0740j8531j5963j5172j5143j3917j2298j1911j1850j0573r046
$$ 1096291 1075551 1057020 1041057 1025885 1010742 996825 984527 972616 960766 950193 941147
58061I41147q699q395o649m804m929o397p500q531j0369j2012j2276j2014j2102
$$ 941147 932448 924053 917404 912600 907671 901274 893774 885243 874874 862862 850586 838572 826470
58048H26470j1372r160p484p894q528p225n200m547m436l047j250q83j267o86
$$ 826470 815098 805938 798454 790560 782032 774807 769607 765060 760624 757577 756327 755444 754177 753491
58034G53491L92O94J053K661M093L305J252L38N57K36n32l05Q23J573J829K157
$$ 753491 753883 754577 755630 758291 762384 765689 766941 767279 767836 768072 767540 767235 768058 769631 771460 773617
58018G73617K016P99m33o07o65j699k515j648l72r75l290n435o856q040q493p632
$$ 773617 775633 776432 775999 775392 774727 773028 770513 768865 768493 767518 764228 758793 751937 743897 735404 727772
58002G27772o583o589o670n383l653l298l775l207j611m96j2P84J443O02j521
$$ 727772 721189 714600 707930 702547 698894 695596 691821 688614 687003 686507 686495 687279 688722 689324 687803
57987F87803l362m348m979n191m582l704l225k614j353m30p36j108j1J897K978
$$ 687803 684441 680093 675114 669923 665341 661637 658412 655798 654445 654015 653279 652171 652160 654057 657035
57972F57035L251L668L856K883J314K84n57k028l328l308k765l210m161m118l361
$$ 657035 660286 663954 667810 670693 672007 672291 671734 669706 666378 663070 660305 657095 652934 648816 645455
57957F45455l365m090m285l954m188m980n415n477n679n461m017k074q60rJ357
$$ 645455 642090 638000 633715 629761 625573 620593 615178 609701 604022 598561 594544 592470 591610 591601 592958
57942E92958K488K157J216J465K549K446O46j525l331n068o437o746o570p107
$$ 592958 595446 597603 598819 600284 602833 605279 605925 604400 601069 596001 589564 582818 576248 569141
57928E69141q159q662q765r286r661q684o856n731n265m120k352j411j544j401
$$ 569141 560982 552320 543555 534269 524608 515924 509068 503337 498072 493952 491600 490189 488645 487244
57914D87244k82J288L107N385P400Q095P944Q323R208R443Q979Q726Q475P201
$$ 487244 486962 488250 491357 496742 504142 512237 520181 528504 537712 547155 556134 564860 573335 580536
57900E80536N377M625N062N180M459L899L729K811P55j346k780m091n628o868
$$ 580536 585913 590538 595600 600780 605239 609138 612867 615678 616433 615087 612307 608216 602588 595720
57886E95720p563q056q298p897p198o854o522n444m092l563l620l123k101j546
$$ 595720 588157 580101 571803 563906 556708 549854 543332 537888 533796 530233 526613 523490 521389 519843
57872E19843j355n02R05J747K047K940M516N674O197O867P531P126N790M900M746
$$ 519843 518488 517986 518891 520638 522685 525625 530141 535815 542012 548879 556410 563536 569326 574226 578972
57857E78972M200K876J641P54m77j931k590k474k664l207l074k383k378k979k742
$$ 578972 583172 586048 587689 588443 587966 586035 583445 580971 578307 575100 572026 569643 567265 564286 561544
57842E61544j694j697l248m392l822k749k560k764k547k402k849l241l151l371
$$ 561544 559850 558153 554905 550513 546691 543942 541382 538618 536071 533669 530820 527579 524428 521057
57828E21057m375n298n556o010p310q599q954q841q941q906q358p876p839p476
$$ 521057 516682 511384 505828 499818 492508 483909 474955 466114 457173 448267 439909 432033 424194 416718
57814D16718o246n008m649m641m086l271k913k770k108j025j97K34O49J287K122
$$ 416718 410472 405464 400815 396174 392088 388817 385904 383134 381026 380001 379804 380038 380687 381974 384096
57799C84096L048L783M150M608N848P713R352J0397J1004J0768Q991O241M205
$$ 384096 387144 390927 395077 399685 405533 413246 422598 432995 443999 454767 463758 469999 474204
57786D74204L550L223K345J401J002P57Q9r38k187l718n111n658n604n961o702
$$ 474204 477754 480977 483322 484723 485725 486482 486571 485633 483446 479728 474617 468959 463355 457394 450692
57771D50692o611n352m177l897l721k911k120k121k470k367j756p94O59K262L084
$$ 450692 444081 438729 434552 430655 426934 424023 421903 419782 417312 414945 413189 412395 413054 415316 418400
57756D18400L021L112L885M611M879N362O178O090M429K405J319Q35J77k80N6
$$ 418400 421421 424533 428418 433029 437908 443270 449448 455538 459967 462372 463691 464526 464703 464423 464479
57741D64479O17O43N01P62R30M77J82J060K647L719M083M430N006N598O270P013
$$ 464479 465096 465739 466240 467002 467932 468409 468591 469651 472298 476017 480100 484530 489536 495134 501404 508417
57725E08417P214O598O110O823Q446R952J1029J1991J2760J3081J3262J3763J4453
$$ 508417 515631 522229 528339 535162 543608 553560 564589 576580 589340 602421 615683 629446 643899
57712F43899J5097J6053J7591J9132K0093K1006K2735K5079K7167K8918L1129
$$ 643899 658996 675049 692640 711772 731865 752871 775606 800685 827852 856770 887899
57701H87899L4309L8290M2806M7809N3309N9438O6458P4399Q3127R2990J04752
$$ 887899 922208 960498 1003304 1051113 1104422 1163860 1230318 1304717 1387844 1480834 1585586
57690A585586J18583J33774J49856J67144J85790K05098K24162K42142K57349
$$ 1585586 1704169 1837943 1987799 2154943 2340733 2545831 2769993 3012135 3269484
57681C269484K67102K69126K62207K45137K16560J76901J29482P8866K9148j5526
$$ 3269484 3536586 3805712 4067919 4313056 4529616 4706517 4835999 4914865 4944013 4928487
57671D928487n0511p2473q0879p6969o3103m5037l3475m0025o9953j18635j74063
$$ 4928487 4877976 4805503 4724624 4647655 4584552 4539515 4506040 4466015 4396062 4277427 4103364
57660D103364k22229k52539k61768k54231k37273k16089j92734j68532j45312
$$ 4103364 3881135 3628596 3366828 3112597 2875324 2659235 2466501 2297969 2152657
57651B152657j24349j05741q9236p4757o2065n0777m0758l1849k3474j5190p276
$$ 2152657 2028308 1922567 1833331 1758574 1696509 1645732 1604974 1573125 1549651 1534461 1527185
57640A527185jP153J4749K2399K9616L7081M5926N6078O6567P7256Q9102J02684
$$ 1527185 1527184 1534337 1549086 1571485 1601101 1638182 1684108 1740186 1806753 1884009 1973111 2075795
57628B075795J17497J32810J48296J63832J79281J94330K07848K17551K20999
$$ 2075795 2193292 2326102 2474398 2638230 2817511 3011841 3219689 3437240 3658239
57619C658239K16726K03883J81360J48262J05261N4933J029n2215j00790j41967
$$ 3658239 3874965 4078848 4260208 4408470 4513731 4568664 4569693 4517478 4416688 4274721
57609D274721j74554j97955k11740k16671k15075k09238k00069j88185j75157
$$ 4274721 4100167 3902212 3690472 3473801 3258726 3049488 2849419 2661234 2486077
57600B486077j62496j50214j37710j25383j14022j03331r2691q2791p4892o8779
$$ 2486077 2323581 2173367 2035657 1910274 1796252 1692921 1600230 1517439 1442547 1373768
57590A373768o3002n6949n1202m6064m1234l6915l3690l1239k8524k5355k2491
$$ 1373768 1310766 1253817 1202615 1156551 1115317 1078402 1044712 1013473 984949 959594 937103
57579I37103k0210j8114j6380j5727j5908j5516j3766j1388r444q153p160o088
$$ 937103 916893 898779 882399 866672 850764 835248 821482 810094 800650 792497 785337 779249
57567G79249m631k798j162j42P61K204L797M713N230O435Q443J0240J1256J1917
$$ 779249 774618 771820 770658 770516 771277 773481 777278 781991 787221 793656 802099 812339 823595 835512
57553H35512J2553J3024J3594J4873J6729J8413K0014K2585K6467L0641L4228
$$ 835512 848065 861089 874683 889556 906285 924698 944712 967297 993764 1024405 1058633
57542A058633L7636M1794M7117N3618O1205O9447P7745Q6082R5039J05016J15986
$$ 1058633 1096269 1138063 1185180 1238798 1300003 1369450 1447195 1533277 1628316 1733332 1849318
57531A849318J27968J40860J53816J65484J74788J80676J81338J74740J59985
$$ 1849318 1977286 2118146 2271962 2437446 2612234 2792910 2974248 3148988 3308973
57522C308973J37287J06950O9641K7666j5429n6676r4120j25648j49012j63486
$$ 3308973 3446260 3553210 3622851 3650517 3635088 3578412 3484292 3358644 3209632 3046146
57512C046146j70308j71059j66733j58581j48474j37735j26540j14951j03621
$$ 3046146 2875838 2704779 2538046 2379465 2230991 2093256 1966716 1851765 1748144
57503A748144r3044q3098p3729o5243n7597n0265m3154l6736l1059k5555k0037
$$ 1748144 1655100 1572002 1498273 1433030 1375433 1325168 1282014 1245278 1214219 1188664 1168627
57492A168627j4947j0422o135k209Q44L318O306J0165J4150J7882K1998K6931
$$ 1168627 1153680 1143258 1137123 1134914 1135758 1139076 1145382 1155547 1169697 1187579 1209577 1236508
57480A236508L2296L7891M4173N1189N8289O5494P3937Q4326R5961J07893J19962
$$ 1236508 1268804 1306695 1350868 1402057 1460346 1525840 1599777 1684103 1780064 1887957 2007919
57469B007919J32107J43686J54056J62747J68401J68604J61451J46361J23063
$$ 2007919 2140026 2283712 2437768 2600515 2768916 2937520 3098971 3245332 3368395
57460C368395R1236N2027Q750l4813p5873j11964j40432j59894j71272j76372
$$ 3368395 3459631 3511658 3520408 3485595 3409722 3297758 3157326 2997432 2826160 2649788
57450B649788j76248j71682j64046j54461j43089j30327j17802j06999r7723q8943
$$ 2649788 2473540 2301858 2137812 1983351 1840262 1709935 1592133 1485134 1387411 1298468
57440A298468q0400p2396o4849n7781n1895m7542m3794l9693l5652l2487k9849
$$ 1298468 1218068 1145672 1080823 1023042 971147 923605 879811 840118 804466 771979 742130
57429G42130k6933k3999k1796k0079j8135j6283j5378j5123j4338j2755j1197
$$ 742130 715197 691198 669402 649323 631188 614905 599527 584404 570066 557311 546114
57418E46114j0119r209q401q004p818p208o203n429n003m416l595l078l029k990
$$ 546114 535995 526786 518385 510381 502563 495355 489152 483723 478720 474304 470709 467631 464602 461612
57404D61612k713k420k192j842j495j483j578j159k65K64l0n66n21J35P01N65
$$ 461612 458899 456479 454287 452445 450950 449467 447889 446730 446465 446729 446699 446133 445612 445747 446448 447013
57388D47013j96q53o96K33J238J820K031J908J221J85l55K4O17N83M9m04p07j015
$$ 447013 446817 445964 445268 445501 446739 448559 450590 452498 453719 453904 453549 453573 454190 454773 454822 454418 453711 452696
57370D52696j039n57o5m9p8M16J054J186J187J809K625K465J299M00M91R89J165
$$ 452696 451657 451100 451035 450986 450908 451324 452378 453564 454751 456560 459185 461650 462949 463349 463840 464829 465994
57353D65994J081J011R92J222K016L013L258K523J801K019K825L182K732K085
$$ 465994 467075 468086 469078 470300 472316 475329 478587 481110 482911 484930 487755 490937 493669 495754
57339D95754J935K315K762L018L321L823L997L227J940J408K048K885L125L338
$$ 495754 497689 500004 502766 505784 509105 512928 516925 520152 522092 523500 525548 528433 531558 534896
57325E34896M217N111M971M057L478L490L565L816M833O250O936O765O830P633
$$ 534896 539113 544224 549195 553252 556730 560220 563785 567601 572434 578684 585620 592385 599215 606848
57311F06848Q385Q467Q397Q758R299R660J0105J0885J1660J2135J2643J3520J4452
$$ 606848 615233 623700 632097 640855 650154 659814 669919 680804 692464 704599 717242 730762 745214
57298G45214J5064J5620J6626J8049J9447K0631K1784K3137K4784K6687K8767
$$ 745214 760278 775898 792524 810573 830020 850651 872435 895572 920356 947043 975810
57287I75810L1075L3728L6473L8554L9493L9799M0233M0597L9948L7915L4941
$$ 975810 1006885 1040613 1077086 1115640 1155133 1194932 1235165 1275762 1315710 1353625 1388566
57276A388566L1167K5986J9070J1058K890n028j2566j9334k4834k8863l1469l2760
$$ 1388566 1419733 1445719 1464789 1475847 1478737 1473709 1461143 1441809 1416975 1388112 1356643 1323883
57264A323883l2889l2031l0267k7824k5275k3166k1363j9258j6545j3523j0723
$$ 1323883 1290994 1258963 1228696 1200872 1175597 1152431 1131068 1111810 1095265 1081742 1071019
57253A071019q599p420o916o184m537k338m68Q57K136L569M767N499N985O430
$$ 1071019 1062420 1055000 1048084 1041900 1037363 1035025 1034557 1035414 1037550 1041119 1045886 1051385 1057370 1063800
57239A063800O844P349Q133R026R693J0202J0800J1390J1733J2031J2550J2922
$$ 1063800 1070644 1077993 1086126 1095152 1104845 1115047 1125847 1137237 1148970 1161001 1173551 1186473
57227A186473J2657J2153J2320J3220J4029J4340J4539J4900J5255J5669J6490
$$ 1186473 1199130 1211283 1223603 1236823 1250852 1265192 1279731 1294631 1309886 1325555 1342045
57216A342045J7598J8418J8855J9368K0042K0464K0587K0827K1298K1812K2634
$$ 1342045 1359643 1378061 1396916 1416284 1436326 1456790 1477377 1498204 1519502 1541314 1563948
57205A563948K4234K6220K7640K8386K9198L0186L0617L0333L0090L0198L0136
$$ 1563948 1588182 1614402 1642042 1670428 1699626 1729812 1760429 1790762 1820852 1851050 1881186
57194A881186K9857L0093L0918L1349L0962L0584L0757L0912L0679L0733L1398
$$ 1881186 1911043 1941136 1972054 2003403 2034365 2064949 2095706 2126618 2157297 2188030 2219428
57183B219428L1775L1313L1048L2206L4523L6997L9352M1717M3756M5195M6434
$$ 2219428 2251203 2282516 2313564 2345770 2380293 2417290 2456642 2498359 2542115 2587310 2633744
57172B633744M7722M8460M8278M7885M7855M7496M6024M4054M2741M2175M1760
$$ 2633744 2681466 2729926 2778204 2826089 2873944 2921440 2967464 3011518 3054259 3096434 3138194
57161C138194M1482M1647M1978M2196M2937M4867M7399M9351N0546N1688N3113
$$ 3138194 3179676 3221323 3263301 3305497 3348434 3393301 3440700 3490051 3540597 3592285 3645398
57150C645398N4581N5873N6693N6521N5467N4632N4746N5097N4703N3628N2217
$$ 3645398 3699979 3755852 3812545 3869066 3924533 3979165 4033911 4089008 4143711 4197339 4249556
57139D249556N0083M7197M4951M4599M5389M5840M6114M7429M9777N2169N4647
$$ 4249556 4299639 4346836 4391787 4436386 4481775 4527615 4573729 4621158 4670935 4723104 4777751
57128D777751N8244O3187O8889P5434Q3188R1252R8225J04357J11001J17849J22844
$$ 4777751 4835995 4899182 4968071 5043505 5126693 5217945 5316170 5420527 5531528 5649377 5772221
57117E772221J25156J26376J28436J32221J38709J49722J66605J89378K17557
$$ 5772221 5897377 6023753 6152189 6284410 6423119 6572841 6739446 6928824 7146381
57108G146381K50772K88595L31181L80125M37423N04016N81318O74052P89672
$$ 7146381 7397153 7685748 8016929 8397054 8834477 9338493 9919811 10593863 11383535
57099A1383535R35320J117630J344978J626583J968446K372355K838400L364658
$$ 11383535 12318855 13436485 14781463 16408046 18376492 20748847 23587247 26951905
57091B6951905L943251M559555N195326N828209O427513O956140P379527P668441
$$ 26951905 30895156 35454711 40650037 46478246 52905759 59861899 67241426 74909867
57083G4909867P792014P717036P420418O894136O127321N090865L760683K166997
$$ 74909867 82701881 90418917 97839335 104733471 110860792 115951657 119712340 121879337
57075A21879337M14437j352949l005014m449566n626708o504272p084269p401983
$$ 121879337 122293774 120940825 117935811 113486245 107859537 101355265 94270996 86869013
57067H6869013p507440p443940p240545o917734o495452n997609n452468m889273
$$ 86869013 79361573 71917633 64677088 57759354 51263902 45266293 39813825 34924552
57059C4924552m333496l804649l317165k880917k500178k173588j896261j661426
$$ 34924552 30591056 26786407 23469242 20588325 18088147 15914559 14018298 12356872
57051A2356872j460583j284690j127193r85576q59357p47510o48484n61609m86882
$$ 12356872 10896289 9611599 8484406 7498830 6639473 5891963 5243479 4681870 4194988
57042D194988m23563l69903l24192k85328k52444k24579k00829j80380j62453
$$ 4194988 3771425 3401522 3077330 2792002 2539558 2314979 2114150 1933770 1771317
57033A771317j46474j32241j19699j08631r8766q9990q2239p5314o9009o3194
$$ 1771317 1624843 1492602 1372903 1264272 1165506 1075516 993277 917963 848954 785760
57023G85760n7651n2124m6701m1825l7655l3818l0034k6561k3645k0955j8134
$$ 785760 728109 675985 629284 587459 549804 515986 485952 459391 435746 414791 396657
57012C96657j5479j3359j1156p684k618L387J0118J8379K8889M1594N6649P5201
$$ 396657 381178 367819 356663 348979 346361 349748 359866 378245 407134 448728 505377 580578
57000E80578R8410J26809J61533K03868K49138K79982K70596K04429R0748l7379
$$ 580578 678988 805797 967330 1171198 1420336 1700318 1970914 2175343 2266091 2228712
56990B228712j43463k07788k31454k26607k05848j78212j49320j22049r7689p7779
$$ 2228712 2085249 1877461 1646007 1419400 1213552 1035340 886020 763971 666282 588503
56980E88503o4413n8385n7762n9085n9584n8000n4106m8403m1926l5545B1833
$$ 588503 524090 465705 407943 348858 289274 231274 177168 128765 86839 51294 21833
56968a717j7885j2509p233k186K056N379Q749a2264E781K2794K7501L3062L9021
$$ -1717 -19602 -32111 -39344 -41530 -39474 -34095 -25346 -12264 5781 28575 56076 89138 128159
56955A28159M2784M1240L2863J8582J510j4101k4820k9856l0779k9488k6819k3043
$$ 128159 170943 212183 245046 263628 265138 251037 226217 196361 165582 136094 109275 86232
56943H6232j8698j4401j0384o632l171R6L505P357J1839J7282K3995L1673L9388
$$ 86232 67534 53133 42749 36117 32946 33042 36547 43904 55743 73025 97020 128693 168081
56930A68081M6116N0562N0299M2321K5635L377j8395l4348m2656m4830m3530m0515
$$ 168081 214197 264759 315058 357379 383014 386391 367996 333648 290992 246162 202632 162117
56918A62117l6279l1098k5872k1576j8247A3926B143f502o219m573l627l266l032
$$ 162117 125838 94740 68868 47292 29045 13926 2143 -6502 -12721 -17294 -20921 -24187 -27219
56905b7219k242p23J061K775M558O451g186B403J1144J2920J4519J5810J7379
$$ -27219 -29461 -30184 -29123 -26348 -21790 -15339 -7186 2403 13547 26467 40986 56796 74175
56892G4175J9821K3067K6688L0351L3757L6794L9806M2877M4435M1670L3035J9776
$$ 74175 93996 117063 143751 174102 207859 244653 284459 327336 371771 413441 446476 466252
56880D66252M675r822k1736k9394l2462l2521l1348k9089k5018j9475j3813q748
$$ 466252 470927 461105 439369 409975 377513 344992 313644 284555 259537 240062 226249 217501
56868B17501l942J020O329J2543K0359K9645L9583M9830O0762P2124Q1544Q4409
$$ 217501 213559 214579 220908 233451 253810 283455 323038 372868 433630 505754 587298 671707
56856F71707P5647N3208K0991j2283l8439n4424o1636o2281n7816n0025m1156
$$ 671707 747354 800562 821553 809270 770831 716407 654771 592490 534674 484649 443493
56845D43493l2431k3646j4521n329L987J4103K5368L7471N0354O4615Q0810R8961
$$ 443493 411062 387416 372895 367566 371553 385656 411024 448495 498849 563464 644274 743235
56833G43235J18153J34904J41846J30279R6367M5210j1269o0479r4358j11187
$$ 743235 861388 996292 1138138 1268417 1364784 1409994 1398725 1338246 1243888 1132701
56823A132701j14275j08734r8543q5988p2882o0818m9982l8987k6757j3910j669
$$ 1132701 1018426 909692 811149 725161 652279 591461 541479 502492 475735 461825 460156
56812D60156R812K1448L4096M8152O3691P9894R4067J01372R6132P4586L8135
$$ 460156 469968 491416 525512 573664 637355 717249 811316 912688 1008820 1083406 1121541
56801A121541n538m5652p4095q8792r2357q8641q0896p1584o2279n3388m4580
$$ 1121541 1116003 1070351 996256 907464 815107 726466 645570 573986 511707 458319 413739
56790D13739l5630k6721j8187j0248k814M589J2487K0983K9828L8718M6766N1632
$$ 413739 378109 351388 333201 322953 320139 324728 337215 358198 388026 426744 473510 525142
56778E25142M9995L9676K1485q95k2543l9256m9078n2651n2001m8921m4523l9697
$$ 525142 575137 614813 636298 635403 612860 573604 524526 471875 419874 370953 326430 286733
56766B86733l5043l0489k5802k1430j8020j5338j2667j0173q613p760o495m760
$$ 286733 251690 221201 195399 173969 155949 140611 127944 117771 109158 101398 94903 90143
56754I0143l846m173m337l228j783j406j836j885j470j478k004k110j271j02M98
$$ 90143 86297 82124 77787 74559 72776 71370 69534 67649 66179 64701 62697 60587 59316 59214 59712
56739E9712K49m26q82r10j077k011l217l413k345j279j190j472j238q33r99j351
$$ 59712 59961 59535 58653 57743 56666 54655 51438 48025 45680 44401 43211 41739 40501 39668 38669 37318
56723C7318j012k43j03p48j282j165p43l76J1M56Q66J344J938K170J580N69o9
$$ 37318 36306 36063 35960 35212 33930 32765 32022 31646 31657 32113 32979 34323 36261 38431 40011 40580 40511
56706D0511k63n74j025r94k52O87J294J453J172N59J35M30J206J772J995K295
$$ 40511 40248 39674 38649 37655 37403 38090 39384 40837 42009 42568 42703 43133 44339 46111 48106 50401
56690E0401K607K319J423Q79J344K184K332J680J087J246J945K432K233J603J221
$$ 50401 53008 55327 56750 57629 58973 61157 63489 65169 66256 67502 69447 71879 74112 75715 76936
56675G6936J379J617J327N55j19l66l32j09M38J166J441Q57j74q96j098j176j443
$$ 76936 78315 79932 81259 81814 81695 81329 80997 80888 81326 82492 83933 84790 84616 83720 82622 81446 80003
56658H0003j814k193k701l248l301k588j744j678k361k953l160l569m318m489
$$ 80003 78189 75996 73295 70047 66746 64158 62414 60736 58375 55422 52262 48693 44375 39886
56644C9886l527k369k146k446k124j341j286k047k330j517n50l25n15n30n18o78
$$ 39886 36359 33990 31844 29398 27274 25933 24647 22600 20270 18753 18203 17878 17363 16833 16315 15637
56628A5637o47k12J60J81K27N09O65O50J071J998K534K237J908K152K266J554
$$ 15637 14990 14778 14938 15119 15346 15855 16520 17170 18241 20239 22773 25010 26918 29070 31336 32890
56612C2890O59M40N25K34N8P69J791J990J608J805K573K675J643M77J42N57J280
$$ 32890 33549 33989 34514 34748 34806 35575 37366 39356 40964 42769 45342 48017 49660 50137 50279 50836 52116
56595E2116K103K696K576J757Q45K60m2r2K44Q65J388J643J756J800J788J886
$$ 52116 54219 56915 59491 61248 62093 62353 62311 62219 62463 63328 64716 66359 68115 69915 71703 73589
56579G3589K249K733L103L358L575L716L861M222M686M871M913N541O993Q592
$$ 73589 75838 78571 81674 85032 88607 92323 96184 100406 105092 109963 114876 120417 127410 136002
56565A36002R833J1063J2507J3594J3939J4172J4897J5676J5956J6061J6262J5807
$$ 136002 145835 156898 169405 182999 196938 211110 226007 241683 257639 273700 289962 305769
56553C05769J4128J2205J1327J1097J0126Q236O463N104L321O48k411n295p864
$$ 305769 319897 332102 343429 354526 364652 372888 379351 384455 387776 388424 386013 380718 372854
56540C72854r884j1053j1552j1831j2010j2186j2818j3926j4538j3936j2870j2393
$$ 372854 362970 351917 340365 328534 316524 304338 291520 277594 263056 249120 236250 223857
56528B23857j2092j0860q867p301o559o129n939o264o586o093n207n023n389n084
$$ 223857 211765 200905 192038 184737 178178 172049 166110 159846 153260 147167 141960 136937 131548 126464
56514A26464l916l034l022l275l361l520l537k666j029J75K78k34q23j464j885
$$ 126464 122548 119514 116492 113217 109856 106336 102799 100133 99104 99279 99557 99323 98500 97036 95151
56499I5151j569p47k55j86J28P78J152J192J433J692J130r8o99j4J300K589L827
$$ 95151 93582 92835 92580 92394 92522 93300 94452 95644 97077 98769 99899 99801 99102 99088 100388 102977 106804
56482A06804M772M833M203L795L780L488K940L047M012M911N246N501N847N766
$$ 106804 111576 116409 120612 124407 128187 131675 134615 137662 141674 146585 151831 157332 163179 168945
56468A68945N361N546O521P384P718Q075Q508Q233P309P020P777Q173O998M870
$$ 168945 174306 179852 186373 193757 201475 209550 218058 226291 233600 240620 248397 256570 263568 268438
56454B68438K997J573K97o72j147j341j240n05N47R62O30M80P89O93j07o60m98
$$ 268438 271435 273008 273305 272633 271486 270145 268905 268400 268947 269909 270539 271019 271808 272501 272394 271734 271236
56437B71236m79j149j699j562j593k549l672m025m077m752n784o213n848n280
$$ 271236 270757 269608 267909 266347 264754 262205 258533 254508 250431 245679 239895 233682 227834 222554
56423B22554n008n229n885o392o095n256m727m432l474k041j575k452l131k433
$$ 222554 217546 212317 206432 200040 193945 188689 183962 179530 176056 174015 172440 169988 166857 164424
56409A64424j164m82j82L05N59J38k72O7O92Q55P52Q19P70M25M14J037J348N27
$$ 164424 163260 162778 162596 162901 163460 163598 163326 163393 164085 164940 165692 166511 167281 167706 168120 169157 170505 171032
56391A71032p29j220q67l65k8J24j05o10p35k39K59L69M83P39O26J62K25R93J416
$$ 171032 170303 169083 168216 167851 167823 167947 167842 167232 166497 166258 166517 166886 167369 168108 168734 168896 169121 170114 171530
56372A71530J042R73K016L244L406K579J503N13K4O72J990K400J512R05J526K097
$$ 171530 172572 173545 175561 178805 182211 184790 186293 186806 186830 187502 189492 191892 193404 194309 195835 197932
56356A97932J458P54J495K932L289K497J812J690J726J966K543K773K119J406
$$ 197932 199390 200144 201639 204571 207860 210357 212169 213859 215585 217551 220094 222867 224986 226392
56342B26392J663K476K850K990L714M868N647O004O463P006P214P032O587N947
$$ 226392 228055 230531 233381 236371 240085 244953 250600 256604 263067 270073 277287 284319 290906 296853
56328B96853N630O396P886Q745Q776R384J1055J2170J1555J0408J0241J0565J0153
$$ 296853 302483 308879 316765 325510 334286 343670 354725 366895 378450 388858 399099 409664 419817
56315D19817R124Q006O334L896J920J228O58r18k476k713k441l014l751l261k086
$$ 419817 428941 436947 443281 447177 449097 450325 450983 450065 447589 444876 442435 439421 435670 432409 430323
56300D30323j702j926j575p65k80L54J872L315L419L137M308O566P975Q220Q746
$$ 430323 428621 426695 425120 424355 424075 424429 426301 429616 433035 436172 440480 447046 455021 463241 471987
56285D71987J0098J1487J2706J4338J6226J7680J9006K1090K3801K6467K9273
$$ 471987 482085 493572 506278 520616 536842 554522 573528 594618 618419 644886 674159
56274F74159L2559L5506L7422L9498M3333M8486N3535N8704O5247P2998Q0877
$$ 674159 706718 742224 779646 819144 862477 910963 964498 1023202 1088449 1161447 1242324
56263A242324Q9280R9618J11881J24799J38021J52039J66371J79904J92543K04596
$$ 1242324 1331604 1431222 1543103 1667902 1805923 1957962 2124333 2304237 2496780 2701376
56253B701376K15053K22397K26481K27538K24121K14151J97448J75222J48032
$$ 2701376 2916429 3138826 3365307 3592845 3816966 4031117 4228565 4403787 4551819
56244D551819J16408Q2594M9208J6862j4553m3214o6594q4662r9162j10473j17773
$$ 4551819 4668227 4750821 4800029 4816891 4802338 4759124 4692530 4607868 4508706 4398233 4280460
56233D280460j21637j23724j24380j23225j21484j20975j21424j21488j21765
$$ 4280460 4158823 4035099 3910719 3787494 3666010 3545035 3423611 3302123 3180358
56224C180358j23741j26512j27767j27556j27817j28443j27333j24237j21098
$$ 3180358 3056617 2930105 2802338 2674782 2546965 2418522 2291189 2166952 2045854
56215B045854j18379j14296j08187j01580r5456q9165q2435p5753o8749o0820
$$ 2045854 1927475 1813179 1704992 1603412 1507956 1418791 1336356 1260603 1191854 1131034
56205A131034n3322m8246m4821m0489l5111l0992k8690k6253k2970k0453j9348
$$ 1131034 1077712 1029466 984645 944156 909045 878053 849363 823110 800140 779687 760339
56194G60339j8123j5858j3396j1145q513n889m349l168n68K861M659M633N241
$$ 760339 742216 726358 712962 701817 693304 687415 683066 679898 679330 682191 686850 691483 696724
56181F96724P543J0136J2488J5762J9642K2049K2864K4633K8416L2220L4550L6347
$$ 696724 704267 714403 726891 742653 762295 784344 807208 831841 860257 892477 927027 963374
56169I63374L8319L9403L9014L7996L6462L3419K9262K5630K2232J6884R329J770
$$ 963374 1001693 1041096 1080110 1118106 1154568 1187987 1217249 1242879 1265111 1281995 1291324 1293094
56157A293094m860j1778j8768k3475k5203k5903k6319k4776k0929j7093j4427
$$ 1293094 1288234 1276456 1257688 1234213 1209010 1183107 1156788 1132012 1111083 1093990 1079563
56146A079563j1240o435j298L576R766J8064K7195L6737M8160O1837P6197R0829
$$ 1079563 1068323 1061888 1060590 1064166 1073932 1091996 1119191 1155928 1204088 1265925 1342122 1432951
56134A432951J06802J22688J33996J37930J35376J27282J13275R5449P9349O8822
$$ 1432951 1539753 1662441 1796437 1934367 2069743 2197025 2310300 2405749 2485098 2553920
56124B553920O2902N9135N6222N1902M2534K7339J0044n478j8186k7471l2179
$$ 2553920 2616822 2675957 2732179 2784081 2826615 2853954 2863998 2858520 2840334 2812863 2780684
56113B780684l4031l8196m8032o2248p8506r5896j12112j22593j25124j21957
$$ 2780684 2746653 2708457 2660425 2598177 2519671 2423775 2311663 2189070 2063946 1941989
56103A941989j15492j05472r2380p9424o8774n9405n0665m4321m0889l7868l3790
$$ 1941989 1826497 1721025 1628645 1549221 1480447 1421042 1370377 1326056 1285167 1247299 1213509
56092A213509l0356k8519k6390k3064k0511j9593j8218j5460j3297j2317j0178
$$ 1213509 1183153 1154634 1128244 1105180 1084669 1065076 1046858 1031398 1018101 1005784 995606
56081I95606o475m362n042n278k940k01J171K798N368O475N622O201R471J1750
$$ 995606 989131 984769 979727 974449 971509 971308 972479 975277 980645 987120 992742 998943 1008414 1020164
56067A020164J0771R566J0691J1943J1313J0883J2084J2460J0894J0755J3768
$$ 1020164 1030935 1040501 1051192 1063135 1074448 1085331 1097415 1109875 1120769 1131524 1145292
56056A145292J6243J5433J4270J5521J6841J6028J5650J7759J9439J8479J8010
$$ 1145292 1161535 1176968 1191238 1206759 1223600 1239628 1255278 1273037 1292476 1310955 1328965
56045A328965K0646K3390K3392K3291K5779K8318K8464K8897L1845L4128L3234
$$ 1328965 1349611 1373001 1396393 1419684 1445463 1473781 1502245 1531142 1562987 1597115 1630349
56034A630349L2634L5468L8626L8859L8976M2000M4972M4767M4270M6632M9112
$$ 1630349 1662983 1698451 1737077 1775936 1814912 1856912 1901884 1946651 1990921 2037553 2086665
56023B086665M8894M9075N2482N5560N4938N3871N5710N7350N5956N5424N9126
$$ 2086665 2135559 2184634 2237116 2292676 2347614 2401485 2457195 2514545 2570501 2625925 2685051
56012B685051O3062O3474O4265O9313P4750P6720P9312Q6527R4043R7459J00876
$$ 2685051 2748113 2811587 2875852 2945165 3019915 3096635 3175947 3262474 3356517 3453976 3554852
56001C554852J08518J15989J19045J22621J31560J41147J46782J53946J67794
$$ 3554852 3663370 3779359 3898404 4021025 4152585 4293732 4440514 4594460 4762254
55992D762254J82313J91042J99065K12601K26639K35303K44337K60288K77783
$$ 4762254 4944567 5135609 5334674 5547275 5773914 6009217 6253554 6513842 6791625
55983F791625K91027L06970L32738L61569L86212M14171M53675M97589N38348
$$ 6791625 7082652 7389622 7722360 8083929 8470141 8884312 9337987 9835576 10373924
55974A0373924N85138O47747P17853P86320Q63909R63522J078111J199575J342382
$$ 10373924 10959062 11606809 12324662 13110982 13974891 14938413 16016524 17216099 18558481
55965A8558481J523303J736495J976645K267284K636541L087613L627556M301754
$$ 18558481 20081784 21818279 23794924 26062208 28698749 31786362 35413918 39715672
55957C9715672N163092O234919P546562R173471J1195218J3654788J6617352K0220235
$$ 39715672 44878764 51113683 58660245 67833716 79028934 92683722 109301074 129521309
55949A29521309K4595198K9789776L5762037M2122296M7438993M8880680M3325785
$$ 129521309 154116507 183906283 219668320 261790616 309229609 358110289 401436074
55942D01436074K9676652J0347108r755383k6000802l6163840m0510628m0565871
$$ 401436074 431112726 441459834 431704451 405703649 369539809 329029181 288463310
55935B88463310l7996349l4151562k9960681k5930563k2258425j9005376j6182679
$$ 288463310 250466961 216315399 186354718 160424155 138165730 119160354 102977675
55928A02977675j3752124j1652876r852887q341614p085900o034874n158131m441234
$$ 102977675 89225551 77572675 67719788 59378174 52292274 46257400 41099269 36658035
55920C6658035l853129l353329k923842k563254k257339j984152j740213j534068
$$ 36658035 32804906 29451577 26527735 23964481 21707142 19722990 17982777 16448709
55912A6448709j360049j203043j062264r46408q50986p62797o81449o15428n61918
$$ 16448709 15088660 13885617 12823353 11876945 11025959 10263162 9581713 8966285 8404367
55903H404367n10490m61920m24277l94729l63402l31157l06174k86805k64585
$$ 8404367 7893877 7431957 7007680 6612951 6249549 5918392 5612218 5325413 5060828
55894E060828k40609k22757k09879j94315j77150j65912j59665j50736j38927
$$ 5060828 4820219 4597462 4387583 4193268 4016118 3850206 3690541 3539805 3400878
55885C400878j30358j24569j15986j06079j01053r9449r4413q6494q2060q0836
$$ 3400878 3270520 3145951 3029965 2923886 2822833 2723384 2628971 2542477 2460417 2379581
55875B379581p6887p0437o7096o6465o2863n6387n2527n1564m8712m4039m2238
$$ 2379581 2302694 2232257 2165161 2098696 2035833 1979446 1926919 1875355 1826643 1782604 1740366
55864A740366m3113m1948l8697l7478l7647l4491k8250k3600k0690j5263p260
$$ 1740366 1697253 1655305 1616608 1579130 1541483 1506992 1478742 1455142 1434452 1419189 1411929
55853A411929j153J620K794R45o693j6961k3377k5379k7252k9067k6889k1242
$$ 1411929 1410776 1412396 1415190 1416135 1409442 1392481 1369104 1343725 1316473 1287406 1260517 1239275
55841A239275j7103j5624j3650j1251j1970j5581j8125j9179k1921k6079k8025
$$ 1239275 1222172 1206548 1192898 1181647 1169677 1154096 1135971 1116792 1094871 1068792 1040767
55830A040767k7778k8755l0611k9477k5510k3053k3013k1969j9292j8252j9413
$$ 1040767 1012989 984234 953623 924146 898636 875583 852570 830601 811309 793057 773644
55819G73644j9615j8203j7945j8978j8145j5062j2776j1779r362n532l552l806
$$ 773644 754029 735826 717881 698903 680758 665696 652920 641141 631779 626247 622695 618889
55807F18889k974j66J811K081K935M678M858L374K869L243J315l159o673q144
$$ 618889 615915 615749 617560 619641 622576 627254 632112 635486 638355 641598 642913 639754 633081 624937
55793F24937j0335j4000j6118j5382j4367j4655j4622j3460j2765j2753j1385
$$ 624937 614602 600602 584484 569102 554735 540080 525458 511998 499233 486480 475095
55782D75095q523o629o228m959k121O7N94O69J7l241q186j1226j1583j2018j3198
$$ 475095 466572 459943 453715 448756 446635 446702 447296 447965 447982 444741 436555 425329 413746 401728 388530
55767C88530j2331q650n341m244l221p27J215O61j469m036p372j0761j1819j0215
$$ 388530 376199 367549 362208 357964 354743 354016 355231 355892 354423 350387 343015 332254 320435 310220
55753C10220q674q807r145q593q299q782q542o944n433m723l814k687k679l436
$$ 310220 301546 292739 283594 275001 266702 257920 249378 242434 237001 232278 228464 225777 223098 219662
55739B19662k941j327j058k453k867j282R5K2J42J361K008J149J99k14j522l931
$$ 219662 216721 215394 214336 211883 209016 207734 207829 207851 207993 209354 211362 212511 212710 212496 210974 207043
55723B07043n370n151n232o334o385m440k670k574k609j438l50m34l66R39K310
$$ 207043 201673 196522 191290 184956 178571 174131 171461 168887 166278 164840 164490 164056 163690 164629 166939
55708A66939K787L454M984O105O168O648Q364R706R305P984O634M702K265J035
$$ 166939 169726 173180 178164 184269 190437 197085 205449 215155 224460 232444 239078 243780 246045 247080
55694B47080J740K917L548M356N323M765K340J34p36j838m193o152o296n728n663
$$ 247080 248820 251737 255285 259641 264964 269729 272069 272203 271467 269629 265436 259284 252988 247260 241597
55679B41597n208l454j457l57K83P91K90j237k104j623j262j784j707j52J312
$$ 241597 236389 232935 231478 231121 231404 232195 232485 231248 229144 227521 226259 224475 222768 222616 223928
55664B23928J330Q07P06K38j044j703p47O23J237J728K584K789J936J403J840
$$ 223928 225258 226065 226771 227009 225965 224262 223515 224138 225375 227103 229687 232476 234412 235815 237655
55649B37655J761K04j631k934m849p744r540q910p702q032r099r152q472q164
$$ 237655 239416 239620 237989 235055 230206 222462 212922 204012 196310 188278 179179 170027 161555 153391
55635A53391p836o729n548n157m947m265l850m207m311l539l055l642m047l203
$$ 153391 145555 138826 133278 128121 123174 118909 115059 110852 106541 103002 99947 96305 92258 89055
55621H9055k172k108k202j469o89p81r89n31k56q72j321o93l8m24r48n50n3n96
$$ 89055 86883 84775 82573 81104 80415 79634 78645 78114 77858 76986 75665 74972 74934 74510 73562 73012 72959 72363
55603G2363j633k207k556k929k522j214m43q56j024q8N53m1l55Q44K067J599L39
$$ 72363 70730 68523 65967 63038 60516 59302 58859 58003 56979 56891 57444 57403 57048 57892 59959 61558 61897
55586F1897k01n58j587k130j023L74L13m24l10k3q70j882j381o8K26k66o4P01
$$ 61897 61696 61138 59551 57421 56398 56772 57085 56661 56351 56328 55458 53576 52195 52127 52353 52087 52023 52724
55568E2724R36J014J879K655J880L19l8Q56J337Q34J17n63j368j639q69j83p37
$$ 52724 53660 54674 56553 59208 61088 61407 61369 62225 63562 64396 64513 63950 62582 60943 60074 59891 59154
55551E9154j564j109O0L02l33p13r46j676j944m90J614K222J473J249J890K115
$$ 59154 57590 56481 56541 56843 56510 55797 54851 53175 51231 50741 52355 54577 56050 57299 59189 61304
55535F1304J875K504L987M696M085L378L305L177K555K025J976K102K125J859
$$ 61304 63179 65683 69670 74366 78451 81829 85134 88311 90866 92891 94867 96969 99094 100953
55521A00953P92j045k341k115j378j645k553k741k342k533l277l548l403l725
$$ 100953 101745 100700 98359 96244 94866 93221 90668 87927 85585 83052 79775 76227 72824 69099
55507F9099m338m334m000m366n180n316m943n276o318o784o196n222B748C58b24
$$ 69099 64761 60427 56427 52061 46881 41565 36622 31346 25028 18244 12048 6826 2748 358 -224
55491A47M95N95O80J85n96F39a17q36p40L5O39Q1p46k96R02e3a5l81a85C25J7
$$ 147 642 1237 1917 2102 1506 639 -117 -953 -1693 -1658 -1019 -938 -1684 -1980 -1078 -53 -15 -396 -185 325 342
55470C42G2J5A7h19j274p54J02O40P45K01j017j839j173K72Q24L60J63M69L35
$$ 342 72 87 17 -819 -2093 -2847 -2745 -2105 -1360 -1159 -2176 -4015 -5188 -4916 -4092 -3732 -3569 -3100 -2765
55451b765k11k2R16h48b96P0H5L38A63c29J26C09H0a339j938j547o11M78J118
$$ -2765 -2976 -2998 -2082 -848 -296 -226 85 423 163 -329 -203 309 80 -1339 -3277 -4824 -5435 -4957 -3839
55432c839R07N13J032I42L141K862K015R96k30j183j091k18L72L90L06lr73j883
$$ -3839 -2932 -2419 -1387 942 4083 6945 8960 9956 9726 8543 7452 7234 7606 7996 8302 8299 7326 5443
55414E443j450j3P46L72Q2L90L22n23j003l39O39R83R13R48R79Q36P13N05p0n15
$$ 5443 3993 3980 4726 5098 5180 5570 5892 5369 4366 4027 4666 5649 6562 7510 8489 9325 10038 10543 10473 9958
55394I958R5J468K193J693P68J9q07j562j471o11j52n37q46m77n8j78n61j007
$$ 9958 10053 11521 13714 15407 16175 16194 15387 13825 12354 11743 11591 11054 10208 9731 9673 9495 8934 7927
55376G927j808k609A191D05O77J051P28L55j53r07F63a088j959j915j051K04M80
$$ 7927 6119 3510 1191 405 1082 2133 2861 3216 3063 2156 663 -1088 -3047 -4962 -6013 -5809 -5329
55359e329n27j472j318n65lM08P56O24O4j7P38J404J172M88J82K57K45j20q85
$$ -5329 -5856 -7328 -8646 -9211 -9214 -8806 -8050 -7426 -7362 -7379 -6641 -5237 -4065 -3577 -3395 -3138 -2893 -3013 -3898
55340c898j766j820l81J585K218J142j24m11j25R6M04Q84R99e54i2E26M43j39
$$ -3898 -5664 -7484 -7865 -6280 -4062 -2920 -3044 -3455 -3580 -3484 -3080 -2196 -1197 -554 -92 526 969 830
55322H30k52L78Q12M93J3l01I00a476k965j999l54O94R80Q62M09n0J70Q78Q41
$$ 830 578 956 1768 2261 2274 1973 900 -1476 -4441 -6440 -6794 -6100 -5120 -4258 -3849 -3899 -3729 -2851 -2010
55303b010k48j003m33N01N55Q7J21O03Q50a89D69K93k53B13K65M01l78c98j13
$$ -2010 -2258 -3261 -3694 -3193 -2638 -2551 -2430 -1827 -977 -189 469 762 509 213 478 879 501 -398 -511
55284e11E32J017n4G04e0o01n87k94K66N46L46r4o34j062q19K78a341A60J046
$$ -511 532 1549 1495 704 -50 -651 -1238 -1532 -1266 -720 -374 -468 -1102 -2164 -2983 -2705 -1341 160 1206
55265A206J044J661K065J727R77K79k76p33j075j249j178q21m35l57m28q4O30
$$ 1206 2250 3911 5976 7703 8680 8959 8683 7950 6875 5626 4448 3627 3192 2835 2407 2323 2953
55248B953Q56R2j023A344I5d93N0g2A46m3K59J124J698J370M95l23r02j187j086
$$ 2953 3809 3901 2878 1344 95 -493 -443 -72 146 103 362 1486 3184 4554 5049 4726 3824 2637 1551
55229A551E84g97j926j343N89a123A426J680J153J331J477J146N89J41n5J12N62
$$ 1551 584 -797 -2723 -4066 -3477 -1123 1426 3106 4259 5590 7067 8213 8802 8943 8888 9000 9562
55212I562R17Q97N44p7r07j439j012J18P46K32o78r61n45M7N31P66N30o2m43l61
$$ 9562 10479 11376 11920 11843 10936 9497 8485 8603 9349 9581 8903 7942 7397 7444 7975 8741 9271 9209 8766 8405
55192H405k34l60m48l37m20r45j508j651A123C10l1N36L60k73D37j3M22O06J067
$$ 8405 8171 7811 7363 7026 6606 5661 4153 2502 1123 310 279 815 1175 902 437 424 846 1452 2519
55173B519J798J911J108L01J77K45l6l26k98l34o21o50k69k44r60j619A223C89
$$ 2519 4317 6228 7336 7637 7814 8059 8023 7697 7399 7065 6444 5794 5525 5281 4321 2702 1223 389
55154B45O95J492J396K82o82p30n60q71A67e00j28Q0E6J716K127Q67q25j088j3
$$ 245 940 2432 3828 4110 3428 2698 2138 1267 167 -500 -628 -548 56 1772 3899 4766 3941 2853 2840
55135B840R28J185J272J294J024Q97J446K117K001J321R69J076J167J207J246
$$ 2840 3768 4953 6225 7519 8543 9440 10886 13003 15004 16325 17294 18370 19537 20744 21990
55120B1990P29n38j459j027k0J66l31l67R7J53j87l3N98P28J52k40O1O07J025
$$ 21990 22719 22181 20722 19695 19675 19841 19510 19143 19240 19393 19206 19173 19771 20499 20651 20411 20472 21079 22104
55101B2104J389J589J400J070Q82L86p87j752j339K2Q23P19P74J510K186K202
$$ 22104 23493 25082 26482 27552 28434 28820 28033 26281 24942 24964 25787 26506 27280 28790 30976 33178
55085C3178J852J423P70J06R1P50J246J044M93J59L06R94J932K294J578N32K58
$$ 33178 35030 36453 37223 37329 37420 38170 39416 40460 40953 41112 41418 42412 44344 46638 48216 48748 49006
55068D9006N71K97q37j798j747r69j02N50Q03N88L01M01N69Q2j015j937k295k339
$$ 49006 49577 49874 49037 47239 45492 44523 44421 44971 45774 46362 46663 47064 47633 47715 46700 44763 42468 40129
55050D0129k207j718j029n55k62K00P00P90N77O18R93J260J259J054M18p79j770
$$ 40129 37922 36204 35175 34620 34358 34558 35258 36048 36625 37243 38236 39496 40755 41809 42227 41448 39678
55033C9678j637p18k54o11r29n85L7M08N68P66J105J623K094J872P15m66n50K75
$$ 39678 38041 37323 37069 36458 35529 34944 34981 35389 35957 36723 37828 39451 41545 43417 44132 43666 43116 43391
55015D3391R13R78R47Q51J54j008j639j272n45j90k48m21l65K53J264J628N54
$$ 43391 44304 45282 46229 47080 47234 46226 44587 43315 42770 42580 42332 41911 41546 41799 43063 44691 45245
54998D5245j231k287k260j787j049J52J111Q15j39k1J348K160J460O00R19J613
$$ 45245 44014 41727 39467 37680 36631 36783 37894 38709 38570 38549 39897 42057 43517 44117 45036 46649
54982D6649J218l3p75n85k16k24m44n52l33L49J189J416P74Q8L10J277K030K047
$$ 46649 47867 47834 47059 46474 46258 46034 45590 45038 44705 45054 46243 47659 48433 48521 48831 50108 52138 54185
54964E4185J611J277J392K041L017L950M739N656O811P798Q139P964P952Q644
$$ 54185 55796 57073 58465 60506 63523 67473 72212 77868 84679 92477 100616 108580 116532 125176
54950A25176R964J1424J2767J4200J5740J6413J4830J0778N666R23l305p324j0638
$$ 125176 135140 146564 159331 173531 189271 205684 220514 231292 236958 237881 234576 227252 216614
54937B16614j2518j3279j3810j4155j3691j2502j1379j0558r564q290p164o201
$$ 216614 204096 190817 177007 162852 149161 136659 125280 114722 105158 96868 89704 83503
54925H3503m996l694k873k376j410k3P22M32J06P60K156L447M243M615M722M897
$$ 83503 78507 74813 71940 69564 68154 68131 68853 69285 69391 70151 72307 75754 79997 84612 89334 94231
54909I4231N620P073R090J1525J4090J6018J6641J6172J5093J2932Q821L240j995
$$ 94231 99851 106924 116014 127539 141629 157647 174288 190460 205553 218485 227306 230546 228551
54896B28551n743q502j1035j3188j4453j4749j4168j2808j1229j0191r643q723
$$ 228551 222808 214306 203271 190083 175630 160881 146713 133905 122676 112485 102842 94119
54884I4119p152n679m829m150l194k368k253k694l056k940k302j385o30k23K46
$$ 94119 86967 81288 76459 72309 69115 66747 64494 61800 58744 55804 53502 52117 51487 51264 51510
54869E1510J025J434P08n66j075o96n28r70j275j144j304j987k281j696j005q57
$$ 51510 52535 53969 54677 54111 53036 52340 51812 50842 49567 48423 47119 45132 42851 41155 40150 39293
54853C9293p32m5P84J151J154R70L72m40o32j30j17j276k637l069k809k481j702
$$ 39293 38561 38516 39300 40451 41605 42575 42947 42507 41875 41745 41628 40352 37715 34646 31837 29356 27654
54836B7654l4J595J889J133P64J299J916J954J655J367R23P2r83j709j694j054
$$ 27654 27620 29215 31104 32237 33001 34300 36216 38170 39825 41192 42115 42187 41204 39495 37801 36747
54820C6747m78n42q51m93O10J482J569J539K131K949L095K464J746J552K028K961
$$ 36747 36269 35727 34876 34383 34993 36475 38044 39583 41714 44663 47758 50222 51968 53520 55548 58509
54804E8509L893M523N201O482Q052Q939Q956R055R908J1126J2340J3913J5874
$$ 58509 62402 66925 72126 78608 86660 95599 104555 113610 123518 134644 146984 160897 176771
54791A76771J7124J6619J4585J1833Q586M702M04l965q158j1431j2591j1496r727
$$ 176771 193895 210514 225099 236932 245518 250220 250624 246659 238501 227070 214479 202983 193256
54778A93256q849q690q187p154o182n379m378l243k393j857j374r24m73L77J808
$$ 193256 184407 175717 167530 160376 154194 148815 144437 141194 138801 136944 135570 134646 134173 134550 136358
54763A36358L186L855M113M779O091P650R139J0593J2225J4382J7273K0447K3122
$$ 136358 139544 143399 147512 152291 158382 166032 175171 185764 197989 212371 229644 250091 273213
54750B73213K5260K7467K9483K9811K7371K2561J6096Q043j098r583j5985k0634
$$ 273213 298473 325940 355423 385234 412605 435166 451262 459305 458207 448624 432639 412005
54738D12005k4378k6803k7091k5846k4526k3482k2006j9897j7693j5615j3512
$$ 412005 387627 360824 333733 307887 283361 259879 237873 217976 200283 184668 171156
54727A71156j1662j0377r160p425n783n277n553n204l917k882k872l200k929k064
$$ 171156 159494 149117 139957 132532 126749 121472 115919 110715 106798 103916 101044 97844 94915 92851
54713I2851j128m50k57p24j538j963j610q04r7J66j34q05j271j080m32J67N91
$$ 92851 91723 91273 91016 90292 88754 86791 85181 84377 84280 84446 84312 83507 82236 81156 80724 80891 81482
54696H1482J002J338J398J233R74N27j57p67j012r82q26m84j36k58p76q19O8J204
$$ 81482 82484 83822 85220 86453 87427 87954 87797 87030 86018 85036 84210 83726 83590 83332 82556 81737 81805 83009
54678H3009J832K174K625K771K140J311J134J495J810K194L088M232N072N635
$$ 83009 84841 87015 89640 92411 94551 95862 96996 98491 100301 102495 105583 109815 114887 120522
54664A20522N993N619M421L756M795O484O722N324M207M698O226P687Q700R267
$$ 120522 126515 132134 136555 140311 145106 151590 158312 163636 167843 172541 178767 186454 195154 204421
54650B04421R536J0080J1320J2707J3561J4577J7147K1255K5345K8370L0532L1952
$$ 204421 213957 224037 235357 248064 261625 276202 293349 314604 339949 368319 398851 430803
54638D30803L2130L0973K8818K5032J8139Q003l301j3420k1441k7383l1244l3229
$$ 430803 462933 493906 522724 547756 565895 573898 570597 557177 535736 508353 477109 443880
54626D43880l3825l3024l0457k6743k3494k1461j9749j7519j5314j3810j2463
$$ 443880 410055 377031 346574 319831 296337 274876 255127 237608 222294 208484 196021
54615A96021j0462q201o691o055n539m643l451k230j338j192j641j800j050M6
$$ 196021 185559 177358 170667 164612 159073 154430 150979 148749 147411 146219 144578 142778 141728 141774
54601A41774M33j94j240k027k311k272k386l021l955m549m578m402m220l753k993
$$ 141774 142207 142013 140773 138746 136435 134163 131777 128756 124801 120252 115674 111272 107052 103299 100306
54586A00306k587k925l438l341k723k327k450k651k466k004j780k054k370j920
$$ 100306 97719 94794 91356 88015 85292 82965 80515 77864 75398 73394 71614 69560 67190 65270
54572F5270n37Q76J271O81Rj85j38j60j89j40m1K45Q42J361J230O22L58P78J467
$$ 65270 64733 65609 66880 67561 67570 67385 67247 67087 66898 66758 66717 66962 67804 69165 70395 71017 71375 72153 73620
54553G3620K100K761L219K843J659O96P46J444K089K674L563M618N334N530N460
$$ 73620 75720 78481 81700 84543 86202 86898 87644 89088 91177 93851 97414 102032 107366 112896 118356
54538A18356N505O026P171Q565R630J0436J1722J3786J5785J6617J6027J4506
$$ 118356 123861 129887 137058 145623 155253 165689 177411 191197 206982 223599 239626 254132
54526B54132J2431R798O513K627j651n915r745j2933j5328j6561j6392j5308j4236
$$ 254132 266563 276361 282874 285501 283850 277935 268190 255257 239929 223368 206976 191668 177432
54513A77432j3501j2634j1259r605q008o546n383m818m693m303l325k294j870
$$ 177432 163931 151297 140038 130433 122425 115879 110496 105678 100985 96682 93357 91063 89193
54500H9193j985k074j743r69j6O70Q13P26R15J269J192O43L47P58J438J798J879
$$ 89193 87208 85134 83391 82422 82406 83076 83889 84615 85530 86799 87991 88634 88981 89739 91177 92975 94854
54483I4854K013K229K374K396K177J506N20k69n76n64l51J58Q12J166J129J055
$$ 94854 96867 99096 101470 103866 106043 107549 108069 107800 107224 106660 106309 106467 107279 108445 109574 110629
54467A10629J012O29m8k75L63J248J544J100K60o98j477j726j562j554j841j853
$$ 110629 111641 112270 112222 111947 112310 113558 115102 116202 116462 115764 114287 112561 110999 109445 107604 105751
54451A05751j399j214j799k384j991r80n71j081j521j053n4M30j65j473k620k948
$$ 105751 104352 103138 101339 98955 96964 95984 95413 94332 92811 91758 91704 92134 91969 90496 87876 84928
54435H4928k461j579o21K70Q25P89M58M53P94Q00J90l75k81J37K85L45Q92J786
$$ 84928 82467 80888 80267 80537 81362 82151 82609 83062 83856 84656 84846 84471 84190 84327 84612 84957 85849 87635
54417H7635K261J989J441J133J100J134J176J239J287J318J419J635J889K047
$$ 87635 89896 91885 93326 94459 95559 96693 97869 99108 100395 101713 103132 104767 106656 108703
54403A08703K042J922J769J608J499J714K478L434L741L091K254K074K222J584
$$ 108703 110745 112667 114436 116044 117543 119257 121735 125169 128910 132001 134255 136329 138551 140135
54389A40135j92k269l660m122l993l737l742m008m037l484k799k676l033l203
$$ 140135 139943 137674 134014 129892 125899 122162 118420 114412 110375 106891 104092 101416 98383 95180
54375I5180l010k829k729k463k146k103k062j537r51j181j971k087j275o75q79
$$ 95180 92170 89341 86612 84149 82003 79900 77838 76301 75350 74169 72198 70111 68836 68161 67282
54360F7282j011l29N08N86P6l91n92l35P36K092K335J182L70J327L006L358K154
$$ 67282 66271 65942 66450 67036 67112 66721 66129 65794 66530 68622 70957 72139 72509 73836 76842 80200 82354
54343H2354R13O70J259K314L562M237L625K221J286J200J214P72P8o51j478k194
$$ 82354 83267 83937 85196 87510 91072 95309 98934 101155 102441 103641 104855 105627 105705 105054 103576 101382
54327A01382k337j969j769k104k638k912k844k557k165j862j815j957k122k296
$$ 101382 99045 97076 95307 93203 90565 87653 84809 82252 80087 78225 76410 74453 72331 70035
54313G0035k475k475k191j851j694j591j277p47j95J19r8q78j601j504p97n57
$$ 70035 67560 65085 62894 61043 59349 57758 56481 55734 55539 55658 55560 54682 53081 51577 50780 50223
54297E0223j180j780j528p70j93J77L85r2j390k357j799j52J137J488J429J318
$$ 50223 49043 47263 45735 44965 44772 44949 45334 45242 43852 41495 39696 39544 40681 42169 43598 44916
54281D4916R85M89K66M17O34P16O13K35k49k27N18J246J262R81J169J643J721
$$ 44916 45901 46390 46656 47073 47707 48423 49036 49271 49022 48795 49313 50559 51821 52802 53971 55614 57335
54264E7335J487J580K012K356K683L227L397K428Q30n9N5K06j41n17o74j081j830
$$ 57335 58822 60402 62414 64770 67453 70680 74077 76505 77335 77276 77331 77537 77396 76879 76205 75124 73294
54247G3294k168j651q26l35j56j29m31j035j402j155n57j9L89P32J011J287J516
$$ 73294 71126 69475 68649 68314 68158 68029 67598 66563 65161 64006 63449 63430 63819 64551 65562 66849 68365
54230F8365J303L90n92o77J19P37M86j68m37j14N34J129J240P14M0j07K33M97
$$ 68365 69668 70058 69466 68789 68908 69645 70131 69963 69526 69412 69946 71075 72315 73029 73069 72962 73195 73692
54212G3692N99R37J353J102P8q07q78m90k09K7L87N19J02m86o34l50j58m02r70
$$ 73692 74291 75228 76581 77683 77761 76954 76076 75586 75377 75404 75791 76310 76412 75926 75292 74942 74784 74382 73412
54193G3412j539j795j621j218q60n25q2K12q9q59j338j029k58K97K70k28p64q30
$$ 73412 71873 70078 68457 67239 66379 65854 65772 65984 65895 65036 63698 62669 62411 62708 62978 62750 61986 61156
54175F1156l91j56p95j914k359j683o23m6Kq4j77l72n67n06r3M81Q56Q10N71O60
$$ 61156 60765 60609 59814 57900 55541 53858 53235 53189 53191 53107 52930 52558 51991 51485 51392 51873 52729 53539 54110 54770
54155E4770J137J363Q46Jm76o10q38r78m60N16J028P28K84K95M79K81l51j028
$$ 54770 55907 57270 58116 58117 57641 57031 56193 55215 54755 55271 56299 57027 57311 57606 58085 58366 58015 56987
54137E6987j287q29K43J239J465R25J24o87j487k007j959j584j284q96j20O34
$$ 56987 55700 54871 55114 56353 57818 58743 58867 58180 56693 54686 52727 51143 49859 48963 48843 49477
54121D9477P10L29J83J30m89j343j316l52K77p1n48l66M4J02R8L65N00J97qL57
$$ 49477 50187 50516 50699 50829 50340 48997 47681 47329 47606 47535 46987 46621 46665 46767 46865 47230 47730 47927 47919 48276
54101D8276Q72R85Q67Q57P99N70M67M41j76j456k261j726n30J73K73K05k39j309
$$ 48276 49148 50133 51000 51857 52656 53226 53693 54134 53958 52502 50241 48515 47985 48158 48431 48636 48397 47088
54083D7088k154j640m9J180J316Q70L91k52j163j920k023j403l46O82J192J029
$$ 47088 44934 43294 43245 44425 45741 46611 47002 46750 45587 43667 41644 40241 39895 40577 41769 42798
54067D2798N85L93O64J373K323K905K323O27r70j355o68K47R69J469J525J056
$$ 42798 43383 43776 44440 45813 48136 51041 53364 53991 53021 51666 50998 51245 52214 53683 55208 56264
54051E6264O30Q47J462J815J786J665J447J088J006J508J971J660J062J249K139
$$ 56264 56894 57741 59203 61018 62804 64469 65916 67004 68010 69518 71489 73149 74211 75460 77599
54036G7599K516J958J510K062L174L995M446M891N247N223M955M794M748M632
$$ 77599 80115 82073 83583 85645 88819 92814 97260 102151 107398 112621 117576 122370 127118 131750
54022A31750M542M730N093N194M784M018L206K526J948J358P13J45j81l43p18
$$ 131750 136292 141022 146115 151309 156093 160111 163317 165843 167791 169149 169862 170007 169826 169483 168765
54007A68765j620k849l656l317j910m80r1p51j545j871k044k552l189l417l205
$$ 168765 167145 164296 160640 157323 155413 154933 154842 154091 152546 150675 148631 146079 142890 139473 136268
53992A36268k956k802k480j860j118m64k7L4l95j115j760k092j986j334k99M96
$$ 136268 133312 130510 128030 126170 125052 124588 124561 124595 124200 123085 121325 119233 117247 115913 115614 116110
53976A16110M86j44p28r47j001j006p67k42K42M85P43J275J823J861J296O39M18
$$ 116110 116596 116452 115724 114777 113776 112770 112003 111761 112003 112488 113231 114506 116329 118190 119486 120125 120543
53959A20543O01O76K97k46l44K08R64J326J120N47o2l19J08J092J966K186K046
$$ 120543 121144 121820 122117 121871 121527 121735 122699 124025 125145 125692 125630 125311 125419 126511 128477 130663 132709
53942A32709K340L344M500N204N553O095P003P802P902P099N535L384R00j342
$$ 132709 135049 138393 142893 148097 153650 159745 166748 174550 182452 189551 195086 198470 199370 198028
53928A98028k648k898k727k782k947k711k044j434j098o72R2Q81J284J463J976
$$ 198028 195380 192482 189755 186973 184026 181315 179271 177837 176739 176067 176159 177040 178324 179787 181763
53913A81763K989L949M130L490K924L401M796N889N847N239N080N203M537K817
$$ 181763 184752 188701 192831 196321 199245 202646 207442 213331 219178 224417 229497 234700 239237 242054
53899B42054J142M95N54M42m9n16p12p29o96q15j386k435l519m220m563m765m867
$$ 242054 243196 243691 244245 244687 244638 244122 243410 242681 241985 241170 239784 237349 233830 229610 225047 220282 215415
53882B15415m903n062n363n496n284n046n168n549n718n367m578l810l536l728
$$ 215415 210512 205450 200087 194591 189307 184261 179093 173544 167826 162459 157881 154071 150535 146807
53868A46807l707l004k227k343l230l827l801l907m421m375l158j751j434k119
$$ 146807 143100 140096 137869 135526 132296 128469 124668 120761 116340 111965 108807 107056 105622 103503
53854A03503k846l250l447l100j929p21o15j471k042j680r08l35j2M8l07q71j134
$$ 103503 100657 97407 93960 90860 88931 88210 87595 86124 84082 82402 81494 81159 81147 81195 80888 80017 78883
53837G8883j002q14n67O0Q49J038M15k95m83l91m25l64K19J128J634J334N64L1
$$ 78883 77881 77067 76500 76560 77409 78447 78862 78567 78084 77693 77268 76904 77123 78251 79885 81219 81783 81814
53819H1814J35O02P56K23o18j055p77r6N02P65P91R22J391J978K172J860J510
$$ 81814 81949 82551 83307 83530 82912 81857 81080 80984 81486 82251 83042 83964 85355 87333 89505 91365 92875
53802I2875J542J869K315L023M043M874M961M397L728L331L386M032N023N619
$$ 92875 94417 96286 98601 101624 105667 110541 115502 119899 123627 126958 130344 134376 139399 145018
53788A45018N301M392L457K577J722J321J696K284K275J792J599J842J925J539
$$ 145018 150319 154711 158168 160745 162467 163788 165484 167768 170043 171835 173434 175276 177201 178740
53774A78740R52K95o01j577k167k281k294k437k689l148l810m131l577k564k041
$$ 178740 179692 179987 179386 177809 175642 173361 171067 168630 165941 162793 158983 154852 151275 148711 146670
53759A46670k240k648l051l634m032l479k112j066r42j157j124j095j316j330
$$ 146670 144430 141782 138731 135097 131065 127586 125474 124408 123466 122309 121185 120090 118774 117444
53745A17444p46Q5O92J078J191N73p52j772j679j042j031j827k583k677k258j727
$$ 117444 116698 116783 117475 118553 119744 120317 119565 117793 116114 115072 114041 112214 109631 106954 104696 102969
53729A02969j260q50m37j7J91j06p02q53j63Q16J214Q51K20k25l82l03j16j2j3
$$ 102969 101709 100859 100422 100405 100596 100490 99788 98935 98772 99588 100802 101653 101873 101648 101266 100963 100847 100835 100822
53710A00822J44O15J130J308J121Q34O90Q20J286J954K549K960L303L608L792
$$ 100822 100966 101581 102711 104019 105140 105974 106664 107484 108770 110724 113273 116233 119536 123144 126936
53695A26936L989M451M948M763L611K078Q43j4n59m35O31K094L102L465L514L208
$$ 126936 130925 135376 140324 145087 148698 150776 151619 151605 151046 150611 151242 153336 156438 159903 163417 166625
53679A66625K185P01k91k54K74M48J13k53k39J30N63P22M31j53o37p81p01o39
$$ 166625 168810 169511 169220 168966 169240 169688 169801 169548 169309 169439 170002 170724 171155 171002 170365 169584 168883 168244
53661A68244o41o59p43r33j063r24o01l77k60K7M50M70j80q14n18N12J059N24
$$ 168244 167603 166944 166201 165268 164205 163281 162680 162303 162043 162070 162520 162990 162810 161996 161478 161990 163049 163573
53643A63573k53k46K72K39m94r03k79P65J205R13O33Q23J152J169J019J162J562
$$ 163573 163320 163074 163346 163585 163091 162188 161909 162674 163879 164792 165425 166248 167400 168569 169588 170750 172312
53626A72312J664J300J119J691K538K709K115J543J334R90L88L03J152K028J945
$$ 172312 173976 175276 176395 178086 180624 183333 185448 186991 188325 189315 189703 190006 191158 193186 195131
53611A95131J398J591K574L206K902K267J949J880J871K183L059M222N160N535
$$ 195131 196529 198120 200694 203900 206802 209069 211018 212898 214769 216952 220011 224233 229393 234928
53597B34928N266M645M296M553M897M605L837L394L457L400K978K837L540M651
$$ 234928 240194 244839 249135 253688 258585 263190 267027 270421 273878 277278 280256 283093 286633 291284
53583B91284N204M658L213J600O61O84J097J218J159J414J805J697J191J045J383
$$ 291284 296488 301146 304359 305959 306620 307304 308401 309619 310778 312192 313997 315694 316885 317930 319313
53568C19313J514J222J153J513J487N56n84j078j015q08k69P84J749J936J590
$$ 319313 320827 322049 323202 324715 326202 326758 326174 325096 324081 323273 323004 323788 325537 327473 329063
53553C29063J418J482J352J009Q06P91P76Q64J306J971K496K756K729K222J260
$$ 329063 330481 331963 333315 334324 335130 335921 336697 337561 338867 340838 343334 346090 348819 351041 352301
53538C52301M18K31M98O79P36R98J513K026K490L017L453L552L409L359L568M053
$$ 352301 352719 352950 353448 354127 354863 355861 357374 359400 361890 364907 368360 371912 375321 378680 382248 386301
53522C86301M903O012O870P072O886O897P256P703Q143Q730R572J0616J1706J2487
$$ 386301 391204 397216 404086 411158 418044 424941 432197 439900 448043 456773 466345 476961 488667 501154
53508E01154J2609J2314J2417J3260J4223J4762J5368J6746J8490J9569J9933
$$ 501154 513763 526077 538494 551754 565977 580739 596107 612853 631343 650912 670845
53497F70845K0570K1939K3227K3530K3007K2550K2736K3495K4365K4793K4469
$$ 670845 691415 713354 736581 760111 783118 805668 828404 851899 876264 901057 925526
53486I25526K3590K2679K2064K1736K1678K1949K2404K2658K2553K2304K2145
$$ 925526 949116 971795 993859 1015595 1037273 1059222 1081626 1104284 1126837 1149141 1171286
53475A171286K2018K1817K1599K1407K1078K0475J9758J9178J8640J7766J6503
$$ 1171286 1193304 1215121 1236720 1258127 1279205 1299680 1319438 1338616 1357256 1375022 1391525
53464A391525J5366J4791J4364J3149J0917Q557P045O263N342L785J734n84l014
$$ 1391525 1406891 1421682 1436046 1449195 1460112 1468669 1475714 1481977 1487319 1491104 1492838 1492254 1489240
53451A489240n148o644p857r453j1337j2685j3199j3554j4328j5267j6036j6939
$$ 1489240 1484092 1477448 1469591 1460138 1448801 1436116 1422917 1409363 1395035 1379768 1363732 1346793
53439A346793j8350j9995k1304k2031k2162k1799k1445k1735k2413k2301k0848
$$ 1346793 1328443 1308448 1287144 1265113 1242951 1221152 1199707 1177972 1155559 1133258 1112410
53428A112410j9002j7895j7247j6004j3950j1832j0216r053q169p425o546n443
$$ 1112410 1093408 1075513 1058266 1042262 1028312 1016480 1006264 997211 989042 981617 975071 969628
53416I69628m456l772k907j385M40J884K897L829M634N170N879P372R464J1451
$$ 969628 965172 961400 958493 957108 957548 959432 962329 966158 970792 975962 981841 989213 998677 1010128
53402A010128J3064J4431J5441J6072J7073J9203K1869K3614K4084K4469K5878
$$ 1010128 1023192 1037623 1053064 1069136 1086209 1105412 1127281 1150895 1174979 1199448 1225326
53391A225326K8119L0400L2326L3932L5379L6974L8984M1203M3174M4793M6226
$$ 1225326 1253445 1283845 1316171 1350103 1385482 1422456 1461440 1502643 1545817 1590610 1636836
53380A636836M7314M7813M8174M9191N0761N1840N1836N1279N0814N0333M9523
$$ 1636836 1684150 1731963 1780137 1829328 1880089 1931929 1983765 2035044 2085858 2136191 2185714
53369B185714M8526M7535M6268M4295M1571L8348L4826L1174K7526K3787J9790
$$ 2185714 2234240 2281775 2328043 2372338 2413909 2452257 2487083 2518257 2545783 2569570 2589360
53358B589360J5675J1749P934L806p66n530j0382j5357k0064k3791k6438k8727
$$ 2589360 2605035 2616784 2624718 2628524 2627758 2622228 2611846 2596489 2576425 2552634 2526196 2497469
53346B497469l1237l3848l6321l8847m1580m4090m5656m5882m4934m3463m2362
$$ 2497469 2466232 2432384 2396063 2357216 2315636 2271546 2225890 2180008 2135074 2091611 2049249
53335B049249m2032m1887m1055l9518l8003l6861l5935l5408l5698l6226l5526
$$ 2049249 2007217 1965330 1924275 1884757 1846754 1809893 1773958 1738550 1702852 1666626 1631100
53324A631100l3112l0255k8182k6508k4326k1970k0481j9827j8871j6967j4600
$$ 1631100 1597988 1567733 1539551 1513043 1488717 1466747 1446266 1426439 1407568 1390601 1376001
53313A376001j2528j1108j0529j0911j1955j3022j3710j3985j3786j2985j1775
$$ 1376001 1363473 1352365 1341836 1330925 1318970 1305948 1292238 1278253 1264467 1251482 1239707
53302A239707j0630r819r218q599p835o882n816m817l817k362k78J744K751K783
$$ 1239707 1229077 1219258 1210040 1201441 1193606 1186724 1180908 1176091 1172274 1169912 1169634 1171378 1174129 1176912
53288A176912K987M265O262P942Q879R639J1037J3281J5857J8102J9745K0977
$$ 1176912 1179899 1184164 1190426 1198368 1207247 1216886 1227923 1241204 1257061 1275163 1294908 1315885
53276A315885K2093K3117K3806K3818K2961K1377J9623J8386J7912J7729J6980
$$ 1315885 1337978 1361095 1384901 1408719 1431680 1453057 1472680 1491066 1508978 1526707 1543687
53265A543687J5138J2464R791P820O561N490M227K814J269p22l278n817p681r120
$$ 1543687 1558825 1571289 1581080 1588900 1595461 1600951 1605178 1607992 1609261 1608539 1605261 1599444 1591763 1582643
53251A582643j1027j3643j6124j7634j8338j8979j9976k1242k2523k3493k3865
$$ 1582643 1571616 1557973 1541849 1524215 1505877 1486898 1466922 1445680 1423157 1399664 1375799
53240A375799k3824k3991k4587k4853k3907k1989k0314j9615j9412j8873j7948
$$ 1375799 1351975 1327984 1303397 1278544 1254637 1232648 1212334 1192719 1173307 1154434 1136486
53229A136486j7326j7490j8183j8787j8884j8365j7302j5941j4752j4104j3790
$$ 1136486 1119160 1101670 1083487 1064700 1045816 1027451 1010149 994208 979456 965352 951562
53218I51562j3165j1904j0426r336q730q307p940p746p766p939q368r167j0103
$$ 951562 938397 926493 916067 906731 898001 889694 881754 874008 866242 858303 849935 840768 830665
53205H30665j0790j1255j1900j2913j4035j4956j5528j5625j5195j4503j3873
$$ 830665 819875 808620 796720 783807 769772 754816 739288 723663 708468 693965 680092
53194F80092j3213j2288j1439j1364j2088j2798j2975j3027j3463j4031j4178
$$ 680092 666879 654591 643152 631788 619700 606902 593927 580900 567437 553406 539228
53183E39228j3910j3646j3610j3789j4183j4610j4560j3727j2451j1275j0305
$$ 539228 525318 511672 498062 484273 470090 455480 440920 427193 414742 403467 393162
53172C93162r442q926r019r340r122q189p180o711o644o375n601m702m432n154
$$ 393162 383720 374794 365775 356435 347313 339124 331944 325233 318589 312214 306613 301911 297479 292325
53158B92325o315o850o255n101m288m094m182m202m025l616l124k937l241l599
$$ 292325 286010 279160 272905 267804 263516 259422 255240 251038 247013 243397 240273 237336 234095 230496
53144B30496l386k584j800j536j774k233k574k418j638p18m14q90j540j729j443
$$ 230496 227110 224526 222726 221190 219416 217183 214609 212191 210553 209835 209421 208531 206991 205262 203819
53129B03819j001n58j19K39M39O22R81J500J980K294K409K260J819J247Q19O62
$$ 203819 202818 202260 202141 202380 202819 203441 204422 205922 207902 210196 212605 214865 216684 217931 218750 219412
53113B19412O60N79K14n32j533k406k772k639k402k409k670l016l334l516l377
$$ 219412 220072 220651 220865 220333 218800 216394 213622 210983 208581 206172 203502 200486 197152 193636 190259
53098A90259k942k584k616k799k650k154j788j750j703j466j373j659j916j646
$$ 190259 187317 184733 182117 179318 176668 174514 172726 170976 169273 167807 166434 164775 162859 161213
53084A61213j030o53o43o21l65q2k3k34o73j192j503j409j060p32n03m14o64j250
$$ 161213 160183 159530 158887 158266 157901 157819 157796 157562 156889 155697 154194 152785 151725 150993 150490 150076 149412 148162
53066A48162j689j557j101p76n00PL73m5j047j637j349p44m77n45o67o58l17M12
$$ 148162 146473 144916 143815 143039 142539 142546 142919 142874 141827 140190 138841 138097 137620 137075 136408 135750 135433 135845
53048A35845R87O91k79r77j064j159j545j560q65l11p15j569j833j467j226j361
$$ 135845 136832 137523 137244 136267 135203 134044 132499 130939 130074 129763 129048 127479 125646 124179 122953 121592
53032A21592j456j248q71m15N8K52P2l5K25K69n06j499j470l03Q11R81N27R2k42
$$ 121592 120136 118888 118017 117602 117660 117912 117984 117949 118174 118443 117937 116438 114968 114665 115476 116457 116984 117076 116834
53013A16834n61o31l20N6K79O39J277J591R77o1l42M02J051O05m22o98N1P44N67
$$ 116834 116273 115642 115322 115378 115657 116296 117573 119164 120141 120080 119738 120140 121191 121796 121374 120676 120727 121471 122038
52994A22038J00J97M95L9r41j169l77Q0o82j571j111K37P68J28k34O30J836K164
$$ 122038 122138 122335 122830 122869 121928 120759 120382 120462 119780 118209 117098 117335 118103 118231 117997 118627 120463 122627
52976A22627J795J746K284K895L371L952M447M196L147K220K132K375K064J301
$$ 122627 124422 126168 128452 131347 134718 138670 143117 147313 150460 152680 154812 157187 159251 160552
52962A60552R43J106R38K7q13q50o15j018j798j972j482j165j195q04J66P35L31
$$ 160552 161495 162601 163539 163566 162753 161903 161288 160270 158472 156500 155018 153853 152658 151854 152020 152755 153086
52945A53086l14m89o94j496k172j719o32k87q52j100l13P80J229R88M76j05m99
$$ 153086 152772 152283 151589 150093 147921 146202 145570 145283 144431 143331 143018 143798 145027 146015 146491 146386 145887
52928A45887k42O81J500J535J065Q18Q62N28n31j726k143j558n95N4L35O32J104
$$ 145887 145645 146326 147826 149361 150426 151244 152106 152634 152103 150377 148234 146676 146081 146135 146470 147102 148206
52911A48206J543J751J710J373P02K4j52J25K16j94n83l79J97N73O96Q64J072
$$ 148206 149749 151500 153210 154583 155285 155309 155157 155282 155498 155304 154721 154342 154539 155112 155808 156672 157744
52894A57744J130J232J755K581L054K674J472r7j346j651j044k54J41L54P41J072
$$ 157744 158874 160106 161861 164442 167496 170170 171642 171545 170199 168548 167504 167250 167391 167745 168486 169558
52878A69558R90P77Q88J084Q71M84N25P87N24j88m24P8M56J34l27k38K35O90J287
$$ 169558 170548 171325 172213 173297 174168 174652 175177 175964 176488 176300 175876 175954 176410 176544 176217 175979 176214 176904 178191
52859A78191K192K819K452J328M01K24N87J125J697K267K799L317L792M042L964
$$ 178191 180383 183202 185654 186982 187383 187607 188194 189319 191016 193283 196082 199399 203191 207233 211197
52844B11197L756L669L581L089K031Q35K47O31J417J395r8k358l892l909k893
$$ 211197 214953 218622 222203 225292 227323 228158 228405 229036 230453 231848 231750 229392 225500 221591 218698
52829B18698j835j322j398j826k196k235k201k601l323l607l129k618k761l091
$$ 218698 216863 215541 214143 212317 210121 207886 205685 203084 199761 196154 193025 190407 187646 184555
52815A84555k640j484p22r22j411j410j145j306j891k240k038j619j321j110r37
$$ 184555 181915 180431 179709 178787 177376 175966 174821 173515 171624 169384 167346 165727 164406 163296 162359
52800A62359r47j115j125q89p75r91j191j087j048j507k106k163j774j644j866
$$ 162359 161412 160297 159172 158283 157508 156517 155326 154239 153191 151684 149578 147415 145641 143997 142131
52785A42131j775j138o46q29j267j378j316j560k077k392k143j265p8N81%j315
$$ 142131 140356 139218 138572 137743 136476 135098 133782 132222 130145 127753 125610 124345 124267 124848 124848 123533
52769A23533j928j337o72r72j649j597r78p70j120j365j346j472j674j447q90
$$ 123533 121605 120268 119596 118624 116975 115378 114400 113630 112510 111145 109799 108327 106653 105206 104316
52754A04316o67r03j143j323j807k340k053p28P81J558J366L46j116k220k291
$$ 104316 103649 102746 101603 100280 98473 96133 94080 93352 94133 95691 97057 97403 96287 94067 91776
52739I1776j682j307j317j148p91q65j356j426q54m00m25k88L35P43M78J96N33
$$ 91776 90094 88787 87470 86322 85531 84666 83310 81884 81030 80630 80205 79917 80252 80995 81473 81669 82202
52722H2202R42O32k07r21j396j704j460m67N36P22L20P0M2j94n22m30P4M93O82
$$ 82202 83144 83776 83569 82648 81252 79548 78088 77621 78157 78879 79199 79269 79311 79117 78595 78165 78239 78732 79414
52703G9414Q90J106J046P25M81M86P53J366K191K587K084J204Q89J150J030M5
$$ 79414 80304 81410 82456 83181 83662 84148 84901 86267 88458 91045 93129 94333 95222 96372 97402 97447
52687I7447j040j180l78L62K51n18j167j274j089r82r35q06p81j125j655j938
$$ 97447 96407 95227 94849 95211 95462 94944 93777 92503 91414 90432 89497 88691 87910 86785 85130 83192
52671H3192j952j958j832j268o07n88j117j200m41K66J04n23p77n07J4P09J273
$$ 83192 81240 79282 77450 76182 75575 74987 73870 72670 72229 72495 72599 72076 71299 70792 70806 71515 72788
52654G2788R67k59j100m66Q25J064l4j183j524j445j427j227n98J35O19R21J136
$$ 72788 73755 73496 72396 71930 72755 73819 73785 72602 71078 69633 68206 66979 66381 66516 67135 68056 69192
52637F9192J122R33R76J430J944K182K243K325K293J862J057K16m10r29j638k519
$$ 69192 70314 71247 72223 73653 75597 77779 80022 82347 84640 86502 87559 87775 87365 86436 84798 82279
52621H2279l012k627j699j118j093q83m6P10N24k96p45n33j47J41M88Q05P60M96
$$ 82279 79267 76640 74941 73823 72730 71847 71801 72511 73035 72739 71994 71461 71314 71455 71943 72748 73508 74004
52603G4004N14Q77J116J071J047J165J220J334J854K497K382J318K70J36N93P05
$$ 74004 74518 75395 76511 77582 78629 79794 81014 82348 84202 86699 89081 90399 90669 90805 91398 92103
52587I2103K38k15j64J97L20k6m44k18Q70K110K561K119J540J437J694J887J793
$$ 92103 92341 92126 91962 92159 92479 92453 92009 91791 92661 94771 97332 99451 100991 102428 104122 106009 107802
52570A07802J339N78k9J37J067J875J822J246J100J706K349K181J216L26K28P07
$$ 107802 109141 109719 109690 109827 110894 112769 114591 115837 116937 118643 120992 123173 124389 124715 124943 125650
52554A25650R27N48J37L20Q67J050O65J76r9k94m99m32J48J090K003K483K200
$$ 125650 126577 127125 127262 127582 128449 129499 130164 130340 130241 129947 129448 129016 129164 130254 132257 134740 136940
52537A36940J201J56k04K6P3l37n66r0O45Q67N66L34M08M34J62j63k56k99o74
$$ 136940 138141 138297 138093 138119 138192 137855 137289 137199 137844 138711 139277 139611 140019 140453 140615 140452 140196 139897 139223
52518A39223j281j457p52L41Q18L91j27K4M84L72l26p14l23L11N45M20K29p2n43
$$ 139223 137942 136485 135733 136074 136892 137283 137156 137180 137664 138036 137710 136996 136673 136984 137529 137949 138178 138106 137563
52499A37563q35o18j17K10K83L05K73J24Q3M62J112J570J659J567J331Q08J17
$$ 137563 136728 136110 135993 136203 136486 136791 137064 137188 137271 137733 138845 140415 142074 143641 144972 145780 145897
52482A45897k60j12K03L07L70P72J431J851J792J485J113N53j73n77l04K28K73
$$ 145897 145637 145525 145728 146035 146405 147177 148608 150459 152251 153736 154849 155402 155229 154652 154348 154576 154849
52465A54849j72l74j5L64L11K07N20Q65N51k22n48p6O57J127J325J309R70M87
$$ 154849 154677 154303 154288 154652 154963 155170 155690 156555 157106 156884 156336 156260 156917 158044 159369 160678 161648 162135
52447A62135L95Q07J134R37N28M19N21L74k02j045j855k239j879j028m29l89l56
$$ 162135 162530 163337 164471 165408 165936 166355 166876 167250 167048 166003 164148 161909 160030 159002 158573 158184 157828
52430A57828R4M29l0r18j306j093r58j054p82p1J88n31j406j385o32j24j68k06
$$ 157828 157922 158351 158321 157403 156097 155004 154046 152992 152210 152139 152327 151796 150390 149005 148373 148249 148081 147875
52412A47875R3M14N29P53J336J909J906J317O26K28J33J77L24P01J457K507L418
$$ 147875 147968 148382 148911 149664 151000 152909 154815 156132 156758 156986 157119 157296 157620 158321 159778 162285 165703
52395A65703L692L201K269J300N16J0k04k74m10n68m73m2M61P90R75J098J121
$$ 165703 169395 172596 174865 176165 176681 176691 176487 176213 175803 175235 174762 174720 175181 175971 176946 178044 179165
52378A79165J191J608K285K588K174J540J292J211P90L05N47J514K268K266J983
$$ 179165 180356 181964 184249 186837 189011 190551 191843 193054 193844 194149 194696 196210 198478 200744 202727
52363B02727K008K207K214K050J850J537J186J261J968K731K854K376J860J664
$$ 202727 204735 206942 209156 211206 213056 214593 215779 217040 219008 221739 224593 226969 228829 230493
52349B30493J836K374L091L449L027K056J153O87P03J137J775K141J936J389R53
$$ 230493 232329 234703 237794 241243 244270 246326 247479 248166 248869 250006 251781 253922 255858 257247 258200
52334B58200Q22R67J360J862K153K177K249K453K369J821J385J615K243K718L082
$$ 258200 259022 259989 261349 263211 265364 267541 269790 272243 274612 276433 277818 279433 281676 284394 287476
52319B87476L558L745L197K417K343K962L451L596L992M751N165M961M820N232
$$ 287476 291034 294779 297976 300393 302736 305698 309149 312745 316737 321488 326653 331614 336434 341666
52305C41666N780O117O781Q273J0018J1071J1470J2065J3245J4484J5122J5030
$$ 341666 347446 353563 360344 368617 378635 389706 401176 413241 426486 440970 456092 471122
52293D71122J4535J4145J4332J5249J6595J7923J8994J9726K0005J9841J9526
$$ 471122 485657 499802 514134 529383 545978 563901 582895 602621 622626 642467 661993
52282F61993J9393J9455J9573J9769K0069K0124J9369J7707J5736J4198J3294
$$ 661993 681386 700841 720414 740183 760252 780376 799745 817452 833188 847386 860680
52271H60680J2694J2086J1430J0587R105O732M088K286J730J653J104Nj139k201
$$ 860680 873374 885460 896890 907477 916582 923314 927402 929688 931418 933071 934175 934180 933041 930840
52257I30840l491m960n976o092n607n195n202n493n720n575m947l978k902j876
$$ 930840 927349 922389 916413 910321 904714 899519 894317 888824 883104 877529 872582 868604 865702 863826
52243H63826r44JJ273L164N409P232Q263R047J0251J1673J2674J3294J4130J5124
$$ 863826 862882 862883 864156 867320 872729 879961 888224 897271 907522 919195 931869 945163 959293 974417
52229I74417J5390J4530J3317J2669J2522J2218J1569J0891J0271R361P885N922
$$ 974417 989807 1004337 1017654 1030323 1042845 1055063 1066632 1077523 1087794 1097155 1105040 1110962
52217A110962L695J375q46k717m114n190o231p360q444r298r992j0819j2020j3549
$$ 1110962 1114657 1116032 1115186 1112469 1108355 1103165 1096934 1089574 1081130 1071832 1061840 1051021 1039001 1025452
52203A025452j5077j6099j6191j5494j4806j4757j4914j4287j2847j1751j1712
$$ 1025452 1010375 994276 978085 962591 947785 933028 918114 903827 890980 879229 867517
52192H67517j1940j1323r938q600p470o157m879m370m637m782m217l230k294j561
$$ 867517 855577 844254 834316 825716 818246 812089 807210 802840 798203 793421 789204 785974 783680 782119
52178G82119j208j524k354l097l405l412l183k613j955j754k028k181j919j625
$$ 782119 780911 779387 777033 773936 770531 767119 763936 761323 759368 757614 755586 753405 751486 749861
52164G49861j655j878k140k563l059l222k943k702k884l289l600l815m014m076
$$ 749861 748206 746328 744188 741625 738566 735344 732401 729699 726815 723526 719926 716111 712097 708021
52150G08021l880l432k783k174k184l095m186m349l516k716k653k971l130l101
$$ 708021 704141 700709 697926 695752 693568 690473 686287 681938 678422 675706 673053 670082 666952 663851
52136F63851k999k753k507k638l116l478l648l943m180l694k585j921k202k649
$$ 663851 660852 658099 655592 652954 649838 646360 642712 638769 634589 630895 628310 626389 624187 621538
52122F21538k581k554l275m228m294l179j497O3J047J209Q88R02J579K333K731
$$ 621538 618957 616403 613128 608900 604606 601427 599930 599993 601040 602249 603137 604039 605618 607951 610682
52107F10682L257M398N729O615P241Q135R228J0182J1176J2512J3896J4918J5801
$$ 610682 613939 618337 624066 630681 637922 646057 655285 665467 676643 689155 703051 717969 733770
52094G33770J6992J8348J9528K0739K2323K3912K4812K4995K4951K4877K4643
$$ 733770 750762 769110 788638 809377 831700 855612 880424 905419 930370 955247 979890
$$ [...]
##END NTUPLES=NMR SPECTRUM
##END=
