
##TITLE=AC1195_HLPAH12056_5946199_6pTzT2tSeK
##JCAMPDX= 6.0         $$ Bruker NMR JCAMP-DX V2.0
##DATA TYPE= NMR SPECTRUM
##DATA CLASS= NTUPLES
##ORIGIN= BRUKER
##OWNER= Administrator
$$ 1.72 TOPSPIN		Version 2.1
$$ 2012-04-10 21:48:34.171 -0500  Administrator@TOPSPIN
$$ Compression mode = diff/dup
##.OBSERVE FREQUENCY= 400.13188235
##.OBSERVE NUCLEUS= ^1H
##.ACQUISITION MODE= SIMULTANEOUS (DQD)
##.ACQUISITION SCHEME= undefined
##.AVERAGES= 8
##.DIGITISER RES= 22
##SPECTROMETER/DATA SYSTEM= spect
##.PULSE SEQUENCE= zg30
##.SOLVENT NAME= COFFEE_meoh
##.SHIFT REFERENCE= INTERNAL, COFFEE_meoh, 1, 14.98061
##AUDIT TRAIL= $$ (NUMBER, WHEN, WHO, WHERE, PROCESS, VERSION, WHAT)
$$ ##TITLE= Audit trail, TOPSPIN		Version 2.1
$$ ##JCAMPDX= 5.01
$$ ##ORIGIN= Bruker BioSpin GmbH
$$ ##OWNER= Administrator
$$ $$ C:\Bruker\TOPSPIN/data/COFFEE/nmr/AC1195_HLPAH12056_5946199_6pTzT2tSeK/10/pdata/1/auditp.txt
$$ ##AUDIT TRAIL=  $$ (NUMBER, WHEN, WHO, WHERE, PROCESS, VERSION, WHAT)
(   1,<2012-04-10 21:48:27.343 -0500>,<Administrator>,<TOPSPIN>,<go>,<TOPSPIN 2.1>,
      <created by zg
	started at 2012-04-10 21:47:20.375 -0500,
	POWCHK enabled, PULCHK disabled,
       configuration hash MD5:
       1A 1E CE 29 27 FD 77 03 67 4E F0 E3 C4 B2 CB 90
       data hash MD5: 64K
       B2 3D 22 AA 7A 07 9F 54 66 F0 A5 75 D0 67 87 6D>)
(   2,<2012-04-10 21:48:30.031 -0500>,<Administrator>,<TOPSPIN>,<proc1d>,<TOPSPIN 2.1>,
      <Start of raw data processing
       efp LB = 0 FT_mod = 6 PKNL = 1 PHC0 = 0 PHC1 = 0 SI = 32K 
       data hash MD5: 32K
       81 EE 38 6F 3A 98 B3 8C 0F 71 86 9E 57 91 8F 10>)
(   3,<2012-04-10 21:48:30.453 -0500>,<Administrator>,<TOPSPIN>,<proc1d>,<TOPSPIN 2.1>,
      <pk PHC0 = 206.8945 PHC1 = 0 
       data hash MD5: 32K
       02 76 0C 21 D8 9E C3 4E DC CB 91 76 7B 0C 38 DC>)
(   4,<2012-04-10 21:48:30.546 -0500>,<Administrator>,<TOPSPIN>,<proc1d>,<TOPSPIN 2.1>,
      <abs ABSG = 1 
       data hash MD5: 32K
       14 4A 4F C3 1B EC 12 EA ED 78 AB 52 F7 E7 16 51>)
(   5,<2012-04-10 21:48:30.578 -0500>,<Administrator>,<TOPSPIN>,<proc1d>,<TOPSPIN 2.1>,
      <abs ABSG = 2 
       data hash MD5: 32K
       D0 6E 57 83 4F 74 ED E3 5D 4E 42 8C 96 5F 15 4C>)
(   6,<2012-04-10 21:48:30.609 -0500>,<Administrator>,<TOPSPIN>,<proc1d>,<TOPSPIN 2.1>,
      <abs ABSG = 3 
       data hash MD5: 32K
       F5 C7 24 E8 D3 C1 A8 90 61 0F 99 3A 45 47 E8 37>)
(   7,<2012-04-10 21:48:30.640 -0500>,<Administrator>,<TOPSPIN>,<proc1d>,<TOPSPIN 2.1>,
      <abs ABSG = 4 
       data hash MD5: 32K
       2A A2 E2 2F FB B2 87 A7 BE B2 86 4B 8F 30 1B 1C>)
(   8,<2012-04-10 21:48:30.671 -0500>,<Administrator>,<TOPSPIN>,<proc1d>,<TOPSPIN 2.1>,
      <abs ABSG = 5 
       data hash MD5: 32K
       2B EF 57 FE EF EF 75 EC A2 1E D3 01 8B E8 8D BC>)
$$ ##END=
$$ 
$$ $$ hash MD5
$$ $$ F2 21 A0 D3 8B E7 9A C3 3F 76 4E 7C 08 DC 2A 7F
##$RELAX= 
##$RELAX= 
##$RELAX= 
##$RELAX= 
##$RELAX= 
##$RELAX= 
##$RELAX= 
$$ Bruker specific parameters
$$ --------------------------
$$ [...]
##$TP= (0..7)
150 150 150 150 150 150 150 150
##$TP07= 0
##$TPNAME0= <>
##$TPNAME1= <>
##$TPNAME2= <>
##$TPNAME3= <>
##$TPNAME4= <>
##$TPNAME5= <>
##$TPNAME6= <>
##$TPNAME7= <>
##$TPOAL= (0..7)
0.5 0.5 0.5 0.5 0.5 0.5 0.5 0.5
##$TPOFFS= (0..7)
0 0 0 0 0 0 0 0
##$TUNHIN= 0
##$TUNHOUT= 0
##$TUNXOUT= 0
##$USERA1= <user>
##$USERA2= <user>
##$USERA3= <user>
##$USERA4= <user>
##$USERA5= <user>
##$V9= 5
##$VALIST= <valist>
##$VCLIST= <CCCCCCCCCCCCCCC>
##$VD= 0
##$VDLIST= <DDDDDDDDDDDDDDD>
##$VPLIST= <PPPPPPPPPPPPPPP>
##$VTLIST= <TTTTTTTTTTTTTTT>
##$WBST= 1024
##$WBSW= 4
##$XGAIN= (0..3)
0 0 0 0
##$XL= 0
##$YL= 0
##$YMAX_a= 517145
##$YMIN_a= -657478
##$ZGOPTNS= <>
##$ZL1= 120
##$ZL2= 120
##$ZL3= 120
##$ZL4= 120
##$ABSF1= 14.98061
##$ABSF2= -5.57192
##$ABSG= 5
##$ABSL= 3
##$ALPHA= 0
##$AQORDER= 0
##$ASSFAC= 0
##$ASSFACI= 0
##$ASSFACX= 0
##$ASSWID= 0
##$AUNMP= <proc_prof1d_extract_pilot.lims>
##$AXLEFT= 0
##$AXNAME= <>
##$AXNUC= <1H>
##$AXRIGHT= 0
##$AXTYPE= 0
##$AXUNIT= <>
##$AZFE= 0.1
##$AZFW= 0.1
##$BCFW= 0
##$BC_mod= 0
##$BYTORDP= 0
##$COROFFS= 0
##$CY= 15
##$DATMOD= 1
##$DC= 0
##$DFILT= <>
##$DTYPP= 0
##$F1P= 0
##$F2P= 0
##$FCOR= 0.5
##$FTSIZE= 32768
##$FT_mod= 6
##$GAMMA= 0
##$GB= 0
##$INTBC= 1
##$INTSCL= 1
##$ISEN= 128
##$LB= 0
##$LEV0= 0
##$LPBIN= 0
##$MAXI= 10000
##$MC2= 0
##$MEAN= 0
##$ME_mod= 0
##$MI= 0
##$NCOEF= 0
##$NC_proc= -8
##$NLEV= 6
##$NOISF1= 0
##$NOISF2= 0
##$NSP= 0
##$NTH_PI= 0
##$NZP= 0
##$OFFSET= 14.98061
##$PC= 1
##$PHC0= 206.8945
##$PHC1= 0
##$PH_mod= 1
##$PKNL= yes
##$PPARMOD= 0
##$PPDIAG= 0
##$PPIPTYP= 0
##$PPMPNUM= 2147483647
##$PPRESOL= 1
##$PSCAL= 4
##$PSIGN= 0
##$PYNMP= <proc.py>
##$REVERSE= no
##$SF= 400.13
##$SI= 32768
##$SIGF1= 0
##$SIGF2= 0
##$SINO= 400
##$SIOLD= 32768
##$SPECTYP= <>
##$SREGLST= <1H.CDCl3>
##$SSB= 0
##$STSI= 32768
##$STSR= 0
##$SW_p= 8223.68421052632
##$SYMM= 0
##$S_DEV= 0
##$TDeff= 65536
##$TDoff= 0
##$TI= <>
##$TILT= no
##$TM1= 0
##$TM2= 0
##$TOPLEV= 0
##$USERP1= <user>
##$USERP2= <user>
##$USERP3= <user>
##$USERP4= <user>
##$USERP5= <user>
##$WDW= 1
##$XDIM= 32768
##$YMAX_p= 460121620
##$YMIN_p= -776435
##$CURPLOT= <Network HP LaserJet P1505>
##$CURPRIN= <$Network HP LaserJet P1505>
##$DFORMAT= <normdp>
##$LAYOUT= <+/1D_H.xwp>
##$LFORMAT= <normlp>
##$PFORMAT= <normpl>
##$SURQMSG= 1
$$ End of Bruker specific parameters
$$ ---------------------------------
##NTUPLES= NMR SPECTRUM
##VAR_NAME=  FREQUENCY,     SPECTRUM/REAL,   SPECTRUM/IMAG
##SYMBOL=    X,             R,               I
##VAR_TYPE=  INDEPENDENT,   DEPENDENT,       DEPENDENT
##VAR_FORM=  AFFN,          ASDF,            ASDF
##VAR_DIM=   32768,         32768,           32768
##UNITS=     HZ,            ARBITRARY UNITS, ARBITRARY UNITS
##FACTOR=    0.250966925370066, 1,           1
##FIRST=     8223.43324360095, 48792,        -251
##LAST=      0,             51726,           -136966
##MIN=       0,             -776435,         0
##MAX=       8223.43324360095, 460121620,    0
$$ Real data points
##PAGE= N=1
##DATA TABLE= (X++(R..R)), XYDATA
$$ [...]
19462C51830c29020a20895j05174D9198a09279r8981A40197b17970B48a88866
19451a8928E6834a96278N4066M7220L2348A69274a20953m9923j64852A2548a52957
19439a49865l7954D260K2914b97929j73813f9466A38433b66420M4992A52054D108
19427d17028H5723N2706b12637C0926g3742o158A47783g6867j29209B12273q7768
19416A24505i2482k42975J43301j93689a15719A17280f3034F8790e6311q5929
19406a42240o7978I1742K10350c1756E8554b37554B36073E8713O6059d2293p8682
19395a20975p6763A24247F1989a90734r9477d0321j66044a6955j08558b0784A51527
19383c89930h7893j08775L1470I2313c5633k6728k52747O8842j8594b3897H2783
$$ y = [351830, -329020, -120895, -226069, 49198, -109279, -208260, 140197, -217970, 248, -188866, -18928, 56834, -196278, -142212, -94992, -62644, 169274, -120953, -170876, -335728, 12548, -152957, -149865, -187819, 4260, 27174, -297929, -471742, -69466, 138433, -266420, -221428, 152054, 4108, -417028, 85723, 138429, -212637, 30926, -73742, -79900, 147783, -76867, -206076, 212273, 124505, -92482, -335457, -192156, -385845, -115719, 117280, -63034, 68790, -56311, -142240, -210218, 91742, 302092, -31756, 58554, -237554, 236073, 58713, 124772, -42293, -120975, -197738, 124247, 61989, -190734, -290211, -40321, -206365, -16955, -125513, -20784, 151527, -389930, -87893, -196668, -165198, 92313, -35633, -62361, -315108, -246266, -264860, -23897, 82783]
19371b17645A47498k5941P1332c17283O7716J2391L6899f1221C0856a04164j84487
19360b88651E03500B32181a95546b8097j92122O1299I9929f744A20526a84013
19349a05581N0416B63992f0713j17431j64380e1887K2174A43898E3637a71397
19338A04233a32287A1049L02616G6970d606o7950G3353a86237c3186j43922O3432
19327a13676j09022A3765K30403i8977A30566h7203b9826k98295j29811a70753
19316h4339C3175f7304I5714a33624c438l84868f7877B8947b39129n6008O2309
19305b32828p0586q9912A2762Q5812c37707c0330L859A33581D5190c10144P6758
19294b33386h3650A60494c04636A32669g4002C34510a0621o3862A46404a34396
$$ y = [-217645, 147498, 121557, 192889, -317283, -249567, -237176, -200277, -61221, 30856, -104164, -288651, 503500, 232181, -195546, -28097, -220219, -158920, 99929, -6744, 120526, -184013, -105581, -55165, 263992, -60713, -178144, -342524, -51887, -29713, 143898, 53637, -171397, 104233, -132287, 11049, 313665, 76970, -4606, -72556, 73353, -186237, -33186, -177108, -113676, -222698, 13765, 244168, -98977, 130566, -87203, -29826, -328121, -457932, -170753, -84339, 33175, -67304, 95714, -133624, -3438, -388306, -67877, 28947, -239129, -295137, -232828, -303414, -393326, 12762, 98574, -337707, -30330, -26471, 133581, 45190, -310144, -233386, -83650, 160494, -304636, 132669, -74002, 334510, -10621, -74483, 146404, -134396]
19283i3889d2266F0416k4623Q5882a96823G2827j3837b28135j8596R0384n9311
19272b15658I1766d0696M822C73945b8157A0202c72165a37616F5850J48128G5240
19260i9767D5b83408D6081c34897J40512i6473l7019N2280k30629A66064c44559
19248A82817d7275L219j28938Q6325j09760a9899k00077m9179N0658r4764A35880
19236a36B2174g4774A44436b13145B61088b97751c8712j37537E6761a12465J9409
19225i3056K9823j36316j32316J8422a21464k70979A85573a32132j09108j08101
19215c49341c4469D3367J91364a30533D1008a62373E9639a14585J1996b3450I4643
19203B50672m7228g6489o2756L7530L7241B10722b16149J3519F6756b93174f2625
$$ y = [-93889, -42266, 60416, 35793, 121675, -196823, 72827, 58990, -228135, -246731, -156347, -215658, 91766, -40696, -35874, 373945, -28157, 10202, -372165, -137616, 65850, 213978, 75240, -99767, 45, -283408, 46081, -334897, -194385, -96473, -133492, -81212, -311841, 166064, -344559, 182817, -47275, -44056, -172994, -86669, -196429, -19899, -219976, -269155, -218497, -313261, 135880, -136, 22174, -74774, 144436, -213145, 261088, -297751, -38712, -176249, 56761, -112465, -93056, -63233, -199549, -331865, -313443, -121464, -392443, 185573, -132132, -241240, -349341, -34469, 43367, 234731, -130533, 41008, -162373, 59639, -114585, -102589, -23450, 94643, 250672, 203444, -76489, -139245, -101715, -64474, 210722, -216149, -202630, 66756, -293174, -62625]
19191h3853L9001j9084B00770a75358e849l58432J67731A6594i0162n2214b6194
19179a44358a7793j74496F3972C339a64185n6326H4009c1276H8550o923L7958
19168A19585E2492d1470j071N871l46729R8110c7969k38861E3996M7021b98436
19156D0577J18872d22785J18329h7323C5505L19713b121j45305a6133j68563j45426
19145c30122C35974e7257J889I2737e7851j38475F0511b5592J1326B58840l4187
19134B24653a43745B49752a00215j12930B0445J1125F299b27314A94509a26273
19123d1329j02751A11685d65892J84351B05335a03706k33764a39777C705a18348
19112e323l56692a1302B2584K9860a37001a1585k22599p8903j3496C25377b81405
$$ y = [-83853, -44852, -63936, 200770, -175358, -5849, -364281, -196550, 16594, -90162, -142376, -26194, -144358, -17793, -192289, 63972, 3339, -164185, -220511, 84009, -31276, 88550, 81627, 119585, 52492, -41470, -42541, -36670, -383399, -285289, -37969, -276830, 53996, 101017, -298436, 40577, 159449, -422785, -304456, -87323, 35505, 355218, -2121, -147426, -16133, -184696, -330122, 335974, -57257, -55368, 92737, -57851, -196326, 60511, -25592, -14266, 258840, 224653, -143745, 249752, -100215, -213145, 20445, 31570, 6299, -227314, 194509, -126273, -41329, -144080, 111685, -465892, -281541, 205335, -103706, -337470, -139777, 3705, -118348, -5323, -362015, -11302, 22584, 52444, -137001, -11585, -234184, -313087, -326583, 325377, -281405]
19100A01678a58630N4680j30316O7071j30977e7775l54635J44815a07247I6793
19089b98258i1826E4939b23417a01561j5301A08736J09989c8489d949j56698A03312
19077I6913a82855d7388C53474i4056k5314B1714a06507M2313j07596P930f0051
19065C11157H2353C2217J71215e4163C5668b72616A11272B1526J28076i7603d6738
19053B46317r0112d0022B22875o1254K4227c12385B9143J61441b2375j01432B0760
19041A32224H162a76267b5133m03870A76405H5119h0660q422C4650K66147A19585
19029A26775c06091m1717A23228R6683g3927d370E6938f2062B40201E1370Q184
19018E9554K5325L32858b3800k9206a3914j34008B78316o4699b94784I9848K02010
$$ y = [101678, -158630, -103950, -234266, -167195, -298172, -57775, -412410, -267595, -107247, 96793, -298258, -91826, 54939, -223417, -101561, -116862, 108736, 218725, -38489, -4949, -161647, 103312, 96913, -182855, -47388, 353474, -94056, -119370, 21714, -106507, -64194, -171790, -163860, -60051, 311157, 82353, 32217, 203432, -54163, 35668, -272616, 111272, 21526, 149602, -97603, -46738, 246317, 156205, -40022, 222875, 161621, 185848, -312385, 29143, 190584, -22375, -123807, 20760, 132224, 8162, -176267, -25133, -429003, 176405, 85119, -80660, -89082, 34650, 300797, 119585, 126775, -306091, -347808, 123228, 219911, -73927, -4370, 56938, -62062, 240201, 51370, 59554, 84879, 417737, -23800, -53006, -13914, -147922, 278316, 213617, -294784, 99848, 301858]
19007C01858A22825h0338A57606h1255I5630a07580G9451b54976h261D6163R5262
18996A41425C3626c04499A87794b12221j1443i7463H5615b19661K9398E4980c85340
18984a61145c4075l16445Q3179B26005d7034c209j9510l53477J74783g3608j25468
18973a99076r3249i183C08123F8421K3273f9386K9501n2909a7377j90182I9226
18961A88637G1928J3732N4702P0257J49893J34391A35173D8062a26571A24030
18950b3752j02034N2869j34158A45917h6734L5908D9127j1084a27712k1588C2819
18938h8361k27352a13552C89222A6874a75742B41563I0223a16153e3212j03563
18928a56775j6582j3024n1706k4993A44366L8630b6083k10752p717A37231b56091
$$ y = [301858, 122825, -80338, 157606, -81255, 95630, -107580, 79451, -254976, -8261, 46163, 141425, 33626, -304499, 187794, -212221, -223664, -97463, 85615, -219661, -190263, 54980, -385340, -161145, -34075, -350520, -267341, 226005, -47034, -3209, -22719, -376196, -201413, -73608, -199076, -292325, -9183, 308123, 68421, 91694, -69386, -39885, -92794, -17377, -207559, 99226, 188637, 71928, 85660, 140362, 210619, 360512, 494903, 135173, 48062, -126571, 124030, -23752, -125786, -72917, -207075, 145917, -86734, -50826, 49127, 38043, -127712, -149300, 32819, -88361, -315713, -113552, 389222, 16874, -175742, 241563, 90223, -116153, -53212, -156775, -173357, -186381, -238087, -263080, 144366, 182996, -26083, -236835, -244552, 137231, -256091]
18916A20505i3154I238b54617e8506k96409N4322B00778g4257C96009g9852b5127
18904h7257B1950a24653A35141e9756a3470o6531G0982K1644L17619J0635n3578
18893C67302p5932A02511k6380k6432b41208A96106m9915a78483L3253B8098J80515
18882B08613a09761B64795c33600a18440K3997j20741G9105i3699B24864a6044
18871g1982A77912a06455A93653a63347K6223j57480b6803q5186j9074j30165
18861b61228F5810a05565j8911A77057g5036D0584L2104b54014h5402k02080F0857
18849b86787O4434A34131i9190c3003m1074k23404A0929a67182g8075k24362J1326
18838b91111N643A94900h3505j73857B90659a77568B07007d2587I5917b46742
$$ y = [120505, -93154, 9238, -254617, -58506, -354915, -300593, 200778, -74257, 396009, -79852, -25127, -87257, 21950, -124653, 135141, -59756, -13470, -80001, 70982, 92626, 410245, 420880, 367302, 291370, 102511, 76131, 49699, -241208, 196106, 146191, -178483, -145230, 28098, 208613, -109761, 264795, -333600, -118440, -94443, -215184, 79105, -93699, 224864, -16044, -71982, 177912, -106455, 193653, -163347, -137124, -294604, -26803, -111989, -131063, -261228, 65810, -105565, -124476, 177057, -75036, 40584, 72688, -254014, -85402, -287482, 60857, -286787, -222353, 134131, -99190, -33003, -74077, -297481, 10929, -167182, -78075, -302437, -291111, -285468, 194900, -83505, -257362, 290659, -177568, 207007, -42587, 95917, -246742]
18827E9375a55419q6603B09116b18218f0784b2461k0310r3349j57489b9869A1596
18815b11770g8734B49470a33994B80912n5156o8230p0107b58134A66170i6618
18804a97744c9291A72360b67469a2723B29501a08347D2637g6514C72785J7755
18794C90540A81167b2149A77088E523f3409C6285A2139L01758c9324j26406B0144
18782c00l3237j01413j33123g1434I6168k8329a11775B49052C3312J2742J9143
18771F5197a16345D6505a75064j04849I0278a12344k113k32405E9471K91567A19323
18759B01217M4994f4351q983K3468B03015c2692k39933B35065a75114F4100a54819
18747B59336c3936n7200A43742h5189a8663A14975a4637k3709j40551A51148a13521
$$ y = [59375, -155419, -242022, 209116, -218218, -60784, -22461, -42771, -136120, -293609, -29869, 11596, -211770, -78734, 249470, -133994, 280912, 225756, 157526, 87419, -258134, 166170, -96618, -197744, -39291, 172360, -267469, -12723, 229501, -108347, 42637, -76514, 372785, 390540, 181167, -22149, 177088, 5523, -63409, 36285, 12139, 313897, -39324, -165730, 20144, -300, -33537, -134950, -268073, -71434, 96168, 67839, -111775, 249052, 33312, 46054, 65197, -116345, 46505, -175064, -279913, 90278, -112344, -114457, -346862, 59471, 351038, 119323, 201217, 246211, -64351, -73334, -49866, 203015, -32692, -272625, 235065, -175114, 64100, -154819, 259336, -33936, -91136, 143742, -85189, -18663, 114975, -14637, -38346, -178897, 151148, -113521]
18735b46317J09110E113b14380h0292l54574h822L579A82874c84472B8723K3376
18724E2099m228a85690L8814a0199l85215i9930r2792g5554A50015a84552f612
18712a75015A84410j756b83307B60341L0778f4733B4433O1934h0227K6605A82313
18700A74450b77234k09568a45368q2118g1626k67184h7633b223j57020M4603A41823
18688C4050c30452C74h9873B08783i6465B018b97356J15693d0287j44349J2747
18677a71889E4895d1261A57711i0204o8090b8971j11867N800A28212J18886d2340
18665b59180J26098H8507i8290C41447i9774j4091H3744d2548a3658o3347A46057
18653a18604e5216F804a93692P0752a2466j44636A53654J58474g168r5360j75974
$$ y = [-246317, -137207, 5113, -214380, -80292, -434866, -8822, -5243, 182874, -384472, 28723, 52099, 47871, -185690, -146876, -10199, -395414, -99930, -192722, -75554, 150015, -184552, -6612, -175015, 184410, 182654, -283307, 260341, 291119, -64733, 24433, 86367, -80227, -53622, 182313, 174450, -277234, -486802, -145368, -227486, -71626, -338810, -87633, -2223, -159243, -114640, 141823, 34050, -330452, 374, -89873, 208783, -96465, 2018, -297356, -181663, -40287, -184636, -171889, 54895, -41261, 157711, -90204, -158294, -28971, -140838, -135038, 128212, 247098, -42340, -259180, -133082, 88507, -98290, 341447, -99774, -113865, 83744, -42548, -13658, -77005, 146057, -118604, -55216, 6804, -193692, -122940, -12466, -157102, 153654, 312128, -7168, -102528, -278502]
18642b78502i7385A96782b26578A89482a91388J0430l5825i9001D03517a91622
18631b13095i3584A7889g4008B98863b55358n5625j2430N3336B8097a58537J976
18620a56561g98B72022E9275K50097a90980A31445a75500B02041d1497j50373
18610a91870B12252b2904k91766a15664K7512q4959A4730b7626k6310j74970n1881
18599b80787b2184B7800L272a1911E7006c50466i3280b2443j43989a9233D71511
18587a20883A09794a45625J1709n0353m7246g2832r9491h2573j32516g1911G3798
18575H0158c0142J4293C8670b85484D0658a5486H1598a65382j0081A33264b09057
18563a89394p2604a7006l20081M4324G086J88556g9174E9046K6438a67074a3318
$$ y = [-278502, -97385, 196782, -226578, 189482, -191388, -180958, -216783, -99001, 403517, -191622, -213095, -93584, 17889, -74008, 298863, -255358, -310983, -323413, -270077, 28097, -158537, -156561, -798, 272022, 59275, 309372, -190980, 131445, -175500, 202041, -41497, -191870, 212252, -22904, -314670, -115664, -88152, -173111, 14730, -27626, -53936, -228906, -280787, -22184, 27800, 31072, -11911, 57006, -350466, -93280, -22443, -166432, -19233, 471511, -120883, 109794, -145625, -133916, -184269, -231515, -72832, -172323, -82573, -215089, -71911, 73798, 80158, -30142, -15849, 38670, -285484, 40658, -15486, 81598, -165382, -175463, 133264, -209057, -189394, -261998, -17006, -337087, -292763, 7086, 195642, -79174, 59046, 85484, -167074, -13318]
18551b27280C0057J40981j9556J55771H1932a8087m19528A13335k4712f0724j79045
18540b39769I2290g5708G6581d3043E0014J94217c28675d352k42385m5228F314
18528a15799j90500i8060K1847a5351k57837B81895A04117b1424k77797A5924
18517C8966a48078A88776M43985a91020b5369E6339c26228g546j77118M0624A57867
18505A93969a27241p9252A98678D5654b21821G4897C7256b26996d4299j41581
18495a85880E6648L7256b8220k12293A74389e9132l67094a68799F0775k2542L27986
18484C66219e2748B73248p4140A0738c72097Q9266C6638b11273D1465a22292k00750
18473c23042B02077D516R8633b5710A10779C2370e3358A75152b27137B93172b90556
$$ y = [-227280, 30057, 171038, 151482, 307253, 81932, -18087, -437615, 113335, 88623, -60724, -239769, 92290, -75708, 76581, -43043, 50014, 244231, -328675, -4352, -246737, -291965, 6314, -115799, -306299, -98060, -76213, -15351, -273188, 281895, 104117, -21424, -299221, 15924, 38966, -148078, 188776, 632761, -191020, -25369, 56339, -326228, -7546, -184664, -144040, 157867, 193969, -127241, -206493, 198678, 45654, -221821, 74897, 37256, -226996, -44299, -185880, 56648, 93904, -28220, -240513, 174389, -59132, -426226, -168799, 60775, 38233, 366219, -52748, 273248, 199108, 10738, -372097, -282831, 36638, -211273, 41465, -122292, -323042, 202077, 4516, 103149, -25710, 110779, 32370, -53358, 175152, -227137, 293172, -290556]
18461G8938k8127J89081d6867j2030K5264n8545o8612O0652F5479b4784A16220
18449c07379H2354b34131c5248A08017J23662C6714a46408j38448A02938D1995
18438h7269j47205a06257H1310k4189b63349J14840A6203P3288a05119I283K6681
18427C5964b69041j23550A1099a30485A58936b72211a04467B20237I4769D1050
18416a49209L1028o6834B5877b9091B50828a4010j39610E0824e2784j99370A2602
18404H0955b35375R4908d3321H6989J10831b1601A22395A0378c54973F4858J16027
18393A80885D5674i5991A14541B4551K95149G2033j5712B0315f5865B02101a2343
18381E2125a6111C3135a62673O6794J6830H6986a74731k82D74K40248B4391a29937
$$ y = [78938, 50811, 239892, -46867, -58897, -33633, -92178, -160790, -100138, 65479, -24784, 116220, -307379, 82354, -234131, -35248, 108017, 231679, 36714, -146408, -284856, 102938, 41995, -87269, -234474, -106257, 81310, 57121, -263349, -148509, 16203, 89491, -105119, 9283, 35964, -269041, -392591, 11099, -130485, 158936, -272211, -104467, 220237, 94769, 41050, -149209, -118181, -185015, 25877, -29091, 250828, -14010, -153620, 50824, -52784, -252154, 12602, 80955, -235375, -140467, -43321, 86989, 197820, -21601, 122395, 10378, -354973, 64858, 180885, 45674, -95991, 114541, 24551, 319700, 72033, 56321, 20315, -65865, 202101, -12343, 52125, -16111, 33135, -162673, -95879, -79049, 86986, -174731, -175013, 474, 240722, 24391, -129937]
18368c8807j73510A92557d3402E7052b02187g4427j8221q3506A6274b79578C6859
18356b18933f8187p2640K9464b1625D4381K03493j19883g2030A95101L2828b71597
18344C6071a61460I4579B1799i0721j10455D600a27344j72314A00771m306k5341
18333G1124f081A6083K38569b80766B83216H9249b27719Q8257G2499k1833i4114
18321b6139C509e7758p4729o343A55120c905k04348A25019J9078J78351g4892
18309a49708A01769a40840O8310N631j78587e3595I8170q130h4712D7539a21403
18297C34490D3645K9682J27254l2180i9126m42549b67751F5869b84932J22804
18287a62128m4086j92901A36500a32361D8439g1671C4557f9156E3414L6175J3585
$$ y = [-38807, -212317, 192557, -43402, 57052, -202187, -74427, -92648, -176154, 16274, -279578, 36859, -218933, -68187, -140827, -111363, -21625, 44381, 247874, 127991, -72030, 195101, 227929, -271597, 36071, -161460, 94579, 21799, -90721, -201176, 4600, -127344, -299658, 100771, 96465, 71124, -6081, 16083, 254652, -280766, 283216, 89249, -227719, -139462, 72499, 50666, -94114, -26139, 3509, -57758, -132487, -138830, 155120, -3905, -208253, 125019, 144097, 322448, -74892, -149708, 101769, -140840, -72530, -66899, -245486, -53595, 98170, 90040, -84712, 47539, -121403, 334490, 43645, 73327, 200581, 168401, -99126, -541675, -267751, 65869, -284932, -162128, -206214, -399115, 136500, -132361, 48439, -71671, 34557, -69156, 53414, 89589, 103174]
18276A03174N1869a14553B00032B7392c03003A78657b3943a0870j46290K9328
18266a27832a3409B7555K58905E5837H110J66038b4267l7552j6601k73733A84208
18254a70638f1936m54484d4483m5069m7234k3809J0619A22537l2854M19914a710
18242C10795c02481G7350g785k47730a8506k03898B3726a68167C388M5263A1686
18230h0646A32850a66044j17582F0699a66043j2198G692i9037C9851a3989I0742
18218D9603b41244K3037A02217b13863J01463k4783B1102b56173G9996N2069b1757
18206D4057P448J64745j06979b60997E3642b13940A2239b6992j82800e9481b5314
18194b72147A37297a99635n234q2134B9100a58733B10049b53504e6561e44C8950
$$ y = [103174, 155043, -114553, 200032, 27392, -303003, 178657, -23943, -10870, -157160, -127832, -13409, 27555, 286460, 55837, 8110, 174148, -24267, -61819, -78420, -352153, 184208, -170638, -61936, -516420, -44483, -89552, -136786, -160595, -149976, 122537, 89683, 509597, -1710, 310795, -302481, 77350, -7785, -255515, -18506, -222404, 23726, -168167, 3388, 48651, 11686, -80646, 132850, -166044, -283626, 60699, -166043, -178241, 7692, -99037, 39851, -13989, 90742, 49603, -241244, -218207, 102217, -213863, -112400, -137183, 21102, -256173, 79996, 132065, -21757, 44057, 51505, 216250, 109271, -260997, 53642, -213940, 12239, -26992, -209792, -59481, -25314, -272147, 137297, -199635, -204869, -287003, 29100, -158733, 210049, -253504, -56561, -544, 38950]
18182C81356A4929L18152G3450a47854L38E8061c28692H288a12374B00013d9378
18170f7292g659l68089J03771O0124C3823a51153B1230J27167C9923m002d8470
18158d3194A78329a7824A3065J92947c7185A1598e0126C58184b825l72249b4860
18146C4731a68524p4232L0932D9833J27867a3602m0355a3213l967p2161a1427
18134A88120F990J22443a01595p0943D7966M485b71749k4846C10175A08567b38484
18122a15083k03274A4730g8505F3876i286H7180O6211a38059K3728N1206j30582
18111a93707K2565F2844c019B82765A14151c9042B57627d2640L526A90046O8339
18100B58385b46906E2728g1491B7437a06856A10121P9341c1165B3197Q8717c9433
$$ y = [381356, 14929, 333081, 73450, -147854, -147516, 58061, -328692, 8288, -112374, 200013, -49378, -67292, -7659, -375748, -271977, -211853, 33823, -151153, 21230, 148397, 39923, 35921, -48470, -43194, 178329, -17824, 13065, 206012, -37185, 11598, -50126, 358184, -2825, -375074, -24860, 34731, -168524, -242756, -211824, 49833, 177700, -13602, -53957, -13213, -17180, -89341, -11427, 188120, 6990, 129433, -101595, -172538, 47966, 52451, -271749, -296595, 310175, 108567, -238484, -115083, -318357, 14730, -78505, 63876, -9286, 87180, 153391, -138059, -114331, -63125, -193707, -171142, 62844, -3019, 282765, 114151, -39042, 257627, -42640, -39114, 190046, 258385, -246906, 52728, -71491, 27437, -106856, 110121, 189462, -31165, 23197, 111914, -39433]
18088a11851B30041p515c8334k19135F544f1017I3482J46550j2775r6840E2994
18076A36160J79404j35742A5784d177B20302b11151a0678I017a14562C10836b19260
18064G124J32797C7052R7540c82467a58635A94262I6305J23529a2638q7581B52203
18052f4314l64952a8305A88950b9908I6258J43725m4987d329H5146j449J04685
18041A88382l4803J08653e3185B60689b07175e5806k50421A8653a23343A29229
18030b762A22320k3552h2114l97690A2003g244j42374A90385p3361K21256a03762
18018g8953a3551A60551F2330M627c1003j2812D3337h4296k25241A62379a03194
18006G8470i6578q0768b2085j26401j6552A6617M25089I7622K01914G7816b060
$$ y = [-111851, 230041, 222526, -38334, -257469, 6544, -61017, 93482, 240032, 227257, 130417, 52994, 136160, 315564, 179822, 15784, -4177, 220302, -211151, -10678, 9017, -114562, 310836, -219260, 7124, 139921, 37052, 134592, -382467, -158635, 194262, 96305, 219834, -12638, -100219, 252203, -64314, -429266, -18305, 188950, -29908, 96258, 239983, 194996, -4329, 85146, 83697, 188382, 153579, 262232, -53185, 260689, -207175, -55806, -306227, 18653, -123343, 129229, -2762, 122320, 98768, -82114, -479804, 12003, -7244, -149618, 190385, 117024, 338280, -103762, -78953, -13551, 160551, 62330, 66957, -31003, -43815, 43337, -84296, -309537, 162379, -103194, 78470, -96578, -177346, -22085, -148486, -165038, 16617, 441706, 97622, 299536, 77816, -2060]
17994a71552A23114c5057F5860R666Q793i8629n7428C26307b9416k63554A85651
17982F519a48265e4791H0852a76791g8144k1530A33997g5742j59487C7228B234
17970A23914j3450j4361d1714j49664a8393A96740b38807H6852a4106H1555a66345
17958a06206C86468e5762K5678F4441Q420c12711A93200e6009l43028a2042C15399
17946D1397e5219A60563b0351B5409K09122b9900l64727A18837D1218a34672J2688
17935a21984O0404E8633J60173c8167l7971H7723h617B95460b93524G0279K668
17924G2947k1289a90793A07435c91554E2759a58772n777I1851L1677J13230b17975
17912C37203D7407J02591J09194R9661A43935i3969B32567e1326j3694j44450
$$ y = [-171552, 123114, -35057, 65860, 75526, 84319, -98629, -156057, 326307, -29416, -292970, 185651, 6519, -148265, -54791, 80852, -176791, -78144, -99674, 133997, -75742, -235229, 37228, 2234, 123914, 110464, 96103, -41714, -191378, -18393, 196740, -238807, 86852, -14106, 81555, -166345, -106206, 386468, -55762, -30084, 64441, 72861, -312711, 193200, -56009, -399037, -12042, 315399, 41397, -55219, 160563, -20351, 25409, 234531, -29900, -394627, 118837, 41218, -134672, -121984, -61580, 58633, 218806, -38167, -76138, 87723, -8617, 295460, -293524, 70279, 72947, 51658, -190793, 107435, -391554, 52759, -158772, -164549, 91851, 123528, 236758, -217975, 337203, 47407, 149998, 259192, 358853, 143935, -93969, 232567, -51326, -65020, -209470]
17902b09470B12677o7632F1396J69486H6216a15862c4724G0347a77559C04093
17891b12050m7184I7194a84471A38305l2739Q4471r961f0554G8910J32632O6514
17880B78056b66382B29776D534d5073A80761a0959A5452c9719j39596M5157d1680
17868G674b25220G7340b4069m5113o0626m7386o1384B53647a94803h6061B32623
17856a04571k9771A41455c18380D3070J2543L9503b46211C4755K07684G9812J24814
17845B04626c3548J5095C65906E1222J09768b800B69099a45943A25893D0673N1534
17834I2207k9841b8450k2259E6786a77418a281F2550a34987G5558e9356A5966
17822D2267A1604K0560J5084a76925A95263a41082e033I859M92b83217a14339
$$ y = [-209470, 212677, 145045, 61396, 230882, 86216, -115862, -34724, 70347, -177559, 304093, -212050, -259234, 97194, -184471, 138305, 105566, 190037, 180076, -60554, 78910, 211542, 278056, -266382, 229776, 4534, -45073, 180761, -10959, 15452, -39719, -179315, -134158, -41680, 7674, -225220, 77340, -24069, -69182, -129808, -177194, -238578, 253647, -194803, -86061, 232623, -104571, -134342, 141455, -318380, 43070, 55613, 95116, -246211, 34755, 242439, 79812, 204626, -33548, -18453, 365906, 51222, 160990, -2800, 269099, -145943, 125893, 40673, 92207, 62366, -28450, -50709, 56786, -177418, -1281, 62550, -134987, 75558, -59356, 15966, 42267, 11604, 32164, 47248, -176925, 195263, -141082, -5033, 9859, 10351, -283217, -114339]
17810b35138k54813A78655b26370B08869f0052A47271J52439c03652e6513I9333
17799E7626f166A24123d6355I4945b12738B51349a67362B89249C8045J45085m1301
17788A41829b0701G7579J22658a81611A40818b449A81661a71967E01970A42357
17777e3892F0160N5435C9342d767n8390A45417d0865A90228l3808J2770J1045
17766A80235k8838j3886i2960B3136K041f6690C86033b3181A87282J25053L728
17755C16063o1469A05399O2358J69282j28010a48477C42801A43774b6821H9058
17744e9794i170B328a5267A29664J25724B727L98759b576A20057n4801N7721K53586
17732C76563f8147B44730H6915Q5951i6674q5816M5162N6175A27532m7253n420
$$ y = [-235138, -489951, 178655, -226370, 208869, -60052, 147271, 299710, -303652, -56513, 99333, 57626, -6166, 124123, -46355, 94945, -212738, 251349, -167362, 289249, 38045, 183130, 141829, -20701, 77579, 200237, -181611, 140818, -2449, 181661, -171967, 501970, 142357, -53892, 60160, 115595, 39342, -4767, -63157, 145417, -40865, 190228, 156420, 169190, 180235, 151397, 137511, -92960, 23136, 25177, -66690, 386033, -23181, 187282, 312335, 316063, 254594, 105399, 167757, 337039, 209029, -148477, 342801, 143774, -26821, 89058, -59794, -9170, 2328, -15267, 129664, 255388, 2727, 401486, -2576, 120057, 65256, 122977, 376563, -68147, 244730, 86915, 172866, -96674, -182490, -137328, -81153, 127532, 80279, 74859]
17721G4859a85118e9694I9307K4064m2374a6304E2398J93308j7238h3503C61948
17709C96674D6939a93306A25472b0123C2884M9341m833j615J48103K10296A18819
17697a87355f0908A78940e094A29718g7667F7782i2950F1815J27032a27719A5108
17685f7742a036k86307e9034A03268K58315a71292A76547b892B45711N2269g009
17673B96411m6456D1605J2338h3736I9359h6771B37295b46610E8032L07105h3610
17661a5860B34459f6435r674B6190J2844b16098I2950L5973J8353o6077K09356
17650B90555a43263A29318h9366B73158A11527m4815g7593m7269A6268L28469
17640C44737j16293G866i0882D08916g4048j03779M9591C19176p5156m0687a91855
$$ y = [74859, -185118, -59694, 99307, 123371, 80997, -16304, 52398, 245706, 228468, -83503, 361948, 396674, 46939, -193306, 125472, -20123, 32884, 82225, 77392, 75777, 223880, 434176, 118819, -187355, -60908, 178940, -5094, 129718, -77667, 67782, -92950, 61815, 188847, -127719, 15108, -67742, -1036, -287343, -59034, 103268, 361583, -171292, 176547, -2892, 245711, 297980, -7009, 296411, 249955, 41605, 53943, -83736, 99359, -86771, 237295, -246610, 58032, 365137, -83610, -15860, 234459, -66435, -76109, 26190, 39034, -216098, 92950, 128923, 147276, 81199, 290555, -143263, 129318, -89366, 273158, 111527, 66712, -77593, -124862, 16268, 344737, 228444, 7866, -90882, 408916, -74048, -177827, -128236, 319176, 244020, 203333, -191855]
17628B13463b04165A31511b5155o158A41551Q4917J22271G8343b6418B09702p5918
17617A33784e5862B20054d9421B41751j07092a13678e77n7376a3643H2091J80650
17606B62741l1429J61854j23797i3669D79682d018G3173K01106B2896a8638B09093
17594B15164r9443Q881M83024h957j03818C14969b8354C05619M8562A54066c1805
17582a0790k8078G8900a49667C7632f2464G6027M9479o0490d2739A587J74332
17571A75919G2795j7853b6438B59701O0716L1481A67664J00896a23024d7233A67253
17559a36798A61062a07247A13849K23799g7827c0156E9687A913J3468K76641L509
17548B95531i04B16534G9019A775J73028L98547k44405N6552o3099J2033G1316
$$ y = [213463, -204165, 131511, -25155, -31313, 141551, 226468, 348739, 78343, -26418, 209702, 133784, -55862, 220054, -49421, 241751, 134659, -113678, -577, -57953, -13643, 82091, 262741, 231312, 393166, 269369, -93669, 479682, -4018, 73173, 274279, 22896, -18638, 209093, 215164, 115721, 124602, 607626, -8957, -112775, 314969, -28354, 305619, 354181, 154066, -31805, -10790, -38868, 78900, -149667, 37632, -62464, 76027, 125506, 65016, -42739, 1587, 175919, 72795, 54942, -26438, 259701, 320417, 351898, 167664, 268560, -123024, -47233, 167253, -136798, 161062, -107247, 113849, 337648, -77827, -30156, 59687, 1913, 15381, 292022, 295531, -904, 216534, 79019, 1775, 174803, 573350, 328945, 385497, 322398, 334431, 71316]
17536D87327k27173n8837I0222M4752J0969E0896M049M87896j95955E1869K25925
17525B77794A03501J32273d127B49552d7331H5877K5040J40607L0240J6601j7619
17514B80746k1869K7235J49965M0937Q622L34303L1136M6869k87560A63352M3958
17503B07310O25003k76780A49046L86793A93712J61695K38025L23726j65603P7652
17493H29207J54863l65256j12420L04241j94336j5210k50259P9628j79292N5438
17483C06604J2435J96146B24511J05932m92K2853J11873q843j27310K58202B49325
17471E5094L65278A91340a09162B07331P2194m4453j04383Q4770g867D27139d51
17459E45759I9078J0802f0491B12080A0139Q5411K148K0551J03123K45793C0668
$$ y = [487327, 260154, 201317, 90222, 134974, 145943, 50896, 54945, 542841, 346886, 51869, 277794, 103501, 235774, -4127, 249552, -47331, 85877, 110917, 251524, 281764, 298365, 280746, 258877, 286112, 436077, 477014, 485636, 819939, 851075, 897944, 610384, 163352, 207310, 832313, 555533, 149046, 535839, 193712, 355407, 593432, 917158, 751555, 829207, 984070, 618814, 506394, 810635, 616299, 601089, 350830, 430458, 251166, 306604, 319039, 515185, 224511, 330443, 329951, 352804, 464677, 455834, 328524, 586726, 249325, 55094, 420372, 191340, -109162, 207331, 279525, 235072, 130689, 215459, -7867, 427139, -451, 545759, 99078, 109880, -60491, 212080, 10139, 95550, 97698, 118249, 221372, 467165, 30668]
17447B45209R5440q5177q1491P0275J6262D4272L09438q6772A26936J47093k3687
17436B50342j10815L41645k40123o9445n388J96538A17825M60395B84023K95215
17426E79238j23646p8570n858N5397B05283G7724K2732J30334J48697A87373L82745
17415E70118C4174P0879L07831A67948J45983Q9727k309r2604j42693K3948K9951
17404B19951L14120k53010R747J59922O1396B49387K14666r6262N8197Q1454j03218
17393D04224N8602j0973k13500N095L006N4198j38175J8145P7200j10426J07508
17382B54904Q1846R7257H8088B1485J38L91867G5399L33491j36833J3591J80648
17371D66296A23222R9293A10546E3331K35642A10140Q0725K21202A98475J41250
$$ y = [245209, 340649, 255472, 173981, 244256, 260518, 44272, 353710, 266938, 126936, 274029, 250342, 139527, 481172, 241049, 171604, 166216, 362754, 117825, 578220, 284023, 579238, 455592, 377022, 371164, 426561, 205283, 77724, 100456, 230790, 379487, 187373, 570118, 34174, 105053, 412884, 167948, 313931, 403658, 401349, 308745, 166052, 190000, 219951, 534071, 281061, 290808, 450730, 512126, 249387, 464053, 367791, 425988, 507442, 404224, 462826, 451853, 238353, 243448, 246454, 300652, 162477, 180622, 257822, 147396, 254904, 336750, 434007, 88088, 21485, 21623, 413490, 75399, 408890, 272057, 285648, 466296, 123222, 222515, 110546, 53331, 288973, 110140, 190865, 412067, 198475, 339725]
17361C39725l4318A09499a40775D51141n2701j72094l3616d8602E0983L5766n014
17350H1735N8501J39880M5521j52890J98937j61426J67339p6712G3085e806D49594
17338D34209j87133K20609F8641C3707J50345J7232J36176H7641P28521B22585
17327E4613O9424J69602J8822C1364R4720m7474L38907a46217f3421A62576j11
17316A62465O5678L49740j9164j29284R0061B07539J61052j35573j06911J81451
17306C07558A34570J75874l2826h9701C81336A86252K90860A62175Q3516j2536
17296B33155M7646A04042K70929K2329J98002p234A78132j4673J88778j71829
17286A80408J78534j04743L46909A05574N821K24301K10568A56200N2883Q6502
$$ y = [339725, 305407, 109499, -140775, 451141, 398440, 226346, 192730, -48602, 50983, 86749, 81735, 140236, 280116, 325637, 172747, 371684, 210258, 377597, 300885, 73085, -5806, 449594, 434209, 247076, 467685, 68641, 33707, 184052, 201284, 337460, 87641, 816162, 222585, 54613, 124037, 293639, 312461, 31364, 126084, 78610, 417517, -146217, -63421, 162576, 162465, 228143, 577883, 558719, 429435, 519496, 207539, 368591, 233018, 126107, 307558, 134570, 310444, 277618, -89701, 381336, 186252, 477112, 162175, 245691, 233155, 280801, 104042, 374971, 397300, 595302, 588068, 178132, 163459, 352237, 180408, 358942, 254199, 601108, 105574, 111395, 335696, 546264, 156200, 209083, 295585]
17276B95585L43549j44368j48812J13063j48429l8366k4934M6715J03559j01340
17266B96222P9469J1758E2297L13766A27905E6235J9572L66807A10071j0138P9660
17255A79593J00683F6320K26909n023r9552l7577K65313A97279N5257I3892L49358
17244D43250j59608L553R9164A32837K07944j59949L08472H1685L10977j14591
17234B78071I8230k6633K54020A48411m3498K23113j13707M450F558K64862Q2756
17223C54176K48514A89364N0899N6399J40481E6964K32519l4540K11383J9722
17213D86048J41941A34424L77129j36182c5708B92018M1572M56869C67422p9772
17203B87650k4627K41527j63397J86134B54804J09353J17264P2580A89836K60379
$$ y = [295585, 639134, 494766, 345954, 459017, 310588, 272222, 247288, 294003, 397562, 296222, 375691, 387449, 52297, 366063, 127905, 56235, 75807, 442614, 110071, 99933, 179593, 280276, 66320, 293229, 288206, 188654, 151077, 416390, 197279, 252536, 93892, 443250, 283642, 287195, 386359, 132837, 340781, 180832, 489304, 81685, 392662, 278071, 98230, 71597, 325617, 148411, 104913, 328026, 214319, 218769, 6558, 271420, 354176, 602690, 189364, 240263, 296662, 437143, 56964, 289483, 254943, 466326, 486048, 627989, 134424, 511553, 375371, -35708, 292018, 333590, 790459, 367422, 287650, 263023, 504550, 341153, 527287, 254804, 364157, 481421, 554001, 189836, 450215]
17193D50215A70994J08555K43409B29943J07342M4960J62254I6899L69800p8426
17183C88273M62362B02505L64933N2047j07476j35170K74720J27360l38746o2999
17173C77174m6988J09857Q4456m0837p2061p8202L01492C12073P4603J67338l2329
17162E21685J16759k19094A68040L01365P3101r7796l6285L0073A53415O39785
17152G93200k88107B31316J62746l9296q3684K43970k42658R087M31785k81536
17142D31730B13580L27635l2717n0643A82259L46405J97940k56556J81694p7054
17132E74688j82581L63808k89774A62759L85834J30769j94532k16186N9697L8218
17122C66559L16056j20228j90260K57879j65082L2510J31426j67416K48597k25470
$$ y = [450215, 170994, 279549, 522958, 229943, 337285, 382245, 544499, 96899, 466699, 388273, 850635, 202505, 567438, 619485, 512009, 376839, 651559, 778919, 440173, 377174, 330186, 440043, 524499, 483662, 411601, 333399, 634891, 312073, 386676, 554014, 521685, 638444, 419350, 168040, 469405, 542506, 444710, 408425, 438498, 153415, 793200, 505093, 231316, 394062, 354766, 271082, 515052, 272394, 281481, 713266, 431730, 213580, 541215, 508498, 457855, 182259, 528664, 726604, 470048, 651742, 574688, 392107, 755915, 466141, 162759, 548593, 679362, 484830, 268644, 328341, 366559, 682615, 562387, 372127, 630006, 464924, 497434, 628860, 461444, 710041, 484571]
17112D84571L706J36342N4863M5508l44971K74150P3677j57875J61459n3729m9659
17101F28042K1245j31699j36208j7012J46191j86596K12479j9856L48760C31591
17090D00979J78928q1239L55431k45072j43172j18537N43560l92463J50057M001
17080F52473j58565L06906l51816K28649L780N1791L81275k76797j60460R1248
17070G68484P5609l25087K60204C04227P03310m10580L42161k21255J26350l65582
17060D78631K95766j9039k81631P6372N92905l62066K4079k79547J75797l0819
17050F70448P5773J73591q069p7296m0892k9056j59745M7773L93466n3416j15797
17039H76780l73867M06272r8850J14468j60478R9610J63655k10321J48433l42892
$$ y = [484571, 488277, 624619, 679482, 724990, 380019, 654169, 727846, 569971, 731430, 677701, 628042, 649287, 517588, 381380, 364368, 510559, 323963, 536442, 516586, 865346, 331591, 400979, 579907, 498668, 854099, 609027, 465855, 347318, 890878, 498415, 648472, 652473, 493908, 800814, 448998, 677647, 681427, 733218, 1114493, 837696, 677236, 768484, 844093, 519006, 779210, 304227, 1007537, 596957, 939118, 717863, 844213, 478631, 774397, 755358, 473727, 550099, 1143004, 780938, 805017, 525470, 701267, 670448, 746221, 919812, 911743, 834447, 793555, 764499, 604754, 652527, 1045993, 992577, 876780, 502913, 909185, 810335, 924803, 764325, 863935, 1027590, 817269, 965702, 622810]
17029F22810Q4669M44161l35590J51460j99712M48894l42638k52900K08468j0976
17019H18646j31300J89996M8307j12664j3415K91166l2144j15741N3846k628M2259
17008A036328l01065M46822l33459j37066J62156J19557P6060N9411k13982L35532
16998A250294j29952j30674M38532m76842M21869m95795J1915K37195k21416P2440
16988I77566K72796j41002Q3026j740l6723M9335j46536K37990j27599J3145o1031
16977A119227Q5852l5062J96814j34J99057l12770j87974K86138m587J53274j99237
16966A300598j27110M09614o3167r4416J69252k78861j99058O15438l00828J93118
16956A624580l10689k53297N24189L5594j28492J4768K161k489K26866m27426
$$ y = [622810, 707479, 1151640, 816050, 967510, 767798, 1216692, 874054, 621154, 829622, 818646, 687346, 877342, 925649, 812985, 799570, 1090736, 1058592, 942851, 996697, 994069, 1036328, 735263, 1182085, 848626, 711560, 873716, 993273, 1069333, 1128744, 914762, 1250294, 1120342, 989668, 1428200, 951358, 1373227, 877432, 889347, 1126542, 905126, 977566, 1250362, 1109360, 1192386, 1190646, 1153923, 1203258, 1056722, 1294712, 1167113, 1180258, 1119227, 1205079, 1170017, 1366831, 1366697, 1565754, 1252984, 1065010, 1351148, 1346561, 1499835, 1300598, 1173488, 1583102, 1519935, 1425519, 1594771, 1315910, 1116852, 1732290, 1431462, 1624580, 1313891, 1060594, 1584783, 1620377, 1491885, 1506653, 1508814, 1506325, 1733191, 1305765]
16946A305765K88237J24326j75496K13608j13148J7991j88899K69518K89610k50861
16936A780651o5350l39224L46436J05059Q2997l05119M02058q404k43665M4760
16926A800199k07631K57870J25345M6026K21168p7894k84843L4998R6619L07147
16916B319004j91063j0401q1472K61280O0215P0319k78038k08802J93596K4325
16906B158963L39295k80542n07191M01939R0164R9403J55104k5924k6962k9459
16896B374790J39849J9472m9323L052L24452k03535K23323n8827j16505P2635
16886B729383n4855N9437M91943m06400L92754k95909J71654r8801L741K34935
16876C227882K95535k85975k32646L96351j07429J87209l89972L10417L80353
$$ y = [1305765, 1594002, 1718328, 1542832, 1756440, 1643292, 1661283, 1472384, 1741902, 2031512, 1780651, 1715301, 1376077, 1722513, 1827572, 1910569, 1605450, 2007508, 1999104, 1755439, 1800199, 1592568, 1850438, 1975783, 2021809, 2242977, 2165083, 1880240, 1915238, 2011857, 2319004, 2127941, 2117540, 2036068, 2297348, 2357563, 2427882, 2149844, 1941042, 2134638, 2158963, 2498258, 2217716, 1710525, 2112464, 2202628, 2302031, 2457135, 2431211, 2404249, 2374790, 2514639, 2534111, 2484788, 2487840, 2812292, 2608757, 2832080, 2773253, 2656748, 2729383, 2674528, 2733965, 3225908, 2819508, 3212262, 2916353, 3088007, 2989206, 2992947, 3227882, 3523417, 3237442, 3004796, 3401147, 3293718, 3480927, 3090955, 3401372, 3781725]
16867C781725k00455l5214J60292N3279k3700k52433k874K16455m5126M10319
16857D062268k78017Q0365L875K87364j88664K53009o844J67844O0948l3924P5908
16846D484132J59885L1346J9854M7366J17541j5030M29606N259Q1670l27934K94992
16835E328687K8298J02424J2256P1234l62008R45981r9274K3466J24306M17195
16825F592565n25151M84171P6122j3077J89862k86105P44038j86105j58830P45688
16815G663178k66230P6566M8228O39478k07348j6389L60477N8241L02392j15802
16805H542791Q90789J97905j68108J10035K29944j79301O38618J26026R5761K43367
16795A0727827K02063K92759N03801K27499N2904K00126M68204n2606N25703J87032
$$ y = [3781725, 3581270, 3546056, 3706348, 3759627, 3735927, 3483494, 3480620, 3697075, 3651949, 4062268, 3784251, 3864616, 3868491, 4155855, 3967191, 4220200, 4213356, 4381200, 4442148, 4408224, 4484132, 4644017, 4675363, 4695217, 4742583, 4860124, 4845094, 5274700, 5279959, 5361629, 5033695, 5328687, 5356985, 5459409, 5471665, 5542899, 5180891, 6126872, 6027598, 6051064, 6175370, 6592565, 6067414, 6551585, 6627707, 6614630, 6804492, 6518387, 7262425, 7076320, 6917490, 7663178, 7396948, 7473514, 7521742, 8161220, 7953872, 7937483, 8297960, 8356201, 8658593, 8542791, 9433580, 9631485, 9463377, 9573412, 9803356, 9624055, 10262673, 10388699, 10484460, 10727827, 10929890, 11222649, 11726450, 11953949, 12006853, 12206979, 12675183, 12622577, 13148280, 13335312]
16785A3335312N29076J34819N21431J01901N13178O52955L07720N04515O6663
16776A6667570O81948O10518L357J122516K16185M46696M76891P69001L97540
16767B1392222J185637L04261O38793M92745R97384P86386N63942Q69458R57426
16758B8188254J017206R94669R79910P87881J114649J015843J663835Q27385J653066
16749C8242698J220379J129993J640250J209255J640577J691239J870134J624891
16741E0269416K232095J817646K184634K057747K215551K032339K508092K796141
16733F8113661K699658K618782K553014K527729L048352K836869L113004K409083
16725H9920152L505090L095079K686255L020978K765985K958750K730008K847959
$$ y = [13335312, 13864388, 13999207, 14520638, 14622539, 15135717, 15788672, 16096392, 16600907, 16667570, 17349518, 17960036, 17963393, 19085909, 19302094, 19748790, 20225681, 20994682, 21392222, 22577859, 22882120, 23520913, 24013658, 25011042, 25797428, 26361370, 27230828, 28188254, 29205460, 30200129, 31180039, 31967920, 33082569, 34098412, 35762247, 36589632, 38242698, 39463077, 40593070, 42233320, 43442575, 45083152, 46774391, 48644525, 50269416, 52501511, 54319157, 56503791, 58561538, 60777089, 62809428, 65317520, 68113661, 70813319, 73432101, 75985115, 78512844, 81561196, 84398065, 87511069, 89920152, 93425242, 96520321, 99206576, 102227554, 104993539, 107952289, 110682297, 113530256]
16717A13530256J948315K440875J962942K047038J211991J258841R55972O46981
16709A26003211K03814j33518l13793r94876j144121j147428j659011j861727
16701A18952551k286444k844477k355327k240786k788920l145363k889022k797007
16693I7605205k948750l358257l110979k792422l132105k767875k767312k739000
16685G3988505l058308k358687k690607k572533j929936k087208k425132k067927
16677E4798167k087845j864340j773183j914737j742751j838638j399603j212375
16669D0964695j708222j259601r65316j527721j174583q84121j286480j077297
16661C1081354j439050p38127m46059j372387m47073j063809n79843o06588q85204
$$ y = [113530256, 115478571, 117919446, 119882388, 121929426, 123141417, 124400258, 125356230, 126003211, 126207025, 126073507, 125759714, 124764838, 123620717, 122473289, 120814278, 118952551, 116666107, 113821630, 111466303, 109225517, 106436597, 103291234, 100402212, 97605205, 94656455, 91298198, 88187219, 85394797, 82262692, 79494817, 76727505, 73988505, 70930197, 68571510, 65880903, 63308370, 61378434, 59291226, 56866094, 54798167, 52710322, 50845982, 49072799, 47158062, 45415311, 43576673, 42177070, 40964695, 39256473, 37996872, 37031556, 35503835, 34329252, 33445131, 32158651, 31081354, 29642304, 28904177, 28458118, 27085731, 26638658, 25574849, 24995006, 24388418, 23503214]
16652B3503214n48705p49872o30394m86394p45034p07654m62061m15818l58307
16643A8398975n52891m05471o55335m67464j87420n57568j52018m16652m52448
16634A4551708l21713o44686r2911m93594j72114m55955k34753k09608J781p08436
16624A1219719q9358j09263k48658m78072j71413J22537k15002l15503m18692
16615I296295N6439r3193n0809l40052j21432l35108O9266m73252j28343K29193
16605H109004l33404n11203K10870m5435o28774N42458k31190k27147j09091M9270
16595F825358m50169j5071J08430j62683k5174k68883l14103j43346M05511m73374
16585E486496n9685K1208k09290K81246j97210k60030N8956l1272j5323k17716
$$ y = [23503214, 22954509, 22204637, 21574243, 21087849, 20342815, 19635161, 19173100, 18757282, 18398975, 17846084, 17440613, 16785278, 16317814, 16130394, 15572826, 15420808, 15004156, 14551708, 14229995, 13585309, 13492398, 12998804, 12826690, 12370735, 12135982, 11926374, 11928155, 11219719, 11130361, 11021098, 10772440, 10294368, 10122955, 10245492, 10030490, 9714987, 9296295, 9352734, 9259541, 9208732, 8868680, 8747248, 8412140, 8481406, 8008154, 7879811, 8109004, 7775600, 7264397, 7475267, 7429832, 6801058, 7343516, 7112326, 6885179, 6776088, 6825358, 6375189, 6360118, 6468548, 6305865, 6280691, 6011808, 5697705, 5554359, 5959870, 5486496, 5426811, 5448019, 5238729, 5519975, 5322765, 5062735, 5121691, 5090419, 5075096, 4857380]
16575D857380j63389J19546p37274N37471k82324J79293k55948K96769K70164
16566D821688n08175N6774k04389k13409K43882j93646J15579k28938K20875k39755
16556C870486k9476k4966k32645M0527k17348L28507l74582J29450K14533l60475
16546C344011j297J03158k13086N462L3076l52137M0543m4773J04305R9155l48054
16535B770363k39008K43226j20461P0013K2635j20744K48078j08574k53719L21078
16525B832887k20232L8095j3824j93710l50293O37847n1035j69379J20180k2721
16515B607815m1261k76642M45569k96011J02382l38797R5069J4952j79198j12428
16505B021450L8194J85802L13434n24981Q0617O8953k15686Q2076M238n9912J24890
$$ y = [4857380, 4693991, 4813537, 4076263, 4613734, 4331410, 4510703, 4254755, 4551524, 4821688, 4313513, 4370287, 4165898, 3952489, 4196371, 4002725, 4118304, 3889366, 4110241, 3870486, 3841010, 3816044, 3583399, 3623926, 3406578, 3735085, 3360503, 3489953, 3704486, 3344011, 3342714, 3445872, 3232786, 3238248, 3271324, 2919187, 2959730, 2914957, 3019262, 3118417, 2770363, 2531355, 2774581, 2654120, 2724133, 2746768, 2626024, 2874102, 2765528, 2511809, 2832887, 2612655, 2650750, 2636926, 2443216, 2092923, 2730770, 2679735, 2510356, 2630536, 2607815, 2566554, 2289912, 2735481, 2439470, 2541852, 2203055, 2298124, 2313076, 2133878, 2021450, 2059644, 2245446, 2558880, 2033899, 2114516, 2183469, 1967783, 2049859, 2054097, 1994185, 2119075]
16494B119075j56400J78327o9853N1338j65749L0829j05815K2895k87511J21182
16484A738318K09135j31873K8509k9238J19248n74536N67514K2044j43510l53183
16474A452428K85911L7273k27841K58161k05867P0366j9902O7824l5354j03945
16464A579054J76573j90207k00247Q6773p4419R507K77871m44651L34331j16332
16454A438253k21188k6976J69763J84219q8249Q2877L6527k65260P2724l48081
16444A034609R2334K86544j66305J86492K4575j51023j9535L4262O6843j30719
16434A258077m44791M21928k83097K23706L55209l01850J93806n17997J54041
16425A059032L49768k0715l87551M15792l88361K30662k57927K57474J00347K5688
$$ y = [2119075, 1962675, 2141002, 2071149, 2122487, 1956738, 1987567, 1881752, 1904647, 1617136, 1738318, 1947453, 1815580, 1844089, 1814851, 1934099, 1359563, 1927077, 1949121, 1805611, 1452428, 1738339, 1775612, 1547771, 1805932, 1600065, 1670431, 1650529, 1718353, 1682999, 1579054, 1755627, 1565420, 1365173, 1451946, 1377527, 1387034, 1664905, 1220254, 1554585, 1438253, 1217065, 1190089, 1359852, 1544071, 1455822, 1538699, 1575226, 1309966, 1382690, 1034609, 1126943, 1413487, 1247182, 1433674, 1458249, 1307226, 1287691, 1321953, 1388796, 1258077, 813286, 1235214, 952117, 1175823, 1531032, 1229182, 1422988, 904991, 1059032, 1408800, 1388085, 1000534, 1416326, 1027965, 1258627, 1000700, 1258174, 1358521, 1384209]
16415A384209k26974Q2910l93987M08414p4641O924N1748k80299K56007j94263
16405A020048J8159L62581k27323k86763J38496n4432l9829J06350L3142l7347
16395A033082J17503l25235J53524l291J62641q4484L33305l84056m25367M27884
16385A005506r5946L10657k12649j17180R7522o1208j05835J34343n4928P8503
16375I78785k01459K96118j41392K58025n88197K64156Q6253m4965k2837Q0199
16365I64686J70147k5306r7409k4681D25970O78415l67060l4759J52324P9801
16355I34691r4199k01614L91337j20344j45059j38022K96754m24528N15485j36959
16345H77542K2526j64392k01850K72321j66209k09839J30027J60846j14508O6320
$$ y = [1384209, 1157235, 1240145, 846158, 1254572, 1179931, 1186855, 1238603, 958304, 1214311, 1020048, 1038207, 1400788, 1173465, 886702, 1025198, 970766, 930937, 1037287, 1070429, 1033082, 1150585, 825350, 978874, 975583, 1138224, 1053740, 1387045, 1002989, 577622, 1005506, 909560, 1220217, 1007568, 890388, 987910, 926702, 820867, 955210, 900282, 978785, 777326, 1073444, 932052, 1190077, 601880, 866036, 952289, 907324, 884487, 964686, 1134833, 1109527, 1012118, 987437, 425970, 1104385, 737325, 702566, 854890, 934691, 840492, 638878, 1030215, 909871, 764812, 626790, 923544, 499016, 1014501, 877542, 900068, 735676, 533826, 806147, 639938, 430099, 560126, 720972, 606464, 672784]
16335F72784J48295k29790k5477L59372D05105L33073n0505J74913l01141L56089
16325I17534k24125J89459l48367J89235P322l61962N61094l83580J84401q3158
16315F47853K36252J68232m35024P9573j5612o3131P6840J30915j47413r4974
16305E83511j97245Q9380K18744j95369K31219p3900j3107k04299L22844l74900
16295C86878K8035K78290q6172o8840Q6295k07864J82426q3757O5421k1556B56195
16283E15638K06321l47306M57191B71002L82213p7585l3977j3599o7446K2088
16273D82696R051O52408D67347l710J31462J14098q6359r4816M0895k01704M82136
16262H49349k85887p8248J28362J37918r5386j34658p2500m8993m5489l0525M56358
$$ y = [672784, 821079, 591289, 565812, 925184, 405105, 738178, 687673, 862586, 561445, 917534, 693409, 882868, 534501, 723736, 731058, 369096, 930190, 546610, 731011, 647853, 884105, 1052337, 617313, 696886, 681274, 618143, 694983, 825898, 678485, 583511, 386266, 475646, 694390, 499021, 730240, 656340, 643233, 438934, 761778, 386878, 414913, 693203, 607031, 538191, 624486, 416622, 599048, 515291, 580712, 559156, 256195, 515638, 721959, 374653, 831844, 271002, 653215, 575630, 541653, 528054, 460608, 482696, 491747, 1144155, 467347, 463637, 595099, 709197, 622838, 528022, 568917, 367213, 849349, 563462, 485214, 613576, 751494, 656108, 521450, 448950, 399957, 354468, 323943, 780301]
16251G80301K2758C54841P935J71745j53023K11301B95313N27642l45100j58897
16241C18958n1540M79240C49507L34867p1452k21892M2082j12099A37761L48023
16231D85784k15383N2323K34094D4245J15488L81988J9370O1727J02608a1997
16220H13497A63983K05637F6480O29714C11210N8789K25360j91500J49129k42663
16210C10325J99357j50448Q5597N3674r5946K22543p4671r0219m6062p695P9618
16199D86073j54932Q4252O2888j52899j1904M7552Q8515A53280P64742C47238
16188B56218J14647l8302M5035A82443J63631h4753C47938A24751J33060K02844
16178D60655j37623n8474K21747o7605K0131O3606k44964A18178J90923q2660
$$ y = [780301, 803059, 354841, 362776, 534521, 381498, 592799, 295313, 822955, 477855, 318958, 267418, 746658, 349507, 684374, 612922, 391030, 433112, 321013, 137761, 485784, 270401, 322724, 556818, 44245, 159733, 541721, 561091, 622818, 725426, -11997, 813497, 163983, 369620, 66480, 696194, 311210, 369999, 595359, 403859, 552988, 310325, 509682, 359234, 444831, 498505, 402559, 625102, 550431, 460212, 414150, 406455, 486073, 331141, 415393, 478281, 325382, 313478, 361030, 449545, 153280, 918022, 347238, 256218, 370865, 332563, 377598, 182443, 346074, -84753, 347938, 124751, 257811, 460655, 323032, 264558, 486305, 418700, 438831, 502437, 257473, 118178, 309101, 226441]
16168B26441O9613n3239K11437A88916K99502k26806M06213B85747R6585K10427
16158E92759A00956K86714K12084G4085J78909M5960J44763A72420B0801J88828
16148B09629K3826L18709B66562e8089B09005L00462A11654K37461m8508d9041
16137D18785k00694J46387m8860d4800C09583Q9556A50859K70036p7242j49437
16127A94216m8744Q1998J4781O5133k4898F4770c5600I2633M54639B19360K7376
16116B46736J61445G4974L33366j13703j40894M04372B20438J95223e971D49067
16105a42368B8803K32054A3803J98406O1970a88576B24219i0831e778C8438J87267
16094B25705L70628B22226f2921D8374f6562l03170I5129J72502b57479A1713
$$ y = [226441, 296054, 242815, 454252, 188916, 488418, 261612, 667825, 285747, 382332, 592759, 100956, 387670, 599754, 74085, 252994, 298954, 443717, 172420, 20801, 209629, 233455, 552164, 266562, -58089, 209005, 509467, 111654, 349115, 300607, -49041, 418785, 218091, 364478, 315618, -44800, 309583, 399139, 150859, 420895, 343653, 194216, 145472, 227470, 242251, 307384, 282486, 64770, -35600, 92633, 547272, 219360, 246736, 408181, 74974, 408340, 294637, 153743, 558115, 220438, 415661, -5971, 449067, -142368, 28803, 260857, 13803, 212209, 274179, -188576, 224219, -90831, -5778, 38438, 225705, 596333, 222226, -62921, 48374, -66562, -369732, 95129, 267631, -257479, 11713]
16083G0958E589R4612J41210B9524J18116M0362I1517J38220Q795J81031C9852
16071I0327K7934K37948p1557A39723J73203n9053p8292q2558O2385k4659m9106
16060H1643C3961R9639F1505R4187B0430L36791b4343j74522C78259F7485L90688
16049D58173k06443j01354J38000J00512b8410A28716H284J15061D7826M33276
16039D81102p1345j64051g125B54218G0345J27965J99335C656b64353H8934m4043
16028D4891b19617k4464B58672n2351a737k07152H9923C221b11025A89422L40281
16017E29703f6311A38162K9343a40393A77766a11902A0472R4661B8588J20673
16007A49261L56352A39247K13212d6490A21232Q9768E900J93299F795a47296B35231
$$ y = [70958, 5589, 100201, 241411, 29524, 147640, 188002, 91517, 229737, 238532, 419563, 39852, 90327, 118261, 356209, 284652, 139723, 312926, 253873, 175581, 93023, 155408, 130749, 81643, 33961, 133600, 61505, 155692, 20430, 357221, -24343, -198865, 378259, 67485, 458173, 251730, 150376, 288376, 388888, -28410, 128716, 8284, 123345, 47826, 481102, 409757, 245706, -7125, 254218, 70345, 198310, 397645, 3656, -264353, 88934, 44891, -219617, -244081, 258672, 206321, -1737, -208889, 89923, 3221, -211025, 189422, 529703, -66311, 138162, 167505, -140393, 177766, -111902, 10472, 105133, 28588, 149261, 505613, 139247, 352459, -46490, 121232, 211000, 5900, 199199, 6795, -147296, 235231]
15995A58568E8513j7508K92912a3877A02537G27a69260o1070A62221j9693P3703
15984B16231d9370l8874e777A24769O3647A5610K81919J6631l7432P7319M09766
15973G63813k22094K37042Q1767Q7989M7234k96190J83742k65038l7387B58532
15962B64015J13235E7134L01374A77077A6860Q2771c0666D4557K13975a67265
15951f3380A60446d374j62103A99162a09436a8295k64028B60248E0216a55318
15940E7446h3564I7026A7730G562L27747i1338I8570c14363B12166l7725O8163
15929B42604J74363A98295f6928l93613A6294b89260E0102a89461B231Q4453a3594
15917D223P1540a30328A60923K90220F8470l3680i0676j11430h4532A03728B7929
$$ y = [158568, 58513, 41005, 333917, -13877, 102537, 727, -169260, -230330, 162221, 142528, 216231, -49370, -88244, -5777, 124769, 188416, 15610, 297529, 314160, 276728, 354047, 763813, 541719, 778761, 860528, 948517, 995751, 699561, 883303, 618265, 580878, 258532, 264015, 377250, 57134, 358508, 177077, 16860, 99631, -30666, 44557, 258532, -167265, -63380, 160446, -4374, -166477, 199162, -109436, -18295, -282323, 260248, 50216, -155318, 57446, -83564, 97026, 17730, 7562, 335309, -91338, 98570, -314363, 212166, 174441, 242604, 416967, 198295, -66928, -460541, 16294, -289260, 50102, -189461, 2231, 86684, -13594, 4223, 75763, -130328, 160923, 451143, 68470, 34790, -90676, -202106, -84532, 103728, 27929]
15905a29656A7076K65484k3925J0965a18129o0936G117R698Q8564b1714O253B83416
15892i4960A40259E1127J47754b57204B78376b12264H1778a05604C59866A30257
15881B8266J93422J71855A71153a29684m9866A90326i8994B63548B3145L06224
15871C29369i1116C5962A6253b24848e5701j52374B02164f497C6429b25533G0067
15859A95368j5701b50540j31465A45049P851h8575A41777o7093a3368r3724k83136
15848c90228B54691G3813a09731j55367C53277a5954C9647M1056h3177C22850
15837a89423C7626p161f9841l651m4179N4968m4375A25710E9068K55426A30409
15825C99480j20440a46994Q044m9294k8457j9619d0856n6419n8887N8286b1159
$$ y = [-129656, 17076, 282560, 258635, 269600, -118129, -179065, 7117, 16815, 105379, -21714, -15461, 283416, -94960, 140259, 51127, 198881, -257204, 278376, -212264, 81778, -105604, 359866, 130257, 28266, 221688, 393543, 171153, -129684, -179550, 190326, -98994, 263548, 23145, 329369, -91116, 35962, 16253, -224848, -55701, -208075, 202164, -6497, 36429, -225533, 70067, 195368, 179667, -250540, -382005, 145049, 152900, -88575, 141777, 74684, -13368, -107092, -390228, 254691, 73813, -109731, -265098, 353277, -15954, 39647, 80703, -83177, 322850, -189423, 37626, 30465, -69841, -73492, -117671, -62703, -107078, 125710, 59068, 314494, 130409, 399480, 279040, -146994, -138950, -188244, -216701, -236320, -40856, -97275, -156162, -97876, -21159]
15813b76047E9064a43521b0531k07869R5669M086e2366l31616A17270a51314g264
15801C26129b46215I9710Q629a39183p365j08602B03920a79671A69137a72131
15790a92186g3307B34547a36661H1996P0584O6814I3585N7975A7539h3038F547
15778b6032j75343a6366j42286C1128L50222F668Q0566J4168A697R2839a1068
15766a8980q9618M7157P617J2105G9518a67654C1569J8573a12702a1290j28512
15755a39802C00178b71950h7161j22815D4486a13111d8254K3857A99192G2370
15744B3881N020K89476a15937E7437b09061I3677a6795B98901C7881c46636A12757
15732G0655M6884K66619c7008A6774J39183C1852A5572K16379a36022c3476A17928
$$ y = [-276047, 59064, -143521, -20531, -228400, -132731, -128645, -52366, -383982, 117270, -151314, -7264, 326129, -246215, 99710, 108339, -139183, -146548, -255150, 203920, -179671, 169137, -172131, -192186, -73307, 234547, -136661, 81996, 152580, 219394, 93585, 151560, 17539, -83038, 6547, -26032, -201375, -16366, -158652, 31128, 381350, 6668, 87234, 101402, 1697, 94536, -11068, -18980, -108598, -61441, -53824, -41719, 79518, -167654, 31569, 50142, -112702, -11290, -139802, 300178, -271950, -87161, -209976, 44486, -113111, -48254, -24397, 199192, 72370, 23881, 28901, 318377, -115937, 57437, -209061, 93677, -16795, 298901, 37881, -346636, 112757, 70655, 117539, 384158, -37008, 16774, 155957, 31852, 15572, 231951, -136022, -33476, 117928]
15720f6322C0976g3276k16829O4098B3668c16713a25682j04024C04544p0196o7615
15709A66733a81904G3842a36602B13635B4267Q0358L1663c64513b7499j07891
15699a35390F5274a31210F4777f9888j44261F2870a8275E7978g450C9016a57523
15687a1138E0753J13444p9972J42145j01159m9320c98221a07460l3603K6503A78712
15675b34069J14095L3503D07927B4892a76785C10292a2671k2182a6278k29901
15665b46179R2454A91306a13340a1709j5758D2050a97696B7494k88a36979e2425
15653b86073d9864B24907a89729o4309b978j14j76432g9628j639b5624I524a77038
15640E2513c16940J22605b8280A67983c86580a13993d8228F8991a34711j50833
$$ y = [-66322, 30976, -73276, -290105, -226007, 23668, -316713, -125682, -229706, 304544, 234348, 166733, -181904, 73842, -136602, 213635, 24267, 104625, 136288, -364513, -27499, -135390, 65274, -131210, 64777, -69888, -214149, 62870, -18275, 57978, -7450, 39016, -157523, -11138, 50753, 164197, 84225, 226370, 125211, 75891, -398221, -107460, -141063, -114560, 178712, -234069, -119974, -86471, 407927, 24892, -176785, 310292, -12671, -34853, -16278, -246179, -153725, 191306, -113340, -11709, -27467, 42050, -197696, 27494, 27206, -136979, -52425, -286073, -49864, 224907, -189729, -254038, -2978, -3092, -179524, -79628, -81267, -25624, 9524, -177038, 52513, -316940, -194335, -28280, 167983, -386580, -113993, -48228, 68991, -134711, -285544]
15630b85544J22326f6624b6221k65632f0455B71900A2311J48982d6287j09674
15620a55961q219e2550j99205C35346E8813c7273B6669a48244A7548b60473j10262
15609c70735E3427h6079i143o0233A99322b42998a18672A45715C7639J08929j895
15598A44673R7220E9816d9989B50833n8818a16554A0979a84251c0698j73541g0173
15586d9954K1184C2448d34090B4059a57078M3133j35386J24086k054d9175n0451
15575i9626A65601o2403K5879g2792A98665H1051J15459b59224g5879J7987E8735
15563B49867a2817k43099M8790C1653M24166A61171o2924a33112j6135g977m7870
15552e5847I9270B7245b13161F8678B40K11225a0142o1213o2847j27768R6605
$$ y = [-285544, -163218, -66624, -26221, -291853, -60455, 271900, 12311, 161293, -46287, -155961, -164180, -52550, -251755, 335346, 58813, -37273, 26669, -148244, 17548, -260473, -370735, 53427, -86079, -9143, -69376, 199322, -242998, -118672, 145715, 37639, 146568, 144673, 241893, 59816, -49989, 250833, 192015, -116554, 10979, -184251, -30698, -204239, -70173, -49954, -28770, 32448, -434090, 24059, -157078, -113945, -249331, -125245, -127299, -49175, -99626, 165601, 103198, 129077, -72792, 198665, 81051, 196510, -259224, -75879, -57892, 58735, 249867, -12817, -255916, -207126, 31653, 455819, 161171, 98247, -133112, -149247, -7977, -55847, 99270, 27245, -213161, 68678, 240, 211465, -10142, -71355, -134202, -261970, -165365]
15541a65365j84123A2518a32734c8838D4102N0883a04332d9079k8650a5716A22225
15529A36468E6628b49820a8014A03215b83651j564A8150a51427j57912c2414j8183
15518e0597C9937b5942k711B03451o1104B623J70419J01978a11141a9162B9644
15506i5632m7918A47441p125h0972C81985j45251m4030O1850H2024J57649O6908
15495C06581L6777j54497p2882m2022i5844H6036e0285B24556o0835a75425A18476
15483C94797C1847O4980Q0315a25182j0016B0746a0959A64724F9599B8911R9628
15472A28539J01826d9869G33554e7527K4439E0822K55977J49689A76210a9553
15461a93413B47181K22040K96821k82155J75905B27992K31515E4925K13707j26769
$$ y = [-165365, -349488, 12518, -132734, -38838, 44102, 94985, -104332, -49079, -77729, -15716, 122225, 136468, 56628, -249820, -18014, 103215, -283651, -285215, 18150, -151427, -309339, -32414, -50597, 39937, -25942, -28653, 203451, 142347, 2623, 173042, 275020, -111141, -19162, 29644, -95632, -143550, 147441, 140316, -80972, 381985, 236734, 192704, 254554, 82024, 239673, 306581, 343358, 188861, 115979, 73957, -95844, 86036, -50285, 224556, 163721, -175425, 118476, 394797, 31847, 96827, 177142, -125182, -135198, 20746, -10959, 164724, 69599, 28911, 128539, 230365, -49869, 733554, -57527, -33088, 50822, 306799, 456488, 176210, -19553, -193413, 247181, 469221, 766042, 483887, 659792, 227992, 459507, 54925, 268632, 141863]
15451A41863a09738D3807J7945a802j52807B83380h9441G1162c4962A0985J45021
15440A56006c2248l5466B27657l9619J85419d44752g0994B99066F3846Q5297a3593
15428D09615j87898L25986k47572N18367p0463l6951B10817L859N498q1482n2030
15417H6662i0333N357j01339L6281B2425L5894A2273c58609C29303A13494B8576
15405C79849j15761I6090g7938I4090b64844L7317h1159A97987J50054A3723J57704
15394A71427a9968l3166A26629M1571A2173a31428F2299a15821q9852d6447C21844
15382a28682r7923d8744k50299m266c3134B153d29213A07956K19184F3590a41707
15370A20525j1280l3706R3551A062L48006j47108m3572a69003B21318a03136B8920
$$ y = [141863, -109738, 43807, 61752, -1802, -154609, 283380, -89441, 71162, -34962, 10985, 156006, -32248, -67714, 227657, 188038, 373457, -444752, -70994, 299066, 63846, 149143, -13593, 409615, 221717, 547703, 300131, 818498, 748035, 711084, 210817, 214676, 220174, 138692, 86662, -90333, -84976, -186315, -150034, 22425, 58319, 12273, -358609, 329303, 113494, 28576, 379849, 264088, 96090, -77938, 94090, -264844, -227527, -81159, 197987, 348041, 13723, 171427, -19968, -53134, 126629, 168200, 12173, -131428, 62299, -115821, -205673, -46447, 321844, -128682, -226605, -48744, -299043, -303309, -33134, 2153, -429213, 107956, 327140, 63590, -141707, 120525, 109245, 75539, 169090, 1062, 349068, 201960, 158388, -169003, 221318, -103136, 28920]
15358B55895P7207j14225q480F9004b26909A35566k5044a53041C5359K50148N4414
15347C39921a25879A97278A4804M4677L1505K51596K62867j74621a58658F9325
15336A30899l0681l3997i7640o1794K5685A75646M21189B61711N0372P3024l3307
15325C51800l993R1244l9687n253H7765J82346a13805B55315c6471B01244P3293
15314B74537e9910B01586E0516h5373D82156B27618k7027r0598h0719E8081K7579
15303H5660D0462K21812n6472e0459B01750a1853A80137Q0369M3568o8952h0561
15291A24725J14744M1263j16033a83950A32993E7433c28548D3192a29407J6819
15281a12588I3783R5923a61095e6332l1676F485J24552n0167a8063A58538F9034
$$ y = [255895, 333102, 218877, 210397, 69004, -226909, 135566, 110522, -153041, 35359, 285507, 339921, -125879, 197278, 14804, 59481, 90986, 342582, 605449, 430828, -158658, 69325, 130899, 100218, 66221, -97640, -159434, -133749, 175646, 596835, 261711, 312083, 385107, 351800, 347807, 439051, 399364, 394111, 87765, 270111, -113805, 255315, -36471, 201244, 274537, -59910, 201586, 50516, -85373, 482156, 227618, 200591, 109993, -80719, 58081, 85660, 40462, 262274, 205802, -50459, 201750, -11853, 180137, 260506, 304074, 235122, -80561, 124725, 239469, 280732, 164699, -183950, 132993, 57433, -328548, 43192, -129407, -112588, 93783, 189706, -161095, -56332, -88008, 6485, 131037, 80870, -18063, 158538, 69034]
15269a36320N6462A33129h782H9746O917E6N9835K46088o0371G7506O7660D5795
15256i5467A07118M987Q4396a72424C38474a53974j3953A94343A7821J01772o887
15245A12706R8203l4527p597F9190R9597a22626c5764C29464A5513f6621K3045
15234d3576j41873c9545D33962k11902P70816J28083K46070k3794j92531k73298
15224H77406C61579A05639J41636A20583k5765K9836e9245D08196f2686A99035
15213A6820M6191N2908N5111K6184A9934b69201A99376O5440b90411h0820B77753
15201a82519h0182G7171A0612B306M8292L6520j5626C5521J40468K47665i8784
15189A56332p4921b3550A80688a43769B0469d0000a1950B39817o7384M0497b0606
$$ y = [-136320, -79858, 133129, -8782, 89746, 96663, 56, 59891, 305979, 245608, 77506, 145166, 45795, -95467, 107118, 112105, 196501, -172424, 338474, -153974, -167927, 194343, 17821, 119593, 112706, 210909, 176382, 168785, 69190, 168787, -122626, -35764, 329464, 15513, -66621, -43576, -185449, -39545, 433962, 222060, 992876, 1120959, 1367029, 1343235, 1150704, 877406, 361579, 105639, 247275, 120583, 94818, 124654, -59245, 408196, -62686, 199035, 16820, 63011, 115919, 171030, 197214, 19934, -269201, 199376, 264816, -290411, -80820, 277753, -182519, -80182, 77171, 10612, 2306, 50598, 87118, 71492, 35521, 175989, 423654, -98784, 156332, 81411, -23550, 180688, -143769, 20469, -40000, -11950, 239817, 172433, 212930, -20606]
15177b00981c7919A19565i9860j45300B14503c7824A39063n7978J55697p0497
15167A66285a81086G3980M1971l5023J00091q0587i5902H119K71219j38735l5164
15156A05439J7306A2535a4736B46402k4455a92668B76519c1649j52203B76858
15145a2925A15222L0111d02699I840b7106k6670D28431a22140D4088K77383A52635
15133A39215e9157I6819K27583b25740f542A5802J52875D4957h0764D7258M3136
15122I0394L48543A58979k0673m2998K31399k7001j37125H1158r071J95259o6530
15111B00816o5265b24105A84128e0455A85434J66263j34186J75480A91492o61
15101A90831K10747b21301E16261h9552j30954G2352c0830B72739q062A16325
$$ y = [-200981, -37919, 119565, -99860, -245160, 214503, -37824, 139063, 81085, 236782, 166285, -181086, 73980, 115951, 80928, 181019, 100432, -95902, 8119, 279338, 140603, 105439, 122745, 12535, -14736, 246402, 221947, -192668, 276519, -31649, -183852, 276858, -12925, 115222, 145333, -402699, 9840, -27106, -53776, 428431, -122140, 44088, 321471, 152635, 139215, -59157, 96819, 324402, -225740, -6542, 15802, 168677, 44957, -80764, 47258, 90394, 438937, 158979, 138306, 95308, 326707, 299706, 162581, 81158, 72087, 267346, 200816, 135551, -224105, 184128, -50455, 185434, 351697, 217511, 392991, 191492, 190831, 401578, -221301, 516261, -89552, -220506, 72352, -30830, 272739, 264677, 116325]
15090C04326l4500H1002O2533n2922L46265A46319a4691D15026k05075J47638
15080C57589I1707J95993d2919j4439E9617k6952g4861A38115K55638A6146J99747
15069B15893n1412k9452O7180K9918h4797B28472I1205A9016P8497K25622J88378
15058E11513B7976J57233a09840A366K10027b57989c5281A24431M17534M2548
15048E84513A58251D6196L98972A78118n6777L76374F5741K88952J23614H3100
15037C03375n9113H0718N12315j60931L10666k54622n5020j8887A05365b42573
15026C29140O1476K2774j20161N5717J23908n4899K6436j76893J92836I6423M87349
15015E83772K8052j32297l2004K00319M7070K9885B93817L11204r3021J95945
$$ y = [304326, 269826, 81002, 143535, 90613, 436878, 146319, -14691, 415026, 209951, 357589, 91707, 287700, -42919, -57358, 59617, 32665, -74861, 138115, 393753, 16146, 215893, 164481, 135029, 202209, 232127, -84797, 228472, 91205, 19016, 97513, 323135, 511513, 27976, 185209, -109840, 1366, 211393, -257989, -35281, 124431, 541965, 584513, 158251, 46196, 445168, 178118, 121341, 497715, 65741, 354693, 478307, 83100, 303375, 244262, 80718, 593033, 432102, 742768, 488146, 433126, 414239, 105365, -242573, 329140, 390616, 413390, 293229, 348946, 472854, 417955, 444391, 267498, 460334, 96423, 583772, 611824, 479527, 447523, 647842, 694912, 724797, 293817, 605021, 512000, 707945]
15005G07945n4482k63230K6025O8457n157j07498J77682l735A98626J79180j58862
14994B18944L32421L371K6945B73988j08795K43797j27625O2559L6010R8099J82491
14983F60524C22820l9637p0708L11804A87639K4559L09645j95502J21689N8599
14973E06629J33707j31116k47422M37510m8015j14718K09434l29059L37725j3155
14963G41520j52827J05508k21599r0397L33392j65593J2651L5829J618k36081
14953C64021P5602A47782E5278M96672j57268K2063j37526r2843K10470p2249
14943C24597H0267L53490k10024L19067B5449K66139N6815J76915j1205j14274
14933C99839K66886A93852m3222L12706L40776j12469j41107K28892j40156R7659
$$ y = [707945, 653463, 390233, 416258, 484715, 479558, 372060, 549742, 546007, 198626, 377806, 218944, 551365, 554736, 581681, 273988, 165193, 408990, 281365, 343924, 379934, 478033, 660524, 322820, 283183, 212475, 524279, 187639, 212198, 521843, 326341, 448030, 506629, 640336, 509220, 261798, 699308, 651293, 536575, 746009, 416950, 754675, 741520, 588693, 694201, 472602, 382205, 715597, 550004, 562655, 598484, 600102, 364021, 439623, 147782, 55278, 551950, 394682, 416745, 279219, 186376, 396846, 324597, 80267, 433757, 223733, 542800, 25449, 291588, 348403, 525318, 514113, 399839, 666725, 193852, 150630, 463336, 804112, 691643, 550536, 779428, 639272, 736931]
14923G36931k20963L422o38J34400L8858k05459J68893j32024J91611K65194K38351
14912A218576L2882J01638J08500j73069M17263l18541K01326m22021K59478N44837
14902A970869j51777K03189k21095k88112k15441Q5790n26122k1904k76627L30944
14892H89714C41353K14836L1215B59981J57885j96979P3201J66410B05714J18824
14882C24538J66872B39641K40013A31394J20546J72513J40035A84391J33573P3678
14872C91642K58421N1182J23107p9414j52971J76995r5851Q4656j51564L20843
14862I27046J04695k31323j18767P5421k81454A92250R6504M35889P2768j88608
14852F08803K51131M0664m02748L56958m17332J17833K19062A52968K70612k2300
$$ y = [736931, 515968, 519390, 518752, 653152, 692010, 486551, 655444, 523420, 715031, 980225, 1218576, 1251458, 1353096, 1461596, 1288527, 1705790, 1387249, 1588575, 1166554, 1426032, 1970869, 1819092, 2022281, 1801186, 1513074, 1297633, 1383423, 857301, 835397, 558770, 889714, 341353, 556189, 587404, 259981, 417866, 220887, 294088, 460498, 205714, 324538, 491410, 239641, 479654, 131394, 251940, 424453, 564488, 184391, 317964, 391642, 650063, 701245, 824352, 744938, 591967, 768962, 673111, 757767, 606203, 927046, 1031741, 800418, 681651, 757072, 475618, 192250, 288754, 724643, 797411, 608803, 859934, 900598, 497850, 854808, 437476, 555309, 774371, 152968, 423580, 401280]
14842D01280J87272j48232j90495J01332P0535j90828K28692J21096O8399j87931
14832D61120R0339j77617J71055J85713K82514j0326J74794k94246N51444n08521
14822I26269l4076J71657k29543l29439L37036r0320k42288k553J0364J39357
14812F56464R3628k21720K2396K78762k3090q5024j43871J95735J7368k84147
14802E06501J44473k5662k63495M18187k7687J65036k77096j43413L21302r4900
14792G23246J52445j99859O5915K94470j34131k15062K21307n33k96891j60701
14782D50206l2690O4970K28434l42485J18529r0717R7483L31002j3205l55193
14772D56334r1318j60844M01785j87556R9693p702j3141q7315K91666P6264p5560
$$ y = [401280, 588552, 440320, 249825, 351157, 421692, 230864, 459556, 580652, 649051, 461120, 551459, 373842, 544897, 730610, 1013124, 1002798, 1177592, 883346, 1434790, 926269, 892193, 1063850, 834307, 504868, 841904, 751584, 509296, 506743, 517107, 656464, 750092, 528372, 550768, 829530, 806440, 721416, 577545, 773280, 790648, 506501, 650974, 625312, 361817, 780004, 752317, 917353, 640257, 496844, 818146, 723246, 875691, 675832, 741747, 1036217, 902086, 687024, 908331, 907798, 610907, 450206, 417516, 482486, 710920, 368435, 486964, 396247, 493730, 824732, 811527, 456334, 365016, 204172, 605957, 418401, 518094, 510392, 497251, 409936, 701602, 777866, 702306]
14761G02306L45512k31856J11923k25677Q5712J42935m45242O12310j28312C56048
14750F41385J08149J42161l01183N7850B86917L53223j28330L61521k60479K7953
14740F40805L3286m4871K44231k15518N0702B97136M04185m1901J08820j42708
14730F25532j26232N6477M5617M7112j27470M55633j52081P6172o9570k6646J57309
14719I61853j8551j96237l8080l2439L20094J34670n11026P57985K2853K73830
14709A674952q2640n0716l37113k9697k06487R1067J81524j47711k6598m8108
14699A018473m95065M16006O4808k83423J89674l804m03739N32764N2434j19462
14689I68666O9873o6519K50687O3344M77320n7962j63352j03536k01282J42683
$$ y = [702306, 1047818, 815962, 927885, 702208, 787920, 930855, 485613, 1097923, 969611, 356048, 641385, 749534, 891695, 590512, 648362, 286917, 640140, 511810, 873331, 612852, 640805, 674091, 629220, 873451, 657933, 708635, 297136, 701321, 659420, 768240, 625532, 499300, 555777, 601394, 648506, 521036, 976669, 824588, 900760, 831190, 804544, 961853, 943302, 747065, 708985, 676546, 996640, 1131310, 620284, 1378269, 1401122, 1674952, 1592312, 1541596, 1204483, 1174786, 968299, 1059366, 1240890, 1093179, 1066581, 1018473, 523408, 939414, 1004222, 720799, 910473, 906669, 502930, 1035694, 1088128, 968666, 1038539, 972020, 1222707, 1286051, 1763371, 1705409, 1542057, 1438521, 1237239, 1379922]
14679A379922l65137K68748l00070L31978l48935J40100o032l40358j52981Q23579
14669A430814n21336K19582l61035J68290n9623L55288l63187K34793k85052J76261
14659I94795O9942m51221K38714R9914K70944k70009J91223J95649j66336m1059
14649A132556J7352j27192q8583L84206m08702M33071m30603K47436l3284j13720
14639A012537j8940L79400j66820R6215j81506J68029K75509r0001L5437l2693
14629A477167k11512l08910L16888l86151J80798L41308r2805K99147k27790m69466
14619I18674N80483p3423k33947M39273k39212M1872o2520J77574k55151K86589
14609A580212J70752o49121J51350K66362l06012J59249m1108j63131L31903R22
$$ y = [1379922, 1014785, 1283533, 983463, 1315441, 966506, 1106606, 1100574, 760216, 607235, 1430814, 909478, 1129060, 768025, 936315, 876692, 1231980, 868793, 1103586, 818534, 994795, 1064737, 613516, 852230, 952144, 1223088, 953079, 1144302, 1339951, 1173615, 1132556, 1149908, 1022716, 934133, 1318339, 909637, 1342708, 912105, 1159541, 1126257, 1012537, 993597, 1372997, 1206177, 1302392, 1120886, 1288915, 1564424, 1474423, 1509860, 1477167, 1265655, 956745, 1273633, 887482, 1068280, 1409588, 1316783, 1615930, 1388140, 918674, 1499157, 1425734, 1191787, 1631060, 1391848, 1433720, 1371200, 1548774, 1293623, 1580212, 1750964, 1101843, 1253193, 1519555, 1213543, 1372792, 1331684, 1168553, 1500456, 1501378]
14599A501378J01792l48920J70055l47220M61805J61296k45307k16317M09498
14590A648060k39888K8009R701P1270r6749K41088K87748l92820O2633l22066
14580A296986M84645l86557J32837K08960J89699m6447l10209J31349L9973r7739
14570A643497L64785j23145N1707k16250K96986l8778K7546q0077M44293k12629
14560B157935o949J80967m14351J41082L14215m69682M68366j79782j72069M64245
14550B483977K59485m52481L29604K76190j85131M43305k04393Q96695l44907
14541C502344J9909M22003L25866M81160R56742O61699J197163K719456L910360
14532A4196702O677155R467323j872700j1036988o431531l879740j178717m73158
$$ y = [1501378, 1603170, 1254250, 1424305, 1077085, 1538890, 1700186, 1454879, 1238562, 1648060, 1408172, 1436181, 1445882, 1517152, 1420403, 1661491, 1949239, 1556419, 1619052, 1296986, 1781631, 1395074, 1527911, 1736871, 1926570, 1880123, 1569914, 1701263, 1741236, 1643497, 2008282, 1885137, 1936844, 1720594, 2017580, 1978802, 2006348, 1926271, 2370564, 2157935, 2150986, 2331953, 1917602, 2058684, 2372899, 1903217, 2371583, 2191801, 2019732, 2483977, 2743462, 2290981, 2620585, 2896775, 2711644, 3154949, 2950556, 3847251, 3502344, 3522253, 3944256, 4270122, 4751282, 5708024, 6369723, 7566886, 10286342, 14196702, 20873857, 30341180, 28468480, 17431492, 10999961, 7120221, 5941504, 5468346]
14524E468346L60853j629976p04396o30711k54980j76283j60700J7334l589K01787
14514B487685j00775o2697L17103j50886p9700P6334k54220L75553r6814m2099
14504B469484o6091N28249q31014L28494J6473M98145P2945k39073Q0373j69911
14494B688074q4059N24690j41529K35314j96243k13910l5003K9852N15137j5561
14484C306762k23053Q2942N4368J1750M4152K63124J5445q8372k25073K94616
14474C536661l20156L41215j3584j65649L5080N98788l6590m11493N27961k56844
14464C835389J76209k36680M89658r3379o0115q2912K32632K07153k16577L02152
14454D553530j31570j18249R5982K27337L36898k58670k09741K89436j4603L09504
$$ y = [5468346, 5829199, 4199223, 3494827, 2864116, 2609136, 2432853, 2272153, 2289487, 2285898, 2487685, 2386910, 2324213, 2641316, 2490430, 2410730, 2487064, 2232844, 2608397, 2511583, 2469484, 2403393, 2931642, 2100628, 2429122, 2445595, 2943740, 3016685, 2777612, 2857985, 2688074, 2604015, 3128705, 2987176, 3222490, 3026247, 2812337, 2777334, 2807186, 3322323, 3306762, 3083709, 3166651, 3221019, 3232769, 3276921, 3540045, 3555490, 3467118, 3242045, 3536661, 3216505, 3557720, 3544136, 3378487, 3413567, 4012355, 3975765, 3564272, 4092233, 3835389, 4011598, 3774918, 4264576, 4171197, 4111082, 4028170, 4260802, 4467955, 4251378, 4553530, 4421960, 4303711, 4399693, 4627030, 4963928, 4705258, 4495517, 4784953, 4770350, 5079854]
14444E079854N1418n2107n2085J96531k12540L80074j75181K51387P5181k3504
14434E519028j54618J61504P9796J942J82913j10506K13469k4310K80087j61883
14424E987422R3758K66406L22033l09018N79463k15830L84238k92808M07277k23335
14414F999606K25258k0638J91566J28911j85633J30075K59475L06410J06768J48346
14404H290144J64272L80439k12757P252M26540j94851J41711k4218K45059K6067
14394I249658K94965K81398j00004M15180J40707M0012M60845o16212O32427m4355
14384A0754621K54360J86156K61380j7446J80558N90336j03815J83695l9635M37947
14374A2688157L64459L35417j35533L15405L62023L94891R3487M65165J62693
$$ y = [5079854, 5131272, 5079165, 5027080, 5223611, 5011071, 5391145, 5215964, 5467351, 5542532, 5519028, 5364410, 5525914, 5605710, 5607652, 5790565, 5680059, 5893528, 5869218, 6149305, 5987422, 6081180, 6347586, 6669619, 6360601, 6940064, 6724234, 7108472, 6815664, 7222941, 6999606, 7224864, 7204226, 7395792, 7524703, 7339070, 7469145, 7728620, 8035030, 8141798, 8290144, 8454416, 8834855, 8622098, 8629350, 9055890, 8861039, 9002750, 8978532, 9223591, 9249658, 9544623, 9826021, 9726017, 10141197, 10281904, 10321916, 10782761, 10166549, 10798976, 10754621, 11008981, 11195137, 11456517, 11439071, 11619629, 12209965, 12106150, 12289845, 12250210, 12688157, 13052616, 13388033, 13252500, 13567905, 13929928, 14324819, 14418306, 14883471, 15046164]
14365A5046164K48673Q47077k63941L92066K63623o3908P26216L32494L58790
14356A7887254J69050O10023L99361K83215K91356N13757K45132P34036L63882
14347B1497066L84563L14163Q07069L09992L32541Q98092L55366R03857M59608
14338B6262317R16740L86451Q40326M01651Q34910O63305J123061O26856R61865
14329C3017482P88985R97500Q20000J199495R49798P98979J442698J334518Q74024
14320D2223479J633610J472434J246559J091755J913877J514669J556742J974350
14312E4627475J752416J709126K432525J679463K403410K165672K698463K427405
14304G1895955K739393K776732L037365L083903L157468L850694L382073M320155
$$ y = [15046164, 15294837, 16141914, 15877973, 16270039, 16533662, 16469754, 17195970, 17528464, 17887254, 18056304, 18666327, 19065688, 19348903, 19640259, 20154016, 20399148, 21133184, 21497066, 21881629, 22195792, 23002861, 23312853, 23645394, 24543486, 24898852, 25802709, 26262317, 27179057, 27565508, 28405834, 28807485, 29642395, 30305700, 31428761, 32055617, 33017482, 33806467, 34803967, 35623967, 36823462, 37773260, 38572239, 40014937, 41349455, 42223479, 43857089, 45329523, 46576082, 47667837, 49581714, 51096383, 52653125, 54627475, 56379891, 58089017, 60521542, 62201005, 64604415, 66770087, 69468550, 71895955, 74635348, 77412080, 80449445, 83533348, 86690816, 90541510, 93923583, 98243738]
14296I8243738L962685M820099M263174N016143N192642N830550O221825O426447
14288A39977303O444176P149032P077524Q403715Q341221R239380Q796607J0017690
14280B05446648J0855375J1385179J1656953J2026253J2119405J1930090J2037663
14273B87457566J2629997J2761498J3559125J3224380J3945513J4168340J4012001
14266C81758420J2708218J2826269J1615930J0349056R292142P638263N632890
14259D51821188M856337K754253O89842j093566k89339n254705j0467176n940150
14251D37076684j0785544j3707941j2824414j2059125j1716205j1659978j3607449
14244C50716028j4099698j5010901j4282450j3419628j3175998j2681221j2369761
$$ y = [98243738, 102206423, 107026522, 111289696, 116305839, 121498481, 127329031, 133550856, 139977303, 146421479, 153570511, 160648035, 169051750, 177392971, 186632351, 195428958, 205446648, 216302023, 227687202, 239344155, 251370408, 263489813, 275419903, 287457566, 300087563, 312849061, 326408186, 339632566, 353578079, 367746419, 381758420, 394466638, 407292907, 418908837, 429257893, 438550035, 446188298, 451821188, 456677525, 459431778, 460121620, 459028054, 458738715, 453484010, 443016834, 437076684, 426291140, 412583199, 399758785, 387699660, 375983455, 364323477, 350716028, 336616330, 321605429, 307322979, 293903351, 280727353, 268046132, 255676371]
14237B55676371j1755286j1828404j1033445j0501598j1095323j0017637r567816
14230A79876862q993626q134779q011917p370077p028195o404324o221179n287683
14222A22425082n348683n207734m664290m760963m016783l873710l367627l869607
14214H7315685l301454l278736l106982l002752k482397k868323k403037k348395
14206F4523609j969157k120820j980964k169601j606406k081272j272556j514684
14198D9808149j526677j223819j619648j426651j364477o82967j377493q10706
14190C9775711j115109j450225o67560j352175q17611m02043j122208j029758
14182C1819022o06874q51838o94241p19800p57750p04367m73745o97367p05234
$$ y = [255676371, 243921085, 232092681, 221059236, 210557638, 199462315, 189444678, 179876862, 170883236, 162748457, 154736540, 147366463, 140338268, 133933944, 127712765, 122425082, 117076399, 111868665, 107204375, 102443412, 98426629, 94552919, 91185292, 87315685, 84014231, 80735495, 77628513, 74625761, 72143364, 69275041, 66872004, 64523609, 62554452, 60433632, 58452668, 56283067, 54676661, 52595389, 51322833, 49808149, 48281472, 47057653, 45438005, 44011354, 42646877, 41963910, 40586417, 39775711, 38660602, 37210377, 36542817, 35190642, 34373031, 33970988, 32848780, 31819022, 31212148, 30360310, 29666069, 28946269, 28188519, 27484152, 27010407, 26313040, 25607806]
14173B5607806m72011n56358m42387q80152m39720n01135j77063r49669J48458
14164B1337769r29640j27137m01072o06171l64359m87041l60155l73929m9571
14155A7638694j98836l71353p11807m41588j9171l34285k40790k16433k25378
14146A4879053n36881k21301n1644l31615k45248k42352j87639p2325P4447o06454
14136A2458041J14334k64609p38366j02418n4905k04495m075k79630j11924l44392
14126A0467561J23553o9463m24915j32516j60719o9768k59184k10652K83013m1641
14116I505269k74708j51048l10460J81637m47169r3411J50382m0084k71169k22382
14106H026857J0329j77145m5270k9322k05286j1293o29001M09552j7059l34163
$$ y = [25607806, 25135795, 24579437, 24137050, 23256898, 22817178, 22316043, 22138980, 21189311, 21337769, 20408129, 20280992, 19879920, 19273749, 18909390, 18422349, 18062194, 17688265, 17638694, 17439858, 17068505, 16356698, 15915110, 15895939, 15561654, 15320864, 15104431, 14879053, 14342172, 14120871, 14069227, 13737612, 13492364, 13250012, 13062373, 12990048, 13064495, 12458041, 12572375, 12307766, 11569400, 11466982, 11412077, 11207582, 11203507, 10923877, 10811953, 10467561, 10591114, 10521651, 10096736, 9964220, 9803501, 9733733, 9474549, 9263897, 9546910, 9505269, 9230561, 9079513, 8769053, 8950690, 8503521, 8410110, 8560492, 8520408, 8249239, 8026857, 8037186, 7860041, 7814771, 7785449, 7580163, 7568870, 6939869, 7349421, 7332362, 6998199]
14096F998199j38776m484j00033j50320N513j36889J7948j03411j8745j97995
14086F171007K8578l16957j17747J67579N0472J51078l39781l80889L99283k51653
14076E560970k35062j74552L51576l31989M0372J69570l00798j35882K10169l59382
14066D794992k0151J66985j22662k5714J75035l39319l8447j3758N879j07412
14056D475428Q734k19576L51663l32591k22580M60419m52329K55395k25568K5192
14046D124187L0768K13832m9604m68709L9754K61066k65336K9806l23375M03356
14036C995745K3639m06532k58600J56335n1448p2593R7178J6235j13245R9921
14026C486635j07727l40505J32411K29160j68014k28193J6812J05223p2683J58648
$$ y = [6998199, 6859423, 6854939, 6754906, 6604586, 6610099, 6473210, 6491158, 6387747, 6369002, 6171007, 6199585, 5882628, 5764881, 5932460, 5982932, 6134010, 5794229, 5413340, 5812623, 5560970, 5325908, 5151356, 5502932, 5170943, 5211315, 5380885, 5080087, 4944205, 5154374, 4794992, 4774841, 4941826, 4819164, 4793450, 4968485, 4629166, 4590719, 4576961, 4582840, 4475428, 4484162, 4264586, 4616249, 4283658, 4061078, 4521497, 4069168, 4324563, 4098995, 4124187, 4154955, 4368787, 4319183, 3850474, 3890228, 4151294, 3885958, 3915764, 3592389, 3995745, 4019384, 3612852, 3354252, 3510587, 3459139, 3386546, 3483724, 3499959, 3386714, 3486635, 3378908, 3038403, 3170814, 3399974, 3231960, 3003767, 3020579, 3125802, 3053119, 3211767]
14016C211767j77098j88886J52632J82226Q376l86808j19968q4230l2928L48538
14006B913621l91371M64953m21463J21940k71391J42832K38018o7434j60611J14507
13996B683601Q355O2432k66476J91871R3215o53396L62623L97589l37513j03697
13986B438604L74431n16188p2087n5035M20989J26874J00113J5183K69385O78153
13976C780422K79009Q21189J572904L018300O195703J0078973M708195r181699
13968B1272996p003983m665966j767376j938908n84975q83528j48464j53135o26367
13959C500294m04311L6150j19115k57530j25652K62441k77808l03728J75672j70492
13949B315921J98948l77259J29389k29087K49192k78464P4924K0364q6238M4707
$$ y = [3211767, 3034669, 2845783, 2998415, 3180641, 3189017, 2802209, 2682241, 2598011, 2565083, 2913621, 2522250, 2987203, 2565740, 2687680, 2416289, 2559121, 2797139, 2729705, 2569094, 2683601, 2691956, 2754388, 2487912, 2679783, 2772998, 2119602, 2482225, 2879814, 2542301, 2438604, 2813035, 2296847, 2224760, 2169725, 2590714, 2717588, 2817701, 2832884, 3102269, 3780422, 4059431, 4880620, 6453524, 9471824, 15667527, 25746500, 30454695, 21272996, 14269013, 9603047, 7835671, 5896763, 5311788, 4428260, 4279796, 4126661, 3500294, 3095983, 3132133, 3013018, 2755488, 2629836, 2892277, 2614469, 2310741, 2486413, 2315921, 2514869, 2137610, 2266999, 2037912, 2287104, 2008640, 2083564, 2103928, 2017690, 2062397]
13939B062397J45340J4336j16612m7842k22092l5968R422J76962R109L4688l06970
13928A722770K37450l72508K02136J4928K84264l06982J53469m31537L45748K0185
13918A869923j71528J80953j56577Q3383n5740p9114O5618j59777m19232P91596
13908A949505k08094k28112k16898L64066J51470m21713K94884k16127J19148
13899A588129j8069O589k66818L02510n3678p2231J99547k35822k29967O5628
13889A285818J72763k8415J29281n4820n8734k25021K01474j91368L0956K31593
13879A493527r8279q1048j9925J10641j64151J20478k68913Q028K34196j78347
13869A156207j4787j90157M35801o6266j64330K8580j04416J13637o7503J59222
$$ y = [2062397, 2207737, 2222073, 2105461, 2057619, 1835527, 1799559, 1808981, 1985943, 1995052, 2029740, 1722770, 1960220, 1587712, 1789848, 1804776, 2089040, 1782058, 1935527, 1503990, 1849738, 1869923, 1698395, 1879348, 1722771, 1806154, 1750414, 1671300, 1736918, 1577141, 1157909, 1949505, 1741411, 1513299, 1296401, 1660467, 1811937, 1390224, 1685108, 1468981, 1588129, 1570060, 1576649, 1309831, 1612341, 1558663, 1486432, 1685979, 1450157, 1220190, 1285818, 1458581, 1430166, 1559447, 1504627, 1445893, 1220872, 1422346, 1230978, 1261934, 1493527, 1395248, 1314200, 1294275, 1404916, 1240765, 1361243, 1092330, 1100358, 1334554, 1156207, 1141420, 951263, 1387064, 1320798, 1156468, 1185048, 1080632, 1194269, 1126766, 1285988]
13859A285988l6012l49036L76837l74539L16724l37856L99522m32388O4795J38006
13849A052041K14234k458l32459J06424q5066j19986L71909k42703J59603l66336
13839G55203K97344n9374k19878L39254k29946j77384M21573k27048J75449K0183
13829A095376j9291k88970L58959k23127L16019n44149P2649K33822o4988M4678
13819I80978K71062k67624J64544k73559L66628l95335L82237n07787K90161k50154
13809G61151r3357L08553k14222N34842k11284m52963M48288j68905K9020j76342
13799G64781p4775j06570K14136Q4224J06308l9875M7466O5175l21380m1734K03400
13788I01156k7639k26810K4083J63699K15748D64609M72391m47978M30453j35760
$$ y = [1285988, 1249976, 900940, 1277777, 903238, 1219962, 882106, 1281628, 849240, 914035, 1052041, 1266275, 1263817, 931358, 1037782, 952716, 832730, 1204639, 961936, 1121539, 755203, 1052547, 993173, 773295, 1112549, 882603, 705219, 1126792, 899744, 1075193, 1095376, 1076085, 787115, 1146074, 922947, 1238966, 694817, 767466, 1001288, 936300, 980978, 1252040, 984416, 1148960, 875401, 1242029, 846694, 1228931, 721144, 1011305, 761151, 667794, 976347, 762125, 1296967, 1085683, 632720, 1081008, 912103, 941123, 764781, 690006, 583436, 797572, 881796, 988104, 948229, 995695, 1060870, 739490, 697756, 901156, 873517, 646707, 670790, 834489, 1050237, 464609, 937000, 489022, 919475, 783715]
13778G83715j91787K23238j41922J398K24989K0839j84214K18731k39841r3225
13768F21921K30537l01055J54495M56273n73399J22739j57241K30857j51609N91864
13758A225382l27382J07527k09715J90785K0266j89656k58250J02633J50036k56865
13748E54761K46874L3344k05532J57399k16484l4887K11425q102j28516K51351
13738H61633j66075r0388m3433J70558l15437L63332j15102j14840k9642K27466
13728G48072C45594L40539J80781m01195K89183J0186k28343J62234J90923l35741
13718E54161J18080K91205m68753J20149k06803j9792J57140N9570N846k05280
13708D05523Q6926L9133J7435J88823k25634N6740q3680K20836j93077J27624
$$ y = [783715, 591928, 815166, 673244, 674642, 899631, 920470, 736256, 954987, 715146, 621921, 852458, 551403, 705898, 1162171, 588772, 711511, 554270, 785127, 633518, 1225382, 898000, 1005527, 795812, 986597, 1006863, 817207, 558957, 661590, 811626, 554761, 801635, 834979, 629447, 786846, 570362, 535475, 746900, 738798, 610282, 861633, 695558, 605170, 561737, 732295, 416858, 780190, 665088, 550248, 520606, 748072, 345594, 686133, 866914, 465719, 754902, 765088, 536745, 698979, 889902, 554161, 672241, 963446, 494693, 614842, 408039, 388247, 545387, 604957, 610803, 405523, 492449, 531582, 549017, 737840, 512206, 568946, 485266, 706102, 513025, 640649]
13698F40649k0245J27918k62894A25399L80733M0578K8862j98993K55051j74479
13688D57151o1655J53320J3096J94786k44775K73414k81163l3112L57669l23578
13678E05153J79381j78626J81284j77515J67901r7306j42405l6811n746K01888
13668E97198j10649J41168B66853l6840K82400j95008J89563q539B05497m2729
13658A62768K37975J55411p4428r9445c792C03476J96164A35894N57660k67191
13648D26363L81251j88869J96631l20306j96922J1414N0130L76600B79497R5966
13638C75463L64431j44234k4101j32048Q5419k30998k2580J35023k7790p7595
13628C00990m6507J78727J75875J68957j4491k62699m1041q0373J10366A22125
$$ y = [640649, 620404, 748322, 485428, 125399, 506132, 546710, 575572, 376579, 631630, 457151, 395496, 548816, 561912, 756698, 511923, 785337, 504174, 471062, 828731, 505153, 684534, 505908, 687192, 509677, 677578, 580272, 437867, 401056, 395310, 597198, 486549, 627717, 266853, 230013, 512413, 317405, 506968, 498429, 205497, 162768, 400743, 556154, 481726, 382281, -3792, 303476, 499640, 135894, 693554, 426363, 807614, 618745, 815376, 495070, 298148, 309562, 359692, 736292, 279497, 375463, 739894, 595660, 571559, 439511, 524930, 293932, 271352, 406375, 378585, 300990, 254483, 433210, 609085, 778042, 763551, 500852, 459811, 379438, 489804, 122125]
13617C07354j21301J43634m1297K3298O3904M91323A50760K86666k17038L31065
13607E51453k47720J58874k28920P2239N7161Q1033O9926o9133j44140M0314K17511
13596E58598j25957j00766D7247M07676j78726A34230K05797N9576P0502A15487
13585B96058O8734m7691d197C56374J27266n7384j07203q4670J60306r9143K62517
13574E58063j10042l2452B07109K87614q6598B01988L9230M5546R991G4329K57072
13563C31401p9923K72951l1041o0162J06749j17420o3784k6003J0967A09185M65945
13552E75130B75367L00767A91712o172K52687D2979j077J52394k9978J56656r2237
13541B28737l891j00907K83929j33066d2245D49840l2182r1894K7032l2666B6161
$$ y = [307354, 186053, 329687, 288390, 311688, 375592, 866915, 150760, 437426, 220388, 551453, 303733, 462607, 233687, 305926, 363087, 444120, 514046, 444913, 300773, 341087, 558598, 432641, 331875, 47247, 454923, 276197, 134230, 340027, 399603, 470105, 115487, 296058, 364792, 317101, -4197, 356374, 483640, 426256, 319053, 234383, 394689, 295546, 558063, 448021, 415569, 207109, 494723, 408125, 201988, 241218, 286764, 296755, 74329, 331401, 251478, 524429, 493388, 433226, 539975, 422555, 358771, 332768, 343735, 109185, 575130, 275367, 576134, 191712, 185540, 438227, 42979, 41902, 194296, 164318, 320974, 228737, 224846, 123939, 407868, 274802, -42245, 449840, 417658, 325764, 352796, 320130, 26161]
13529E05854j15813A75574l6495a5796B35523A04923N7313L99553k38139F1731
13518B43722N1610O4376E4209L09862K44226k07611A44037L87569B49656K30938
13508D80594A97257K50540a983A37862E3993K76967o4491A32013H607L78027A01647
13496B85499A20394K356J26511B1842M33283k2942N2605j65506j11259Q594O3173
13485B79790j28043J99435j25539A9163L26689f6599A53191L62198J06657B12909
13474H4385J80022q8156R9843K25148A15048N8668L67974B67973m0694J20347
13464C47626m7740I9987K78561j81934q5374e9629D1337a21823B77061j09991
13454A67070F2076K37430q3128N113K63975k30431J82916E1259g1977D46781H9753
$$ y = [505854, 390041, 175574, 139079, -15796, 235523, 104923, 162236, 561789, 323650, 61731, 243722, 295332, 359708, 54209, 364071, 608297, 400686, 144037, 531606, 249656, 480594, 197257, 447797, -1983, 137862, 53993, 330960, 266469, 132013, 8607, 386634, 101647, 285499, 120394, 122750, 249261, 21842, 455125, 432183, 484788, 319282, 208023, 216617, 279790, 151747, 351182, 225643, 19163, 345852, -66599, 153191, 515389, 622046, 212909, 84385, 264407, 176251, 276094, 501242, 115048, 173716, 541690, 267973, 227279, 347626, 299886, 99987, 378548, 196614, 111240, -59629, 41337, -121823, 277061, 167070, 62076, 299506, 216378, 221491, 485466, 255035, 437951, 51259, -71977, 446781, 89753]
13442C17653j5658E433K4731K53481J18558A85280L458p1557J14293B3112J13839
13431A36951J39L48831j58983j31441L45498B19055J25468a7014l1214C18508
13420b3771F0153K65034J7365j49458R7534b33731B65408G1519K49068l9549l8840
13409B42198j14909M6139a38227B50988a24712B66253k9550o9695J75264A02682
13398A92308J79655J33687h0510d574n0223C53902J8194h4827G2886J58689o4575
13387A67000Q309B6415K74255A26467a34760A67191J28050j42688P6532j03735
13377A25350a23724j2398C83159o5459N8648j83186J72757A36136n8337J26119
13367B03918b08352B82534q8091J34659m6677P5465A57274J72956G2939O62100
$$ y = [317653, 301995, 5433, 30164, 283645, 402203, 185280, 188738, 117181, 231474, 23112, 136951, 137090, 485921, 326938, 195497, 540995, 219055, 344523, -17014, -48228, 318508, -23771, 60153, 325187, 342552, 193094, 290628, -233731, 265408, 71519, 320587, 281038, 242198, 127289, 173428, -138227, 250988, -124712, 266253, 236703, 167008, 342272, 102682, 192308, 371963, 505650, -80510, -4574, -54797, 353902, 372096, -84827, 72886, 231575, 167000, 175309, 26415, 300670, 126467, -134760, 167191, 295241, 152553, 229085, 125350, -123724, -136122, 383159, 317700, 376348, 193162, 365919, 136136, 77799, 203918, -208352, 282534, 194443, 329102, 282425, 357890, 157274, 330230, 72939, 735039]
13357G35039a02777C7640K05336J05907i8352C03923K3622A52144L10426j09321
13347C53249j71953J67929E8856J58737m4666R995L5233R0130A15834a75466A91245
13335B50516A14866L961K51073j35958C8175J09938J62230o819o0411h2083C23893
13323C36766J35386A01148f9071D44695O3824k18100D2564c21759A22421J75975
13313B98396J93036l8468r8203D9319L1827j1380g272D13575A88410J29677l8593
13302B79494J77322k06860A15216J05377J0978m873J11042q5169I9456J24372
13292B23828L5737L21964A0393a37203B06839k3620o8938J36242M0810A40460
13281c6483B18491K16425m7847A61692J14755H9945P3875a12653A80274k7389
$$ y = [735039, -102777, 37640, 242976, 348883, -98352, 303923, 327545, 152144, 462570, 353249, 181296, 349225, 58856, 217593, 172927, 182922, 218155, 308285, 115834, -175466, 191245, 250516, 114866, 118827, 369900, 233942, 38175, 148113, 310343, 303524, 243113, -82083, 323893, 336766, 472152, 101148, -69071, 444695, 508519, 290419, 42564, -321759, 122421, 298396, 491432, 452964, 354761, 49319, 81146, 69766, -7272, 413575, 188410, 318087, 279494, 456816, 249956, 115216, 220593, 231571, 226698, 337740, 252571, 99456, 223828, 259565, 581529, 10393, -137203, 206839, 183219, 114281, 250523, 291333, 140460, -36483, 218491, 434916, 387069, 161692, 276447, 89945, 163820, -112653, 180274, 152885]
13271A52885M9586p9920K8028A8577K0797p7R4934c7441B01106H8982J02511o8370
13259A23123a40373A25509f56C29433A36590h6559A22781D457a45046A4765N3156
13248F7921R0418a38561B33190k5253p4173a20744p7643A8818N9324a8210Q766
13237i444G9569K57448E8739J69004b0654A58380b04625A40863N8334J30125A24387
13225C87552q4425A8538g2903A78538L78365k69087N3867i7087B52449b75899
13214c6691G8819R1813b02824C22303c2329j04783K5400A25464L1244L3522m7812
13203A42418J75300M2180F4358a25173J4962G6942o091a15411D07478j97421b7257
13191H0536R8944L1444a63836e6310J0530B8641J84900a98416A50863c2479j09355
$$ y = [152885, 202471, 122551, 150579, 18577, 39374, 39297, 134231, -37441, 201106, 88982, 191493, 123123, -140373, 125509, -656, 329433, 136590, -86559, 122781, 4457, -145046, 14765, 67921, 158339, -138561, 233190, 207937, 133764, -120744, -198387, 18818, 78142, -18210, -9444, 79569, 337017, 58739, 227743, -20654, 158380, -204625, 140863, 199197, 329322, 124387, 387552, 303127, 18538, -72903, 178538, 556903, 287816, 341683, -97087, 252449, -275899, -36691, 78819, 170632, -202824, 322303, -32329, -137112, -111712, 125464, 156708, 190230, 142418, 317718, 359898, 64358, -125173, -110211, 76942, 70851, -115411, 407478, 210057, -27257, 80536, 179480, 210924, -163836, -56310, -45780, 28641, 213541, -198416, 150863, -32479, -141834]
13180a41834A86053P1318b01648B26181I295M01223b46232D30256A90398K8834
13170B19232a59290B12572m458J31907o2734A20463j5006J14857d682B62L36212
13159C36474b66669A09096E3324b0620k50709J32103B45b9837j89569c5389B95229
13147h4422D28096c745H706M7446J82649A7871G611J20227a99261E8832f343j12540
13135a18883A07891N0213F7372i8590G9579J67378a25815A81700f0600j07842
13125a68442B7102O5053a42710F1438A0276M0212L27662e785G5732B4280c5530
13113A33883d2281A65513B9294K11881d7392A28831L744a28339A77949D6561P5290
13102A21851Q7138r889b92294j14137A3187J55698j8296e2854P527j88419d4131
$$ y = [-141834, 186053, 257371, -201648, 226181, 9295, 410518, -246232, 430256, 190398, 219232, -159290, 212572, 208114, 340021, 277287, 120463, 105457, 220314, -4682, 262, 336474, -266669, 109096, 53324, -20620, -271329, -139226, 245, -29837, -219406, -35389, 295229, -84422, 428096, -3745, 8706, 56152, 238801, 17871, 7611, 127838, -199261, 58832, -6343, -118883, 107891, 158104, 67372, -98590, 79579, 246957, -125815, 181700, -60600, -168442, 27102, 92155, -142710, 61438, 10276, 50488, 378150, -5785, 75732, 24280, -35530, 133883, -42281, 165513, 29294, 241175, -47392, 128831, 132575, -128339, 177949, 46561, 121851, 208989, 199100, -292294, -406431, 13187, 168885, 150589, -52854, -45327, -233746, -44131]
13090a60235P2763j19497d7488B83085d050l9190A84736a44977b5479j98996A92494
13078b57314g5019A99559E5573G240R8730A2226c610A67262a75221B9625J94811
13067B24436r3356A4720K35632D8267L02908A3187a18924C03300j36776J35773
13057C02297R2804E4552k0014e5178k34379B0735K7594b1577A43961C4868J35159
13046A70027M6545r1268K2386L31254k20706m7335K77246F6100k5722j0234K80168
13035C10312b23395g9082D07973j79638r1520N6854P8528J91010B10953b24384
13024B39576m2682C7802b0240B59180H6185J9476d27546E4717a6027n896k8122
13013e0045D07788e2847B06580L2940G5416a30603k6498A72557p2589d3827j90
$$ y = [-160235, -87472, -206969, -47488, 283085, -4050, -43240, 184736, -144977, -25479, -224475, 192494, -257314, -75019, 199559, 55573, 7240, 105970, 12226, -3610, 167262, -175221, 29625, 224436, 131080, 14720, 250352, 48267, 351175, 13187, -118924, 303300, 166524, 302297, 395101, 54552, 34538, -55178, -289557, 20735, 48329, -21577, 143961, 34868, 170027, 216572, 125304, 147690, 478944, 258238, 210903, 488149, 66100, 40378, 30144, 310312, -223395, -79082, 407973, 228335, 136815, 193669, 272197, 463207, 210953, -224384, 239576, 196894, 37802, -20240, 259180, 86185, 105661, -427546, 54717, -16027, -21923, -50045, 407788, -52847, 206580, 239520, 75416, -130603, -157101, 172557, 99968, -43827, -44017]
13002d4017A3685a16488H207J65883k5419M091b47258D95674B38075n2997a03884
12990b77558M6691E7581j5958J4627J22681E1478K50401l3496C7846J44950a9154
12978c4349C35143n3690b1830A8512p975f0382A1986K90338L0544A16673P9878
12967A96551m9404C0595N88937a15360C19115a54796A44342b34761h3760m455
12957h8215a4000D8455M8772b5769B03381f7602C16691n0117a5072j57062k4660
12946a96794A05959m9885J25598f1938B71120e8073B65281d4839a3430F902a59179
12934h7747A04077E973L5594a38712M208k2569L4665C263c85608H9422Q0104n5127
12922A14399M8122b60557B86867H5583f1006l02856H591M0033a08918A69811I075
$$ y = [-44017, 13685, -116488, 8207, 174090, 148671, 152762, -247258, 495674, 238075, 185078, -103884, -277558, -230867, 57581, 41623, 56250, 178931, 51478, 301879, 268383, 37846, 182796, -19154, -34349, 335143, 281453, -21830, 18512, 10537, -60382, 11986, 302324, 332868, 116673, 196551, 147147, 30595, 619532, -115360, 319115, -154796, 144342, -234761, -83760, -88215, -14000, 48455, 97227, -25769, 203381, -67602, 316691, 266574, -15072, -172134, -196794, 105959, 56074, 181672, -61938, 271120, -58073, 265281, -44839, -13430, 6902, -159179, -87747, 104077, 5973, 41567, -138712, -134504, -157073, -122408, 3263, -385608, 89422, 169526, 114399, 162521, -260557, 286867, 85583, -61006, -363862, 8591, 48624, -108918, 169811, 9075]
12910H8222a23101A4440J107R163M0065g5101q9008M0867e8505I4298a55628C7961
12897A57092e088A9022k497e9768C9793C342K42751d1990B09068h6403k5752G9673
12884b1585o0320j07544D1881a48749B233R462i0333C43994A66399a29909B11542
12872G0087i9919A31213J806C1215a24121a865j03546B43231A7487a78863A5943
12860B59270b57586C61668a57185A64021D6888J85219q0221K2348a4218I9972
12849c26474a8047j36040e4336J864j55777D8938m665a68175A08250a87529N1715
12838a35814C92788H9872a9025j79972A3745b26115c522D33042a22152n7581f2700
12826a37730B23666J9398j20456A7373J67923o8439b51850A7267L0190e7499k85748
$$ y = [88222, -123101, 14440, 15547, 24710, 64775, -75101, -164109, -123242, -58505, 94298, -155628, 37961, 157092, -5088, 19022, 16525, -59768, 39793, 3342, 246093, -41990, 209068, -86403, -112155, 79673, -21585, -81905, -189449, 41881, -148749, 2233, 11695, -90333, 343994, 166399, -129909, 211542, 70087, -99919, 131213, 133019, 31215, -124121, -1865, -105411, 243231, 17487, -178863, 15943, 259270, -257586, 361668, -157185, 164021, 46888, 232107, 151886, 174234, -14218, 99972, -326474, -18047, -154087, -54336, -52472, -208249, 48938, 44273, -168175, 108250, -187529, -135814, 392788, 89872, -19025, -198997, 13745, -226115, -3522, 433042, -122152, -179733, -62700, -137730, 223666, 243064, 122608, 17373, 185296, 116857, -251850, 17267, 47457, -57499, -343247]
12815c43247h3168G7089h3578B9209a91154a4881H5811j5698a71776b1991G4569
12803G0084J39212l7335J07034P004F6007B6080Q6877a05063l053b8373F8436
12791d8305A9991c7211C5779J41744F5486Q172d75287B1400a38300a9306A55213
12779C26246A08937K67408B7129h6029A54430G6190l6558J25209g3533j50270
12769b23803B87935A31581n1900e2098k32875J04108F5887c8016B9540J2793e238
12757A59972a0218l2504o8795M5815D41065j17913h5889B28709J6799g0086p2029
12746a42115A18154a61600K0737B00563a46104j16767e2514j34707I0817C9368
12735h2460E108P2467B3431c31656I4053F904M448K413M0872O8712Q9251D4186
$$ y = [-343247, -83168, 77089, -83578, 29209, -191154, -14881, 85811, 70113, -171776, -21991, 74569, 70084, 209296, 171961, 278995, 285999, 66007, 26080, 112957, -105063, -108116, -28373, 68436, -48305, 19991, -37211, 35779, 177523, 65486, 73658, -475287, 21400, -138300, -19306, 155213, 326246, 108937, 376345, 27129, -86029, 154430, 76190, 39632, 164841, -73533, -223803, 287935, 131581, 79681, -52098, -284973, -180865, 65887, -38016, 29540, 42333, -5238, 159972, -10218, -42722, -111517, -65702, 441065, 323152, -85889, 228709, 245508, -70086, -142115, 118154, -161600, -140863, 200563, -146104, -262871, -52514, -187221, 90817, 39368, -82460, 5108, 77575, 23431, -331656, 94053, 6904, 11352, 13765, 54637, 123349, 212600, 44186]
12722G6537a49777D0921J69187c7654q6367A7359J55135c10862a00849D33729
12711D119i05q0306a3739k26463g5176q733o793B83218A3705a34431K9141C52164
12698D610J64929M5962a22285B80065m5689E1252J40265a72776H4264g7018A5243
12686e3691B06243b9307B62636b93641N9746A09299J88746A1831a49213A9592
12675g0790C16125c55351b6386C29649c6557q05A15087J04462D6640d0722h126
12663A32215k4556e4298I5453H882R6749m0847K12896E159c32246a57714J4224
12652a43490o738A2461R5222n089m3759d587j14356A47511R3048o3634d6033G3751
12639A32841J55164j09263E1862b3496D73989b85091A3265K9506d2936I9841e7299
$$ y = [76537, -149777, 40921, 210108, -37654, -124021, 17359, 172494, -310862, -100849, 433729, 4119, -905, -81211, -13739, -240202, -75176, -83909, -90702, 283218, 13705, -134431, -105290, 352164, 4610, 169539, 215501, -122285, 280065, 234376, 51252, 191517, -172776, 84264, -77018, 15243, -53691, 206243, -29307, 262636, -293641, -233895, 109299, 298045, 11831, -149213, 19592, -70790, 316125, -355351, -26386, 329649, -36557, -37362, 115087, 219549, 46640, -40722, -8126, 132215, 107659, -54298, 95453, 8882, 105631, 64784, 277680, 5159, -332246, -157714, -143490, -150228, 12461, 107683, 102594, 58835, -4587, -118943, 147511, 240559, 176925, -46033, 73751, 132841, 288005, 178742, 51862, -23496, 473989, -285091, 13265, 42771, -42936, 99841, -57299]
12627A89233R550C7782c05011H5421f4519A0703c64115A50943D6771a17518e8086
12615a72516D72806a51130B28327G8256K80288N9704i7107A92883J39343B630
12604c8790B02179p2588l1814a84781I7091b64131j68312G0544K08479D1564a91246
12592B54170m7778q0834O3212k8699E6000c6107B38609d9033A87884J20821a9303
12580b11428B34982a12537r527L1336H8274b11981e4141k00290B9109J57926c1156
12568A95607f6749J0117F8115L33099i8873G2029a5467A91877E2477O5013b48185
12556B67196F3361M9755a3538j49574B2484j0594J92371b84364D22583A07292
12545A88475B0816R1224c9758j29j22806B02469P296r6675L061e1564l8233B4975
$$ y = [189233, 198783, 37782, -305011, 85421, -64519, 10703, -364115, 150943, 46771, -117518, -58086, -172516, 472806, -151130, 228327, 78256, 358544, 418248, -97107, 192883, 332226, 2630, -38790, 202179, 129591, 97777, -184781, 97091, -264131, -432443, 70544, 279023, 41564, -191246, 254170, 206392, 125558, 188770, 160071, 56000, -36107, 238609, -49033, 187884, 308705, -19303, -211428, 234982, -112537, -122064, -90728, 88274, -211981, -54141, -254431, 29109, 187035, -31156, 195607, -66749, -56632, 68115, 401214, -98873, 72029, -15467, 191877, 52477, 117490, -248185, 267196, 63361, 113116, -13538, -163112, 22484, 11890, 204261, -284364, 422583, 107292, 188475, 20816, 112040, -39758, -39887, -162693, 202469, 209765, 113090, 116151, -51564, -89797, 24975]
12532d9282D9047k2321a3791A07237J6690c748A52961b67471e2824A25462P7340
12521B02802f7144A83543a40244k75544A7724J18809a90174B10426H335J1498
12511A9833a18854C04035a08764j58171i7219A60420C6449L3331D089a76211o7314
12500b43525F515Q1554a11458F8028g3791j88023j3492D049b44187h6731A70753
12488a10021A7830h7753n6510A30529d64450a02671j55340a20182B43096h6690
12477h5485K9346B05830a08979A828N2168J25214a06569o479A09402M68a9733
12465a81862B56866j13083a07941B99186C0177J25876l8296b57177H5272a57973
12454a68197D29334A75729L1491b14675A63813b42410F0940J9101J83172c2376
$$ y = [-49282, 49047, 26726, -13791, 107237, 123927, -3748, 152961, -267471, -52824, 125462, 202802, -67144, 183543, -140244, -415788, 17724, 136533, -190174, 210426, 8335, 19833, -118854, 304035, -108764, -266935, -97219, 160420, 36449, 69780, 4089, -176211, -243525, 6515, 88069, -111458, 68028, -73791, -261814, -275306, 4049, -244187, -86731, 170753, -110021, 17830, -87753, -144263, 130529, -464450, -102671, -258011, -120182, 243096, -86690, -85485, -56139, 205830, -108979, 1828, 53996, 179210, -106569, -113048, 109402, 109870, -19733, -181862, 256866, 143783, -107941, 299186, 30177, 156053, 117757, -257177, 85272, -157973, -168197, 429334, 175729, 207220, -214675, 163813, -242410, 60940, 80041, 263213, -32376]
12443B03467B383b2364o5377K709L7379G6050R3523N5657I2347a14734b0422B0663
12430a71090A47279b96460b4738E3548i0361K9915J3741j84556h5437k6864B93067
12418B16482q8298c007F9349e823EJ25895a88730k1290A23169P9582l3533J78230
12406C47448a39076l9230J2576b1415B71376A06144a01682M7358F944a22918p6557
12395a99475g1483I7363f4981A41449j1806a94235d4789C47241a82569m86882
12385f69451g2502A25990b76047J22120n8295B70899a66532O7197L0769o4639
12375a33205r284m5263n1432C70701h4579A04102C2521b3359k07680J8599C69508
12363a8533E0016d1351k05670A96821m9533a62501A95865j3276K06709A32833
$$ y = [203467, 2383, -22364, -87741, -85032, -47653, 76050, 169573, 225230, 92347, -114734, -20422, 20663, -171090, 147279, -296460, -24738, 53548, -90361, -60446, -46705, -231261, -85437, -112301, 293067, 216482, 128184, -3007, 69349, -5823, 5, 125900, -188730, -210020, 123169, 202751, 169218, 347448, -139076, -178306, -165730, -21415, 271376, 106144, -101682, -54324, 6944, -122918, -199475, -71483, 97363, -64981, 141449, 129643, -194235, -44789, 347241, -182569, -669451, -72502, 125990, -276047, -153927, -212222, 270899, -166532, -99335, -68566, -133205, -142489, -187752, -239184, 370701, -84579, 104102, 32521, -23359, -231039, -212440, 369508, -18533, 50016, -41351, -247021, 196821, 147288, -162501, 195865, 182589, 389298, 132833]
12352f2967K8143n693A13205g4426B7708J87884a15570p0260I0315P3355H1047
12340a78429m3130L2908f8377D31777a74625k4151e9873j34891j00310P5294A6184
12328A77092a56146B18945d6775J6629A35902b1478A01044J64307J13401g475
12317A83353L8684a42522B24053K7090J03446B6401J01893e2678j19430a5502
12306a26376a7571C47489r2880h3559K0304j47055A9112c28247c1749A85650E943
12294a50025n3246C29506A50711n093g4268A47809R2569E8943d8594D3134O2284
12283A05418K00817h0424k8158A18031g8734A68012p3704a16253G4589N00325
12273E74914G9635K5234D5658L00216F834L27417N4004E3096J66333K92973b2597
$$ y = [-62967, -34824, -40517, 113205, -74426, 27708, 215592, -115570, -185830, 90315, 163670, 81047, -178429, -221559, -188651, -68377, 431777, -174625, -198776, -59873, -194764, -295074, -219780, 16184, 177092, -156146, 218945, -46775, -30146, 135902, -21478, 101044, 265351, 378752, -7475, 183353, 222037, -142522, 224053, 251143, 354589, 26401, 128294, -52678, -172108, -15502, -126376, -17571, 347489, 254609, -83559, -63255, -210310, 19112, -328247, -31749, 185650, 5943, -150025, -203271, 329506, 150711, 145618, -74268, 147809, 240378, 58943, -48594, 43134, 105418, 306235, -80424, -108582, 118031, -78734, 168012, 94308, -116253, 74589, 574914, 79635, 104869, 45658, 345874, 6834, 334251, 388255, 53096, 219429, 512402, -22597]
12261B24417m318o638O5687A28836a24177C69771j50211J8650A6795J63765b15452
12249A76144P7768D9287L11121E4879M9049k0587J6495O0281a6417A57038K99329
12238D56367I5016g7892B96380A07457b44977B29991D5234J80486r0701a18637
12227A8970L8001K15990J84047H6908J04957a93618B79160k0189o2548b37814
12216B55372H7379L40878b5569j72048B99751j2860J01976j00925d9706C66549
12205G5665J29152J58158K2819a63059a5454A09844K59425e3832A99168q7008
12195A12160a75538C36643D8195i4979A69026K52482J13016b8491j09799b2756
12184g6055B38269j02256J80105D7807J19530Q389o6402L23502a1073B76000L8729
$$ y = [224417, 220099, 213461, 279148, 128836, -124177, 369771, 219560, 238210, 16795, 180560, -215452, 176144, 253912, 49287, 360408, 54879, 103928, 83341, 99836, 160117, -16417, 157038, 456367, 95016, -77892, 296380, 107457, -244977, 229991, 45234, 225720, 135019, -118637, 18970, 56971, 272961, 457008, 86908, 191865, -193618, 279160, 258971, 196423, -237814, 255372, 87379, 428257, -25569, -197617, 299751, 286891, 388867, 287942, -49706, 366549, 75665, 204817, 362975, 385794, -163059, -15454, 109844, 369269, -53832, 199168, 112160, -175538, 336643, 48195, -94979, 169026, 421508, 534524, -28491, -138290, -22756, -76055, 238269, 136013, 316118, 47807, 167337, 175726, 109324, 432826, -11073, 276000, 314729]
12173C14729b31291B2686O2187a14839C67584G4702J30713q9839d1711A08213
12162B25804r97a7685B13742i7633J2786A28986M3075J82814D5166K43462A30858
12150a10220A54154C9092L05654r2234N3182A25601D8709A4325c05094F8665k4355
12139D4310Q4617k2003a83164A10657C9148K73216i3568F5076d7698I1945b12584
12127A47482r79a25466A99622l6952a31552H9734b53342a6534B92978K2944A14750
12115C15346e7501r2457G0991j6591K41705g2307E1363J3362b62111A9341O1514
12104H0855J8503J82477a23006B36215A2856l288L53292e1761A02591b01774B93804
12092B62332j15145M2308G9839Q3905p0886J88507a07192d0039A09858Q4164C3224
$$ y = [314729, -231291, 22686, 84873, -114839, 367584, 74702, 205415, 115576, -41711, 108213, 225804, 224807, -17685, 213742, -97633, -84847, 128986, 172061, 354875, 45166, 288628, 130858, -110220, 154154, 39092, 344746, 252512, 305694, 125601, 48709, 14325, -305094, 68665, 44310, 128927, 106924, -183164, 110657, 39148, 312364, -93568, 65076, -47698, 91945, -212584, 147482, 146503, -125466, 199622, 162670, -131552, 89734, -253342, -16534, 292978, 315922, 114750, 315346, -57501, -149958, 70991, 54400, 296105, -72307, 51363, 64725, -262111, 19341, 80855, 99358, 281835, -123006, 236215, 12856, 9568, 362860, -51761, 102591, -201774, 293804, 262332, 147187, 189495, 79839, 163744, 92858, 281365, -107192, -40039, 109858, 194022, 33224]
12080C18185n7841N1942b68298e6604I8213d6151O712A09968J54367n8156g8763
12068A32901K54084j05845a34214B53022H6061d138r1193A97414J7477i4848B25035
12056d4538A20725J64678q6891f0633k30548D7358e7023C43412j55595R2793n5740
12045B24870F5275O4626B403b9126C5113c3508k70265A60027b14615B11547a29847
12033I2597f4581A2071b6485C5236a10962B1536b55820B62958A01653a62975E471
12021A85316e4420j32669J787H1658k8802a12619j05380B90492d9267C00856G1203
12009b0303k44426Q9398A61619l6013a45230Q801B284K23396l306J78864c75007
11997I9009c3754j28784c6226A22141C7147J72362g1795m6044A66689n5114a79374
$$ y = [318185, 260344, 312286, -268298, -56604, 98213, -46151, -39439, 109968, 264335, 206179, -78763, 132901, 386985, 281140, -134214, 253022, 86061, -4138, -95331, 197414, 214891, -94848, 225035, -44538, 120725, 285403, 198512, -60633, -291181, 47358, -57023, 343412, 187817, 280610, 224870, 65275, 129901, 2403, -29126, 35113, -33508, -303773, 160027, -214615, 211547, -129847, 92597, -64581, 12071, -26485, 35236, -110962, 21536, -255820, 262958, 101653, -162975, 5471, 185316, -54420, -187089, -185302, 81658, 52856, -112619, -217999, 290492, -49267, 300856, 71203, -20303, -264729, -175331, 161619, 125606, -145230, -136429, 2284, 225680, 222374, 401238, -375007, 99009, -33754, -162538, -36226, 122141, 37147, 209509, -71795, -117839, 166689, 111575, -179374]
11985C1844R380a63249c0024B58725B3733a48706G6011b27294n3304M0259e6700
11973a5146n4017H6555J69453a61981j69504c6912A5754e5746B66811d2167k17589
11962b59756A94481F0602c1333I2821C6661k837J14441a32956B5570f40925a93542
11950a5070A3169b9118H7383b26497C70117A71523D2393M5273B9290i9776n3269
11939a53045g2859A48122K1256b9391J3300A01444O7840m1058n8654J53619G2090
11927a71959B40285B2527b66662J22565f3316o7810j47546e837k51158k903I4248
11915h9783D86894i6691M0680C20560a68736j01709a27825q13E2589a42435D0477
11903d15882a21421j89258A16951C9781K78712i2289A39674g1775A30957o4124
$$ y = [31844, 41224, -163249, -30024, 258725, 23733, -148706, 76011, -227294, -280598, -240339, -56700, -15146, -69163, 86555, 256008, -161981, -331485, -36912, 15754, -55746, 266811, -42167, -259756, 194481, 60602, -31333, 92821, 36661, 33824, 148265, -132956, 25570, -640925, -193542, -15070, 13169, -29118, 87383, -226497, 370117, 171523, 42393, 87666, 29290, -99776, -153045, -72859, 148122, 169378, -29391, -16091, 101444, 169284, 128226, 69572, 223191, 72090, -171959, 240285, 22527, -266662, -144097, -63316, -131126, -278672, -5837, -256995, -259898, 94248, -89783, 486894, -96691, -56011, 320560, -168736, -270445, -127825, -128638, 52589, -142435, 40477, -415882, -121421, -310679, 116951, 39781, 318493, -92289, 139674, -71775, 130957, 66833]
11893F6833K1506K12245a5542F7315A6889a22590d1147C4593b31187A5523K01989
11882B17512p9749d35656a1885j66230d5015k69144h8525j07746e2000B63764
11871a1916B7412K56798i3855o8440A15729j5770g2346l62824h8687o950j43394
11860b39031I4558D1094c6266B7287a34190O2403b550j47214M9291B18488a9980
11848b9338j75168c7988j1342A92171D3391A1934b89689b0427B4352K39354b03754
11836B05119A0117b62990q7627g065G6344R4273b07988j58593J38609E1681i4964
11824B2618K83746e1699C5057A2772b31493E3923b91465F0546J51534c11429P9172
11813b32257j95200b1009E2295a24527C44841A21977a89194C58587G5868d06339
$$ y = [66833, 88339, 300584, -15542, 67315, 16889, -122590, -41147, 34593, -231187, 15523, 217512, 137763, -435656, -11885, -178115, -45015, -314159, -88525, -196271, -52000, 263764, -11916, 27412, 284210, -93855, -162295, 115729, 99959, -72346, -435170, -88687, -95637, -239031, 94558, 41094, -36266, 27287, -134190, -71787, -2550, -149764, -100473, 218488, -19980, -29338, -204506, -37988, -49330, 192171, 43391, 11934, -289689, -20427, 24352, 263706, -203754, 205119, 10117, -262990, -350617, -7065, 76344, 170617, -207988, -366581, -227972, 51681, -94964, 22618, 306364, -51699, 35057, 12772, -231493, 53923, -291465, 60546, 212080, -311429, -232257, -427457, -21009, 52295, -124527, 344841, 121977, -189194, 358587, 75868, -406339]
11802e6537k58447i5925q151B04873J72826b32954D0789d1467D64289j85892I4442
11790a02j22505A02258b50763a25314E8905a55049A67921M3434D1960K490i2652
11778c77228a06572j89474a37899A00626a77076F8932f1881k05619d8549j42965
11768a91514b6981E6050J50827p5466a11036B75886j01361N2921b70248q1341
11758c51589G9096F833J45451e5021J6237E0828P3522a50321F3557j3673c00142
11746A18551e1135C15528h8564B59784a95271E2678b70387J31888N6817k1854
11736a03536B58535d1611B07937o9362a21874N2334A218a06703d0497J8136A57560
11724a07795P415c9176D2484h3816b4821q4504A91250b44261d3689A6133a001
$$ y = [-56537, -314984, -95925, -104076, 204873, 377699, -232954, 40789, -41467, 464289, 278397, 94442, -102, -122607, 102258, -250763, -125314, 58905, -155049, 167921, 211355, 41960, 44450, -92652, -377228, -106572, -296046, -137899, 100626, -177076, 68932, -61881, -267500, -48549, -191514, -26981, 56050, 206877, 131411, -111036, 275886, 174525, 227446, -270248, -351589, 79096, 6833, 152284, -55021, -38784, 50828, 124350, -150321, 63557, 49884, -300142, 118551, -51135, 315528, -88564, 259784, -195271, 52678, -270387, -138499, -81682, -103536, 258535, -41611, 207937, 138575, -121874, -69540, 1218, -106703, -40497, -22361, 157560, -107795, -100380, -39176, 42484, -83816, -24821, -109325, 191250, -244261, -43689, 16133, -1001]
11712D5668K6607a43852o3086e8601D9231k2458M6766J34320a53574j19454E4179
11700c48337A76760c93C82721D5348a8843B80569a31158d4665P798I5942K14486
11689C10428a0060F2444f0035A81068a98336g71q4634A24020R57J07363A2067
11677a69696P8646B05186a48270K7317K6958l860A24081M320J08579b57993a20807
11665i1352J9893b1901k2322B33064B2125b22470B05575R7094j8128h4710A34985
11653A16855i9285L6122C9628i3469d3253A75373A3596a879B27368d9352r9075
11642a48427M7399B56079b23926B35133a1661B26537a72923A17113E5009b84914
11631A7740R9257a51694e212r7447A07630J03514A3670a04882E7447b37280J09716
$$ y = [45668, 72275, -143852, -206938, -58601, 49231, 26773, 73539, 207859, -153574, -273028, 54179, -348337, 176760, -393, 382721, 45348, -18843, 280569, -131158, -44665, -36867, 95942, 310428, -10060, 62444, -60035, 181068, -198336, -771, -85405, 124020, 124977, 232340, 12067, -169696, -91050, 205186, -148270, -120953, -93995, -97855, 124081, 128401, 236980, -257993, -120807, -91352, -71459, -21901, -44223, 233064, 22125, -222470, 205575, 302669, 284541, -84710, 134985, 116855, -99285, -63163, 39628, -93469, -43253, 175373, 13596, -1879, 227368, -49352, -148427, -101028, 256079, -223926, 235133, -11661, 226537, -172923, 117113, 55009, -284914, 17740, 116997, -151694, -5212, -102659, 107630, 211144, 13670, -104882, 57447, -237280, -127564]
11620a27564A18408g5431A87262K4110b0225o1216B54898e4790q091A728i4365
11608A6473h7547j14057g229G883i0621A19557k8701b1522q0174J1213A3204K13528
11596B26732a29302A39076a68949A19014B1424J78908q9309a10355A00086a03997
11585a60046c5720m8296k6003I2817b68789J23888l8065f8267A84532a07336a5944
11573A69631O166i4665l165k19359J23696A86443I1260g4359C20630a93140C07466
11561D745a02279C80320I1375a2946l03139A52285h3690B09437d4379E9526L70036
11550D29562c00600B56156n4153J7875a45527a0652k78955C04481B7499K58847
11540B86346P3776h9923C51782q3745A2515a36821A65486b10439A09379f4329
$$ y = [-127564, 118408, -75431, 187262, 211372, -20225, -81441, 254898, -54790, -62881, 1728, -94365, 16473, -87547, -201604, -7229, 7883, -90621, 119557, 90856, -21522, -101696, -90483, 13204, 226732, -129302, 139076, -168949, 119014, 21424, 200332, 111023, -110355, 100086, -103997, -160046, -35720, -84016, -110019, 92817, -268789, -144901, -182966, -68267, 184532, -107336, -15944, 169631, 175797, -94665, -97830, -317189, -193493, 186443, 91260, -74359, 320630, -193140, 307466, 4745, -102279, 380320, 91375, -12946, -316085, 152285, -83690, 209437, -44379, 59526, 429562, -300600, 256156, 202003, 219878, -145527, -10652, -289607, 304481, 27499, 286346, 360122, -89923, 351782, 268037, 12515, -136821, 165486, -210439, 109379, -64329]
11529B05966p2989J46459j24757f4620C19980A3052h5759D9478K71636h1681A96241
11517A22379a56056A00968n605M7582J306a4666A41583L7339Q6844a14442A13614
11505C08321b70621B3450i990m3955B57286A07359d0926j38018A09258J50956
11495B60214G7678J29579a40581B08478K4244C7758O9790l1424a85570R959B05142
11483C01952A14347E2246J7393c49412A37040C3222e770l2131j54206j78172J50589
11472b19690C9540L55549I9431M4288n8011l2037h4469j0947A99003K53748c2979
11460f5267k4928H3214e8860A40930J26342C8898P6957N167J480J98388G4969
11448C50592k6676c1899A60296N6092l0705C6643L2084k7418l370K07536H1541
$$ y = [205966, 132977, 279436, 154679, -64620, 319980, 13052, -85759, 49478, 321114, -81681, 196241, 122379, -156056, 100968, 95363, 142945, 144251, -14666, 141583, 178922, 265766, -114442, 113614, 308321, -270621, 23450, -9990, -53945, 257286, 107359, -40926, -178944, 109258, 260214, 77678, 207257, -140581, 208478, 232722, 37758, 107548, 76124, -185570, -175611, 205142, 301952, 114347, 52246, 69639, -349412, 137040, 33222, -5770, -37901, -192107, -370279, -219690, 39540, 395089, 99431, 143719, 85708, 53671, -84469, -95416, 199003, 452751, -32979, -65267, -90195, 83214, -58860, 140930, 267272, 38898, 115855, 121022, 122502, 320890, 74969, 350592, 323916, -31899, 160296, 216388, 185683, 36643, 68727, 41309, 37939, 245475, 81541]
11436i3919A62281b27990b0648A16952c08878A5515h228A69088p5779L28048A28657
11424B59558K58744d3356D9345N5947k101a7946C4593K1196Q6366E7682a61512
11412c4921B0299J65350C5239K8805d20577A14717A8951a23580N6036p7241M6720
11401i8065B01480b97210N3473A79010a66590l0234D187K60015E6027J07317B3299
11389a72356I2505Q6416b91130f490j52223A09153b23946C17529A35586B9791
11378E9795c22404A04408a36921l55666A13101J06965g4500j10780O4338b8473
11367B01876A4047F443Q7420b62410b72l19386D12736b52735J19787B5458b29301
11355B32746F3522f3591l58605a92158D359O985O0001c85657a6929j58390B61627
$$ y = [-93919, 162281, -227990, -20648, 116952, -308878, 15515, -8228, 169088, 93309, 421357, 128657, 259558, 518302, -43356, 49345, 105292, 103191, -17946, 34593, 55789, 142155, 57682, -161512, -34921, 20299, 185649, 35239, 64044, -420577, 114717, 18951, -123580, -67544, -144785, -98065, 201480, -297210, -243737, 179010, -166590, -196824, 4187, 264202, 56027, 163344, 23299, -172356, 92505, 178921, -291130, -6490, -158713, 109153, -223946, 317529, 135586, 29791, 59795, -322404, 104408, -136921, -492587, 113101, 220066, -74500, -185280, -120942, -28473, 201876, 14047, 6443, 93863, -262410, -272, -319658, 412736, -252735, -132948, 25458, -229301, 232746, 63522, -63591, -422196, -192158, 4359, 11344, 71345, -385657, -16929, -175319, 261627]
11343I535b917E8298b5865M222j35476D2964e3969A27120h5498k26979R8129k0565
11331b34913B6958L6128c36178H0027a43755j81248O1061f2606A81178K53350
11321D34528a65835C33356A40853d3861J4356A80487a52867K908a3311k44855
11311b58166c5022A12180L0958d0876F9714d7894D6767J00738l667b9057l40772
11300c69829a22317N222A24656K6481J73112E9043R8519k3253J1373b82900B42136
11288g4836D68688a81052H143d5051B51253g2283B3023M6539J35712J281A910
11276A08009B5851M07907A78418a50572F3765f23565A33155a16958a2313n172
11266a7485D42832h978m1554E0234f8265j52554B8165b97008a43153D188b20193
$$ y = [9535, -2917, 58298, -25865, -21643, -157119, 42964, -53969, 127120, -85498, -312477, -214348, -234913, 26958, 63086, -336178, 80027, -143755, -325003, -263942, -62606, 181178, 434528, -165835, 333356, 140853, -43861, -29505, 180487, -152867, -149959, -13311, -258166, -35022, 112180, 143138, -40876, 69714, -47894, 46767, 147505, 143838, -29057, -369829, -122317, -117095, 124656, 151137, 324249, 59043, 157562, 134309, 145682, -282900, 242136, -74836, 468688, -181052, 8143, -45051, 251253, -72283, 23023, 69562, 205274, 206555, 1910, 108009, 25851, 433758, 178418, -150572, 63765, -623565, 133155, -116958, -12313, -17485, 442832, -8978, -50532, 50234, -68265, -220819, 28165, -297008, -143153, 4188, -220193]
11254a97945N4256f1142b8150A5475a60862M1267n7524K6503A57784a92962B36604
11242h7010B4600c1850j55007A31852a93458F4201g4886l01802J33021K819A06757
11230A16762b89264B70377g4393m0487F9623f7294B05443b13323J1678K0363j80654
11219c61936K6769h36H1669c01009q6307i363B26717E5697a70511D2470h3534
11207C51439p5166B2139J8737M7253e1168I0460a44815D7586b5039A20133a06437
11195d0479j32500k6022N2822D8705g8489B24174a77414B13769b08338M2956n5410
11184b20792d5889A26409K8021a63103A00293a18542j23548I744g2938j38644
11174b11582d4806a5168C68501a14733F0285a02676a4800r4387I0455a38197E5699
$$ y = [-197945, -143689, -61142, -28150, 15475, -160862, -119595, -177119, -150616, 157784, -192962, 236604, -87010, 24600, -31850, -186857, 131852, -193458, 64201, -74886, -376688, -243667, -240848, 106757, 116762, -289264, 270377, -74393, -114880, 69623, -67294, 205443, -213323, -201645, -181282, -361936, -335167, -836, 81669, -301009, -387316, -9363, 226717, 55697, -170511, 42470, -83534, 351439, 276273, 22139, 40876, 88129, -51168, 90460, -144815, 47586, -25039, 120133, -106437, -40479, -172979, -199001, -146179, 48705, -78489, 224174, -177414, 213769, -208338, -165382, -220792, -45889, 126409, 154430, -163103, 100293, -118542, -242090, 9744, -72938, -211582, -44806, -15168, 368501, -114733, 60285, -102676, -14800, -109187, 90455, -138197, 55699]
11162g1746r8810p304J5808P1687j91053L9714a03217B69902C9317a96172A08352
11150B5278c34527C9984c07743B6743G903c22090A91997D4341b40310a07405K8850
11139g8555b839A36254J11023i6273E2983e8440j26950B00425b30549g2807k81505
11128c54312B34194A10375k6606J06190b91362L7083N7051F6166i6538B54126
11117b15068d0045k5100c0481F2972L6484B173K37212e0638B64740K2373a03218
11105C17871d3404a8916j00870a4978B84898k0608f3434H783a0693A5800K70696
11094B86496g8421I9967a8273j04174C90028A91175a5392j59298E5395P6144e0353
11082A69320k0392C7038L7006N1625O7639K172O0902f3234A03911p817K54091
$$ y = [-71746, -170556, -177860, -162052, -90365, -281418, -241704, -103217, 269902, 39317, -196172, 108352, 25278, -334527, 39984, -307743, 26743, 7903, -322090, 191997, 44341, -240310, -107405, -78555, -2839, 136254, 247277, -96273, 52983, -58440, -185390, 200425, -230549, -72807, -354312, 234194, 110375, 83769, 189959, -291362, -254279, -197228, 66166, -96538, 254126, -215068, -40045, -65145, -30481, 62972, 99456, 2173, 239385, -50638, 264740, 287113, -103218, 317871, -43404, -18916, -119786, -14978, 284898, 264290, -63434, 8783, -10693, 15800, 286496, -78421, 99967, -18273, -122447, 390028, 191175, -15392, -174690, 55395, 131539, -50353, 169320, 148928, 37038, 74044, 125669, 193308, 195480, 256382, -63234, 103911, 96094, 350185]
11071C50185G6395F904K74321p9869f6861a7905D09865j26789C8786AL43678d518
11058D05808a2695B18219O9800c09372B14933l9828J76823A68678K9366H0720
11047D57531H0965J01168p6724M45841M4510B31818Q996J81410j61919J24477
11037C84782K00195j50611O6250J7960n7849J9325r09o0512m4501K7369K65310
11026F66809m9728j91324M7474P0850j54863L44147N3044l27027m106M66030D53724
11014D28530J05987j98584R8036N5118J51982k02916R0750J68250j63160L8142
11004E72135N8747F3107L22175k7824j65729M18720r1546j27784q6722j4567J65031
10993D54861j9922r3386J73035j88396J87145j00910N7060K8233j21105L51641
$$ y = [350185, 76395, 6904, 281225, 201356, -66861, -17905, 409865, 283076, 38786, 1, 343679, -4518, 405808, -12695, 218219, 288019, -309372, 214933, 175105, 351928, 168678, 198044, 80720, 457531, 80965, 182133, 105409, 551250, 595760, 231818, 240814, 422224, 260305, 384782, 584977, 434366, 500616, 518576, 460727, 480052, 479143, 418631, 374130, 401499, 666809, 617081, 425757, 473231, 544081, 389218, 733365, 786409, 459382, 455276, 921306, 453724, 428530, 534517, 335933, 433969, 489087, 641069, 438153, 528903, 697153, 533993, 572135, 630882, 63107, 385282, 357458, 191729, 610449, 518903, 391119, 304397, 289830, 454861, 434939, 341553, 514588, 326192, 513337, 412427, 469487, 497720, 376615, 728256]
10983G28256k67589J27318q6606j36337j17012j04161L58621K26224j28110R1624
10973F92228k09106J2327O5909j27807k3857J93770P3775J9591K60879o8207o091
10962H83411O7798J19571o4125L46084n9132J48877K36243j9614j86341J54465
10952A627237N29272k19961j46827o4724k50444L0505j21806l1431K35417l98682
10942A188556J24645R7241j46015J73631M7415p5327k22831L03522j95569o0135
10932A235133l88812K00586C91912J06691N0915n1658j1263j69357a6070B21781
10921E42569B4205J40041C4052L6482L87247G1155P2776P4730D3311Q9013n9505
10910G2819J44944j03191C1255M8492J60927J7712a7363l26302E5733K1873a24421
$$ y = [728256, 460667, 587985, 501379, 365042, 248030, 143869, 502490, 728714, 600604, 692228, 483122, 495449, 561358, 433551, 409694, 603464, 677239, 696830, 957709, 889502, 883411, 951209, 1070780, 1006655, 1352739, 1293607, 1442484, 1678727, 1659113, 1472772, 1627237, 2156509, 1936548, 1789721, 1724997, 1474553, 1505058, 1383252, 1351821, 1587238, 1188556, 1313201, 1410442, 1264427, 1438058, 1485473, 1410146, 1187315, 1490837, 1295268, 1235133, 846321, 1046907, 391912, 498603, 549518, 497860, 486597, 317240, -16070, 221781, 542569, 24205, 164246, 34052, 70534, 457781, 71155, 143931, 218661, 43311, 132324, 72819, 217763, 114572, 31255, 79747, 240674, 258386, -17363, -343665, 55733, 77606, -124421]
10898A1003K26597B9169o174a56368H5790R68J10437l5058d8712j098A8319a36076
10885A36291c3445j33365A46226p499j8469e25724b42100j11804J65403j4375
10875b02876o942D7907Q6838c26631a23192A26088a20423K5496B86918j17140
10865A69778p9287h1126A45590h5788j08030k07909B9454P3118d2176D8197g9893
10853H0302J54261L113a76167q3137a10399A74495a24144M1402o7584m0484B41523
10841A6297J74235q7210b4312k33964b2956B64410a73225B1011K23314o8792a87640
10829B11000a82704G1323d77868A48633a77818E6536b60157a21566L1010m5132
10819a35688J7907D95704d0370k02125l6380J12121A09046a26349d5807A80447
$$ y = [11003, 237600, 29169, 22995, -156368, 85790, 86758, 197195, 162137, -48712, -49810, 18319, -136076, 136291, -33445, -166810, 146226, 138727, 120258, -525724, -242100, -353904, -188501, -202876, -209818, 47907, 134745, -326631, -123192, 126088, -120423, -94927, 286918, 169778, 90491, -81126, 145590, -85788, -193818, -401727, 29454, 102572, -42176, 48197, -79893, 80302, 234563, 237676, -176167, -259304, -110399, 174495, -124144, -82742, -150326, -190810, 241523, 16297, 190532, 103322, -24312, -258276, -22956, 264410, -173225, 21011, 244325, 175533, -187640, 211000, -182704, 71323, -477868, 148633, -177818, 56536, -260157, -121566, -90556, -135688, -117781, 495704, -40370, -242495, -278875, -166754, 109046, -126349, -45807, 180447]
10808e6922j60767A57385D3754K10615H1143b2809j15995j67652A26637Q5921
10798B12558a30226C11154a35126k7026k11386a37126j39604J06822c5578j7836
10788e3414l36963J17111a33469G4430K14731b13251A51729g0489o2937A89899
10777B465b09583Q6768f0076B60798a80412O833H954g1834l1730H3083b60573
10765a2107E4431a27991j78089d1188A20998D4638j5278b67596F5802a7843j99519
10754b17362M4090B2991a31424e3034k62056a25779B8214d619k16815c3502j68533
10743b02035c8280B57474i8153l5175E0060L2938i2262k49647R3255A58283b81802
10731f7749e283C62872a58503d7007B70479I588A451i9871A23195h3195m355A39637
$$ y = [-56922, -217689, 157385, 43754, 254369, 81143, -22809, -138804, -306456, 126637, 212558, -130226, 311154, -135126, -162152, -373538, -137126, -276730, -169908, -35578, -53414, -390377, -273266, -133469, 74430, 289161, -213251, 151729, -70489, -133426, 189899, 2465, -209583, -122815, -60076, 260798, -180412, -173579, 8954, -71834, -103564, 83083, -260573, -12107, 54431, -127991, -306080, -41188, 120998, 44638, 29360, -267596, 65802, -17843, -217362, -173272, 22991, -131424, -53034, -315090, -125779, 28214, -4619, -221434, -33502, -202035, -38280, 257474, -98153, -133328, 50060, 82998, -92262, -341909, -248654, 158283, -281802, -67749, -5283, 362872, -158503, -47007, 270479, 9588, 1451, -99871, 123195, -83195, -87550, 139637]
10718B37513a91328C71690a70266c3112A37792a32367o510E0566c8220j14628
10708a52848A54609d4541k28627F5497a62944k5697o696h9195A78430J61578c5127
10696b17286C2228a01393l26516a40388A38086j3137a704k5090q3785d585j27733
10685a32318a2810E6103J03412A4705a02755j17962C25212b50733Q8053A48886
10674a4098k47227c9878p6784A1063a68637A28759m7055J730h4118K1469B11949
10662c5520o8758j06618a9333E503b30323J8318A58631e1098k20168p9194d6399
10650d1159q6537k22348J06615L4930A74626g6741j68241A15935a71632j7623
10640a89255n8023Q4415A25560b26578N8489P099F8152I940a76343D15517d4049
$$ y = [237513, -191328, 371690, -170266, -33112, 137792, -132367, -138877, 50566, -38220, -152848, 154609, -44541, -273168, 65497, -162944, -188641, -195337, -89195, 178430, 340008, -35127, -217286, 32228, -101393, -427909, -140388, 138086, 124949, -1704, -26794, -110579, -4585, -132318, -12810, 56103, 159515, 14705, -102755, -220717, 325212, -250733, -162680, 148886, -14098, -261325, -39878, -116662, 11063, -168637, 128759, 81704, 83434, -84118, -62649, 211949, -35520, -104278, -210896, -19333, 5503, -230323, -212005, 158631, -51098, -271266, -350460, -46399, -41159, -127696, -350044, -243429, -208499, 174626, -76741, -244982, 115935, -171632, -189255, -247278, -162863, 125560, -226578, -168089, -160990, 68152, 9940, -176343, 415517, -44049]
10628c5914J4521D7885a1372o5359m91106C8173M4185i1480K479I7457c2200k10205
10616b42405B5852b76681a1630m40594g9741E219L009N5342A4341g1132j47787
10605b18919A03a02168c1854B9591a03116K0887A15020C6756g7051j09987a0247
10593a19182k05873J14354F4840e1147l33792D8681N7683L3709J78999c1600C7620
10581b02033Q9783D9146B1376K8572a363A54088F335Q9422J61449H603a15240
10569b86961L0600n8333J43143A24808c34817R6537F1556b15862c9747k18626
10559b58373G3047b27646Q8472k12129J72259A95295a47939J7555A26168a92384
10548f3797n6166E1177J55143n9532P900M9802g7518b0325j51970C28019f9495
$$ y = [-35914, -21393, 47885, -11372, -76731, -567837, 38173, 82358, -91480, -89001, 97457, -32200, -242405, 25852, -276681, -11630, -452224, -79741, 5219, 8228, 63570, 14341, -71132, -218919, 103, -102168, -31854, 29591, -103116, -82229, 115020, 36756, -77051, -187038, -10247, -119182, -325055, -210701, 64840, -51147, -384939, 48681, 106364, 140073, 319072, -31600, 37620, -202033, -112250, 49146, 21376, 49948, -1363, 154088, 6335, 95757, 257206, 8603, -115240, -286961, -256361, -314694, -171551, 124808, -334817, -238280, 61556, -215862, -39747, -258373, 73047, -227646, -139174, -351303, -179044, 195295, -147939, -130384, 126168, -192384, -63797, -119963, 51177, 206320, 146788, 154688, 204490, -77518, -20325, -172295, 328019, -69495]
10536B25966c10859E5423A449a39487j0291j14067I9539i4700I1864g8168j2552
10525i0720B60902B2389e2830A5862f3388P893j6253a0506A54295b4507A18338
10513d52162J67830D0176J10272b36426A2963c3059F1911h6557j1993j03215C5105
10501g3143j78390J09064c4641N073n6302A83207f0117b5741j21840k13123C870
10489c20524N7095O3331G2498c9730q4054A26173E7000N6255b44555K8942F0015
10477A06812L9277b50129K3000E6539j8715k405P5737H949K58150j27147E0106
10465h728B22907a2852j52948A47998P0796R2779L5321m6332q0439h5597B54785
10453i703F4493Q8456a00461J7912A47601f7374D5316i8554B30295r4302D0869
$$ y = [225966, -310859, 55423, 1449, -139487, -149778, -263845, 99539, -94700, 91864, -78168, -90720, 260902, 22389, -52830, 15862, -63388, -55495, -71748, -10506, 154295, -24507, 118338, -452162, -284332, 40176, 150448, -236426, 12963, -33059, 61911, -86557, -98550, -201765, 35105, -73143, -251533, -142469, -34641, -29568, -85870, 183207, -60117, -25741, -147581, -360704, 3870, -320524, -263429, -200098, 72498, -39730, -123784, 126173, 57000, 113255, -244555, -215613, 60015, 106812, 146089, -250129, -227129, 56539, 37824, 35419, 111156, 8949, 267099, 139952, 50106, -8728, 222907, -12852, -165800, 147998, 218794, 311573, 346894, 300562, 220123, -85597, 254785, -9703, 64493, 152949, -100461, -82549, 147601, -67374, 45316, -98554, 230295, 135993, 40869]
10441C9634a48757E1629J50287A1795a0396E4552a23179o0305C41490j30948g5526
10429A5625p219a6044j4697j79933B80179H6831i7926D8573L7759C6718J08222
10418A44940Q4017E1861J19268a34256m1109A06021e9080I6541c9470M902m2696
10407g7264j29286I4974c22621a00325C72540A39268a36177M2754A06483b7291
10396b89250f9964A82947h687k0416m5209G0923a00497C7571a39026I3796M1046
10385A34842h1924k5306A22829a90267F3005R0769o232Q6468j3191q2020b3438
10373A24354Q8426I8658c31018B24229A2195e4630A45436B4418E562e1119A63625
10361a66314E8239Q9875a41412B48447H2288h0652E895K32483B2054K93115D9313
$$ y = [39634, -148757, 51629, 201916, 11795, -10396, 54552, -123179, -183484, 341490, 210542, -75526, 15625, 8406, -16044, -30741, -210674, 280179, 86831, -97926, 48573, 86332, 36718, 144940, 228957, 51861, 171129, -134256, -175365, 106021, -59080, 96541, -39470, -34568, -77264, -206550, 94974, -322621, -100325, 372540, 139268, -136177, -93423, 106483, -27291, -289250, -69964, 182947, -8687, -29103, -74312, 70923, -100497, 37571, -139026, 93796, 134842, -81924, -107230, 122829, -190267, 63005, 153774, 147542, 234010, 220819, 138799, -23438, 124354, 212780, 98658, -331018, 224229, 12195, -54630, 145436, 24418, 5562, -51119, 163625, -166314, 58239, 148114, -141412, 248447, 82288, -80652, 5895, 238378, 22054, 315169, 49313]
10349A21146J13216a46339C23443N6277a6179C31727j06009g5293D16773j64150
10339B52623k4411n5976b27199A71578O4837R5680A34653M6942L01579M7946E9421
10327A34824L97962j74190D4577J41129K04446A82053P4740d2051j64807f16G1951
10315d5028A38755D3560J08300b0094F1715O398J87675A758K60857b97213A79006
10303C9003a18458A29148l7099b4565R475A10034a4441B06636K2750h0322k2642
10292a02964G3422N8092o4225J93748c58060J51103L3832c6287b478r8389b6689
10280D0666c83886B4931c28518J52353A5994a00575g996o532j5956n7521b4889
10268B07099a68722A8918Q7628a51794D1449L15028b13038R9257E1456j680a65124
$$ y = [121146, 234362, -146339, 323443, 379720, -16179, 331727, 225718, -75293, 416773, 252623, 228212, 172236, -227199, 171578, 236415, 332095, 134653, 181595, 483174, 531120, 59421, 134824, 532786, 358596, 44577, 185706, 390152, 182053, 256793, -42051, -206858, -616, 71951, -45028, 138755, 43560, 151860, -20094, 61715, 68113, 255788, 1758, 262615, -297213, 179006, 39003, -118458, 129148, 92049, -24565, -15090, 110034, -14441, 206636, 229386, -80322, -102964, 73422, 131514, 67289, 261037, -358060, -206957, -173125, -36287, -2478, -100867, -26689, 40666, -383886, 24931, -328518, -176165, 15994, -100575, -7996, -14528, -30484, -88005, -24889, 207099, -168722, 18918, 106546, -151794, 41449, 356477, -213038, -113781, 51456, 49776, -165124]
10256H0987b76798J9464a23858o6637P4519q2256B37155o2441d771D4623r515
10245C5108K13449D5878O8817J34733A3961b9091A65286J79219A53351K02194
10235C55545I0737N1300M21387E8568Q8775f0834j23069L5671p2191a4448D8113
10223a22256j7403N9436b2788D47312H6379a61849l1456P1943G8494a9581L829
10212a5752k456J747D797a15226p1528B1025a939n3061o4022F4309k9331g5741
10199a6727H7472b45761B54687b92481J42747b8691A79398C7022g8568p0918e850
10187B2383a93056P0874q7442f8588k97190J48806G8063L86351b37798J08223
10177a29575A51022d9873D0229J84730C7784i7856o0944A27897a43406e6442b4580
$$ y = [80987, -276798, -257334, -123858, -190495, -115976, -198232, 237155, 174714, -4771, 44623, 35108, 248557, 45878, 114695, 249428, 13961, -29091, 165286, 344505, 153351, 355545, 90737, 142037, 563424, 58568, 147343, -60834, -183903, -148232, -220423, -14448, 48113, -122256, -139659, -80223, -22788, 447312, 86379, -161849, -193305, -121362, 78494, -19581, -15752, -18208, -16461, 4797, -115226, -186754, 21025, -1939, -55000, -119022, 64309, 34978, -75741, -16727, 87472, -245761, 254687, -292481, -149734, -28691, 179398, 37022, -78568, -149486, -5850, 22383, -193056, -122182, -209624, -68588, -365778, -216972, 78063, 464414, -237798, -129575, 151022, -49873, 40229, 224959, 37784, -97856, -158800, 127897, -143406, -56442, -24580]
10165a5113j41269o00B7197a14322j72047E0647a08372c3675k44205a27404j2438
10154a39842m9967A20732c7707A21609a4836j74719B3097b79128m1583D2224b08482
10142a06377n821c2283n5770k01864K6008B20840A0299d10583C17613c84688G1979
10130A56682b28380d7292m3519C8376j90K4453j7235J0785k625b3950A83896n6305
10118A27591a13090B07339a22287o6035L9125A22065b38588a4459q9628F4316
10107a36166A18538c21498h5759j2238p1675k52746J14345J00536e1386p9705
10097a31091e1219D92L9482a57163a9048A11097c21021e5805A90432j6817J8011
10086A91626q2289b05168j58604D0285a85679R0873k955a2011j66563o5484i2409
$$ y = [-15113, -156382, -156982, 27197, -114322, -286369, 50647, -108372, -33675, -277880, -127404, -139842, -189809, 120732, -37707, 121609, -14836, -189555, 23097, -279128, -320711, 42224, -208482, -106377, -112198, -32283, -88053, -289917, -263909, 220840, 10299, -410583, 317613, -384688, 71979, 156682, -228380, -47292, -90811, 38376, 38186, 62639, 45404, 56189, 53564, -23950, 183896, 127591, -113090, 207339, -122287, -188322, -149197, 122065, -238588, -14459, -104087, 64316, -136166, 118538, -321498, -85759, -97997, -169672, -422418, -308073, -207537, -51386, -131091, -51219, 492, 39974, -157163, -19048, 111097, -321021, -55805, 190432, 173615, 191626, 109337, -205168, -363772, 40285, -185679, -94806, -97761, -12011, -178574, -244058, -92409]
10074g0832l1078A34775k7690b13122h5839b9923G3301J50854b82484A25908m6920
10063G8988J33761a58049b5666Q262k92972M1794a33374A84343b56420L9253k6533
10052b43700l7527d3451B2500c38261C49893a29839A51830a27266a755l8447D10013
10040B0886d4570J9651J1636k59186J29003k61892a45488b4658o2426m547J912
10029h9719F4995a99465A03693n0577b36013k8504J0610b9749j28516A42052a77906
10017e708F7996d29514B94821k9026b90308c375m8904D1287J92359D124i5232
10005e7570A94354a923A74208b185j41872l074K9722k3595d1704n9108A53559
9993a75390D7697b29969J13785D59738A4425b48298a23031L6139I5167a96958
$$ y = [-70832, -101910, 134775, 107085, -213122, -85839, -29923, 73301, 224155, -282484, 125908, 78988, 212749, -158049, -25666, -17404, -310376, -268582, -133374, 184343, -256420, -217167, -243700, -281227, -43451, 22500, -338261, 349893, -129839, 151830, -127266, -1755, -40202, 410013, 20886, -44570, -24919, -13283, -272469, -143466, -405358, -145488, -24658, -87084, -91631, -89719, 64995, -199465, 103693, 53116, -236013, -264517, -253907, -29749, -158265, 142052, -177906, -5708, 67996, -429514, 294821, 265795, -290308, -3375, -52279, 41287, 233646, 4124, -95232, -57570, 194354, -1923, 174208, -2185, -144057, -147131, -117409, -141004, -41704, -100812, 153559, -175390, 47697, -229969, -116184, 459738, 14425, -248298, -123031, -86892, 95167, -196958]
9982a2093j62714e3144k17176a02458k03740J47473J9043B75111i2960j61296
9972b54256A06675j2538a40496b0373A81471b1841j98606q9558Q0845l31069a32988
9960c17288e1168J1284A14100g3981A10382l0392K5843i1161a4301E9917f0173
9948E5131K50975r9468G2478a40811f8810l4029A60126Q6134H553J1858h3488
9936b34880j65332a05126A58103k7738a7981l0708A7261c81903G419J81847L4594
9925B23860H1101a35895a391m2884D2548a33319k10515D5708g857l33536A860
9913C7809K06699d4841m8177j50431J13117G5086b11215F2439g4319p998F3861
9901a40335D6194a11735k33575J22672m4277k43466R6499a8745j46149A47901
$$ y = [-12093, -174807, -53144, -270320, -102458, -306198, -158725, -139682, 275111, -92960, -254256, 106675, 94137, -140496, -20373, 181471, -21841, -220447, -310005, -229160, -560229, -132988, -317288, -51168, -39884, 114100, -73981, 110382, 79990, 105833, -91161, -14301, 59917, -60173, 55131, 306106, 206638, 72478, -140811, -68810, -102839, 160126, 246260, 8553, 20411, -83488, -234880, -400212, -105126, 158103, 130365, -17981, -48689, 17261, -381903, 7419, 189266, 223860, 81101, -135895, -1391, -44275, 42548, -133319, -343834, 45708, -7857, -341393, 1860, 37809, 244508, -44841, -93018, -243449, -130332, 75086, -211215, 62439, -74319, -82317, 63861, -140335, 46194, -111735, -345310, -222638, -266915, -510381, -413882, -18745, -164894, 147901]
9890A3147K90664c7509A28638d5690m2090F218J37350n3277k4114b48999c6483
9878F2728a82427j3709H4970D0917K0150J54630l5061c33696L6407r7488J94639
9867b00138P1778N7464A84255a73727B0073c13918h138A3462K7468a70665b581
9855B86208a83500C5759a97952o1872a7199G4450f1521L0755j66362B0688a29357
9843b87701B23013g1050K6720o4104N3334q653K063K3319p4476l15542a56008
9831F9313b39247R2157K1996f0192h424l19607h71j65743k07369c2844E3721a79125
9818a41617A14544n4811b5695p0587j94409J04454J199C0517a41723A24526a62216
9806b70626C8314a64200A79233G2095K3800b47436a00070l2738k3685O4814A99329
$$ y = [13147, 303811, -37509, 128638, -45690, -87780, 6218, 143568, 90291, 66177, -248999, -36483, 62728, -182427, -196136, 84970, 40917, 61067, 215697, 180636, -333696, -297289, -394777, -200138, -128360, -70896, 184255, -173727, 20073, -313918, -8138, 13462, 40930, -170665, -2581, 286208, -183500, 35759, -197952, -259824, -17199, 74450, -61521, -30766, -197128, 20688, -129357, -287701, 223013, -71050, -44330, -108434, -55100, -63753, -61690, -38371, -112847, -428389, -156008, 69313, -239247, -147090, -125094, -60192, -8424, -328031, -871, -166614, -373983, -32844, 53721, -179125, -141617, 114544, 59733, -25695, -96282, -290691, -186237, -185038, 30517, -141723, 124526, -162216, -270626, 38314, -164200, 179233, 72095, 95895, -247436, -100070, -132808, -156493, -91679, 199329]
9794C2253a19602G7494d70155a7597L955l08192d4303m4928D109a02316l55501
9783d57817D629Q9430g6954j95044c9784B3718J50071m6575d4716A0380a00448
9771d0550B05024e1228m3333m5112M0906k01588a6836Q021q8566j89112l931J22361
9759a68063A02367a34336A9618P5677d44107a86092a468k17724K1761k9626f9865
9747b23344B10804a7501q4722I6624c67315F1039a88958A47138a73252I9485h630
9735a27964I3038a16204A53928a329n06472A26182K13270H96J97114b15976B16885
9723c11725J46235B55818c272G285f9093j36923M6114r26e4262j42185E06165
9711a43766B30290a71288A57608F7365a77291d4096j03820i755k58404A08446
$$ y = [32253, -119602, 77494, -470155, -17597, -13642, -321834, -44303, -89231, 4109, -102316, -457817, 4629, 94059, -76954, -271998, -39784, 23718, 173789, 127214, -44716, 10380, -100448, -40550, 205024, -51228, -94561, -139673, -98767, -300355, -16836, -8815, -97381, -286493, -290424, -168063, 102367, -134336, 19618, 95295, -444107, -186092, -1468, -219192, -197431, -227057, -69865, -223344, 210804, -17501, -102223, 96624, -367315, 61039, -188958, 147138, -173252, 99485, -8630, -127964, 93038, -116204, 153928, -1329, -507801, 126182, 339452, 896, 198010, -215976, 216885, -311725, -165490, 255818, -3272, 7285, -69093, -206016, -159902, -160828, -54262, -196447, 506165, -143766, 230290, -171288, 157608, 67365, -177291, -44096, -147916, -9755, -268159, 108446]
9700C00680c9533j98979J14896C18630f3206j14677L2220a1743l4394A45389P7676
9689B23065B2778J39527b42618k5860h1679c645n0025k95701A11303b48210N2542
9678a95668N4138J7623j34984Q8029Q5048D9340a26977E3025J88395A09290a50722
9666b47421f8108n1241n0325g6053C2733e7945A2814K05165a47005A7116b18192
9654c71175A17771a88794B6310J46140D3699O5092B6117O772a63070l00696A12614
9642A60008l1644b68315j86903J57436f3785k2326F3613a76271P6050k08178Q6933
9631b21466B9686e0024p6539j0856n8249c9030j25420B16790I2607b12858O6404
9620a46454A1494J7944a23386A01201K4139a81574j7874j84939J83708D73a14641
$$ y = [300680, -39533, -238512, -123616, 318630, -63206, -177883, -145663, -11743, -46137, 145389, 223065, 22778, 162305, -242618, -268478, -81679, -3645, -53670, -349371, 111303, -248210, -195668, -141530, -123907, -258891, -170862, -85814, 49340, -126977, 53025, 241420, 109290, -150722, -247421, -68108, -119349, -169674, -76053, 32733, -57945, 12814, 217979, -147005, 17116, -218192, -371175, 117771, -188794, 26310, 172450, 43699, 108791, 26117, 32889, -163070, -463766, 112614, 160008, 128364, -268315, -455218, -297782, -63785, -86111, 63613, -176271, -100221, -308399, -221466, 29686, -50024, -126563, -137419, -195668, -39030, -164450, 216790, 92607, -212858, -146454, 11494, 29438, -123386, 101201, 125340, -181574, -199448, -384387, -200679, 473, -114641]
9608c16058d8643j09687A48514k8325a40825A1335K10751p8391E887a19329A66075
9596F4878k4132g9614j89620A58490c4775P816j03817E4135J40003b27529g2683
9584c53526b046B21812a34880N5698r515o7073A4307n539a81247l797d4007k01002
9572b45009N8622o6435P8150f3222l12333R2425C11762l8662a95826N3532l1090
9561a73384c6394k6308j81133b4943k69350J04943J0314A32852K41643a15385
9550C8538b14591G6120R7309a11426j30602P8267B15405G7453R4464M587p0817
9539A05687L7217c4268j82844g9849k1752j82182a41703O5900j3388A7704R7319
9528A15023g6859B82792e2405A80379m9851b71651a10066A74755g3414j958k97807
$$ y = [-316058, -48643, -158330, 148514, 120189, -140825, 11335, 222086, 143695, 5887, -119329, 166075, 64878, 40746, -79614, -269234, 158490, -34775, -26959, -130776, 54135, 194138, -227529, -72683, -353526, -2046, 221812, -134880, -79182, -88697, -155770, 14307, 8768, -181247, -185044, -44007, -245009, -186387, -252822, -174672, -63222, -375555, -283130, 311762, 273100, -195826, -142294, -173384, -36394, -62702, -243835, -24943, -294293, -189350, -179036, 132852, 374495, -115385, 38538, -214591, 76120, 173429, -111426, -242028, -163761, 215405, 77453, 171917, 176504, 105687, 142904, -34268, -217112, -79849, -101601, -283783, -141703, -75803, -89191, 17704, 115023, -76859, 282792, -52405, 180379, 130528, -271651, -110066, 174755, -73414, -75372, -373179]
9517c73179b5327n3006F223J09815E4838a75464H4607a75796A28627b55988B40349
9505H3761a98899A52840j3735m6529a2761A96316b9731m734G5565a03318F8326
9493F3479b3245E931a62990A67767G1073a29500d1300j04l22486a21051c4334
9481b07006j64390J28241b584l47361d7109j09405E3586b63960a28615k26943
9471c55558h3388b3195j01780n2675A19611a55871A88179F4959P3586a31644A52905
9459a88535r7271J13527j71848Q4425A12368a94375g6939j32533P9372k00139
9449c30239D7639J56931c58200i0076A3639c97540a27901M7038E3911K22115k4994
9438B51032a287j61228a4941k34542i0254a9016k299m1781l2276l394j12983P4053
$$ y = [-373179, -25327, -78333, 6223, 116038, 54838, -175464, 84607, -175796, 128627, -255988, 240349, 83761, -198899, 152840, 139105, 92576, -12761, 196316, -29731, -34465, 75565, -103318, 68326, 63479, -23245, 5931, -162990, 167767, 71073, -129500, -41300, -41404, -363890, -121051, -34334, -207006, -371396, -243155, -2584, -349945, -47109, -156514, 53586, -263960, -128615, -355558, -83388, -23195, -124975, -177650, 119611, -155871, 188179, 64959, 138545, -131644, 152905, -188535, -285806, -172279, -344127, -259702, 112368, -194375, -76939, -209472, -130100, -330239, 47639, 204570, -358200, -90076, 13639, -397540, -127901, -80863, 53911, 276026, 251032, -1287, -162515, -14941, -249483, -90254, -19016, -21315, -63096, -95372, -98766, -211749, -137696]
9426a37696q9453i2791r0904o0517J08774B1870i3142j38138A35219a19298C2793
9414f5037j22844j32410O3784A59825G5838R8430p9269b18610e3723O989A00906
9402E7983d2053r1636K6324B4597i6124j5247d6962G662a05573A28640K5508g7279
9389B38434a30446A07887P443d2135m07198a51652F743a42084A16738d93837A7423
9377a06016M956r4988f7579a2399j32656c2921A36081e4425A64215h4150E9249
9365b0359j0635D925a5735p0709j11635e286B01844b4589I3421e0654j75301i4428
9352g3142I9801D8983K11734b20036A8665K17498m5465c22015G0657b56939B0388
9340H6254i5701A23449l6562a68250j94850A83064R198d2827k00256A5712M8179
$$ y = [-137696, -227149, -92791, -183695, -244212, -135438, 21870, -93142, -231280, 135219, -119298, 32793, -65037, -187881, -320291, -256507, 159825, 75838, 174268, 94999, -218610, -53723, -46734, 100906, 57983, -42053, -133689, -107365, 24597, -96124, -111371, -46962, 7662, -105573, 128640, 154148, -77279, 238434, -130446, 107887, 115330, -42135, -449333, -151652, 6743, -142084, 116738, -493837, 17423, -106016, -101060, -196048, -67579, -12399, -145055, -32921, 136081, -54425, 164215, -84150, 59249, -20359, -30994, 4925, -15735, -86444, -198079, -5286, 201844, -24589, 93421, -50654, -225955, -94428, -73142, 99801, 48983, 260717, -220036, 18665, 236163, 190698, -322015, 70657, -256939, 20388, 86254, -95701, 123449, 86887, -168250, -363100, 183064, 192262, -42827, -243083, 15712, 63891]
9329F3891c2966I3655a40143A63708j0285l5183a38675f1959A38254b65016M7407
9318b17609h4637j72732n4371M829B95649e7986q0904I9834M6782i014A41132
9306E5176b53649j44619A88534b38756a621k65093c4311A05270d065k29867K7920
9295b06012Q7115j68183p7834e4619A60038N1302a37058E0356c20245B41164c16847
9283D2120c60135i0388j66523p3619A69248e3339B82453c23322l3952b7304o4611
9272i1915j04464m2222D3765J14090a17546A15177a25376B7390b97128A19774
9261A4137M5139o921d3452C56498p4257c0156D9288I948J86510a16404B23448
9249b46975A50591J10700b01278o0A58444b74845B27243i8854j57079B51953H031
$$ y = [63891, -32966, 93655, -140143, 163708, 153423, 118240, -138675, -61959, 138254, -265016, -217609, -84637, -257369, -311740, -306911, 295649, -57986, -138890, 99834, 146616, -9014, 141132, 55176, -253649, -398268, 188534, -238756, -1621, -266714, -34311, 105270, -4065, -233932, -206012, -118897, -287080, -364914, -54619, 160038, 211340, -137058, 50356, -320245, 241164, -316847, 42120, -360135, -90388, -256911, -330530, 169248, -53339, 282453, -323322, -357274, -27304, -91915, -196379, -238601, 43765, 157855, -117546, 115177, -125376, 27390, -297128, 119774, 14137, 59276, 52355, -43452, 356498, 282241, -30156, 49288, 9948, 196458, -116404, 223448, -246975, 150591, 261291, -201278, -201338, 158444, -274845, 227243, -98854, -255933, 251953, 8031]
9237a20319A05957C4614a6333j24734d6155D7247b13446o0840A48153a09239A6284
9225c83984g6544n904j011A96135H8187P3658f0387C7071b41488P4540A6658a28226
9212c41970B9614b40168e0326p3044p2273Q4064B00990B9153L92547h4444B1490
9200i3902D7752b61871C557N8917b70832d1585C00254a12811m0930j7054J2409
9189a58386k0619b8555j46508B911a37268D9519i2410D4447a76535j57991D1941
9177A213c0620k62139A54399b39401l0564i6173b7332l58558D10239a51004A42376
9165a93206B01066E3194b52960h3770A4085a10673M3297A25201a01759c6435B99828
9153a56314A6408a23697j13668J11359m0587F9304a98772R7866C2401c44041A05153
$$ y = [-120319, 105957, 34614, -16333, -141067, -46155, 47247, -213446, -274286, 148153, -109239, 16284, -383984, -76544, -82448, -83459, 196135, 88187, 161845, -60387, 37071, -241488, -166948, 16658, -128226, -341970, 29614, -240168, -50326, -123370, -195643, -111579, 200990, 29153, 421700, -84444, 21490, -93902, 47752, -261871, 3557, 62474, -270832, -41585, 300254, -112811, -153741, -170795, -158386, -179005, -28555, -175063, 2911, -137268, 49519, -92410, 44447, -176535, -334526, 41941, 1213, -30620, -292759, 154399, -239401, -269965, -96173, -27332, -385890, 410239, -151004, 142376, -193206, 201066, 53194, -252960, -83770, 14085, -110673, -67376, 125201, -101759, -36435, 299828, -156314, 16408, -123697, -237365, -126006, -166593, 69304, -198772, -100906, 32401, -344041, 105153]
9141E6934i8703r3909A11769E3823N6343j5532g3391j70199c6711q1153E8134
9129B8258Q9911b18522a8135A77623a49612B34760d38694F4845a55071B6546K2773
9118D9319d2188J8898j6132j57528j631A03788c48379N8921a34304q5887A74232
9106B3489J01591C228J94318K60648e32529b10483n1073D086L5604b51488a09807
9094H9202b03064h8145a5725A3893a35266d7993E8854a18679G7255a50433j33514
9083b83947e1632m5663A36163a13898I9754a50457C3676b65548A610b18489C2269
9071a14294d5909o5993K1942j2229p0859A12873D210a90673p3297J23110r7001
9060b37861b7910j33722L7320H9441O6041J30506f0666k19177M9868B45407f832
$$ y = [56934, -98703, -192612, 111769, 53823, 110166, 94634, -73391, -243590, -36711, -117864, 58134, 28258, 118169, -218522, -18135, 177623, -149612, 234760, -438694, 64845, -155071, 26546, 49319, -42188, -23290, -39422, -196950, -198581, 103788, -348379, -289458, -134304, -220191, 174232, 23489, 125080, 3228, 197546, 458194, -532529, -210483, -261556, 4086, 39690, -251488, -109807, 89202, -203064, -88145, -15725, 13893, -135266, -47993, 58854, -118679, 77255, -150433, -283947, -51632, -97295, 136163, -113898, 99754, -150457, 33676, -265548, 1610, -218489, 32269, -114294, -45909, -111902, -89960, -102189, -173048, 112873, 4210, -190673, -263970, -140860, -237861, -27910, -161632, -124312, 89441, 155482, 285988, -60666, -279843, -229975, 245407, -6832]
9048a39498l7399A79370g6646H1465b93486f1796l19364j71392A80567d0911o6181
9037a07092I8881B0988N6668l5827j9698d8457l1918G0093l3869K41766h6744
9025A31417e4298B3709J04152e06984a01736A09468h7391A00235c4693j74847
9015b09540l1601A5812a0018j29888C697M8416J04567f2512j67041M8641r941
9004a90853f5226B3167P0714a37931j80864B07441f1851G4648h426j67229e8084
8992F2766J9356a08054m6890n8174J5800j91281J82762G3689c9999j38175j38696
8981c16870n3138b1997j34982J8223B32929b8783k58102Q9813m5618A70033D8665
8969b4987j34800C01018j09908G5820c33248B5660a6923l0326g664j16296M9804
$$ y = [-139498, -176897, 179370, -76646, 81465, -293486, -61796, -381160, -552552, 180567, -40911, -107092, 98881, 20988, 77656, 41829, 22131, -48457, -80375, 70093, 36224, 277990, -86744, 131417, -54298, 23709, 127861, -506984, -101736, 109468, -87391, 100235, -34693, -209540, -241141, 15812, -10018, -139906, 3697, 52113, 156680, -62512, -229553, -180912, -190853, -65226, 23167, 93881, -137931, -318795, 207441, -61851, 74648, -8426, -175655, -58084, 62766, 82122, -108054, -154944, -213118, -197318, -388599, -205837, 73689, -39999, -178174, -316870, -370008, -21997, -156979, -138756, 232929, -28783, -286885, -197072, -242690, 170033, 48665, -24987, -159787, 301018, 191110, 75820, -333248, 25660, -16923, -47249, -7664, -123960, -74156]
8958g4156B4510b72871A62167i4609M2235p8499j2768B8300h823k65531r460o2049
8946c45863j19687F2742a01917n5686j1290I5113A9717J349b2938n669C32398
8934f4692p2925n3421f7880j3612A17717b93421B97118I4214a59470C0546c4626
8922b95105f0625A6606K6251K9278R540R8047F5374J32202j4642f044B13530j03508
8910A10022f2873C92481J35480K31726j5554J539259J151234L687854k634457
8901D488023k098296j149559E18675J15542A85923L15613D7605K94334j14637
8892B27302a91087A90790e1863B97869J34928e8506L479m3253K4916J7101B7064
8880f8210l11898A55611i065k25172L5467H7153b3565N287C8877P1467m9582c6868
$$ y = [-74156, 24510, -272871, 162167, -94609, -52374, -130873, -143641, 28300, -8823, -274354, -283814, -345863, -465550, 62742, -101917, -157603, -168893, 95113, 19717, 21066, -22938, -28607, 332398, -64692, -137617, -191038, -67880, -81492, 117717, -293421, 297118, 94214, -159470, 30546, -34626, -295105, -60625, 16606, 42857, 72135, 81675, 179722, 65374, 197576, 182934, -6044, 213530, 110022, -62873, 392481, 527961, 759687, 744133, 2283392, 3434626, 7122480, 4488023, 2389727, 1240168, 518675, 634217, 185923, 501536, 47605, 341939, 227302, -191087, 190790, -51863, 297869, 432797, -58506, -55027, -98280, -73364, -56263, 27064, -68210, -380108, 155611, -9065, -234237, -198770, 87153, -23565, -18278, 38877, 110344, 60762, -36868]
8867h2678l0490A59999d9622r8421j5683N898F5564a23400H6642b77783E0882
8855c2008A90418J25022a49975B28468D145a29981B20104e7513K0358j11757A53877
8843b5353j97242r7095k1704g0648j59745p0584J5015Q6061C8362c1542m6864
8832g8406l7884H4190i6208B60835c7834j23787A70236a46128A39971i481l82863
$$ y = [-82678, -113168, 159999, -49622, -148043, -163726, -157828, 65564, -123400, 86642, -277783, 50882, -32008, 190418, 315440, -149975, 228468, 4145, -129981, 220104, -57513, -37155, -148912, 153877, -25353, -222595, -319690, -341394, -70648, -230393, -300977, -285962, -199901, 38362, -31542, -78406, -116290, 84190, -96208, 260835, -37834, -161621, 170236, -146128, 139971, -9481, -392344]
$$ [...]
##END NTUPLES=NMR SPECTRUM
##END=
