
##TITLE=AC1195_HLPAH12056_5946199_6pTzT2tSeK
##JCAMPDX= 6.0         $$ Bruker NMR JCAMP-DX V2.0
##DATA TYPE= NMR SPECTRUM
##DATA CLASS= NTUPLES
##ORIGIN= BRUKER
##OWNER= Administrator
$$ 1.72 TOPSPIN		Version 2.1
$$ 2012-04-10 22:02:09.421 -0500  Administrator@TOPSPIN
$$ Compression mode = diff/dup
##.OBSERVE FREQUENCY= 400.13188235
##.OBSERVE NUCLEUS= ^1H
##.ACQUISITION MODE= SIMULTANEOUS (DQD)
##.ACQUISITION SCHEME= undefined
##.AVERAGES= 64
##.DIGITISER RES= 22
##SPECTROMETER/DATA SYSTEM= spect
##.PULSE SEQUENCE= noesygpps1d.comp
##.SOLVENT NAME= COFFEE_meoh
##.SHIFT REFERENCE= INTERNAL, COFFEE_meoh, 1, 14.96846
##AUDIT TRAIL= $$ (NUMBER, WHEN, WHO, WHERE, PROCESS, VERSION, WHAT)
$$ ##TITLE= Audit trail, TOPSPIN		Version 2.1
$$ ##JCAMPDX= 5.01
$$ ##ORIGIN= Bruker BioSpin GmbH
$$ ##OWNER= Administrator
$$ $$ C:\Bruker\TOPSPIN/data/COFFEE/nmr/AC1195_HLPAH12056_5946199_6pTzT2tSeK/12/pdata/1/auditp.txt
$$ ##AUDIT TRAIL=  $$ (NUMBER, WHEN, WHO, WHERE, PROCESS, VERSION, WHAT)
(   1,<2012-04-10 22:02:04.656 -0500>,<Administrator>,<TOPSPIN>,<go>,<TOPSPIN 2.1>,
      <created by zg
	started at 2012-04-10 21:50:32.609 -0500,
	POWCHK enabled, PULCHK disabled,
       configuration hash MD5:
       1A 1E CE 29 27 FD 77 03 67 4E F0 E3 C4 B2 CB 90
       data hash MD5: 64K
       FD EC 58 3A 77 4B 2C 6E 5F 41 05 09 C1 86 D1 EF>)
(   2,<2012-04-10 22:02:07.453 -0500>,<Administrator>,<TOPSPIN>,<proc1d>,<TOPSPIN 2.1>,
      <Start of raw data processing
       efp LB = 0.3 FT_mod = 6 PKNL = 1 PHC0 = 0 PHC1 = 0 SI = 128K 
       data hash MD5: 128K
       3D 7E 18 5B A2 7D 1E AB 44 ED 5B 4B 72 79 FF 66>)
(   3,<2012-04-10 22:02:08.671 -0500>,<Administrator>,<TOPSPIN>,<proc1d>,<TOPSPIN 2.1>,
      <pk PHC0 = 29.02039 PHC1 = 0 
       data hash MD5: 128K
       F9 5F 8B 7E 68 86 96 6D A6 5D 59 BF 27 F4 D7 E4>)
(   4,<2012-04-10 22:02:08.906 -0500>,<Administrator>,<TOPSPIN>,<proc1d>,<TOPSPIN 2.1>,
      <abs ABSG = 1 
       data hash MD5: 128K
       8B F5 78 BE 0C 06 14 BE FA A1 37 27 09 4E 78 D0>)
(   5,<2012-04-10 22:02:08.984 -0500>,<Administrator>,<TOPSPIN>,<proc1d>,<TOPSPIN 2.1>,
      <abs ABSG = 2 
       data hash MD5: 128K
       4F 72 23 57 F5 83 74 1B 63 4C 93 91 5D 25 A5 EC>)
(   6,<2012-04-10 22:02:09.218 -0500>,<Administrator>,<TOPSPIN>,<proc1d>,<TOPSPIN 2.1>,
      <abs ABSG = 3 
       data hash MD5: 128K
       AE F4 E2 5D C4 7E 29 E7 32 94 AE BE 22 E8 BC 25>)
(   7,<2012-04-10 22:02:09.281 -0500>,<Administrator>,<TOPSPIN>,<proc1d>,<TOPSPIN 2.1>,
      <abs ABSG = 4 
       data hash MD5: 128K
       CF 42 8F EE 7E 38 5A F7 EA 64 44 24 1A 2C 97 B6>)
(   8,<2012-04-10 22:02:09.328 -0500>,<Administrator>,<TOPSPIN>,<proc1d>,<TOPSPIN 2.1>,
      <abs ABSG = 5 
       data hash MD5: 128K
       91 41 23 0F C1 A7 42 A5 14 94 2C 16 59 3E D2 CB>)
$$ ##END=
$$ 
$$ $$ hash MD5
$$ $$ EC 12 6A 9A FE A2 FD 49 C6 AE 95 13 0C E4 FD 95
##$RELAX= 
##$RELAX= 
##$RELAX= 
##$RELAX= 
##$RELAX= 
##$RELAX= 
##$RELAX= 
##$RELAX= 
$$ Bruker specific parameters
$$ [...]
##$TP07= 0
##$TPNAME0= <>
##$TPNAME1= <>
##$TPNAME2= <>
##$TPNAME3= <>
##$TPNAME4= <>
##$TPNAME5= <>
##$TPNAME6= <>
##$TPNAME7= <>
##$TPOAL= (0..7)
0.5 0.5 0.5 0.5 0.5 0.5 0.5 0.5
##$TPOFFS= (0..7)
0 0 0 0 0 0 0 0
##$TUNHIN= 0
##$TUNHOUT= 0
##$TUNXOUT= 0
##$USERA1= <user>
##$USERA2= <user>
##$USERA3= <user>
##$USERA4= <user>
##$USERA5= <user>
##$V9= 5
##$VALIST= <valist>
##$VCLIST= <CCCCCCCCCCCCCCC>
##$VD= 0
##$VDLIST= <DDDDDDDDDDDDDDD>
##$VPLIST= <PPPPPPPPPPPPPPP>
##$VTLIST= <TTTTTTTTTTTTTTT>
##$WBST= 1024
##$WBSW= 4
##$XGAIN= (0..3)
0 0 0 0
##$XL= 0
##$YL= 0
##$YMAX_a= 14031858
##$YMIN_a= -5898768
##$ZGOPTNS= <>
##$ZL1= 120
##$ZL2= 120
##$ZL3= 120
##$ZL4= 120
##$ABSF1= 14.96846
##$ABSF2= -5.58407
##$ABSG= 5
##$ABSL= 3
##$ALPHA= 0
##$AQORDER= 0
##$ASSFAC= 0
##$ASSFACI= 0
##$ASSFACX= 0
##$ASSWID= 0
##$AUNMP= <proc_prof1d_extract.lims>
##$AXLEFT= 0
##$AXNAME= <>
##$AXNUC= <1H>
##$AXRIGHT= 0
##$AXTYPE= 0
##$AXUNIT= <>
##$AZFE= 0.1
##$AZFW= 0.1
##$BCFW= 0
##$BC_mod= 0
##$BYTORDP= 0
##$COROFFS= 0
##$CY= 15
##$DATMOD= 1
##$DC= 0
##$DFILT= <>
##$DTYPP= 0
##$F1P= 0
##$F2P= 0
##$FCOR= 0.5
##$FTSIZE= 131072
##$FT_mod= 6
##$GAMMA= 0
##$GB= 0
##$INTBC= 1
##$INTSCL= 1
##$ISEN= 128
##$LB= 0.3
##$LEV0= 0
##$LPBIN= 0
##$MAXI= 10000
##$MC2= 0
##$MEAN= 0
##$ME_mod= 0
##$MI= 0
##$NCOEF= 0
##$NC_proc= -3
##$NLEV= 6
##$NOISF1= 0
##$NOISF2= 0
##$NSP= 0
##$NTH_PI= 0
##$NZP= 0
##$OFFSET= 14.96846
##$PC= 1
##$PHC0= 29.02039
##$PHC1= 0
##$PH_mod= 1
##$PKNL= yes
##$PPARMOD= 0
##$PPDIAG= 0
##$PPIPTYP= 0
##$PPMPNUM= 2147483647
##$PPRESOL= 1
##$PSCAL= 4
##$PSIGN= 0
##$PYNMP= <proc.py>
##$REVERSE= no
##$SF= 400.130004860154
##$SI= 131072
##$SIGF1= 0
##$SIGF2= 0
##$SINO= 400
##$SIOLD= 131072
##$SPECTYP= <>
##$SREGLST= <1H.CDCl3>
##$SSB= 0
##$STSI= 131072
##$STSR= 0
##$SW_p= 8223.68421052632
##$SYMM= 0
##$S_DEV= 0
##$TDeff= 65536
##$TDoff= 0
##$TI= <>
##$TILT= no
##$TM1= 0
##$TM2= 0
##$TOPLEV= 0
##$USERP1= <user>
##$USERP2= <user>
##$USERP3= <user>
##$USERP4= <user>
##$USERP5= <user>
##$WDW= 1
##$XDIM= 131072
##$YMAX_p= 454007590
##$YMIN_p= -138985950
##$CURPLOT= <Network HP LaserJet P1505>
##$CURPRIN= <$Network HP LaserJet P1505>
##$DFORMAT= <normdp>
##$LAYOUT= <+/1D_H.xwp>
##$LFORMAT= <normlp>
##$PFORMAT= <normpl>
##$SURQMSG= 1
$$ End of Bruker specific parameters
$$ ---------------------------------
##NTUPLES= NMR SPECTRUM
##VAR_NAME=  FREQUENCY,     SPECTRUM/REAL,   SPECTRUM/IMAG
##SYMBOL=    X,             R,               I
##VAR_TYPE=  INDEPENDENT,   DEPENDENT,       DEPENDENT
##VAR_FORM=  AFFN,          ASDF,            ASDF
##VAR_DIM=   131072,        131072,          131072
##UNITS=     HZ,            ARBITRARY UNITS, ARBITRARY UNITS
##FACTOR=    0.0627417313425165, 1,          1
##FIRST=     8223.62146879498, -2979,        -100992
##LAST=      0,             1298,            -102702
##MIN=       0,             -138985950,      0
##MAX=       8223.62146879498, 454007590,    0
$$ Real data points
##PAGE= N=1
##DATA TABLE= (X++(R..R)), XYDATA
$$ [...]
60696A625554M504M794O497Q240Q275O386L896J946O58mL40J677K977L045J719
60681A680504j46j615k307k423k412k512k574k541k902m147n904p247p879q237
60667A627658q370p696o126m587l953m171m722n160m999m054l277m080o154p214
60653A553095n828l336j964k164l107m569o567p984p633o375o174p114p345o177
60639A476758n246n844o933o913n972n380n382n190m502l844l514l180k572j955
60625A410331j680j860k554m057o561r467j1455j1804j1549j2422j4371j5233
60613A307318j3710j1502j1018j1797j1225q572o040n256m949l359j151j56m38
60600A218145m84J77N07M0j03J069K861L651K717Q22o90j011k60R22J985K682
$$ y = [1625554, 1630058, 1634852, 1641349, 1649589, 1657864, 1664250, 1668146, 1670092, 1670750, 1670746, 1671086, 1672763, 1675740, 1678785, 1680504, 1680358, 1678743, 1676436, 1674013, 1671601, 1669089, 1666515, 1663974, 1661072, 1656925, 1651021, 1643774, 1635895, 1627658, 1619288, 1611592, 1605466, 1600879, 1596926, 1592755, 1588033, 1582873, 1577874, 1573820, 1570543, 1566463, 1560309, 1553095, 1547267, 1543931, 1541967, 1539803, 1536696, 1532127, 1525560, 1517576, 1509943, 1503568, 1497394, 1490280, 1482935, 1476758, 1471512, 1465668, 1458735, 1451822, 1445850, 1440470, 1435088, 1429898, 1425396, 1421552, 1418038, 1414858, 1412286, 1410331, 1408651, 1406791, 1404237, 1400180, 1393619, 1384152, 1372697, 1360893, 1349344, 1336922, 1322551, 1307318, 1293608, 1282106, 1271088, 1259291, 1248066, 1239494, 1233454, 1228198, 1223249, 1219890, 1218739, 1218583, 1218145, 1217661, 1217838, 1218345, 1218385, 1218282, 1219351, 1222212, 1225863, 1228580, 1229402, 1228712, 1227701, 1227441, 1228363, 1230348, 1233030]
60584A233030K888K661K391K432K504K028J173R02J665K817L729M701O143P618
60570A276682Q637R611J1068J2452J2984J3349J4947J7495J8966J8481J7813J9112
60558A451597K2101K4753K6003K6579K7243K7504K6528K4525K2576K1267K0033
60547A720709J7911J4667J0887P031K877j933p088j1797j5571j8373k0220k1213
60535A677887k1898k2763k3250k2198j9579j6962j5580j4728j2972j0309q101
60524A489547p124o835o419n598m349k869j886k011k596k346j282r51k130l486
60510A439665l321j617N30K507M126M862M613M644O360R278J1568J2424J2628
60497A508267J2867J3005J3225J4301J6194J7577J7573J7020J7308J8741K0594
$$ y = [1233030, 1235918, 1238579, 1240970, 1243402, 1245906, 1247934, 1249107, 1250009, 1251674, 1254491, 1258220, 1262921, 1269064, 1276682, 1285319, 1294930, 1305998, 1318450, 1331434, 1344783, 1359730, 1377225, 1396191, 1414672, 1432485, 1451597, 1473698, 1498451, 1524454, 1551033, 1578276, 1605780, 1632308, 1656833, 1679409, 1700676, 1720709, 1738620, 1753287, 1764174, 1771205, 1774082, 1772149, 1765061, 1753264, 1737693, 1719320, 1699100, 1677887, 1655989, 1633226, 1609976, 1587778, 1568199, 1551237, 1535657, 1520929, 1507957, 1497648, 1489547, 1482423, 1475588, 1469169, 1463571, 1459222, 1456353, 1454467, 1452456, 1449860, 1447514, 1446232, 1445281, 1443151, 1439665, 1436344, 1434727, 1435257, 1437764, 1441890, 1446752, 1451365, 1456009, 1462369, 1471647, 1483215, 1495639, 1508267, 1521134, 1534139, 1547364, 1561665, 1577859, 1595436, 1613009, 1630029, 1647337, 1666078, 1686672]
60486A686672K2130K3039K3667K5293K9233L4985M0161M3064M4478M5990M7263
60475B065975M6252M1640L3944K4388J3876L169o869j5563k2501k7288k9610k9502
60463B097911k7228k3046j7450j1352n538n1N470J1158J6873K2408K7263L0689
60451B127107L2535L3747L5469L8049M1493M6271N2871O0939O9742P9170Q9476
60440B706869J00479J12036J24985J40449J58307J77418J97138K17418K37538
60431D172637K56498K74963K95156L18034L41935L64989L87069M07309M20335
60422G238925M17199L90802L39452K65375J71907O3569n2082j64755k64472l44358
60412H061562m01281m35327m49237m47419m34383m13781l88552l60918l31792
$$ y = [1686672, 1708802, 1731841, 1755508, 1780801, 1810034, 1845019, 1885180, 1928244, 1972722, 2018712, 2065975, 2112227, 2153867, 2187811, 2212199, 2226075, 2229244, 2222375, 2206812, 2184311, 2157023, 2127413, 2097911, 2070683, 2047637, 2030187, 2018835, 2013297, 2013246, 2018716, 2029874, 2046747, 2069155, 2096418, 2127107, 2159642, 2193389, 2228858, 2266907, 2308400, 2354671, 2407542, 2468481, 2538223, 2617393, 2706869, 2807348, 2919384, 3044369, 3184818, 3343125, 3520543, 3717681, 3935099, 4172637, 4429135, 4704098, 4999254, 5317288, 5659223, 6024212, 6411281, 6818590, 7238925, 7656124, 8046926, 8386378, 8651753, 8823660, 8887229, 8835147, 8670392, 8405920, 8061562, 7660281, 7224954, 6775717, 6328298, 5893915, 5480134, 5091582, 4730664, 4398872]
60403D398872l01244k70415k42016k17723j96072j74845j54941j39481j28961
60394B573174j19905j09365r8357q9281q2031p4856o7573o1426n6631n2422m8981
60383A712346m6998m5531m2697l8653l5568l4207l2815l0078k7138k5363k3994
60372A329304k1532j8339j6254j6156j7173j7921j7605j6082j3675j0921q221
60361A155425n868m372m153m710m837l907k377q52O18K059L186L818M028L714
60347A141772K775J903K190L592M686M463L509K993L321M351N954P663Q632Q624
60333A206428Q466Q796R051Q402P033N807N113M789M693M745M748M583M196L192
60319A290042J234r70k121k215k738m251n111l861j677p92j302j355j60J147J697
$$ y = [4398872, 4097628, 3827213, 3585197, 3367474, 3171402, 2996557, 2841616, 2702135, 2573174, 2453269, 2343904, 2245547, 2156266, 2074235, 1999379, 1931806, 1870380, 1813749, 1761327, 1712346, 1665348, 1619817, 1577120, 1538467, 1502899, 1468692, 1435877, 1405799, 1378661, 1353298, 1329304, 1307772, 1289433, 1273179, 1257023, 1239850, 1221929, 1204324, 1188242, 1174567, 1163646, 1155425, 1149557, 1145185, 1141032, 1136322, 1131485, 1127578, 1125201, 1124349, 1124967, 1127026, 1130212, 1134030, 1138058, 1141772, 1144547, 1146450, 1148640, 1152232, 1156918, 1161381, 1164890, 1167883, 1171204, 1175555, 1181509, 1189172, 1197804, 1206428, 1214894, 1223690, 1232741, 1241143, 1248176, 1253983, 1259096, 1263885, 1268578, 1273323, 1278071, 1282654, 1286850, 1290042, 1291276, 1290306, 1288185, 1285970, 1283232, 1278981, 1273870, 1270009, 1268332, 1267540, 1266238, 1264883, 1264723, 1265870, 1267567]
60304A267567K082K848L354L056K788L754N868P954R214R719R817R766R952J0711
60290A358450J1829J2607J2695J2504J2505J2407J1522R909Q491P770P014N301
60278A483004K928J038L1p40j616j921r91Q37K687M079N041N736O332O852O875
60263A520172N910M223K679J435m27l432o596q484q910q794q700q291p203n728
60249A467854m487l823l598l386k838j930q55K27J171J799K147K597L325L937
60235A462140M206M638N352M941K126j526k442O24M752O450N674M870N234N818
60221A512857N789N731O361P401Q177Q638R250J0275J1520J2650J3624J4656J5602
60208A642531J5885J5574J6029J8256K1034K2231K2160K3605K7824L2587L5425
$$ y = [1267567, 1269649, 1272497, 1275851, 1278907, 1281695, 1285449, 1291317, 1299271, 1308485, 1318204, 1328021, 1337787, 1347739, 1358450, 1370279, 1382886, 1395581, 1408085, 1420590, 1432997, 1444519, 1454428, 1462919, 1470689, 1477703, 1483004, 1485932, 1486970, 1487001, 1486261, 1484645, 1482724, 1481733, 1482570, 1485257, 1489336, 1494377, 1500113, 1506445, 1513297, 1520172, 1526082, 1530305, 1532984, 1534419, 1533992, 1530560, 1523964, 1515480, 1506570, 1497776, 1489076, 1480785, 1473582, 1467854, 1463367, 1459544, 1455946, 1452560, 1449722, 1447792, 1446937, 1447164, 1448335, 1450134, 1452281, 1454878, 1458203, 1462140, 1466346, 1470984, 1476336, 1481277, 1483403, 1481877, 1479435, 1480059, 1484811, 1491261, 1496935, 1501805, 1507039, 1512857, 1518646, 1524377, 1530738, 1538139, 1546316, 1554954, 1564204, 1574479, 1585999, 1598649, 1612273, 1626929, 1642531, 1658416, 1673990, 1690019, 1708275, 1729309, 1751540, 1773700, 1797305, 1825129, 1857716, 1893141]
60197A893141L6914L9005M1807M4367M7432N2719N9860O6532P1794P7061Q3474
60186B514106R0310R6690J03136J10556J18884J27428J35685J43291J49986J55989
60176C746061J61727J66940J70722J72360J71489J67585J60317J50192J37941
60167E205334J23588J07307R0593P4958N9697M2957K5088Q911l863j4327k3620
60156E696623l0541l3380l2601k9943k5966k0060j2128k698Q160K0644L4153M7651
60144E619914O0976P4815Q9417J04161J18262J31240J42738J52380J59633J63438
60134F816974J62417J56037J45155J30976J14113R5262P5856N6815L7171J5374
60124G806150q132l0893n1063o8709q4162r6422j03979j06420j04432r8831r0326
$$ y = [1893141, 1930055, 1969060, 2010867, 2055234, 2102666, 2155385, 2215245, 2281777, 2353571, 2430632, 2514106, 2604416, 2701106, 2804242, 2914798, 3033682, 3161110, 3296795, 3440086, 3590072, 3746061, 3907788, 4074728, 4245450, 4417810, 4589299, 4756884, 4917201, 5067393, 5205334, 5328922, 5436229, 5526822, 5601780, 5661477, 5704434, 5729522, 5738433, 5734570, 5720243, 5696623, 5666082, 5632702, 5600101, 5570158, 5544192, 5524132, 5512004, 5509306, 5517466, 5538110, 5572263, 5619914, 5680890, 5755705, 5845122, 5949283, 6067545, 6198785, 6341523, 6493903, 6653536, 6816974, 6979391, 7135428, 7280583, 7411559, 7525672, 7620934, 7696790, 7753605, 7790776, 7806150, 7798018, 7767125, 7716062, 7647353, 7563191, 7466769, 7362790, 7256370, 7151938, 7053107, 6962781]
60113F962781p9743o7614n3666l7359j8929N74K0125L9026N6500P1704Q4238R4133
60101G071770J01152J04652J04420J01065R5212Q6771P5568O2381M8746L5920
60091G887657K4450J4585O505L41l548m435j806M280J3933K7910M6318O7293Q8518
60078H172001J09923J33291J59022J85318K11341K39009K69981L02451L33061
60069A0115398L61046L88365M16051M42632M66076M85249M99102N06366N06878
60060A4187163N01654M90718M72097M44007M06986L62929L12794K56564J94931
60051A7629843J29794O3012m471p2168j39126k03521k62755l13997l55106l85332
60041A6086173m05087m14991m15229m05818l87477l62057l31895k98642k62759
$$ y = [6962781, 6883038, 6815424, 6761758, 6724399, 6705470, 6706044, 6726169, 6765195, 6821695, 6893399, 6977637, 7071770, 7172922, 7277574, 7381994, 7483059, 7578271, 7665042, 7740610, 7802991, 7851737, 7887657, 7912107, 7926692, 7933197, 7933538, 7929990, 7925555, 7923749, 7928029, 7941962, 7969872, 8016190, 8083483, 8172001, 8281924, 8415215, 8574237, 8759555, 8970896, 9209905, 9479886, 9782337, 10115398, 10476444, 10864809, 11280860, 11723492, 12189568, 12674817, 13173919, 13680285, 14187163, 14688817, 15179535, 15651632, 16095639, 16502625, 16865554, 17178348, 17434912, 17629843, 17759637, 17822649, 17818178, 17746010, 17606884, 17403363, 17140608, 16826611, 16471505, 16086173, 15681086, 15266095, 14850866, 14445048, 14057571, 13695514, 13363619, 13064977, 12802218]
60032A2802218k24253j83678j42320j01728o3342k8392K199K7883M8552O4681
60022A2201820P7006Q5315Q7559Q1246O6278M5649K2787r23k5453n0293p4733
60011A2516258r9133j24099j48477j69755j86803k01006k14360k27187k38004
60002A0907434k44704k45759k41131k32375k21337k08528j93233j75020j54425
59993H990922j32277j09215q5778o2134l7811j2553J2637L6319N8315P9457R9632
59982H837514J17246J30905J40364J45525J45738J40736J31150J17379R8898P5448
59972A0080903M8303J9560r319l7706o5218r1546j16437j39190j58382j72643
59962I358325j81644j85976j86104j81709j72214j58016j40987j23233j05175
$$ y = [12802218, 12577965, 12394287, 12251967, 12150239, 12086897, 12058505, 12060704, 12088587, 12137139, 12201820, 12278826, 12364141, 12451700, 12532946, 12599224, 12644873, 12667660, 12666737, 12641284, 12590991, 12516258, 12417125, 12293026, 12144549, 11974794, 11787991, 11586985, 11372625, 11145438, 10907434, 10662730, 10416971, 10175840, 9943465, 9722128, 9513600, 9320367, 9145347, 8990922, 8858645, 8749430, 8663652, 8601518, 8563707, 8551154, 8563791, 8600110, 8658425, 8737882, 8837514, 8954760, 9085665, 9226029, 9371554, 9517292, 9658028, 9789178, 9906557, 10005455, 10080903, 10129206, 10148766, 10139447, 10101741, 10036523, 9944977, 9828540, 9689350, 9530968, 9358325, 9176681, 8990705, 8804601, 8622892, 8450678, 8292662, 8151675, 8028442, 7923267]
59953G923267q5471o3224l9507j6123O431K8860N1705P5133R9443J24434J48690
59942H253638J70713J90382K08020K22525K31967K35627K33836K26187K11824
59933A0184719J91448J67024J39435J08340P4367L9255L529l3487p0676j04484
59923A0699470j32388j54915j73102j85944j91779j90406j82572j68996j51204
59914I168164j31439j10378q6651o0186l3937j0367J1835L5046N8409P9044R6522
59903I016062J12934J28792J41836J50380J55371J58247J58576J54964J47189
59894A0324351J36564J24785J12986J01574R0672Q0702P2244O5508O0751N9339
59884A1229476O3055P1832Q3615R7482J15345J39253J68489K01077K36738K76090
$$ y = [7923267, 7837796, 7774572, 7735065, 7718942, 7725373, 7754233, 7805938, 7881071, 7980514, 8104948, 8253638, 8424351, 8614733, 8822753, 9045278, 9277245, 9512872, 9746708, 9972895, 10184719, 10376167, 10543191, 10682626, 10790966, 10865333, 10904588, 10908117, 10874630, 10803954, 10699470, 10567082, 10412167, 10239065, 10053121, 9861342, 9670936, 9488364, 9319368, 9168164, 9036725, 8926347, 8839696, 8779510, 8745573, 8735206, 8747041, 8782087, 8840496, 8919540, 9016062, 9128996, 9257788, 9399624, 9550004, 9705375, 9863622, 10022198, 10177162, 10324351, 10460915, 10585700, 10698686, 10800260, 10890932, 10971634, 11043878, 11109386, 11170137, 11229476, 11292531, 11364363, 11447978, 11545460, 11660805, 11800058, 11968547, 12169624, 12406362, 12682452]
59874A2682452L17783L58810L97352M33197M65570M92592N12701N24507N25151
59865A6710115N10939M80139M33473L71793K95175K05122J05992L483r7318j92150
59855A8826763k77358l50249m08975m52094m79322m92518m94290m85543m65960
59846A4920454m36945m02096l64123l23280k79670k35161j91640j48970j06343
59837A2432226o4513k4996J2135M7807Q1584J11343J35344J53302J65138J69762
59827A3219132J65653J51818J27812R3429M9281k352n7864j13985j68935k21770
59817A3242219k70817l13427l47421l72182l88049l95474l95345l89367l78903
59808I991234l63778l43415l19170k94253k70923k48746k26233k03383j81810
$$ y = [12682452, 13000235, 13359045, 13756397, 14189594, 14655164, 15147756, 15660457, 16184964, 16710115, 17221054, 17701193, 18134666, 18506459, 18801634, 19006756, 19112748, 19116231, 19018913, 18826763, 18549405, 18199156, 17790181, 17338087, 16858765, 16366247, 15871957, 15386414, 14920454, 14483509, 14081413, 13717290, 13394010, 13114340, 12879179, 12687539, 12538569, 12432226, 12367713, 12342717, 12354852, 12402659, 12484243, 12595586, 12730930, 12884232, 13049370, 13219132, 13384785, 13536603, 13664415, 13757844, 13807125, 13804773, 13746909, 13632924, 13463989, 13242219, 12971402, 12657975, 12310554, 11938372, 11550323, 11154849, 10759504, 10370137, 9991234, 9627456, 9284041, 8964871, 8670618, 8399695, 8150949, 7924716, 7721333, 7539523]
59799G539523j62854j46519j32342j20509j11648j05745j01845r8856r6264r3729
59789F369212r0469q5702p9447p2270o4526n6900n1237m9272n0134n0903n0434
59778E667918n1001n4896o0833o5398o7000o6512o4728o1313n6223n0402m4787
59767E024825l9701l5165l0770k5523j9027j2405o722r82O628J5801K4274L1002
59755D932235L7242M4117N0943N6757O1969O7543P3468P8836Q2745Q4722Q4965
59744E655542Q4256Q2959Q0086P4372O6256N7798N0750M5776M3259M3319M5151
59733F329524M7891N2286N9850P0425Q2426R5659J11795J31430J52860J74723
59723G308869J97837K23271K50473K78760L09017L42172L76977M10690M40894
$$ y = [7539523, 7376669, 7230150, 7097808, 6977299, 6865651, 6759906, 6658061, 6559205, 6462941, 6369212, 6278743, 6193041, 6113594, 6041324, 5976798, 5919898, 5868661, 5819389, 5769255, 5718352, 5667918, 5616917, 5562021, 5501188, 5435790, 5368790, 5302278, 5237550, 5176237, 5120014, 5069612, 5024825, 4985124, 4949959, 4919189, 4893666, 4874639, 4862234, 4855512, 4854530, 4861158, 4876959, 4901233, 4932235, 4969477, 5013594, 5064537, 5121294, 5183263, 5250806, 5324274, 5403110, 5485855, 5570577, 5655542, 5739798, 5822757, 5902843, 5977215, 6043471, 6101269, 6152019, 6197795, 6241054, 6284373, 6329524, 6377415, 6429701, 6489551, 6559976, 6642402, 6738061, 6849856, 6981286, 7134146, 7308869, 7506706, 7729977, 7980450, 8259210, 8568227, 8910399, 9287376, 9698066, 10138960]
59714A0138960M65291M80523M82366M66370M27857L63378K74379J68929N8404
59705A3326457m7072j39653k12976k63548k92848l05751l06415k96714k78012
59696A1183468k52488k22429j89627j55653j21640q7727n3849k0982R561L8008
59686A0126642O5972R4215J21849J48098J73662J99845K27280K56068K86322L17970
59676A2017923L50529L83740M18136M54637M93756N35434N79420O25558O73737
59667A6532870P23520P73775Q22914Q69791R14156R55757R92972J022567J040920
59658B4649242J045648J036739J016612R88804R56212R20752Q84759Q51966Q26306
59649C3177040Q10000Q03239Q04954Q12876Q23056Q30645Q31574Q22885Q01535
$$ y = [10138960, 10604251, 11084774, 11567140, 12033510, 12461367, 12824745, 13099124, 13268053, 13326457, 13279385, 13139732, 12926756, 12663208, 12370360, 12064609, 11758194, 11461480, 11183468, 10930980, 10708551, 10518924, 10363271, 10241631, 10153904, 10100055, 10079073, 10088634, 10126642, 10192614, 10286829, 10408678, 10556776, 10730438, 10930283, 11157563, 11413631, 11699953, 12017923, 12368452, 12752192, 13170328, 13624965, 14118721, 14654155, 15233575, 15859133, 16532870, 17256390, 18030165, 18853079, 19722870, 20637026, 21592783, 22585755, 23608322, 24649242, 25694890, 26731629, 27748241, 28737045, 29693257, 30614009, 31498768, 32350734, 33177040, 33987040, 34790279, 35595233, 36408109, 37231165, 38061810, 38893384, 39716269, 40517804]
59640D0517804P64160P08845O36594N50397M53467L49273K42897J40901M8999
59631D4413337k9607r3105j39063j64762j69418j54845j23414p6262j4090O1334
59621D3510105J47467K42225L43866M50071N58211O66211P71965Q72005R61677
59612D8523803J036335J091109J119619J114325J068511R77245Q37302O48605
59604E6416854M16606J51997j32264m22404p02910r57636j174251j346882j473769
59595E0775341j554503j591254j590696j561805j512052j447588j376352j308618
59587C8832473j254092j219551j208405j219858j247632j281250j310060j326571
59579B8765054j327053j310903j279901j236914j184517j124901j060597r94064
$$ y = [40517804, 41281964, 41990809, 42627403, 43177800, 43631267, 43980540, 44223437, 44364338, 44413337, 44383730, 44290625, 44151562, 43986800, 43817382, 43662537, 43539123, 43462861, 43448771, 43510105, 43657572, 43899797, 44243663, 44693734, 45251945, 45918156, 46690121, 47562126, 48523803, 49560138, 50651247, 51770866, 52885191, 53953702, 54930947, 55768249, 56416854, 56833460, 56985457, 56853193, 56430789, 55727879, 54770243, 53595992, 52249110, 50775341, 49220838, 47629584, 46038888, 44477083, 42965031, 41517443, 40141091, 38832473, 37578381, 36358830, 35150425, 33930567, 32682935, 31401685, 30091625, 28765054, 27438001, 26127098, 24847197, 23610283, 22425766, 21300865, 20240268, 19246204]
59571A9246204r26635q58991p92671p30026o72445o19585n70515n24609m81247
59562A3069480m39907m01078l66078l35350l07605k81313k56361k33737k14112
59553A0233939j97393j83321j71940j63530j58412j56585j57424j59807j62639
59544H722888j65185j66997j67907j68033j67382j65401j61366j55227j47741
59535G257649j39612j30904j21315j10718r9282q7341p5389o4033n3822m4890
59525F330343l6545k7375j6425m552N983J3798J9802K5844L2481L8771M3851M7842
59513F473818N1307N4693N8362O2481O6940P1921P8362Q7023R7225J07444J17402
59502G326978J28617J42571J58913J76075J93076K10223K28258K47278K66623
$$ y = [19246204, 18319569, 17460578, 16667907, 15937881, 15265436, 14645851, 14075336, 13550727, 13069480, 12629573, 12228495, 11862417, 11527067, 11219462, 10938149, 10681788, 10448051, 10233939, 10036546, 9853225, 9681285, 9517755, 9359343, 9202758, 9045334, 8885527, 8722888, 8557703, 8390706, 8222799, 8054766, 7887384, 7721983, 7560617, 7405390, 7257649, 7118037, 6987133, 6865818, 6755100, 6655818, 6568477, 6493088, 6429055, 6375233, 6330343, 6293798, 6266423, 6249998, 6245446, 6251429, 6265227, 6285029, 6310873, 6343354, 6382125, 6425976, 6473818, 6525125, 6579818, 6638180, 6700661, 6767601, 6839522, 6917884, 7004907, 7102132, 7209576, 7326978, 7455595, 7598166, 7757079, 7933154, 8126230, 8336453, 8564711, 8811989, 9078612]
59493I078612K85699L04752L24457L44553L63370L79212L91787M01496M07747
59484A2281685M09084M05114L97124L86354L72502L54518L32010L05026K73193
59475A5516610K36360J96340J57075J22392R3620O9503M8342L0019J6045P985
59465A6494291O215J0286K0009L5538N6272Q0220J04766J27767J47555J62088
59455A7245007J68657J64650J48477J19765P9132K7984l1747r8003j68662k40867
59445A7414393l10626l73883m28151m72555n06196n27550n36071n33548n22686
59436A3203127n04824m80189m50054m16989l82682l46984l09823k72903k38388
59427I800291k06634j76317j46357j16745q7728n9249l1472m972K0056M4491O9672
$$ y = [9078612, 9364311, 9669063, 9993520, 10338073, 10701443, 11080655, 11472442, 11873938, 12281685, 12690769, 13095883, 13493007, 13879361, 14251863, 14606381, 14938391, 15243417, 15516610, 15752970, 15949310, 16106385, 16228777, 16322397, 16391900, 16440242, 16470261, 16486306, 16494291, 16500506, 16510792, 16530801, 16566339, 16622611, 16702831, 16807597, 16935364, 17082919, 17245007, 17413664, 17578314, 17726791, 17846556, 17925688, 17953672, 17921925, 17823922, 17655260, 17414393, 17103767, 16729884, 16301733, 15829178, 15322982, 14795432, 14259361, 13725813, 13203127, 12698303, 12218114, 11768060, 11351071, 10968389, 10621405, 10311582, 10038679, 9800291, 9593657, 9417340, 9270983, 9154238, 9066510, 9007261, 8975789, 8970817, 8990873, 9035364, 9105036]
59416I105036R6008J22461J47692J71596J95118K18342K39535K56686K69425K78364
59406A1100263K83010K81485K72120K54114K26780J89817J44660R4055L9792j7860
59396A2868236p7817j36912j91882k41370k84871l21017l48329l66781l77365
59387A0521892l80799l77786l69836l58547l44609l28431l11027k93288k75158
59378G482411k56612k38512k21370k04169j85970j67795j51335j36545j22325
59369E797778j08904r7442q7569p7376o6005n4516m4006l4560k6076j8408j0626
59358E172290j962O259J1833J5421K0777K9842L9350M4162M3041L9510L7657L8779
59346E496959M1888M5972N1047N7842O7144P9295R3730J08711J21793J31260J37563
$$ y = [9105036, 9201044, 9323505, 9471197, 9642793, 9837911, 10056253, 10295788, 10552474, 10821899, 11100263, 11383273, 11664758, 11936878, 12190992, 12417772, 12607589, 12752249, 12846304, 12886096, 12868236, 12790419, 12653507, 12461625, 12220255, 11935384, 11614367, 11266038, 10899257, 10521892, 10141093, 9763307, 9393471, 9034924, 8690315, 8361884, 8050857, 7757569, 7482411, 7225799, 6987287, 6765917, 6561748, 6375778, 6207983, 6056648, 5920103, 5797778, 5688874, 5591432, 5503863, 5426487, 5360482, 5305966, 5261960, 5227400, 5201324, 5182916, 5172290, 5170328, 5176587, 5188420, 5203841, 5224618, 5254460, 5293810, 5337972, 5381013, 5420523, 5458180, 5496959, 5538847, 5584819, 5635866, 5693708, 5760852, 5840147, 5933877, 6042588, 6164381, 6295641, 6433204]
59335F433204J43153J50601J61188J75235J92772K13213K35356K58828K84881
59326H248431L14648L47220L80782M15087M51297M89783N29864N71523O15263
59317A2363898O59801P01770P38486P69469P94353Q10837Q15908Q08198P88050
59308A9250770P56257P14009O63761O08971N52677M96527M40930L85942L32144
59299B4201988K80486K30805J80817J27523O9597P602n7916j27041j98980k71307
59289B4443574l41408m07748m69286n24852n73746o16018o51434o79081o98767
59280A9481234p11847p19672p21755p16474p03312o83755o60177o34213o05946
59271A3324083n74497n39748n03423m67818m33577l99779l66321l34724l06036
$$ y = [6433204, 6576357, 6726958, 6888146, 7063381, 7256153, 7469366, 7704722, 7963550, 8248431, 8563079, 8910299, 9291081, 9706168, 10157465, 10647248, 11177112, 11748635, 12363898, 13023699, 13725469, 14463955, 15233424, 16027777, 16838614, 17654522, 18462720, 19250770, 20007027, 20721036, 21384797, 21993768, 22546445, 23042972, 23483902, 23869844, 24201988, 24482474, 24713279, 24894096, 25021619, 25091216, 25098818, 25040902, 24913861, 24714881, 24443574, 24102166, 23694418, 23225132, 22700280, 22126534, 21510516, 20859082, 20180001, 19481234, 18769387, 18049715, 17327960, 16611486, 15908174, 15224419, 14564242, 13930029, 13324083, 12749586, 12209838, 11706415, 11238597, 10805020, 10405241, 10038920, 9704196, 9398160]
59262I398160k79242k52817k26869k02630j80576j60199j41065j23096j06032
59253G725634q9721p4673o1351m9022l6160k2189q123M733J6267K7466L9036N0483
59241G522380O0765O9816P8805Q8363R7081J02804J05273J06414J07795J08996
59231H448492J08906J07466J05275J02429R8964R5976R5171R7168J00989J05399
59221I466235J10301J16596J24753J33655J40947J44611J43863J38522J28352
59212A0647835J13814R6839P9319O0881L9459J4388j2366l8465o3323q7078j08602
59201A0742701j25866j37908j45437j49527j50333j47168j39562j28323j15400
59192I503177j02338q8968p4239n8137m1932k6676j2506L95J1395K0439K8402
$$ y = [9398160, 9118918, 8866101, 8639232, 8436602, 8256026, 8095827, 7954762, 7831666, 7725634, 7635913, 7561240, 7499889, 7450867, 7414707, 7392518, 7384395, 7389128, 7405395, 7432861, 7471897, 7522380, 7583145, 7652961, 7731766, 7820129, 7917210, 8020014, 8125287, 8231701, 8339496, 8448492, 8557398, 8664864, 8770139, 8872568, 8971532, 9067508, 9162679, 9259847, 9360836, 9466235, 9576536, 9693132, 9817885, 9951540, 10092487, 10237098, 10380961, 10519483, 10647835, 10761649, 10858488, 10937807, 10998688, 11038147, 11052535, 11040169, 11001704, 10938381, 10851303, 10742701, 10616835, 10478927, 10333490, 10183963, 10033630, 9886462, 9746900, 9618577, 9503177, 9400839, 9311871, 9237632, 9179495, 9137563, 9110887, 9098381, 9098776, 9110171, 9130610, 9159012]
59181I159012L5831M2241M7250N1553N6227O1773O8406P6474Q6081R7061J09780
59170I891689J25204J43836J65390J89862K17703K48363K79838L10459L40099
59161A1912443L68710L94586M14893M26995M28384M16380L89252L47146K91069
59152A5389858K21694J40268M9912m5154j41247k35103l22758l99999m63988n13673
59142A3679810n48886n70024n78426n76048n64529n45086n19315m89504m57997
59133H829995m26394l95216l64316l33921l05170k79209k55988k34811k15777
59124F019193j99394j84771j69925j54414j40092j28406j18461j08712r9038q9915
59114D626065q1038p2275o4687n8751n2700m4654l5658k8497k3738j8996j2132
$$ y = [9159012, 9194843, 9237084, 9284334, 9335887, 9392114, 9453887, 9522293, 9598767, 9684848, 9781909, 9891689, 10016893, 10160729, 10326119, 10515981, 10733684, 10982047, 11261885, 11572344, 11912443, 12281153, 12675739, 13090632, 13517627, 13946011, 14362391, 14751643, 15098789, 15389858, 15611552, 15751820, 15801732, 15756578, 15615331, 15380228, 15057470, 14657471, 14193483, 13679810, 13130924, 12560900, 11982474, 11406426, 10841897, 10296811, 9777496, 9287992, 8829995, 8403601, 8008385, 7644069, 7310148, 7004978, 6725769, 6469781, 6234970, 6019193, 5819799, 5635028, 5465103, 5310689, 5170597, 5042191, 4923730, 4815018, 4715980, 4626065, 4545027, 4472752, 4408065, 4349314, 4296614, 4251960, 4216302, 4187805, 4164067, 4145071, 4132939]
59103D132939l470N364J3255J9860K5368L0446L5653M0733M5195M9428N4322N9968
59091D509061O5663P1109P6542Q1793Q6266Q9890R3133R6115R8587J00752J03089
59080E472000J05174J05643J03643R9706R4915Q9776Q4018P7158O9169O0820N3193
59069F415215M6636M0527L4352K8558K4172K2121K3209K7750L4698M2021M8865
59058F788124N6428O6031P7242Q8915J01018J14033J27387J40000J51955J64279
59048G875412J77424J91152K05368K19700K32648K42509K48960K52535K52777
59039I898485K48015K36635K17531J89975J54358J12685O7152J8900l0655p8373
59029A1034708j21117j58227j90313k16547k35564k48635k58884k67156k71446
$$ y = [4132939, 4129469, 4134833, 4148088, 4167948, 4193316, 4223762, 4259415, 4300148, 4345343, 4394771, 4449093, 4509061, 4574724, 4645833, 4722375, 4804168, 4890434, 4980324, 5073457, 5169572, 5268159, 5368911, 5472000, 5577174, 5682817, 5786460, 5886166, 5981081, 6070857, 6154875, 6232033, 6301202, 6362022, 6415215, 6461851, 6502378, 6536730, 6565288, 6589460, 6611581, 6634790, 6662540, 6697238, 6739259, 6788124, 6844552, 6910583, 6987825, 7076740, 7177758, 7291791, 7419178, 7559178, 7711133, 7875412, 8052836, 8243988, 8449356, 8669056, 8901704, 9144213, 9393173, 9645708, 9898485, 10146500, 10383135, 10600666, 10790641, 10944999, 11057684, 11124836, 11143736, 11113081, 11034708, 10913591, 10755364, 10565051, 10348504, 10112940, 9864305, 9605421, 9338265, 9066819]
59020I066819k71099k68786k67133k65694k62798k58434k53621k48448k42459
59011F728347k35927k29227k21916k13690k05427j98000j90793j82690j73852
59002D876825j65336j57298j48848j39514j29962j21356j14480j09211j04391
58993C686429r8718r2195q6231q1760p7929p3252o7557o2057n7915n5460n4420
58982B878935n4177n3905n3040n1642m9910m7626m4453m0645l7038l4277l2215
58971B380007l0029k6970k3143j9466j6559j3931j0730p086m029k172j285j163
58959B223444j954l273l954l233j614q0J118K303L554M503M845M645M305M388
58945B238997N151O167O773P152Q477J1486J5182J7405J6844J4290J1877J1201
$$ y = [9066819, 8795720, 8526934, 8259801, 7994107, 7731309, 7472875, 7219254, 6970806, 6728347, 6492420, 6263193, 6041277, 5827587, 5622160, 5424160, 5233367, 5050677, 4876825, 4711489, 4554191, 4405343, 4265829, 4135867, 4014511, 3900031, 3790820, 3686429, 3587711, 3495516, 3409285, 3327525, 3249596, 3176344, 3108787, 3046730, 2988815, 2933355, 2878935, 2824758, 2770853, 2717813, 2666171, 2616261, 2568635, 2524182, 2483537, 2446499, 2412222, 2380007, 2349978, 2323008, 2299865, 2280399, 2263840, 2249909, 2239179, 2232093, 2228064, 2225892, 2224607, 2223444, 2221490, 2218217, 2214263, 2211030, 2209416, 2209336, 2210454, 2212757, 2216311, 2220814, 2225659, 2230304, 2234609, 2238997, 2244148, 2250315, 2257088, 2264240, 2272717, 2284203, 2299385, 2316790, 2333634, 2347924, 2359801, 2371002]
58933B371002J2248J4154J6462J9114K1430K2122K0952J9609K0074K2441K5005
58922B584613K6259K6109K5383K4928K5188K6070K7232K8701L0906L3711L6100
58911B895200L7442L8480M0189M2238M3632M4479M5886M8200N0624N2641N4698
58900C393709N7159N9647O1685O3458O5369O7483O9633P1748P3915P6326P9101
58889D139233Q2079Q5129Q8730R3695J00069J07124J14748J23740J34032J44002
58879E212581J52707J61612J72635J85428J98317K11024K24585K39168K54099
58870G012156K69859K87935L08559L30451L53024L77137M03448M31595M61321
58861A0235485M92928N26310N60937N96986O35128O75123P15961P57265P98933
$$ y = [2371002, 2383250, 2397404, 2413866, 2432980, 2454410, 2476532, 2497484, 2517093, 2537167, 2559608, 2584613, 2610872, 2636981, 2662364, 2687292, 2712480, 2738550, 2765782, 2794483, 2825389, 2859100, 2895200, 2932642, 2971122, 3011311, 3053549, 3097181, 3141660, 3187546, 3235746, 3286370, 3339011, 3393709, 3450868, 3510515, 3572200, 3635658, 3701027, 3768510, 3838143, 3909891, 3983806, 4060132, 4139233, 4221312, 4306441, 4395171, 4488866, 4588935, 4696059, 4810807, 4934547, 5068579, 5212581, 5365288, 5526900, 5699535, 5884963, 6083280, 6294304, 6518889, 6758057, 7012156, 7282015, 7569950, 7878509, 8208960, 8561984, 8939121, 9342569, 9774164, 10235485, 10728413, 11254723, 11815660, 12412646, 13047774, 13722897, 14438858, 15196123, 15995056]
58852A5995056Q39578Q77134R10896R40843R64793R78423R78339R62943R29853
58843B4377858Q75194P96594O94869N71892M29318K70906J03911o3849k26915
58834B7829778l80972n20708o40976p39119q14642q67910r00725r16759r19378
58825B1128589r09745q88517q58311q22727p83823p42456p00242o59092o19210
58816A4144466n79647n40956n05454m74637m47822m23537m00808l78812l56764
58807A0036029l34957l14795k96896k79918k62043k43233k24940k07854j91009
58798G680384j73707j57248j43540j32173j20438j06685r2283p9319o7703n5987
58788F551301m3919l2256k0753q440M211J5608K5649L6081M7876O0192P2462Q5589
$$ y = [15995056, 16834634, 17711768, 18622664, 19563507, 20528300, 21506723, 22485062, 23448005, 24377858, 25253052, 26049646, 26744515, 27316407, 27745725, 28016631, 28120542, 28056693, 27829778, 27448806, 26928098, 26287122, 25548003, 24733361, 23865451, 22964726, 22047967, 21128589, 20218844, 19330327, 18472016, 17649289, 16865466, 16123010, 15422768, 14763676, 14144466, 13564819, 13023863, 12518409, 12043772, 11595950, 11172413, 10771605, 10392793, 10036029, 9701072, 9386277, 9089381, 8809463, 8547420, 8304187, 8079247, 7871393, 7680384, 7506677, 7349429, 7205889, 7073716, 6953278, 6846593, 6754310, 6674991, 6607288, 6551301, 6507382, 6475126, 6454373, 6445933, 6450144, 6465752, 6491401, 6527482, 6575358, 6635550, 6708012, 6793601]
58776F793601J00089J14740J28125J40365J52625J65969J81169J98350K16438
58767H191471K34345K52817K73515K96272L19316L42530L67876L95945M24847
58758A1098934M53835M85218N20825N59017N97510O37012O79347P23617P66957
58749A6522272Q07993Q46643Q81160R07996R24533R29632R21306Q95725Q49009
58740B4486269P78940O85122N68757M32612K80609J17673m9766k14234l69198
58731B6716784n10142o33604p36768q18840q81111r24337r47745r52070r41796
58722A9370371r22186q95566q62575q25489p87357p48669p07923o65479o24307
58713A2330820n86623n52021n19318m88345m59447m32734m08299l85948l64633
$$ y = [6793601, 6893690, 7008430, 7136555, 7276920, 7429545, 7595514, 7776683, 7975033, 8191471, 8425816, 8678633, 8952148, 9248420, 9567736, 9910266, 10278142, 10674087, 11098934, 11552769, 12037987, 12558812, 13117829, 13715339, 14352351, 15031698, 15755315, 16522272, 17330265, 18176908, 19058068, 19966064, 20890597, 21820229, 22741535, 23637260, 24486269, 25265209, 25950331, 26519088, 26951700, 27232309, 27349982, 27300216, 27085982, 26716784, 26206642, 25573038, 24836270, 24017430, 23136319, 22211982, 21264237, 20312167, 19370371, 18448185, 17552619, 16690044, 15864555, 15077198, 14328529, 13620606, 12955127, 12330820, 11744197, 11192176, 10672858, 10184513, 9725066, 9292332, 8884033, 8498085, 8133452]
58704H133452l43336l22489l03366k86168k69910k53920k38158k22440k06797
58695E686868j92339j80180j69553j58512j46394j34305j23293j13679j06064
58686D362549j01098r7833r3827q7667q0438p4193o9824o6820o4277o1729n9266
58675C505577n7093n4920n2304m9741m8475m8659m8728m7557m6047m5434m5190
58664B961429m4285m3513m4481m6847m8568m8898m9127n0270n1636n1978n0725
58653B431101m7986m4640m2409m2455m3679m3583m0995l6917l2923k9992k8729
58642A996793k9142k9923k9253k6788k3920k1963k1043k0808k1138k1801k2274
58631A728740k2159k1382j9916j7859j5590j3437j1418r653q391p270n445l049
$$ y = [8133452, 7790116, 7467627, 7164261, 6878093, 6608183, 6354263, 6116105, 5893665, 5686868, 5494529, 5314349, 5144796, 4986284, 4839890, 4705585, 4582292, 4468613, 4362549, 4261451, 4163618, 4069791, 3982124, 3901686, 3827493, 3757669, 3690849, 3626572, 3564843, 3505577, 3448484, 3393564, 3341260, 3291519, 3243044, 3194385, 3145657, 3098100, 3052053, 3006619, 2961429, 2917144, 2873631, 2829150, 2782303, 2733735, 2684837, 2635710, 2585440, 2533804, 2481826, 2431101, 2383115, 2338475, 2296066, 2253611, 2209932, 2166349, 2125354, 2088437, 2055514, 2025522, 1996793, 1967651, 1937728, 1908475, 1881687, 1857767, 1835804, 1814761, 1793953, 1772815, 1751014, 1728740, 1706581, 1685199, 1665283, 1647424, 1631834, 1618397, 1606979, 1597326, 1588935, 1581665, 1576220, 1573171]
58619A573171j385r67n67Q06K343L048L458M247M506L227J150o42k672n415p160
58604A577148o100l588k462k950l216l296n039p996q851n896j340J918L479M491
58590A536302N634P250R687J2477J4563J5913J7599J9948K2230K4398K7339L1106
58578A744446L4695L7858M1291M4748M7174M9069N2386N7377O1840O4583O7424
58567B302891P2512P9577Q7188R4952J03101J11403J19931J29706J41345J54093
58557C396699J67151J80721J94967K09213K23165K37369K51411K63111K70788
58548E394595K74917K76124K72722K61835K42112K13770J76868J31368P8965K3429
58538G346705l1249q2386j28394j67889j99478k22464k37566k46461k50138k48217
$$ y = [1573171, 1571786, 1570819, 1570252, 1571058, 1573401, 1576449, 1579907, 1584154, 1588660, 1591887, 1593037, 1592395, 1589723, 1584308, 1577148, 1571048, 1567460, 1564998, 1562048, 1558832, 1555536, 1550497, 1542501, 1533650, 1527754, 1526414, 1528332, 1531811, 1536302, 1541936, 1549186, 1558873, 1571350, 1585913, 1601826, 1619425, 1639373, 1661603, 1686001, 1713340, 1744446, 1779141, 1816999, 1858290, 1903038, 1950212, 1999281, 2051667, 2109044, 2170884, 2235467, 2302891, 2375403, 2454980, 2542168, 2637120, 2740221, 2851624, 2971555, 3101261, 3242606, 3396699, 3563850, 3744571, 3939538, 4148751, 4371916, 4609285, 4860696, 5123807, 5394595, 5669512, 5945636, 6218358, 6480193, 6722305, 6936075, 7112943, 7244311, 7323276, 7346705, 7315456, 7233070, 7104676, 6936787, 6737309, 6514845, 6277279, 6030818, 5780680, 5532463]
58528E532463k40613k29274k17024k04961j92366j79040j65971j53489j40564
58519C809161j26760j13461j02264r3213q5396p8365p2225o7121o3231o0617n8769
58508B887739n6854n4671n2634n0804m8882m7128m6211m5960m5413m4331m3530
58497B351321m3529m3884m4103m4189m4142m3902m3852m4255m4188m2319l8775
58486A874183l5095l2300l0195k8460k7046k5572k3837k2695k2906k3268k1824
58475A580985j8901j6830j6491j6343j5409j4861j5559j6135j4918j2381j0346
58464A412811r853j0700j2068j2764j1897j0005q618q262p956p072o374o641p387
58451A293214p637p064n952m833m385m839n452n496n445o071o841o686n979n980
$$ y = [5532463, 5291850, 5062576, 4845552, 4640591, 4448225, 4269185, 4103214, 3949725, 3809161, 3682401, 3568940, 3466676, 3373463, 3288067, 3209702, 3137477, 3070356, 3007125, 2946508, 2887739, 2830885, 2776214, 2723580, 2672776, 2623894, 2576766, 2530555, 2484595, 2439182, 2394851, 2351321, 2307792, 2263908, 2219805, 2175616, 2131474, 2087572, 2043720, 1999465, 1955277, 1912958, 1874183, 1839088, 1806788, 1776593, 1748133, 1721087, 1695515, 1671678, 1648983, 1626077, 1602809, 1580985, 1562084, 1545254, 1528763, 1512420, 1497011, 1482150, 1466591, 1450456, 1435538, 1423157, 1412811, 1402958, 1392258, 1380190, 1367426, 1355529, 1345524, 1336906, 1328644, 1320688, 1313616, 1307242, 1300601, 1293214, 1285577, 1278513, 1272561, 1267728, 1263343, 1258504, 1253052, 1247556, 1242111, 1236040, 1229199, 1222513, 1216534, 1210554]
58437A210554o613o662o009n737o068o142n836n789n776n107m420m801n385m412
58423A131797k522k103l342l924l014k283k419j935m40K28o44j280r43j558m046
58408A101572o135n954n128n786o906o177l730j493k13O73J390J873K470L236
58394A069692L551L548M396O154P056O123M743M397M487L813K561J523Q16M94
58380A123354R54J754J618L51r73k208m258o511o909n455m817o103o989n681l846
58365A074281l548m047l828l497m071m422k912j00K187L357L979M526N367O528
58351A073800O860N302L476M316P482R296Q291P290Q414R801R499Q994J0123J1640
58337A184584J1742J1175J1104J0577Q939P927Q637R110P858O852P891Q915P444
$$ y = [1210554, 1203941, 1197279, 1191270, 1185533, 1179465, 1173323, 1167487, 1161698, 1155922, 1150815, 1146395, 1141594, 1136209, 1131797, 1129275, 1127172, 1123830, 1119906, 1116892, 1114609, 1112190, 1110255, 1109815, 1110043, 1109399, 1108119, 1107176, 1105618, 1101572, 1095437, 1089483, 1084355, 1078569, 1071663, 1065486, 1061756, 1060263, 1060050, 1060723, 1062113, 1063986, 1066456, 1069692, 1073243, 1076791, 1081187, 1087341, 1094397, 1100520, 1105263, 1109660, 1114147, 1117960, 1120521, 1122044, 1122860, 1123354, 1124308, 1126062, 1127680, 1128031, 1127058, 1124850, 1120592, 1114081, 1107172, 1101717, 1096900, 1090797, 1083808, 1078127, 1074281, 1070733, 1066686, 1062858, 1059361, 1055290, 1050868, 1047956, 1047856, 1050043, 1053400, 1057379, 1061905, 1067272, 1073800, 1080660, 1085962, 1089438, 1093754, 1101236, 1110532, 1118823, 1126113, 1134527, 1144328, 1153827, 1162821, 1172944, 1184584, 1196326, 1207501, 1218605, 1229182, 1238121, 1246048, 1254685, 1263795, 1271653, 1278505, 1286396, 1295311, 1302755]
58324A302755N082M810O106O455N838N952O509N987M721M165M284M452N385P450
58310A379951Q789P824N928N172N400N910P617J0750J2990J2798J2028J2219J1295
58297A498671P493L601L167M971N443M370L956M299M114M175N791P415O856N335
58283A569657N443O642O779O304P016Q235Q319Q383J0474J3592J5394J6244J7741
58270A700223J9149J9199J9372K1227K2672K1329J9308J9868K1636K1320K0043
58259A925346K1347K4441K5304K3592K2860K4431K6188K7065K7876K8241K7196
58248B203887K6305K7689K9901L0132K9335L0548L3377L4997L5436L6984L9391
58237B557982M0593M1155M3320M6666M9298N1903N6027O0043O1653O2372O4579
$$ y = [1302755, 1307837, 1312647, 1318753, 1325208, 1331046, 1336998, 1343507, 1349494, 1354215, 1358380, 1362664, 1367116, 1372501, 1379951, 1388740, 1396564, 1402492, 1407664, 1413064, 1418974, 1426591, 1437341, 1450331, 1463129, 1475157, 1487376, 1498671, 1506164, 1509765, 1512932, 1517903, 1523346, 1527716, 1531672, 1535971, 1540085, 1544260, 1550051, 1557466, 1564322, 1569657, 1575100, 1581742, 1588521, 1594825, 1601841, 1610076, 1618395, 1626778, 1637252, 1650844, 1666238, 1682482, 1700223, 1719372, 1738571, 1757943, 1779170, 1801842, 1823171, 1842479, 1862347, 1883983, 1905303, 1925346, 1946693, 1971134, 1996438, 2020030, 2042890, 2067321, 2093509, 2120574, 2148450, 2176691, 2203887, 2230192, 2257881, 2287782, 2317914, 2347249, 2377797, 2411174, 2446171, 2481607, 2518591, 2557982, 2598575, 2639730, 2683050, 2729716, 2779014, 2830917, 2886944, 2946987, 3008640, 3071012, 3135591]
58226C135591O6409O5159O3372O5397P0118P3496P6221Q1914Q9484R4549R7418
58215C979128J02702J11650J21345J30595J40244J48790J54128J58384J64767
58206E211733J71305J74108J74566J76436J78468J77567J76613J80638J87591
58197F809025J91693J93828J99517K08540K16032K22134K30745K40324K46013
58188H757851K49486K56489K66155K73272K79664K92137L10433L28604L46983
58179A1361074L70764L98031M21916M43817M71357N03831N33131N58896N88897
58170A5651714O24542O60164O96831P42242P96685Q53588R13827R84277J062835
58161B2986705J141101J220898J311006J409001J505603J605759J724780J864818
$$ y = [3135591, 3202000, 3267159, 3330531, 3395928, 3466046, 3539542, 3615763, 3697677, 3787161, 3881710, 3979128, 4081830, 4193480, 4314825, 4445420, 4585664, 4734454, 4888582, 5046966, 5211733, 5383038, 5557146, 5731712, 5908148, 6086616, 6264183, 6440796, 6621434, 6809025, 7000718, 7194546, 7394063, 7602603, 7818635, 8040769, 8271514, 8511838, 8757851, 9007337, 9263826, 9529981, 9803253, 10082917, 10375054, 10685487, 11014091, 11361074, 11731838, 12129869, 12551785, 12995602, 13466959, 13970790, 14503921, 15062817, 15651714, 16276256, 16936420, 17633251, 18375493, 19172178, 20025766, 20939593, 21923870, 22986705, 24127806, 25348704, 26659710, 28068711, 29574314, 31180073, 32904853, 34769671]
58153C4769671K017353K187298K389036K618691K858109L108122L389637L710316
58145E7048233M061245M448564M894748N406286N977640O630303P406749Q322845
58137A04196613R373347J0587209J2021436J3693511J5575845J7644636J9848428
58130B02941025K2059852K4225657K6553458K9197718L1449325L1427784K7123568
58123C94978387J8092883O099586n981179j5860154k2633987k6460967k7932777
58116C20301792k7726950k6463186k4595750k2402220k0079584j7792893j5629199
58109A65612010j3592539j1684952r943391q381300o956669n628636m399965l288432
58101A01736126k323256j610195j334341j613124k343802l238427m014734m540935
$$ y = [34769671, 36787024, 38974322, 41363358, 43982049, 46840158, 49948280, 53337917, 57048233, 61109478, 65558042, 70452790, 75859076, 81836716, 88467019, 95873768, 104196613, 113569960, 124157169, 136178605, 149872116, 165447961, 183092597, 202941025, 225000877, 249226534, 275779992, 304977710, 336427035, 367854819, 394978387, 413071270, 419170856, 413189677, 397329523, 374695536, 348234569, 320301792, 292574842, 266111656, 241515906, 219113686, 199034102, 181241209, 165612010, 152019471, 140334519, 130391128, 122009828, 115053159, 109424523, 105024558, 101736126, 99412870, 97802675, 96468334, 94855210, 92511408, 89272981, 85258247, 80717312]
58093H0717312m827625m939215m929898m828853m649865m405336m113416l793816
58085D4229288l461489l127951k804762k501790k225341j980473j770628j592928
58077B4763926j439167j303929j187064j087605j001965r29546q72783q29187
58069A6112680p90163p50196p10973o74468o38735o02768n68779n36964n04081
58060A0335553m69581m37313m09306l83757l60692l43218l31194l19895l06903
58051F973694k94312k82650k69174k54011k41359k32257k22542k10150j98111
58042D769128j88099j77598j66019j57080j51892j46034j36798j27456j20798
58033C397354j14234j05140r5905q9600q5193q0819p7512p6044p4126p0175o6129
$$ y = [80717312, 75889687, 70950472, 66020574, 61191721, 56541856, 52136520, 48023104, 44229288, 40767799, 37639848, 34835086, 32333296, 30107955, 28127482, 26356854, 24763926, 23324759, 22020830, 20833766, 19746161, 18744196, 17814650, 16941867, 16112680, 15322517, 14572321, 13861348, 13186880, 12548145, 11945377, 11376598, 10839634, 10335553, 9865972, 9428659, 9019353, 8635596, 8274904, 7931686, 7600492, 7280597, 6973694, 6679382, 6396732, 6127558, 5873547, 5632188, 5399931, 5177389, 4967239, 4769128, 4581029, 4403431, 4237412, 4080332, 3928440, 3782406, 3645608, 3518152, 3397354, 3283120, 3177980, 3082075, 2992475, 2907282, 2826463, 2748951, 2672907, 2598781, 2528606, 2462477]
58022B462477o3473o0291n5413n1453n0425m9969m7313m3668m1341l9682l7183
58011A922266l4732l3505l2221k9595k7242k7129k8171k8008k6413k4601k2856
58000A607793k0951j9417j8643j8131j7645j7485j6954j4829j1973j0927j2032
57989A428806j2697j1404r616q843q665q686r424j0222r273o905n839o946p743
57976A312543o363l992k051o2K145L041J794l58k378m571o672p603p953r624j2239
57961A255657j3141j1793j0728j1092j1073r884r415j0360j0595r258q464r185
57949A130669r352q230q536j1582j4213j3529j1095r445p989n686m314n303o270
57936A015125m603j989j569k820l199k991m453p280q685p361m399r95K016L278
$$ y = [2462477, 2399004, 2338713, 2283300, 2231847, 2181422, 2131453, 2084140, 2040472, 1999131, 1959449, 1922266, 1887534, 1854029, 1821808, 1792213, 1764971, 1737842, 1709671, 1681663, 1655250, 1630649, 1607793, 1586842, 1567425, 1548782, 1530651, 1513006, 1495521, 1478567, 1463738, 1451765, 1440838, 1428806, 1416109, 1404705, 1395089, 1386246, 1377581, 1368895, 1359471, 1349249, 1339976, 1333071, 1327232, 1320286, 1312543, 1306180, 1302188, 1300137, 1300075, 1302220, 1305261, 1307055, 1306697, 1304319, 1299748, 1293076, 1285473, 1277520, 1267896, 1255657, 1242516, 1230723, 1219995, 1208903, 1197830, 1187946, 1178531, 1168171, 1157576, 1148318, 1139854, 1130669, 1121317, 1113087, 1104551, 1092969, 1078756, 1065227, 1054132, 1044687, 1036698, 1031012, 1026698, 1021395, 1015125, 1010522, 1008533, 1006964, 1004144, 1000945, 997954, 993501, 986221, 977536, 970175, 965776, 964781, 966797, 970075]
57922I70075K299R55J308K596K561Q29j178k780m277n444n763n544n296m838m240
57907I41263m509n905p070p088o929p410p495o184m326l021k043j393k213m392
57893H71285n557m518l348l721l690j010K599L852K753J746J449P49kN75J773
57878H64935J441m74j924k168k426l194l513l125l072l799m584n009n490o225
57864H21373o911p246o746m786j912L4L84Q33K598M071L402J860K003L719M813
57849H17489M648M513M913N231N582O498P031N709L107J147J73q69j770j347k69
57834H61786p97l429o288q106r362j0121r377p340o030o512p455p393o732o431
57820G66413o193n101l063p60J110K045J960J561J882L257N189O985P943P561
$$ y = [970075, 972374, 973329, 974637, 977233, 979794, 980623, 979445, 976665, 972388, 966944, 961181, 955637, 950341, 945503, 941263, 936754, 930849, 923779, 916691, 909762, 902352, 894857, 888673, 884347, 881326, 879283, 877890, 875677, 871285, 865728, 861210, 857862, 854141, 850451, 849441, 852040, 855892, 858645, 860391, 861840, 862589, 862587, 863162, 864935, 866376, 865902, 863978, 861810, 859384, 856190, 852677, 849552, 846480, 842681, 838097, 833088, 827598, 821373, 814462, 807216, 800470, 795684, 793772, 793806, 794190, 795023, 797621, 801692, 805094, 806954, 808957, 812676, 817489, 822137, 826650, 831563, 836794, 842376, 848874, 855905, 861614, 864721, 865868, 866041, 865172, 863402, 862055, 861786, 860989, 857560, 851272, 843166, 833804, 823683, 814306, 806966, 800936, 794424, 786969, 779576, 772844, 766413, 760220, 755119, 752056, 751296, 752406, 754451, 756411, 757972, 759854, 763111, 768300, 775285, 783228, 790789]
57806G90789O400O015O780O736M176N84r32K90K088K873L140L413K954J215j087
57791H35434l199n289p510r287j0091j0138r908r743r916j0351j0413r760q987
57778G20842q506p500n348l443l741n831p327p132o405o226o215n933n899o518
57764F34818p361q081q866r584r592q774p783p003o287n729n554n221l910j962
57750E39111o35l69m38l34j75K35J370K990M383N492O531O843N796M479M550N529
57734E85358N382L856K935L526M118L550K824K989L267K710K021K075K093Q82
57720F27586j056k254k411k512l347m866o550p692p839p443p396p548o690m494
57706E55488k235r50J5J661L611M705M539L565K430J968K949N053O782P224P112
$$ y = [790789, 797189, 803204, 809984, 816720, 820896, 821480, 820548, 820838, 822926, 825799, 828939, 832352, 835306, 836521, 835434, 832235, 826946, 819436, 810149, 800058, 789920, 780012, 770269, 760353, 750002, 739589, 729829, 720842, 712336, 704836, 699488, 696045, 692304, 686473, 679146, 672014, 665609, 659383, 653168, 647235, 641336, 634818, 627457, 619376, 610510, 600926, 591334, 582560, 574777, 567774, 561487, 555758, 550204, 544983, 541073, 539111, 538476, 538107, 537669, 537335, 537160, 537395, 538765, 541755, 546138, 551630, 558161, 565004, 570800, 575279, 579829, 585358, 590740, 594596, 597531, 601057, 605175, 608725, 611549, 614538, 617805, 620515, 622536, 624611, 626704, 627586, 626530, 624276, 621865, 619353, 616006, 611140, 604590, 596898, 589059, 581616, 574220, 566672, 559982, 555488, 553253, 552303, 552318, 553979, 557590, 562295, 566834, 570399, 572829, 574797, 577746, 582799, 589581, 596805, 603917]
57691F03917P510Q314Q838Q935Q687P882O752O394P354Q535Q536P462O404N814
57677G11334N535N904P391R328J0163R177P198N644N457O743Q768J0328J0792
57664H13762J0812J1543J3312J5381J6825J7348J7375J7677J8721K0152K1208
57653I94116K1812K2769K4614K6787K8345K9063K9494L0424L2468L5771L9666
57642A315329M3077M5653M8160N1582N6211O1816O7936P3800P8621Q2564Q6909
57631B011658R2829J00368J08945J18333J28771J40442J53137J66173J78707J90634
57621C389997K03038K16947K31526K44318K53283K57697K57051K50462K37496
57612E541815K18556J94122J64966J33196J00987O7001K5912k6313q6860j46901
$$ y = [603917, 611427, 619741, 628579, 637514, 646201, 654083, 660835, 667229, 674583, 683118, 691654, 699116, 705520, 711334, 716869, 722773, 730164, 739492, 749655, 758832, 766030, 771674, 777131, 783874, 792642, 802970, 813762, 824574, 836117, 849429, 864810, 881635, 898983, 916358, 934035, 952756, 972908, 994116, 1015928, 1038697, 1063311, 1090098, 1118443, 1147506, 1177000, 1207424, 1239892, 1275663, 1315329, 1358406, 1404059, 1452219, 1503801, 1560012, 1621828, 1689764, 1763564, 1842185, 1924749, 2011658, 2104487, 2204855, 2313800, 2432133, 2560904, 2701346, 2854483, 3020656, 3199363, 3389997, 3593035, 3809982, 4041508, 4285826, 4539109, 4796806, 5053857, 5304319, 5541815, 5760371, 5954493, 6119459, 6252655, 6353642, 6420643, 6446555, 6420242, 6333382, 6186481]
57602F186481j97433k33622k54853k63100k61638k53823k41985k27303k10516
57593D042208j92407j73885j55924j39097j23084j07376r2676q0535p1126o2573
57583B843525n3295m3872l5555k8048k0150j1738l697L580J0397J6939K3490L0897
57571B732473L9498M8198N5917O3527P2791Q3779R4892J05308J15801J27075J38748
57560C678007J50059J60209J67867J71640J71243J66970J58112J43198J21927
57551E089232R5249O3643K7230j1816m9101q1581j09787j35224j56849j72063
57541D558933j80451j84482j86311j85526j80786j72580j63219j54426j46021
57532C005131j37320j28806j21374j14296j05561r4847q4850p8306p4565p0550
$$ y = [6186481, 5989048, 5755426, 5500573, 5237473, 4975835, 4722012, 4480027, 4252724, 4042208, 3849801, 3675916, 3519992, 3380895, 3257811, 3150435, 3057759, 2977224, 2906098, 2843525, 2790230, 2746358, 2710803, 2682755, 2662605, 2650867, 2647170, 2650750, 2661147, 2678086, 2701576, 2732473, 2771971, 2820169, 2876086, 2939613, 3012404, 3096183, 3191075, 3296383, 3412184, 3539259, 3678007, 3828066, 3988275, 4156142, 4327782, 4499025, 4665995, 4824107, 4967305, 5089232, 5184481, 5248124, 5275354, 5263538, 5214437, 5132856, 5023069, 4887845, 4730996, 4558933, 4378482, 4194000, 4007689, 3822163, 3641377, 3468797, 3305578, 3151152, 3005131, 2867811, 2739005, 2617631, 2503335, 2397774, 2302927, 2218077, 2139771, 2065206, 1994656]
57522A994656o4657n8094n2488m7928m3816m0104l6986l4396l2449l1418l0757
57511A521563k9134k6084k2637j9723j6965j3923j1518j0974j1765j1794r616
57500A337430n769j939O36J974K970M338N995P678R789J2864J6279J8645J9796
57487A430686K1268K4223K7964L1376L4761L9007M3616M7005M8714N0074N2584
57476A851278N6479O1165O6257P1845P8166Q5279R2859J00231J06826J12615J17981
57465B800981J23180J28025J31885J33973J33842J31336J25666J14877R7356P3944
57455C995065M7480J9920q727l7946o4742q5835j01040j12740j22275j28497j30015
57444C270648j27341j22270j16243j09939j03635r7230r0316q2702p4765o7166
$$ y = [1994656, 1929999, 1871905, 1819417, 1771489, 1727673, 1687569, 1650583, 1616187, 1583738, 1552320, 1521563, 1492429, 1466345, 1443708, 1423985, 1407020, 1393097, 1381579, 1370605, 1358840, 1347046, 1337430, 1331661, 1329722, 1330358, 1332332, 1335302, 1339640, 1345635, 1353313, 1363102, 1375966, 1392245, 1410890, 1430686, 1451954, 1476177, 1504141, 1535517, 1570278, 1609285, 1652901, 1699906, 1748620, 1798694, 1851278, 1907757, 1968922, 2035179, 2107024, 2185190, 2270469, 2363328, 2463559, 2570385, 2683000, 2800981, 2924161, 3052186, 3184071, 3318044, 3451886, 3583222, 3708888, 3823765, 3921121, 3995065, 4042545, 4062465, 4053738, 4015792, 3951050, 3865215, 3764175, 3651435, 3529160, 3400663, 3270648, 3143307, 3021037, 2904794, 2794855, 2691220, 2593990, 2503674, 2420972, 2346207, 2279041]
57434B279041o0374n4336m8248m1040l2709k4932j9482j6084j2775q435l975n03
57422A956148K567O728J2241J7868K2677K7324L3101M0000M6466N1304N5393O0810
57410B332627O8292P6441Q3720R0205R6687J03064J08785J14020J18754J21159
57400C313754J18834J11702J01882R0128P4319N2509K5904k566l1231n9534q5891
57389C709810j07798j24034j35235j42197j45103j44597j42189j38898j34427
57380B495332j28262j20713j12416j03664r4897q7040q0530p4725o9105o4385
57370A559595o1152n8005n2813m5971m0581l8513l7838l5634l2119l0036l0362
57359A096571l0846k9298k6340k3817k1914j9431j6145j3389j2253j2291j2174
$$ y = [2279041, 2218667, 2164331, 2116083, 2075043, 2042334, 2017402, 1997920, 1981836, 1969061, 1960626, 1956651, 1956148, 1958715, 1965443, 1977684, 1995552, 2018229, 2045553, 2078654, 2118654, 2165120, 2216424, 2271817, 2332627, 2400919, 2477360, 2561080, 2651285, 2747972, 2851036, 2959821, 3073841, 3192595, 3313754, 3432588, 3544290, 3646172, 3736300, 3810619, 3863128, 3889032, 3886466, 3855235, 3795701, 3709810, 3602012, 3477978, 3342743, 3200546, 3055443, 2910846, 2768657, 2629759, 2495332, 2367070, 2246357, 2133941, 2030277, 1935380, 1848340, 1767810, 1693085, 1623980, 1559595, 1498443, 1440438, 1387625, 1341654, 1301073, 1262560, 1224722, 1189088, 1156969, 1126933, 1096571, 1065725, 1036427, 1010087, 986270, 964356, 944925, 928780, 915391, 903138, 890847, 878673]
57348H78673j1087r500q776r648j0874j0184p139m149l709n427o924o973o205
57335G78078n265m008k616j861j862j856j477j180j154r48l68L60J330K578L077
57320G62828J760k96o49J132K905L344L586M386M150J866j66Q71M141O468P021
57305H03347P779R650J1038J0740R930J0232J1686J3487J5303J6844J7388J6701
57293I54125J5658J5118J4862J4184J2862J1011Q755O728O019O851P800P291N699
57280A086963N146P030J0345J2792J3238J2598J2316J2632J2903J3099J3889J5118
57268A228069J5451J4194J2540J2087J2815J3528J3696J3717J3817J3900J4304
57257A378118J5452J6723J6910J5841J4559J3766J3232J3001J3949J6464J9464
$$ y = [878673, 867586, 858086, 849310, 839662, 828788, 818604, 811465, 807316, 803607, 798180, 791256, 784283, 778078, 772813, 768805, 766189, 764328, 762466, 760610, 759133, 757953, 756799, 755851, 755483, 755843, 757173, 759751, 762828, 764588, 764292, 763643, 764775, 767680, 771024, 774610, 778996, 783146, 785012, 784846, 785717, 789858, 796326, 803347, 811126, 820776, 831814, 842554, 852484, 862716, 874402, 887889, 903192, 920036, 937424, 954125, 969783, 984901, 999763, 1013947, 1026809, 1037820, 1046575, 1053303, 1059322, 1066173, 1073973, 1081264, 1086963, 1092109, 1099139, 1109484, 1122276, 1135514, 1148112, 1160428, 1173060, 1185963, 1199062, 1212951, 1228069, 1243520, 1257714, 1270254, 1282341, 1295156, 1308684, 1322380, 1336097, 1349914, 1363814, 1378118, 1393570, 1410293, 1427203, 1443044, 1457603, 1471369, 1484601, 1497602, 1511551, 1528015, 1547479]
57246A547479K1403K1845K1471K1001K0595K0172J9935K0496K2358K5090K7339
57235A789184K8181K8212K8689K9800L0619L0746L1019L2245L3984L5120L5214
57224B133013L4862L4882L5476L6069L5827L4276L1504K7901K4065K0777J8491
57213B467143J6651J4148J0767P488N029K881M46j734k775k742k225j157Q38L245
57199B518003M971N739O456Q164J1089J4391J6448J6116J4322J3506J4704J6118
57187B660027J5678J3970J3137J3798J4822J5706J7329K0269K3839K7127K9916
57176B865618L2533L5406L8521M0800M0936L9610L9606M2366M5794M7231M7325
57165C315746M8607N1358N3635N4941N6929O0349O3929O6798O9766P3623P8056
$$ y = [1547479, 1568882, 1590727, 1612198, 1633199, 1653794, 1673966, 1693901, 1714397, 1736755, 1761845, 1789184, 1817365, 1845577, 1874266, 1904066, 1934685, 1965431, 1996450, 2028695, 2062679, 2097799, 2133013, 2167875, 2202757, 2238233, 2274302, 2310129, 2344405, 2375909, 2403810, 2427875, 2448652, 2467143, 2483794, 2497942, 2508709, 2516197, 2521226, 2524107, 2524553, 2522819, 2520044, 2517302, 2515077, 2513920, 2514758, 2518003, 2522974, 2528713, 2535169, 2543333, 2554422, 2568813, 2585261, 2601377, 2615699, 2629205, 2643909, 2660027, 2675705, 2689675, 2702812, 2716610, 2731432, 2747138, 2764467, 2784736, 2808575, 2835702, 2865618, 2898151, 2933557, 2972078, 3012878, 3053814, 3093424, 3133030, 3175396, 3221190, 3268421, 3315746, 3364353, 3415711, 3469346, 3524287, 3581216, 3641565, 3705494, 3772292, 3842058, 3915681, 3993737]
57154C993737Q2644Q7012Q9709Q8815Q4238P7938P1779O6639O3215O1750O1086
57143D828562O0086N9850O2411O7375P2274P6001P9383Q2397Q3731Q3457Q3476
57132E639003Q4703Q6171Q7161Q7745Q7211Q4670Q1386P9514P8402P5305P0025
57121F541296O5432O3000O1561O1085O3641O9413P5646Q0992Q7166R4849J01946
57110G366027J07654J14352J23245J31926J38486J44246J49698J51386J45928
57101H572948J34170J18705J00173P8787N6617L5587J5649k858j7917k9008l8459
57090I024394m7382n3551n5587n5892n7095n9391o3557p2253q5266r7702j06357
57079H270361j13778j22805j31463j37135j41364j46318j50700j53638j58630
$$ y = [3993737, 4076381, 4163393, 4253102, 4341917, 4426155, 4504093, 4575872, 4642511, 4705726, 4767476, 4828562, 4888648, 4948498, 5010909, 5078284, 5150558, 5226559, 5305942, 5388339, 5472070, 5555527, 5639003, 5723706, 5809877, 5897038, 5984783, 6071994, 6156664, 6238050, 6317564, 6395966, 6471271, 6541296, 6606728, 6669728, 6731289, 6792374, 6856015, 6925428, 7001074, 7082066, 7169232, 7264081, 7366027, 7473681, 7588033, 7711278, 7843204, 7981690, 8125936, 8275634, 8427020, 8572948, 8707118, 8825823, 8925996, 9004783, 9061400, 9096987, 9112636, 9109778, 9091861, 9062853, 9024394, 8977012, 8923461, 8867874, 8811982, 8754887, 8695496, 8631939, 8559686, 8474420, 8376718, 8270361, 8156583, 8033778, 7902315, 7765180, 7623816, 7477498, 7326798, 7173160, 7014530]
57070G014530j69124j84055k01763k23896k50752k77569l00633l22670l47021
57061D737047l71287l92364m13005m37221m63759m90256n19296n54177E02102
57051a34624o88503p52841q26774r07430r98210j100722j208435j316978j433003
57042i367520j564169j709691j871207k062228k294044k562912k865156l213013
57034b7509940l619432m079586m583241n127479n697100o256486o785018p275974
57026g0934256p643525p684913p269495o597979o143022o207109o564244o623083
57018a25667626n934688m485016k541846l56774J933531M219505O350614Q159690
57010a18322610R507054J0302392J0523918J0231448R548590Q625973P614918
$$ y = [7014530, 6845406, 6661351, 6459588, 6235692, 5984940, 5707371, 5406738, 5084068, 4737047, 4365760, 3973396, 3560391, 3123170, 2659411, 2169155, 1649859, 1095682, 502102, -134624, -823127, -1575968, -2402742, -3310172, -4308382, -5409104, -6617539, -7934517, -9367520, -10931689, -12641380, -14512587, -16574815, -18868859, -21431771, -24296927, -27509940, -31129372, -35208958, -39792199, -44919678, -50616778, -56873264, -63658282, -70934256, -78577781, -86262694, -93532189, -100130168, -106273190, -112480299, -119044543, -125667626, -131602314, -136087330, -138629176, -138985950, -137052419, -132832914, -126482300, -118322610, -108815556, -98513164, -87989246, -77757798, -68209208, -59583235, -51968317]
57003e1968317O647268N807564N117580M555705M089990L692171L338100L014663
56995a5705276K724558K473101K253048K050379J859271J681393a148617B05770
56986A404433J049766R06978P70117O46049N43399M62061L94798L37209K89508
56977F804318K50765K18691J93875J77553J65910J52523J35811J19014J03875
56968H322335Q9383P5692O4050N3299M0983K7290J3969L45j5338l1592m4934n4799
56956H540683o3281p0656p5209p7355q0064q4693q9185r0970q9802q7406q5210
56945G646852q2078p5033o5033o2107p9803j21445j75256k25714k66237k98095
56935F196051l22001l36478l41634l38748l27377l07439k82715k57974k33999
$$ y = [-51968317, -45321049, -39513485, -34395905, -29840200, -25750210, -22058039, -18719939, -15705276, -12980718, -10507617, -8254569, -6204190, -4344919, -2663526, -1148617, 205770, 1404433, 2454199, 3361177, 4131294, 4777343, 5320742, 5782803, 6177601, 6514810, 6804318, 7055083, 7273774, 7467649, 7645202, 7811112, 7963635, 8099446, 8218460, 8322335, 8411718, 8487410, 8551460, 8604759, 8645742, 8673032, 8687001, 8687346, 8672008, 8640416, 8595482, 8540683, 8477402, 8406746, 8331537, 8254182, 8174118, 8089425, 8000240, 7909270, 7819468, 7732062, 7646852, 7564774, 7489741, 7424708, 7362601, 7282798, 7161353, 6986097, 6760383, 6494146, 6196051, 5874050, 5537572, 5195938, 4857190, 4529813, 4222374, 3939659, 3681685, 3447686]
56926C447686k09532j86368j67855j53556j40287j27709j18249j12063j06690
56917B125377j01560r8341r6538r3064q6765p9672p3142o6214n8481n1311m5370
56906A274919l9593l3333k7264k1865j6988j2786r013m104K624Q672J0896R411
56894A141576O139P31q345j9280k7700l2057l4526l6199l5304l1120k6030k2215
56882H75670j9110j5355j0922o317j769K018M420O577J0436J5662J9645K0781
56870I01736J9593J6608J1682N624j02n628j2118j8770k3119k4543k4699k4186
56858H22078k1931j8405j6072j5522j4296j1054p885o789o626n578m251m082m585
56845F85002m373l569l236l434l483l323l284l287l190l064k516p44K123M932
$$ y = [3447686, 3238154, 3051786, 2883931, 2730375, 2590088, 2462379, 2344130, 2232067, 2125377, 2023817, 1925476, 1828938, 1735874, 1649109, 1569437, 1496295, 1430081, 1371600, 1320289, 1274919, 1235326, 1201993, 1174729, 1152864, 1135876, 1123090, 1114077, 1109973, 1112597, 1121269, 1132165, 1141576, 1147715, 1148446, 1140101, 1120821, 1093121, 1061064, 1026538, 990339, 955035, 923915, 897885, 875670, 856560, 841205, 830283, 823966, 822197, 824215, 828635, 835212, 845648, 861310, 880955, 901736, 921329, 937937, 949619, 955243, 955141, 949513, 937395, 918625, 895506, 870963, 846264, 822078, 800147, 781742, 765670, 750148, 735852, 724798, 716913, 710124, 703498, 697920, 693669, 689587, 685002, 680629, 677060, 673824, 670390, 666907, 663584, 660300, 657013, 653823, 650759, 648243, 647499, 649622, 654554]
56831F54554P212R670J2504J4783J6124J7410J9152K0527K0761J9984J8174J4874
56819H45729J0658P253N439M274L096K651L489M936O495Q694J1606J4121J5723
56806I44164J7456K0129K3097K5841K9306L4365M0021M4108M4711M0426L0784
56795A294408J7540M321o208j3962j9765k3399k4138k2110j8281j3889j0073o874
56783A157570k622M141J2225J9163K4951L1904M0583M8776N5291O1417O7028O8317
56771A588744O1639M7449K8505O840j5199l3430m4739n0129n2361n2084m8757
56760A436478m3684l8893l4081k7680k0142j3255o887N65Q860J5948K1299K6339
56748A324867L1493L5235L6303L4383K8501J7446K398j3101k6431l7126m4638
$$ y = [654554, 661766, 671436, 683940, 698723, 714847, 732257, 751409, 771936, 792697, 812681, 830855, 845729, 856387, 863640, 869079, 873353, 876449, 879100, 882589, 887525, 894020, 902714, 914320, 928441, 944164, 961620, 981749, 1004846, 1030687, 1059993, 1094358, 1134379, 1178487, 1223198, 1263624, 1294408, 1311948, 1316269, 1310061, 1296099, 1276334, 1252935, 1228797, 1206687, 1188406, 1174517, 1164444, 1157570, 1154948, 1159089, 1171314, 1190477, 1215428, 1247332, 1287915, 1336691, 1391982, 1453399, 1520427, 1588744, 1650383, 1697832, 1726337, 1733177, 1717978, 1684548, 1639809, 1589680, 1537319, 1485235, 1436478, 1392794, 1353901, 1319820, 1292140, 1271998, 1258743, 1251856, 1252421, 1261281, 1277229, 1298528, 1324867, 1356360, 1391595, 1427898, 1462281, 1490782, 1508228, 1510626, 1497525, 1471094, 1433968, 1389330]
56737A389330m7539m5985m2662l9786l6855l2623k7620k3188j9217j4454q397
56726A051004j764M435R358J2528J4270J5455J6119J4897J0493L293m975j2664
56714A132449j8855k3230k5961k7438k7695k6498k4270k2238k1069j9900j7498
56703H77797j4152j1643j1115j1555j0877q411n741m706n085n123m213l736m643
56690G76797n542m568k308j153j919k920k736k239k962m753o216o709o635o142
56676G19995m831k787r32k2K1n04j646l245m359m116k985k361k759l185k693j701
56660F81890j183j172r62k91N92J603K472K143m9k682l408k045q79j368k278k060
56644F70323j357j640k680l141k888k850l075k563j043N45J378J384P25j64j41
$$ y = [1389330, 1341791, 1295806, 1253144, 1213358, 1176503, 1143880, 1116260, 1093072, 1073855, 1059401, 1051004, 1049240, 1053675, 1063033, 1075561, 1089831, 1105286, 1121405, 1136302, 1146795, 1150088, 1145113, 1132449, 1113594, 1090364, 1064403, 1036965, 1009270, 982772, 958502, 936264, 915195, 895295, 877797, 863645, 852002, 840887, 829332, 818455, 810044, 804303, 799597, 794512, 789389, 785176, 781440, 776797, 771255, 766687, 764379, 763226, 761307, 758387, 755651, 753412, 750450, 745697, 739481, 732772, 726137, 719995, 715164, 712377, 711445, 711423, 711444, 710940, 709294, 706049, 701690, 697574, 694589, 692228, 689469, 686284, 683591, 681890, 680707, 679535, 678573, 678282, 678874, 680477, 682949, 685092, 685043, 682361, 678953, 676908, 676029, 674661, 672383, 670323, 668966, 667326, 664646, 661505, 658617, 655767, 652692, 650129, 649086, 649631, 651009, 652393, 653118, 652954, 652813]
56629F52813J675M416O135O113N361M740L920K591J368P98L96m05j070o21Q73
56614F89103K204K425J823J491K144L407M148L578K034M93n85j561k674l245k337
56599G02448l20Q74l09k988m610m096l254m225o437p515o660n380m947m971m911
56584F42699n126n665n708m997m343l906k844j618k415n506p417n146n16K411
56570E89903K908L346M345L934J735K64R53J822Q08r42r52R52K727K780J182j002
56554F14763k413k050k29J520K041J536P79J38k02%O70J433K197K877K686R75
56538F26721j135j541J0J470J395O34L01j18j289k189j496J27Q15J63m76l1J080
56521F24441J777J424K22q99r57m8O55M64P7L48J023J504K146L586N371O404O539
$$ y = [652813, 654488, 658904, 665039, 671152, 676513, 681253, 685173, 687764, 689132, 689930, 690326, 689921, 688851, 688230, 689103, 691307, 693732, 695555, 697046, 699190, 702597, 706745, 710323, 712357, 712850, 712265, 710704, 708030, 704785, 702448, 702128, 703002, 702693, 699705, 695095, 690999, 687745, 683520, 677083, 669568, 662908, 657528, 652581, 647610, 642699, 637573, 631908, 626200, 621203, 616860, 612954, 610110, 608492, 606077, 600571, 593154, 588008, 587492, 589903, 592811, 596157, 600502, 604436, 606171, 606435, 607388, 609210, 610018, 609076, 608124, 609076, 611803, 614583, 615765, 614763, 612350, 610300, 610071, 611591, 613632, 615168, 615947, 616085, 615883, 615883, 616553, 617986, 620183, 623060, 625746, 626721, 625586, 624045, 624055, 625525, 626920, 627554, 627855, 627737, 626448, 624259, 622763, 622890, 623705, 623868, 623392, 623361, 624441, 626218, 627642, 627864, 626965, 626008, 625960, 626615, 627079, 627156, 627504, 628527, 630031, 632177, 635763, 641134, 647538, 654077]
56504F54077O597O956P130O777O128N365M359L403L431N041P549R403R490P987
56490G43693O006M511L589K764J807R29L30p3n06j237k477l979m933m813m130
56475G41481l731l671l547l671m754o415p192o308m542l187k907l644m644m680
56461F78588l485k757m230o780p317m978k315j667k417k955l134l351l067k117
56447F28018j906l287m633m103k558k012k379k247j976l162n275n768l829j479
56433E83404l99l3M43N69J66M64K232M179M577L441K026J158J100K064L715M810
56417F13916M460L254K317J806J283R34J353K448L576M503N301N509M553L069
56403F58282K663L815M950M404K792K327L826N379M661J835p20j323n77R6L46
$$ y = [654077, 660674, 667630, 674760, 681537, 687665, 693030, 697389, 700792, 704223, 709264, 716813, 726216, 735706, 743693, 749699, 754210, 757799, 760563, 762370, 763299, 763629, 763556, 763050, 761813, 759336, 755357, 750424, 745611, 741481, 737750, 734079, 730532, 726861, 722107, 715692, 708500, 702192, 697650, 694463, 691556, 687912, 683268, 678588, 675103, 672346, 668116, 661336, 654019, 649041, 646726, 645059, 642642, 639687, 636553, 633202, 630135, 628018, 626112, 622825, 618192, 614089, 611531, 609519, 607140, 604893, 602917, 599755, 594480, 588712, 584883, 583404, 583005, 582972, 583415, 583984, 584150, 584614, 586846, 591025, 595602, 599043, 601069, 602227, 603327, 605391, 609106, 613916, 618376, 621630, 623947, 625753, 627036, 627970, 629323, 631771, 635347, 639850, 645151, 650660, 655213, 658282, 660945, 664760, 669710, 674114, 676906, 679233, 683059, 688438, 693099, 694934, 694214, 692891, 692314, 692410, 692756]
56388F92756N94P17K03n63l99R42K049J473m21j980k319k139k383k921l172l361
56372F79076m152n169n190m142l617m449m990l253n1J816J188n48k059l503m788
56357F36169m625k563m20j53j363k231k044j557j489j920k639l191l040k344j876
56342F04714j704j081j34q8r33p19J406L233K585P45L79J331J309J4n76J00K26
56325F10807j067k130j513k0J008J608K280K751K734K737L087L237K777K142J707
56310F32145J228P41Q23J359J317M64O3R92K306K725K615L207M512N279M775L585
56294F68136K585J980J552J410J901K908L545L094K149K117L416M910N530N525
56280G10758N454N013L925L043L307M376N495O889Q708R655Q631P027P211R077
$$ y = [692756, 693350, 694067, 694270, 693707, 693308, 694250, 696299, 697772, 697351, 695371, 693052, 690913, 688530, 685609, 682437, 679076, 674924, 669755, 664565, 660423, 656806, 652357, 647367, 644114, 644063, 645879, 647067, 646519, 644460, 640957, 636169, 631544, 628981, 628561, 628408, 627045, 624814, 622770, 621213, 619724, 617804, 615165, 611974, 608934, 606590, 604714, 603010, 601929, 601795, 601707, 600774, 600055, 601461, 604694, 607279, 608024, 608403, 609734, 611043, 611057, 610481, 610581, 610807, 609740, 607610, 606097, 606077, 607085, 608693, 610973, 613724, 616458, 619195, 622282, 625519, 628296, 630438, 632145, 633373, 634114, 634937, 636296, 637613, 638077, 638140, 639132, 641438, 644163, 646778, 649985, 654497, 659776, 664551, 668136, 670721, 672701, 674253, 675663, 677564, 680472, 684017, 687111, 689260, 691377, 694793, 699703, 705233, 710758, 716212, 721225, 725150, 728193, 731500, 735876, 741371, 748260, 756968, 766623, 775254, 782281, 789492, 798569]
56266G98569J0442J0634J1149J2604J3518J2921J1861J1445J1307J0913J0719
56255I26082J1114J1725J2474J3757J5064J5088J3716J2206J0963R161P144O650
56243A065144P748P950N906L774M099O203P665P827P769Q082Q598R437J0575J1242
56229A172019J1254J2044J4723J8047K0018K0710K1914K4478K7664L0799L4021
56218A407691L7456M0796M3851M6802N0071N4247N9637O5542P0750P5185Q0222
56207B032250Q6943R5075J03891J13034J22058J30652J39651J50284J62001J72916
56197C308755J82876J93795K05920K16204K22005K24213K24887K23802K19422
56188E221879K11392J99831J83705J62461J37929J12341Q5640N7071K8267K087
$$ y = [798569, 809011, 819645, 830794, 843398, 856916, 869837, 881698, 893143, 904450, 915363, 926082, 937196, 948921, 961395, 975152, 990216, 1005304, 1019020, 1031226, 1042189, 1051350, 1058494, 1065144, 1072892, 1080842, 1086748, 1090522, 1094621, 1100824, 1108489, 1116316, 1124085, 1132167, 1140765, 1150202, 1160777, 1172019, 1183273, 1195317, 1210040, 1228087, 1248105, 1268815, 1290729, 1315207, 1342871, 1373670, 1407691, 1445147, 1485943, 1529794, 1576596, 1626667, 1680914, 1740551, 1806093, 1876843, 1952028, 2032250, 2119193, 2214268, 2318159, 2431193, 2553251, 2683903, 2823554, 2973838, 3135839, 3308755, 3491631, 3685426, 3891346, 4107550, 4329555, 4553768, 4778655, 5002457, 5221879, 5433271, 5633102, 5816807, 5979268, 6117197, 6229538, 6315178, 6372249, 6400516, 6402603]
56178F402603k0819m1709o0777p6950r0240j01708j11261j17848j21873j25218
56168E534200j28830j32190j35255j38963j43535j48041j51815j55024j57714
56159D242833j59552j60364j59834j57175j52402j47182j42831j38125j31042
56150B894326j22074j13738j07016j00522r3306q6264q0213p4406o7900o1203
56140A987684n5724n2218n0151m8123m4869m0276l5279l0669k6608k3467k1945
56129A558355k1728k1245j9629j7657j5998j4040j1485r344p935n705j767K140
56117A413962M156N100O754Q954J0678J2394J4717J6350J6146J5901J7968K1203
56105A564283K2545K1844K1681K2847K3369K2158K0399J8991J7489J6011J5674
$$ y = [6402603, 6381784, 6340075, 6279298, 6202348, 6112108, 6010400, 5899139, 5781291, 5659418, 5534200, 5405370, 5273180, 5137925, 4998962, 4855427, 4707386, 4555571, 4400547, 4242833, 4083281, 3922917, 3763083, 3605908, 3453506, 3306324, 3163493, 3025368, 2894326, 2772252, 2658514, 2551498, 2450976, 2357670, 2271406, 2191193, 2116787, 2048887, 1987684, 1931960, 1879742, 1829591, 1781468, 1736599, 1696323, 1661044, 1630375, 1603767, 1580300, 1558355, 1536627, 1515382, 1495753, 1478096, 1462098, 1448058, 1436573, 1427229, 1419294, 1413589, 1411822, 1413962, 1418118, 1423218, 1429972, 1438926, 1449604, 1461998, 1476715, 1493065, 1509211, 1525112, 1543080, 1564283, 1586828, 1608672, 1630353, 1653200, 1676569, 1698727, 1719126, 1738117, 1755606, 1771617, 1787291]
56094A787291J6585J7624J8506K0028K2254K4530K7320L1827L7855M4177N0915
56083B098912N9422O9762Q0432R0567J00554J10626J20727J31135J41312J48710
56073C152159J50936J48481J43291J35682J25189J13371J02755R3589Q4295P4318
56063D324066O3708N0884L4253J5499j961j7177l1306m4042n4225o3352p4478
56052D201869q7725j00547j12049j23076j32370j36996j36835j34532j30621j22858
56042B984260j10806r7143q3848p1021n9804n2117m6801m0310l2056k5178k1311
56031B343865j8778j6669j6192j6994j6539j4513j3578j4470j4505j2334r919
56020B179374q472o515l412p09J375M595Q602J0617J0469J1458J4721J7408J8006
$$ y = [1787291, 1803876, 1821500, 1840006, 1860034, 1882288, 1906818, 1934138, 1965965, 2003820, 2047997, 2098912, 2158334, 2228096, 2308528, 2399095, 2499649, 2610275, 2731002, 2862137, 3003449, 3152159, 3303095, 3451576, 3594867, 3730549, 3855738, 3969109, 4071864, 4165453, 4249748, 4324066, 4387774, 4438658, 4472911, 4488410, 4486449, 4469272, 4437966, 4393924, 4339699, 4276347, 4201869, 4114144, 4013597, 3901548, 3778472, 3646102, 3509106, 3372271, 3237739, 3107118, 2984260, 2873454, 2776311, 2692463, 2621442, 2561638, 2509521, 2462720, 2422410, 2390354, 2365176, 2343865, 2325087, 2308418, 2292226, 2275232, 2258693, 2244180, 2230602, 2216132, 2201627, 2189293, 2179374, 2170902, 2164387, 2160975, 2160266, 2161641, 2166236, 2174838, 2185455, 2195924, 2207382, 2222103, 2239511, 2257517]
56007B257517J8677K0445K1092K0071K0645K4495K8687L0655L1930L4329L6692
55996B545235L8018L9846M2945M5468M6724M8836N2689N6098N7922N9765O1911
55985C095457O2279O1274O2725O7876P3238P6600Q0198Q5817R1842R7407J04219
55974C958932J12193J18619J23664J31061J41410J50880J58243J66406J74955
55965E236363J78907J77701J77528J81316J84479J84370J85516J90833J96080
55956F893093J98344K01829K09437K16544K19457K22358K29496K37802K43645
55947H872005K49529K57792K65162K70210K78607K94400L13541L32404L54315
55938A1487965L81143M07603M31254M58620M93229N27369N54707N81412O15317
$$ y = [2257517, 2276194, 2296639, 2317731, 2337802, 2358447, 2382942, 2411629, 2442284, 2474214, 2508543, 2545235, 2583253, 2623099, 2666044, 2711512, 2758236, 2807072, 2859761, 2915859, 2973781, 3033546, 3095457, 3157736, 3219010, 3281735, 3349611, 3422849, 3499449, 3579647, 3665464, 3757306, 3854713, 3958932, 4071125, 4189744, 4313408, 4444469, 4585879, 4736759, 4895002, 5061408, 5236363, 5415270, 5592971, 5770499, 5951815, 6136294, 6320664, 6506180, 6697013, 6893093, 7091437, 7293266, 7502703, 7719247, 7938704, 8161062, 8390558, 8628360, 8872005, 9121534, 9379326, 9644488, 9914698, 10193305, 10487705, 10801246, 11133650, 11487965, 11869108, 12276711, 12707965, 13166585, 13659814, 14187183, 14741890, 15323302, 15938619]
55929A5938619O53817O92528P35970P88803Q46193R04053R69186J047851J134049
55920B3711069J220673J311996J413376J519860J627663J745497J881596K032090
55912C6463820K195410K383575K603797K844325L095683L370450L684345M035839
55904F0677244M424808M872232N398801O004369O693278P497047Q444532R535863
55896A13548174J0777769J2215338J3893591J5824096J8030227K0573862K3476075
55889B28339132K6661072L0013202L3296500L5739262L5756148L1564346K2546088
55882D43915750J0091840l046649j4331110k2513346k7566836l0043143l0608426
55875C25898080k9880882k8347115k6318682k3998699k1572100j9197590j6958889
$$ y = [15938619, 16592436, 17284964, 18020934, 18809737, 19655930, 20559983, 21529169, 22577020, 23711069, 24931742, 26243738, 27657114, 29176974, 30804637, 32550134, 34431730, 36463820, 38659230, 41042805, 43646602, 46490927, 49586610, 52957060, 56641405, 60677244, 65102052, 69974284, 75373085, 81377454, 88070732, 95567779, 104012311, 113548174, 124325943, 136541281, 150434872, 166258968, 184289195, 204863057, 228339132, 255000204, 285013406, 318309906, 354049168, 389805316, 421369662, 443915750, 454007590, 450960941, 436629831, 414116485, 386549649, 356506506, 325898080, 296017198, 267670083, 241351401, 217352702, 195780602, 176583012, 159624123]
55868A59624123j4888144j3023113j1401076j0017788q836402p828175o975261
55861H6654164o249351n620675n079475m622988m231426l880646l568095l302928
55853E0098580l079399k881164k702607k544574k396809k245453k092107j947099
55845C0209368j809686j672397j538921j419652j313804j212487j115974j032182
55837A9094265r60986q94691q31785p76809p28826o82550o38839o02321n70903
55828A2406555n38699n06818m80406m57732m32971m07320l86615l70085l51950
55819H473959l32282l15958l02396k86481k68584k54089k43652k32948k21407
55810F016162k12473k05601j96420j84796j75078j68336j61298j52708j44284
$$ y = [159624123, 144735979, 131712866, 120311790, 110294002, 101457600, 93629425, 86654164, 80404813, 74784138, 69704663, 65081675, 60850249, 56969603, 53401508, 50098580, 47019181, 44138017, 41435410, 38890836, 36494027, 34248574, 32156467, 30209368, 28399682, 26727285, 25188364, 23768712, 22454908, 21242421, 20126447, 19094265, 18133279, 17238588, 16406803, 15629994, 14901168, 14218618, 13579779, 12977458, 12406555, 11867856, 11361038, 10880632, 10422900, 9989929, 9582609, 9195994, 8825909, 8473959, 8141677, 7825719, 7523323, 7236842, 6968258, 6714169, 6470517, 6237569, 6016162, 5803689, 5598088, 5401668, 5216872, 5041794, 4873458, 4712160, 4559452, 4415168]
55801D415168j36135j27461j20772j19108j20174j19224j16234j14078j11651
55792C330331j05679r7787r2650r0080q5840p9437p4426p1455o7643o2517n8325
55781B444492n4677m8935m1718l6368l3144k9428k5284k3208k2851k1520j9701
55770B087658k0582k4240k7432k8996l0459l1751l1427l0715l2320l5533l7345
55759A756858l7666l8458l8554l5025k9293k6180k6742k7312k5729k3363k0987
55748A427549j7899j5343j5609j7349j6783j3708j1360j0277p845m308l303n336
55736A288429o327m393k902m759q295j0858j2423j3463j3101j1461j0642j1487
55724A178318j2344j2350j2796j3983j3892j1641r428r562j1907j5258j8766k1190
$$ y = [4415168, 4279033, 4151572, 4030800, 3911692, 3791518, 3672294, 3556060, 3441982, 3330331, 3224652, 3126865, 3034215, 2944135, 2858295, 2778858, 2704432, 2632977, 2565334, 2502817, 2444492, 2389815, 2340880, 2299162, 2262794, 2229650, 2200222, 2174938, 2151730, 2128879, 2107359, 2087658, 2067076, 2042836, 2015404, 1986408, 1955949, 1924198, 1892771, 1862056, 1829736, 1794203, 1756858, 1719192, 1680734, 1642180, 1607155, 1577862, 1551682, 1524940, 1497628, 1471899, 1448536, 1427549, 1409650, 1394307, 1378698, 1361349, 1344566, 1330858, 1319498, 1309221, 1301376, 1297068, 1293765, 1288429, 1282102, 1277709, 1274807, 1270048, 1261753, 1250895, 1238472, 1225009, 1211908, 1200447, 1189805, 1178318, 1165974, 1153624, 1140828, 1126845, 1112953, 1101312, 1091884, 1082322, 1070415, 1055157, 1036391, 1015201]
55712A015201k1283j9840j9102j9515j9388j8044j6783j6276j5610j4299j2932
55701H22129j1627j0156r435j0478j2158j2572j2086j2173j2145j0445q444q905
55689F91505j0948j0833p996n933o451p332o854o521p757r423j0290j0801j0964
55676E79402r521o679m712m413l810j828m19j352l438m593m515l953l293l143
55662E23733m351o370p429p096o787p169p172o145m806l487j709K3K90p48j177
55647D59600k30R00J577K642M295N297M987L950K384J3k248k867k064j195k9K520
55631D79532N173N224K957J647K644L944M342N278P343Q553P726O388N661M317
55617E50729J558j100k447l455m819n236l905k321j885j819j032R3J082K318L451
$$ y = [1015201, 993918, 974078, 954976, 935461, 916073, 898029, 881246, 864970, 849360, 835061, 822129, 810502, 800346, 790911, 780433, 768275, 755703, 743617, 731444, 719299, 708854, 700410, 691505, 680557, 669724, 661728, 655795, 649344, 642012, 635158, 628637, 620880, 611457, 601167, 590366, 579402, 569881, 563202, 558490, 554077, 550267, 548439, 548020, 546668, 543230, 538637, 534122, 530169, 526876, 523733, 519382, 513012, 505583, 498487, 491700, 484531, 477359, 471214, 466408, 462921, 461212, 461235, 461525, 460777, 459600, 459370, 460270, 461847, 464489, 468784, 474081, 479068, 483018, 485402, 485415, 483167, 480300, 478236, 477041, 477012, 479532, 484705, 489929, 492886, 494533, 497177, 501121, 505463, 510741, 518084, 526637, 534363, 540751, 546412, 550729, 552287, 551187, 548740, 545285, 540466, 535230, 531325, 529004, 527119, 525300, 524268, 524361, 525443, 527761, 531212]
55602E31212L125J495O42J360J982J551J437K421K973J973N45l41j381k498j906
55587E44590M68J452j109n046p184p578q041q587q160p230p185q226r730j1372
55573D57062j2296j0987p721n417o143q422r730r871r961r929r209q407q192p814
55559C32963o557n320n046n000m335l834m279m590l449j502k74j48q27k312l970
55544B81520m226k729j187p70o17k11q38k782l645j916J14k78j995k261j340j726
55528B55113l762n316n303m645m088l514l164l354l308k243j068j149k005k155
55514B10039j499q87j67J230K485K339J378J157J569J182j64j203j481j703k045
55499B12230k012j837k220k709k065l26J025J087L90l12q77j310j352p02P59K565
$$ y = [531212, 534337, 535832, 536474, 537834, 539816, 541367, 542804, 545225, 548198, 550171, 550716, 550375, 548994, 546496, 544590, 545058, 546510, 545401, 540355, 533171, 525593, 517552, 508965, 500805, 493575, 486390, 478164, 468434, 457062, 444766, 433779, 426058, 420641, 414498, 406076, 396346, 386475, 376514, 366585, 357376, 348969, 340777, 332963, 326406, 321086, 316040, 311040, 306705, 302871, 298592, 294002, 290553, 289051, 288777, 288629, 287802, 285490, 281520, 277294, 274565, 273378, 272608, 271991, 271780, 270942, 268160, 264515, 262599, 262713, 262435, 260440, 258179, 256839, 255113, 251351, 246035, 240732, 236087, 231999, 228485, 225321, 221967, 218659, 216416, 215348, 214199, 212194, 210039, 208540, 207653, 207486, 208716, 211201, 213540, 214918, 216075, 217644, 218826, 218662, 217459, 215978, 214275, 212230, 210218, 208381, 206161, 203452, 201387, 201061, 202086, 203173, 203563, 203251, 202374, 201064, 199712, 199010, 199769, 202334]
55483B02334L313J802j005k469j511J57Q99J410K757M073M149L679L811L801K461
55468B29661P61N50J567K140K195L089M842N842N234L647J682m58k091k582k565
55453B53514l062l704l469k732k796l760m521m717m902n083m726m096m077m859
55439A97010n930o918p308o195l765j973k177l156l227k964l544l735j579J658
55425A46197K534L57j980k445k188k586k801j738k17L27q4n58q96j461k200k663
55409A27598k541j847j021q88j864l289m086l926l169k224j641k032k943k762
55395I3365q56J132J445O06J37N9l76n86L25J287N60j106j296J99J038R3j036
55378I4990q55KM44O10R77J347J503J505R62n79k248k400r46M57Q50R63J441J715
$$ y = [202334, 205647, 207449, 206444, 203975, 202464, 202621, 203520, 204930, 207687, 211760, 215909, 219588, 223399, 227200, 229661, 230422, 230972, 232539, 234679, 236874, 239963, 244805, 250647, 255881, 259528, 261210, 260752, 258661, 256079, 253514, 250452, 246748, 243279, 240547, 237751, 233991, 229470, 224753, 219851, 214768, 210042, 205946, 201869, 197010, 191080, 184162, 176854, 170659, 166894, 164921, 162744, 159588, 156361, 153397, 149853, 146118, 144539, 146197, 148731, 149088, 147108, 144663, 142475, 139889, 137088, 135350, 135133, 135460, 135376, 134818, 133922, 132461, 130261, 127598, 125057, 123210, 122189, 121301, 119437, 116148, 112062, 108136, 104967, 102743, 101102, 99070, 96127, 93365, 92509, 93641, 95086, 95692, 95829, 95888, 95512, 94926, 95251, 96538, 97098, 95992, 94696, 94895, 95933, 96026, 94990, 94135, 94137, 94581, 95191, 96168, 97515, 99018, 100523, 101485, 100906, 98658, 96258, 95312, 95769, 96619, 97582, 99023, 100738]
55360A00738J345Q84P18L41n84j559k120k322k213j813j595j777j337P90L565
55345I3061M633L315J178l79j353j836j543r53j097j694j383k05M9j289k536k189
55329H5779r72k94k23J8P60J948L280L758K367j60j771j755j365j275m29J579
55313I1245K993K323O80n9j61j235l406n037m999l756k324j286p77o52o04n51
55297G2394o64q62p66m32m82j143j792j819j346p67j99L23O51P75P62M73q9l41
55279F4676K33J126J384R43M41J2o46j317j675k215l315l815k441m32m01k376
55263E0182l407j809N81J544J599K386L673L907K681R83l73j162j165l22P63J339
55247F1400J156L80n91j009l43P73J104N26P3J12l9m39j56Q72J274M92j07O37
$$ y = [100738, 102083, 102967, 103685, 104026, 103442, 101883, 99763, 97441, 95228, 93415, 91820, 90043, 88706, 89496, 93061, 97694, 101009, 102187, 101808, 100455, 98619, 97076, 96123, 95026, 93332, 91949, 91744, 91793, 90504, 87968, 85779, 84807, 84513, 84290, 84308, 85068, 87016, 90296, 94054, 96421, 96261, 94490, 92735, 91370, 90095, 89666, 91245, 94238, 96561, 97241, 97182, 97021, 95786, 92380, 87343, 82344, 78588, 76264, 74978, 74201, 73549, 72945, 72394, 71730, 70868, 70102, 69670, 69188, 68045, 66253, 64434, 63088, 62321, 62122, 62445, 63096, 63871, 64633, 65106, 65017, 64676, 64909, 66035, 67419, 68362, 68803, 68815, 68169, 66852, 65177, 62962, 59647, 55832, 53391, 52959, 52558, 50182, 46775, 44966, 45547, 47091, 48690, 51076, 54749, 58656, 61337, 62320, 61947, 60785, 59620, 59298, 60061, 61400, 62556, 62936, 62345, 61336, 60993, 61766, 62870, 63396, 63469, 63581, 63542, 63103, 62947, 63819, 65093, 65585, 65478, 66115]
55229F6115J871K197J580O88m19j618j962j019J2j52j028j224l68Q33J761J994
55213F9261J157l91j353j038k97k18p14j217j636j684m97J794L292K592R53O02
55197G0606J559J745P1k111k737j162J438L187L013J506P3o97j224j541j137m00
55181G2189o93k163l051k228r86r89j755j656l93J122K417L562M257M248L888
55166G7769L257J687o05j729n51J190J160k43q78l79l29j342k318k521k319j763
55150G0086m44J022J380P39L85M30k35j412j295M39J516L48j487j670m92J18k15
55133F9213j73O82J225Q03K25K12K44k86q18n82r5m66j422j378K16J871K108J448
55115G3027J185J073j28k179l281k608j243j42J021K200K124M71p61J19J682J269
$$ y = [66115, 67986, 70183, 71763, 72451, 72032, 70414, 68452, 67433, 67445, 67293, 66265, 65041, 64673, 65506, 67267, 69261, 70418, 70027, 68674, 67636, 67339, 67121, 66407, 65190, 63554, 61870, 61373, 63167, 66459, 69051, 70004, 70606, 72165, 73910, 73981, 71870, 69133, 67971, 69409, 72596, 75609, 77115, 77188, 76491, 75267, 73726, 72589, 72189, 71496, 69333, 66282, 64054, 63068, 62079, 60324, 58668, 58275, 59397, 61814, 65376, 69633, 73881, 77769, 81026, 82713, 82108, 80379, 79828, 81018, 82178, 81935, 81057, 80678, 80349, 79007, 76689, 74168, 71849, 70086, 69642, 70664, 72044, 72783, 73168, 73598, 73363, 71951, 70656, 71095, 72611, 72959, 71472, 69802, 69310, 69428, 69213, 69040, 69722, 70947, 71750, 71975, 72187, 72431, 72145, 71327, 70745, 70650, 70184, 68762, 67384, 67600, 69471, 71579, 73027, 74212, 75285, 75157, 72978, 69697, 67089, 65846, 65704, 66725, 68925, 71049, 71520, 70759, 70878, 72560, 73829]
55099G3829j009k397j435L24Q82K05o29j177j517j384n17N27P51j13j226j487
55083F3627o26N66J140R81O04J06r46k364l034k398j497j640k588k924j873J76
55067D7310K437M108M326K943J272R73K042K794K034M22n61k99O59J487J909K184
55051G6040K478K373J396L3m88J71Q28M02m70l52R66K303K748K453J915J387J058
55034I5241J072J278J430J609J923K008J445N65J43L40O32P11Q48J282J840K139
55018A14506J856Q45n76j557j474o45m2k96j281k350k708j839j10J347J609P87
55002A08072l16j007j046o77m67o23m20Q50K344K244K19j888k502k093j733j254
54986I9703k07N59j2j252j585p95K8M66J061J809J888J119L60K74O44J044J249
$$ y = [73829, 72820, 70423, 68988, 69312, 70194, 70399, 69770, 68593, 67076, 65692, 65175, 65702, 66453, 66340, 65114, 63627, 63001, 63567, 64707, 65688, 66292, 66398, 65452, 63088, 60054, 57656, 56159, 54519, 51931, 49007, 47134, 47310, 49747, 53855, 58181, 61124, 62396, 63369, 65411, 68205, 70239, 70661, 70100, 69801, 70460, 71947, 73856, 76040, 78518, 80891, 82287, 82320, 81832, 82003, 82831, 83233, 82763, 82411, 83377, 85680, 88428, 90881, 92796, 94183, 95241, 96313, 97591, 99021, 100630, 102553, 104561, 106006, 106571, 106714, 107054, 107686, 108397, 109245, 110527, 112367, 114506, 116362, 117207, 116631, 115074, 113600, 112955, 112913, 112617, 111336, 108986, 106278, 104439, 104329, 105676, 107285, 108072, 107756, 106749, 105703, 105026, 104559, 103936, 103516, 104366, 106710, 108954, 109173, 107285, 104783, 102690, 100957, 99703, 99496, 100055, 100043, 98791, 97206, 96411, 96439, 96905, 97966, 99775, 101663, 102782, 103142, 103416, 104060, 105104, 106353]
54969A06353J062N87N14J241J960J743J127J388K391K615J394k84j448k299l111
54954A15233l218j927K64K059K725K627K519K561K147R32j44L30K079K895J323
54939A32405j366k892k770k147j715j413j548k425l033j895O26K419K235Q39n05
54924A16815j389j849j941j951k032j592j37J521K173K074K372K904K541J603
54910A21112J825L394M258L157J411O81Q05J097K002L865N424N305M143L699M436
54895A66614N356N735N841O290P618J0049J2863J4565J4569J4155J4833J6280
54883B94768J6892J5827J3501J0437O772K784j008m364p310r746j1517j2764j3652
54870C00620j4131j4348j4766j5230j4519j1812q215n786n105m847l871k640k199
$$ y = [106353, 107415, 108002, 108516, 109757, 111717, 113460, 114587, 115975, 118366, 120981, 122375, 122091, 120643, 118344, 115233, 112015, 110088, 110352, 112411, 115136, 117763, 120282, 122843, 124990, 125922, 125778, 126108, 128187, 131082, 132405, 131039, 128147, 125377, 123230, 121515, 120102, 118554, 116129, 113096, 111201, 111827, 114246, 116481, 117320, 116815, 115426, 113577, 111636, 109685, 107653, 106061, 105924, 107445, 109618, 111692, 114064, 116968, 119509, 121112, 122937, 126331, 130589, 133746, 135157, 135838, 136643, 137740, 139742, 143607, 149031, 154336, 158479, 162178, 166614, 171970, 177705, 183546, 189836, 197454, 207503, 220366, 234931, 249500, 263655, 278488, 294768, 311660, 327487, 340988, 351425, 358197, 360981, 359973, 355609, 348299, 338553, 327036, 314272, 300620, 286489, 272141, 257375, 242145, 227626, 215814, 207599, 201813, 196708, 191861, 187990, 185350, 183151]
54857A83151k506k556j730l73Q69J748K360K837L465M839P399J0552J2795J3198
54843B36048J2589J2701J4097J5396J4788J1952Q207N043K817P73j950n548r600
54830C17313j3464j6343j7357j6245j4016j2265j1595j1378j1081j0860j0531
54819A72178r219o941n425o071p866q600p593n794l874j891m02n3q3Q40K217K045
54803A13468l4j896j974j226r98q50l5M35p64k677l015j327M64P79O4m98o01n90
54785I8725o43p80j050j152m02J274K645K155k72k940m074l493k295j393q42m52
54769H5011k81l26l15j33Q9N22J625L230M336M295L480K383R76m05o98K61R37
54752A04987L29KJ973N276O949O208N337O017P160P125O136N266M711M475N366
$$ y = [183151, 180645, 178089, 176359, 175986, 176855, 178603, 180963, 183800, 187265, 192104, 199503, 210055, 222850, 236048, 248637, 261338, 275435, 290831, 305619, 317571, 325778, 330821, 333638, 334411, 332461, 326913, 317313, 303849, 287506, 270149, 253904, 239888, 227623, 216028, 204650, 193569, 182709, 172178, 162959, 156018, 150593, 144522, 136656, 128056, 120463, 114669, 110795, 108904, 108502, 108449, 108366, 109206, 111423, 113468, 113434, 111538, 109564, 108338, 107340, 106490, 106455, 106890, 106126, 103449, 100434, 99107, 99571, 100350, 100414, 99916, 99315, 98725, 98082, 97302, 96252, 95100, 94698, 95972, 98617, 100772, 100500, 97560, 93486, 89993, 87698, 86305, 85463, 85011, 84730, 84404, 84089, 83956, 84045, 84567, 86192, 89422, 93758, 98053, 101533, 103916, 104892, 104487, 103789, 104050, 104987, 105316, 105318, 107291, 112567, 119516, 125724, 131061, 137078, 144238, 151363, 157499, 162765, 167476, 171951, 177317]
54737A77317P776J0410J1748J2061J2650J3634J4022J3742J4028J5379J6357J5111
54725C34235J1564P383M014J422j199m099o897r345j1365j2365j1628r605p794
54712B84321o836n816m131k761k585k647j617J3Q13P33P26Q38O11P98K456M705
54696B69621N711N758O885R428J1550J2544J3960J6683J9407K1106K2628K4531
54684D39812K5448K4061K0944J7242J3340R802P540N826K368l084p450q570q599
54671E38680j0841j5025j8297j9551j9966k0181j9676j8701j8341j8631j8524
54660C40946j7747j7021j6445j5202j2967j0344p975o239n624o306p465p877p004
54647B02730n055k710j195j496k759k752r32M08p25l250m803m816l987k334J9
$$ y = [177317, 185093, 195503, 207251, 219312, 231962, 245596, 259618, 273360, 287388, 302767, 319124, 334235, 345799, 353182, 357196, 358618, 357419, 353320, 346423, 337078, 325713, 313348, 301720, 292115, 284321, 277485, 271669, 267538, 264777, 262192, 259545, 257928, 257941, 258754, 259487, 260213, 261051, 261662, 262460, 264916, 269621, 275332, 281090, 287975, 297403, 308953, 321497, 335457, 352140, 371547, 392653, 415281, 439812, 465260, 489321, 510265, 527507, 540847, 550649, 558189, 564015, 566383, 563299, 555849, 547279, 538680, 527839, 512814, 494517, 474966, 455000, 434819, 415143, 396442, 378101, 359470, 340946, 323199, 306178, 289733, 274531, 261564, 251220, 243245, 237006, 231382, 225076, 217611, 209734, 202730, 197675, 194965, 193770, 192274, 189515, 186763, 185831, 186239, 185514, 182264, 177461, 172645, 168658, 166324, 166343]
54632A66343J489R05k44L1Q03j94k344k674n40J424J551J348K380L598L317J944
54616A79137J205J734K737L251K940K276K252L272M379M481M066M353N117N022
54602B26222M145M126N496O759O774O258O085N799M940M427N230O562O661M970
54588C04454K771K003L811P628J1300J2757J1893J0427R984J1043J3439J6662
54576D18172J9604K1374K2626K4800K7819K9865K9875K8724K7404K5466K2036
54565F97765J7147J1116L888m052j1141j6261k0024k3482k6403k7903k8173k8287
54553E44190k8541k8118k6346k3531k0506j7979j6222j4954j3486j1340q755o509
54541C27903n418n945p805r860j0866j0495r371q112o855n641m630l934l806m802
$$ y = [166343, 167832, 168737, 168493, 168524, 169327, 169133, 166789, 164115, 163575, 164999, 166550, 167898, 170278, 173876, 177193, 179137, 180342, 182076, 184813, 188064, 191004, 193280, 195532, 198804, 203183, 207664, 211730, 216083, 221200, 226222, 230367, 234493, 239989, 246748, 253522, 259780, 265865, 271664, 276604, 281031, 286261, 292823, 299484, 304454, 307225, 309228, 313039, 320667, 331967, 344724, 356617, 367044, 377028, 388071, 401510, 418172, 437776, 459150, 481776, 506576, 534395, 564260, 594135, 622859, 650263, 675729, 697765, 714912, 726028, 729916, 725864, 714723, 698462, 678438, 654956, 628553, 600650, 572477, 544190, 515649, 487531, 461185, 437654, 417148, 399169, 382947, 367993, 354507, 343167, 334412, 327903, 322485, 316540, 308735, 298875, 288009, 277514, 268143, 260031, 253176, 247535, 242905, 238971, 235165, 230363]
54527B30363o896q600q244o280m959n227n518m395l012l363n110n950m811k953
54513A55045j712p85M38J148L2k496m283l899k229j074q46n55L05R40O85J40K43
54496A41097Q27R81M08l76r15j085p14J81R61J009Q14J463K891L630K665R19K45
54479A55001J338L126M122M040L948M809O169O742O260O020P230R504J1481J2409
54465B42199J2484J2312J2636J3878J5209J4844J2289R480Q473Q687P836N017
54453C75344J251k641o777j0678j2952j3159j2601j2643j3286j3873j4125j3891
54441B49969j2886j1275r695q339o758m929l685l643m405n107n121m173k535j225
54427A66193j165j974k367j764p55q1r8r92k394k904j439R90K265J929J442J640
$$ y = [230363, 223467, 214867, 206623, 200343, 195384, 190157, 184639, 180244, 177232, 173869, 168759, 162809, 157998, 155045, 153333, 152548, 152986, 154134, 154166, 151670, 147387, 143488, 141259, 140185, 139339, 138784, 139089, 140029, 140714, 140854, 141097, 141924, 142905, 143313, 142937, 142022, 140937, 140223, 140404, 141365, 142374, 143188, 144651, 147542, 151172, 153837, 154756, 155001, 156339, 159465, 163587, 167627, 171575, 176384, 182553, 189295, 195555, 201575, 208805, 218309, 229790, 242199, 254683, 266995, 279631, 293509, 308718, 323562, 335851, 345331, 353804, 362491, 370327, 375344, 376595, 373954, 367177, 356499, 343547, 330388, 317787, 305144, 291858, 277985, 263860, 249969, 237083, 225808, 216113, 207774, 201016, 196087, 192402, 188759, 184354, 179247, 174126, 169953, 167418, 166193, 165028, 163054, 160687, 158923, 158168, 158087, 157989, 156997, 154603, 151699, 150260, 151250, 153515, 155444, 156886, 158526]
54411A58526J785J505J695K652L135K375J419J281J191J33j096j007J68P36j84
54396A74314j844l127l602l412k848k025q52M45R74J73r51q25K97M15j278l159
54380A52695l651l384l614m016l508k238j159m26K44L44p86k402k965k084p50
54365A22300J82N98M74j59p35o59k09k6O3P22J726K080J610J398K266L641M368
54348A39640M099L428K917K500J956J646K303L826M835M176K584J935K819L881
54334A82545L761K706J845J867K792M180N047M469K660P08j006k951m811n203
54320A98609l833k378k213k587k280j796k438m105n533o027n671m512k845j625
54306A50766j303r81MO15k27j425j142K24O53j15k39R83J810Q26q88j546j150
$$ y = [158526, 160311, 161816, 163511, 166163, 169298, 171673, 173092, 174373, 175564, 175697, 174601, 173594, 173762, 174498, 174314, 172470, 169343, 165741, 162329, 159481, 157456, 156604, 157049, 158023, 158196, 157245, 156420, 156717, 157132, 155854, 152695, 149044, 145660, 142046, 138030, 134522, 132284, 131125, 130699, 130943, 131287, 130501, 128099, 125134, 123050, 122300, 122482, 123080, 123554, 123395, 122660, 122001, 121792, 121766, 121829, 122551, 124277, 126357, 127967, 129365, 131631, 135272, 139640, 143739, 147167, 150084, 152584, 154540, 156186, 158489, 162315, 167150, 171326, 173910, 175845, 178664, 182545, 186306, 189012, 190857, 192724, 195516, 199696, 204743, 209212, 211872, 212580, 211574, 208623, 203812, 198609, 194776, 192398, 190185, 187598, 185318, 183522, 181084, 176979, 171446, 165419, 159748, 155236, 152391, 150766, 149463, 148482, 148486, 149101, 148874, 147449, 146307, 146531, 147184, 147069, 146830, 147813, 149623, 150449, 149561, 148015, 146865]
54289A46865q41o80L94K680M893N559M621L362K875K938K645J899J565K008K326
54274A83109J620K80p51j406k243l169l410k629j333k94n8o90j507j638j389k158
54258A62334m256n900n569m358m325n327n519m541l910m197m058k677j118m48
54244A06131k14K05L61j09n32o28j459l498n013m177j880n08m80r5J229J906J033
54227I2272K42J334L406M054K673Q89p7p42j738k435k037j040n67q34j189j217
54211I2994r34k28R27J869J794R18L34O79J612K496K900K496J299n7r16j290j300
54194A05593m67J299K538J744k43j138n11j99j145k033j743j053o72K87K296L731
54178A08284K970R22l84n76n26k49Q73K436L376L448K927J551p18k591k785j805
$$ y = [146865, 146024, 145344, 145738, 148418, 153311, 158870, 163491, 166853, 169728, 172666, 175311, 177210, 178775, 180783, 183109, 184729, 185009, 184258, 182852, 180609, 177440, 174030, 171401, 170068, 169774, 169716, 169026, 167519, 165881, 164492, 162334, 158078, 152178, 146609, 142251, 137926, 132599, 127080, 122539, 118629, 114432, 110374, 107697, 106579, 106131, 105917, 106122, 106483, 106374, 105842, 105214, 103755, 100257, 95244, 91067, 89187, 88679, 88199, 88104, 89333, 91239, 92272, 92514, 93848, 97254, 101308, 103981, 104870, 104793, 104051, 102313, 99878, 97841, 96801, 96234, 95400, 94211, 92994, 92060, 91832, 92759, 94628, 96422, 97340, 97674, 98353, 99965, 102461, 105361, 107857, 109156, 109099, 108183, 106893, 105593, 105126, 106425, 108963, 110707, 110464, 109326, 108815, 108616, 107471, 105438, 103695, 102642, 101970, 102257, 104553, 108284, 111254, 112176, 111792, 111216, 110690, 110441, 111314, 113750, 117126, 120574, 123501, 125052, 124334, 121743, 118958, 117153]
54162A17153r37k16Q91J668J021l34o56J92Q02N88J58m02j474k255j332Q94K393
54145A18154K358J987K071J838P11n59j230j550j767j660j497k017k991l235k517
54130A08096j941j971j716p85k56r05j845j859j044k84k4k35o89q22k27M25N0
54113I3968j070j438n88K95M19M98J159J773J725J446J226K50k014m505n643n019
54097H2482l259j076Q10J769J961K179K537K285J321O16N06o7j763l598m391m270
54081G8042l717k338J16K456L159K219Q77R0O7P02J545J880J551J145R32L82p72
54064H8336j964k725l126k832j176J185K217J169k51m45n3j80k22O57J427P35
54048H2752n40o14K30L64j55J40J078Q07r42k090j383q5M20O67J573K532K480
$$ y = [117153, 116216, 116000, 116891, 118559, 119580, 119246, 118590, 118782, 119584, 120172, 120330, 119928, 118454, 116199, 114867, 115761, 118154, 120512, 122499, 124570, 126408, 127119, 126560, 125330, 123780, 122013, 120353, 118856, 116839, 113848, 110613, 108096, 106155, 104184, 102468, 101683, 101427, 100522, 98677, 96818, 95774, 95490, 95466, 95231, 94542, 93720, 93493, 93918, 93968, 92898, 91460, 90872, 91167, 91586, 92084, 93243, 95016, 96741, 98187, 99413, 99663, 97649, 93144, 87501, 82482, 79223, 78147, 78957, 80726, 82687, 84866, 87403, 89688, 91009, 91625, 92131, 92064, 90301, 86703, 82312, 78042, 74325, 71987, 72103, 74559, 77718, 79937, 80814, 80904, 80971, 81673, 83218, 85098, 86649, 87794, 88726, 89108, 88336, 86372, 83647, 80521, 77689, 76513, 77698, 79915, 81084, 80833, 80388, 80335, 80155, 79933, 80590, 82017, 82752, 82212, 81598, 81828, 82192, 82037, 82177, 83255, 84062, 83120, 81030, 79647, 79562, 79982, 80649, 82222, 84754, 87234]
54031H7234J635Q30K9j121j946j327O28K562L392L068J998O49k27J16J472K452
54015A01444J754m16k487l064k208j066o10q61j195r69Q3J566K585K571K045K000
53999A01172K539K689J757K35r65j463j322o29K93R22J276J996L194L946L645
53984A19285L101L303L743L235J963J469K504M089N009N214N341N718O319P130
53970A77423P976Q353P950P140O587O472O402O063N585N289N241N269N279N268
53956B66297N044M321L249K404K015J537N32m60o67l77o44j787l062l821m084
53941B70497l923l310k757l046l964m319l642k783k462k340k161k514l582m278
53927B25416l768k902k877l267k712j113K36M07l51j405k290k544k014j345j378
$$ y = [87234, 88869, 89699, 89728, 88607, 86661, 85334, 85962, 88524, 91916, 94984, 96982, 97631, 97404, 97520, 98992, 101444, 103198, 102782, 100295, 97231, 95023, 93957, 93347, 92486, 91291, 90322, 90405, 91971, 94556, 97127, 99172, 101172, 103711, 106400, 108157, 108392, 107427, 105964, 104642, 104013, 104306, 105228, 106504, 108500, 111694, 115640, 119285, 122386, 125689, 129432, 132667, 134630, 136099, 138603, 142692, 147701, 152915, 158256, 163974, 170293, 177423, 185399, 193752, 201702, 208842, 215429, 221901, 228303, 234366, 239951, 245240, 250481, 255750, 261029, 266297, 271341, 275662, 278911, 281315, 283330, 284867, 285399, 284939, 284272, 283895, 283251, 281464, 278402, 274581, 270497, 266574, 263264, 260507, 257461, 253497, 249178, 245536, 242753, 240291, 237951, 235790, 233276, 229694, 225416, 221648, 218746, 215869, 212602, 209890, 208777, 209013, 209420, 209069, 207664, 205374, 202830, 200816, 199471, 198093]
53912A98093k026k356j734l87R96J710J384M08k59j62J65J46k0PQ0K01Q96K024
53894A99166K249Q48p02m19J421K707K308J085K94L91J346K749L566L128K335
53879B22472K674M069N142N501O104P061P012N409L791L680M491M787M540M709
53865B91442N203M843L284J713J286J695J754J040M81J294L484N702O659O507
53851C36387O433P081P908Q102P595O885O316N802N036L737J935J54q72r67p65
53836D00767r92j542j586p24K30K4j532l407m909o504q357r031p177m234l431
53821C47595n718q572r636r643j0242j0741r357o677n339o383p967q020o411m126
53807B38763j948o07q16k365m006m758m720m338l816l471l706m281m408l895l417
$$ y = [198093, 196067, 193711, 191977, 191590, 192586, 194296, 195680, 196088, 195829, 195667, 195832, 195978, 195958, 195965, 196045, 196246, 197142, 199166, 201415, 202263, 201561, 201142, 202563, 205270, 207578, 208663, 208957, 209348, 210694, 213443, 217009, 220137, 222472, 225146, 229215, 234357, 239858, 245962, 253023, 260035, 265444, 269235, 272915, 277406, 282193, 286733, 291442, 296645, 301488, 304772, 306485, 307771, 309466, 311220, 312260, 312741, 314035, 317519, 323221, 329880, 336387, 342820, 349901, 357809, 365911, 373506, 380391, 386707, 392509, 397545, 401282, 403217, 403371, 402499, 401532, 400767, 399775, 398233, 396647, 395923, 396153, 396177, 394645, 391238, 386329, 379825, 371468, 362437, 355260, 351026, 347595, 341877, 333305, 323669, 314026, 303784, 293043, 283686, 277009, 271670, 265287, 257320, 249300, 242889, 238763, 236815, 236208, 235392, 233027, 229021, 224263, 219543, 215205, 211389, 207918, 204212, 199931, 195523, 191628, 188211]
53792A88211l417l562l493l346l250l186l405m156m846m463l070j854j417j092
53778A43654l30L47K92l05r87j515j313L85L007M379L178R07J17J162K046J339
53762A56363o3m50L75J062O05l51m12P35J955K232J935J911J925J116k42o37O80
53745A68739K687M011M418M428M274L982L816M054M678N626O825P729P692P122
53731B40081P267Q250Q447O662L979K269J752J344P93Q21J429J725J580J809K311
53716B90519J570j065l864m636l370j804j017q05j095k385m419n756n396m038
53702B52439l034k823l111l812m758n024l813j876p59o50k83P62J189N2j701k678
53686B20120k920l112k944j741k09J6j403k905k847j127J010K112J554Q0q11n34
$$ y = [188211, 184794, 181232, 177739, 174393, 171143, 167957, 164552, 160396, 155550, 151087, 148017, 146163, 144746, 143654, 143324, 143671, 143963, 143658, 142671, 141156, 139843, 140228, 143235, 147614, 150792, 151699, 151816, 152978, 155024, 156363, 156300, 155850, 156225, 157287, 157892, 157541, 157129, 157864, 159819, 162051, 163986, 165897, 167822, 168938, 168696, 168059, 168739, 171426, 175437, 179855, 184283, 188557, 192539, 196355, 200409, 205087, 210713, 217538, 225267, 232959, 240081, 247348, 255598, 264045, 270707, 274686, 276955, 278707, 280051, 280844, 281665, 283094, 284819, 286399, 288208, 290519, 292089, 291024, 287160, 282524, 279154, 277350, 276333, 275528, 274433, 272048, 267629, 261873, 256477, 252439, 249405, 246582, 243471, 239659, 234901, 229877, 226064, 224188, 223429, 222779, 222496, 223258, 224447, 224499, 222798, 220120, 217200, 214088, 211144, 209403, 209194, 209210, 207807, 204902, 202055, 200928, 201938, 204050, 205604, 205684, 204873, 204339]
53670B04339l0k22o52n30k54n61q46k6J369J676O99j3L69Q85O27L5k67m75p79
53651B05344p04r6M53O98J113J567R60r25k446j966K14K791N237P382Q218O714
53635B34554L617J124N81J338J988K015K028K644L487L513K435J406J658K760
53621B65148L263K823K495K768K669J451ll48M13J122R15p6j049j226o47l01p97
53604B78620j196k78J288J529L0j504j848j560j196l26P57M74j421k596j264J164
53588B70673K341K334K601L057K597J551J133J183P99N73J610K835K123M8l81
53573B95077J736L716L284J538O27O85P71J004J860K478J647j57j285j114l44
53558C11523N86J939L509M324L890K901K312K289K553L200M441N757O111N358
$$ y = [204339, 204309, 204087, 203435, 202905, 202651, 202090, 201244, 201218, 202587, 204263, 204962, 204949, 205318, 206203, 206830, 206865, 206598, 206123, 205344, 204640, 204544, 204997, 205695, 206808, 208375, 209335, 208410, 205964, 203998, 204212, 207003, 212240, 219622, 227840, 234554, 238171, 239295, 239876, 241214, 243202, 245217, 247245, 249889, 253376, 256889, 259324, 260730, 262388, 265148, 268411, 271234, 273729, 276497, 279166, 280617, 280614, 280266, 280679, 281801, 282716, 282640, 281591, 280365, 279718, 279417, 278620, 277424, 277146, 278434, 279963, 279993, 278489, 276641, 275081, 273885, 273559, 274316, 274790, 273369, 270773, 269509, 270673, 273014, 275348, 277949, 281006, 283603, 285154, 286287, 287470, 288269, 288842, 290452, 293287, 295410, 295458, 295077, 296813, 300529, 303813, 305351, 305978, 306663, 307434, 308438, 310298, 312776, 314423, 314266, 312981, 311867, 311523, 312109, 314048, 317557, 321881, 325771, 328672, 330984, 333273, 335826, 339026, 343467, 349224, 355335, 360693]
53544C60693M806N701P463Q230P082M890K934J680J187J651K892M151N032N867
53530D24259O573O221M626L238L381M410M907M752M555L924K094j52j089m06O87
53515D71980J575K789M386N452N464M745L465J690L91O35J644J531K43k15R78
53500E06753K094J733R78J343K246K221J307O71P21J092J687K459K854K685K768
53485E33612L511L791K640J281J789M143O248O670N954N286N275O039P195P670
53471F01104O694N183N025O714Q703R375Q759Q044Q256R669J1760J3394J3704
53458G16384J3034J2506J2658J3180J4078J5962J8815K1359K2360K1978K1274
53447I03588K0870K0784K1119K2094K3449K4474K4869K5265K6579K8895L1101
$$ y = [360693, 365499, 371200, 378663, 386893, 393975, 398865, 401799, 403479, 404666, 406317, 409209, 413360, 418392, 424259, 430832, 437053, 441679, 444917, 448298, 452708, 457615, 462367, 466922, 470846, 472940, 472788, 471699, 471293, 471980, 473555, 476344, 480730, 486182, 491646, 496391, 499856, 501546, 501937, 502572, 504216, 505747, 505990, 505775, 506753, 508847, 510580, 511558, 512901, 515147, 517368, 518675, 519346, 520067, 521159, 522846, 525305, 528159, 530844, 533612, 537123, 540914, 543554, 544835, 546624, 550767, 557015, 563685, 569639, 574925, 580200, 586239, 593434, 601104, 607798, 612981, 618006, 624720, 633423, 642798, 651557, 659601, 667857, 677526, 689286, 702680, 716384, 729418, 741924, 754582, 767762, 781840, 797802, 816617, 837976, 860336, 882314, 903588, 924458, 945242, 966361, 988455, 1011904, 1036378, 1061247, 1086512, 1113091, 1141986, 1173087]
53436A173087L1911L1321L0807L1752L3792L5229L5029L3805L2766L2321L2163
53425A533983L2083L2121L2178L2038L1708L1282L0578K9431K8237K7754K8239
53414A869632K9133K9713K9686K9074K7948K6528K5203K4109K2932K1352J9510
53403B154820J7758J6090J4234J2127J0011Q074O205M157J722j145m176o891r013
53390B223973j0708j2122j3014j3255j3357j3945j4889j5763j6835j8603k0334
53379B061148k0550j9310j8617j9610k0695j9920j8154j8050k0142k2008k1531
53368A842561j9257j6882j4863j2603j0050p930o749o294n930n047l571k226j684
53355A729475j272N39L898O932Q172Q565R948J2284J3981J4492J4987J6376J8252
$$ y = [1173087, 1204998, 1236319, 1267126, 1298878, 1332670, 1367899, 1402928, 1436733, 1469499, 1501820, 1533983, 1566066, 1598187, 1630365, 1662403, 1694111, 1725393, 1755971, 1785402, 1813639, 1841393, 1869632, 1898765, 1928478, 1958164, 1987238, 2015186, 2041714, 2066917, 2091026, 2113958, 2135310, 2154820, 2172578, 2188668, 2202902, 2215029, 2225040, 2233114, 2239319, 2243476, 2245198, 2244053, 2239877, 2232986, 2223973, 2213265, 2201143, 2188129, 2174874, 2161517, 2147572, 2132683, 2116920, 2100085, 2081482, 2061148, 2040598, 2021288, 2002671, 1983061, 1962366, 1942446, 1924292, 1906242, 1886100, 1864092, 1842561, 1823304, 1806422, 1791559, 1778956, 1768906, 1760976, 1754227, 1747933, 1742003, 1736956, 1733385, 1731159, 1729475, 1728203, 1728742, 1732640, 1739572, 1747744, 1756309, 1766257, 1778541, 1792522, 1807014, 1822001, 1838377, 1856629]
53342A856629K0151K2415K5168K7706K9678L1796L4433L6561L7399L8236M1042
53331B201214M5496M8994M9934M9488M9674N0917N2430N3994N6054N8476O0408
53320B777079O1486O2293O3282O3847O2955O0501N7649N5800N5245N4990N3858
53309C428985N1620M8731M5311M1104L6407L2084K8207K3760J8335J3215R444
53298C777203N803L00o638j2486j6384k0501k6695l3490l7963l9550m0366m2189
53286C507044m4741m6881m8160m8798m8966m8613m7722m6607m5976m6323m7061
53275B987196m6814m5133m3309m2756m3087m2849m1727m0885m1012m1191m0086
53264B518347l7535l4535l2111l0558k9443k8093k6168k3828k1460j9494j8548
$$ y = [1856629, 1876780, 1899195, 1924363, 1952069, 1981747, 2013543, 2047976, 2084537, 2121936, 2160172, 2201214, 2246710, 2295704, 2345638, 2395126, 2444800, 2495717, 2548147, 2602141, 2658195, 2716671, 2777079, 2838565, 2900858, 2964140, 3027987, 3090942, 3151443, 3209092, 3264892, 3320137, 3375127, 3428985, 3480605, 3529336, 3574647, 3615751, 3652158, 3684242, 3712449, 3736209, 3754544, 3767759, 3777203, 3783006, 3783306, 3776668, 3764182, 3747798, 3727297, 3700602, 3667112, 3629149, 3589599, 3549233, 3507044, 3462303, 3415422, 3367262, 3318464, 3269498, 3220885, 3173163, 3126556, 3080580, 3034257, 2987196, 2940382, 2895249, 2851940, 2809184, 2766097, 2723248, 2681521, 2640636, 2599624, 2558433, 2518347, 2480812, 2446277, 2414166, 2383608, 2354165, 2326072, 2299904, 2276076, 2254616, 2235122, 2216574]
53253B216574j9093k0578k1558k1324k0743k0764k0900k0180j8965j8374j8317
53242A995778j7625j6016j4319j2709j0378p316m742l152j524P26K513K967L177
53229A917380M665P159R380J1161J3136J4916J5395J4874J5172J7312K0299K2585
53217B083434K3721K4099K4068K3832K3516K2771K0975J8262J5651J3685J1687
53206B305701R043O500N098M290K429q91m200o327p989j0460j3545j6020j7499
53193B256130j8658j9847k0856k1961k3882k6242k7484k6989k6131k6355k7281
53182A990444k7766k7855k8146k7995k6151k3124k1163k1456k2674k2805k1510
53171A719799k0073j9805k0898k2383k2869k1839k0221j9254j9006j8763j8489
$$ y = [2216574, 2197481, 2176903, 2155345, 2134021, 2113278, 2092514, 2071614, 2051434, 2032469, 2014095, 1995778, 1978153, 1962137, 1947818, 1935109, 1924731, 1917415, 1912673, 1909521, 1907997, 1908723, 1911236, 1914203, 1917380, 1922045, 1929204, 1938584, 1949745, 1962881, 1977797, 1993192, 2008066, 2023238, 2040550, 2060849, 2083434, 2107155, 2131254, 2155322, 2179154, 2202670, 2225441, 2246416, 2264678, 2280329, 2294014, 2305701, 2314744, 2321244, 2326342, 2330632, 2333061, 2332170, 2327970, 2321643, 2313654, 2303194, 2289649, 2273629, 2256130, 2237472, 2217625, 2196769, 2174808, 2150926, 2124684, 2097200, 2070211, 2044080, 2017725, 1990444, 1962678, 1934823, 1906677, 1878682, 1852531, 1829407, 1808244, 1786788, 1764114, 1741309, 1719799, 1699726, 1679921, 1659023, 1636640, 1613771, 1591932, 1571711, 1552457, 1533451, 1514688, 1496199]
53160A496199j8576j8348j6389j2894j0134r890j1436j2879j3356j3135j2602
53149A346560j2205j2594j3881j5293j6341j7512j9029j9844j9045j7596j7272
53138A165948j8305j9296j9253j8528j7810j7328j7091j6993j6627j5736j4862
53127I74119j4787j5402j5892j6024j6364j7104j7502j6867j5491j4319j4014
53116H00353j4440j4799j4223j2600j0762r578r043q619q176q072q515r418j0635
53103F61473j1831j2255j1449j0003r006q767q809q940r508j0369j0563r341p184
53090E33448n432n081o010p014o763n134l538l377m360m970m573m228n153o972
53076D60843p963o769l750q96l02k322n125o479n830m248k709j386n32p50j931
$$ y = [1496199, 1477623, 1459275, 1442886, 1429992, 1419858, 1409968, 1398532, 1385653, 1372297, 1359162, 1346560, 1334355, 1321761, 1307880, 1292587, 1276246, 1258734, 1239705, 1219861, 1200816, 1183220, 1165948, 1147643, 1128347, 1109094, 1090566, 1072756, 1055428, 1038337, 1021344, 1004717, 988981, 974119, 959332, 943930, 928038, 912014, 895650, 878546, 861044, 844177, 828686, 814367, 800353, 785913, 771114, 756891, 744291, 733529, 723951, 714908, 706289, 698113, 690041, 681526, 672108, 661473, 649642, 637387, 625938, 615935, 606929, 598162, 589353, 580413, 570905, 560536, 549973, 540632, 533448, 528016, 522935, 516925, 509911, 503148, 498014, 494476, 491099, 486739, 481769, 477196, 472968, 467815, 460843, 452880, 446111, 442361, 441465, 441163, 438841, 433716, 427237, 421407, 417159, 414450, 413064, 412532, 411782, 409851]
53061D09851k797k370j265q32j382k008k013j822k364l903n626o339n647m365
53047C67118l524l099k340j267j022k189l618l736k566j455j084p71N6Q59J027
53032C42389J048J740K727K718J394M7n1P71J319J231J023O66o45k921m729m907
53016C43820m275m538n844o610n810m240l138k615k195k122l012m526n454n219
53002B84222m586m584n311o010n887m642k660r59o08j621k707k550j236n4Pq45
52986B39969j670j670o67P24J280K44j599k487j787q65j296k709l355k478j194
52971B20440r28j836l058l813l845l203k017l76J605L360L834K495L43q90o98
52956B11413k12n03j356k084k627l098l011j881k01R86J186N58o56j993k490j525
$$ y = [409851, 407054, 404684, 403419, 402587, 401205, 399197, 397184, 395362, 392998, 389095, 383469, 377130, 371483, 367118, 363594, 360495, 358155, 356888, 355866, 353677, 350059, 346323, 343757, 342302, 341218, 340447, 340503, 341362, 342389, 343437, 345177, 347904, 350622, 352016, 352063, 352012, 352783, 354102, 355333, 356356, 357022, 356377, 353456, 348727, 343820, 339545, 335007, 329163, 322553, 316743, 312503, 309365, 306750, 304555, 302433, 299421, 294895, 289441, 284222, 279636, 275052, 269741, 263731, 257844, 253202, 250542, 249583, 248975, 247354, 244647, 242097, 240861, 240807, 240814, 239969, 238299, 236629, 235962, 236686, 237966, 238210, 236611, 234124, 232337, 231472, 230176, 227467, 224112, 221634, 220440, 219512, 217676, 214618, 210805, 206960, 203757, 201740, 201364, 202969, 206329, 210163, 212658, 213001, 212111, 211413, 211201, 210698, 209342, 207258, 204631, 201533, 198522, 196641, 196440, 197426, 198612, 199170, 198514, 196521, 194031, 192506]
52940A92506J62J112R02M21M21O64P41Q75J325J574Q39p49k049k079j044l8J55
52923A95738j96l32K9N61J016J534K094K197J524N09q1M0N90J096J155P13M73
52906B08660J488L776N804N984M431K600J498J077J084J521K147K396K129J900
52892B46495K202K885L542L995M238M286M232M194M078L775L507L698M356M987
52878C00470N122M752M142L481K733J675J86j380k359k552k488k600k570j950
52864C06662j027m50m26q08j518k166j807j63J363J186j42n31N93J440N82r60
52848C01828j330m41K00l18j452k199k140j441n26K78J011J948L026L729L656
52833C05829K872J603J68o94k35J077J571K80j638k192q87R12J728J386P70P67
$$ y = [192506, 192668, 193780, 194682, 195103, 195524, 196188, 196929, 197804, 199129, 200703, 201542, 200793, 198744, 196665, 195621, 195583, 195738, 195542, 195210, 195239, 195800, 196816, 198350, 200444, 202641, 204165, 204674, 204593, 204633, 205223, 206319, 207474, 208187, 208660, 210148, 213924, 219728, 225712, 230143, 232743, 234241, 235318, 236402, 237923, 240070, 242466, 244595, 246495, 248697, 251582, 255124, 259119, 263357, 267643, 271875, 276069, 280147, 283922, 287429, 291127, 295483, 300470, 305592, 310344, 314486, 317967, 320700, 322375, 322561, 321181, 318822, 316270, 313782, 311182, 308612, 306662, 305635, 305185, 304759, 303951, 302433, 300267, 298460, 298297, 299660, 300846, 300704, 300173, 300766, 302206, 302788, 301828, 300498, 300057, 300257, 299939, 298487, 296288, 294148, 292707, 292181, 292459, 293470, 295418, 298444, 302173, 305829, 308701, 310304, 310472, 309778, 309543, 310620, 312191, 312471, 310833, 308641, 307754, 308666, 310394, 311780, 312550, 313317]
52817C13317J593K713L351L087K003L39j449k458j894j77J257J609J387J058J67
52802C25903j348k065q49J026J253k00j056j39J105J215J051K036L441L277J385
52787C36035k30k69L41L54J35P21J887K435K085J780K002J910P46p42j147k75
52771C47768P65J254J630K188J995J66k209k619j37L136M259K702N49k27K85Q13
52755C62318O44q3j114k128k542k167j991l295n810p635p317n445l772l323l725
52740C12615l961l363k216j630k366l658l966l109k579l295m165l941l337l776
52726B67253m816m698l235k198k510k891k085r30j051k562m196n026n079m605
52712B21371l700k450q97Q12J915J351p82k687k761j522q55j620k872l386l006
$$ y = [313317, 314910, 317623, 320974, 324061, 326064, 326403, 324954, 322496, 320602, 320425, 321682, 323291, 324678, 325736, 325903, 324555, 322490, 321641, 322667, 323920, 323720, 322664, 322525, 323630, 324845, 325896, 327932, 331373, 334650, 336035, 335805, 335536, 335877, 336231, 336366, 337087, 338974, 341409, 343494, 345274, 347276, 349186, 349932, 349190, 348043, 347768, 348533, 349787, 351417, 353605, 355600, 355766, 353557, 350938, 350801, 353937, 358196, 360898, 361447, 361220, 361505, 362318, 362962, 362879, 361765, 359637, 357095, 354928, 352937, 349642, 343832, 336197, 328880, 323435, 319663, 316340, 312615, 308654, 305291, 303075, 301445, 299079, 295421, 291455, 288346, 285767, 282472, 278307, 274366, 271029, 267253, 262437, 257739, 254504, 252306, 249796, 246905, 244820, 243890, 242839, 240277, 236081, 231055, 225976, 221371, 217671, 215221, 214324, 215136, 217051, 218402, 217620, 214933, 212172, 210650, 209795, 208175, 205303, 201917, 198911]
52697A98911k457k461l145l889l837k950k387l161m658n281m431k998j928j204
52683A54124o41o00j263j854j485n01j42q86j819j854r91r8J34l44j301k393l088
52666A34998k868j873r01m87k69L10J007J154Q67R77J569J494l2k020k786k050
52650A29090j013n25k68O8j42j370k723k785j505l33k98o61N8K090M039M459L366
52633A31547K058J632J935K001J257M9r40j472j676j442m33J232K754L432L363
52618A45297L075K790K476K338K611K967K752J970J402J482J638J089j23j288
52604A70476j845j685r28O2O38K24j149k845l974l822k379o43J26l37j141j546
52588A49232j798k330k856k877k543k215j672n41P70J459J415J106O88M8m63l31
$$ y = [198911, 196454, 193993, 190848, 186959, 183122, 180172, 177785, 174624, 169966, 164685, 160254, 157256, 155328, 154124, 153483, 152883, 151620, 149766, 148281, 147780, 147638, 146752, 144933, 143079, 142088, 141990, 142124, 141780, 140479, 138086, 134998, 132130, 130257, 129356, 128869, 128600, 128910, 129917, 131071, 131938, 132915, 134484, 135978, 135946, 133926, 131140, 129090, 128077, 127552, 127284, 127352, 127210, 125840, 123117, 120332, 118827, 118494, 118196, 117535, 117593, 119683, 123722, 128181, 131547, 133605, 135237, 137172, 139173, 140430, 140479, 139539, 138067, 136391, 134949, 134516, 135748, 138502, 141934, 145297, 148372, 151162, 153638, 155976, 158587, 161554, 164306, 166276, 167678, 169160, 170798, 171887, 171764, 170476, 168631, 166946, 166018, 166080, 166718, 166942, 165793, 162948, 158974, 155152, 152773, 152130, 152256, 151919, 150778, 149232, 147434, 145104, 142248, 139371, 136828, 134613, 132941, 132400, 133170, 134629, 136044, 137150, 137838, 137886, 137423, 137092]
52572A37092J01q8r82j600j270l88L79Q75J076P06k94j386j895j652j023n72o95
52555A28384j227j527j310j098j256j043M36K526L429K464Q44j22o02j429k524
52540A25945k824j561Q01K751K890J264n83j156l73R55K268L105K657Q91m60K97
52524A36867K254K948J916J197K002L052L017K535K556K578J950J443J868K431
52510A68614K043J212J000J057M04n37n16M18J043R69R52J329J577J501J655K406
52494A85127L371L838L172J247q89j474q8J469J459N56N76J547J900J227R15J807
52478B05760K923K943J807L97l67R4J556K812K872K276K209K493J890L35o94l88
52462B28918L42M35L4l43o12n58L25J651K007R14k04Q1J301K153K445K649K333
$$ y = [137092, 137193, 137105, 136123, 134523, 133253, 132865, 133244, 134119, 135195, 135901, 135607, 134221, 132326, 130674, 129651, 129079, 128384, 127157, 125630, 124320, 123222, 121966, 120923, 121359, 123885, 127314, 129778, 130622, 130500, 129898, 128469, 125945, 123121, 121560, 122361, 125112, 128002, 129266, 128683, 127527, 127154, 128109, 130377, 133482, 136139, 137030, 136570, 136867, 139121, 142069, 143985, 145182, 147184, 150236, 153253, 155788, 158344, 160922, 162872, 164315, 166183, 168614, 170657, 171869, 172869, 173926, 174330, 173793, 173277, 173695, 174738, 175707, 176659, 177988, 179565, 181066, 182721, 185127, 188498, 192336, 195508, 196755, 195866, 194392, 194304, 195773, 197232, 197788, 198364, 199911, 201811, 203038, 203953, 205760, 208683, 211626, 213433, 213830, 213463, 213557, 215113, 217925, 220797, 223073, 225282, 227775, 229665, 230000, 229306, 228918, 229260, 229695, 229729, 229386, 228774, 228216, 228541, 230192, 232199, 233113, 232909, 232990, 234291, 236444, 238889, 241538, 243871]
52445B43871P02j564k611j855q08r40j739j682m01R70J396J073Q54J184J907K633
52429B42990K945K531J612J032J405K285K626J977O66r07k266k315k35K757L870
52414B60973J902j200k854k801k329j725l64J196J386O3r50l12J193K037J854
52399B58069J322R99R92J218J443J394J098P86N10L01N19J387K270K349J920K070
52383B78647K875K999J550n40j570r39M81J453J475J041R68J369J477Q00J6M5
52367B92147O50P81J19o67j105j371j576j489j021k87O92J567J418m4j472j383
52351B86959k88J75r2K48J347J735R28K58M66M96l14q39l16L4r31k108j790k83
52333B85685R26J555K305L037L100K862L179L687L286K078J227J047P40Ln62p59
$$ y = [243871, 244573, 243009, 240398, 238543, 237735, 236795, 235056, 233374, 232973, 233943, 235339, 236412, 237266, 238450, 240357, 242990, 245935, 248466, 250078, 251110, 252515, 254800, 257426, 259403, 260069, 259162, 256896, 254581, 254346, 257103, 260973, 262875, 261675, 258821, 256020, 253691, 251966, 251602, 252798, 254184, 254247, 253297, 252985, 254178, 256215, 258069, 259391, 260390, 261382, 262600, 264043, 265437, 266535, 267321, 267831, 268132, 268651, 270038, 272308, 274657, 276577, 278647, 281522, 284521, 286071, 285531, 283961, 283022, 283503, 284956, 286431, 287472, 288440, 289809, 291286, 292086, 292102, 292147, 292797, 293578, 293697, 293030, 291925, 290554, 288978, 287489, 286468, 286181, 286873, 288440, 289858, 289814, 288342, 286959, 286671, 286846, 286754, 287002, 288349, 290084, 291012, 291270, 291736, 292232, 291918, 291079, 290763, 290797, 289866, 287758, 285968, 285685, 286611, 288166, 290471, 293508, 296608, 299470, 302649, 306336, 309622, 311700, 312927, 313974, 314714, 314717, 314155, 313396]
52317C13396j125j743j878j102J69J367K139K180J647J596K768M131L978K483
52303C30006J608K196K819K251J432J818K977L399K949K890L674M171L427K041
52289C67658J332J805L001M287N243N609N399N033M903M876M585M113L901L986
52275D25731L888L401K937K893L174L771N119P210Q970R363Q761Q292Q143P655
52261E09308P013P455R453J1757J2810J2350J1161J0084R788J0712J2583J4445
52249F38919J5643J6249J6441J6276J6318J7393J9153K0005J9262J8390J9149
52238H33198K1460K4085K6443K8449K9369K8506K6736K5894K6649K8161K9639
52227A128589L0923L1569L0907K9265K7960K7564K7145K5704K3462K1312J9816
$$ y = [313396, 312271, 310528, 308650, 307548, 307717, 309084, 311223, 313403, 315050, 316646, 319414, 323545, 327523, 330006, 331614, 333810, 336629, 338880, 340312, 342130, 345107, 348506, 351455, 354345, 358019, 362190, 365617, 367658, 368990, 370795, 373796, 378083, 383326, 388935, 394334, 399367, 404270, 409146, 413731, 417844, 421745, 425731, 429619, 433020, 435957, 438850, 442024, 445795, 450914, 458124, 467094, 476457, 485218, 493510, 501653, 509308, 516321, 523776, 533229, 544986, 557796, 570146, 581307, 591391, 601179, 611891, 624474, 638919, 654562, 670811, 687252, 703528, 719846, 737239, 756392, 776397, 795659, 814049, 833198, 854658, 878743, 905186, 933635, 963004, 991510, 1018246, 1044140, 1070789, 1098950, 1128589, 1159512, 1191081, 1221988, 1251253, 1279213, 1306777, 1333922, 1359626, 1383088, 1404400, 1424216]
52216A424216J9195J9527K0337K0558J9447J7127J3991J0278O672M580M801O273
52204A587002O952N973M302L186K660J874L88j374k727l299k935j616L27K216
52190A602929L680N078O900Q999J0808J2130J3132J3736J3766J3754J4716J6840
52178A736468J9107K0543K1140K1199K0704K0013K0259K1897K3347K2342J8745
52167A965764J4881J2828J2242J1330R256O694M350K009n95k743l691m370o817
52154B021138j1293j5227j6221j5286j5345j7051j8209j7584j7039j8684k1597
52143A837602k2953k1512j8523j5931j4971j5899j7663j8179j6190j2762j0033
52132A652986q825q432q297q629r311r469q399o411m623m197n407o927o814m763
$$ y = [1424216, 1443411, 1462938, 1483275, 1503833, 1523280, 1540407, 1554398, 1564676, 1571348, 1575928, 1580729, 1587002, 1593954, 1599927, 1604229, 1607415, 1610075, 1611949, 1612337, 1610963, 1608236, 1604937, 1602002, 1600386, 1600713, 1602929, 1606609, 1611687, 1618587, 1627586, 1638394, 1650524, 1663656, 1677392, 1691158, 1704912, 1719628, 1736468, 1755575, 1776118, 1797258, 1818457, 1839161, 1859174, 1879433, 1901330, 1924677, 1947019, 1965764, 1980645, 1993473, 2005715, 2017045, 2026301, 2032995, 2037345, 2039354, 2038759, 2036016, 2032325, 2027955, 2021138, 2009845, 1994618, 1978397, 1963111, 1947766, 1930715, 1912506, 1894922, 1877883, 1859199, 1837602, 1814649, 1793137, 1774614, 1758683, 1743712, 1727813, 1710150, 1691971, 1675781, 1663019, 1652986, 1644161, 1635729, 1627432, 1618803, 1609492, 1600023, 1591624, 1585213, 1580590, 1576393, 1570986, 1564059, 1557245, 1552482]
52118A552482k842l073m958o411o369n350m091l176l512n542p957q666p263n443
52104A477829m987o269q521j0361j0307q142n660m843n461n883n712n834o177
52091A389672n718m812n087o413o440m231k036j950k894k843k219k759m289n060
52077A332921m666m281m250l605k165j097r94j116j122j972m128o119o062m027
52063A287317j847r19r99j077n71L70J321J996K506L299M701O370P461P581P506
52048A325015Q598J1361J4903J7857J9661K0644K1338K2157K3464K5320K7154
52037A537472K8312K8986L0132L2268L4788L6660L7323L6819L5527L4182L3663
52026A906132L4163L4651L3696L0975K7750K5536K4494K3417K1385J8818J6508
$$ y = [1552482, 1549640, 1546567, 1541609, 1535198, 1528829, 1523479, 1519388, 1516212, 1512700, 1507158, 1499201, 1490535, 1483272, 1477829, 1472842, 1466573, 1458052, 1447691, 1437384, 1429242, 1423582, 1418739, 1413278, 1407395, 1401683, 1395849, 1389672, 1383954, 1379142, 1374055, 1367642, 1361202, 1356971, 1354935, 1352985, 1350091, 1347248, 1345029, 1342270, 1337981, 1332921, 1328255, 1323974, 1319724, 1316119, 1313954, 1312857, 1311863, 1310747, 1309625, 1307653, 1303525, 1297406, 1291344, 1287317, 1285470, 1284551, 1283552, 1282475, 1281904, 1282274, 1283595, 1285591, 1288097, 1291396, 1296097, 1302467, 1309928, 1317509, 1325015, 1333613, 1344974, 1359877, 1377734, 1397395, 1418039, 1439377, 1461534, 1484998, 1510318, 1537472, 1565784, 1594770, 1624902, 1657170, 1691958, 1728618, 1765941, 1802760, 1838287, 1872469, 1906132, 1940295, 1974946, 2008642, 2039617, 2067367, 2092903, 2117397, 2140814, 2162199, 2181017, 2197525]
52015B197525J4089J0488N849J882j40q23j549k938n173q697j3199j6651j7027
52002B163636j4850j2734j2340j3024j3417j3025j1984j0481q968p969p292o169
51990B031383m322k265m21J151K229K697L357N274P959R462Q686O622M987M689
51976B081488N892Q235J0332J0380Q134N382L811L306K937K424J786N98j378l594
51962B139733n618p855j0567j3060j4680j5794j6904j7725j8172j9242k1645k4311
51950A954160k5690k5961k6613k8197k9892l1093l2013l2858l3592l4586l6292
51939A617373l8054l8489l7416l6401l6865l8333l9207l8835l8110l8021l8198
51928A199444l7337l5039l2537l1194l0757l0020k8870k8450k9188l0036l0124
$$ y = [2197525, 2211614, 2222102, 2227951, 2229833, 2229693, 2228870, 2227321, 2224383, 2219210, 2210513, 2197314, 2180663, 2163636, 2148786, 2136052, 2123712, 2110688, 2097271, 2084246, 2072262, 2061781, 2052813, 2044844, 2037552, 2031383, 2027061, 2024796, 2024375, 2025526, 2027755, 2030452, 2033809, 2039083, 2047042, 2056504, 2065190, 2071812, 2076799, 2081488, 2087380, 2095615, 2105947, 2116327, 2124461, 2129843, 2133654, 2136960, 2139897, 2142321, 2144107, 2144705, 2143327, 2139733, 2134115, 2126260, 2115693, 2102633, 2087953, 2072159, 2055255, 2037530, 2019358, 2000116, 1978471, 1954160, 1928470, 1902509, 1875896, 1847699, 1817807, 1786714, 1754701, 1721843, 1688251, 1653665, 1617373, 1579319, 1540830, 1503414, 1467013, 1430148, 1391815, 1352608, 1313773, 1275663, 1237642, 1199444, 1162107, 1127068, 1094531, 1063337, 1032580, 1002560, 973690, 945240, 916052, 886016, 855892]
51917H55892k9807k9383k8131k5720k3326k2044k1165j9413j7138j5693j5225
51906F08847j4668j3559j2349j1158r735q641q890j0208j0965j0196q527o894
51894D83057n484m328l935m687o253p883q854q679p524o423o296o728o504n245
51880C94234l759k818k498k704l318l721l160j916j242j893l328m517m811m049
51866C50500k601j449j413k131k516k185j626j012p3P81M17j463l642m738m487
51851C22362l449k354k034k955m314m464k823o39N04J86j144l004m809n816n770
51836B79477n139m371l528k829k519k038n59J233J353o37k491k243r81j013k294
51821B51421k687j416k09p04k305l298k929j785q04n06p97j086q19K4J088K044
$$ y = [855892, 826085, 796702, 768571, 742851, 719525, 697481, 676316, 656903, 639765, 624072, 608847, 594179, 580620, 568271, 557113, 547378, 538737, 529847, 519639, 508674, 498478, 489951, 483057, 477573, 473245, 469310, 464623, 458370, 450487, 441633, 432954, 425430, 419007, 412711, 405983, 399479, 394234, 390475, 387657, 385159, 382455, 379137, 375416, 372256, 370340, 369098, 367205, 363877, 359360, 354549, 350500, 347899, 346450, 345037, 342906, 340390, 338205, 336579, 335567, 335494, 336275, 336692, 335229, 331587, 326849, 322362, 318913, 316559, 314525, 311570, 307256, 302792, 299969, 299330, 299834, 300020, 298876, 295872, 291063, 285247, 279477, 274338, 269967, 266439, 263610, 261091, 259053, 258494, 259727, 261080, 260443, 257952, 255709, 254728, 253715, 251421, 248734, 247318, 247109, 246405, 244100, 240802, 237873, 236088, 235284, 234778, 233981, 232895, 232076, 232100, 233188, 235232]
51805B35232K477J853K46j182j231r6J054J746K524L567M036L265J766O56N39
51790B56452J306K470L359L378K594J707J316J455J974K831L772M243L977L308
51776B94142K610J912J226P75N07j14j389k846l821m121l794k828j668j268j829
51761B77494k043o92J395K200J262J43L5L12L3m70m18M4L80Q00J624K177J618
51744B85894N67M80J509K215J687O18q2n68j284j915j941j610j464j341o87L92
51728B82470J084Q48q3j123j819j983j635q86K23J611K917L674L870L906L849
51713B96923L181J641k04j553k184k313k089j645j225q03l1J024J551J026J02
51698B93401r8P28J987L066L638L546L048K876L370L838L523K814K716L386M066
$$ y = [235232, 237709, 239562, 239808, 238626, 237395, 237299, 238353, 240099, 242623, 246190, 250226, 253491, 255257, 255913, 256452, 257758, 260228, 263587, 266965, 269559, 271266, 272582, 274037, 276011, 278842, 282614, 286857, 290834, 294142, 296752, 298664, 299890, 300665, 301172, 301058, 299669, 296823, 293002, 288881, 285087, 282259, 280591, 279323, 277494, 275451, 274759, 276154, 278354, 279616, 279759, 279794, 280106, 280139, 279669, 279251, 279295, 279675, 280475, 282099, 284276, 285894, 286461, 286941, 288450, 290665, 292352, 292970, 292888, 292320, 291036, 289121, 287180, 285570, 284106, 282765, 282078, 282470, 283554, 284402, 284319, 283196, 281377, 279394, 277759, 276873, 277096, 278707, 281624, 285298, 289168, 293074, 296923, 300104, 301745, 301541, 299988, 297804, 295491, 293402, 291757, 290532, 289729, 289698, 290722, 292273, 293299, 293401, 293303, 294031, 296018, 299084, 302722, 306268, 309316, 312192, 315562, 319400, 322923, 325737, 328453, 331839, 335905]
51683C35905M313M380M511M738N335O537P886Q604Q642Q507Q243P643P275Q022
51669D30541R388R649Q180O369N573N282M198K204L14p83j170j037m48L85J090
51654D79735J319P52n75j926k500k630l448m913n216l034N05L086L735L016J510
51639D69416m75k020k005o15P93J488J922K313K037R92L38R47J964K031J427J726
51623D82279L542N665O701O580N991N097L642J946Q27M26j27j454k869l204k361
51608E12681j331o65J68J638L123L732L664L859M519M742L935K680J910J658J225
51593E47538K65q61j675k100k362k797l671m866n767n842n260m592m035l589l809
51578D96577n337p437q123o582m537m175n407o442o427n925n138l666k270k709
$$ y = [335905, 340218, 344598, 349109, 353847, 359182, 365719, 373605, 382209, 390851, 399358, 407601, 415244, 422519, 430541, 439929, 449578, 457758, 464127, 469700, 474982, 479180, 481384, 481698, 480915, 479745, 478708, 478260, 478645, 479735, 481054, 481806, 481231, 479305, 476805, 474175, 470727, 465814, 460598, 457564, 458069, 461155, 464890, 467906, 469416, 468941, 466921, 464916, 464301, 465094, 466582, 468504, 470817, 472854, 473846, 474184, 475131, 477095, 479126, 480553, 482279, 485821, 491486, 498187, 504767, 510758, 515855, 519497, 521443, 522270, 522696, 522569, 521115, 518246, 515042, 512681, 511350, 510685, 510853, 512491, 515614, 519346, 523010, 526869, 531388, 536130, 540065, 542745, 544655, 546313, 547538, 547803, 546942, 545267, 543167, 540805, 538008, 534337, 529471, 523704, 517862, 512602, 508010, 503975, 500386, 496577, 491240, 483803, 475680, 469098, 464561, 460386, 454979, 448537, 442110, 436185, 431047, 427381, 425111, 422402]
51564D22402m898o091m381j508n28j747k896k628j856j711k104k510k734k521
51550C84289j635o42m73j076j573j777k261k840k506j229l59n47p10R2J089J175
51534C69017O90O14Q52O25K3n4P16J776K611L129L318L181K920K663K270J872
51518C96223K114L336M859N728N713N165M381L702L577L828L463K063P08N41R77
51503D46378N31r92k427l102l393l462k863j680q84j021j548j872k085k174j554
51488D17852k9J512K150K135K403L368M764O168O970O421M583K902K867M146M924
51473D73136M099K380J023L78J58L06Q81J437J445J188J510K415K739J567m19
51458D94243j558j075J56P41L19k70j93K34k2j148j861q87J195K456K054J203
$$ y = [422402, 417504, 411413, 407032, 405524, 404996, 403249, 400353, 397725, 395869, 394158, 392054, 389544, 386810, 384289, 382654, 382012, 381539, 380463, 378890, 377113, 374852, 372012, 369506, 368277, 367918, 367371, 366661, 366753, 367842, 369017, 369707, 370321, 371173, 371798, 371821, 371767, 372483, 374259, 376870, 379999, 383317, 386498, 389418, 392081, 394351, 396223, 398337, 401673, 406532, 412260, 417973, 423138, 427519, 431221, 434798, 438626, 442089, 444152, 444860, 445401, 446378, 446909, 445917, 443490, 440388, 436995, 433533, 430670, 428990, 428106, 427085, 425537, 423665, 421580, 419406, 417852, 417823, 419335, 421485, 423620, 426023, 429391, 434155, 440323, 447293, 453714, 458297, 461199, 464066, 468212, 473136, 477235, 479615, 480638, 481016, 481174, 481480, 482361, 483798, 485243, 486431, 487941, 490356, 493095, 494662, 494243, 492685, 491610, 491766, 492507, 492826, 492556, 492363, 492597, 492575, 491427, 489566, 488679, 489874, 492330, 494384, 495587]
51442D95587J223J606R47r03k756l721l806l207k237j946l302n443o127m484k367
51427D59064k118l916n935o409m841j974O76J798J561J391J985K289J259k32l89
51412D44209J028K470K724K182J884K201K816L428M052M820N648O163O163O092
51398D95880O525P128O958O030N673O553P381O613M747L686M195N246N682N279
51384E77576M153K337K74j245j948k249k341j829n21J050K079K095J151q5o07
51369E79890o2O83O56K04L88J110J141J13o98k04Q92J078j22j990l701m799m994
51352E69585m320l414l047l290l507l232k711k584l186m235n039m979l880k113
51338E20048m97J65k51r73j267j426k215l320l356j899l98j72m71K54J724K121
$$ y = [495587, 496810, 498416, 499363, 498460, 495704, 491983, 488177, 484970, 482733, 480787, 477485, 472042, 465915, 461431, 459064, 456946, 453030, 447095, 440686, 435845, 433871, 434547, 436345, 437906, 439297, 441282, 443571, 444830, 444598, 444209, 445237, 447707, 450431, 452613, 454497, 456698, 459514, 462942, 466994, 471814, 477462, 483625, 489788, 495880, 502405, 509533, 516491, 522521, 528194, 534747, 542128, 548741, 553488, 557174, 561369, 566615, 572297, 577576, 581729, 584066, 584340, 583095, 581147, 578898, 576557, 574728, 574207, 575257, 577336, 579431, 580582, 580497, 579890, 579828, 580511, 581167, 581371, 581759, 582869, 584010, 584123, 583425, 583221, 584113, 585191, 585069, 583079, 579378, 574579, 569585, 565265, 561851, 558804, 555514, 552007, 548775, 546064, 543480, 540294, 536059, 531020, 526041, 522161, 520048, 519551, 519716, 519465, 518492, 517225, 515799, 513584, 510264, 506908, 505009, 504611, 504439, 503968, 504222, 505946, 508067]
51322E08067Q22o98j153j194k211m137n317m403j901Q5j71k245m098m657n035
51307D71754o412p798p443n884n670p764j0204j0895j0116r314q848q148p144
51294C66114o311n786n382n084m764l899k312q34n26j494k889l808l872l305k758
51279C13090k722k960k942k818l122l536l037j572m30m21q15p59o05q89j140p43
51263B84579j12P5P0L43M25k64j102r90J6J087K154L678N203N589M786L977L904
51246C13418M150M315M603M931M610L478K499K481K795K138K55j652k310j738
51232C43973j088j228j906k502l136m224n194m866l313k135k195k452j908j462
51218C06364k429m254n349n471n554n702n205m307m059m394m146l094k216j691
$$ y = [508067, 508889, 508191, 507038, 505844, 503633, 499496, 494179, 489776, 487875, 487960, 487789, 485544, 481446, 476789, 471754, 465342, 457544, 450101, 444217, 438547, 430783, 420579, 409684, 399568, 390254, 381406, 373258, 366114, 359803, 354017, 348635, 343551, 338787, 334888, 332576, 331742, 331216, 329722, 326833, 323025, 319153, 315848, 313090, 310368, 307408, 304466, 301648, 298526, 294990, 291953, 290381, 289951, 289530, 288715, 287956, 287351, 286462, 285322, 284579, 284467, 284542, 284612, 284955, 285380, 285116, 284014, 283024, 283040, 284127, 286281, 289959, 295162, 300751, 305537, 309514, 313418, 317568, 321883, 326486, 331417, 336027, 339505, 342004, 344485, 347280, 349418, 349673, 348021, 345711, 343973, 342885, 341657, 339751, 337249, 334113, 329889, 324695, 319829, 316516, 314381, 312186, 309734, 307826, 306364, 303935, 299681, 294332, 288861, 283307, 277605, 272400, 268093, 264034, 259640, 255494, 252400, 250184, 248493]
51204B48493o39P43Q06q73k425k458k174l208m744m600k350K84J673J540L51j199
51188B29220k182k011j024O3J002J786K169K215K684L932M866M062J632q82k135
51173B45397j761q5J970L096K737J728R71R5j450k716k272n39O56P34P49J042
51157B50352N38j005k032j491m17j1L95J887L675M024K816J540J085J015Q42N59
51141B63772o6j404l006l902l830l200j885N95L499M911L912J595n86k241l204
51126B54960k718p73Q10K41j659k325q33R73J027n43k118k774k833k725k302j375
51110B35033m42m25j650l266l922l128j695o41K8R61K170K767K145Q12l40j169
51094B27238k132l213l526k354l10J018P62k46o12k03j79j137k161k192j553j318
$$ y = [248493, 247854, 248597, 249403, 248530, 246105, 243647, 241473, 238265, 233521, 228921, 226571, 226855, 228528, 230068, 230419, 229220, 227038, 225027, 224003, 224066, 225068, 226854, 229023, 231238, 233922, 237854, 242720, 246782, 248414, 247532, 245397, 243636, 243551, 245521, 248617, 251354, 253082, 254053, 254148, 252698, 249982, 247710, 247171, 247827, 248561, 249310, 250352, 250890, 249885, 247853, 246362, 245945, 245934, 246329, 248216, 251891, 255915, 258731, 260271, 261356, 262371, 263213, 263772, 263706, 262302, 259296, 255394, 251564, 248364, 246479, 247074, 250573, 255484, 259396, 260991, 260405, 258164, 254960, 252242, 251469, 252279, 252520, 250861, 248536, 247703, 248676, 249703, 249160, 247042, 244268, 241435, 238710, 236408, 235033, 234591, 234166, 232516, 229250, 225328, 222200, 220505, 219864, 219892, 220853, 223023, 225790, 227935, 228747, 228407, 227238, 225106, 221893, 218367, 216013, 215703, 216721, 217483, 217237, 216625, 216422, 216243, 215106, 212945, 210753, 209200, 207882]
51078B07882j694k000j884j585j093j82P76J000M95N5m0k84n79L3J741L151L063
51061B08855K045J347J163J028J116J799K468K200J405J402K354K955K339J206
51047B33682O93J025J665K063J897J227N59L05J51l04m92N07K196K766J387o76
51031B48651j857k069j973j448j4J833K842K475J326K55k30N8Q83J522J403Q02
51015B54459M56O69J235J856K088J361j56j099k90J481K226J346L67P24J918K474
50999B71115J829M83j037k354k829k029n13O65J223J758K480K738K014P43l21
50984B75965r68j232o96J100L606N303N212L960L041L194L834L992L468K840K529
50969C15148K253J575O70K18N37J249J853K309K771L139L254L308L609M066M451
$$ y = [207882, 206188, 204188, 202304, 200719, 199626, 199444, 200220, 201220, 201715, 201770, 201730, 201446, 200867, 200900, 202641, 205792, 208855, 210900, 212247, 213410, 214438, 215554, 217353, 219821, 222021, 223426, 224828, 227182, 230137, 232476, 233682, 234375, 235400, 237065, 239128, 241025, 242252, 242811, 243116, 243267, 242963, 242471, 242978, 245174, 247940, 249327, 248651, 246794, 244725, 242752, 241304, 241290, 243123, 245965, 248440, 249766, 250021, 249791, 249849, 250732, 252254, 253657, 254459, 254915, 255584, 256819, 258675, 260763, 262124, 261968, 260869, 260579, 262060, 264286, 265632, 265999, 266723, 268641, 271115, 272944, 273427, 272390, 270036, 267207, 265178, 264665, 265330, 266553, 268311, 270791, 273529, 275543, 276286, 275965, 274997, 273765, 273069, 274169, 277775, 283078, 288290, 292250, 295291, 298485, 302319, 306311, 309779, 312619, 315148, 317401, 318976, 319646, 319864, 320401, 321650, 323503, 325812, 328583, 331722, 334976, 338284, 341893, 345959, 350410]
50954C50410M939N802O566O193M450K474J686K576M685P095Q660Q573P335O495
50940D27939O735O982O189N208N699P721R913J1720J3771J5987J7119J6785J6439
50927E68207J7373J9065K0466K1800K3813K6131K7791K8860L0330L2699L5767
50916H52302L9476M3849M8251N1870N4808N7756O0894O4194O8483P4692Q1948
50905A498523Q7958R1687R4362R7296R9990J01198J00765R9413R7366R4203Q9607
50894B552368Q3511P5916O7212N8243M9442M0325L0502K0687J1965M425k692r708
50882B982196j6080k1103k4342k5578k5018k3559k2334k1922k2484k4358k7957
50871B727461l3058l8712m3931m8167n1497n4751n9115o4892p0785p5138p7682
$$ y = [350410, 355349, 361151, 367717, 373910, 378360, 380834, 382520, 385096, 389781, 396876, 405536, 414109, 421444, 427939, 434674, 441656, 447845, 453053, 458752, 466473, 476386, 488106, 501877, 517864, 534983, 551768, 568207, 585580, 604645, 625111, 646911, 670724, 696855, 724646, 753506, 783836, 816535, 852302, 891778, 935627, 983878, 1035748, 1090556, 1148312, 1209206, 1273400, 1341883, 1416575, 1498523, 1586481, 1678168, 1772530, 1869826, 1969816, 2071014, 2171779, 2271192, 2368558, 2462761, 2552368, 2635879, 2711795, 2779007, 2837250, 2886692, 2927017, 2957519, 2978206, 2990171, 2994596, 2991904, 2982196, 2966116, 2945013, 2920671, 2895093, 2870075, 2846516, 2824182, 2802260, 2779776, 2755418, 2727461, 2694403, 2655691, 2611760, 2563593, 2512096, 2457345, 2398230, 2333338, 2262553, 2187415, 2109733]
50860B109733p9360q0512q0271p7959p4305p0704o7819o5224o2099n7990n3146
50849A340344m8309m4069m0422l7067l3881l0667k6832k2048j7202j3825j2404
50838A013618j1931j1278j0312r395q520p331n639l570j455L34J753L231N019
50825I54524O697P916R199J0949J2101J1360R864J0733J5155K0589K3901K4940
50813A117928K5621K6852K8180K9752L2518L6480M0389M3463M6253M9576N3585
50802A530597N8108O3056O8312P3850Q0072Q7384R5537J04021J12881J22579J33339
50791B529736J45262J58494J72431J85295J95677K04047K11512K17729K21480
50782D241663K22769K22451K19958K13408K02140J87127J68718J46219J20493
$$ y = [2109733, 2030373, 1949861, 1869590, 1791631, 1717326, 1646622, 1578803, 1513579, 1451480, 1393490, 1340344, 1292035, 1247966, 1207544, 1170477, 1136596, 1105929, 1079097, 1057049, 1039847, 1026022, 1013618, 1001687, 990409, 980097, 970702, 962182, 954851, 949212, 945642, 944187, 944521, 946274, 949505, 954524, 961221, 969137, 978336, 989285, 1001386, 1012746, 1022610, 1033343, 1048498, 1069087, 1092988, 1117928, 1143549, 1170401, 1198581, 1228333, 1260851, 1297331, 1337720, 1381183, 1427436, 1477012, 1530597, 1588705, 1651761, 1720073, 1793923, 1873995, 1961379, 2056916, 2160937, 2273818, 2396397, 2529736, 2674998, 2833492, 3005923, 3191218, 3386895, 3590942, 3802454, 4020183, 4241663, 4464432, 4686883, 4906841, 5120249, 5322389, 5509516, 5678234, 5824453, 5944946]
50773E944946R4616P0680M7756K4294R02k0635l9284n4154o3635o7217o6870o4660
50761E806739o0272n3109m5642m1959m3369m7995n4506o3541p5234q7957j00412
50750E132743j12896j25775j38494j50904j63544j75569j84197j87599j86949
50741C706816j84405j80444j74495j66891j58449j49051j38361j27288j17132
50732B310300j07704r7979q8286q0153p3835o7653o0329n2713m6509m2116l8537
50721A554486l4813l0885k7301k4575k2765k1429j9949j8043j6009j4454j3778
50710A310485j3645j3046j1230q685o689n618m425k261J6Q44J92j08J712N623
50696A253165R893J2545J3096J3353J5900K1069K6099K8470K9373L2105L7297
$$ y = [5944946, 6039562, 6110242, 6157998, 6182292, 6183194, 6162559, 6123275, 6069121, 6005486, 5938269, 5871399, 5806739, 5746467, 5693358, 5647716, 5605757, 5562388, 5514393, 5459887, 5396346, 5321112, 5233155, 5132743, 5019847, 4894072, 4755578, 4604674, 4441130, 4265561, 4081364, 3893765, 3706816, 3522411, 3341967, 3167472, 3000581, 2842132, 2693081, 2554720, 2427432, 2310300, 2202596, 2104617, 2016331, 1936178, 1862343, 1794690, 1734361, 1681648, 1635139, 1593023, 1554486, 1519673, 1488788, 1461487, 1436912, 1414147, 1392718, 1372769, 1354726, 1338717, 1324263, 1310485, 1296840, 1283794, 1272564, 1263879, 1257190, 1251572, 1247147, 1244886, 1244902, 1245746, 1245938, 1245830, 1247542, 1253165, 1263058, 1275603, 1288699, 1302052, 1317952, 1339021, 1365120, 1393590, 1422963, 1455068, 1492365]
50685A492365M1962M3912M4928M8179N4117O0718O6626P2143P7644Q3059Q8957
50674B174610R6390J05215J13871J21225J27520J33135J37547J40087J40862J40239
50664C430701J38046J33757J26862J16729J02902Q6032O7728M8961K9372Q853
50654D289943j1109k8513m2688n4053o2612o7810o9573o8351o4404n8109n1033
50643C711688m5393m2153m0475l9450l9477m1575m6022n2227n9497o7490p6227
50632C161702q5777r5601j04157j09793j12147j12113j10408j06961j01923r6224
50622B126598r0572q4788p8737p3089o8199o2968n6077m8055m1030l6286l2985
50611A453812k9451k4919j9799j4920j0930q010n853l972k068Q4K879O479J0240
$$ y = [1492365, 1534327, 1578239, 1623167, 1671346, 1725463, 1786181, 1852807, 1924950, 2002594, 2085653, 2174610, 2271000, 2376215, 2490086, 2611311, 2738831, 2871966, 3009513, 3149600, 3290462, 3430701, 3568747, 3702504, 3829366, 3946095, 4048997, 4135029, 4202757, 4251718, 4281090, 4289943, 4278834, 4250321, 4207633, 4153580, 4090968, 4023158, 3953585, 3885234, 3820830, 3762721, 3711688, 3666295, 3624142, 3583667, 3544217, 3504740, 3463165, 3417143, 3364916, 3305419, 3237929, 3161702, 3075925, 2980324, 2876167, 2766374, 2654227, 2542114, 2431706, 2324745, 2222822, 2126598, 2036026, 1951238, 1872501, 1799412, 1731213, 1668245, 1612168, 1564113, 1523083, 1486797, 1453812, 1424361, 1399442, 1379643, 1364723, 1353793, 1345783, 1339930, 1335958, 1333890, 1333974, 1336853, 1343332, 1353572]
50598A353572J3089J4674J5810J7711K1067K5724L0795L4933L7251L8278L9674
50587A642578M2642M6851N1157N5015N8721O2532O6111O8954P1018P2704P4353
50576B312636P5972P7350P8248P8457P7739P5885P2788O8534O3538N8443N3533
50565C093123M8177M1426L3586K6575K1901J8695J4798R823N758M176M066L346
50553C325450J525k91j254j400r07j03o2j711m251n692n500n722q973j5997k5540
50538C249572l5816m5602n4559o3016p1096p7942q2380q4489q5645q6668q6842
50527B475517q5346q2735q0083p7345p3593o8586o3183n8306n4192n0605m7047
50516A734496m2799l7458l1583k6322k2362j9508j7143j4611j1276o863j902K551
$$ y = [1353572, 1366661, 1381335, 1397145, 1414856, 1435923, 1461647, 1492442, 1527375, 1564626, 1602904, 1642578, 1685220, 1732071, 1783228, 1838243, 1896964, 1959496, 2025607, 2094561, 2165579, 2238283, 2312636, 2388608, 2465958, 2544206, 2622663, 2700402, 2776287, 2849075, 2917609, 2981147, 3039590, 3093123, 3141300, 3182726, 3216312, 3242887, 3264788, 3283483, 3298281, 3308104, 3313862, 3318038, 3322104, 3325450, 3326975, 3326684, 3325430, 3324030, 3323123, 3323020, 3322958, 3321247, 3316996, 3311304, 3305804, 3300082, 3291109, 3275112, 3249572, 3213756, 3168154, 3113595, 3050579, 2979483, 2901541, 2819161, 2734672, 2649027, 2562359, 2475517, 2390171, 2307436, 2227353, 2150008, 2076415, 2007829, 1944646, 1886340, 1832148, 1781543, 1734496, 1691697, 1654239, 1622656, 1596334, 1573972, 1554464, 1537321, 1522710, 1511434, 1504571, 1502669, 1505220]
50504A505220N789P871R343J0879J3000J5702J8317K0243K1717K3489K5708K7763
50492A705041K9307L0794L2772L5057L7020L8327L9145L9745M0178M0247L9863
50481B107496L9565M0538M3630M8197N2572N5833N8615O1896O5677O9495P3761
50470B717275P9597Q7356R6044J04434J12202J19689J26956J33534J38843J42674
50460C858604J45125J46167J45248J41647J35346J27288J18116J06974R2377P4442
50450E091334N5301L6805J8626o52k1140m1316n9587p5143q7434r6055j01359
50439D719380j04172j04497j01399r4628q5427p5102o3638n0680l7173k4763j3937
50428C963964l947N243J1978J4353J1855N218m737j7429l2112m7848o3827p9324
$$ y = [1505220, 1511009, 1518880, 1528223, 1539102, 1552102, 1567804, 1586121, 1606364, 1628081, 1651570, 1677278, 1705041, 1734348, 1765142, 1797914, 1832971, 1869991, 1908318, 1947463, 1987208, 2027386, 2067633, 2107496, 2147061, 2187599, 2231229, 2279426, 2331998, 2387831, 2446446, 2508342, 2574019, 2643514, 2717275, 2796872, 2884228, 2980272, 3084706, 3196908, 3316597, 3443553, 3577087, 3715930, 3858604, 4003729, 4149896, 4295144, 4436791, 4572137, 4699425, 4817541, 4924515, 5016892, 5091334, 5146635, 5183440, 5202066, 5201414, 5180274, 5138958, 5079371, 5004228, 4916794, 4820739, 4719380, 4615208, 4510711, 4409312, 4314684, 4229257, 4154155, 4090517, 4039837, 4002664, 3977901, 3963964, 3960017, 3965260, 3977238, 3991591, 4003446, 4008664, 4003927, 3986498, 3954386, 3906538, 3842711, 3763387]
50416C763387r3405j05137j14273j21334j26668j29658j29239j25293j19167j12576
50406B586637j06282j00074r3684q7163q0446p3372o6191n9402n2849m5648l7581
50395A783945k9928k4193k0316j6861j2771q139l401J343N876R470J1587J2873
50383A709485J4836J8326K2399K5154K5936K6304K8200L1345L3478L3428L2747
50372B001638L3488L5307L6028L4578L1996K9592K7555K5586K3868K2692K1843
50361B324171K0892J9674J8185J6485J5086J5007J6989K0689K4699K7508K8749
50350B548134K9800L2603L7344M1930M4508M5834M7860N0435N1233M9084M5519
50339C024284M2117L8036L1443K2428J2865L871n235j5549k7185l9360n0977o0898
$$ y = [3763387, 3669982, 3564845, 3450572, 3329238, 3202570, 3072912, 2943673, 2818380, 2699213, 2586637, 2480355, 2380281, 2286597, 2199434, 2118988, 2045616, 1979425, 1920023, 1867174, 1821526, 1783945, 1754017, 1729824, 1709508, 1692647, 1679876, 1671737, 1668336, 1669679, 1675555, 1685025, 1696612, 1709485, 1724321, 1742647, 1765046, 1790200, 1816136, 1842440, 1870640, 1901985, 1935463, 1968891, 2001638, 2035126, 2070433, 2106461, 2141039, 2173035, 2202627, 2230182, 2255768, 2279636, 2302328, 2324171, 2345063, 2364737, 2382922, 2399407, 2414493, 2429500, 2446489, 2467178, 2491877, 2519385, 2548134, 2577934, 2610537, 2647881, 2689811, 2734319, 2780153, 2828013, 2878448, 2929681, 2978765, 3024284, 3066401, 3104437, 3135880, 3158308, 3171173, 3175044, 3169809, 3154260, 3127075, 3087715, 3036738, 2975840]
50327B975840o8325p3327p6766p9411q1086q0731p7537p2018o5685n9272n1894
50316B189788m2653l2576k3668j6239q738o27O215R896J0907J0813R643O181K61
50303B119203o842j4131k1677k9556l7197m3905m9141n2186n2495n0616m7977
50292A713480m5496m3013m0331l7930l6265l4976l3313l1076k8606k5994k2814
50281A333666j8821j4718j1825j0714j0425r511p732o053m888l283l85L173O175
50268A244659Q493J0799J3038J4431J5003J5900J7747J9639K0413K0319K0585
50257A421026K1573K2109K0989J8704J7211J7862J9993K1714K1742K0113J7448
50246A640484J4336J1428R307P943O879O052N739N493M158J503j069k250k533
$$ y = [2975840, 2907515, 2834188, 2757422, 2678011, 2596925, 2516194, 2438657, 2366639, 2300954, 2241682, 2189788, 2147135, 2114559, 2090891, 2074652, 2065914, 2065287, 2071502, 2081398, 2092305, 2103118, 2112761, 2118942, 2119203, 2112361, 2098230, 2076553, 2046997, 2009800, 1965895, 1916754, 1864568, 1812073, 1761457, 1713480, 1667984, 1624971, 1584640, 1546710, 1510445, 1475469, 1442156, 1411080, 1382474, 1356480, 1333666, 1314845, 1300127, 1288302, 1277588, 1267163, 1257652, 1249920, 1243867, 1238979, 1235696, 1235311, 1238484, 1244659, 1253152, 1263951, 1276989, 1291420, 1306423, 1322323, 1340070, 1359709, 1380122, 1400441, 1421026, 1442599, 1464708, 1485697, 1504401, 1521612, 1539474, 1559467, 1581181, 1602923, 1623036, 1640484, 1654820, 1666248, 1675555, 1683498, 1690377, 1696429, 1702168, 1707661, 1711819, 1713322, 1712253, 1710003, 1707470]
50233A707470l347n025o748q089r508j1284j2889j3657j3691j3791j4689j6244
50221A578508j7402j7389j6892j7285j8573j9183j8278j7109j7168j8122j8690
50210A382417j8553j8032j6810j4712j3125j3753j5960j7008j5063j0720n703
50199A222978j500P54P59j40%J425K556K363J557J118R08L83m77j443k361k831
50183A226049k591k372l219m790n647n474n425n812n302l435k153l293n842p361
50169A163333p176o499n979n058l692k995l647m726m751l390j646o26l43J93J782
50154A114780M009N711O240N833M958M045L649L904L774K072n33j904j360r15
50140A154263k630n930q645r847j0320j0881j1518j1956j2087j1889j1537j1285
$$ y = [1707470, 1704123, 1699098, 1692350, 1684261, 1674753, 1663469, 1650580, 1636923, 1623232, 1609441, 1594752, 1578508, 1561106, 1543717, 1526825, 1509540, 1490967, 1471784, 1453506, 1436397, 1419229, 1401107, 1382417, 1363864, 1345832, 1329022, 1314310, 1301185, 1287432, 1271472, 1254464, 1239401, 1228681, 1222978, 1221478, 1222232, 1222991, 1222851, 1222851, 1224276, 1226832, 1229195, 1230752, 1231870, 1232778, 1233161, 1232684, 1231241, 1228880, 1226049, 1223458, 1221086, 1217867, 1213077, 1207430, 1201956, 1196531, 1190719, 1185417, 1181982, 1179829, 1176536, 1170694, 1163333, 1156157, 1149658, 1143679, 1138621, 1134929, 1131934, 1128287, 1123561, 1118810, 1115420, 1113774, 1113148, 1112805, 1112998, 1114780, 1118789, 1124500, 1130740, 1136573, 1141531, 1145576, 1149225, 1153129, 1156903, 1158975, 1158442, 1156538, 1155178, 1154263, 1151633, 1145703, 1137058, 1127211, 1116891, 1106010, 1094492, 1082536, 1070449, 1058560, 1047023, 1035738]
50128A035738j0847r580p853p280q641j0430j0656r435q480q483q512p799o833
50115I20909o419o665p062o925n930m784m933o711q346p934n967m535m432m583
50101H35683m401m882o796r166j0426j0149q945p412n950n017m867n277n862o387
50087G40146o645o476n951n146l848k080o82m51q32o07J44Q7j013j532m38Q11
50071G05487K30j657k248j90L057N131N292M704M811O003P576Q664R079R259R536
50056G74734R752R722R673J0007J0833J1953J3040J3718J3708J3113J2257J1210
50044I13720R926R028R629J1746J3499J2861R992P019N550N320N433N741O425
50031A025889O977O759O184O297P194P868P839P879Q545Q979Q246P125P169Q222
$$ y = [1035738, 1024891, 1015311, 1007458, 1000178, 991537, 981107, 970451, 961016, 952536, 944053, 935541, 927742, 920909, 914490, 907825, 900763, 893838, 887908, 883124, 878191, 871480, 863134, 855200, 849233, 844698, 840266, 835683, 831282, 826400, 819604, 810438, 800012, 789863, 780918, 773506, 767556, 762539, 757672, 752395, 746533, 740146, 733501, 727025, 721074, 715928, 712080, 710000, 709318, 708867, 708035, 707428, 707572, 707659, 706646, 705114, 704676, 705487, 705717, 704060, 701812, 701622, 704679, 709810, 715102, 719806, 724617, 730620, 738196, 746860, 755939, 765198, 774734, 784486, 794208, 803881, 813888, 824721, 836674, 849714, 863432, 877140, 890253, 902510, 913720, 923646, 932674, 942303, 954049, 967548, 980409, 990401, 997420, 1002970, 1008290, 1013723, 1019464, 1025889, 1032866, 1039625, 1045809, 1052106, 1059300, 1067168, 1075007, 1082886, 1091431, 1100410, 1108656, 1115781, 1122950, 1131172]
50017A131172Q522P596P432R784J3511J5943J6123J5355J4934J4848J4794J5067
50005A285081J6001J7374J8813K0092K0729K0092J8364J6816J6619J7589J8388
49994A485958J7723J5404J2725J1627J2835J4725J4805J2292Q506M934K046R0
49982A613670o33r01k458n733q965j0699j1886j3964j6103j6447j5240j4407j4371
49969A481863j3819j2741j2967j4693j5131j2392q693p455q602r166p793o013
49957A352398n102m295k914k041k760m086m089k335j42J057O28j349l986n687
49943A315297n441m054l401m426o492q497r951j0952j1818j2855j3947j4331j3378
49930A195754j1656j0524j0505j0704j0160r162q692q931q806p010l355P09L072
$$ y = [1131172, 1139694, 1147290, 1154722, 1164506, 1178017, 1193960, 1210083, 1225438, 1240372, 1255220, 1270014, 1285081, 1301082, 1318456, 1337269, 1357361, 1378090, 1398182, 1416546, 1433362, 1449981, 1467570, 1485958, 1503681, 1519085, 1531810, 1543437, 1556272, 1570997, 1585802, 1598094, 1606600, 1611534, 1613580, 1613670, 1613037, 1612136, 1609678, 1603945, 1594980, 1584281, 1572395, 1558431, 1542328, 1525881, 1510641, 1496234, 1481863, 1468044, 1455303, 1442336, 1427643, 1412512, 1400120, 1391427, 1383972, 1375370, 1366204, 1358411, 1352398, 1347296, 1343001, 1340087, 1338046, 1335286, 1331200, 1327111, 1324776, 1324634, 1325691, 1326319, 1324970, 1320984, 1315297, 1309856, 1305802, 1302401, 1297975, 1291483, 1282986, 1273035, 1262083, 1250265, 1237410, 1223463, 1209132, 1195754, 1184098, 1173574, 1163069, 1152365, 1142205, 1133043, 1124351, 1115420, 1106614, 1099604, 1096249, 1096958, 1100030]
49917A100030K866J562J528L355N150N028L513K709L437M270L618J848P57J248
49903A140919K276K133L58k057m125n940q049j0415j2636j4844j7518k0317k2231
49890A027554k3084k3917k5189k5664k4160k1684k0345k0413j9944j7698j4977
49879G90479j3855j4457j5013j4018j1582r004p778q651j0735j1680r708n752
49867F58246k756k482l620l528j295J576L081K544N81j693l147l088j856o51l10
$$ y = [1100030, 1102896, 1104458, 1105986, 1109341, 1114491, 1119519, 1123032, 1125741, 1129178, 1133448, 1137066, 1138914, 1139671, 1140919, 1143195, 1145328, 1145686, 1143629, 1139504, 1133564, 1125515, 1115100, 1102464, 1087620, 1070102, 1049785, 1027554, 1004470, 980553, 955364, 929700, 905540, 883856, 863511, 843098, 823154, 805456, 790479, 776624, 762167, 747154, 733136, 721554, 712550, 704772, 696121, 685386, 673706, 663998, 658246, 655490, 653008, 649388, 645860, 644565, 646141, 649222, 651766, 652347, 650654, 647507, 644419, 642563, 641912, 641602]
$$ [...]
##END NTUPLES=NMR SPECTRUM
##END=
