
##TITLE=AC1196_HVEAH12055_5946653_9ioTwGzrMZ
##JCAMPDX= 6.0         $$ Bruker NMR JCAMP-DX V2.0
##DATA TYPE= NMR SPECTRUM
##DATA CLASS= NTUPLES
##ORIGIN= BRUKER
##OWNER= Administrator
$$ 1.72 TOPSPIN		Version 2.1
$$ 2012-04-11 01:18:08.796 -0500  Administrator@TOPSPIN
$$ Compression mode = diff/dup
##.OBSERVE FREQUENCY= 400.13188235
##.OBSERVE NUCLEUS= ^1H
##.ACQUISITION MODE= SIMULTANEOUS (DQD)
##.ACQUISITION SCHEME= undefined
##.AVERAGES= 64
##.DIGITISER RES= 22
##SPECTROMETER/DATA SYSTEM= spect
##.PULSE SEQUENCE= noesygpps1d.comp
##.SOLVENT NAME= COFFEE_meoh
##.SHIFT REFERENCE= INTERNAL, COFFEE_meoh, 1, 14.96833
##AUDIT TRAIL= $$ (NUMBER, WHEN, WHO, WHERE, PROCESS, VERSION, WHAT)
$$ ##TITLE= Audit trail, TOPSPIN		Version 2.1
$$ ##JCAMPDX= 5.01
$$ ##ORIGIN= Bruker BioSpin GmbH
$$ ##OWNER= Administrator
$$ $$ C:\Bruker\TOPSPIN/data/COFFEE/nmr/AC1196_HVEAH12055_5946653_9ioTwGzrMZ/12/pdata/1/auditp.txt
$$ ##AUDIT TRAIL=  $$ (NUMBER, WHEN, WHO, WHERE, PROCESS, VERSION, WHAT)
(   1,<2012-04-11 01:18:04.125 -0500>,<Administrator>,<TOPSPIN>,<go>,<TOPSPIN 2.1>,
      <created by zg
	started at 2012-04-11 01:06:32.468 -0500,
	POWCHK enabled, PULCHK disabled,
       configuration hash MD5:
       1A 1E CE 29 27 FD 77 03 67 4E F0 E3 C4 B2 CB 90
       data hash MD5: 64K
       31 08 54 D8 41 97 93 3F 91 4D 47 0A 85 9F 07 88>)
(   2,<2012-04-11 01:18:06.828 -0500>,<Administrator>,<TOPSPIN>,<proc1d>,<TOPSPIN 2.1>,
      <Start of raw data processing
       efp LB = 0.3 FT_mod = 6 PKNL = 1 PHC0 = 0 PHC1 = 0 SI = 128K 
       data hash MD5: 128K
       7E CC 0F AE 5D 0B 7B 6F E4 3E A4 DE 3D E7 BF 25>)
(   3,<2012-04-11 01:18:08.031 -0500>,<Administrator>,<TOPSPIN>,<proc1d>,<TOPSPIN 2.1>,
      <pk PHC0 = 31.94824 PHC1 = 0 
       data hash MD5: 128K
       00 0F 8F 8B A7 7E 15 ED 72 C7 51 27 D2 42 AE 5D>)
(   4,<2012-04-11 01:18:08.265 -0500>,<Administrator>,<TOPSPIN>,<proc1d>,<TOPSPIN 2.1>,
      <abs ABSG = 1 
       data hash MD5: 128K
       D0 7D B9 94 1D 62 49 47 A9 34 79 0A 96 99 47 3B>)
(   5,<2012-04-11 01:18:08.343 -0500>,<Administrator>,<TOPSPIN>,<proc1d>,<TOPSPIN 2.1>,
      <abs ABSG = 2 
       data hash MD5: 128K
       9B 14 AB B1 EA D0 FD 70 CB 2B FB 35 AF 1B 91 36>)
(   6,<2012-04-11 01:18:08.453 -0500>,<Administrator>,<TOPSPIN>,<proc1d>,<TOPSPIN 2.1>,
      <abs ABSG = 3 
       data hash MD5: 128K
       FC 9B F0 D7 63 C3 22 44 67 64 CC 34 FD 2A 37 22>)
(   7,<2012-04-11 01:18:08.656 -0500>,<Administrator>,<TOPSPIN>,<proc1d>,<TOPSPIN 2.1>,
      <abs ABSG = 4 
       data hash MD5: 128K
       8D 7E 5B 83 F6 8B 37 88 73 60 A1 37 4A 47 2F 6E>)
(   8,<2012-04-11 01:18:08.703 -0500>,<Administrator>,<TOPSPIN>,<proc1d>,<TOPSPIN 2.1>,
      <abs ABSG = 5 
       data hash MD5: 128K
       FF B9 09 5E 44 65 3C 05 A4 05 EC 8A CA B6 DC B9>)
$$ ##END=
$$ 
$$ $$ hash MD5
$$ $$ 10 89 14 BF 96 C2 8F 29 38 B9 51 6E 51 15 11 C6
##$RELAX= 
##$RELAX= 
##$RELAX= 
##$RELAX= 
##$RELAX= 
##$RELAX= 
##$RELAX= 
##$RELAX= 
$$ Bruker specific parameters
$$ [...]
##$TP07= 0
##$TPNAME0= <>
##$TPNAME1= <>
##$TPNAME2= <>
##$TPNAME3= <>
##$TPNAME4= <>
##$TPNAME5= <>
##$TPNAME6= <>
##$TPNAME7= <>
##$TPOAL= (0..7)
0.5 0.5 0.5 0.5 0.5 0.5 0.5 0.5
##$TPOFFS= (0..7)
0 0 0 0 0 0 0 0
##$TUNHIN= 0
##$TUNHOUT= 0
##$TUNXOUT= 0
##$USERA1= <user>
##$USERA2= <user>
##$USERA3= <user>
##$USERA4= <user>
##$USERA5= <user>
##$V9= 5
##$VALIST= <valist>
##$VCLIST= <CCCCCCCCCCCCCCC>
##$VD= 0
##$VDLIST= <DDDDDDDDDDDDDDD>
##$VPLIST= <PPPPPPPPPPPPPPP>
##$VTLIST= <TTTTTTTTTTTTTTT>
##$WBST= 1024
##$WBSW= 4
##$XGAIN= (0..3)
0 0 0 0
##$XL= 0
##$YL= 0
##$YMAX_a= 10426598
##$YMIN_a= -8855085
##$ZGOPTNS= <>
##$ZL1= 120
##$ZL2= 120
##$ZL3= 120
##$ZL4= 120
##$ABSF1= 14.96833
##$ABSF2= -5.5842
##$ABSG= 5
##$ABSL= 3
##$ALPHA= 0
##$AQORDER= 0
##$ASSFAC= 0
##$ASSFACI= 0
##$ASSFACX= 0
##$ASSWID= 0
##$AUNMP= <proc_prof1d_extract.lims>
##$AXLEFT= 0
##$AXNAME= <>
##$AXNUC= <1H>
##$AXRIGHT= 0
##$AXTYPE= 0
##$AXUNIT= <>
##$AZFE= 0.1
##$AZFW= 0.1
##$BCFW= 0
##$BC_mod= 0
##$BYTORDP= 0
##$COROFFS= 0
##$CY= 15
##$DATMOD= 1
##$DC= 0
##$DFILT= <>
##$DTYPP= 0
##$F1P= 0
##$F2P= 0
##$FCOR= 0.5
##$FTSIZE= 131072
##$FT_mod= 6
##$GAMMA= 0
##$GB= 0
##$INTBC= 1
##$INTSCL= 1
##$ISEN= 128
##$LB= 0.3
##$LEV0= 0
##$LPBIN= 0
##$MAXI= 10000
##$MC2= 0
##$MEAN= 0
##$ME_mod= 0
##$MI= 0
##$NCOEF= 0
##$NC_proc= -1
##$NLEV= 6
##$NOISF1= 0
##$NOISF2= 0
##$NSP= 0
##$NTH_PI= 0
##$NZP= 0
##$OFFSET= 14.96833
##$PC= 1
##$PHC0= 31.94824
##$PHC1= 0
##$PH_mod= 1
##$PKNL= yes
##$PPARMOD= 0
##$PPDIAG= 0
##$PPIPTYP= 0
##$PPMPNUM= 2147483647
##$PPRESOL= 1
##$PSCAL= 4
##$PSIGN= 0
##$PYNMP= <proc.py>
##$REVERSE= no
##$SF= 400.130004913582
##$SI= 131072
##$SIGF1= 0
##$SIGF2= 0
##$SINO= 400
##$SIOLD= 131072
##$SPECTYP= <>
##$SREGLST= <1H.CDCl3>
##$SSB= 0
##$STSI= 131072
##$STSR= 0
##$SW_p= 8223.68421052632
##$SYMM= 0
##$S_DEV= 0
##$TDeff= 65536
##$TDoff= 0
##$TI= <>
##$TILT= no
##$TM1= 0
##$TM2= 0
##$TOPLEV= 0
##$USERP1= <user>
##$USERP2= <user>
##$USERP3= <user>
##$USERP4= <user>
##$USERP5= <user>
##$WDW= 1
##$XDIM= 131072
##$YMAX_p= 123980764
##$YMIN_p= -334360341
##$CURPLOT= <Network HP LaserJet P1505>
##$CURPRIN= <$Network HP LaserJet P1505>
##$DFORMAT= <normdp>
##$LAYOUT= <+/1D_H.xwp>
##$LFORMAT= <normlp>
##$PFORMAT= <normpl>
##$SURQMSG= 1
$$ End of Bruker specific parameters
$$ ---------------------------------
##NTUPLES= NMR SPECTRUM
##VAR_NAME=  FREQUENCY,     SPECTRUM/REAL,   SPECTRUM/IMAG
##SYMBOL=    X,             R,               I
##VAR_TYPE=  INDEPENDENT,   DEPENDENT,       DEPENDENT
##VAR_FORM=  AFFN,          ASDF,            ASDF
##VAR_DIM=   131072,        131072,          131072
##UNITS=     HZ,            ARBITRARY UNITS, ARBITRARY UNITS
##FACTOR=    0.0627417313425165, 1,          1
##FIRST=     8223.62146879498, 1430,         -20659
##LAST=      0,             1309,            -20392
##MIN=       0,             -334360341,      0
##MAX=       8223.62146879498, 123980764,    0
$$ Real data points
##PAGE= N=1
##DATA TABLE= (X++(R..R)), XYDATA
$$ [...]
62278D89352j5683j5782j5463j4808j4168j3746j3282j2454j1435j0681j0277
$$ 489352 473669 457887 442424 427616 413448 399702 386420 373966 362531 351850 341573
62267C41573r886r367q984q883q724q113p147o253n593m972m226l448k782k236
$$ 341573 331687 322320 313336 304453 295729 287616 280469 274216 268623 263651 259425 255977 253195 250959
62253B50959j819j614j633j642j388q90m55l36n35r21j415j977k496k780k717
$$ 250959 249140 247526 245893 244251 242863 241973 241518 241182 240647 239726 238311 236334 233838 231058 228341
62238B28341k362j914j583j426j289r54m19P4K90K80K80L95N68P93J190J804K511
$$ 228341 225979 224065 222482 221056 219767 218813 218394 218468 218758 219038 219318 219713 220281 221074 222264 224068 226579
62221B26579L195L851M415M709M698M651M833N169N452N794O495P493Q276Q503
$$ 226579 229774 233625 238040 242749 247447 252098 256931 262100 267552 273346 279841 287334 295610 304113
62207C04113Q427Q551R079R901J0920J2109J3332J4359J5069J5513J5777J5912
$$ 304113 312540 321091 330170 340071 350991 363100 376432 390791 405860 421373 437150 453062
62195D53062J5977J5975J5723J4880J3179J0645P631M643K007l54k743n242p640
$$ 453062 469039 485014 500737 515617 528796 539441 547072 551715 553722 553368 550625 545383 537743
62182E37743r765j1664j3263j4248j4542j4643j5013j5337j4953j3898j2919j2344
$$ 537743 527978 516314 503051 488803 474261 459618 444605 429268 414315 400417 387498 375154
62170C75154j1602j0164q414p126o466n993n421m831m292l715l074k450j861j322
$$ 375154 363552 353388 344974 337848 331382 325389 319968 315137 310845 307130 304056 301606 299745 298423
62156B98423r94j035j311j521j515j285p89p0N42P16N36L54K86K33K80O61J304
$$ 298423 297429 296394 295083 293562 292047 290762 289973 289903 290445 291161 291697 292051 292337 292570 292850 293511 294815
62139B94815J878K301K795L352L628L537L493L833M368M791N194N769O335O529
$$ 294815 296693 298994 301789 305141 308769 312306 315799 319632 324000 328791 333985 339754 346089 352618
62125C52618O372O211O224O269O247O286O558P024P472P715P791P993Q587R509
$$ 352618 358990 365201 371425 377694 383941 390227 396785 403809 411281 418996 426787 434780 443367 452876
62111D52876J0415J1128J1829J2733J3744J4569J4994J4907J4280J3260J2124
$$ 452876 463291 474419 486248 498981 512725 527294 542288 557195 571475 584735 596859
62100E96859J0932R425P494N493L887K665J443M1j368k601l667m563n153n381
$$ 596859 607791 617216 624710 630203 634090 636755 638198 638239 636871 634270 630603 626040 620887 615506
62086F15506n449n615n837n729m950l678k605k296k561k694k349j886j745j798
$$ 615506 610057 604442 598605 592876 587926 584248 581643 579347 576786 574092 571743 569857 568112 566314
62072E66314j611j074m61L4M78R78J551K204K922L600M198M817N505O055O309
$$ 566314 564703 563629 563168 563202 563680 564658 566209 568413 571335 574935 579133 583950 589455 595510 601819
62057F01819O514P078Q014Q910R465R752R972J0221J0564J1069J1682J2237J2656
$$ 601819 608333 615411 623425 632335 641800 651552 661524 671745 682309 693378 705060 717297 729953
62044G29953J2974J3207J3426J3870J4725J5743J6390J6473J6387J6644J7348
$$ 729953 742927 756134 769560 783430 798155 813898 830288 846761 863148 879792 897140
62033H97140J8268J9137J9711J9759J9250J8454J7741J7284J7059J7067J7380
$$ 897140 915408 934545 954256 974015 993265 1011719 1029460 1046744 1063803 1080870 1098250
62022A098250J7988J8705J9207J9212J8668J7827J7052J6552J6317J6335J6739
$$ 1098250 1116238 1134943 1154150 1173362 1192030 1209857 1226909 1243461 1259778 1276113 1292852
62011A292852J7647J8897K0041K0715K1011K1392K2152K3038K3553K3551K3287
$$ 1292852 1310499 1329396 1349437 1370152 1391163 1412555 1434707 1457745 1481298 1504849 1528136
62000A528136K2885K2061K0614J8862J7320J6158J5210J4351J3501J2423J0920
$$ 1528136 1551021 1573082 1593696 1612558 1629878 1646036 1661246 1675597 1689098 1701521 1712441
61989A712441R274Q055P444P011O344N578N152N217N480N559N365N131N062N048
$$ 1712441 1721715 1729770 1737214 1744225 1750569 1756147 1761299 1766516 1771996 1777555 1782920 1788051 1793113 1798161
61975A798161M759M056L131K173J184K35l54m03k48l67q10j312j836k564l416
$$ 1798161 1802920 1806976 1810107 1812280 1813464 1813699 1813345 1812942 1812694 1812327 1811517 1810205 1808369 1805805 1802389
61960A802389m043m313m428m531m570m567m613m588m237l628l071k595j958j244
$$ 1802389 1798346 1794033 1789605 1785074 1780504 1775937 1771324 1766736 1762499 1758871 1755800 1753205 1751247 1750003
61946A750003r19j073j165p66j09M04P75J116J226R79O73N91M43j74j024j515
$$ 1750003 1749084 1748011 1746846 1746080 1745971 1746375 1747150 1748266 1749492 1750471 1751144 1751735 1752178 1752004 1750980 1749465
61930A749465j637j977k844l872m638n216n942o921p992q982r835j0578j1294
$$ 1749465 1747828 1745851 1743007 1739135 1734497 1729281 1723339 1716418 1708426 1699444 1689609 1679031 1667737
61917A667737j2038j2766j3379j3824j4101j4204j4203j4285j4588j5006j5345
$$ 1667737 1655699 1642933 1629554 1615730 1601629 1587425 1573222 1558937 1544349 1529343 1513998
61906A513998j5549j5674j5671j5385j4781j4045j3445j3141j3064j2940j2512
$$ 1513998 1498449 1482775 1467104 1451719 1436938 1422893 1409448 1396307 1383243 1370303 1357791
61895A357791j1802j1065j0413r678q773p955p513p323o985o353n641n031m467
$$ 1357791 1345989 1334924 1324511 1314833 1306060 1298105 1290592 1283269 1276284 1269931 1264290 1259259 1254792
61882A254792l852l225k651k068j354m98L98J225J996K849L922N167O347P294
$$ 1254792 1250940 1247715 1245064 1242996 1241642 1241144 1241542 1242767 1244763 1247612 1251534 1256701 1263048 1270342
61868A270342Q129R153J0570J2345J4342J6442J8642K0984K3482K6108K8917L2120
$$ 1270342 1278471 1287624 1298194 1310539 1324881 1341323 1359965 1380949 1404431 1430539 1459456 1491576
61856A491576L5902M0184M4700M9361N4441O0354O7379P5546Q4669R4519J05127
$$ 1491576 1527478 1567662 1612362 1661723 1716164 1776518 1843897 1919443 2004112 2098631 2203758
61845B203758J16923J30278J44915J60038J75016J89655K03621K15953K25178
$$ 2203758 2320681 2450959 2595874 2755912 2930928 3120583 3324204 3540157 3765335
61836C765335K29558K26991K15091J91888J56645J10224N5219m014o2067j14094
$$ 3765335 3994893 4221884 4436975 4628863 4785508 4895732 4950951 4946937 4884870 4770776
61826D770776j57141j90120k13046k26653k32330k31714k26188k16994k05543
$$ 4770776 4613635 4423515 4210469 3983816 3751486 3519772 3293584 3076590 2871047
61817B871047j93103j80254j67089j53923j41407j29851j18990j08510r8539q9452
$$ 2871047 2677944 2497690 2330601 2176678 2035271 1905420 1786430 1677920 1579381 1489929
61807A489929q1424p4331o7906o1917n6324n1310m6998m3204l9622l6164l2940
$$ 1489929 1408505 1334174 1266268 1204351 1148027 1096717 1049719 1006515 966893 930729 897789
61796H97789k9953k7133k4574k2430k0604j8827j7034j5342j3732j2091j0574
$$ 897789 867836 840703 816129 793699 773095 754268 737234 721892 708160 696069 685495
61785F85495r527q920q272p252o038m932l926k920k022j389j002p44n96m95k09
$$ 685495 675968 667048 658776 651524 645486 640554 636628 633708 631686 630297 629295 628551 627955 627460 627251
61770F27251M04J156J721K035K309K768L444M210M847N187N317N564O206P227
$$ 627251 627655 628811 630532 632567 634876 637644 641088 645298 650145 655332 660649 666213 672419 679646
61756F79646Q390R464J0345J1082J1893J2991J4388J5858J7178J8325J9445K0788
$$ 679646 688036 697500 707845 718927 730820 743811 758199 774057 791235 809560 829005 849793
61744H49793K2583K4886K7385K9659L1605L3531L5715L8127M0668M3474M6738
$$ 849793 872376 897262 924647 954306 985911 1019442 1055157 1093284 1133952 1177426 1224164
61733A224164N0356N4060N7832O1969O6682P1826P7159Q2798Q9209R6740J05263
$$ 1224164 1274520 1328580 1386412 1448381 1515063 1586889 1664048 1746846 1836055 1932795 2038058
61722B038058J14412J24129J34845J47062J60959J76540J93971K13473K34930
$$ 2038058 2152470 2276599 2411444 2558506 2719465 2896005 3089976 3303449 3538379
61713C538379K57855K81821L06645L32097L57517L81649M02551M17485M23071
$$ 3538379 3796234 4078055 4384700 4716797 5074314 5455963 5858514 6275999 6699070
61704F699070M15679L91734L48120K83248J98585R9402o252j09629k03065k80968
$$ 6699070 7114749 7506483 7854603 8137851 8336436 8435838 8429586 8319957 8116892 7835924
61694G835924l40329l80880m04546m14336m13274m03923l88418l68597l46104
$$ 7835924 7495595 7114715 6710169 6295833 5882559 5478636 5090218 4721621 4375517
61685D375517l22345k98409k74964k52294k30533k09920j90876j73730j58422
$$ 4375517 4053172 3754763 3479799 3227505 2996972 2787052 2596176 2422446 2264024
61676B264024j44513j31577j19544j08611r8899r0286q2535p5427o8819o2653
$$ 2264024 2119511 1987934 1868390 1759779 1660880 1570594 1488059 1412632 1343813 1281160
61666A281160n6992n1920m7470m3614m0296l7361l4560l1734k8955k6426k4255
$$ 1281160 1224168 1172248 1124778 1081164 1040868 1003507 968947 937213 908258 881832 857577
61655H57577k2439k0960j9723j8531j7286j6192j5492j5067j4514j3631j2613
$$ 857577 835138 814178 794455 775924 758638 742446 726954 711887 697373 683742 671129
61644F71129j1755j1156j0811j0709j0757j0739j0522j0166r777r377q968q613
$$ 671129 659374 648218 637407 626698 615941 605202 594680 584514 574737 565360 556392 547779
61632E47779q360q183q036p851p522p021o578o508o802p012o676n772m700l905
$$ 547779 539419 531236 523200 515349 507827 500806 494228 487720 480918 473906 467230 461458 456758 452853
61618D52853l553l471l310k869k281j837j689j787k035k334k543k604k643k748
$$ 452853 449300 445829 442519 439650 437369 435532 433843 432056 430021 427687 425144 422540 419897 417149
61604D17149k725k343j803j585j792k017j968j842j924k108k142k030j965j951
$$ 417149 414424 412081 410278 408693 406901 404884 402916 401074 399150 397042 394900 392870 390905 388954
61590C88954j849j638j434j266j063q01n25l01k08l18n75p61p04l85J51Q58J540
$$ 388954 387105 385467 384033 382767 381704 380903 380378 380077 379869 379551 378976 378215 377511 377126 377277 378135 379675
61573C79675J934K003J985K013J900J524J099Q88Q10O30M29M99R14J421J722J679
$$ 379675 381609 383612 385597 387610 389510 391034 392133 393021 393831 394461 394890 395389 396303 397724 399446 401125
61557D01125J313Q03M17K42M1m03r61j358j621j957k329k477k392k399k698l082
$$ 401125 402438 403241 403658 403900 403941 403538 402577 401219 399598 397641 395312 392835 390443 388044 385346 382264
61541C82264l277l264l167k994k688k274j823j372j006q57r18r07n49R3O91J098
$$ 382264 378987 375723 372556 369562 366874 364600 362777 361405 360399 359542 358624 357717 357168 357261 357952 359050
61525C59050J523K235L109L721L825L722M008M956O267P352P875Q018Q275Q985
$$ 359050 360573 362808 365917 369638 373463 377185 381193 386149 392416 399768 407643 415661 423936 432921
61511D32921R979J0733J0968J1039J1531J2499J3354J3530J3067J2377J1725J1121
$$ 432921 442900 453633 464601 475640 487171 499670 513024 526554 539621 551998 563723 574844
61499E74844J0596J0231R978R619R002Q187P387O859O674O534N942M740L363K314
$$ 574844 585440 595671 605649 615268 624270 632457 639844 646703 653377 659911 665853 670593 673956 676270
61485F76270J542N51q40k246l200l671l906m031l982l743l428l115k757k274j704
$$ 676270 677812 678363 677523 675277 672077 668406 664500 660469 656487 652744 649316 646201 643444 641170 639466
61470F39466j186p45j22J040K788M684O225P352Q429R759J1278J2849J4559J6601
$$ 639466 638280 637535 637413 638453 641241 645925 652150 659502 667931 677690 688968 701817 716376 732977
61456G32977J8964K1435K3940K6622K9602L2801L6154L9823M3976M8454N2912
$$ 732977 751941 773376 797316 823938 853540 886341 922495 962318 1006294 1054748 1107660
61445A107660N7348O2177O7634P3290P8389Q2475Q5407Q6911Q6481Q3724P8460
$$ 1107660 1165008 1227185 1294819 1368109 1446498 1528973 1614380 1701291 1787772 1871496 1949956
61434A949956P0455N9471M5803L0482J4690p69j5311k8162l8608m6519n2298n6315
$$ 1949956 2020411 2079882 2125685 2156167 2170857 2170088 2154777 2126615 2088007 2041488 1989190 1932875
61422A932875n8628n9283n8589n6934n4474n1166m7052m2459l7868l3602k9583
$$ 1932875 1874247 1814964 1756375 1699441 1644967 1593801 1546749 1504290 1466422 1432820 1403237
61411A403237k5481k1056j6343j1538o873k648R15L968O977J0160J3134J5360
$$ 1403237 1377756 1356700 1340357 1328819 1321946 1319298 1320213 1324181 1331158 1341318 1354452 1369812
61399A369812J6821J7970J9097K0025K0478K0459K0154J9689J9098J8441J7807
$$ 1369812 1386633 1404603 1423700 1443725 1464203 1484662 1504816 1524505 1543603 1562044 1579851
61388A579851J7270J6871J6623J6488J6472J6639J6976J7230J7047J6324J5293
$$ 1579851 1597121 1613992 1630615 1647103 1663575 1680214 1697190 1714420 1731467 1747791 1763084
61377A763084J4213J3088J1758J0192Q534O886N155L146Q25j612l899n878p518
$$ 1763084 1777297 1790385 1802143 1812335 1820869 1827755 1832910 1836056 1836881 1835269 1831370 1825492 1817974
61364A817974q854r983j1005j1865j2286j2055j1340j0566r866q949p548n835
$$ 1817974 1809120 1799137 1788132 1776267 1763981 1751926 1740586 1730020 1720154 1711205 1703657 1697822
61352A697822m229k905j718n67L44O59K41o14j387j834k205k859l714m297m332
$$ 1697822 1693593 1690688 1688970 1688403 1688747 1689406 1689647 1689033 1687646 1685812 1683607 1680748 1677034 1672737 1668405
61337A668405l963l298k105j36K530N722R512J3981J8857K3728K8571L3751L9517
$$ 1668405 1664442 1661144 1659039 1658903 1661433 1667155 1676667 1690648 1709505 1733233 1761804 1795555 1835072
61324A835072M5780N2349N9094O5844P2371P8468Q3888Q8202R0956R1908R0911
$$ 1835072 1880852 1933201 1992295 2058139 2130510 2208978 2292866 2381068 2472024 2563932 2654843
61313B654843Q7531Q1104P1271N8313M2986K6276R362o612k1030l4025m5953n6759
$$ 2654843 2742374 2823478 2894749 2953062 2996048 3022324 3031686 3025074 3004044 2970019 2924066 2867307
61301B867307o6054p3694p9972q5133q8919r0863r0943q9740q7842q5369q2210
$$ 2867307 2801253 2727559 2647587 2562454 2473535 2382672 2291729 2201989 2114147 2028778 1946568
61290A946568p8510p4580p0442o5819o0662n5370n0304m5381m0349l5259l0404
$$ 1946568 1868058 1793478 1723036 1657217 1596555 1541185 1490881 1445500 1405151 1369892 1339488
61279A339488k5892k1563j7293j3151r257n617k170J113M171O877R219J1380J3521
$$ 1339488 1313596 1292033 1274740 1261589 1252332 1246715 1244545 1245658 1249829 1256706 1265925 1277305 1290826
61266A290826J5454J6756J7282J7367J7377J7305J6942J6251J5295J4060J2580
$$ 1290826 1306280 1323036 1340318 1357685 1375062 1392367 1409309 1425560 1440855 1454915 1467495
61255A467495J1124R954Q986P938O757N675M802L956K822J228p52k897n040p206
$$ 1467495 1478619 1488573 1497559 1505497 1512254 1517929 1522731 1526687 1529509 1530737 1529985 1527088 1522048 1514842
61241A514842r410j1380j2771j3691j4702j6143j7723j9016j9989k0764k1217
$$ 1514842 1505432 1494052 1481281 1467590 1452888 1436745 1419022 1400006 1380017 1359253 1338036
61230A338036k1147k0662k0012j9214j8143j6820j5291j3494j1548r937q967q290
$$ 1338036 1316889 1296227 1276215 1257001 1238858 1222038 1206747 1193253 1181705 1171768 1162801 1154511
61218A154511p382o321n594n371n442n729o269o846p139p207p295p255o663n483
$$ 1154511 1147129 1140808 1135214 1129843 1124401 1118672 1112403 1105557 1098418 1091211 1083916 1076661 1069998 1064515
61204A064515m061k521p08J261L020M588O390Q584J0931J3379J6208J9446K2747
$$ 1064515 1060454 1057933 1057225 1058486 1061506 1066094 1072484 1081068 1091999 1105378 1121586 1141032 1163779
61191A163779K6001K9452L3007L6039L8149L9540M0341M0063L8133L4371K8750
$$ 1163779 1189780 1219232 1252239 1288278 1326427 1365967 1406308 1446371 1484504 1518875 1547625
61180A547625K1109J1609J028r783k0353l0237l8679m5103m9571n2345n3399n2778
$$ 1547625 1568734 1580343 1581371 1571588 1551235 1520998 1482319 1437216 1387645 1335300 1281901 1229123
61168A229123n1102m9109m6951m4364m1384l8408l5683l3135l0651k8196k5702
$$ 1229123 1178021 1128912 1081961 1037597 996213 957805 922122 888987 858336 830140 804438
61157H04438k3155k0728j8573j6620j4723j2866j1074r345p809o655n729m562
$$ 804438 781283 760555 741982 725362 710639 697773 686699 677354 669545 662890 657161 652599
61145F52599l036j623o44K39J402K510L039L192L667M561N155M864L845K649J605
$$ 652599 649563 647940 647296 647535 648937 651447 654486 657678 661345 665906 671061 675925 679770 682419 684024
61130F84024P07k15j298k463l425m077m765n859p168q078q297q170q151q309q390
$$ 684024 684731 684516 683218 680755 677330 673253 668488 662629 655461 647383 639086 630916 622765 614456 606066
61115F06066q238p999p958q192q428q349q035p910q173q534q650q593q657q931
$$ 606066 597828 589829 581871 573679 565251 556902 548867 540957 532784 524250 515600 507007 498350 489419
61101D89419r269r536r636r506r233r011q856q566q132p828p766p690p475p400
$$ 489419 480150 470614 460978 451472 442239 433228 424372 415806 407674 399846 392080 384390 376915 369515
61087C69515p676q015q081p976p860p485o606n558m847m438l975l444l070k691
$$ 369515 361839 353824 345743 337767 329907 322422 315816 310258 305411 300973 296998 293554 290484 287793
61073B87793j957j010l52p8K00N95Q45R60J350K142K884L191L217L292L460L559
$$ 287793 285836 284826 284474 284396 284596 285191 286036 286996 288346 290488 293372 296563 299780 303072 306532 310091
61057C10091L466L145K695K413K503K747K823K804L005L329L334K950K542K237
$$ 310091 313557 316702 319397 321810 324313 327060 329883 332687 335692 339021 342355 345305 347847 350084
61043C50084J741J010N06N29P47P07M29J78M1oO2J43m0n85j190j530j598j594
$$ 350084 351825 352835 353341 353870 354617 355324 355753 355931 355972 355966 356028 356171 356131 355546 354356 352826 351228 349634
61025C49634j727k183k971l684l815l426l105l126l101k718k274k138k128j836
$$ 349634 347907 345724 342753 339069 335254 331828 328723 325597 322496 319778 317504 315366 313238 311402
61011C11402j325r74r17r27q11n78l68l49n87q60q12m25q7k2j1J78M40O32Q52
$$ 311402 310077 309103 308186 307259 306448 305870 305502 305153 304566 303706 302894 302469 302382 302360 302349 302527 302967 303599 304451
60992C04451J105J085O80L42N62J211J791K109K295K420K503K750L319L981M387
$$ 304451 305556 306641 307321 307663 308225 309436 311227 313336 315631 318051 320554 323304 326623 330604 334991
60977C34991M600M985N639O307O785P168P629Q270R034R688R975R976J0112J0589
$$ 334991 339591 344576 350215 356522 363307 370475 378104 386374 395408 405096 415071 425047 435159 445748
60963D45748J1100J1306J1313J1376J1525J1759J2289J3146J3961J4537J5332
$$ 445748 456848 468154 479467 490843 502368 514127 526416 539562 553523 568060 583392
60952E83392J6729J8315J9499K0561K2262K4622K6933K8964L1219L3978L6875
$$ 583392 600121 618436 637935 658496 680758 705380 732313 761277 792496 826474 863349
60941H63349L9575M2150M4594M6794M9216N2825N7943O3866O9884P6012Q2436
$$ 863349 902924 945074 989668 1036462 1085678 1138503 1196446 1260312 1330196 1406208 1488644
60930A488644Q8983R5676J03086J11803J22201J35077J51606J72065J95546K21648
$$ 1488644 1577627 1673303 1776389 1888192 2010393 2145470 2297076 2469141 2664687 2886335
60920B886335K51495K86340L26432L72257M25427M86587N53937O25772P00819
$$ 2886335 3137830 3424170 3750602 4122859 4548286 5034873 5588810 6214582 6915401
60911F915401P68781P99816P53807O12642M06076J99537N1279j9176k4729J3912
$$ 6915401 7684182 8483998 9237805 9850447 10256523 10456060 10507339 10488163 10463434 10477346
60901A0477346P5581J25929J15936R760j82479m04814n91786p06434p48826p38908
$$ 10477346 10552927 10678856 10794792 10804552 10622073 10217259 9625473 8919039 8170213 7431305
60891G431305o97966o42236n83306n27746m76773m28820l82926l39499k99207
$$ 7431305 6733339 6091103 5507797 4980051 4503278 4074458 3691532 3352033 3052826
60882C052826k62530k30052k02180j78612j58701j42018j28072j15894j04665
$$ 3052826 2790296 2560244 2358064 2179452 2020751 1878733 1750661 1634767 1530102
60873A530102r4533q6115p9357p3437o7790o2497n7671n3141m8878m5244m2459
$$ 1530102 1435569 1349454 1270097 1196660 1128870 1066373 1008702 955561 906683 861439 818980
60862H18980m0251l8204l6176l4198l2200l0102k7991k5993k4105k2242k0383
$$ 818980 778729 740525 704349 670151 637951 607849 579858 553865 529760 507518 487135
60851D87135j8633j7157j6028j5084j4030j2790j1653j0859j0209r355q335p543
$$ 487135 468502 451345 435317 420233 406203 393413 381760 370901 360692 351337 343002 335459
60839C35459p132o838o390n801n209m653m155l725l258k664k098j801j680j339
$$ 335459 328327 321489 315099 309298 304089 299436 295281 291556 288298 285634 283536 281735 280055 278716
60825B78716o16J53N69O14N28N39P66J174J519J510J176Q29O49N32M33N12P97
$$ 278716 278100 278253 278822 279436 279964 280503 281269 282443 283962 285472 286648 287477 288126 288658 289091 289603 290400
60808B90400J007Q84M79m8o37j188j504j579j675j873j887j545j105q46o33k54
$$ 290400 291407 292291 292770 292722 292085 290897 289393 287814 286139 284266 282379 280834 279729 278883 278250 277996
60792B77996Q4Q9j4L00J131K014K557K812L029L342L776M219M469M398M131L834
$$ 277996 278080 278169 278155 278455 279586 281600 284157 286969 289998 293340 297116 301335 305804 310202 314333 318167
60776C18167L484L096K989L406L951L905L219K697K983L684L890L314K577K360
$$ 318167 321651 324747 327736 331142 335093 338998 342217 344914 347897 351581 355471 358785 361362 363722
60762C63722K584K615K110J403J054J139J255J072O67K75j8k02k05r2j41n65j232
$$ 363722 366306 368921 371031 372434 373488 374627 375882 376954 377621 377896 377878 377676 377471 377379 377238 376673 375441
60745C75441j868k415k965l539m081m551m848m807m486m262m389m623m558m168
$$ 375441 373573 371158 368193 364654 360573 356022 351174 346367 341881 337619 333230 328607 324049 319881
60731C19881l738l393l024k578k139j773j534j442j323q12J23R95J445J805K530
$$ 319881 316143 312750 309726 307148 305009 303236 301702 300260 298937 298125 298248 299243 300688 302493 305023
60716C05023L367L680L465L396L870M605N228N673N938N975N933O035O139N912
$$ 305023 308390 312070 315535 318931 322801 327406 332634 338307 344245 350220 356153 362188 368327 374239
60702C74239N479N317N406N170M411L646L260K969K545K320K499K566K014J228
$$ 374239 379718 385035 390441 395611 400022 403668 406928 409897 412442 414762 417261 419827 421841 423069
60688D23069R78J347J760J841J623J099K03p85j382j494j461j542j695j863k082
$$ 423069 424047 425394 427154 428995 430618 431717 431920 431135 429753 428259 426798 425256 423561 421698 419616
60673D19616k286k374k490k910l567m038m039l718l411l326l461l641l627l336
$$ 419616 417330 414956 412466 409556 405989 401951 397912 394194 390783 387457 383996 380355 376728 373392
60659C73392k934k572k134j456o68p5K62N11P18P43N41K87J35O7jj11k94n52q16
$$ 373392 370458 367886 365752 364296 363628 363553 363815 364326 365044 365787 366328 366615 366750 366817 366816 366705 366411 365859 365043
60640C65043j049j243j286r52k39M47P11O39N96O63O35M58K66J1n31j333k032
$$ 365043 363994 362751 361465 360513 360274 360721 361432 362071 362667 363330 363965 364423 364689 364700 364169 362836 360804
60623C60804k382k506k616k809l218l932m668m890m511m074m001m018l727l340
$$ 360804 358422 355916 353300 350491 347273 343341 338673 333783 329272 325198 321197 317179 313452 310112
60609C10112l349l602l388k509j620j305j286r33k63R1j66n73n52j25K24J95q4
$$ 310112 306763 303161 299773 297264 295644 294339 293053 292120 291857 291948 291782 291209 290657 290532 290756 290951 290867
60592B90867l45m70m37j95K80Q48J266J340J055N40Rl40m09k61m3J29K53L58M78
$$ 290867 290522 290052 289615 289420 289700 290548 291814 293154 294209 294749 294758 294418 294009 293748 293705 293834 294087 294445 294923
60573B94923O61R81J389J650J592J460J759K616L499L855L836M019M498M803M776
$$ 294923 295584 296565 297954 299604 301196 302656 304415 307031 310530 314385 318221 322240 326738 331541 336317
60558C36317M985N907P123P848P926P811P758P611P341P189P139O821O070N160
$$ 336317 341302 347209 354332 362180 370106 377917 385675 393286 400627 407816 414955 421776 427846 433006
60544D33006M278L168J633j6j341k363l386m454n313n864o264o614o794o672o250
$$ 433006 437284 440452 442085 442069 440728 438365 434979 430525 425212 419348 413084 406470 399676 393004 386754
60529C86754n610m867m142l503k883k237j706j500j608j737j651j445j431j706
$$ 386754 381144 376277 372135 368632 365749 363512 361806 360306 358698 356961 355310 353865 352434 350728
60515C50728j962j834j378j017r78r81o80j68K00L22L73M31M64O38J248K216L065
$$ 350728 348766 346932 345554 344537 343559 342578 341898 341730 341930 342252 342625 343056 343520 344158 345406 347622 350687
60498C50687L468L593L746L967M158M336M590M983N558O285O927P166P004O794
$$ 350687 354155 357748 361494 365461 369619 373955 378545 383528 389086 395371 402298 409464 416468 423262
60484D23262O809P078P611Q521R745J1033J2267J3504J4556J4972J4599J3789
$$ 423262 430071 437149 444760 453281 463026 474059 486326 499830 514386 529358 543957 557746
60472E57746J2758J1165Q596N195J475k182n468p950r293r576r077p946o359m713
$$ 557746 570504 581669 590265 595460 596935 594753 589285 581335 572042 562466 553389 545443 539084 534371
60458E34371l325k081o83R15K552M123N502O498P166P910Q971J0080J0959J1852
$$ 534371 531046 528965 528282 529197 531749 535872 541374 547872 555038 562948 571919 581999 592958 604810
60444F04810J3154J4830J6630J8639K1103K3927K6862L0043L3816L8162M2754
$$ 604810 617964 632794 649424 668063 689166 713093 739955 769998 803814 841976 884730
60433H84730M7473N2385N7384O2383O7746P3932Q0828Q7965R5353J03478J12396
$$ 884730 932203 984588 1041972 1104355 1172101 1246033 1326861 1414826 1510179 1613657 1726053
60422A726053J21363J29097J33729J32523J22791J03642P6468M3553O938l0996
$$ 1726053 1847416 1976513 2110242 2242765 2365556 2469198 2545666 2589219 2596157 2565161
60412B565161o6784r6800j18936j33032j39969j40897j37206j30542j22392j13692
$$ 2565161 2498377 2401577 2282641 2149609 2009640 1868743 1731537 1600995 1478603 1364911
60402A364911j04818r5903q7139p8817p1098o3862n6948n0515m4914m0204l6112
$$ 1364911 1260093 1164190 1077051 998234 927136 863274 806326 755811 710897 670693 634581
60391F34581l2428k9215k6484k3989k1509j9096j6944j5206j3989j3273j2769
$$ 634581 602153 572938 546454 522465 500956 481860 464916 449710 435721 422448 409679
60380D09679j2057j1030j0002r274q812q417p968p367o498n444m556m144m177
$$ 409679 397622 386592 376590 367316 358504 350087 342119 334752 328254 322810 318254 314110 309933
60367C09933m336m254l717k892k295k318k665k637k019j319j004q81n14R8O39
$$ 309933 305597 301343 297626 294734 292439 290121 287456 284819 282800 281481 280477 279596 279082 279180 279819
60352B79819R93J259J373J190Q46P04Q86J122J173J120J158J274J296J187J147
$$ 279819 280812 282071 283444 284634 285480 286184 287070 288192 289365 290485 291643 292917 294213 295400 296547
60337B96547J360J770K131K303K355K385K366K214J924J555J166Q65Q34J071J239
$$ 296547 297907 299677 301808 304111 306466 308851 311217 313431 315355 316910 318076 318941 319775 320846 322085
60322C22085R53K42m98r63j167j225j186j110j098j164j217j230j253j266j138
$$ 322085 323038 323280 322782 321819 320652 319427 318241 317131 316033 314869 313652 312422 311169 309903 308765
60307C08765p89k48M13J055J453J497J354J260J234J201J232J410J556J452J280
$$ 308765 307976 307728 308141 309196 310649 312146 313500 314760 315994 317195 318427 319837 321393 322845 324125
60292C24125J471K081K739L206L579L889L946L740L583L616L581L272K904K693
$$ 324125 325596 327677 330416 333622 337201 341090 345036 348776 352359 355975 359556 362828 365732 368425
60278C68425K435J821R92L70J42J43K13L42N37P78J098J530K000K323K397K276
$$ 368425 370860 372681 373673 374043 374185 374328 374541 374883 375420 376198 377296 378826 380826 383149 385546 387822
60262C87822K103J937J640J023J40o30j022j201j493j877k125k261k460k562k218
$$ 387822 389925 391862 393502 394525 394665 394035 393013 391812 390319 388442 386317 384056 381596 379034 376816
60247C76816j560j170j225j233q42l63j32Q2N61R85Q96M99L67N40N33K01K1L31
$$ 376816 375256 374086 372861 371628 370786 370423 370291 370373 370934 371919 372815 373314 373681 374221 374754 374955 374976 375307
60229C75307Q70J232J432J711K052K230K208K246K547K955L126K931K618K496
$$ 375307 376177 377409 378841 380552 382604 384834 387042 389288 391835 394790 397916 400847 403465 405961
60215D05961K610K804L025L355L748M016M131M370N002N994P057P874Q270Q343
$$ 405961 408571 411375 414400 417755 421503 425519 429650 434020 439022 445016 452073 459947 468217 476560
60201D76560Q507R183J0339J1560J2598J3635J4889J6234J7461J8655K0102K1912
$$ 476560 485067 494250 504589 516149 528747 542382 557271 573505 590966 609621 629723 651635
60189F51635K3969K6137K8376L0707L3157L5677L8036L9995M1600M3113M4525
$$ 651635 675604 701741 730117 760824 793981 829658 867694 907689 949289 992402 1036927
60178A036927M5432M5497M4803M3552M1691L9066L5791L2150K8258K4012J9387
$$ 1036927 1082359 1127856 1172659 1216211 1257902 1296968 1332759 1364909 1393167 1417179 1436566
60167A436566J4527R658N005P64k984o228q849j0591j1360j1352j0810r762q091
$$ 1436566 1451093 1460751 1465756 1466520 1463536 1457308 1448459 1437868 1426508 1415156 1404346 1394584 1386493
60154A386493n758k806O62M452Q301J2111J5976J9959K3967K7917L1785L5367
$$ 1386493 1380735 1377929 1378591 1383043 1391344 1403455 1419431 1439390 1463357 1491274 1523059 1558426
60142A558426L8260M0226M1413M2025M1958M0881L8555L4974L0379K5168J9635
$$ 1558426 1596686 1636912 1678325 1720350 1762308 1803189 1841744 1876718 1907097 1932265 1951900
60131A951900J3724P276N38n863j1532j6571k1124k5042k8157l0499l1968l2144
$$ 1951900 1965624 1972900 1973438 1967575 1956043 1939472 1918348 1893306 1865149 1834650 1802682 1770538
60119A770538l0741k7999k4355k0056j5304j0473n753r05M275R448J4094J8176
$$ 1770538 1739797 1711798 1687443 1667387 1652083 1641610 1635857 1634952 1639227 1648675 1662769 1680945
60107A680945K2026K5719K8872L1051L1995L1610L0021K7635K4826K1620J7903
$$ 1680945 1702971 1728690 1757562 1788613 1820608 1852218 1882239 1909874 1934700 1956320 1974223
60096A974223J3813R691N772K212o72k502l119k576r30J762N332R626J4643K0334
$$ 1974223 1988036 1997727 2003499 2005711 2005039 2002537 1999418 1996842 1995912 1997674 2003006 2012632 2027275 2047609
60082B047609K6417L2603L8927M5648N2857O0347O7820P5138Q2472R0249R8699
$$ 2047609 2074026 2106629 2145556 2191204 2244061 2304408 2372228 2447366 2529838 2620087 2718786
60071B718786J07393J15490J22517J28610J33842J37708J39564J39109J36265
$$ 2718786 2826179 2941669 3064186 3192796 3326638 3464346 3603910 3743019 3879284
60062C879284J30893J23050J13127J01402Q7757P2230N5485L8222K0480J992j6949
$$ 3879284 4010177 4133227 4246354 4347756 4435513 4507743 4563228 4601450 4621930 4623922 4606973
60051D606973l5553n3234o9700q4467r6844j06368j12897j16356j16823j14701
$$ 4606973 4571420 4518186 4448486 4364019 4267175 4160807 4047910 3931554 3814731 3700030
60041C700030j10420j04042r5610q5651p4903o3664n1914l9940k8245j6950n868
$$ 3700030 3589610 3485568 3389958 3304307 3229404 3165740 3113826 3073886 3045641 3028691 3022823
60030C022823M788J4309K2141K8116L2036L3560L2652K9703K5024J8673J0905
$$ 3022823 3027611 3041920 3064061 3092177 3124213 3157773 3190425 3220128 3245152 3263825 3274730
60019C274730K396o162j4450k2389k9916l6950m3375m9020n3840n8029o1715o4616
$$ 3274730 3277126 3270964 3256514 3234125 3204209 3167259 3123884 3074864 3021024 2962995 2901280 2836664
60007B836664o6349o6933o6688o5755o4051o1615n8497n4486m9417m3637l7680
$$ 2836664 2770315 2703382 2636694 2570939 2506888 2445273 2386776 2332290 2282873 2239236 2201556
59996B201556l1545k4858j7702j0677m076K406R010J5524K1696K7496L2732L6895
$$ 2201556 2170011 2145153 2127451 2116774 2112698 2115104 2124114 2139638 2161334 2188830 2221562 2258457
59984B258457L9639M1064M1291M0155L7497L3430K8177K1900J4846P293o97r172
$$ 2258457 2298096 2339160 2380451 2420606 2458103 2491533 2519710 2541610 2556456 2563749 2563052 2553880
59972B553880j7839k6057l3391l9775m5110m9119n1706n3016n3058n1613m8728
$$ 2553880 2536041 2509984 2476593 2436818 2391708 2342589 2290883 2237867 2184809 2133196 2084468
59961B084468m4829m0238l4999k9292k3541j7906j2053n696R92P694J4311K0790
$$ 2084468 2039639 1999401 1964402 1935110 1911569 1893663 1881610 1875914 1876906 1884600 1898911 1919701
59949A919701K7038L3172L9467M5844N1752N6752O0788O3718O5072O4544O2335
$$ 1919701 1946739 1979911 2019378 2065222 2116974 2173726 2234514 2298232 2363304 2427848 2490183
59938B490183N8655N3306M6196L7856K9056K0075J0791J266q134j7084k5387l2831
$$ 2490183 2548838 2602144 2648340 2686196 2715252 2735327 2746118 2747384 2739250 2722166 2696779 2663948
59926B663948l9167m4223m7845m9881n0305m9245m6765m2864l7727l1790k5364
$$ 2663948 2624781 2580558 2532713 2482832 2432527 2383282 2336517 2293653 2255926 2224136 2198772
59915B198772j8507j1333m196K638R218J5597K1605K7088L2074L6512M0055M2372
$$ 2198772 2180265 2168932 2164736 2167374 2176592 2192189 2213794 2240882 2272956 2309468 2349523 2391895
59903B391895M3438M3385M2279M0228L7500L4333L0844K7242K3887K0927J8150
$$ 2391895 2435333 2478718 2520997 2561225 2598725 2633058 2663902 2691144 2715031 2735958 2754108
59892B754108J5406J2977J1372J0950J1847J4019J7230K1322K6531L3273M1464
$$ 2754108 2769514 2782491 2793863 2804813 2816660 2830679 2847909 2869231 2895762 2929035 2970499
59881B970499N0470N9870O9876Q0733R2145J03556J14653J25198J34651J42278
$$ 2970499 3020969 3080839 3150715 3231448 3323593 3427149 3541802 3667000 3801651 3943929
59871C943929J47447J49535J47766J41416J30099J13714R2422O6912L8422Q365
$$ 3943929 4091376 4240911 4388677 4530093 4660192 4773906 4866328 4933240 4971662 4980027
59861D980027k1879n0707p6391r7800j14758j27443j35812j39859j40070j37158
$$ 4980027 4958148 4907441 4831050 4733250 4618492 4491049 4355237 4215378 4075308 3938150
59851C938150j31683j24198j15416j05787r5199q3520p1169n8744m6362l3896
$$ 3938150 3806467 3682269 3566853 3461066 3365867 3282347 3211178 3152434 3106072 3072176
59841C072176k1581r873J184J1865K2133L1532L9688M6427N1451N4257N4501N2033
$$ 3072176 3050595 3040722 3041906 3053771 3075904 3107436 3147124 3193551 3245002 3299259 3353760 3405793
59829C405793M6649L8108K6470J2151m274k2045m0062n7137p2481q5750r6660
$$ 3405793 3452442 3490550 3517020 3529171 3524897 3502852 3462790 3405653 3333172 3247422 3150762
59818C150762j04856j10217j13011j13686j12623j10103j06290j01254r5157q8452
$$ 3150762 3045906 2935689 2822678 2708992 2596369 2486266 2379976 2278722 2183565 2095113
59808B095113q1720p5287o9070o2759n6126m9295m2799l7221l2684k8792k5223
$$ 2095113 2013393 1938106 1869036 1806277 1750151 1700856 1658057 1620836 1588152 1559360 1534137
59797A534137k2113j9767j8193j7182j6623j6467j6481j6331j5859j5088j4017
$$ 1534137 1512024 1492257 1474064 1456882 1440259 1423792 1407311 1390980 1375121 1360033 1346016
59786A346016j2587j0795q794o880n485m976n400o486p935r514j0993j2242j3394
$$ 1346016 1333429 1322634 1313840 1306960 1301475 1296499 1291099 1284613 1276678 1267164 1256171 1243929 1230535
59773A230535j4567j5417j5389j4471j3225j1936j0275q038n642l502j404J034
$$ 1230535 1215968 1200551 1185162 1170691 1157466 1145530 1135255 1127217 1121575 1118073 1116669 1117703
59761A117703L642N922P699R118J0296J1464J3069J5302J7725J9842K1717K3571
$$ 1117703 1121345 1127267 1134966 1144084 1154380 1165844 1178913 1194215 1211940 1231782 1253499 1277070
59749A277070K5050K5566K5130K4238K3072K1393J9226J6972J4876J2855J0988
$$ 1277070 1302120 1327686 1352816 1377054 1400126 1421519 1440745 1457717 1472593 1485448 1496436
59738A496436R579Q705Q098P654P685Q541J0256J2634J5430J8433K1680K5516
$$ 1496436 1506015 1514720 1522818 1530472 1538157 1546698 1556954 1569588 1585018 1603451 1625131 1650647
59726A650647L0261L5810M1849M8322N5373O3013P1157P9901Q9378R9353J09357
$$ 1650647 1680908 1716718 1758567 1806889 1862262 1925275 1996432 2076333 2165711 2265064 2374421
59715B374421J19030J27914J34958J38608J37307J29588J14062R0187N9448K5354
$$ 2374421 2493451 2621365 2756323 2894931 3032238 3161826 3275888 3366075 3425523 3450877
59705C450877p931l6981n9638p5102q3933q7527q7254q4073p8776p2056o4247
$$ 3450877 3442946 3405965 3346327 3271225 3187292 3099765 3012511 2928438 2849662 2777606 2713359
59694B713359n5433m6046l6908k8498k0513j2390m046M157J1939J9364K6666L4050
$$ 2713359 2657926 2611880 2574972 2546474 2525961 2513571 2509525 2513682 2525621 2544985 2571651 2605701
59682B605701M1573M9188N6871O4691P2710Q0907Q9338R8182J07531J17274J27411
$$ 2605701 2647274 2696462 2753333 2818024 2890734 2971641 3060979 3159161 3266692 3383966 3511377
59671C511377J38241J49980J62418J75230J88427K02056K15693K28710K40882
$$ 3511377 3649618 3799598 3962016 4137246 4325673 4527729 4743422 4972132 5213014
59662E213014K52209K62121K69481K73401K73666K70359K63698K54327K43335
$$ 5213014 5465223 5727344 5996825 6270226 6543892 6814251 7077949 7332276 7575611
59653G575611K31838K20919K11998K06578K05304K07584K12316K18539K25263
$$ 7575611 7807449 8028368 8240366 8446944 8652248 8859832 9072148 9290687 9515950
59644I515950K31179K34958K35512K31805K22756K07709J86743J60376J29327
$$ 9515950 9747129 9982087 10217599 10449404 10672160 10879869 11066612 11226988 11356315
59635A1356315R4915N9303K4885o459l3349n4550o9176p7160p9035p5233o5897
$$ 11356315 11451230 11510533 11535418 11528959 11495610 11441060 11371884 11294724 11215689 11140456 11074559
59624A1074559n1365l2496j0313J4482M1628P1040J02506J35515J69259K02796
$$ 11074559 11023194 10990698 10980385 10994867 11036495 11107535 11210041 11345556 11514815 11717611
59614A1717611K35191K65426K92146L13504L27240L30978L22492K99844K61556
$$ 11717611 11952802 12218228 12510374 12823878 13151118 13482096 13804588 14104432 14365988
59605A4365988K07125J37697N6442l1818j21467k06976k83542l47553l96785m30440
$$ 14365988 14573113 14710810 14767252 14735434 14613967 14406991 14123449 13775896 13379111 12948671
59595A2948671m49094m54582m49457m36237m17110l94285l70286l47710l28930
$$ 12948671 12499577 12044995 11595538 11159301 10742191 10347906 9977620 9629910 9300980
59586I300980l16114l11011l14035l23472l35829l47180l54387l55725l50997
$$ 9300980 8984866 8673855 8359820 8036348 7700519 7353339 6998952 6643227 6292230
59577F292230l41186l27608l11308k93134k74010k54751k35789k17430k00130
$$ 6292230 5951044 5623436 5312128 5018994 4744984 4490233 4254444 4037014 3836884
59568C836884j84167j69224j54771j40754j27600j15593j04677r4736q5650p7170
$$ 3836884 3652717 3483493 3328722 3187968 3060368 2944775 2840098 2745362 2659712 2582542
59558B582542o9187o1972n5812n0457m5474m0994l7602l5447l4081l3216l3069
$$ 2582542 2513355 2451383 2395571 2345114 2299640 2258646 2221044 2185597 2151516 2118300 2085231
59547B085231l3813l5127l6496l7629l8438l8961l9357l9680l9621l8823l7410
$$ 2085231 2051418 2016291 1979795 1942166 1903728 1864767 1825410 1785730 1746109 1707286 1669876
59536A669876l5805l4034l1755k8920k5935k3036k0065j6983j4091j1511q931
$$ 1669876 1634071 1600037 1568282 1539362 1513427 1490391 1470326 1453343 1439252 1427741 1418810
59525A418810o149l406r97J124L099M916O603Q306R996J1397J2429J3332J4209
$$ 1418810 1412661 1409255 1408258 1409382 1412481 1417397 1424000 1432306 1442302 1453699 1466128 1479460 1493669
59512A493669J4857J5280J5918J7082J8584K0222K2221K4812K7708L0428L2981
$$ 1493669 1508526 1523806 1539724 1556806 1575390 1595612 1617833 1642645 1670353 1700781 1733762
59501A733762L5848L9422M3669M8271N2866N7282O1751O6765P2552P8850Q5233
$$ 1733762 1769610 1809032 1852701 1900972 1953838 2011120 2072871 2139636 2212188 2291038 2376271
59490B376271R1443R7269J02453J06894J10694J13818J15926J16776J16490J15176
$$ 2376271 2467714 2564983 2667436 2774330 2885024 2998842 3114768 3231544 3348034 3463210
59480C463210J12517J08137J02273R5757Q9185Q2304P4354O5080N5342M6582L9557
$$ 3463210 3575727 3683864 3786137 3881894 3971079 4053383 4127737 4192817 4248159 4294741 4334298
59469D334298L3829K8705K4363K1653K0955K1819K3722K6524K9974L3261L5407
$$ 4334298 4368127 4396832 4421195 4442848 4463803 4485622 4509344 4535868 4565842 4599103 4634510
59458D634510L5789L4005K9496K1710J0498l779k0457l8744n7889p7248r6112
$$ 4634510 4670299 4704304 4733800 4755510 4766008 4762229 4741772 4703028 4645139 4567891 4471779
59447D471779j13538j28548j40521j49225j54567j56612j55779j52640j47551
$$ 4471779 4358241 4229693 4089172 3939947 3785380 3628768 3472989 3320349 3172798
59438C172798j40747j32684j23863j14421j04384r4207q4595p5727o7227n8885
$$ 3172798 3032051 2899367 2775504 2661083 2556699 2462492 2377897 2302170 2234943 2176058
59428B176058n0920m3475l6412k9623k3023j6240q999j822M448R891J5518K1849
$$ 2176058 2125138 2081663 2045251 2015628 1992605 1976365 1967366 1965544 1969992 1979883 1995401 2017250
59416B017250K8325L4475M0685M7356N4111O0499O6719P2935P8471Q2554Q5331
$$ 2017250 2045575 2080050 2120735 2168091 2222202 2282701 2349420 2422355 2500826 2583380 2668711
59405B668711Q7330Q8200Q6797Q2340P4831O4492N1485L6211J9296J313j7131
$$ 2668711 2756041 2844241 2931038 3013378 3088209 3152701 3204186 3240397 3259693 3261006 3243875
59394C243875l5112n1654o6194p8516q8412r5762j00778j03777j04884j04181
$$ 3243875 3208763 3157109 3090915 3012399 2923987 2828225 2727447 2623670 2518786 2414605
59384B414605j02004r8706r4389q9237q3827p8685p3707o8444o2845n7313n2154
$$ 2414605 2312601 2213895 2119506 2030269 1946442 1867757 1794050 1725606 1662761 1605448 1553294
59373A553294m7313m2645l8109l3770k9787k6266k3013j9642j6081j2668r614
$$ 1553294 1505981 1463336 1425227 1391457 1361670 1335404 1312391 1292749 1276668 1264000 1254386
59362A254386o737l952j550L19K070M151O416Q422J0085J1652J3386J5491J7943
$$ 1254386 1247649 1243697 1242147 1242466 1244536 1248687 1255103 1263525 1273610 1285262 1298648 1314139 1332082
59349A332082K0001K0445J8954J6836J5839J6487J8205K0580K3702K7519L1775
$$ 1332082 1352083 1372528 1391482 1408318 1424157 1440644 1458849 1479429 1503131 1530650 1562425
59338A562425L6512M1782M6796N0246N1848N2980N5419N9892O6024P3295Q1467
$$ 1562425 1598937 1640719 1687515 1737761 1789609 1842589 1898008 1957900 2023924 2097219 2178686
59327B178686R0391R9845J09687J20014J31045J42837J55163J67660J79985J91673
$$ 2178686 2269077 2368922 2478609 2598623 2729668 2872505 3027668 3195328 3375313 3566986
59317C566986K01975K10119K15654K18186K16874K10857K00386J86999J72204
$$ 3566986 3768961 3979080 4194734 4412920 4629794 4840651 5041037 5228036 5400240
59308E400240J56439J39712J22650J06303R1131P6801O2812M8914L5018K1017
$$ 5400240 5556679 5696391 5819041 5925344 6016475 6093276 6156088 6205002 6240020 6261037
59298F261037O621q777k5701m3802o1851p8774r4297j08195j19606j27755j32964
$$ 6261037 6267658 6258881 6233180 6189378 6127527 6048753 5954456 5846261 5726655 5598900 5465936
59287E465936j36304j38535j39984j41196j42838j45130j47856j50838j53839
$$ 5465936 5329632 5191097 5051113 4909917 4767079 4621949 4474093 4323255 4169416
59278D169416j56225j57295j56875j55092j51854j47062j41068j34329j26839
$$ 4169416 4013191 3855896 3699021 3543929 3392075 3245013 3103945 2969616 2842777
59269B842777j18523j09922j01730r3893q5901p7815p0182o3057n6021m9155m3128
$$ 2842777 2724254 2614332 2512602 2418709 2332808 2254993 2184811 2121754 2065733 2016578 1973450
59258A973450l8082l3249k7974k2449j7223j2515q336m703j470J672M836P921
$$ 1973450 1935368 1902119 1874145 1851696 1834473 1821958 1813622 1808919 1807449 1809121 1813957 1821878
59246A821878J1007J4368J7981K1501K4743K7809L0688L3243L5627L8112M0438
$$ 1821878 1832885 1847253 1865234 1886735 1911478 1939287 1969975 2003218 2038845 2076957 2117395
59235B117395M1893M2252M2122M2074M1891M0944L8980L6292L3367L0581K8051
$$ 2117395 2159288 2201540 2243662 2285736 2327627 2368571 2407551 2443843 2477210 2507791 2535842
59224B535842K5686K3476K1753K0903K0976K1796K3320K5497K7954L0215L2201
$$ 2535842 2561528 2585004 2606757 2627660 2648636 2670432 2693752 2719249 2747203 2777418 2809619
59213B809619L3973L5179L5191L3746L0865K6263J9500J0804J192q371j7407k5523
$$ 2809619 2843592 2878771 2913962 2947708 2978573 3004836 3024336 3035140 3036332 3027961 3010554 2985031
59201B985031l2235l7332m0950m3125m3688m2705m0545l7377l3139k8074k2797
$$ 2985031 2952796 2915464 2874514 2831389 2787701 2744996 2704451 2667074 2633935 2605861 2583064
59190B583064j7654j2463p027j461M060R370J4044J7611K0210K2482K4666K6334
$$ 2583064 2565410 2552947 2545920 2544459 2548519 2557889 2571933 2589544 2609754 2632236 2656902 2683236
59178B683236K7236K7836K8719K9955L1420L3265L5744L8900M2808M7756N3936
$$ 2683236 2710472 2738308 2767027 2796982 2828402 2861667 2897411 2936311 2979119 3026875 3080811
59167C080811O1170O9181P7765Q6521R4677J01441J06178J08164J06486J00545
$$ 3080811 3141981 3211162 3288927 3375448 3470125 3571566 3677744 3785908 3892394 3992939
59157C992939R0386P6251N8155L6188J1024j6090m3773p0769r5915j18140j36573
$$ 3992939 4083325 4159576 4217731 4253919 4264943 4248853 4205080 4134311 4038396 3920256 3783683
59146C783683j50646j60233j65644j67357j65835j61636j55492j48017j39478
$$ 3783683 3633037 3472804 3307160 3139803 2973968 2812332 2656840 2508823 2369345
59137B369345j30091j20343j10743j01472r2620q4538p7429p0937o4623n8652
$$ 2369345 2239254 2118911 2008168 1906696 1814076 1729538 1652109 1581172 1516549 1457897
59127A457897n3457m8893m4447m0123l6381l3283l0365k7460k4834k2532k0278
$$ 1457897 1404440 1355547 1311100 1270977 1234596 1201313 1170948 1143488 1118654 1096122 1075844
59116A075844j8132j6470j5140j3412j1040q614o621m815k865r32P74K430M180
$$ 1075844 1057712 1041242 1026102 1012690 1001650 993036 986415 981600 978735 977803 978577 981007 985187
59103I85187N803P215Q777J0750J2856J4708J6284J7690J8968K0326K2136K4320
$$ 985187 990990 998205 1006982 1017732 1030588 1045296 1061580 1079270 1098238 1118564 1140700 1165020
59091A165020K6290K7752K9101L0708L2384L3897L5496L7429L9385M0874M1833
$$ 1165020 1191310 1219062 1248163 1278871 1311255 1345152 1380648 1418077 1457462 1498336 1540169
59080A540169M2441M2683M2477M1962M1229M0052L8168L5664L2753K9486K5898
$$ 1540169 1582610 1625293 1667770 1709732 1750961 1791013 1829181 1864845 1897598 1927084 1952982
59069A952982K2209J8671J5410J2577J0392Q893P988P805Q613J0332J2559J5198
$$ 1952982 1975191 1993862 2009272 2021849 2032241 2041134 2049122 2056927 2065540 2075872 2088431 2103629
59057B103629J8551K2703K7323L2235L7599M3280M8682N3459N7895O2182O5863
$$ 2103629 2122180 2144883 2172206 2204441 2242040 2285320 2334002 2387461 2445356 2507538 2573401
59046B573401O8321O9285O8485O5257N9052M9953L8433K4943J0116n028j9430
$$ 2573401 2641722 2711007 2779492 2844749 2903801 2953754 2992187 3017130 3027246 3022218 3002788
59035C002788l2329m3121n1298n6818o0108o1543o1287n9746n7638n5398n3035
$$ 3002788 2970459 2927338 2876040 2819222 2759114 2697571 2636284 2576538 2518900 2463502 2410467
59024B410467n0731m8979m7906m7215m6971m7695m9301n0825n1764n2836n4764
$$ 2410467 2359736 2310757 2262851 2215636 2168665 2120970 2071669 2020844 1969080 1916244 1861480
59013A861480n6979n8353n8624n8345n7805n6836n5388n3615n1565m9285m7053
$$ 1861480 1804501 1746148 1687524 1629179 1571374 1514538 1459150 1405535 1353970 1304685 1257632
59002A257632m4993m2803m0259l7681l5448l3422l1262k8956k6618k4210k1876
$$ 1257632 1212639 1169836 1129577 1091896 1056448 1023026 991764 962808 936190 911980 890104
58991H90104k0097j9078j8431j7870j7702j8075j8411j8237j7978j8147j8293
$$ 890104 870007 850929 832498 814628 796926 778851 760440 742203 724225 706078 687785
58980F87785j7603j6236j5121j4635j4290j3594j2504j1129r629q354p537o918
$$ 687785 670182 653946 638825 624190 609900 596306 583802 572673 563044 554690 547153 540235
58968E40235o145n317m670m030l114k127j468j118q63q52j212j462r82O3R04J174
$$ 540235 534090 528773 524103 520073 516959 514832 513364 512246 511383 510531 509319 507857 506875 506938 507842 509016
58952E09016J089Q43M97L52P86J710K653L347L716L613L089K737L102L878M304
$$ 509016 510105 510948 511445 511797 512583 514293 516946 520293 524009 527622 530711 533448 536550 540428 544732
58937E44732M206M081M196M337M428M722N325N986O481O765O842O783O882P317
$$ 544732 548938 553019 557215 561552 565980 570702 576027 582013 588494 595259 602101 608884 615766 623083
58923F23083P822Q049Q044Q038Q049Q092Q475R308J0048J0155R960J0204J0992
$$ 623083 630905 638954 646998 655036 663085 671177 679652 688960 699008 709163 719123 729327 740319
58910G40319J1848J2608J3485J4435J5190J5909J6995J8292J9180J9518J9777
$$ 740319 752167 764775 778260 792695 807885 823794 840789 859081 878261 897779 917556
58899I17556K0161K0361K0308K0497K1232K2163K2835K3305K3923K4896K6246
$$ 917556 937717 958078 978386 998883 1020115 1042278 1065113 1088418 1112341 1137237 1163483
58888A163483K7978L0095L2539L5166L7680L9843M1952M4762M8578N2734N6448
$$ 1163483 1191461 1221556 1254095 1289261 1326941 1366784 1408736 1453498 1502076 1554810 1611258
58877A611258N9888O3809O8410P3236P8096Q3350Q9293R5845J02942J10695J19043
$$ 1611258 1671146 1734955 1803365 1876601 1954697 2038047 2127340 2223185 2326127 2436822 2555865
58866B555865J27760J36866J46638J57145J68227J79838J92095K04921K18048
$$ 2555865 2683625 2820491 2967129 3124274 3292501 3472339 3664434 3869355 4087403
58857D087403K31230K44209K56434K67250K76067K82054K83879K80236K70439
$$ 4087403 4318633 4562842 4819276 5086526 5362593 5644647 5928526 6208762 6479201
58848F479201K54035K30197J98222J58598J13028O3477J1816l9840q9208j34457
$$ 6479201 6733236 6963433 7161655 7320253 7433281 7496758 7508574 7468734 7379526 7245069
58838G245069j74331k07724k33743k52260k64034k70122k71476k68881k62862
$$ 7245069 7070738 6863014 6629271 6377011 6112977 5842855 5571379 5302498 5039636
58829E039636k53784k42281k29452k16215k02817j89340j76265j64010j52317
$$ 5039636 4785852 4543571 4314119 4097904 3895087 3705747 3529482 3365472 3213155
58820C213155j40863j30074j20596j12238j04341r6953r0738q5780q1393p7072
$$ 3213155 3072292 2942218 2821622 2709384 2605043 2508090 2417352 2331572 2250179 2173107
58810B173107p2823o8570o4063n9443n5123n1016m6658m2131l8093l4723l1479
$$ 2173107 2100284 2031714 1967651 1908208 1853085 1802069 1755411 1713280 1675187 1640464 1608985
58799A608985k8009k4629k1640j8878j6141j3442j0706p751m736k054L49K962
$$ 1608985 1580976 1556347 1534707 1515829 1499688 1486246 1475540 1467789 1463053 1460999 1461348 1464310
58787A464310N941Q946J1804J4772J8003K1330K4690K8180L1653L4815L7809M1158
$$ 1464310 1470251 1479197 1491001 1505773 1523776 1545106 1569796 1597976 1629629 1664444 1702253 1743411
58775A743411M5081M9365N3863N8522O3029O7154P1431P6732Q3076Q9615R5886
$$ 1743411 1788492 1837857 1891720 1950242 2013271 2080425 2151856 2228588 2311664 2401279 2497165
58764B497165J02329J09465J17280J25641J34699J44610J55418J67226J80021
$$ 2497165 2599494 2708959 2826239 2951880 3086579 3231189 3386607 3553833 3733854
58755C733854J93260K06253K18906K31421K43316K53489K61207K66126K67285
$$ 3733854 3927114 4133367 4352273 4583694 4827010 5080499 5341706 5607832 5875117
58746E875117K63000K52020K33973K08527J75163J34236Q7588L7644j3510o3948
$$ 5875117 6138117 6390137 6624110 6832637 7007800 7142036 7229624 7267268 7253758 7189810
58736G189810j11568j54522j91572k21863k44873k60809k70529k74854k74391
$$ 7189810 7078242 6923720 6732148 6510285 6265412 6004603 5734074 5459220 5184829
58727E184829k70027k62877k53653k42711k30725k18611k06614j94360j81915
$$ 5184829 4914802 4651925 4398272 4155561 3924836 3706225 3499611 3305251 3123336
58718C123336j70029j59079j48641j38367j28568j19592j11385j03953r7533r1952
$$ 3123336 2953307 2794228 2645587 2507220 2378652 2259060 2147675 2043722 1946189 1854237
58708A854237q6564q1137p6096p1624o7212o2524n7948n3923n0322m6833m3426
$$ 1854237 1767673 1686536 1610440 1538816 1471604 1409080 1351132 1297209 1246887 1200054 1156628
58697A156628m0112l6823l3721l1056k8607k5948k3344k1519k0438j9244j7618
$$ 1156628 1116516 1079693 1045972 1014916 986309 960361 937017 915498 895060 875816 858198
58686H58198j6191j5303j4406j3167j2114j1638j1223j0422r642r339r154q597
$$ 858198 842007 826704 812298 799131 787017 775379 764156 753734 744092 734753 725599 717002
58674G17002p900p501p283p002o889p184p606p880q237q836r317r471r775j0606
$$ 717002 709102 701601 694318 687316 680427 673243 665637 657757 649520 640684 631367 621896 612121 601515
58660F01515j1510j1894j1951j2200j2546j2485j1980j1440j1140j1002j0809
$$ 601515 590005 578111 566160 553960 541414 528929 516949 505509 494369 483367 472558
58649D72558j0288r337q325p796p671p321o582o023n936n893n621n522n815n970
$$ 472558 462270 452933 444608 436812 429141 421820 415238 409215 403279 397386 391765 386243 380428 374458
58635C74458n539m911m632m611m550m524m566m319l674l157l083k947k284j442
$$ 374458 368919 364008 359376 354765 350215 345691 341125 336806 333132 329975 326892 323945 321661 320219
58621C20219r16m72K76J045J325J227J177J174R82P06N36K98j85o61q35q29p93
$$ 320219 319303 318831 319107 320152 321477 322704 323881 325055 326037 326743 327279 327577 327392 326731 325896 325067 324274
58604C24274n02J70Q44J135J141J000N90Oj96J98O36O79P19J275K164L026M028
$$ 324274 323772 323942 324786 325921 327062 328062 328652 328658 328462 328660 329296 329975 330694 331969 334133 337159 341187
58587C41187N386O704P478P836Q170Q498Q779R347J0420J1581J2378J3039J4026
$$ 341187 346573 353277 360755 368591 376761 385259 394038 403385 413805 425386 437764 450803 464829
58574D64829J5300J6541J7709J8907K0098K1429K3364K5967K8597L0768L2900
$$ 464829 480129 496670 514379 533286 553384 574813 598177 624144 652741 683509 716409
58563G16409L5686L9215M3192M7466N1893N6170O0303O4762O9723P4611P8780
$$ 716409 752095 791310 834502 881968 933861 990031 1050334 1115096 1184819 1259430 1338210
58552A338210Q1982Q3833Q3544Q0607P5090O6845N5236M0263K3198N553j1862
$$ 1338210 1420192 1504025 1587569 1668176 1743266 1810111 1865347 1905610 1928808 1934361 1922499
58541A922499k8377m2875n4550o3519p0037p3853p4983p4313p2705p0190o6705
$$ 1922499 1894122 1851247 1796697 1733178 1663141 1589288 1514305 1439992 1367287 1297097 1230392
58530A230392o2826n9031n5098n0893m6965m3549l9912l5553l1216k7794k5053
$$ 1230392 1167566 1108535 1053437 1002544 955579 912030 872118 836565 805349 777555 752502
58519G52502k2318j9678j7479j5475j3465j2044j1656j1584j0932r983r528r502
$$ 752502 730184 710506 693027 677552 664087 652043 640387 628803 617871 607888 598360 588858
58507E88858r319q981q779q445p677p007p143p890q616r272j0064j0726j0967
$$ 588858 579539 570558 561779 553334 545657 538650 531507 523617 515001 505729 495665 484939 473972
58494D73972j1127j1471j1531j0979j0350j0035r418q087o934o881p287o987o159
$$ 473972 462845 451374 439843 428864 418514 408479 399061 390974 384040 377159 369872 362885 356726
58481C56726n772n822n542m894m512m488m435m373m497m432l794k991k559k289
$$ 356726 350954 345132 339590 334696 330184 325696 321261 316888 312391 307959 304165 301174 298615 296326
58467B96326j913j880k370k495j721j088j626k489k286j365j038j279j060m43
$$ 296326 294413 292533 290163 287668 285947 284859 283233 280744 278458 277093 276055 274776 273716 273273
58453B73273l66p33n92k6l3o71j030r75j260j942k283k204k306k485k101j444
$$ 273273 272907 272174 271582 271556 271523 270852 269822 268847 267587 265645 263362 261158 258852 256367 254266 252822
58437B52822j500k185k392j854j485j745k048j961j737j503j156j005j440j989
$$ 252822 251322 249137 246745 244891 243406 241661 239613 237652 235915 234412 233256 232251 230811 228822
58423B28822j877j359j271j518j327p44n11o35m48L9J89ko2j69q10j537j507r73
$$ 228822 226945 225586 224315 222797 221470 220726 220215 219580 219132 219171 219360 219358 219296 219127 218317 216780 215273 214300
58405B14300q55j125j071q58j190j777j723j178r73r21j82R48J411J319J728K601
$$ 214300 213445 212320 211249 210391 209201 207424 205701 204523 203550 202629 202447 203395 204806 206125 207853 210454
58389B10454K903K606K656L042K805K021J797K202K096J213N12K47l86j442j957
$$ 210454 213357 215963 218619 221661 224466 226487 228284 230486 232582 233795 234307 234554 234168 232726 230769
58374B30769j785j876k459k714k482k553k980k921k395k321k627k170q73m4j66
$$ 230769 228984 227108 224649 221935 219453 216900 213920 210999 208604 206283 203656 201486 200613 200569 200403
58359B00403k61J50L90K73N55J259J402R18R54J786K226J716J202J319J453J194
$$ 200403 200142 200292 200682 200955 201510 202769 204171 205089 206043 207829 210055 211771 212973 214292 215745 216939
58343B16939J102J446J730J904K494L240L232K654K656L297L463K960K811L209
$$ 216939 218041 219487 221217 223121 225615 228855 232087 234741 237397 240694 244157 247117 249928 253137
58329B53137L224K831L058L833L842K982K711L444L817L210K703K837K588J424
$$ 253137 256361 259192 262250 266083 269925 272907 275618 279062 282879 286089 288792 291629 294217 295641
58315B95641K93k44q16j530j488o71k59l98J29J426J979J336R36J428J588Q68
$$ 295641 295934 295690 294874 293344 291856 291185 290926 290528 290657 292083 294062 295398 296334 297762 299350 300218
58299C00218N44J265J750J173O33J018J471J183P56O76L69k49k52L93M78j25J9
$$ 300218 300762 302027 303777 304950 305583 306601 308072 309255 310011 310687 311056 310807 310555 310948 311426 311301 311320
58282C11320J268K080J757J575K263K773K624K941M048M552L988L907N023N843
$$ 311320 312588 314668 316425 318000 320263 323036 325660 328601 332649 337201 341189 345096 350119 355962
58268C55962N353M670M660M484L762L681M560M870M007L495M122M511L925L734
$$ 355962 361315 365985 370645 375129 378891 382572 387132 392002 396009 399504 403626 408137 412062 415796
58254D15796M655N299M922M890N825O173N201M614N447O273O129O334P616Q433
$$ 415796 420451 425750 430672 435562 441387 447560 452761 457375 462822 469095 475224 481558 489174 497607
58240D97607P997P969R218R939R049Q315R050R753R217Q918R968J0801J0233R869
$$ 497607 505604 513573 522791 532730 541779 550094 559144 568897 578114 587032 597000 607801 618034 627903
58226F27903J1027J2272J2344J2617J4175J5486J5379J5370J6654J7758J7563
$$ 627903 638930 651202 663546 676163 690338 705824 721203 736573 753227 770985 788548
58215G88548J7554J8825J9946K0079K0829K2808K3974K3595K4103K6605K8606
$$ 788548 806102 824927 844873 864952 885781 908589 932563 956158 980261 1006866 1035472
58204A035472K8745K9521L2528L5337L6229L7505M0849M3910M5042M6840N1186
$$ 1035472 1064217 1093738 1126266 1161603 1197832 1235337 1276186 1320096 1365138 1411978 1463164
58193A463164N5315N6762N7761O0702O3790O5273O7394P1775P5636P6993P8890
$$ 1463164 1518479 1575241 1633002 1693704 1757494 1822767 1890161 1961936 2037572 2114565 2193455
58182B193455Q3953Q9558R3048R6769J03096J09578J13971J18935J26695J34467
$$ 2193455 2277408 2366966 2460014 2556783 2659879 2769457 2883428 3002363 3129058 3263525
58172C263525J40235J47358J58159J69054J77555J87657K02368K17706K30427
$$ 3263525 3403760 3551118 3709277 3878331 4055886 4243543 4445911 4663617 4894044
58163D894044K44552K63534K83506L01446L22117L49117L77199M01797M27653
$$ 4894044 5138596 5402130 5685636 5987082 6309199 6658316 7035515 7437312 7864965
58154G864965M59431M93053N25694N64468O14679O69549P22512P79104Q45370
$$ 7864965 8324396 8817449 9343143 9907611 10522290 11191839 11914351 12693455 13538825
58145A3538825R16884R92324J084867J205716J350093J514641J712740J955813
$$ 13538825 14455709 15448033 16532900 17738616 19088709 20603350 22316090 24271903
58137B4271903K238640K563707K958082L440145L990261M579595N201246N851907
$$ 24271903 26510543 29074250 32032332 35472477 39462738 44042333 49243579 55095486
58129E5095486O538504P343660Q371351R449847R899042Q830618N887772J688708
$$ 55095486 61633990 68977650 77349001 86798848 96697890 105528508 111416280 113104988
58121A13104988k541271n779096p674519q415668q368702p874447p201199o515808
$$ 113104988 110563717 104784621 97110102 88694434 80325732 72451285 65250086 58734278
58113E8734278n874233n274735m716614m202839l724399l274071k860449k491463
$$ 58734278 52860045 47585310 42868696 38665857 34941458 31667387 28806938 26315475
58105B6315475k160480j860519j593746j356172j131574r10668p00047n06610
$$ 26315475 24154995 22294476 20700730 19344558 18212984 17302316 16602269 16095659
58097A6095659l31028j76268l7266J14938K95911M40109M16167J50671k79769
$$ 16095659 15764631 15588363 15551097 15666035 15961946 16402055 16818222 16968893 16689124
58088A6689124p06917j005845j152621j180539j129288j036269r35218q42358
$$ 16689124 15982207 14976362 13823741 12643202 11513914 10477645 9542427 8700069
58080H700069p56070o74955o04200n44333m88952m36170l90495l52157l15758
$$ 8700069 7943999 7269044 6664844 6120511 5631559 5195389 4804894 4452737 4136979
58071D136979k80486k51236k28821k08510j88794j72723j60397j48403j36765
$$ 4136979 3856493 3605257 3376436 3167926 2979132 2806409 2646012 2497609 2360844
58062B360844j28540j22729j15173j06088r9338r4727q8314p9960p3386o9122
$$ 2360844 2232304 2109575 1994402 1888314 1788976 1694249 1605935 1525975 1452589 1383467
58052A383467o4305n9199n7052n7534n6774n3983n1955n1052m8687m4809m2151
$$ 1383467 1319162 1259963 1202911 1145377 1088603 1034620 982665 931613 882926 838117 795966
58041G95966m0878l8430l4733l2343l1335k9213k5849k3599k2574k0625j7945
$$ 795966 755088 716658 681925 649582 618247 589034 563185 539586 517012 496387 478442
58030D78442j6910j7378j6804j4958j4010j4056j3080j1266j0860j1708j1401
$$ 478442 461532 444154 427350 412392 398382 384326 371246 359980 349120 337412 326011
58019C26011r819r258r974r892q883q997j0205j0072q137o637o433o003m875m414
$$ 326011 316192 306934 296960 287068 278185 269188 258983 248911 240774 234137 227704 221701 216826 212412
58005B12412m667m016k453j830k475k724k146k035k513k306j582j841k870k921
$$ 212412 207745 203729 201276 199446 196971 194247 192101 190066 187553 185247 183665 181824 178954 176033
57991A76033k030j936k688k605j732j895l113l306k055j288j745j901j054l97
$$ 176033 174003 172067 169379 166774 165042 163147 160034 156728 154673 153385 151640 149739 148685 148288
57977A48288l33K88J546J917J100O59J169J362P50M49P84N86l86q94o05p07j481
$$ 148288 147955 148243 149789 151706 152806 153465 154634 155996 156746 157195 157979 158565 158179 157285 156680 155973 154492
57960A54492j743j236j245k124k599k108j652j719j616j321j800k916l272k643
$$ 154492 152749 151513 150268 148144 145545 143437 141785 140066 138450 137129 135329 132413 129141 126498
57946A26498k370k866k982k362k114k575k647j957j544j755j631r79q82j484j468
$$ 126498 124128 121262 118280 115918 113804 111229 108582 106625 105081 103326 101695 100716 99834 98350 96882
57931I6882m23L43J70Q5P27J259J131J059J395J379P53L48L81kq85j168n99l29
$$ 96882 96459 96802 96972 97057 97784 99043 100174 101233 102628 104007 104760 105108 105489 105487 104602 103434 102835 102506
57913A02506p72q87l09k30j260k292k438k331k554k532j921j499j693j794j436
$$ 102506 101734 100847 100538 100308 99048 96756 94318 91987 89433 86901 84980 83481 81788 79994 78558
57898G8558j358j800j800r30k70o48j373j553j335j032l90M82Q02M21J94L95K45
$$ 78558 77200 75400 73600 72670 72400 71752 70379 68826 67491 66459 66069 66551 67353 67774 67968 68363 68608
57881F8608m37o61m5M09L2m51m41m67q91j085p86p95j472j912j558j198j482j800
$$ 68608 68171 67510 67465 67874 67906 67455 67014 66547 65656 64571 63785 62990 61518 59606 58048 56850 55368 53568
57863E3568j565j253j199p46M06J341J397J252J539J719J334J108J660K263K110
$$ 53568 52003 50750 49551 48805 49211 50552 51949 53201 54740 56459 57793 58901 60561 62824 64934
57848F4934J678J714J862J510J031J028J144Q16L86M47P27O29K16k15q50j795
$$ 64934 66612 68326 70188 71698 72729 73757 74901 75717 76103 76550 77277 77906 78122 77907 77057 75262
57832G5262k505k568k418k528k636k415k184k260k272j886j442j323j318j219
$$ 75262 72757 70189 67771 65243 62607 60192 58008 55748 53476 51590 50148 48825 47507 46288
57818D6288j218j244q10rK52l43q60n05K51O44P24Q51R70J068J471K053K091J527
$$ 46288 45070 43826 43016 43007 43259 42916 42056 41551 41802 42446 43170 44021 44991 46059 47530 49583 51674 53201
57800E3201J302J777J966J128Om83o33j024j274q96m76q20j606k000k015k146
$$ 53201 54503 56280 58246 59374 59380 58897 58264 57240 55966 55070 54594 53774 52168 50168 48153 46007
57784D6007k295k085j774j851k126k123j975k049k174j960j563j400j492j690
$$ 46007 43712 41627 39853 38002 35876 33753 31778 29729 27555 25595 24032 22632 21140 19450
57770A9450k023k358k272j768j503j799k151k202A011a857l111k601j875j575
$$ 19450 17427 15069 12797 11029 9526 7727 5576 3374 1011 -1857 -4968 -7569 -9444 -11019
57756a1019j491j226j017j114j111o89l25m26n67l29j30l90o41l35J93M53O95
$$ -11019 -12510 -13736 -14753 -15867 -16978 -17667 -17992 -18418 -18985 -19314 -19444 -19834 -20475 -20810 -20617 -20164 -19469
57739a9469J191J443J091Q18J315K047K118J671J338J032L83j99j43J86R8j80
$$ -19469 -18278 -16835 -15744 -14926 -13611 -11564 -9446 -7775 -6437 -5405 -5022 -5221 -5364 -5178 -5080 -5260
57723e260l7K64O1l85k78K45K85l41r33j097j115j153j051q65p99o59j76L33L51
$$ -5260 -5297 -5033 -4972 -5357 -5635 -5390 -5105 -5446 -6379 -7476 -8591 -9744 -10795 -11660 -12459 -13118 -13294 -12961 -12610
57704a2610K8q5R1K79N06R41J302J234R93J031J198J120R84J160d30H09R35J058
$$ -12610 -12582 -12667 -12576 -12297 -11791 -10850 -9548 -8314 -7321 -6290 -5092 -3972 -2988 -1828 -430 809 1744 2802
57686B802J466J521J125P21M59J58o2J05N41Q93J211J698K158K298K313K425K326
$$ 2802 4268 5789 6914 7635 8094 8252 8190 8295 8836 9729 10940 12638 14796 17094 19407 21832 24158
57669B4158J783J410J914K943L580L683L821M178M459M646M950N181N058M894
$$ 24158 25941 27351 29265 32208 35788 39471 43292 47470 51929 56575 61525 66706 71764 76658
57655G6658N208N817O163O280O569O956P147P456Q328R363R812R878J0417J1524
$$ 76658 81866 87683 93846 100126 106695 113651 120798 128254 136582 145945 155757 165635 176052 187576
57641A87576J2482J3080J3835J4914J5925J6907J8466K0746K3141K5245K7266
$$ 187576 200058 213138 226973 241887 257812 274719 293185 313931 337072 362317 389583
57630C89583K9397L1585L4025L7102M0722M4450M8284N2536N6999O1042O4524
$$ 389583 418980 450565 484590 521692 562414 606864 655148 707684 764683 825725 890249
57619H90249O7694P0178P0959O9535O6216O1174N4087M5016L4836K4612J5084
$$ 890249 957943 1028121 1099080 1168615 1234831 1296005 1350092 1395108 1429944 1454556 1469640
57608A469640O679r04r182j9959l3386m7497n9764o8563p3288p4094p1976o8314
$$ 1469640 1476319 1475415 1466233 1446274 1412888 1365391 1305627 1237064 1163776 1089682 1017706 949392
57596I49392o3939n9038n3875m8890m4082l9123l4199k9949k6394k2889j9265
$$ 949392 885453 826415 772540 723650 679568 640445 606246 576297 549903 527014 507749
57585E07749j6164j3855j1653q923o000l560j734k16J259K928M985P318R576J1727
$$ 507749 491585 477730 466077 457154 451154 447594 445860 445644 446903 449831 454816 462134 471710 483437
57571D83437J4041J6485J8764K0978K3599K6603K9446L2051L5029L8615M2165
$$ 483437 497478 513963 532727 553705 577304 603907 633353 665404 700433 739048 781213
57560G81213M5091M7506M9485N0350M9280M6111M1007L3862K4546J3467J431j0745
$$ 781213 826304 873810 923295 973645 1022925 1069036 1110043 1143905 1168451 1181918 1183349 1172604
57548A172604k2224l2124l9947m5770m9871n2402n3598n3851n3357n2020m9876
$$ 1172604 1150380 1118256 1078309 1032539 982668 930266 876668 822817 769460 717440 667564
57537F67564m7253m4390m1321l8244l5519l3179l0888k8541k6405k4530k2576
$$ 667564 620311 575921 534600 496356 460837 427658 396770 368229 341824 317294 294718
57526B94718k0441j8498j6958j5548j4094j2895j2147j1493j0557r508q747q286
$$ 294718 274277 255779 238821 223273 209179 196284 184137 172644 162087 152579 143832 135546
57514A35546p883p399o801o023n117m357l946l777l593l208k551j746j130q90
$$ 135546 127663 120264 113463 107440 102323 97966 94020 90243 86650 83442 80891 79145 78015 77125
57500G7125p31k58M39J006J475K149K953L500L803M253M877N292N519O077P095
$$ 77125 76394 76136 76575 77581 79056 81205 84158 87658 91461 95714 100591 105883 111402 117479 124574
57485A24574Q009Q469Q874R709J0879J2032J3027J3875J4649J5671J7268J9202
$$ 124574 132583 141052 149926 159635 170514 182546 195573 209448 224097 239768 257036 276238
57473B76238K0908K2401K4308K6861K9508L1774L3769L5620L7107L8170L8971
$$ 276238 297146 319547 343855 370716 400224 431998 465767 501387 538494 576664 615635
57462F15635L9150L7746L4300K9318K3276J5900P063k390j1313j9243k6114l1585
$$ 615635 654785 692531 726831 756149 779425 795325 802388 799998 788685 769442 743328 711743
57450G11743l5360l7702l9013l9256l8368l6778l4999l3042l0786k8484k6368
$$ 711743 676383 638681 599668 560412 522044 485266 450267 417225 386439 357955 331587
57439C31587k4177k1678j9155j6959j4908j2794j0986r869r082q010o670n417
$$ 331587 307410 285732 266577 249618 234710 221916 210930 201061 191979 183969 177299 171882
57427A71882m135k513q55K36Q79J851L434N113O426P514Q693R992J1343J2801
$$ 171882 167747 165234 164379 164615 165494 167345 170779 175892 182318 189832 198525 208517 219860 232661
57413B32661J4441J6299J8423K0745K2930K4676K6148K7821K9863L1932L3520
$$ 232661 247102 263401 281824 302569 325499 350175 376323 404144 434007 465939 499459
57402D99459L4253L3885L2208K9035K4222J7778R994J317p843j6950k5123l1562
$$ 499459 533712 567597 599805 628840 653062 670840 680834 682151 674308 657358 632235 600673
57390F00673l6252l9805m2428m3698m3489m2442m1159l9569l7517l5319l3199
$$ 600673 564421 524616 482188 438490 395001 352559 311400 271831 234314 198995 165796
57379A65796l0815k8011k5466k3806k2530A4468c890j6388j5094j3978j2772j1840
$$ 165796 134981 106970 81504 57698 35168 14468 -3890 -20278 -35372 -49350 -62122 -73962
57367g3962j1362j0938j0222r395q749q272p831p407o981o523o110n841n587n183
$$ -73962 -85324 -96262 -106484 -115879 -124628 -132900 -140731 -148138 -155119 -161642 -167752 -173593 -179180 -184363
57353a84363m766m605m654m620m433m272m171l976l699l537l537l541l444l211
$$ -184363 -189129 -193734 -198388 -203008 -207441 -211713 -215884 -219860 -223559 -227096 -230633 -234174 -237618 -240829
57339b40829k783k204j755j626j599j407j223j377j726j805j541j335j463j791
$$ -240829 -243612 -245816 -247571 -249197 -250796 -252203 -253426 -254803 -256529 -258334 -259875 -261210 -262673 -264464
57325b64464k102k319k407k361k324k387k375k095j722j567j590j524j366j343
$$ -264464 -266566 -268885 -271292 -273653 -275977 -278364 -280739 -282834 -284556 -286123 -287713 -289237 -290603 -291946
57311b91946j455j462j282j006o09o2L66L70J13M1K07L25L61O20J121J451J366
$$ -291946 -293401 -294863 -296145 -297151 -297760 -297822 -297456 -297086 -296973 -296932 -296725 -296400 -296039 -295419 -294298 -292847 -291481
57294b91481J069Q26O61N61N78O13M44Q2k25l72m95o11n74m00k97k82j26K13N09
$$ -291481 -290412 -289586 -288925 -288364 -287786 -287173 -286729 -286647 -286872 -287244 -287739 -288350 -288924 -289324 -289621 -289903 -290029 -289816 -289307
57275b89307O14O00N19L01K2q6mM7l3j09r0n1m9r1k79o49r18q33o70r32j534j812
$$ -289307 -288693 -288093 -287574 -287273 -287251 -287337 -287341 -287294 -287327 -287436 -287526 -287577 -287626 -287717 -287996 -288645 -289563 -290396 -291066 -291998 -293532 -295344
57253b95344j478j026j016j406j806j980j877j507j022n99j64M75J108J247Q33
$$ -295344 -296822 -297848 -298864 -300270 -302076 -304056 -305933 -307440 -308462 -309061 -309225 -308750 -307642 -306395 -305562
57238c05562M58N88J016J317J431J509J561J598J811K280K766L066L347L872M594
$$ -305562 -305104 -304516 -303500 -302183 -300752 -299243 -297682 -296084 -294273 -291993 -289227 -286161 -282814 -278942 -274348
57223b74348N284N852O315O641O891P272P845Q338Q414P984P116N879M412K905
$$ -274348 -269064 -263212 -256897 -250256 -243365 -236093 -228248 -219910 -211496 -203512 -196396 -190517 -186105 -183200
57209a83200J349m31k386m162n577o873q269r638j0799j1782j2565j2903j2738
$$ -183200 -181851 -182282 -184668 -188830 -194407 -201280 -209549 -219187 -229986 -241768 -254333 -267236 -279974
57196b79974j2420j2199j1795j0908r836r122q818q553q163p788p456p038o607
$$ -279974 -292394 -304593 -316388 -327296 -337132 -346254 -355072 -363625 -371788 -379576 -387032 -394070 -400677
57183d00677o378o295o049n537m945m393l783l072k433k073k102k551l339m152
$$ -400677 -407055 -413350 -419399 -424936 -429881 -434274 -438057 -441129 -443562 -445635 -447737 -450288 -453627 -457779
57169d57779m645m738m622m480m370m268m086l673l020k349j802j236n04J80N40
$$ -457779 -462424 -467162 -471784 -476264 -480634 -484902 -488988 -492661 -495681 -498030 -499832 -501068 -501572 -501392 -500852
57154e00852P25J146J814K276K219J784J227N67k48j115j908k611l264l854m384
$$ -500852 -500127 -498981 -497167 -494891 -492672 -490888 -489661 -489094 -489342 -490457 -492365 -494976 -498240 -502094 -506478
57139e06478m865n208n325n369n671o335p085p626p969q316q726r058r230r382
$$ -506478 -511343 -516551 -521876 -527245 -532916 -539251 -546336 -553962 -561931 -570247 -578973 -588031 -597261 -606643
57125f06643r759j0381j0913j0979j0605j0169r886r582r170q975r311r968j0539
$$ -606643 -616402 -626783 -637696 -648675 -659280 -669449 -679335 -688917 -698087 -707062 -716373 -726341 -736880
57112g36880j1069j1971j3367j4968j6590j8356k0341k2384k4352k6231k8000
$$ -736880 -747949 -759920 -773287 -788255 -804845 -823201 -843542 -865926 -890278 -916509 -944509
57101i44509k9685l1474l3438l5257l6681l8133m0281m3068m5890m8716n2246
$$ -944509 -974194 -1005668 -1039106 -1074363 -1111044 -1149177 -1189458 -1232526 -1278416 -1327132 -1379378
57090a379378n6765o1654o6388p1287p6812q2771q8753r4844j01434j08738j16842
$$ -1379378 -1436143 -1497797 -1564185 -1635472 -1712284 -1795055 -1883808 -1978652 -2080086 -2188824 -2305666
57079b305666j25747j34976j43775j52131j60996j71042j81879j92989k04682
$$ -2305666 -2431413 -2566389 -2710164 -2862295 -3023291 -3194333 -3376212 -3569201 -3773883
57070c773883k17477k31300k46068k62315k80496l00310l21608l45196l71840
$$ -3773883 -3991360 -4222660 -4468728 -4731043 -5011539 -5311849 -5633457 -5978653 -6350493
57061f350493m01225m33008m68152n08094n53246o03618o60317p25141p99253
$$ -6350493 -6751718 -7184726 -7652878 -8160972 -8714218 -9317836 -9978153 -10703294 -11502547
57052a1502547q83579r79911j090367j216547j360579j525968j715585j929643
$$ -11502547 -12386126 -13366037 -14456404 -15672951 -17033530 -18559498 -20275083 -22204726
57044b2204726k167588k431289k724944l053805l426053l855227m358078m950738
$$ -22204726 -24372314 -26803603 -29528547 -32582352 -36008405 -39863632 -44221710 -49172448
57036d9172448n648640o466991p416183q496882r701907j1019731j2431991j3911273
$$ -49172448 -54821088 -61288079 -68704262 -77201144 -86903051 -97922782 -110354773 -124266046
57028a24266046j5424279j6925502j8336403j9547230k0468297k1065928k1283505
$$ -124266046 -139690325 -156615827 -174952230 -194499460 -214967757 -236033685 -257317190
57021b57317190k0887326j9443118j6553667j2192926o817900j148214M170104
$$ -257317190 -278204516 -297647634 -314201301 -326394227 -333212127 -334360341 -330190237
57014c30190237Q743568J2408076J5144628J7032268J8215361J8851395J9066349
$$ -330190237 -321446669 -309038593 -293893965 -276861697 -258646336 -239794941 -220728592
57007b20728592J8947945J8558808J7941657J7122152J6123426J4981292J3743298
$$ -220728592 -201780647 -183221839 -165280182 -148158030 -132034604 -117053312 -103310014
57000a03310014J2457943J1169567R918344Q736590P644170O650529N760133M973829
$$ -103310014 -90852071 -79682504 -69764160 -61027570 -53383400 -46732871 -40972738 -35998909
56992c5998909M287750L695072L188550K759507K396359K087265J823675J599539
$$ -35998909 -31711159 -28016087 -24827537 -22068030 -19671671 -17584406 -15760731 -14161192
56984a4161192J408534J244322J102505R80258Q74652P82918P03372O34492N73889
$$ -14161192 -12752658 -11508336 -10405831 -9425573 -8550921 -7768003 -7064631 -6430139 -5856250
56975e856250N19561M71185M28739L90878L55991L23892K94970K68614K43964
$$ -5856250 -5336689 -4865504 -4436765 -4045887 -3689896 -3366004 -3071034 -2802420 -2558456
56966b558456K21383K01613J84167J67991J53096J40176J29094J19055J09798
$$ -2558456 -2337073 -2135460 -1951293 -1783302 -1630206 -1490030 -1360936 -1241881 -1132083
56957a132083J01432R3540Q5595P7839P0812O4402N8244N2507M7421M2644L7902
$$ -1132083 -1030651 -937111 -851516 -773677 -702865 -638463 -580219 -527712 -480291 -437647 -399745
56946c99745L3564K9706K5494K0440J5418J1248P236K554j713l562k691o65J266
$$ -399745 -366181 -336475 -310981 -290541 -275123 -263875 -256639 -254085 -255798 -259360 -262051 -262716 -261450
56933b61450L050M690N751O114O090N664M600L287K425J889R24n47j786k473l039
$$ -261450 -258400 -253710 -247959 -241845 -235755 -230091 -225491 -222204 -219779 -217890 -216966 -217513 -219299 -221772 -224811
56918b24811l672l935l575k983k517k024j217rJ611L528N346O717P766Q813R863
$$ -224811 -228483 -232418 -235993 -238976 -241493 -243517 -244734 -244743 -243132 -239604 -234258 -227541 -219775 -210962 -201099
56903b01099J0786J1677J2547J3019J2936J2840J3151J3347J2743J1638J0787
$$ -201099 -190313 -178636 -166089 -153070 -140134 -127294 -114143 -100796 -88053 -76415 -65628
56892f5628J0098Q964P595O867O891O876O455e768C66O191O137O379P005P463
$$ -65628 -55530 -46566 -38971 -32104 -25213 -18337 -11882 -5768 366 6557 12694 19073 26078 33541
56878C3541P410P188P134P125P020O948O871O500N842N243M649L452J362j064
$$ 33541 40951 48139 55273 62398 69418 76366 83237 89737 95579 100822 105471 108923 110285 109221
56864A09221l032m170m461m092l567l456l734l813l366k683k079j490q33k89J01
$$ 109221 106189 102019 97558 93466 89899 86443 82709 78896 75530 72847 70768 69278 68445 68156 68257
56849F8257N71J240J865K310K796L500M239M777N132N453N802O212O652O947O993
$$ 68257 68828 70068 71933 74243 77039 80539 84778 89555 94687 100140 105942 112154 118806 125753 132746
56834A32746P010P253P542P454O990O567O386O245N982N576M795L250R52j591
$$ 132746 139756 147009 154551 162005 168995 175562 181948 188193 194175 199751 204546 207796 208748 207157
56820B07157l861n576o523o680o447o239n879m882l333j812n30Q16K247L332M019
$$ 207157 203296 197720 191197 184517 178070 171831 165952 161070 157737 155925 155395 156211 158458 161790 165809
56805A65809M920O391P990R204J0171J1260J2324J2760J2006R820O434K701l40
$$ 165809 170729 177120 185110 194314 204485 215745 228069 240829 252835 262655 269089 271790 271450
56792B71450k322l626m552m873m421l561k701j762n36Q28K050L169M419N842P373
$$ 271450 269128 265502 260950 256077 251656 248095 245394 243632 243096 243924 245974 249143 253562 259404 266777
56777B66777R050J0862J2578J3935J4820J5049J4150J1623P428K175k996o863
$$ 266777 275827 286689 299267 313202 328022 343071 357221 368844 376272 378447 375451 368588
56765C68588q862r459r607r713r465q560p230n901m719l559k258p33R23K407L545
$$ 368588 359726 350267 340660 330947 321482 312922 305692 299791 295072 291513 289255 288522 289445 291852 295397
56750B95397M606N960P538Q966J0003J0390R400O351J672l130o779q994r992r955
$$ 295397 300003 305963 313501 322467 332470 342860 352260 358611 360283 357153 350374 341380 331388 321433
56736C21433r211q327p576o796n922n172m525l585k300j169m51K81J415K650L557
$$ 321433 312222 303895 296319 289523 283601 278429 273904 270319 268019 266850 266399 266680 268095 270745 274302
56721B74302M216M815N036M373K758N03k124m748o741p681p819p644p255o533
$$ 274302 278518 283333 288369 292742 295500 296003 293879 289131 282390 274709 266890 259246 251991 245458
56707B45458n694n141m909m679m253l702l112k516k016j733j589j344q56k15L24
$$ 245458 239764 234623 229714 225035 220782 217080 213968 211452 209436 207703 206114 204770 203914 203699 204023
56692B04023N22L64J00r8l51p63j035q09k88m0j95l68l93n90j112j577j592j248
$$ 204023 204545 204909 205009 204911 204560 203797 202762 201953 201665 201625 201430 201062 200669 200079 198967 197390 195798 194550
56674A94550q39n54n48r12j420j696j751j881j994j688j046p05q57r45o51m55
$$ 194550 193711 193157 192609 191697 190277 188581 186830 184949 182955 181267 180221 179516 178659 177714 177063 176608
56658A76608q06j346j510j263q59l47J62L06L7j49M5K30L0k94m49o61j032j027
$$ 176608 175802 174456 172946 171683 170824 170477 170639 170945 170982 170833 170878 171108 171138 170844 170395 169734 168702 167675
56640A67675k82N90P68M22K85M87N75M59M90P25Q70Q48Q45Q21N91K76J92L18L59
$$ 167675 167393 167983 168751 169173 169458 169945 170520 170979 171469 172194 173064 173912 174757 175578 176169 176445 176637 176955 177314
56621A77314K26O5k2J6K85O68P87N44L52M52M91J83j01KJ20k14o87p41n83p73
$$ 177314 177540 177605 177583 177599 177884 178552 179339 179883 180235 180687 181178 181361 181260 181262 181382 181168 180481 179740 179157 178384
56601A78384j133j019m51o6j9J10L63K61k64o24m85k05j81l71o38r66j186j018
$$ 178384 177251 176232 175781 175715 175696 175806 176169 176430 176166 175542 175057 174852 174671 174300 173662 172696 171510 170492
56583A70492n35j46qM7J2l22p98r21n85k92m11p18q29o84m48k37j58k60m11l93
$$ 170492 169957 169811 169803 169850 169862 169540 168742 167821 167236 166944 166533 165815 164986 164302 163854 163617 163459 163199 162788 162395
56563A62395j88N8K88M83N17L62K78M49N62K20m20p80o44l04m5P7N8p1j11N9K63
$$ 162395 162207 162265 162553 163036 163553 163915 164193 164642 165204 165424 165004 164224 163580 163276 163231 163308 163366 163295 163184 163243 163506
56542A63506L78O26J087J279P54j03n39m36k45j12J63M43L21r5k27J05M80O02
$$ 163506 163884 164510 165597 166876 167630 167527 166988 166552 166307 166195 166358 166801 167122 167027 166800 166905 167385 167987
56524A67987N49L44m0k66R2P65R86O19L37N56R03R44Q02P08N86L79L22N85J018
$$ 167987 168536 168880 168840 168574 168666 169431 170417 171036 171373 171929 172832 173776 174578 175286 175872 176251 176573 177158 178176
56505A78176J472J995K555K959L121L088K810K324K072K494L295L707L507L148
$$ 178176 179648 181643 184198 187157 190278 193366 196176 198500 200572 203066 206361 210068 213575 216723
56491B16723K901K517J865J259Q97N95K54K2j32m99j075j477j553j584j752j952
$$ 216723 219624 222141 224006 225265 226162 226757 227011 227033 226901 226402 225327 223850 222297 220713 218961 217009
56475B17009k221k764l449l813l751l559l317k805k140j784j733j482r92q65j270
$$ 217009 214788 212024 208575 204762 201011 197452 194135 191330 189190 187406 185673 184191 183199 182334 181064
56460A81064j527j197q22j002j411j391j022r29j294j647j557j074n88m68p13
$$ 181064 179537 178340 177518 176516 175105 173714 172692 171763 170469 168822 167265 166191 165603 165135 164422
56445A64422r26p76m51l26l19p5L17M25K83L85P90R83P91O94R16R64M92r1k45
$$ 164422 163496 162720 162269 161943 161624 161549 161866 162291 162574 162959 163749 164732 165523 166217 167133 168097 168589 168498 168253
56426A68253rL31P17J058J061P12M79O32Q59Q26O86O43N47K61KJ9L02Q01J465
$$ 168253 168244 168575 169292 170350 171411 172123 172602 173234 174093 174919 175605 176248 176795 177056 177058 177077 177379 178180 179645
56407A79645J938J778J171Q35J006J208J184J294J676J843J531J216J308J509
$$ 179645 181583 183361 184532 185367 186373 187581 188765 190059 191735 193578 195109 196325 197633 199142
56393A99142J499J529J824K023J757J222O80K0o95r34n24j38k82m75r1N37O47
$$ 199142 200641 202170 203994 206017 207774 208996 209676 209696 209001 208067 207543 207405 207123 206648 206557 207094 207741
56376B07741J86l20o63r88j236j279j348j723k158k158j652j012n75n23r00j434
$$ 207741 207927 207607 206944 205956 204720 203441 202093 200370 198212 196054 194402 193390 192815 192292 191392 189958
56360A89958j672j521j347j343j261j027r69j168j232j026r97j306j429j025n09
$$ 189958 188286 186765 185418 184075 182814 181787 180818 179650 178418 177392 176395 175089 173660 172635 172126
56345A72126k55MM23N54K15N0M69Q23M71p2OM33L85j47m84m02k18l3K66M97N08
$$ 172126 171871 171875 172298 172852 173067 173117 173586 174409 174880 174808 174814 175247 175632 175485 175001 174599 174381 174348 174614 175111 175619
56324A75619O43J162J568J296P24O47J078J374J272J049Q41O06N09O63P18L76
$$ 175619 176262 177424 178992 180288 181012 181659 182737 184111 185383 186432 187273 187879 188388 189051 189769 190145
56308A90145k0L9M43P90J084J371J263N35j74r1O26J240J476J456J096M13j1K61
$$ 190145 190125 190164 190607 191397 192481 193852 195115 195650 195476 195385 196011 197251 198727 200183 201279 201692 201681 201942
56290B01942P72R14R17J236J479J055L86L61Q97J176J090J224J628J720J408J216
$$ 201942 202714 203628 204545 205781 207260 208315 208701 209062 209959 211135 212225 213449 215077 216797 218205 219421
56274B19421J292J303J277J604K168K414K316K397K780L057L058L000K899K627
$$ 219421 220713 222016 223293 224897 227065 229479 231795 234192 236972 240029 243087 246087 248986 251613
56260B51613K474K807L333L470L331L514L993M180L964L792L782L579L135K790
$$ 251613 254087 256894 260227 263697 267028 270542 274535 278715 282679 286471 290253 293832 296967 299757
56246B99757K598K291J902J698J627J467J384J656K047K156K084K095K013J746
$$ 299757 302355 304646 306548 308246 309873 311340 312724 314380 316427 318583 320667 322762 324775 326521
56232C26521J883K865M033M518M600N096N904O344O551P195Q097Q560Q766R485
$$ 326521 328404 331269 335302 339820 344420 349516 355420 361764 368315 375510 383607 392167 400933 410418
56218D10418J0570J1179J1429J2332J4080J5775J7009J8277J9721K0878K1925
$$ 410418 420988 432167 443596 455928 470008 485783 502792 521069 540790 561668 583593
56207E83593K3726K6366K8887L0863L3015L5886L9073M2145M5258M8527N1740
$$ 583593 607319 633685 662572 693435 726450 762336 801409 843554 888812 937339 989079
56196I89079N4968N8494O2017O4795O6685O7998O8436O7351O4978O2082N8355
$$ 989079 1044047 1102541 1164558 1229353 1296038 1364036 1432472 1499823 1564801 1626883 1685238
56185A685238N2618M4776L6128K7518J8626R383O32p071j4028k0261k5124k8525
$$ 1685238 1737856 1782632 1818760 1846278 1864904 1874287 1874919 1867848 1853820 1833559 1808435 1779910
56173A779910l1250l3652l5237l5900l6393l7099l7629l8032l9061m0769m2173
$$ 1779910 1748660 1715008 1679771 1643871 1607478 1570379 1532750 1494718 1455657 1414888 1372715
56162A372715m2823m3423m4398m5087m5038m4821m4864m4677m3873m2843m1806
$$ 1372715 1329892 1286469 1242071 1196984 1151946 1107125 1062261 1017584 973711 930868 889062
56151H89062m0277l8105l5937l4130l2219k9987k7917k6128k4022k1520j9426
$$ 889062 848785 810680 774743 740613 708394 678407 650490 624362 600340 578820 559394
56140E59394j8078j6828j5345j4169j3407j2271j0535r168q782q638p958o997
$$ 559394 541316 524488 509143 494974 481567 469296 458761 449593 440811 432173 424215 417218
56128D17218o166n241m191l614l635l463k686j897j458q76J1N52N66Q77J828K617
$$ 417218 411052 405811 401620 398006 394371 390908 388222 386325 384867 383991 384002 384554 385120 385997 387825 390442
56112C90442K774K987L704M271M251M280M816N255N113M847M748M328L489K966
$$ 390442 393216 396203 399907 404178 408429 412709 417525 422780 427893 432740 437488 441816 445305 448271
56098D48271K919K457J354P26J181J795J805J806K345K861L046L716N250O666
$$ 448271 451190 453647 455001 455727 456908 458703 460508 462314 464659 467520 470566 474282 479532 486198
56084D86198P332Q098R685J1413J2695J4250J6628J9018K0774K2638K5174K7410
$$ 486198 493530 501628 511313 522726 535421 549671 566299 585317 606091 628729 653903 681313
56072F81313K8391K8652K8828K8196K6114K3554K1775K0603J9268J7807J6351
$$ 681313 709704 738356 767184 795380 821494 845048 866823 887426 906694 924501 940852
56061I40852J4279J1259P931M598O11l922p492r360j0739j2664j4512j5887j7921
$$ 940852 955131 966390 974321 978919 979530 975608 968116 958756 948017 935353 920841 904954 887033
56048H87033k1158k3991k5039k5190k5570k5313k3331k0600j8584j6930j4673
$$ 887033 865875 841884 816845 791655 766085 740772 717441 696841 678257 661327 646654
56037F46654j2320j0703r244p247n539m936m520l381k522l051m028m099l763l971
$$ 646654 634334 623631 614387 607140 601601 596665 592145 588764 586242 583191 579163 575064 571301 567330
56023E67330m047l130k109j976j820o49M45K14k69N53J972K542K782L866N124
$$ 567330 563283 560153 558044 556068 554248 553599 554044 554258 553989 554542 556514 559056 561838 565704 570828
56008E70828N373N290O022O837O645O281O863P486P105O934Q279R741R460Q452
$$ 570828 576201 581491 587513 594350 600995 607276 614139 621625 628730 635664 643943 653684 663144 671596
55994F71596Q719R717R805R585J0502J1725J1653J1119J1844J3107J3281J3153
$$ 671596 680315 690032 699837 709422 719924 731649 743302 754421 766265 779372 792653 805806
55982H05806J4393J6119J6491J6258J7284J8905J9328J9203K0217K1578K1634
$$ 805806 820199 836318 852809 869067 886351 905256 924584 943787 964004 985582 1007216
55971A007216K1452K2998K5250K6021K6113K7682K9991L1019L1688L4181L7489
$$ 1007216 1028668 1051666 1076916 1102937 1129050 1156732 1186723 1217742 1249430 1283611 1321100
55960A321100L9107L9819M2225M5857M8339N0108N3239N6870N8640N9371O1577
$$ 1321100 1360207 1400026 1442251 1488108 1536447 1586555 1639794 1696664 1755304 1814675 1876252
55949A876252O4646O6354O7689P1057P5297P7792P9877Q4579R0705R5029R8612
$$ 1876252 1940898 2007252 2074941 2145998 2221295 2299087 2378964 2463543 2554248 2649277 2747889
55938B747889J04749J12285J17545J21400J27662J35918J42807J49055J58076
$$ 2747889 2852638 2964923 3082468 3203868 3331530 3467448 3610255 3759310 3917386
55929C917386J69055J78744J88616K02465K18570K32315K45061K61884K82188
$$ 3917386 4086441 4265185 4453801 4656266 4874836 5107151 5352212 5614096 5896284
55920E896284L01566L21234L45922L73957L99696M24430M54383M89557N25783
$$ 5896284 6197850 6519084 6865006 7238963 7638659 8063089 8517472 9007029 9532812
55911I532812N65992O17026O76713P37041P98659Q68759R47218J030453J126836
$$ 9532812 10098804 10715830 11392543 12129584 12928243 13797002 14744220 15774673 16901509
55902A6901509J251064J405109J582921J790962K042712K336514K664969L044719
$$ 16901509 18152573 19557682 21140603 22931565 24974277 27310791 29975760 33020479
55894C3020479L508062M066478M715014N468725O351507P349549Q422300R528929
$$ 33020479 36528541 40595019 45310033 50778758 57130265 64479814 72902114 82431043
55886H2431043J0509184J0881670R923896P192762L042209j463152n217435p674804
$$ 82431043 92940227 103821897 113745793 120938555 123980764 122517612 117300177 109625373
55878A09625373q896790r217568q970267q418910p753662p070087o388044n714355
$$ 109625373 100728583 91511015 82540748 74121838 66368176 59298089 52910045 47195690
55870D7195690n071558m476372l929600l435244l004501k636863k318488k041756
$$ 47195690 42124132 37647760 33718160 30282916 27278415 24641552 22323064 20281308
55862B0281308j807834j609550j431054j266699j123786j004789r02147q11849
$$ 20281308 18473474 16863924 15432870 14166171 13042385 12037596 11135449 10323600
55854A0323600p36970o75537o18599n63075n14304m73597m34845l95660l60895
$$ 10323600 9586630 8911093 8292494 7729419 7215115 6741518 6306673 5911013 5550118
55845E550118l32530l06146k79841k57253k39335k21880k03556j88310j77609
$$ 5550118 5217588 4911442 4631601 4374348 4135013 3913133 3709577 3521267 3343658
55836C343658j67899j57618j49384j43434j36080j26465j18180j12417j06084
$$ 3343658 3175759 3018141 2868757 2725323 2589243 2462778 2344598 2232181 2126097
55827B126097r8210r1813q7760q2968p6436p1136o8272o5287o1210n8389n7328
$$ 2126097 2027887 1936074 1848314 1765346 1688910 1617774 1549502 1484215 1423005 1364616 1307288
55816A307288n5164n0995m7585m6193m4564m1666l9545l8977l7873l5561l4176
$$ 1307288 1252124 1201129 1153544 1107351 1062787 1021121 981576 942599 904726 869165 834989
55805H34989l4274l3490l0935k8703k7608k5664k2229j9467j8277j6723j4008
$$ 834989 800715 767225 736290 707587 679979 654315 632086 612619 594342 577619 563611
55794E63611j2063j1797j1515j0522j0462j1782j2429j1514j0740j0875j0372
$$ 563611 551548 539751 528236 517714 507252 495470 483041 471527 460787 449912 439540
55783D39540q713p604p579o898n104m186m833n070m002l459m413n178m755m707
$$ 439540 430827 423223 415644 408746 403642 399456 394623 389553 385551 382092 377679 372501 367746 363039
55769C63039n942o847o292n596n774n745m918m768o084p321p282o949p155o987
$$ 363039 357097 350250 343958 338362 332588 326843 321925 317157 311073 303752 296470 289521 282366 275379
55755B75379o020n511n931n811m480l436l567l551k522j706j934j961r16Rq4p3
$$ 275379 269359 263848 257917 252106 247626 244190 240623 237072 234550 232844 230910 228949 228033 228042 227958 227885
55739B27885Q67J593J215P76J085J065m2j013q99q35j875l028l179l075l635m119
$$ 227885 228752 230345 231560 232336 233421 234486 234444 233431 232532 231697 229822 226794 223615 220540 216905 212786
55723B12786l694l150l353l643l246k719k520j923p48l95j620l028l288l173l767
$$ 212786 209092 205942 202589 198946 195700 192981 190461 188538 187790 187395 185775 182747 179459 176286 172519
55708A72519m444m262l792l840l873l285k806l063l244k695k366l089l901l673
$$ 172519 168075 163813 160021 156181 152308 149023 146217 143154 139910 137215 134849 131760 127859 124186
55694A24186k990k818k708j965j197j111j013k30L48k36j202j385j230j695k336
$$ 124186 121196 118378 115670 113705 112508 111397 110384 110154 110502 110266 109064 107679 106449 104754 102418
55679A02418k184j570j376j408j035n81n64m92J72P36M37j48k21k81j067j954
$$ 102418 100234 98664 97288 95880 94845 94264 93700 93208 93380 94116 94553 94405 94184 93903 92836 90882
55663I0882j991j610j726k023j673j002q59j046q72n57o36o76n3O69N78M8J22
$$ 90882 88891 87281 85555 83532 81859 80857 79998 78952 78080 77523 76887 76211 76158 76827 77405 77453 77575
55646G7575P98J342J645J991K074J541J004J129J379Q99N1k24j8m0j61K98J225
$$ 77575 78373 79715 81360 83351 85425 86966 87970 89099 90478 91377 91428 91204 91186 91146 90985 91283 92508
55629I2508J976K505L071L299K707J768J300J235J063R26J113J123M32l60m08
$$ 92508 94484 96989 100060 103359 106066 107834 109134 110369 111432 112358 113471 114594 115026 114666 114258
55614A14258q5k47o26l33M25O68L38K89P03Q78N45K28K08J59j44n37q18q15l12
$$ 114258 114173 113926 113300 112967 113392 114060 114398 114687 115390 116268 116813 117041 117249 117408 117264 116727 115909 115094 114782
55595A14782M38O78K13j14K35N14j6o95n83j70n80j639k220k132k220k801l336
$$ 114782 115220 115898 116111 115997 116232 116746 116730 116035 115452 115282 114702 113063 110843 108711 106491 103690 100354
55578A00354l528l566l379k817k406k725l256k986k070j628j978k304k108j804
$$ 100354 96826 93260 89881 87064 84658 81933 78677 75691 73621 71993 70015 67711 65603 63799
55564F3799j717j558j155q07o99o77p08r10j115j065r25j028j190j019o53n35
$$ 63799 62082 60524 59369 58562 57863 57186 56478 55568 54453 53388 52463 51435 50245 49226 48573 48038
55548D8038o24n49l58l64m67l32k1J74L03N05N11R5l42l15m8qn9J35L07N5l04
$$ 48038 47414 46865 46507 46143 45676 45344 45323 45497 45800 46305 46816 46911 46569 46254 46206 46198 46139 46274 46581 46636 46332
55527D6332k09J63K53Q7Nj64p13j217j017l05K47N55Q87R61L63m30n68j25J31
$$ 46332 46123 46286 46539 46626 46631 46467 45754 44537 43520 43215 43462 44017 44904 45865 46228 45798 45230 45105 45236
55508D5236O5J84N30O34N11O12Q73Q21N37N21P10N92K36J54K91J13l03l52k9J2
$$ 45236 45301 45485 46015 46649 47160 47772 48645 49466 50003 50524 51234 51826 52062 52216 52507 52620 52317 51965 51936 51948
55488E1948m19q08q54o84k61N22J189J112N51L12M37K73k11k85K50P75R49J146
$$ 51948 51529 50721 49867 49183 48922 49444 50633 51745 52296 52608 53045 53318 53107 52822 53072 53847 54796 55942
55470E5942J510J630J357J100J032Q56N48M59N33K37m68r07p12l06j50k46n28
$$ 55942 57452 59082 60439 61539 62571 63427 63975 64434 64967 65204 64736 63829 63117 62811 62661 62415 61887
55453F1887j034j515j570j326j322j633j786j614j423j266q78m08m04r17j326
$$ 61887 60853 59338 57768 56442 55120 53487 51701 50087 48664 47398 46520 46112 45708 44791 43465
55438D3465j301j137j074r36o98o40q20r47r39r71r60o25j33Qk61n57p54j013
$$ 43465 42164 41027 39953 39017 38319 37679 36859 35912 34973 34002 33042 32417 32284 32292 32031 31474 30720 29707
55420B9707j140p66j44N2k48m91m96n90p42n20l3O2l03m33l1L48K68Lj52l42n70
$$ 29707 28567 27801 27657 27709 27461 26970 26474 25884 25142 24622 24589 24651 24348 23915 23884 24232 24500 24503 24351 24009 23439
55399B3439m66rK67Q3k06k53j81r0J31L97M08K36K52L60J06l76l99J40N27L80
$$ 23439 22973 22964 23231 23314 23108 22855 22674 22584 22715 23112 23520 23756 24008 24368 24474 24098 23699 23839 24366 24746
55379B4746J20N4j40n89q02m85n4Q2P8J06nk33j70K49M97L45K69N92Q94P10K10
$$ 24746 24866 24920 24780 24191 23389 22904 22850 22932 23010 23116 23111 22878 22708 22957 23454 23799 24068 24660 25554 26264 26474
55358B6474k28n51p87q16p22q34j088r58k97L61O30P40Q83Q00L57p8k44l57n33
$$ 26474 26246 25695 24908 24092 23370 22536 21448 20490 20193 20554 21184 21924 22807 23607 23964 23886 23642 23285 22752
55339B2752m71p9K27J90J08J88J64r5k30l2J76J64K11M88O48M37J22n6k70n89
$$ 22752 22281 22202 22429 22619 22727 22915 23079 22984 22754 22722 22898 23062 23273 23761 24409 24846 24968 24912 24642 24053
55319B4053o70l96j70k26j97J74N39N71N01N73N08N0m92p13o50m77j45K60L42
$$ 24053 23383 22987 22817 22591 22394 22568 23107 23678 24179 24752 25260 25310 24818 24105 23455 22978 22833 23093 23435
55300B3435J3k19k2K46J30k42n11o14n81l10J00K78J51J00K57K45j10l79k89j39
$$ 23435 23448 23229 23207 23453 23583 23341 22830 22216 21635 21325 21425 21703 21854 21954 22211 22456 22346 21967 21678 21539
55280B1539j50j9M06O80M90K22K81M29K79m7l19o06q55o57L0M98K44k50k87N8
$$ 21539 21389 21370 21776 22456 22946 23168 23449 23878 24157 24110 23791 23185 22330 21673 21703 22201 22445 22195 21908 21966
55260B1966K64J98j4m20r48j102n77J70N20M81L90K79Q1m5o4k56o42o80j31M07
$$ 21966 22230 22428 22414 21994 21046 19944 19367 19537 20057 20538 20928 21207 21288 21243 21179 20923 20281 19601 19470 19877
55240A9877L96K28M79Q50O94J71k0K62N09M84M75O74Q50O88J01o64j037o01K85
$$ 19877 20273 20501 20980 21830 22524 22695 22675 22937 23446 23930 24405 25079 25929 26617 26718 26054 25017 24416 24701
55221B4701P53N21J92J70J02k29l02J92N85K33l70l67J49N14O35Q41R75O02q1
$$ 24701 25454 25975 26167 26337 26439 26210 25908 26100 26685 26918 26548 26181 26330 26844 27479 28320 29295 29897 29816
55202B9816m68m73m45m05j38J44M7k45k37L6J52Q3R7J03j50l72r1M49N51J19k92
$$ 29816 29348 28875 28430 28025 27887 28031 28078 27833 27596 27632 27784 27867 27964 28067 27917 27545 27454 27903 28454 28573 28281
55181B8281m11m53m45j81J02j21p51j024n98L2L30L74M50N52N26L14p8n51q44
$$ 28281 27870 27417 26972 26791 26893 26772 26021 24997 24399 24431 24761 25135 25585 26137 26663 26977 26899 26348 25504
55162B5504p80n44l91k28J60N78O36L47O4p8j79j94l1P7j63n43n27k5N04O58M45
$$ 25504 24724 24180 23789 23561 23721 24299 24935 25282 25346 25268 25089 24895 24864 24941 24778 24235 23708 23683 24187 24845 25290
55141B5290R6p0K10P83J031N92j09m27l51k87k76m2L72O20N82L39j33p22q70j96
$$ 25290 25386 25316 25526 26309 27340 27932 27823 27396 27045 26758 26482 26440 26812 27432 28014 28353 28220 27498 26628 26432
55121B6432P09Q62J70n16o01l38j78k22l72n43n45k28K03M10L88L69L71K79J51
$$ 26432 27141 28003 28173 27657 27056 26718 26540 26318 25946 25403 24858 24630 24833 25243 25631 26000 26371 26650 26801
55102B6801P5j60o45r44o50j34q7m74o57m07p3K00O09J040J043N55L9k37m62p08
$$ 26801 26876 26716 26071 25127 24477 24343 24256 23782 23125 22718 22645 22845 23454 24494 25537 26092 26131 25894 25432 24724
55082B4724o97l08J93N19O00M30Q7j51j10m6k05l57k18m0j52k56Q2M83K72l32
$$ 24724 24027 23719 23912 24431 25031 25461 25548 25397 25287 25241 25036 24679 24461 24421 24269 24013 24095 24578 24850 24518
55062B4518m85p2K36K42M47Q75Q28J32m11k32K32M48N98R36J164R59N80L39R1
$$ 24518 24033 23961 24197 24439 24886 25761 26589 26721 26310 26078 26310 26758 27356 28292 29456 30415 30995 31334 31425
55043C1425l08n17k38L06P68J089J176P59j8m33j32K90J78k24k61J21M40M46K89
$$ 31425 31117 30600 30362 30668 31436 32525 33701 34460 34442 34009 33877 34167 34345 34121 33860 33981 34421 34867 35156
55024C5156R6o4k4K45M13K39k0mJ84K28K10M58Q92J003N68m2l47k95j92k05j88
$$ 35156 35252 35188 35164 35409 35822 36061 36041 36037 36221 36449 36659 37117 38009 39012 39580 39538 39191 38896 38704 38499 38311
55003C8311RJ92pn17p30k77L52L89j44n15l82k11l98n99l28J81K45l31r41q77
$$ 38311 38320 38512 38505 37988 37258 36981 37333 37722 37578 37063 36681 36470 36072 35473 35145 35326 35571 35240 34299 33422
54983C3422j20O30O75L6o20p90o12m49k99K2M19O22O11M85J33m81q91o06J28N96
$$ 33422 33302 33932 34607 34643 34023 33233 32621 32172 31873 31895 32314 32936 33547 34032 34165 33684 32793 32187 32315 32911
54963C2911O22O69R23J004O78K51L8mL0J68K95K03N3K45P19R71P97N19L11Kl34
$$ 32911 33533 34202 35125 36129 36807 37058 37096 37092 37122 37290 37585 37788 37841 38086 38805 39776 40573 41092 41403 41405 41071
54942D1071l10K5O0m23p82m55K37O46O38M45J62j58l11k45k34l80l76m2K70J91
$$ 41071 40761 40786 40846 40423 39641 39186 39423 40069 40707 41152 41314 41156 40845 40600 40366 39986 39610 39568 39838 40029
54922D0029j45m07n43n78l61J17M72L97J10k0Q4L20O61R58Q78M06M4K15P13J117
$$ 40029 39884 39477 38934 38356 37995 38112 38584 38981 39091 39071 39155 39475 40136 41094 41972 42378 42422 42637 43350 44467
54902D4467J321J363J141O85M07O47J197J610J754J760J715J720J999K592L181
$$ 44467 45788 47151 48292 48977 49384 50031 51228 52838 54592 56352 58067 59787 61786 64378 67559
54887F7559L499L685M020M526N035N342N154M283L013J929J149J91j151k409l158
$$ 67559 71058 74743 78763 83289 88324 93666 98820 103103 106116 108045 109194 109385 108234 105825 102667
54872A02667l649m227m668m613m198l842l632l411l165k878k355j602j020q33
$$ 102667 99018 94791 90123 85510 81312 77470 73838 70427 67262 64384 62029 60427 59407 58574
54858E8574p07l49q6k97o59n61QN34P79R57J231J583K008K444K688K775L145L990
$$ 58574 57867 57518 57432 57135 56476 55915 55923 56457 57236 58193 59424 61007 63015 65459 68147 70922 74067 78057
54840G8057M707M596L837L213K969K579J604K07j234k501l496m154m501m554m238
$$ 78057 82764 87360 91197 94410 97379 99958 101562 101769 100535 98034 94538 90384 85883 81329 77091
54825G7091l655l213l171l202k857k262j914j918j916j691j389j104p38l25j19
$$ 77091 73436 70223 67052 63850 60993 58731 56817 54899 52983 51292 49903 48799 48061 47736 47617
54810D7617k32m86o70p42o99n07j81J74L81K27l39r52j092p21m00m98o73m77r1
$$ 47617 47385 46899 46229 45487 44788 44281 44100 44274 44655 44882 44543 43591 42499 41778 41378 40880 40207 39730 39639
54791C9639L6k1J74O21Q25N52Q7k58m85o49o59m90l15k71k92k35o5Q4J6l09n77
$$ 39639 39675 39654 39828 40449 41274 41826 41913 41655 41170 40521 39862 39372 39057 38786 38494 38259 38194 38278 38294 37985 37408
54770C7408m36j4J34j75m37j97K40L12O6K7L35O08O15N80P00Q07O77L79J99L24
$$ 37408 36972 36958 37092 36917 36480 36283 36523 36835 36901 36928 37263 37871 38486 39066 39766 40573 41250 41629 41828 42152
54750D2152O39Q21O31K59J63N13R92J280J434J615J767J824J938K208K455K589
$$ 42152 42791 43612 44243 44502 44665 45178 46170 47450 48884 50499 52266 54090 56028 58236 60691 63280
54734F3280K870L495M168M519M659M936N332N530N361M822L853K507J154J41o16
$$ 63280 66150 69645 73813 78332 82991 87927 93259 98789 104150 108972 112825 115332 116486 116627 116011
54719A16011j320j871k146k356k688k886k669k337k317k398k067j399r55q69p74
$$ 116011 114691 112820 110674 108318 105630 102744 100075 97738 95421 93023 90956 89557 88602 87733 86959
54704H6959n67n68q04q28l82K56P64J093J256J260J407K103L221M122M495M717
$$ 86959 86392 85824 85020 84192 83810 84066 84830 85923 87179 88439 89846 91949 95170 99292 103787 108504
54688A08504N242N989O606O928O989O859O623O322N814M920L750K633J658O37
$$ 108504 113746 119735 126341 133269 140258 147117 153740 160062 165876 170796 174546 177179 178837 179474
54674A79474n31j694k717l609m386n058n757o552p188p310o952o469o027n502
$$ 179474 178943 177249 174532 170923 166537 161479 155722 149170 141982 134672 127720 121251 115224 109722
54660A09722m856m259l805l449l220l160l090k796k359k050j875j650j384j254
$$ 109722 104866 100607 96802 93353 90133 86973 83883 81087 78728 76678 74803 73153 71769 70515
54646G0515j171q85m39j49j25k08l30m96n24k66n0l21q67r77m50J52L71L73M42
$$ 70515 69344 68459 68020 67871 67746 67538 67208 66712 66188 65922 65872 65551 64684 63707 63257 63409 63780 64153 64595
54627F4595M95M01K76J65j21n63p56n16j97j47j63J00N13O40L78N4J3L31Q46J281
$$ 64595 65090 65491 65767 65932 65811 65248 64492 63976 63779 63632 63469 63569 64082 64722 65100 65154 65167 65498 66344 67625
54607F7625J452J463J589J876K066J978J752J590J501J394J263J149J082J139
$$ 67625 69077 70540 72129 74005 76071 78049 79801 81391 82892 84286 85549 86698 87780 88919
54593H8919J388J722J931J987K072K251K367K285K084J942J977K232K637L076
$$ 88919 90307 92029 93960 95947 98019 100270 102637 104922 107006 108948 110925 113157 115794 118870
54579A18870L575M312N259O009O281O427P024Q086R095R739J0142J0389J0270
$$ 118870 122445 126757 132016 138025 144306 150733 157757 165843 174938 184677 194819 205208 215478
54566B15478R558Q156N985L103m9k940n473p780r570j0303j0071r705r764r916
$$ 215478 225036 233192 239177 242280 242231 239291 233818 226038 216468 206165 196094 186389 176625 166709
54552A66709r585q706p603o549n737n307n136m862m334l776l346k896k342j936
$$ 166709 157124 148418 140815 134266 128529 123222 118086 113224 108890 105114 101768 98872 96530 94594
54538I4594j902k121k289k222j876j364r84r78j162j193j133j331j699j727j334
$$ 94594 92692 90571 88282 86060 84184 82820 81836 80858 79696 78503 77370 76039 74340 72613 71279
54523G1279j075j241j420j241j052j308j760j826j446j067r44r46q97p66n71l97
$$ 71279 70204 68963 67543 66302 65250 63942 62182 60356 58910 57843 56899 55953 55056 54290 53719 53322
54507E3322l89n34n99m70l30l53m08l18j28N5K85O06Q77R86J014J004P99L86O5
$$ 53322 52933 52399 51800 51330 51000 50647 50239 49921 49793 49848 50133 50739 51616 52602 53616 54620 55419 55805 55870
54488E5870Q6K52K11r9m46n80l57J83P15Q64P26Q18J331J785J726J388J310J594
$$ 55870 55956 56208 56419 56320 55874 55294 54937 55120 55835 56699 57425 58243 59574 61359 63085 64473 65783 67377
54470F7377J953K261K634L055L355L493L633L922M398N031N652N902N514M581
$$ 67377 69330 71591 74225 77280 80635 84128 87761 91683 96081 101112 106764 112666 118180 122761
54456A22761L439K320J236R6j216k662l926m581m575m313m185m192m169m116m115
$$ 122761 126200 128520 129756 129852 128636 125974 122048 117467 112892 108579 104394 100202 96033 91917 87802
54441H7802m105l965l677l269k721k056j419r70p81q59j105j280j196r47p50o02
$$ 87802 83697 79732 76055 72786 70065 68009 66590 65620 64839 63980 62875 61595 60399 59452 58702 58100
54425E8100l52o9O8J36L32N03K87k06m17j45J85K71L58O81R78R52P78P74R45J156
$$ 58100 57748 57679 57747 57883 58215 58718 59005 58799 58382 58237 58422 58693 59051 59732 60710 61662 62440 63214 64159 65315
54405F5315J392J535J298O81J62N4Q2r9l75n24p01j068j379j325j048q47o99n14
$$ 65315 66707 68242 69540 70221 70383 70437 70519 70420 70045 69521 68820 67752 66373 65048 64000 63153 62454 61940
54387F1940n49j038j690j990j884j642j313p81j96J17J01m3k43n02o38m20M0L69
$$ 61940 61391 60353 58663 56673 54789 53147 51834 51053 50857 50974 51075 51032 50789 50287 49649 49229 49269 49638
54369D9638L14j26p77j281j284q88o39p76q25l37M03Q26R00R44R33O36K37J83
$$ 49638 49952 49826 49049 47768 46484 45596 44957 44181 43356 43019 43422 44248 45148 46092 47025 47661 47898 48081
54351D8081M97P87R11J100J378J426J077N70K37K06M39P73R50R00Q31Q78Q41N70
$$ 48081 48578 49365 50276 51376 52754 54180 55257 55827 56064 56270 56709 57482 58432 59332 60163 61041 61882 62452
54333F2452L73N59Q81Q86O76P38J107J265R60M96K03L9j58l69n28o76q43j016
$$ 62452 62825 63384 64265 65151 65827 66565 67672 68937 69897 70393 70596 70635 70477 70108 69580 68904 68061 67045
54315F7045j202j354j325j069q10p68q30q13q03r47j056q61n11l89n34o77p44
$$ 67045 65843 64489 63164 62095 61285 60517 59687 58874 58071 57124 56068 55207 54696 54307 53773 53096 52352
54298E2352q68r67q04m53k69l28l50j85%P4J28K54M22O19Q27Q95P20M98M95O60
$$ 52352 51484 50517 49713 49260 48991 48663 48313 48128 48128 48202 48330 48584 49006 49625 50452 51347 52067 52565 53060 53720
54278E3720P89Q71R72R20O16M44Q73J640J954J538Q91M58J04m00q46q99o10l53
$$ 53720 54509 55380 56352 57272 57888 58332 59205 60845 62799 64337 65228 65686 65790 65390 64544 63645 63035 62682
54260F2682m22p94j153j160q57p30j115j665j785j438j092r54q10o00n74p52p88
$$ 62682 62260 61466 60313 59153 58296 57566 56451 54786 53001 51563 50471 49517 48707 48107 47533 46781 45993
54243D5993n51m05o28r42r25n69j76L9Q1L9OJ9k8k00l52l11j88k23l69l46j30
$$ 45993 45442 45037 44409 43467 42542 41973 41797 41836 41917 41956 41962 41981 41953 41753 41401 41090 40902 40679 40310 39964 39834
54222C9834jj10k88l71l83l55k45r2L8K47O56J051J051O37J79n4j19q7Q0K92L21
$$ 39834 39833 39723 39435 39064 38681 38326 38081 37989 38027 38274 38930 39981 41032 41669 41848 41794 41675 41588 41668 41960 42281
54201D2281J37n0j25j37k6L13P17Q44O38L30J9l52n79l33K33N06K16k12l27k11
$$ 42281 42418 42368 42243 42106 42080 42393 43110 43954 44592 44922 44941 44589 44010 43677 43910 44416 44632 44420 44093 43882
54181D3882j35j06k9K3pPJ27K01J64J99M09N61M59K36R3j6j85k68r1K31L66J55
$$ 43882 43747 43641 43612 43635 43628 43635 43762 43963 44127 44326 44735 45296 45755 45991 46084 46068 45883 45615 45524 45755 46121 46276
54159D6276k46n40n17k42QJ3j20j33J8J58J80J14l1k09k32K8L62M31K19j7j92
$$ 46276 46030 45490 44973 44731 44739 44752 44632 44499 44517 44675 44855 44969 44938 44729 44497 44525 44887 45318 45537 45520 45328
54138D5328m06o11o64o03n69m45n3L88M53J53q5p6l8q0n5L2l5k53l74l60l82l44
$$ 45328 44922 44311 43647 43044 42475 42030 41977 42365 42818 42971 42886 42810 42772 42692 42637 42669 42634 42381 42007 41647 41265 40921
54116D0921k4L54K86j60l57j33l1l20n04k07J77J35j98m47n85o80n36j06J70q
$$ 40921 40897 41251 41537 41377 41020 40887 40856 40536 40032 39825 40002 40137 39939 39492 38907 38227 37691 37585 37755 37747
54096C7747k91k18P5J94K04M24P56Q10N32K14K7r0j36m0J14J66J11L5q4l12n80
$$ 37747 37456 37238 37313 37507 37711 38135 38891 39701 40233 40447 40474 40384 40248 40208 40322 40488 40599 40634 40550 40238 39658
54075C9658p48o76k77L14O08K51l66m81m6J75k24o62n41j45o1k34k30o5j04l82
$$ 39658 38910 38234 37957 38271 38879 39130 38764 38283 38237 38412 38188 37526 36985 36840 36779 36545 36315 36250 36146 35764
54055C5764n90n88m78k92j0K44L68M65N74N28L14K46M52N53K72p1r6Kj08k55j16
$$ 35764 35174 34586 34108 33816 33806 34050 34418 34883 35457 35985 36299 36545 36997 37550 37822 37751 37655 37657 37549 37294 37178
54034C7178J12M8j49k0L89N83M23K19J41M7r6j06L9J67J40j15o74j348j575j108
$$ 37178 37290 37338 37189 37169 37558 38141 38564 38783 38924 38971 38875 38769 38808 38975 39115 39000 38326 36978 35403 34295
54014C4295n01m39p57p26j37N20Q84J075J179J024N93K30J86L80O06P36P07N97
$$ 34295 33794 33355 32598 31872 31735 32255 33139 34214 35393 36417 37010 37240 37426 37806 38412 39148 39855 40452
53996D0452O35Q48Q78N07J15J69M68M76K04J29L19L43J04O0M80J030J273J191
$$ 40452 41087 41935 42813 43320 43435 43604 44072 44548 44752 44881 45200 45543 45647 45707 46187 47217 48490 49681
53978D9681J016R75J231J719K031J868J540J588J943K060J835J696J747J554J012
$$ 49681 50697 51672 52903 54622 56653 58521 60061 61649 63592 65652 67487 69183 70930 72484 73496
53963G3496O72Q97J278J322J208J304J456J237P14L96N45Q91R89O60J04k43j43
$$ 73496 74168 75065 76343 77665 78873 80177 81633 82870 83584 83980 84525 85416 86405 87065 87169 86926 86783
53946H6783R0j07p92j347j277q58p22j036j392j366r42m00m2Jj79m16o55q96j027
$$ 86783 86873 86766 85974 84627 83350 82492 81770 80734 79342 77976 77034 76634 76592 76593 76414 75998 75343 74447 73420
53927G3420q58m26j3J42N3k05o02j055j355j324r84n16j56p7k15k84j28Mj71m75
$$ 73420 72562 72136 72123 72265 72318 72113 71511 70456 69101 67777 66793 66277 66121 66044 65829 65545 65417 65421 65250 64775
53907F4775m70j30J21K6k17l47l67l04m4L91O69N49K16L5J48M51P91R98R05N59
$$ 64775 64305 64175 64296 64322 64105 63758 63391 63087 63043 63434 64103 64652 64868 64903 65051 65502 66293 67291 68196 68755
53887F8755K49K46N24Q92J182J308J260J155J167J323J471J555J683J938K229
$$ 68755 69004 69250 69774 70666 71848 73156 74416 75571 76738 78061 79532 81087 82770 84708 86937
53872H6937K417K455K338K070J761J594J616J681J598J287P96L18J35L53P31R08
$$ 86937 89354 91809 94147 96217 97978 99572 101188 102869 104467 105754 106550 106868 107003 107356 108087 108995
53856A08995P74M73J86N4K31O67J009J000Q72J021J348J386J037P22P49R52J068
$$ 108995 109769 110242 110428 110482 110713 111380 112389 113389 114261 115282 116630 118016 119053 119775 120524 121476 122544
53839A22544J032Q30M03j05l93m31n39q79j243j450j599j708j546j083p56r92
$$ 122544 123576 124406 124809 124704 124311 123880 123341 122462 121219 119769 118170 116462 114916 113833 113077 112085
53823A12085j669k334k726k864k833k726k618k457k138j784j699j914k053j860
$$ 112085 110416 108082 105356 102492 99659 96933 94315 91858 89720 87936 86237 84323 82270 80410
53809H0410j551j472j606j709j675j588j530j557j684j785j679j412j202j019
$$ 80410 78859 77387 75781 74072 72397 70809 69279 67722 66038 64253 62574 61162 59960 58941
53795E8941o07n8J18k99q25r29p58p69r91j066q75o12l95k20k15m37n67j94N41
$$ 58941 58334 58276 58394 58095 57270 56341 55583 54814 53823 52757 51882 51270 50875 50655 50440 50003 49436 49242 49783
53776D9783J038J005P06M19N4n02j011j133q26l17J93N96P76O58L57J26R5J75
$$ 49783 50821 51826 52532 52951 53005 52503 51492 50359 49533 49216 49409 50005 50781 51439 51796 51922 52017 52192
53758E2192J95J29R1J46J97J12q0k31k23o2J85L98M54M34O49J270J945K118J720
$$ 52192 52387 52516 52607 52753 52950 53062 52982 52751 52528 52466 52651 53049 53503 53937 54586 55856 57801 59919 61639
53739F1639J289J258J489J622J579J510J471J437J449J516J484J257R94R02R23
$$ 61639 62928 64186 65675 67297 68876 70386 71857 73294 74743 76259 77743 79000 79994 80896 81819
53724H1819Q18N23J84l6q5mQ3M0q8j03J2m3n09j185j588j496j109p92p67r82j163
$$ 81819 82637 83160 83344 83308 83223 83219 83302 83342 83254 83151 83163 83120 82611 81426 79838 78342 77233 76441 75674 74692 73529
53703G3529j070q12p54j010j217j028o06l76m70o82q20q35o48k38R3l4n42q76
$$ 73529 72459 71647 70893 69883 68666 67638 67032 66656 66186 65504 64684 63849 63201 62963 63056 63022 62480 61604
53685F1604o67j82O8l6k18k77l45n68p78o37j12M01N14L14J82K49K70P9r0M3M17
$$ 61604 60937 60755 60823 60787 60569 60292 59947 59379 58601 57964 57852 58253 58767 59081 59263 59512 59782 59861 59771 59814 60231
53664F0231P15P92P56P11O57O38P65J067J391J520J349R83O98O98Q79R28P15M57
$$ 60231 60946 61738 62494 63205 63862 64500 65265 66332 67723 69243 70592 71575 72273 72971 73850 74778 75493 75950
53646G5950M18N33N05K13j32k49j01Q8Q0j08k45j76l2n5k38k91KN46J033J194
$$ 75950 76368 76901 77406 77619 77487 77238 77137 77225 77305 77197 76952 76776 76744 76689 76451 76160 76162 76708 77741 78935
53626G8935R49M57N5j9J61L77N60O96N81Q0m01j93P05J395J143K54m17n10l19
$$ 78935 79884 80341 80396 80377 80538 80915 81475 82171 82752 82832 82431 82238 82943 84338 85481 85735 85318 84808 84489
53607H4489j06J65M96P02O89N99N59N58N81O64P43O72M36K33K13K87K47Qk90l93
$$ 84489 84383 84548 85044 85746 86435 87034 87593 88151 88732 89396 90139 90811 91247 91480 91693 91980 92227 92235 91945 91552
53587I1552j53K86N89N75M02L35M07L83O6m71r09r69o95m30m05m11r1M77P87N42
$$ 91552 91399 91685 92274 92849 93251 93586 93993 94376 94442 93971 93062 92093 91398 90968 90563 90152 90061 90538 91325 91867
53567I1867J6l16k85J3M37Q08R31Q26P70R34J105R92N72M1l95n03r4O33J141J196
$$ 91867 91883 91567 91282 91295 91732 92540 93471 94297 95067 96001 97106 98098 98670 98711 98316 97813 97719 98352 99493 100689
53547A00689J211J579K036K059J668J281J050Q33P08Q86J152J025N59L77P56J189
$$ 100689 101900 103479 105515 107574 109242 110523 111573 112406 113114 114000 115152 116177 116736 117113 117869 119058
53531A19058J185R46R78J283J459J342J152J101J134J101R69Q00O36M38J30k48
$$ 119058 120243 121189 122167 123450 124909 126251 127403 128504 129638 130739 131708 132508 133144 133582 133712 133464
53515A33464m59l10N3K48J14r0p2J12J84O8j1J87O21J026J169J071R43R58J091
$$ 133464 133005 132695 132748 132996 133110 133020 132948 133060 133244 133312 133301 133488 134109 135135 136304 137375 138318 139276 140367
53496A40367J199J199J108J008J018J206J449J473J169P95P06R34J199J295J271
$$ 140367 141566 142765 143873 144881 145899 147105 148554 150027 151196 151991 152697 153631 154830 156125 157396
53481A57396J272J365J559J847K169K412K516K518K474K443K467K491K385K107
$$ 157396 158668 160033 161592 163439 165608 168020 170536 173054 175528 177971 180438 182929 185314 187421
53467A87421J884K036K615L332L868M129M198M157M049L968M063M367M671M777
$$ 187421 189305 191341 193956 197288 201156 205285 209483 213640 217689 221657 225720 230087 234758 239535
53453B39535M822N175N826O205N908N393N445O044O420O277O286O961P799Q045
$$ 239535 244357 249532 255358 261563 267471 272864 278309 284353 290773 297050 303336 310297 318096 326141
53439C26141P820P779Q032Q169Q143Q352Q853R207R233R221R306R180Q700Q202
$$ 326141 333961 341740 349772 357941 366084 374436 383289 392496 401729 410950 420256 429436 438136 446338
53425D46338P976P913P884Q014Q302Q381Q056P705P742P984P974P718P591P704
$$ 446338 454314 462227 470111 478125 486427 494808 502864 510569 518311 526295 534269 541987 549578 557282
53411E57282P739P478P124O990P047O930O317N302M368L898L732L327K416J307
$$ 557282 565021 572499 579623 586613 593660 600590 606907 612209 616577 620475 624207 627534 629950 631257
53397F31257M37j39o50j184j682k170k782l458l925m027l959m049m384m773n017
$$ 631257 631694 631555 630905 629721 628039 625869 623087 619629 615704 611677 607718 603669 599285 594512 589495
53382E89495n152n341n626n873n994o065o181o317o407o426o318n950n333m717
$$ 589495 584343 579002 573376 567503 561509 555444 549263 542946 536539 530113 523795 517845 512512 507795
53368E07795m299l970l539l021k530k002j413j044j159j439j258n43J07K43J25
$$ 507795 503496 499526 495987 492966 490436 488434 487021 485977 484818 483379 482121 481578 481685 481928 482053
53353D82053K59P59J368J814J934J752J630K048L056M187N090N857O576O986O981
$$ 482053 482312 483071 484439 486253 488187 489939 491569 493617 496673 500860 505950 511807 518383 525369 532350
53338E32350P031P650Q652R423R800J0160J0724J1308J1751J2172J2663J3121
$$ 532350 539381 547031 555683 565106 574906 585066 595790 607098 618849 631021 643684 656805
53326F56805J3547J4139J4915J5543J5708J5521J5312J5235J5247J5320J5481
$$ 656805 670352 684491 699406 714949 730657 746178 761490 776725 791972 807292 822773
53315H22773J5615J5457J4786J3655J2409J1472J1035J0842J0391R377P975O609
$$ 822773 838388 853845 868631 882286 894695 906167 917202 928044 938435 947812 955787 962396
53303I62396N508M518L331J845K52j184k409l598m914o322p648q748r600j0246
$$ 962396 967904 972422 975753 977598 977850 976666 974257 970659 965745 959423 951775 943027 933427 923181
53289I23181j0743j1107j1305j1322j1268j1373j1728j2118j2219j1983j1681
$$ 923181 912438 901331 890026 878704 867436 856063 844335 832217 819998 808015 796334
53278G96334j1506j1317j0871j0210r626r277r070q914q894r077r304r322r071
$$ 796334 784828 773511 762640 752430 742804 733527 724457 715543 706649 697572 688268 678946 669875
53265F69875q624q015p259o538o075n848n625n283m905m583m344m345m788n553
$$ 669875 661251 653236 645977 639439 633364 627516 621891 616608 611703 607120 602776 598431 593643 588090
53251E88090o171o318o120n826n535n339n423n669n501m595l467k903k914k761
$$ 588090 581919 575601 569481 563655 558120 552781 547358 541689 536188 531593 528126 525223 522309 519548
53237E19548k014j041l60k6J82L37M52O71J125J710K276K839L491M191M828N337
$$ 519548 517534 516493 516133 516107 516289 516626 517078 517749 518874 520584 522860 525699 529190 533381 538209 543546
53221E43546N710N947O112O311O541O685O650O443O089N582N001M484M039L529
$$ 543546 549256 555203 561315 567626 574167 580852 587502 593945 600034 605616 610617 615101 619140 622669
53207F22669K864K133J515J129R44P37K04o81j534j987k184k583l338m190m902
$$ 622669 625533 627666 629181 630310 631254 631991 632195 631514 629980 627993 625809 623226 619888 615698 610796
53192F10796n460n833n920n808n749n818n887o011o360o779o776o231n672n580
$$ 610796 605336 599503 593583 587775 582026 576208 570321 564310 557950 551171 544395 538164 532492 526912
53178E26912n777n776n443n010m661m421m322m351m351m219m066m030m059m057
$$ 526912 521135 515359 509916 504906 500245 495824 491502 487151 482800 478581 474515 470485 466426 462369
53164D62369m012l907l677l413l334l372l153k606k179k175k257k005j701j912
$$ 462369 458357 454450 450773 447360 444026 440654 437501 434895 432716 430541 428284 426279 424578 422666
53150D22666k544k943k864k791l195l939m602m989n122n040m849m734m784m832
$$ 422666 420122 417179 414315 411524 408329 404390 399788 394799 389677 384637 379788 375054 370270 365438
53136C65438m662m290l966l952m304m803n125n165n121n219n463n712n919o040
$$ 365438 360776 356486 352520 348568 344264 339461 334336 329171 324050 318831 313368 307656 301737 295697
53122B95697n960n627n284n233n455n626n523n217m910m743m726m743m612m323
$$ 295697 289737 284110 278826 273593 268138 262512 256989 251772 246862 242119 237393 232650 228038 223715
53108B23715m105m130m202l990l496l062k946l061l193l237l191l073k909k712
$$ 223715 219610 215480 211278 207288 203792 200730 197784 194723 191530 188293 185102 182029 179120 176408
53094A76408k504k377k487k828l120l077k737k370k143j995j808j518j182j022
$$ 176408 173904 171527 169040 166212 163092 160015 157278 154908 152765 150770 148962 147444 146262 145240
53080A45240j306j940k435k447k216k170k244k024j432q89p35q83j108j319j451
$$ 145240 143934 141994 139559 137112 134896 132726 130482 128458 127026 126137 125402 124519 123411 122092 120641
53065A20641j384j121q24n86l73k28k79m62n61n63o63q67r22p64o42o18l62K73
$$ 120641 119257 118136 117312 116726 116353 116125 115846 115384 114823 114260 113597 112730 111808 111044 110402 109784 109422 109695
53047A09695Q26Q18M33J51kl56q40r81o77m26n85q44p41l67j65l28o56r67j255
$$ 109695 110521 111339 111772 111923 111921 111565 110725 109744 109067 108641 108056 107212 106471 106104 105939 105611 104955 103988 102733
53028A02733j489j550j434j293j210j132j054j081j238j370j356j276j254j277
$$ 102733 101244 99694 98260 96967 95757 94625 93571 92490 91252 89882 88526 87250 85996 84719
53014H4719j228j050p63m57l37n70j000j176q94n06m46o37o76m63k17l0J82K49
$$ 84719 83491 82441 81678 81221 80884 80314 79314 78138 77244 76738 76292 75655 74979 74516 74299 74269 74451 74700
52996G4700j50q49j170q27l69m11q21j046r27p02m49r5J95J32j50j89J07K65p5
$$ 74700 74550 73701 72531 71704 71335 70924 70103 69057 68130 67428 66979 66884 67079 67211 67061 66872 66979 67244 67169
52977F7169o75j036r60n98j71J47K42J55Q8J73L16L22J42q2j83j12K8P5l3k11
$$ 67169 66494 65458 64498 63900 63729 63876 64118 64273 64361 64534 64850 65172 65314 65232 65049 64937 64965 65040 65007 64796
52957F4796l80n42o72o29l71j14j23l28m23k65k6J42K85N11P44Q10O43L25J1j73
$$ 64796 64416 63874 63202 62573 62202 62088 61965 61637 61214 60949 60923 61065 61350 61861 62605 63415 64058 64383 64394 64221
52937F4221j86j03k7J6N0P0P2R5J15J6k04k93j3M70P36O07L22J67J87K80L73M25
$$ 64221 64035 63932 63905 63921 63971 64041 64113 64208 64323 64339 64135 63842 63829 64299 65035 65642 65964 66131 66318 66598 66971 67396
52915F7396M11M19N47P04O54L50O2O1L36P14J074J348J441J325J134J043J077
$$ 67396 67807 68226 68773 69477 70131 70481 70543 70604 70940 71654 72728 74076 75517 76842 77976 79019 80096
52898H0096J153J189J161J072J020J122J335J436J257R04O10M77M33L99L37K04
$$ 80096 81249 82438 83599 84671 85691 86813 88148 89584 90841 91745 92355 92832 93265 93664 94001 94205
52882I4205m1l13m47l67j92j52l67p20q92o21j7M39L38k12o99q06p10p29q39p89
$$ 94205 94164 93851 93404 93037 92845 92693 92326 91606 90714 90093 90076 90515 90853 90641 89942 89136 88426 87697 86858 86069
52862H6069n46l44k58o2L49O94O66L87J51m0l93p99q84n42p8L05P30J243J541
$$ 86069 85523 85179 84921 84859 85208 85902 86568 86955 87106 87066 86673 85874 84990 84448 84370 84675 85405 86648 88189
52843H8189J367R17N57L80K76K34K79K78J54J24M45R87J336J245Q09K70j61l48
$$ 88189 89556 90473 91030 91410 91686 91920 92199 92477 92631 92755 93200 94187 95523 96768 97577 97847 97686 97338
52825I7338l36l37m01l01J05N48O97O66P96J019R23M10j15k90j82j1J93M64O83
$$ 97338 97002 96665 96264 95963 96068 96616 97313 97979 98775 99794 100717 101127 101012 100722 100540 100529 100722 101186 101869
52806A01869O84M67J95M4O2Q6j52o55r97p53l7O13Q83R06Q78P82O07M85M71M15
$$ 101869 102553 103020 103215 103259 103321 103407 103255 102600 101603 100850 100813 101426 102309 103215 104093 104875 105482 105967 106438 106853
52786A06853K60K31N22R62J187J084Q63P68Q15Q66Q50Q33R06J040J126J118J029
$$ 106853 107113 107344 107866 108828 110015 111099 111962 112730 113545 114411 115261 116094 117000 118040 119166 120284 121313
52769A21313P65K23m49q60q71p79q50q83o00k12k07o67j177j401j396j327j294
$$ 121313 122078 122301 121852 120992 120121 119342 118492 117609 117009 116797 116590 115923 114746 113345 111949 110622 109328
52752A09328j399j668j819j495p79k04j32l99o47p11o57o40q08j124j330j282
$$ 109328 107929 106261 104442 102947 102168 101964 101832 101433 100786 100075 99418 98778 97970 96846 95516 94234
52736I4234j195j266j238q38m39o44j264j404p73j59k86q48j128j013q75q36p36
$$ 94234 93039 91773 90535 89697 89258 88614 87350 85946 85173 85014 84728 83880 82752 81739 80864 80028 79292
52719G9292n92n49n24l57j71j97l74m54l90l00j80%L7k97q05j037q52n61m65n55
$$ 79292 78700 78151 77627 77270 77099 76902 76528 76074 75684 75384 75204 75204 75241 74944 74139 73102 72250 71689 71224 70669
52699G0669o53o56n64m36l62l55l65m15o49j103j575j815j740j364p47j57k4m70
$$ 70669 70016 69360 68796 68360 67998 67643 67278 66863 66214 65111 63536 61721 59981 58617 57870 57713 57689 57219
52681E7219j061j300j165r45p41m79k54k68m51m70j77K29N03N36K75l06r96j367
$$ 57219 56158 54858 53693 52748 52007 51528 51274 51006 50555 50085 49908 50137 50640 51176 51451 51145 50149 48782
52663D8782j136m88Q9K28k5l28m48m88o19p08m35J58N76M44j3k95j68K24O42Q50
$$ 48782 47646 47158 47247 47475 47450 47122 46674 46186 45567 44859 44424 44582 45158 45602 45589 45294 45126 45350 45992 46842
52643D6842O48R9l95n28m49m55m53q8O67J398J716J593J184O60K30J08K90N39
$$ 46842 47490 47589 47194 46666 46217 45762 45309 45221 45888 47286 49002 50595 51779 52439 52669 52777 53067 53606
52625E3606O64O99P65Q65Q38N41K9l99m77l11k82n64q87r08o62m37l81m51n88
$$ 53606 54270 54969 55734 56599 57437 57978 58007 57608 57131 56820 56538 55974 55087 54179 53517 53080 52699 52248 51660
52606E1660p03o43l91k44m90r75j226j009n09o9P7j47o12r82r73o56l20j04L2
$$ 51660 50957 50314 49923 49679 49189 48214 46988 45979 45470 45401 45478 45331 44719 43737 42764 42108 41788 41684 41716
52587D1716P7l9k02j71N5J80K2k29k73p6J47K08J24M1Q0K20L57M63O45R59J265
$$ 41716 41793 41754 41552 41381 41436 41616 41638 41409 41136 41060 41207 41415 41539 41580 41660 41880 42237 42700 43345 44304 45569
52566D5569J324J041N28kl55m68m37l65k14O5K47Ln67r19p36l75k94l98k89L3
$$ 45569 46893 47934 48462 48460 48105 47637 47200 46835 46621 46686 46933 46936 46369 45450 44714 44339 44045 43647 43358 43391
52546D3391K22J58L2p1k45l97k56J38M15M05L48M09L82J10j19O6N46Q23O26J75
$$ 43391 43613 43771 43803 43732 43487 43090 42834 42972 43387 43792 44140 44549 44931 45041 44922 44988 45534 46357 46983 47158
52526D7158j42j69k5J22K66N22R33J325J438J167O46J38j52j88j35j88l26l01
$$ 47158 47016 46847 46822 46944 47210 47732 48665 49990 51428 52595 53241 53379 53227 53039 52904 52716 52390 52089
52508E2089M0M95P55P55P06P49Q08P61O01M07K29Q5kO4L69P74Q85M81o9j20M15
$$ 52089 52129 52624 53379 54134 54840 55589 56397 57158 57759 58166 58395 58480 58478 58542 58911 59685 60570 61051 60982 60862 61277
52487F1277R15Q54M49J91J33L4m2K13P70J191J170Q22M41K43L41P07J072J191
$$ 61277 62192 63046 63495 63686 63819 63853 63811 64024 64794 65985 67155 67977 68418 68661 69002 69709 70781 71972
52469G1972J094R33O84L19J08L83R84J357J189O77J73q2O7N63R86Q74L18j19j40
$$ 71972 73066 73999 74683 75002 75110 75493 76477 77834 79023 79700 79873 79791 79858 80421 81407 82281 82599 82480 82340
52450H2340J6N5j5j32l16m52l02Q3K99J48m0P8L93N67N04K94k7m04o07m41l6K97
$$ 82340 82356 82411 82396 82264 81948 81496 81194 81277 81576 81724 81684 81762 82155 82722 83226 83520 83493 83089 82482 82041 82005 82302
52428H2302M01L35J91L2p4j02j17j76k37k26q1J79L93L02j15m42k49L04O06L48
$$ 82302 82703 83038 83229 83261 83187 83085 82968 82792 82555 82329 82248 82427 82820 83122 83007 82565 82316 82620 83226 83574
52408H3574j28l53k19J24N32Q32Q28N50L13L45N27N96M65K03l8k2L88R10J042
$$ 83574 83446 83093 82874 82998 83530 84362 85190 85740 86053 86398 86925 87521 87986 88189 88151 88129 88517 89427 90469
52389I0469O94L60M63P92Q83O24K55Kl2K02N84P83O25L27J67J05k5j30OL28N54
$$ 90469 91163 91523 91986 92778 93661 94285 94540 94542 94510 94712 95296 96079 96704 97031 97198 97303 97278 97148 97154 97482 98036
52368I8036N55M08J69j71m62m40l4M87P31N07k9m75n30k80n7J6J36M25O81O76
$$ 98036 98591 98999 99168 98997 98535 98095 98061 98548 99279 99786 99757 99282 98752 98472 98415 98431 98567 98992 99673 100349
52348A00349M75K79J27k6r4L4L15O24Q88R92P68L05nM8J57qk14M2P13J157R16
$$ 100349 100824 101103 101230 101204 101110 101144 101459 102083 102971 103963 104731 105036 105031 105079 105236 105228 105014 105056 105769 106926 107842
52327A07842K29l48n37m27k44j43j45j70j62j85k83l59l17k64l78o13p32n97k93
$$ 107842 108071 107723 107186 106759 106515 106372 106227 106057 105895 105710 105427 105068 104751 104487 104109 103496 102764 102167 101874
52308A01874M0L31N73Q04J035J163J006O17L26L14L25J00o4L46J220J807J678
$$ 101874 101914 102245 102818 103622 104657 105820 106826 107443 107769 108083 108408 108508 108444 108790 110010 111817 113495
52291A13495J275J270J714K089K032J645J229R91R77J119J289J443J659J938K066
$$ 113495 114770 116040 117754 119843 121875 123520 124749 125740 126717 127836 129125 130568 132227 134165 136231
52276A36231J871J512J331J416J544J600J764K142K446K315J823J439J448J729
$$ 136231 138102 139614 140945 142361 143905 145505 147269 149411 151857 154172 155995 157434 158882 160611
52262A60611K096K509K871K905K528K130K186K688L251L666M007M253M222M020
$$ 160611 162707 165216 168087 170992 173520 175650 177836 180524 183775 187441 191448 195701 199923 203943
52248B03943M110M754N634O261O557O730O861O922P053P488Q156Q652Q720Q550
$$ 203943 208053 212807 218441 224702 231259 237989 244850 251772 258825 266313 274469 283121 291841 300391
52234C00391Q495Q652Q839Q928R023R280R671R991J0081R941R656R270Q823Q394
$$ 300391 308886 317538 326377 335305 344328 353608 363279 373270 383351 393292 402948 412218 421041 429435
52220D29435Q020P667P329P042O757O321N737N279N102M919M366L543K844K350
$$ 429435 437455 445122 452451 459493 466250 472571 478308 483587 488689 493608 497974 501517 504361 506711
52206E06711J794J182Q68R29Q97M19k09m89m04l06l02j79J76N84P94O91L64J23
$$ 506711 508505 509687 510555 511484 512381 512800 512591 512102 511698 511392 511090 510911 511087 511671 512465 513156 513520 513643
52188E13643L55J168K225L135L829M459N052N532N932O333O671O820O833O845
$$ 513643 513998 515166 517391 520526 524355 528814 533866 539398 545330 551663 558334 565154 571987 578832
52174E78832O842O711O492O354O282O069N603N000M426L902L329K658J893J095
$$ 578832 585674 592385 598877 605231 611513 617582 623185 628185 632611 636513 639842 642500 644393 645488
52160F45488L29l40q96j383j933k645l387l876m075m373n098n992o552o739o949
$$ 645488 645817 645477 644581 643198 641265 638620 635233 631357 627282 622909 617811 611819 605267 598528 591579
52145E91579p224p109o485n968o080o489o488n957n365n012m766m424l952l438
$$ 591579 584355 577246 570761 564793 558713 552224 545736 539779 534414 529402 524636 520212 516260 512822
52131E12822l049k963l075k969k470j969j893k038j893j413j029r89j121j212
$$ 512822 509773 506810 503735 500766 498296 496327 494434 492396 490503 489090 488061 487072 485951 484739
52117D84739j222j133r84j013j381j778j755j377j151j326j649j876k015k047
$$ 484739 483517 482384 481400 480387 479006 477228 475473 474096 472945 471619 469970 468094 466079 464032
52103D64032j836j474j322j535j887k117k234k325k388k451k514k354j729q84
$$ 464032 462196 460722 459400 457865 455978 453861 451627 449302 446914 444463 441949 439595 437866 436982
52089D36982m51o77j107j256j174j156j219j222j255j499j811j801j330p41n38
$$ 436982 436531 435854 434747 433491 432317 431161 429942 428720 427465 425966 424155 422354 421024 420283 419745
52074D19745q59j319j364q57k62o4k07l01k63l55o10p10n34l67l33j19M67R87
$$ 419745 418886 417567 416203 415346 415084 415020 414813 414512 414249 413894 413284 412574 412040 411673 411340 411221 411688 412675
52056D12675R14M26K32O92J526K315K952L508L961M218M304M383M629N084N611
$$ 412675 413589 414015 414247 414939 416465 418780 421732 425240 429201 433419 437723 442106 446735 451819 457430
52041D57430O088O604P360Q327R158R583R772J0061J0489J0816J0950J1132J1562
$$ 457430 463518 470122 477482 485809 494967 504550 514322 524383 534872 545688 556638 567770 579332
52028E79332J2030J2093J1623J0995J0674J0637J0376R471Q080O739N808N219
$$ 579332 591362 603455 615078 626073 636747 647384 657760 667231 675311 682050 687858 693077
52016F93077M683L965K974J821P92J32k69q05j736k913l906m374m314m037l936
$$ 693077 697760 701725 704699 706520 707312 707444 707175 706370 704634 701721 697815 693441 689127 685090 681154
52001F81154m142m435m576m598m665m711m486l946l351k891k431j715p45J73O87
$$ 681154 677012 672577 668001 663403 658738 654027 649541 645595 642244 639353 636922 635207 634462 634635 635322
51986F35322P54P18R99J625K242K605K861L124L110K588J971J937K488K928K808
$$ 635322 636076 636794 637793 639418 641660 644265 647126 650250 653360 655948 657919 659856 662344 665272 668080
51971F68080K396K059J679J021K23l89p53j029j336j805k602l657m565n030n246
$$ 668080 670476 672535 674214 675235 675458 675069 674316 673287 671951 670146 667544 663887 659322 654292 649046
51956F49046n558n970o247o393o661p182p838q499r119r594r767r642r472r575
$$ 649046 643488 637518 631271 624878 618217 611035 603197 594698 585579 575985 566218 556576 547104 537529
51942E37529j0090j0847j1489j1767j1753j1664j1517j1208j0902j0982j1449
$$ 537529 527439 516592 505103 493336 481583 469919 458402 447194 436292 425310 413861
51931D13861j1794j1655j1308j1196j1246j1088j0689j0300r902r266q575q416
$$ 413861 402067 390412 379104 367908 356662 345574 334885 324585 314683 305417 296842 288426
51919B88426q942r450r181q240p400p149p238p133o645n995n462n098m798m467
$$ 288426 279484 270034 260853 252613 245213 238064 230826 223693 217048 211053 205591 200493 195695 191228
51905A91228m119l810l589l486l490l484l289k848k339k051k098k308k402k277
$$ 191228 187109 183299 179710 176224 172734 169250 165961 163113 160774 158723 156625 154317 151915 149638
51891A49638k102k094k267k407k343k116j859j621j427j400j638k018k305k426
$$ 149638 147536 145442 143175 140768 138425 136309 134450 132829 131402 130002 128364 126346 124041 121615
51877A21615k453k358k015j522j173j065r40o02k52k35n89j008j183j040p15m58
$$ 121615 119162 116804 114789 113267 112094 111029 110089 109487 109235 109000 108411 107403 106220 105180 104465 104007
51861A04007m63o94q89q54o28l46r6N9J9j69l07k98l22n42q38r97j057j200j388
$$ 104007 103544 102850 101961 101107 100479 100133 100037 100096 100115 99946 99639 99341 99019 98477 97639 96642 95585 94385 92997
51842I2997j356j014o01l88l77l96l73m08n94q43r38p78n21m26n41o55o03m85
$$ 92997 91641 90627 90026 89638 89261 88865 88492 88084 87490 86647 85709 84931 84410 83984 83443 82788 82185 81700
51824H1700n24p77j089j276j246r89n59o9L16M41K67k0j10J04L77L91J71k2r6
$$ 81700 81176 80399 79310 78034 76788 75799 75240 75171 75487 75928 76195 76175 76065 76169 76546 76937 77108 77086 76990
51805G6990k00l42k77Q6M34M69L37M23P63R97Q36M18P8j8M7J47K52L70M09K23
$$ 76990 76790 76448 76171 76257 76691 77160 77497 77920 78683 79680 80516 80934 81012 80994 81041 81188 81440 81810 82219 82442
51785H2442j51m18l05J12N40Q30J032J141J040P36M46K90J79P2J10L67O61P78
$$ 82442 82291 81873 81568 81680 82220 83050 84082 85223 86263 86999 87445 87735 87914 87986 88096 88463 89124 89902
51767H9902P28N93L18j91p59j030q00k83N2j41p38j217j178p77m64m25m98n67
$$ 89902 90630 91223 91541 91350 90591 89561 88761 88478 88530 88389 87651 86434 85256 84479 84015 83590 83092 82525
51749H2525o59o40k56M09Q77Q55N67L11P5j76k39k3J56L4j49n4J67J00k34m31
$$ 82525 81866 81226 80970 81379 82256 83111 83678 83989 84064 83888 83649 83626 83782 83816 83667 83613 83780 83880 83646 83215
51729H3215l51k73l43l45o8L40N46L74q3n32o94n88n46p49r08o15O4O52Q04N90
$$ 83215 82864 82591 82248 81903 81835 82175 82721 83095 83012 82480 81786 81198 80652 79903 78995 78380 78444 79096 79900 80490
51709H0490K23j36l58l76k98k79k84j89k3Q1J41K79M81O11O58P31P98P20N03L04
$$ 80490 80713 80577 80219 79843 79545 79266 78982 78793 78770 78851 78992 79271 79752 80363 81021 81752 82550 83270 83773 84077
51689H4077K03K01L90Q18J205J111N39M7J05N40Q19P31O05Q37J345J610J327Q54
$$ 84077 84280 84481 84871 85689 86894 88005 88544 88591 88696 89236 90055 90786 91391 92228 93573 95183 96510 97364
51671I7364Q24J284J634J489J259J486J969K101J883K004K814L757M113L843L467
$$ 97364 98188 99472 101106 102595 103854 105340 107309 109410 111293 113297 116111 119868 123981 127824 131291
51656A31291L380L557L746L695L347K919K651K455J981J141K50l99q62j257j461
$$ 131291 134671 138228 141974 145669 149016 151935 154586 157041 159022 160163 160413 160014 159152 157895 156434
51641A56434j363j212j366j756j957j753j346j026q40o88n12k69J18O41J102J308
$$ 156434 155071 153859 152493 150737 148780 147027 145681 144655 143815 143127 142615 142346 142464 143105 144207 145515
51625A45515J320J363J515J641J705J903K346K724K555J775Q46K40jj44l89o96
$$ 145515 146835 148198 149713 151354 153059 154962 157308 160032 162587 164362 165208 165448 165447 165303 164914 164218
51609A64218q75p48l32R1K38J98L16O75R58R43Q74J086J475J649J491J285J320
$$ 164218 163343 162595 162263 162354 162592 162790 163106 163781 164739 165682 166556 167642 169117 170766 172257 173542 174862
51592A74862J577J793J700J247P15M66M97M04ql85l23m3j42p94j575k049k200
$$ 174862 176439 178232 179932 181179 181894 182360 182857 183261 183253 182868 182545 182502 182360 181566 179991 177942 175742
51575A75742k261k369k512k610k590k494k475k581k623k434k136j972j978k055
$$ 175742 173481 171112 168600 165990 163400 160906 158431 155850 153227 150793 148657 146685 144707 142652
51561A42652k176k299k214j809j371j273j433j421j079o92n02m82n62q02j175
$$ 142652 140476 138177 135963 134154 132783 131510 130077 128656 127577 126885 126383 125901 125339 124537 123362
51546A23362j477j547j426j237j102j100j181j164j017r90j219j391j156o73l60
$$ 123362 121885 120338 118912 117675 116573 115473 114292 113128 112111 111121 109902 108511 107355 106682 106322
51531A06322k28L4L87M53J95M5K05L95M07M44O29P30O23N53O68O79L95J93M96
$$ 106322 106094 106128 106515 106968 107163 107208 107413 107808 108215 108659 109288 110018 110641 111194 111862 112541 112936 113129 113625
51512A13625J093J458J550J789K277K567K265J593J069Q99Q15N41J66j6qj84p61
$$ 113625 114718 116176 117726 119515 121792 124359 126624 128217 129286 130185 131000 131541 131707 131691 131683 131499 130738
51495A30738j418j684j563j431j436j361j086p83o15n94p39j020j115o85K9L28
$$ 130738 129320 127636 126073 124642 123206 121845 120759 119976 119361 118767 118028 117008 115893 115208 115237 115565
51479A15565L8j68L36J261J860J933J888K007K105J947J625J405J420J557J609
$$ 115565 115603 115435 115771 117032 118892 120825 122713 124720 126825 128772 130397 131802 133222 134779 136388
51464A36388J475J261J062Q16M19m1l79n98q12r32p82m97l98m55l12O7K32n1m22
$$ 136388 137863 139124 140186 141002 141421 141380 141001 140403 139591 138659 137877 137380 136982 136527 136215 136282 136514 136463 136041
51445A36041m94m04m39n08l86j79j05p3J38L94L55N0j59j02l2j84m43m92k13J54
$$ 136041 135547 135143 134704 134196 133810 133631 133526 133453 133591 133985 134340 134390 134231 134129 134097 133913 133470 132978 132765 132919
51425A32919K24j59p33j151j406j680j870j632j011n38n05n41k68N6k1l73m76
$$ 132919 133143 132984 132251 131100 129694 128014 126144 124512 123501 122963 122458 121917 121649 121705 121684 121311 120835
51408A20835k06P3J68L06O48R99J077Q90O64N94P28R76J185J291J389J616J986
$$ 120835 120629 120702 120870 121176 121824 122823 123900 124790 125454 126048 126776 127752 128937 130228 131617 133233 135219
51391A35219K390K680K739K585K468K609K870K832K358J793J493J410J299J111
$$ 135219 137609 140289 143028 145613 148081 150690 153560 156392 158750 160543 162036 163446 164745 165856
51377A65856R64Q97Q59P92N86J64k84m03j58R2J15P4Q8m5l68m65k4O01Q82Q61
$$ 165856 166820 167717 168576 169368 169954 170118 169834 169431 169273 169365 169480 169554 169642 169597 169229 168764 168740 169341 170223 171084
51357A71084R48J203J363J417J585J775J622J066N07K83L39M23L27j04p99j362
$$ 171084 172032 173235 174598 176015 177600 179375 180997 182063 182570 182853 183192 183615 183942 183838 183039 181677
51341A81677j408j047p40p41r25j168j497j864k068k017j804j522j234j070j128
$$ 181677 180269 179222 178482 177741 176816 175648 174151 172287 170219 168202 166398 164876 163642 162572 161444
51326A61444j286j336j321j401j512j411j095q35p48o22k81J40L90M06L14K62
$$ 161444 160158 158822 157501 156100 154588 153177 152082 151247 150499 149877 149596 149736 150126 150532 150846 151108
51310A51108L04L95M49M39M12L69K62P0j56m49r13j516k079k538k970l339l439
$$ 151108 151412 151807 152256 152695 153107 153476 153738 153808 153652 153203 152290 150774 148695 146157 143187 139848 136409
51293A36409l234k922k614k289k162k560l215l310k581j796j682j937j926j772
$$ 136409 133175 130253 127639 125350 123188 120628 117413 114103 111522 109726 108044 106107 104181 102409
51279A02409j927k150j819j076o76p89q15m87k38l57n32n06m99p01r02r04p94
$$ 102409 100482 98332 96513 95437 94761 93972 93157 92670 92432 92075 91543 91037 90538 89837 88935 88031 87237
51262H7237n93j76L10M47K13O7K22L22J45J4J89L54J27k95m40k11J14L25L87L45
$$ 87237 86644 86468 86778 87225 87438 87505 87727 88049 88194 88208 88397 88751 88878 88583 88143 87932 88046 88371 88758 89103
51242H9103L24M40N88N16K59J57L50N98P19Q49J109J375J577J845K147K174J826
$$ 89103 89427 89867 90455 90971 91230 91387 91737 92335 93054 93903 95012 96387 97964 99809 101956 104130 105956
51225A05956J420J211J030O82K84k0l68q57j272j420j474j654j847j855j786j883
$$ 105956 107376 108587 109617 110299 110583 110563 110195 109338 108066 106646 105172 103518 101671 99816 98030 96147
51209I6147k154k373k350k010j467j088j256j822k182k004j575j221q69m15j02
$$ 96147 93993 91620 89270 87260 85793 84705 83449 81627 79445 77441 75866 74645 73776 73361 73259
51194G3259j24k24q4J43P8l04o96q63p79n40l71n24q88r96o14p0K24L11M18N54
$$ 73259 73135 72911 72827 72970 73048 72744 72048 71185 70406 69866 69495 68971 68083 67087 66473 66403 66627 66938 67356 67910
51174F7910O45P71R29Q65M88J76K73O07Q27R22J030J041Q41O39O16N89L76J81
$$ 67910 68555 69326 70255 71120 71608 71784 72057 72664 73491 74413 75443 76484 77325 77964 78580 79169 79545 79726
51156G9726J35p7o26r71n91J12L79K68L91P35P15L33K60O29P34K13l08k26J69
$$ 79726 79861 79784 79158 78187 77596 77708 78087 78355 78746 79481 80196 80529 80789 81418 82152 82365 82057 81831 82000
51137H2000L23K68K90K48j11n71p01n40m73o22p43o78m97k89q5L8K7m1q2j55l35
$$ 82000 82323 82591 82881 83129 83018 82447 81746 81206 80733 80111 79368 78690 78193 77904 77819 77857 77884 77843 77761 77606 77271
51116G7271n33o21n91n10m32m22n79q46j016r94q72p10m36j31j11n02r33r38m91
$$ 77271 76738 76117 75526 75016 74584 74162 73583 72737 71721 70727 69855 69145 68709 68578 68467 67965 67032 66094 65603
51097F5603M4L61M30L66L43M80O38M84k5m51l91m6Q5o1p7K23N04L73j01n70p81
$$ 65603 65647 66008 66438 66804 67147 67627 68265 68749 68724 68273 67882 67836 67921 67860 67783 68006 68510 68883 68782 68212 67431
51076F7431o71l02Q9J58j86o21p45n49l20k26j70p6m5j22j31J13N04P01M84j9
$$ 67431 66760 66458 66547 66705 66519 65898 65153 64604 64284 64058 63888 63812 63767 63645 63514 63627 64131 64832 65316 65297
51056F5297m56n46k63J78N05N92N14M34M51O09Q90J190J341J237R55O74M93M24
$$ 65297 64841 64295 64032 64210 64715 65307 65821 66255 66706 67315 68205 69395 70736 71973 72928 73602 74095 74519
51038G4519M80O94J030J332J433J288J003P63O78O44M60J15j32p8J07J09j07k49
$$ 74519 74999 75693 76723 78055 79488 80776 81779 82542 83220 83864 84324 84439 84307 84229 84336 84445 84338 84089
51020H4089j34J00J99J07m8j23p6l0j60m24m97j31M51P61O54M41L91M09L35K38
$$ 84089 83955 84055 84254 84361 84313 84190 84114 84084 83924 83500 83003 82872 83323 84084 84738 85179 85570 85979 86314 86552
51000H6552K57L37L29J66j50n34p79p05m74m42o46p17m92k87l39l96j94L7j4j27
$$ 86552 86809 87146 87475 87641 87491 86957 86178 85473 84999 84557 83911 83194 82702 82415 82076 81680 81486 81523 81509 81382
50980H1382J51P07R81P94N32N17O36P50R85J385J691J657J388J160J068J060J102
$$ 81382 81533 82240 83221 84015 84547 85064 85700 86450 87435 88820 90511 92168 93556 94716 95784 96844 97946
50963I7946J172J185J138J185J461J844K039J870J460J116J022J065R99Q01P14
$$ 97946 99118 100303 101441 102626 104087 105931 107970 109840 111300 112416 113438 114503 115502 116303 117017
50948A17017Q63J052J061J007J189J632K070K287K314K288K320K455K623K656
$$ 117017 117880 118932 119993 121000 122189 123821 125891 128178 130492 132780 135100 137555 140178 142834
50934A42834K558K637L110L748M137M258M444M826N228N577O036O593O968P118
$$ 142834 145392 148029 151139 154887 159024 163282 167726 172552 177780 183357 189393 195986 202954 210072
50920B10072P463Q348R535J0492J1004J1286J1647J2342J3528J5124J6756J8083
$$ 210072 217535 225883 235418 245910 256914 268200 279847 292189 305717 320841 337597 355680
50908C55680J9179K0445K2151K4151K6076K7646K8895L0122L1550L3018L4023
$$ 355680 374859 395304 417455 441606 467682 495328 524223 554345 585895 618913 652936
50897F52936L4215L3681L2723L1477K9887K7915K5583K2804J9462J5714J2054
$$ 652936 687151 720832 753555 785032 814919 842834 868417 891221 910683 926397 938451
50886I38451Q931O318L788J060j628l815n354o515p516q199q335q082p866p902
$$ 938451 947382 953700 957488 958548 956920 953105 947751 941236 933720 925521 917186 909104 901238 893336
50872H93336q072q327q915j0095j1788j3637j5355j6910j8477k0234k2144k3883
$$ 893336 885264 876937 868022 857927 846139 832502 817147 800237 781760 761526 739382 715499
50860G15499k5075k5679k6028k6393k6625k6322k5343k4068k3035k2330k1433
$$ 715499 690424 664745 638717 612324 585699 559377 534034 509966 486931 464601 443168
50849D43168j9808j7653j5803j4758j4047j2812j0924r112q029p524o978o093
$$ 443168 423360 405707 389904 375146 361099 348287 337363 328251 320222 312698 305720 299627
50837B99627n092m283l682l059k236j296m68J58O78J149J417J392J301J440J761
$$ 299627 294535 290252 286570 283511 281275 279979 279511 279669 280347 281496 282913 284305 285606 287046 288807
50822B88807K027K287K865L773M596N069N421N928O452O731O865P196P849Q702
$$ 288807 290834 293121 295986 299759 304355 309424 314845 320773 327225 333956 340821 348017 355866 364568
50808C64568R687J0777J1788J2534J3200J4206J5643J7134J8402J9663K1274K3217
$$ 364568 374255 385032 396820 409354 422554 436760 452403 469537 487939 507602 528876 552093
50796E52093K5230K7313K9759L2672L5765L8796M1974M5669M9853N4073N7960
$$ 552093 577323 604636 634395 667067 702832 741628 783602 829271 879124 933197 991157
50785I91157O1484O4692O7502O9872P1896P3502P4257P3711P1792O8606O4016
$$ 991157 1052641 1117333 1184835 1254707 1326603 1400105 1474362 1548073 1619865 1688471 1752487
50774A752487N7816N0197M1749L2929K3865J4746O064j653q197j3605j7949k1189
$$ 1752487 1810303 1860500 1902249 1935178 1959043 1973789 1979853 1978200 1970003 1956398 1938449 1917260
50762A917260k3185k3749k2943k1264j9354j7531j5899j4825j4943j6553j9402
$$ 1917260 1894075 1870326 1847383 1826119 1806765 1789234 1773335 1758510 1743567 1727014 1707612
50751A707612k3154k7718l2867l8022m2734m7122n1454n5447n8471o0268o1157
$$ 1707612 1684458 1656740 1623873 1585851 1543117 1495995 1444541 1389094 1330623 1270355 1209198
50740A209198o1463o1154o0040n8082n5462n2426m9165m5717m2009l8131l4417
$$ 1209198 1147735 1086581 1026541 968459 912997 860571 811406 765689 723680 685549 651132
50729F51132l1189k8469k6081k3879k1754j9588j7437j5593j4192j2970j1622
$$ 651132 619943 591474 565393 541514 519760 500172 482735 467142 452950 439980 428358
50718D28358j0289r280q473p437o164n188m807m625m127l366k772k505k340k042
$$ 428358 418069 408789 400316 392879 386715 381527 376720 372095 367968 364602 361830 359325 356985 354943
50704C54943j549q75r5N24P24O04O16J075J791K356K683L090L859M823N607O118
$$ 354943 353394 352519 352424 352948 353672 354276 354892 355967 357758 360114 362797 365887 369746 374569 380176 386294
50688C86294O681P552Q588R481J0245J1181J2399J3670J4826J6026J7481J9087
$$ 386294 392975 400527 409115 418596 428841 440022 452421 466091 480917 496943 514424 533511
50676E33511K0616K2129K3943K6198K8684L1136L3474L5731L7910M0001M1990
$$ 533511 554127 576256 600199 626397 655081 686217 719691 755422 793332 833333 875323
50665H75323M3712M4836M5138M4701M3691M2099L9854L7058L3809K9846K4674
$$ 875323 919035 963871 1009009 1053710 1097401 1139500 1179354 1216412 1250221 1280067 1304741
50654A304741J8188J0937L701l024q980j3900j7541j9908k1207k1607k1215k0231
$$ 1304741 1322929 1333866 1337567 1334543 1325563 1311663 1294122 1274214 1253007 1231400 1210185 1189954
50642A189954j8930j7488j5993j4622j3696j3481j4048j5327j7254j9799k2930
$$ 1189954 1171024 1153536 1137543 1122921 1109225 1095744 1081696 1066369 1049115 1029316 1006386
50631A006386k6454k9950l2907l5066l6504l7356l7538l6944l5710l4182l2584
$$ 1006386 979932 949982 917075 882009 845505 808149 770611 733667 697957 663775 631191
50620F31191l0955k9250k7382k5225k2812k0483j8536j6834j5008j3028j1273
$$ 631191 600236 570986 543604 518379 495567 475084 456548 439714 424706 411678 400405
50609D00405r945q787p488o083m779l631k566j582p28jO19J144J636K192K822
$$ 400405 390460 381673 374185 368102 363323 359692 357126 355544 354816 354815 355434 356578 358214 360406 363228
50594C63228L482M245N213O236P016P549Q186R161J0367J1677J3149J4662J5794
$$ 363228 366710 370955 376168 382404 389420 396969 405155 414316 424683 436360 449509 464171 479965
50581D79965J6382J6919J7971J9395K0559K1202K1653K2198K2679K2779K2420
$$ 479965 496347 513266 531237 550632 571191 592393 614046 636244 658923 681702 704122
50570G04122K1757K0948J9992J8676J6793J4523J2446J0957R769Q329O613N139
$$ 704122 725879 746827 766819 785495 802288 816811 829257 840214 849983 858312 864925 870064
50558H70064M227L664L189K859K813K928L028L181L613M377N246N836N791N020
$$ 870064 874291 877955 881144 884003 886816 889744 892772 895953 899566 903943 909189 915025 920816 925836
50544I25836L829K668J686O41p51k534m618o932r371j1811j4291j6933j9638k2020
$$ 925836 929665 932333 934019 934660 933909 931375 926757 919825 910454 898643 884352 867419 847781 825761
50530H25761k3847k5235k6304k6852k6698k6113k5539k5018k4207k2910k1308
$$ 825761 801914 776679 750375 723523 696825 670712 645173 620155 595948 573038 551730
50519E51730j9673j8121j6641j5155j3536j1833j0414r513q737p434n651m181
$$ 551730 532057 513936 497295 482140 468604 456771 446357 436844 428107 420673 415022 410841
50507D10841l435k806j570j4R55J103J118J602K444L312M174N091N903O512P128
$$ 410841 407406 404600 403030 403016 403971 405074 406192 407794 410238 413550 417724 422815 428718 435230 442358
50492D42358P904Q568Q825Q880R183R784J0339J0671J0877J0922J0601J0016R676
$$ 442358 450262 458830 467655 476535 485718 495502 505841 516512 527389 538311 548912 558928 568604
50479E68604R898J0421J0815J1065J1451J2104J2929J3934J5294J7033J8837K0351
$$ 568604 578502 588923 599738 610803 622254 634358 647287 661221 676515 693548 712385 732736
50467G32736K1623K3118K5256K7972L0806L3388L5685L7723L9296M0177M0457
$$ 732736 754359 777477 802733 830705 861511 894899 930584 968307 1007603 1047780 1088237
50456A088237M0451M0254L9621L8282L6100L2944K8745K3754J8535J3467Q428
$$ 1088237 1128688 1168942 1208563 1246845 1282945 1315889 1344634 1368388 1386923 1400390 1408818
50445A408818L149k317p598j2382j6534j9971k2616k4490k5685k6213k5960k4825
$$ 1408818 1411967 1409650 1402052 1389670 1373136 1353165 1330549 1306059 1280374 1254161 1228201 1203376
50433A203376k2883k0370j7496j4289j0693o864l254l00J871L264L687K838O51
$$ 1203376 1180493 1160123 1142627 1128338 1117645 1110781 1107527 1107227 1109098 1112362 1116049 1118887 1119538
50420A119538k708p076j2227j7568k2397k6534l0321l3770l6222l7186l7135l6952
$$ 1119538 1116830 1109754 1097527 1079959 1057562 1031028 1000707 966937 930715 893529 856394 819442
50408H19442l6823l6137l4442l2030k9564k7417k5509k3510k1180j8654j6395
$$ 819442 782619 746482 712040 680010 650446 623029 597520 574010 552830 534176 517781
50397E17781j4732j3422j1915j0042q199o786n699m539l124j635l18P53J624K326
$$ 517781 503049 489627 477712 467670 459471 452685 446986 442447 439323 437688 437370 438123 439747 442073
50383D42073K930L653M704N984P057P620P889Q351R156R991J0499J0609J0440
$$ 442073 445003 448656 453360 459344 466401 474021 481910 490261 499417 509408 519907 530516 540956
50370E40956J0164J0000J0054J0069R643Q801Q051P686P324O458N167L979L178
$$ 540956 551120 561120 571174 581243 590886 599687 607738 615424 622748 629206 634373 638352 641530
50357F41530K604K079J693J665K065K729L329L676L998M783O211P907R420J0676
$$ 641530 644134 646213 647906 649571 651636 654365 657694 661370 665368 670151 676362 684269 693689 704365
50343G04365J1776J2646J3120J3247J3184J2948J2510J1930J1111R673P377M512
$$ 704365 716141 728787 741907 755154 768338 781286 793796 805726 816837 826510 833887 838399
50331H38399J514j621n195r165j3095j6595j9439k1379k2274k2393k2177k1686
$$ 838399 839913 838292 833097 823932 810837 794242 774803 753424 731150 708757 686580 664894
50319F64894k0704j9244j7550j5567j3050j0175p500n181k802k30J866K812K799
$$ 664894 644190 624946 607396 591829 578779 568604 561104 555923 553121 552891 554757 557569 560368
50306E60368K530K236J542J51j728l735n750p814r827j1482j2554j3160j3641
$$ 560368 562898 565134 566676 566827 565099 561364 555614 547800 537973 526491 513937 500777 487136
50293D87136j4107j4287j3883j3000j2017j1178j0533j0102r765r109p799o136
$$ 487136 473029 458742 444859 431859 419842 408664 398131 388029 378264 369155 361356 355220
$$ [...]
##END NTUPLES=NMR SPECTRUM
##END=
