
##TITLE=AC1197_CPAAH12060_5946785_4O4TSD0MWf
##JCAMPDX= 6.0         $$ Bruker NMR JCAMP-DX V2.0
##DATA TYPE= NMR SPECTRUM
##DATA CLASS= NTUPLES
##ORIGIN= BRUKER
##OWNER= Administrator
$$ 1.72 TOPSPIN		Version 2.1
$$ 2012-04-10 23:45:51.984 -0500  Administrator@TOPSPIN
$$ Compression mode = diff/dup
##.OBSERVE FREQUENCY= 400.13188235
##.OBSERVE NUCLEUS= ^1H
##.ACQUISITION MODE= SIMULTANEOUS (DQD)
##.ACQUISITION SCHEME= undefined
##.AVERAGES= 8
##.DIGITISER RES= 22
##SPECTROMETER/DATA SYSTEM= spect
##.PULSE SEQUENCE= zg30
##.SOLVENT NAME= COFFEE_meoh
##.SHIFT REFERENCE= INTERNAL, COFFEE_meoh, 1, 14.98061
##AUDIT TRAIL= $$ (NUMBER, WHEN, WHO, WHERE, PROCESS, VERSION, WHAT)
$$ ##TITLE= Audit trail, TOPSPIN		Version 2.1
$$ ##JCAMPDX= 5.01
$$ ##ORIGIN= Bruker BioSpin GmbH
$$ ##OWNER= Administrator
$$ $$ C:\Bruker\TOPSPIN/data/COFFEE/nmr/AC1197_CPAAH12060_5946785_4O4TSD0MWf/10/pdata/1/auditp.txt
$$ ##AUDIT TRAIL=  $$ (NUMBER, WHEN, WHO, WHERE, PROCESS, VERSION, WHAT)
(   1,<2012-04-10 23:45:45.171 -0500>,<Administrator>,<TOPSPIN>,<go>,<TOPSPIN 2.1>,
      <created by zg
	started at 2012-04-10 23:44:38.609 -0500,
	POWCHK enabled, PULCHK disabled,
       configuration hash MD5:
       1A 1E CE 29 27 FD 77 03 67 4E F0 E3 C4 B2 CB 90
       data hash MD5: 64K
       C6 4A 26 97 95 AE 0B 42 07 FC 15 77 86 27 08 C5>)
(   2,<2012-04-10 23:45:47.765 -0500>,<Administrator>,<TOPSPIN>,<proc1d>,<TOPSPIN 2.1>,
      <Start of raw data processing
       efp LB = 0 FT_mod = 6 PKNL = 1 PHC0 = 0 PHC1 = 0 SI = 32K 
       data hash MD5: 32K
       79 37 16 3E C0 B4 94 33 63 B4 62 F8 BF 3D 16 97>)
(   3,<2012-04-10 23:45:48.203 -0500>,<Administrator>,<TOPSPIN>,<proc1d>,<TOPSPIN 2.1>,
      <pk PHC0 = 211.3495 PHC1 = 0 
       data hash MD5: 32K
       36 28 16 BA E4 E6 A5 5A 87 4A 32 A3 9F 0F EE 22>)
(   4,<2012-04-10 23:45:48.296 -0500>,<Administrator>,<TOPSPIN>,<proc1d>,<TOPSPIN 2.1>,
      <abs ABSG = 1 
       data hash MD5: 32K
       69 02 04 07 DA DC 2C 0E 2F 28 B4 F2 A8 F8 3F 3C>)
(   5,<2012-04-10 23:45:48.343 -0500>,<Administrator>,<TOPSPIN>,<proc1d>,<TOPSPIN 2.1>,
      <abs ABSG = 2 
       data hash MD5: 32K
       8B 1E 66 BB 24 D2 A9 43 B9 4F 78 EB DE 84 D7 1F>)
(   6,<2012-04-10 23:45:48.375 -0500>,<Administrator>,<TOPSPIN>,<proc1d>,<TOPSPIN 2.1>,
      <abs ABSG = 3 
       data hash MD5: 32K
       5C 5B 7F 36 B5 A0 FD 7A 38 A8 6D D4 D7 67 8D A4>)
(   7,<2012-04-10 23:45:48.406 -0500>,<Administrator>,<TOPSPIN>,<proc1d>,<TOPSPIN 2.1>,
      <abs ABSG = 4 
       data hash MD5: 32K
       6E AE F5 6E EE E7 38 BE 30 D5 BB 30 2B 2B 85 77>)
(   8,<2012-04-10 23:45:48.437 -0500>,<Administrator>,<TOPSPIN>,<proc1d>,<TOPSPIN 2.1>,
      <abs ABSG = 5 
       data hash MD5: 32K
       6B CF 04 0E 31 B0 5F 14 3E 23 A9 28 7C FB CC B8>)
$$ ##END=
$$ 
$$ $$ hash MD5
$$ $$ 6E 25 C8 87 05 CE 07 70 8F C6 39 1E 69 0E 24 E1
##$RELAX= 
##$RELAX= 
##$RELAX= 
##$RELAX= 
##$RELAX= 
##$RELAX= 
##$RELAX= 
$$ Bruker specific parameters
$$ --------------------------
$$ [...]
##$TP= (0..7)
150 150 150 150 150 150 150 150
##$TP07= 0
##$TPNAME0= <>
##$TPNAME1= <>
##$TPNAME2= <>
##$TPNAME3= <>
##$TPNAME4= <>
##$TPNAME5= <>
##$TPNAME6= <>
##$TPNAME7= <>
##$TPOAL= (0..7)
0.5 0.5 0.5 0.5 0.5 0.5 0.5 0.5
##$TPOFFS= (0..7)
0 0 0 0 0 0 0 0
##$TUNHIN= 0
##$TUNHOUT= 0
##$TUNXOUT= 0
##$USERA1= <user>
##$USERA2= <user>
##$USERA3= <user>
##$USERA4= <user>
##$USERA5= <user>
##$V9= 5
##$VALIST= <valist>
##$VCLIST= <CCCCCCCCCCCCCCC>
##$VD= 0
##$VDLIST= <DDDDDDDDDDDDDDD>
##$VPLIST= <PPPPPPPPPPPPPPP>
##$VTLIST= <TTTTTTTTTTTTTTT>
##$WBST= 1024
##$WBSW= 4
##$XGAIN= (0..3)
0 0 0 0
##$XL= 0
##$YL= 0
##$YMAX_a= 523468
##$YMIN_a= -645804
##$ZGOPTNS= <>
##$ZL1= 120
##$ZL2= 120
##$ZL3= 120
##$ZL4= 120
##$ABSF1= 14.98061
##$ABSF2= -5.57192
##$ABSG= 5
##$ABSL= 3
##$ALPHA= 0
##$AQORDER= 0
##$ASSFAC= 0
##$ASSFACI= 0
##$ASSFACX= 0
##$ASSWID= 0
##$AUNMP= <proc_prof1d_extract_pilot.lims>
##$AXLEFT= 0
##$AXNAME= <>
##$AXNUC= <1H>
##$AXRIGHT= 0
##$AXTYPE= 0
##$AXUNIT= <>
##$AZFE= 0.1
##$AZFW= 0.1
##$BCFW= 0
##$BC_mod= 0
##$BYTORDP= 0
##$COROFFS= 0
##$CY= 15
##$DATMOD= 1
##$DC= 0
##$DFILT= <>
##$DTYPP= 0
##$F1P= 0
##$F2P= 0
##$FCOR= 0.5
##$FTSIZE= 32768
##$FT_mod= 6
##$GAMMA= 0
##$GB= 0
##$INTBC= 1
##$INTSCL= 1
##$ISEN= 128
##$LB= 0
##$LEV0= 0
##$LPBIN= 0
##$MAXI= 10000
##$MC2= 0
##$MEAN= 0
##$ME_mod= 0
##$MI= 0
##$NCOEF= 0
##$NC_proc= -8
##$NLEV= 6
##$NOISF1= 0
##$NOISF2= 0
##$NSP= 0
##$NTH_PI= 0
##$NZP= 0
##$OFFSET= 14.98061
##$PC= 1
##$PHC0= 211.3495
##$PHC1= 0
##$PH_mod= 1
##$PKNL= yes
##$PPARMOD= 0
##$PPDIAG= 0
##$PPIPTYP= 0
##$PPMPNUM= 2147483647
##$PPRESOL= 1
##$PSCAL= 4
##$PSIGN= 0
##$PYNMP= <proc.py>
##$REVERSE= no
##$SF= 400.13
##$SI= 32768
##$SIGF1= 0
##$SIGF2= 0
##$SINO= 400
##$SIOLD= 32768
##$SPECTYP= <>
##$SREGLST= <1H.CDCl3>
##$SSB= 0
##$STSI= 32768
##$STSR= 0
##$SW_p= 8223.68421052632
##$SYMM= 0
##$S_DEV= 0
##$TDeff= 65536
##$TDoff= 0
##$TI= <>
##$TILT= no
##$TM1= 0
##$TM2= 0
##$TOPLEV= 0
##$USERP1= <user>
##$USERP2= <user>
##$USERP3= <user>
##$USERP4= <user>
##$USERP5= <user>
##$WDW= 1
##$XDIM= 32768
##$YMAX_p= 463376022
##$YMIN_p= -699209
##$CURPLOT= <Network HP LaserJet P1505>
##$CURPRIN= <$Network HP LaserJet P1505>
##$DFORMAT= <normdp>
##$LAYOUT= <+/1D_H.xwp>
##$LFORMAT= <normlp>
##$PFORMAT= <normpl>
##$SURQMSG= 1
$$ End of Bruker specific parameters
$$ ---------------------------------
##NTUPLES= NMR SPECTRUM
##VAR_NAME=  FREQUENCY,     SPECTRUM/REAL,   SPECTRUM/IMAG
##SYMBOL=    X,             R,               I
##VAR_TYPE=  INDEPENDENT,   DEPENDENT,       DEPENDENT
##VAR_FORM=  AFFN,          ASDF,            ASDF
##VAR_DIM=   32768,         32768,           32768
##UNITS=     HZ,            ARBITRARY UNITS, ARBITRARY UNITS
##FACTOR=    0.250966925370066, 1,           1
##FIRST=     8223.43324360095, -247821,      -125241
##LAST=      0,             291427,          98
##MIN=       0,             -699209,         0
##MAX=       8223.43324360095, 463376022,    0
$$ Real data points
##PAGE= N=1
##DATA TABLE= (X++(R..R)), XYDATA
$$ [...]
19462a67260j99168i02k58490A03450b4918D6604K70969a38135B01827c6601k04451
$$ -167260 -366428 -902 -259392 103450 -24918 46604 317573 -138135 201827 -36601 -241052
19451b41052J13384H9678d97735a59608I3716D5478a35269A15727K630d4019k16720
$$ -241052 -127668 89678 -497735 -159608 93716 45478 -135269 115727 118357 -44019 -260739
19440b60739j72099J11086o3496A3132a06319K4032b3388C55232a76360j95819
$$ -260739 -432838 -321752 -385248 13132 -106319 -82287 -23388 355232 -176360 -372179
19430c72179e0104k15346C497a94344g1419j44939i4231q0722c611j40506A46167
$$ -372179 -50104 -265450 3497 -194344 -71419 -216358 -94231 -174953 -3611 -144117 146167
19418c81153I0662a36161M1700b6567k05005e7774A42412R6442D9625c72712J29214
$$ -381153 90662 -136161 -94461 -26567 -231572 -57774 142412 238854 49625 -372712 -243498
19407b43498B07181h7342m0030N1376B85165c6131C176K9815O7458L47634a07685
$$ -243498 207181 -87342 -127372 -75996 285165 -36131 3176 32991 100449 448083 -107685
19395b32787L2508L8505e1348l56947f8006D9225h1463r8202o5496e8700j57865
$$ -232787 -200279 -161774 -51348 -408295 -68006 49225 -81463 -179665 -245161 -58700 -216565
19384b16565b1694j64905j40844g8723L7582j31795C7108l674a98336l383H6678
$$ -216565 -21694 -186599 -327443 -78723 -41141 -172936 37108 33434 -198336 -201719 86678
19372B16882h7204C6894a80859j99312O0225f070j10566A04706m3123J61559a06321
$$ 216882 -87204 36894 -180859 -380171 -319946 -6070 -116636 104706 61583 223142 -106321
19360B4117i5965L4188q1893B06692a28473m0066p8121C30872f9455C0995a38098
$$ 24117 -95965 -61777 -143670 206692 -128473 -168539 -246660 330872 -69455 30995 -138098
19348A64545F019g9203q680l883g360l9113l06659A73816a05278c9046l14990
$$ 164545 6019 -79203 -87883 -91766 -7360 -46473 -353132 173816 -105278 -39046 -354036
19337c54036a26671M1448a2041k67302c7095J6287A08594J08717a09172A7843
$$ -354036 -126671 -85223 -12041 -279343 -37095 -20808 108594 217311 -109172 17843
19326a96025B043J77677o9706a12616k13722e0560j9685q3223F9911N5658d5024
$$ -196025 2043 179720 110014 -112616 -326338 -50560 -70245 -153468 69911 125569 -45024
19314c36999d8474F0538b2548n8284j06429G3497b67062g2715l2413A65325a63442
$$ -336999 -48474 60538 -22548 -80832 -187261 73497 -267062 -72715 -105128 165325 -163442
19302h113n01662J25512A9212J21302i6000l0834r0649J00107n2905G3629c82282
$$ -8113 -509775 -384263 19212 140514 -96000 -126834 -217483 -117376 -170281 73629 -382282
19290a08080l27153A54015J41738A8106K20311i3274K1117j04204D975d20407
$$ -108080 -435233 154015 295753 18106 238417 -93274 -72157 -176361 4975 -420407
19279e6088B02267f1640j75879k1884A15024b64355E426b80858h1232C23886a33062
$$ -56088 202267 -61640 -237519 -259403 115024 -264355 5426 -280858 -81232 323886 -133062
19267C0679f6155l4026n6458j04769C3641b8280j01034j21094e9788j52695j3772
$$ 30679 -66155 -100181 -156639 -261408 33641 -28280 -129314 -250408 -59788 -212483 -226255
19256b26255o3067J33989A16903c6811j79008Q6054a2724A42644c09011c6237
$$ -226255 -289322 -155333 116903 -36811 -215819 -129765 -12724 142644 -309011 -36237
19245b2314l95369a21288j34140A3005a49039A94326q044b32304h7279A20380
$$ -22314 -417683 -121288 -255428 13005 -149039 194326 186282 -232304 -87279 120380
19234i3418a3989B5172g7359A06222a11025F1403N3283a25032q8155P4122C16810
$$ -93418 -13989 25172 -77359 106222 -111025 61403 114686 -125032 -213187 -139065 316810
19222a24322k18339a57377r6778a1158k57366A15797a02651F8622N1299d6017
$$ -124322 -342661 -157377 -254155 -11158 -268524 115797 -102651 68622 119921 -46017
19211b64348F7735d1085j24623j0381N8468A86360a14294j4722p069K5289H2752
$$ -264348 67735 -41085 -165708 -176089 -117621 186360 -114294 -129016 -136085 -110796 82752
19199a63090f7652l0184A0984c11838B20374a25248j85786B31425b2786F543b33532
$$ -163090 -67652 -97836 10984 -311838 220374 -125248 -311034 231425 -22786 6543 -233532
19187c8379j13242K2019q4966c6175o8188A9241a61362g0355j1601j49913a07124
$$ -38379 -151621 -129602 -214568 -36175 -104363 19241 -161362 -70355 -81956 -231869 -107124
19175e1884B95362a55923C1176a62579q3394F7007a70179a107r8934k05036a5315
$$ -51884 295362 -155923 31176 -162579 -245973 67007 -170179 -1107 -100041 -305077 -15315
19163B25434b98707A9083i1923L0886j00110j1997A11333a8443j05680j42989
$$ 225434 -298707 19083 -91923 -61037 -161147 -173144 111333 -18443 -124123 -267112
19153b67112J28483A81843D6377a38675M2473j77502F9224j0000a94889g1469
$$ -267112 -138629 181843 46377 -138675 -96202 -273704 69224 59224 -194889 -71469
19142e1526o5228j08915A0719b45012A45896n5028a88227k06975h3477C67186
$$ -51526 -116754 -225669 10719 -245012 145896 90868 -188227 -395202 -83477 367186
19131A55621A680K29499n9509b18632B43176b78560d1004j59k10492a5520m69413
$$ 155621 1680 231179 171670 -218632 243176 -278560 -41004 -41163 -251655 -15520 -484933
19120d84933b24086M9431A49006b93600R2153K3341O5671I1996N7889a07575l41059
$$ -484933 -224086 -174655 149006 -293600 -201447 -178106 -112435 91996 149885 -107575 -448634
19109d48634d2450A52164b92713a19317D0379a63357G1236i5794A27995O8731
$$ -448634 -42450 152164 -292713 -119317 40379 -163357 71236 -95794 127995 196726
19099A96726K2313a83473I7776E065L9991b50228A98549J0336i8440J7475n6477
$$ 196726 219039 -183473 97776 5065 45056 -250228 198549 208885 -98440 -80965 -137442
19088a37442b0242j79313d524j36831k8048M887N1659J318b9058j78899C1796
$$ -137442 -20242 -199555 -4524 -141355 -169403 -164516 -112857 -111539 -29058 -207957 31796
19076a4224m74741a52393B7369a33574q4743i9650a8952j54816B11860e4991A23341
$$ -14224 -488965 -152393 27369 -133574 -218317 -99650 -18952 -173768 211860 -54991 123341
19064i6661o8289b0757j03635O1617j00064b7997M457j10926A89372a27799c2305
$$ -96661 -164950 -20757 -124392 -62775 -162839 -27997 -23540 -134466 189372 -127799 -32305
19052b6212n7124B21487n3339b72890a04415J1647B45923d1885o3134M0751C8651
$$ -26212 -83336 221487 168148 -272890 -104415 -92768 245923 -41885 -105019 -64268 38651
19040C0111a00699G9918b30500A05351Q4808b34819I7703a15005G4490A8594K09946
$$ 30111 -100699 79918 -230500 105351 190159 -234819 97703 -115005 74490 18594 228540
19029B28540e212l0164j51190C7618h525p8789i402q7273L6574m8416I016M5134
$$ 228540 -5212 -35376 -186566 37618 -8525 -87314 -9402 -96675 -60101 -108517 9016 54150
19017E4150J89054m1942a51259C1158a74135j78712C12286E3530i8984I6437g6392
$$ 54150 243204 201262 -151259 31158 -174135 -352847 312286 53530 -98984 96437 -76392
19005F6648A1572c7231B37096b23390A76372J33139E7915k5018i1040j31052H9864
$$ 66648 11572 -37231 237096 -223390 176372 309511 57915 32897 -91040 -222092 89864
18993E9607c9670j23048b7509l5504C39582b44196j102a07679A4276J56325l2445
$$ 59607 -39670 -162718 -27509 -63013 339582 -244196 -245298 -107679 14276 170601 138156
18982A38156K7390f9927A66594j7279P277b94418Q8835R1280K0113L6478r9276
$$ 138156 165546 -69927 166594 149315 156592 -294418 -205583 -114303 -94190 -57712 -156988
18971a56988g5266k28429O2607j04170K2456A99071a5921n407l0835J9806j90902
$$ -156988 -75266 -303695 -241088 -345258 -322802 199071 -15921 -21328 -52163 -32357 -223259
18960b23259B4476R4101J38505J78394r5508j45643M6566J5983h9626j80027c3981
$$ -223259 24476 118577 257082 435476 339968 194325 240891 256874 -89626 -269653 -33981
18948B15195b82515F9449g0150J5073k32568B777J3970J7495a53132B54810H9295
$$ 215195 -282515 69449 -70150 -55077 -287645 2777 16747 34242 -153132 254810 89295
18936a92488E5692c09904I198g8680j40479A97981i942A22424e0126l24459J74903
$$ -192488 55692 -309904 9198 -78680 -219159 197981 -9942 122424 -50126 -374585 -199682
18925a99682c9637A17566a60339p4969Q8422J5317A73539q337b81164A20724J29232
$$ -199682 -39637 117566 -160339 -235308 -146886 -131569 173539 165202 -281164 120724 249956
18914B49956A00156b35922E5167M1092d5738j39191E1162O9551r878f5925Fe3440
$$ 249956 100156 -235922 55167 96259 -45738 -184929 51162 120713 110835 -65925 6 -53440
18901h235C86484d7057C0601q588R6932l2517L01149l4655k0086F5780I109c4573
$$ -8235 386484 -47057 30601 22013 118945 86428 387577 352922 332836 65780 9109 -34573
18888a04382m4263m3918j85680E0590g1781j49125R9481J7907F2033N0215a33129
$$ -104382 -148645 -192563 -378243 50590 -71781 -220906 -121425 -103518 62033 112248 -133129
18876d9124k20726J0115J06582A61255c55688B87582b21394e3084o4011e4358
$$ -49124 -269850 -259735 -153153 161255 -355688 287582 -221394 -53084 -117095 -54358
18865b04081P474G4669Q9209d2453A44521g9886j63844A92082c80155a01868k8202
$$ -204081 -196607 74669 163878 -42453 144521 -79886 -243730 192082 -380155 -101868 -130070
18854a30070n4127L2779E4892c1013D0411J22303d8167k04835I6743l6235b3199
$$ -130070 -184197 -151418 54892 -31013 40411 162714 -48167 -253002 96743 60508 -23199
18842A03999b97202A5697K05220R7391H541J97179B3608d15639i1863K6602K9506
$$ 103999 -297202 15697 220917 318308 8541 205720 23608 -415639 -91863 -65261 -35755
18831c5755j89187O8931e9019A94955D8318m497N5123a68869B9984b58024a09135
$$ -35755 -224942 -156011 -59019 194955 48318 43821 98944 -168869 29984 -258024 -109135
18819A6957b25313C58859A38374e28047K08300i7559D9543g4871q5091A72831
$$ 16957 -225313 358859 138374 -528047 -319747 -97559 49543 -74871 -159962 172831
18808a33689J8853n2436e7480A87142C5316J13904D8402a59911A59358a42686
$$ -133689 -114836 -167272 -57480 187142 35316 149220 48402 -159911 159358 -142686
18797f0872b836D5844J09279J78593j29420d0165j12742G0522a16963C2804j3088
$$ -60872 -2836 45844 155123 333716 204296 -40165 -152907 70522 -116963 32804 19716
18786A9716f6586l54314B82125A31092b87360A31023a29425d1405p2831E1497
$$ 19716 -66586 -420900 282125 131092 -287360 131023 -129425 -41405 -114236 51497
18775a78219J7018N5861B69008b59611B61512c02510A08673i789j11160p5661
$$ -178219 -161201 -105340 269008 -259611 261512 -302510 108673 -9789 -120949 -196610
18765a96610A47049A2900K4583h8431c7211A86036a06032j8789p8129L8745B63333
$$ -196610 147049 12900 37483 -88431 -37211 186036 -106032 -124821 -202950 -164205 263333
18753c2302J1321l36123J28430k4960Q6756g5648J1004m4304j47594k5686F9645
$$ -32302 -20981 -357104 -228674 -253634 -166878 -75648 -64644 -108948 -256542 -282228 69645
18741H0357h9502j18153n5780l47818B76851J39274e061j47361d3023r7484j22652
$$ 80357 -89502 -207655 -263435 -611253 276851 416125 -5061 -152422 -43023 -140507 -263159
18730b63159j035B6278L13792a03891r7863B07298h3167k41663C443d641k16543
$$ -263159 -264194 26278 340070 -103891 -201754 207298 -83167 -324830 3443 -4641 -221184
18719b21184i6692C2159O0452b3258j83853C64139a10574d1870n0687I0324I941
$$ -221184 -96692 32159 92611 -23258 -207111 364139 -110574 -41870 -92557 90324 9941
18707b77422J14796A7262K64155b58060B75797e2858K2291j01029B79684A34385
$$ -277422 -162626 17262 281417 -258060 275797 -52858 -30567 -131596 279684 134385
18696a6090B9037e4524k93505P4996I5823a10846M344B00706c9292k3887j98019
$$ -16090 29037 -54524 -348029 -273033 95823 -110846 -106502 200706 -39292 -63179 -261198
18685b61198k2333C00690g0139F0200a74417h5560j24631Q2352q1441l111K2545
$$ -261198 -283531 300690 -70139 60200 -174417 -85560 -210191 -127839 -209280 -212391 -189846
18674a89846B21493I4539k8773H434K39852q1712b35245F5073b615j8451j51569
$$ -189846 221493 94539 65766 8434 248286 166574 -235245 65073 -2615 -21066 -172635
18663a72635j77238K5072D3224N4638a62686O4247A63909G6847a81216O7151j9593
$$ -172635 -349873 -324801 43224 97862 -162686 -98439 163909 76847 -181216 -114065 -133658
18652a33658B06528A5355J110K88579a33365I4023N0826n6732a88184b6401l19697
$$ -133658 206528 15355 16465 305044 -133365 94023 144849 88117 -188184 -26401 -346098
18641c46098c7692B82256i8942r993E2524h3459k25192d5234k6510N205i404A19945
$$ -346098 -37692 282256 -98942 -108935 52524 -83459 -308651 -45234 -71744 -66539 -9404 119945
18628D07771j85686D9087K23884d9362A3835c61036c331q0492F6509A1388a57270
$$ 407771 222085 49087 272971 -49362 13835 -361036 -3331 -83823 66509 11388 -157270
18616a25187F554a44483G683M9765b85596F1333f8521n201E9408a53072C5187
$$ -125187 6554 -144483 7683 57448 -285596 61333 -68521 -73722 59408 -153072 35187
18604D1917c36396J62430A0688a04549a0173A5769J31992b48608A22227g9280
$$ 41917 -336396 -173966 10688 -104549 -10173 15769 147761 -248608 122227 -79280
18593G2629a65561q6318d3730p866O879j02587c0215j95219A72110a09084j3774
$$ 72629 -165561 -251879 -43730 -51596 -44717 -147304 -30215 -225434 172110 -109084 -122858
18582a22858j85483a24120l10294A00409a40440p4991g8739j56738J2232J9255
$$ -122858 -308341 -124120 -434414 100409 -140440 -215431 -78739 -235477 -223245 -203990
18572b03990L2889o9360A97657a4727E8389O7812d763l3196J8626A952h6669j97085
$$ -203990 -171101 -240461 197657 -14727 58389 126201 -4763 -37959 -19333 1952 -86669 -283754
18560b83754J29372j87956J49087g7173j21104h0270A96133p649a33893K2911
$$ -283754 -154382 -342338 -193251 -77173 -198277 -80270 196133 188484 -133893 -110982
18550a10982k09281d3812A42891b04633C00678E2796m591g2239C22926a54090
$$ -110982 -320263 -43812 142891 -204633 300678 52796 48205 -72239 322926 -154090
18539A63722p8605a89587E4500i3163m2896c5567B5810K8360a56691L0068a8728
$$ 163722 85117 -189587 54500 -93163 -136059 -35567 25810 54170 -156691 -126623 -18728
18527E0115A7767a48893q0381f2766A09033K18080A55120a73048l5525R7900k88960
$$ 50115 17767 -148893 -229274 -62766 109033 327113 155120 -173048 -208573 -110673 -399633
18516c99633C9341a42130k1824A48723c09585G4292a11183A23756a2971F4809
$$ -399633 39341 -142130 -163954 148723 -309585 74292 -111183 123756 -12971 64809
18505I6761c71842q2938a94614O4709N9754m3216M7709m6722a7034j01170j49888
$$ 96761 -371842 -454780 -194614 -129905 -70151 -113367 -65658 -112380 -17034 -118204 -268092
18494b68092b7150j28914l38654H0175a88749B02775b7824n1640A6356Q2929a80714
$$ -268092 -27150 -156064 -494718 80175 -188749 202775 -27824 -79464 16356 99285 -180714
18482E5791b30598Q5334N5619q174a9147G1276L6004J6419b16132D13634f9782
$$ 55791 -230598 -145264 -89645 -97819 -19147 71276 107280 123699 -216132 413634 -69782
18470b3939I6394A65c0305r1822p0484A42624b2521A27029e3043A15829o196B3008
$$ -23939 96394 165 -30305 -122127 -192611 142624 -22521 127029 -53043 115829 109633 23008
18457C232a09293A50121f0585l9775j13109j08375B12572b00636I1897a75251
$$ 3232 -109293 150121 -60585 -100360 -213469 -321844 212572 -200636 91897 -175251
18446b52985A69627J00331A09613n1064i9509M790k16863C43476b29959e7595
$$ -252985 169627 269958 109613 58549 -99509 -94719 -311582 343476 -229959 -57595
18435B4254J94148g2195e357k253q0131B7884a15053p0977a8222A92756h0268
$$ 24254 218402 -72195 -5357 -7610 -87741 27884 -115053 -186030 -18222 192756 -80268
18423B20387d22580f8253l03423C52428b61187E4160a833A00889f5904B91484
$$ 220387 -422580 -68253 -371676 352428 -261187 54160 -1833 100889 -65904 291484
18412a46575M015j42467C01820c04929o9101i471j96986g9337D1776N0164c26297
$$ -146575 -142560 -285027 301820 -304929 -374030 -9471 -206457 -79337 41776 91940 -326297
18400B03575G6559f7992q5455c1947k25727n9926G9066d0799k70414d6793j93707
$$ 203575 76559 -67992 -153447 -31947 -257674 -317600 79066 -40799 -311213 -46793 -240500
18389b40500A04533a22735B61903j00149a91368C39976c96110J51842P4727q388
$$ -240500 104533 -122735 261903 161754 -191368 339976 -396110 -244268 -169541 -177929
18379a77929O6753B27248E2480a36528c9004q4442F3367c67464B59193A26184
$$ -177929 -111176 227248 52480 -136528 -39004 -123446 63367 -367464 259193 126184
18368A82691g8625J6558L0598q9615l0780E3649J31714n9568C4040K69631d3382
$$ 182691 -78625 -62067 -31469 -121084 -151864 53649 185363 125795 34040 303671 -43382
18356A72913J01801b841j56977L2558B81094a96824J9090A30195d528B58108d639
$$ 172913 274714 -2841 -159818 -127260 281094 -196824 -177734 130195 -4528 258108 -4639
18344G4767g1306H0902J33826a02668k26471E5672a60493M6265A53085a01233
$$ 74767 -71306 80902 214728 -102668 -329139 55672 -160493 -114228 153085 -101233
18333A410e6920B38046G1744c32509g4235l9883m3565A2817h5186a9508j5656
$$ 1410 -56920 238046 71744 -332509 -74235 -114118 -157683 12817 -85186 -19508 -35164
18322c5164E7321b11804a8652k3649l46289a85340C12314h1569A6352K07822d125
$$ -35164 57321 -211804 -18652 -42301 -388590 -185340 312314 -81569 16352 224174 -4125
18310a0654j06679j49912J29459B54448a43766I0481K09461d8636j42732M4080
$$ -10654 -117333 -267245 -137786 254448 -143766 90481 299942 -48636 -191368 -147288
18300a47288B73064b86769G1462J18184f2769D2135K02505e51354A40622o0587
$$ -147288 273064 -286769 71462 189646 -62769 42135 244640 -551354 140622 80035
18290H0035J4199a933j15244e4545B5845a03208a0169l3930q505k26515A20535
$$ 80035 94234 -1933 -117177 -54545 25845 -103208 -10169 -44099 -52604 -279119 120535
18278b16796O2333J4484k56525a15927n2351j14235k22599a97645A4489D53a07926
$$ -216796 -154463 -139979 -396504 -115927 -168278 -282513 -505112 -197645 14489 453 -107926
18266I7562b69891A71746E0293g7585a380F376a1072m035B05828a01042A0025
$$ 97562 -269891 171746 50293 -77585 -1380 6376 -11072 -15107 205828 -101042 10025
18254G4941h3959p0572O6856l6882A35913L6437A8497a53084H8662J74071c04766
$$ 74941 -83959 -154531 -87675 -124557 135913 172350 18497 -153084 88662 262733 -304766
18242A86068d32179c2044l9959j18742e0368C5569b02023A15334R645l1059a51692
$$ 186068 -432179 -32044 -72003 -190745 -50368 35569 -202023 115334 124979 93920 -151692
18230H1554A6346J79428b8130A4012f0871B05335b7191j87933M3810C22519j46666
$$ 81554 16346 195774 -28130 14012 -60871 205335 -27191 -215124 -171314 322519 175853
18219A75853B8159m797J62919b63211i4916m4514A66115b40634B94094a88442
$$ 175853 28159 23362 186281 -263211 -94916 -139430 166115 -240634 294094 -188442
18208d4562B45203j08418c0899k96062E9179c61832a03659k29018a27352B0354
$$ -44562 245203 136785 -30899 -326961 59179 -361832 -103659 -332677 -127352 20354
18197i0031B04851b3821C54070B9963a1759j5695a1753n6337A92308a20647l3355
$$ -90031 204851 -23821 354070 29963 -11759 -27454 -11753 -68090 192308 -120647 -154002
18186a54002j64401h9236j30358j3613E8658J69652b4872j80564D7606c13597
$$ -154002 -318403 -89236 -219594 -233207 58658 228310 -24872 -205436 47606 -313597
18175A01858b05320A48927a26076l3027K4266j71245A95654B7520L42826C3051
$$ 101858 -205320 148927 -126076 -159103 -134837 -306082 195654 27520 370346 33051
18164D2639a96589b7743A2048M9515b9049j33580H0190h7914b910C05414j28158
$$ 42639 -196589 -27743 12048 61563 -29049 -162629 80190 -87914 -2910 305414 177256
18153A77256m6320b13598B40470A01176D6949J42932d28140A7186O12Q934L53093
$$ 177256 130936 -213598 240470 101176 46949 189881 -428140 17186 17798 26732 379825
18142C79825g5308j88599G8327a72709D3981J71001C5202J1337J34978p9027O9047
$$ 379825 -75308 -263907 78327 -172709 43981 214982 35202 46539 181517 102490 171537
18131A71537f4680E2775a56494m8490m05383A38035b12260B66184g940j47573
$$ 171537 -64680 52775 -156494 -204984 -610367 138035 -212260 266184 -7940 -155513
18121a55513m1360c8618H7317J19390J27034a67274A94482m2969D7013c6826q9487
$$ -155513 -196873 -38618 87317 206707 333741 -167274 194482 151513 47013 -36826 -126313
18110a26313j52921J22441I6181C0209a29904A07876a81994a3322j02788k32411
$$ -126313 -279234 -156793 96181 30209 -129904 107876 -181994 -13322 -116110 -348521
18100c48521a49581k11530h1286n3570B7637K87344e9784j37842A23544a6729
$$ -348521 -149581 -361111 -81286 -134856 27637 314981 -59784 -197626 123544 -16729
18089a10312B36398b0482C094d39016C24746j13365c8795I2627b4044E949b4283
$$ -110312 236398 -20482 3094 -439016 324746 211381 -38795 92627 -24044 5949 -24283
18077A84704a64263A8767F288a58767I5955c1476G1444a45453N5902A91370b78351
$$ 184704 -164263 18767 6288 -158767 95955 -31476 71444 -145453 -89551 191370 -278351
18065b96280d8206I3337k1937b66547f3169n875j47267B26851h7655M2706k18564
$$ -296280 -48206 93337 71400 -266547 -63169 -69044 -216311 226851 -87655 -44949 -263513
18054b63513K8091A03646a65199B50357b85236b3862l06773m5994B1445j237a04250
$$ -263513 -235422 103646 -165199 250357 -285236 -23862 -330635 -376629 21445 20208 -104250
18042E6183a04752p7828g4059j11033e1157A51458k7460a16479d9939k96833A77846
$$ 56183 -104752 -182580 -74059 -185092 -51157 151458 123998 -116479 -49939 -346772 177846
18030C3628L4484K97667A7473O1738J10140K36986b52243A17642d76559F7052
$$ 33628 68112 365779 17473 79211 189351 426337 -252243 117642 -476559 67052
18019c9786H3611i8422p9720b1166j0330j04395n8442C2196b33787H0129a33110
$$ -39786 83611 -98422 -178142 -21166 -31496 -135891 -194333 32196 -233787 80129 -133110
18007a74082C1614L6953a38874l1396Q4201B02586b5838k27254d6337k63703J24145
$$ -174082 31614 68567 -138874 -170270 -86069 202586 -25838 -253092 -46337 -310040 -185895
17996a85895N886E43903B4764K41392b06035d8642p0794A10972c30630d8958A0820
$$ -185895 -180009 543903 24764 266156 -206035 -48642 -119436 110972 -330630 -48958 10820
17984C6372b03496A48758b59462B6091L8652g2891A99766I2127e0305A88937l663
$$ 36372 -203496 148758 -259462 26091 64743 -72891 199766 92127 -50305 188937 185274
17973A85274K05749b888j05450p1595A22861a27104J9718A8635O7220J80022b06336
$$ 185274 391023 -2888 -108338 -179933 122861 -127104 -107386 18635 85855 265877 -206336
17961a00499k02944a29713j48669E8513c4296B80512a71202b0576B12103F9284
$$ -100499 -303443 -129713 -278382 58513 -34296 280512 -171202 -20576 212103 69284
17950H8651a02776a5801A39282P7156a79724G4171K18682a95114q2754M06A4931
$$ 88651 -102776 -15801 139282 216438 -179724 74171 292853 -195114 -277868 -277462 14931
17938i890k26411R8511B8676K09472G794e1319B45063B2882P4327C2100d1713
$$ -9890 -236301 -137790 28676 238148 7794 -51319 245063 22882 97209 32100 -41713
17926C1191L38175J29762j32439d6333l3772A04371F155K77330J1303a4730A36685
$$ 31191 369366 499128 366689 -46333 -80105 104371 6155 283485 294788 -14730 136685
17914c6160l49253a21640K7402L1009k33582B2995c3587j59285C7869J55058a72055
$$ -36160 -385413 -121640 -94238 -63229 -296811 22995 -33587 -192872 37869 192927 -172055
17902a48880a9778A27840a37546B89754f763j14808E6720b03117A44752c2269
$$ -148880 -19778 127840 -137546 289754 -6763 -121571 56720 -203117 144752 -32269
17891a8298k66705a13715A64881a21627a8170C95689b86323h7035A02032a4188
$$ -18298 -285003 -113715 164881 -121627 -18170 395689 -286323 -87035 102032 -14188
17880A59316b54314E772c7864D21264A25413N3793n9903c14405B25090m2135B1122
$$ 159316 -254314 5772 -37864 421264 125413 179206 119303 -314405 225090 182955 21122
17868A69743d8768A37381C1191N4618C8276e0051C6309d6483r8871J5648A22959
$$ 169743 -48768 137381 31191 85809 38276 -50051 36309 -46483 -145354 -129706 122959
17856A29261c79080I6903M1203b10118o851h8180H3871I998J37635k4975k3785
$$ 129261 -379080 96903 138106 -210118 -216969 -88180 83871 9998 147633 122658 98873
17845I8873j1591d6683o1965C8448J39107J42387a72511A54919O7854f6412A6112
$$ 98873 87282 -46683 -108648 38448 177555 319942 -172511 154919 222773 -66412 16112
17833d9094B10197A641N5551L68738j94731b8546I5826J56699c0241A92883b48983
$$ -49094 210197 1641 57192 425930 231199 -28546 95826 252525 -30241 192883 -248983
17821a55661H6856b7178D17817j74531B2496L2743J28251o1040n3617a30075F7993
$$ -155661 86856 -27178 417817 243286 22496 55239 183490 122450 68833 -130075 67993
17809B9110K23755K5315b31975N60d6699E8421a49139C65701A11536a69389j5719
$$ 29110 252865 278180 -231975 -231415 -46699 58421 -149139 365701 111536 -169389 -185108
17798a85108b478o9025A04414l7117k4977d8026A29475J15024i9522E1844J94859
$$ -185108 -2478 -71503 104414 67297 42320 -48026 129475 244499 -99522 51844 246703
17787B46703m1172D5164e7051J8865q2331B07361I0949d1480E6899J69593c66828
$$ 246703 205531 45164 -57051 -38186 -120517 207361 90949 -41480 56899 226492 -366828
17775A99252h4523n6554A60201a32770A34193J823m7676a4607E7710K26170A10138
$$ 199252 -84523 -141077 160201 -132770 134193 136016 88340 -14607 57710 283880 110138
17763a5052D17176a18893k38028b5438E0487P5078b01850R6112C0213Q781b68734
$$ -15052 417176 -118893 -356921 -25438 50487 125565 -201850 -105738 30213 38994 -268734
17751b09344A61127P7686J33247c08839C781P58Q0624K22052a2684A59394b79498
$$ -209344 161127 238813 372060 -308839 3781 4539 85163 307215 -12684 159394 -279498
17739C9504a46301N884A23943m496K5343E3824a51212j7038b197A1016K23759
$$ 39504 -146301 -140417 123943 119447 144790 53824 -151212 -168250 -2197 11016 234775
17728B34775D2874K20045j04482a61417O2861A51994d8193j52782P9339A24081
$$ 234775 42874 262919 158437 -161417 -98556 151994 -48193 -200975 -121636 124081
17717B21898l273G5835K21123a88346B91462k0433a4735o5791C1362g9264b6287
$$ 221898 218625 75835 296958 -188346 291462 271029 -14735 -80526 31362 -79264 -26287
17705C65537c38767B23119N3388r7898J20610A6340a85700b6599f242A25825J1854
$$ 365537 -338767 223119 276507 178609 299219 16340 -185700 -26599 -6242 125825 137679
17694A37679F6076d510F4577a45048E8243J44857R0725j37821k7925A387a52036
$$ 137679 66076 -4510 64577 -145048 58243 203100 293825 156004 128079 1387 -152036
17682A69163D6929j7096K27124g9930k04567R5097L0151G3132R2578F2973b8310
$$ 169163 46929 29833 256957 -79930 -284497 -189400 -159249 73132 165710 62973 -28310
17670A30666j0717J04213C4802l335K13835P3738I1722C7537Q2353P7776h8804
$$ 130666 119949 224162 34802 31467 245302 319040 91722 37537 119890 197666 -88804
17658A24376a74136e1349I7476J62038n5433m6984r769D0010J63775F1841L32741
$$ 124376 -174136 -51349 97476 259514 204081 157097 147328 40010 203785 61841 394582
17647C94582A25038C2707J45225H4477Q449O2380o4469J46243c34546E6080P0969
$$ 394582 125038 32707 177932 84477 92926 155306 90837 237080 -334546 56080 127049
17636A27049J08777f0499H5121l3678J98766a56249B82572j38456b64270B54964
$$ 127049 235826 -60499 85121 51443 250209 -156249 282572 144116 -264270 254964
17625A46322C2769b27427B09051J09186F1289K71807I9275J18088r6419M6374
$$ 146322 32769 -227427 209051 318237 61289 333096 99275 217363 120944 167318
17615A67318E4984L5627c104A96428E7545a15575C4355L9175J79853K7966A32565
$$ 167318 54984 90611 -3104 196428 57545 -115575 34355 73530 253383 281349 132565
17603A53675K88488B0360h0809C52671A45158F4127a68732A66954E4819K16941
$$ 153675 442163 20360 -80809 352671 145158 64127 -168732 166954 54819 271760
17593B71760H2648K22301A6216R8821e64947I3351J84895I6291M6619J00269q1126
$$ 271760 82648 304949 16216 115037 -564947 93351 278246 96291 142910 243179 162053
17582A62053m7014J4713E5150j2061J06342M2176L1463f6849b8804B92347m8924
$$ 162053 115039 129752 55150 43089 149431 191607 223070 -66849 -28804 292347 243423
17571B43423G3771k4819K74837j14724a57387B76007B477b01545e4748A78850
$$ 243423 73771 48952 323789 209065 -157387 276007 2477 -201545 -54748 178850
17560A86959J2702b5576e118B75349l3118r0049n9382K98195J73382h1083A43383
$$ 186959 199661 -25576 -5118 275349 242231 152182 92800 390995 564377 -81083 143383
17548A79864j7956c5653C37275p8793L1412J16664r9656j05230a67917B34386
$$ 179864 161908 -35653 337275 258482 289894 406558 306902 201672 -167917 234386
17537C23318A45704A4318K61888r3520J67232f9220A30203O0403L4976j6318l6123
$$ 323318 145704 14318 276206 182686 349918 -69220 130203 190606 225582 209264 173141
17526A73141R6745F4735L23534q829j40275A3416K45793J3744J54995J03864G8039
$$ 173141 269886 64735 388269 379440 239165 13416 259209 272953 427948 531812 78039
17514D65000q5543L45967j39272J77227K21664J95278k12977o6389j23115j9011
$$ 465000 379457 725424 586152 763379 985043 1180321 967344 900955 777840 758829
17504G58829B61378L29932j58264j2581J60757j56502M9634K51139N5120L27351
$$ 758829 261378 591310 433046 420465 581222 424720 474354 725493 780613 1107964
17494A107964j96868J91127m15407l9288k38649A90149L16311k23334L38331j32830
$$ 1107964 911096 1102223 686816 647528 408879 190149 506460 283126 621457 488627
17484D88627B34956J87365J1262r9125L691j29801j2321R983P9498J25332I7186
$$ 488627 234956 422321 433583 334458 338149 208348 196027 206010 285508 410840 97186
17472A93068a26843A90394J8931o2134K08440j30503r5937J07542L22933k23360
$$ 193068 -126843 190394 209325 147191 355631 225128 129191 236733 559666 336306
17462C36306r4189E7150L41316j77201d0750E44173k65169d383C94962O1376j83265
$$ 336306 242117 57150 398466 221265 -40750 544173 279004 -4383 394962 456338 273073
17451B73073k2854K16334k12418K9835A04068K8963J67219j4314I0088M9946D3466
$$ 273073 250219 466553 254135 283970 104068 133031 300250 285936 90088 140034 43466
17439C47851j72091K44750A95137k7958K6756O1110J70672k401r5894j42238K66196
$$ 347851 175760 420510 195137 167179 193935 255045 425717 423316 327422 185184 451380
17428D51380J23835j61735A96074P4205I2231J08523o979J83506k7819m613P7545
$$ 451380 575215 413480 196074 270279 92231 200754 193775 377281 349462 344849 422394
17417D22394A71136k2787L23653j14188k514A28497K25291j07262r3443F6024
$$ 422394 171136 148349 472002 357814 355300 128497 353788 246526 153083 66024
17406B13502K2694J04668A49786J83944J27959F0113Q7661E4267J51048K04043
$$ 213502 236196 340864 149786 333730 461689 60113 147774 54267 205315 409358
17396D09358j81077p0378k9984N2443A710K28143d8613a5800B81973G6628a3689
$$ 409358 228281 157903 127919 180362 1710 229853 -48613 -15800 281973 76628 -13689
17384H9738K66601q7564q233J80476A35845J47585B5358L23398A36557J44741
$$ 89738 356339 268775 260542 441018 135845 283430 25358 348756 136557 281298
17374B81298P3796j165j11466K06341B8541J33555j8616K75280j00472L9152O4901
$$ 281298 355094 353929 242463 448804 28541 162096 143480 418760 318288 357440 422341
17363D22341A43402M46317k82161j23965O2205C2602M95314F6230L43929N6389
$$ 422341 143402 589719 307558 183593 245798 32602 527916 66230 410159 466548
17353D66548A83527K7449K36173E6125K52222D4697L25765J19977A047M36180
$$ 466548 183527 210976 447149 56125 308347 44697 370462 490439 1047 437227
17343D37227p3548n6073j37523J91948A6519M05839E1973j3473M29708e0690A93803
$$ 437227 363679 307606 170083 362031 16519 422358 51973 38500 468208 -50690 193803
17331C31111a10529B16436K34042j08132J911G3895B9266J30744b2520D91896
$$ 331111 -110529 216436 450478 342346 344257 73895 29266 160010 -22520 491896
17320B00168K88756j13927q6100I9302g0541C54708j16860M0314J35391A4526
$$ 200168 488924 374997 288897 99302 -70541 354708 237848 278162 413553 14526
17309B68809p1218A5908J63069O1596M39609a07138E36934R9248B85909Q0324
$$ 268809 197591 15908 178977 240573 680182 -107138 536934 636182 285909 366233
17299C66233J44199A04796M52480D6569K55270K1503r9914D0432Q3703J55928
$$ 366233 510432 104796 557276 46569 301839 323342 223428 40432 124135 280063
17289B80063J05014A73736c32129B61282L28781D3058L09558n6092A15482M23490
$$ 280063 385077 173736 -332129 261282 590063 43058 352616 296524 115482 538972
17279E38972A65415L01418b1587E44283d6353A40288L10764J47372H6109b0554
$$ 538972 165415 466833 -21587 544283 -46353 140288 451052 598424 86109 -20554
17268A59282J23981K72268j32772j19091P2781q0964J4975M3618J62610b7183
$$ 159282 283263 555531 422759 303668 376449 295485 310460 354078 516688 -27183
17257C93711N9305J97834k64470h2618B66233n143I6092L28300j63416j1945K98799
$$ 393711 453016 650850 386380 -82618 266233 261090 96092 424392 260976 249031 547830
17246E47830B52545a3532B05833p6772M7524K58292A71107J65844n7089J39384
$$ 547830 252545 -13532 205833 129061 176585 434877 171107 336951 279862 419246
17236D19246Q4446k27455j32278K21570K09294o6836j09173A73145L04536N8727
$$ 419246 503692 276237 143959 365529 574823 507987 398814 173145 477681 536408
17226E36408j14100j25055J1267K12361G9695M27135j22476n6062j33840L27252
$$ 536408 422308 297253 308520 520881 79695 506830 384354 328292 194452 521704
17216E21704P1492n7674L40k52080O3914j1344n4397M27536l27135m2319J05906
$$ 521704 593196 535522 535862 283782 347696 336352 281955 709491 382356 340037 445943
17205D45943j31504O3888A76819K02985Q6577J397A2648K95190J98286B40840
$$ 445943 314439 378327 176819 379804 466381 467778 12648 307838 506124 240840
17194B48589L63077k65285J96363N6717k35030J02650K06485k19697p4736P3952
$$ 248589 611666 346381 542744 599461 364431 467081 673566 453869 379133 453085
17184D53085j147J68402j50467j30328J5305K65565E2472M60140p831J24875j42365
$$ 453085 451938 620340 469873 339545 354850 620415 52472 512612 504781 629656 487291
17173D87291k27101M10146p5884j23668A89199K15516K71162B26898R3676P7048
$$ 487291 260190 670336 594452 470784 189199 404715 675877 226898 320574 397622
17163C97622P3754j81935N0779L49968l21411P0773j45878k6625r7421L55175
$$ 397622 471376 289441 340220 690188 368777 439550 293672 267047 169626 524801
17153E24801P1927m9495l7270K72145k94041J5728m7524J00688j15772p7771L08796
$$ 524801 596728 547233 509963 782108 488067 503795 456271 556959 441187 363416 672212
17142F72212k78652j30923L81572j93339m4027J25004l5919K80160p7253l25986
$$ 672212 393560 262637 644209 450870 406843 531847 495928 776088 698835 372849
17132C72849j6020L35829A73531N34848k07061j34888P5357m0729J59283L34417
$$ 372849 356829 692658 173531 708379 501318 366430 441787 401058 560341 894758
17122H94758l31362q2173Q6081J22872P5819A61713N19801r2909j57564k15194
$$ 894758 563396 481223 567304 690176 765995 161713 681514 588605 431041 215847
17112B15847L51750j43818m5723K06276j07365B22169M54993j40168k43663M2393
$$ 215847 567597 423779 378056 584332 476967 222169 677162 536994 293331 335724
17102C35724L43849J28455k00947j09954q8908q3942J41551A04718M77413K36368
$$ 335724 679573 808028 607081 497127 408219 324277 465828 104718 582131 818499
17092H18499k82670J19020K4658R4444L036j26328J53067Q5803l73012L45868
$$ 818499 535829 654849 679507 773951 776987 650659 803726 889529 516517 862385
17082H62385l12760K66647A93346N47498j09521M2461k91534J03879K0608J61438
$$ 862385 549625 816272 193346 740844 631323 673784 382250 486129 506737 668175
17072F68175r2367j74683M60607l82342k09703O33764l54151L15709k38003K55260
$$ 668175 575808 401125 861732 479390 269687 903451 549300 865009 627006 882266
17062H82266k66689P696K63637l6522J95944j70633k72242K49008L3539p8475
$$ 882266 615577 623273 886910 850388 1046332 875699 603457 852465 886004 807529
17052H07529j17191k0332K5276J53504q4926L31792j20951o0909k00583j28418
$$ 807529 690338 670006 695282 848786 763860 1095652 974701 913792 713209 584791
17042E84791J48296J40029l5932j9013o5521p126J50425j26805j860J07555J94027
$$ 584791 733087 873116 837184 818171 752650 745524 895949 769144 767284 874839 1068866
17031A068866l64572K64410J51187l14316J01213j37076P8711P5028j27651J93260
$$ 1068866 704294 968704 1119891 805575 906788 769712 848423 923451 795800 989060
17021I89060j66595L97917j0617l01279j07628K24071o0938P7480r8874M09948
$$ 989060 822465 1220382 1209765 908486 800858 1024929 963991 1041471 942597 1352545
17011A352545m44266j45617J78381j3464K10429k0743m8015Q7431m01680K14134
$$ 1352545 908279 762662 941043 927579 1138008 1117265 1069250 1156681 755001 969135
17001I69135K03740l63879K94220k37533M04517k64139J17963j06629j44277K17835
$$ 969135 1172875 808996 1103216 865683 1270200 1006061 1124024 1017395 873118 1090953
16991A090953l7362J68215j12120o533r6747O6767M3944o1917P0805j6297j04625
$$ 1090953 1053591 1221806 1109686 1103153 1006406 1073173 1117117 1055200 1126005 1109708 1005083
16980A005083n5572P2078J64353J3649j61529n5293L26708j14854j32460M52314
$$ 1005083 949511 1021589 1185942 1199591 1038062 982769 1309477 1194623 1062163 1514477
16970A514477o5825k15928j35148L76261j3134l0577k08128K73236j17116M0555
$$ 1514477 1448652 1232724 1097576 1473837 1460703 1430126 1221998 1495234 1378118 1418673
16960A418673K83983j15863l4364k45206o7470O7673N1426K1539J12339K5708
$$ 1418673 1702656 1586793 1552429 1307223 1239753 1307426 1358852 1380391 1492730 1518438
16950A518438p6368r805k41829J07001M34986m96361L45381k32217K19216j3508
$$ 1518438 1442070 1432265 1190436 1297437 1732423 1236062 1581443 1349226 1568442 1554934
16940A554934j07815R4373R3606J15192J8582N1291j6495m52655M53371l6176
$$ 1554934 1447119 1541492 1635098 1750290 1768872 1820163 1803668 1351013 1804384 1768208
16930A768208J14129l10624K1863N56729j70556j41030k56167K46990o6235L97164
$$ 1768208 1882337 1571713 1593576 2150305 1979749 1838719 1582552 1829542 1763307 2160471
16920B160471l50197J86884l2650J06788J50606L2938l87735L08926k81367J21448
$$ 2160471 1810274 1997158 1964508 2071296 2221902 2254840 1867105 2176031 1894664 2016112
16910B016112O6111k61142O50887k50487P1085J40877j04920j04419J68100o1748
$$ 2016112 2082223 1821081 2471968 2221481 2292566 2433443 2328523 2224104 2392204 2330456
16900B330456L5440k61023L23849J11309k21267Q8083J30558k55016K18557q9242
$$ 2330456 2365896 2104873 2428722 2540031 2318764 2406847 2537405 2282389 2500946 2411704
16890B411704N55947j07294k47996K08768n7302J27815m32308M78591j81585K05461
$$ 2411704 2967651 2860357 2612361 2821129 2763827 2891642 2459334 2937925 2756340 2961801
16880B961801J06420k68393K49959k8311j8562M8474N1983j26933K74254P9548
$$ 2961801 3068221 2799828 3049787 3021476 3002914 3051388 3103371 2976438 3250692 3330240
16870C330240J778P0016J32311K6850l79780J34218N3605o9365M62583j06964
$$ 3330240 3332018 3402034 3534345 3561195 3181415 3315633 3369238 3299873 3762456 3655492
16860C655492j09560M92791j69107j65295K64053j62382N34626k85979L42401
$$ 3655492 3545932 4038723 3869616 3704321 3968374 3805992 4340618 4054639 4397040
16851D397040n97394N76029r8582J61018n5937J18819K01L09287m15901L07358
$$ 4397040 3799646 4375675 4277093 4438111 4382174 4500993 4501194 4810481 4394580 4701938
16841D701938m85841M15592M56759J99953l79865K24193j43007L41147j00477
$$ 4701938 4216097 4631689 5088448 5288401 4908536 5132729 4989722 5330869 5230392
16832E230392M91074R5695j30571j24502M98937l50415J58456N5545K54693o1555
$$ 5230392 5721466 5817161 5686590 5562088 6061025 5710610 5869066 5924611 6179304 6117749
16822F117749J51300J67805l5313J11892Q4889L99962J12827N3787j73371K65996
$$ 6117749 6269049 6436854 6401541 6513433 6598322 6998284 7111111 7164898 6991527 7257523
16812G257523l2872N29549P2028p6458O12775k68389J63888K98912O6625J45810
$$ 7257523 7224651 7754200 7826228 7749770 8362545 8094156 8258044 8556956 8623581 8769391
16802H769391L03110m1561L92222L84152k88249L85998K22061K41597K51280K59008
$$ 8769391 9072501 9030940 9423162 9807314 9519065 9905063 10127124 10368721 10620001 10879009
16792A0879009j2694K74794K37924K85323P08170k9238L69299K14556N02885J48100
$$ 10879009 10866315 11141109 11379033 11664356 12372526 12343288 12712587 12927143 13430028 13578128
16782A3578128N9142N14439K56514N39783L00615N23093O17298J6626L74247P60719
$$ 13578128 13637270 14151709 14408223 14948006 15248621 15771714 16389012 16405638 16779885 17540604
16772A7540604J98413L30872P91138J28120J057463K05707O87905O90827M22169
$$ 17540604 17739017 18069889 18861027 18989147 20046610 20252317 20940222 21631049 22053218
16763B2053218O53436P64655R67564Q90689M22777Q27559N84331J346646O03730
$$ 22053218 22706654 23471309 24438873 25329562 25752339 26579898 27164229 28510875 29114605
16754B9114605J058284Q23517J277602J132097J120342J024997J351319J434072
$$ 29114605 30172889 30996406 32274008 33406105 34526447 35551444 36902763 38336835
16746C8336835J039093J630528J580421J326154J832661J650342J751979K028890
$$ 38336835 39375928 41006456 42586877 43913031 45745692 47396034 49148013 51176903
16738E1176903J651901K109430K326790K253765K416059K251908K929767K163905
$$ 51176903 52828804 54938234 57265024 59518789 61934848 64186756 67116523 69280428
16730F9280428K991672K260427L228689K772344L057114L329460L144137L303888
$$ 69280428 72272100 74532527 77761216 80533560 83590674 86920134 90064271 93368159
16722I3368159L203830L078550L317328L077866K931178K881036K987324K947914
$$ 93368159 96571989 99650539 102967867 106045733 108976911 111857947 114845271 117793185
16714A17793185K216773K696628J589810K047718J218983J126587M92018O45626
$$ 117793185 120009958 122706586 124296396 126344114 127563097 128689684 129181702 129827328
16706A29827328k10107k82437q23756j051818j105755j765773j975369k093962
$$ 129827328 129617221 129334784 128511028 127459210 126353455 124587682 122612313 120518351
16698A20518351k665899k775120k710609l060479l003605l086269l247545l600572
$$ 120518351 117852452 115077332 112366723 109306244 106302639 103216370 99968825 96368253
16690I6368253l055942l283179l001892l276122k986723k890301l090011k565657
$$ 96368253 93312311 90029132 87027240 83751118 80764395 77874094 74784083 72218426
16682G2218426k981570k455298k471224k459437k363154k484679k224903k254926
$$ 72218426 69236856 66781558 64310334 61850897 59487743 57003064 54778161 52523235
16674E2523235j980425j814577j824937j685029j455142j878845j429944j278942
$$ 52523235 50542810 48728233 46903296 45218267 43763125 41884280 40454336 39175394
16666C9175394j205608j861699j057714j437925j134223q12084j150133j403129
$$ 39175394 37969786 36108087 35050373 33612448 32478225 31666141 30516008 29112879
16658B9112879q52482m97490j174937q41170p36180o95244o77290r78619p47140
$$ 29112879 28260397 27762907 26587970 25746800 25010620 24315376 23638086 22659467 21912327
16649B1912327m32248r76608j58885o73430k82110r02890n20449k87046l36756
$$ 21912327 21480079 20503471 20344586 19671156 19389046 18486156 17965707 17678661 17341905
16640A7341905m99605r49478j76262k22216m75762m66065q6529m27655q05743
$$ 17341905 16842300 15892822 15716560 15494344 15018582 14552517 14465988 14038333 13232590
16631A3232590J33573n48086j77322j39872n13125k63212l28837j46002j23053
$$ 13232590 13366163 12818077 12640755 12500883 11987758 11724546 11395709 11249707 11126654
16622A1126654l24201j01390o70523K14382l40016k48429l81552j61965k08586
$$ 11126654 10802453 10701063 10030540 10244922 9904906 9656477 9274925 9112960 8904374
16613H904374R1207M3344n78018J66585n77496J25513m93988J1624J48122l32526
$$ 8904374 8995581 9038925 8460907 8627492 8049996 8175509 7681521 7693145 7841267 7508741
16603G508741j58741k43531k75416p1733k43939M52342j84188p6204k57053j37839
$$ 7508741 7350000 7106469 6831053 6759320 6515381 6967723 6783535 6707331 6450278 6312439
16593F312439m0183j74005j63069k25746j30687J79773n78885L50001p0342j21098
$$ 6312439 6272256 6098251 5935182 5709436 5578749 5758522 5179637 5529638 5459296 5338198
16583E338198j97143n1878l14706J00830j99693K43132k49841K28188k94985Q1082
$$ 5338198 5141055 5089177 4774471 4875301 4675608 4918740 4668899 4897087 4602102 4683184
16573D683184l38793k53523L15756R5309j84663l52889J92714l65475R5205J61949
$$ 4683184 4344391 4090868 4406624 4501933 4317270 3964381 4157095 3791620 3886825 4048774
16563D048774j54694k7321l41289K69056m166o9326j59773n6045J78346j21461
$$ 4048774 3894080 3866759 3525470 3794526 3790360 3721034 3561261 3505216 3683562 3562101
16553C562101J02487l50050k2737K78622l28061k3256L99989k89965o5313J3650
$$ 3562101 3664588 3314538 3291801 3570423 3242362 3219106 3619095 3329130 3263817 3277467
16543C277467l45033J88687n71576M19274J99358j78618k88490R435M2474j53242
$$ 3277467 2932434 3121121 2549545 2968819 3168177 2989559 2701069 2710504 2752978 2599736
16533B599736M59549m81991q9064m3461L5869k19546L6685K80322n5340l00262
$$ 2599736 3059285 2577294 2488230 2444769 2480638 2261092 2297777 2578099 2522759 2222497
16523B222497k3020M36907n39822O7463j60578J53130J66751J94333l47977K16857
$$ 2222497 2199477 2636384 2096562 2164025 2003447 2156577 2323328 2517661 2169684 2386541
16513B386541j24702k03276O1302p0872J2794L78809l99796j84558j34369J43664
$$ 2386541 2261839 2058563 2119865 2048993 2061787 2440596 2040800 1856242 1721873 1865537
16503A865537N6538K22275l40304J88596j48236P5718k00727o7859K50810j80458
$$ 1865537 1922075 2144350 1804046 1992642 1844406 1920124 1719397 1651538 1902348 1721890
16493A721890K72163o40961L60230k02218L07154l61412J22162R5263p7140J18399
$$ 1721890 1994053 1353092 1713322 1511104 1818258 1456846 1579008 1674271 1597131 1715530
16483A715530m23457R8891N16468l52817n458J14572J44840k05843k72070k42189
$$ 1715530 1292073 1390964 1907432 1554615 1549157 1663729 1808569 1602726 1330656 1088467
16473A088467M79557K57612m69665k21824O22468l12539J38755j32667r5571j27778
$$ 1088467 1568024 1825636 1355971 1134147 1756615 1444076 1582831 1450164 1354593 1226815
16463A226815L34745m79646L11263j9603J87983l39220p9387K35127j38002L63115
$$ 1226815 1561560 1081914 1393177 1373574 1561557 1222337 1142950 1378077 1240075 1603190
16453A603190n87227J9941Q4055j85832L69206K03822o9116j45624j39080j32225
$$ 1603190 1015963 1035904 1119959 934127 1303333 1507155 1438039 1292415 1153335 1021110
16443A021110m0254M20351k12348K24502p8196Q1521m5965l1308m9541k10867
$$ 1021110 980856 1401207 1188859 1413361 1335165 1416686 1370721 1339413 1289872 1079005
16433A079005k232O3064o4597P8640j85095q3718L197J00842J60637K09009j92557
$$ 1079005 1076773 1139837 1075240 1153880 968785 885067 888264 989106 1149743 1358752 1166195
16422A166195j99748k80j03924j65718K27420J20593j66024K32327n3570n5781
$$ 1166195 966447 966167 862243 696525 923945 1044538 878514 1110841 1057271 1001490
16412A001490p6960j05726K35331k18656J35493R6808k17753J45170J58870n54581
$$ 1001490 924530 818804 1054135 835479 970972 1067780 850027 995197 1154067 599486
16402E99486K55571L1170K07315p9886l89714L27840l51914J65820K10696j26038
$$ 599486 855057 886227 1093542 1013656 623942 951782 599868 765688 976384 850346
16392H50346q7094L64658l41836J35379k58198j59563L50927j35335o3313m7111
$$ 850346 763252 1127910 786074 921453 663255 503692 854619 719284 655971 608860
16382F08860J46355K90843j21667k91447Q0676N0422j59102K91767O7306k9595
$$ 608860 755215 1046058 924391 632944 713620 764042 604940 896707 964013 934418
16372I34418r7083q8848j63446J204L26308C82537M39305k74631r7061K60224
$$ 934418 837335 748487 585041 586245 912553 382537 821842 547211 450150 710374
16362G10374R1210k90397l1769L68883l65125M10721k64501l6962N221Q271p7678
$$ 710374 801584 511187 479418 848301 483176 893897 629396 592434 597655 605926 528248
16351E28248j53816R7624J55583J39822k38548j71680K64446j57456K59980n3812
$$ 528248 374432 472056 627639 767461 528913 357233 621679 464223 724203 670391
16341F70391j72641L18816k80490L646J82233k79893L18688R995k82482M17362
$$ 670391 497750 816566 536076 539722 721955 442062 760750 770745 488263 905625
16331I05625B20091O44940j87064Q2976m8052J03592j26456j87966j40516M47486
$$ 905625 220091 865031 677967 760943 712891 816483 690027 502061 361545 809031
16321H09031C77353r9355N30773j01353j42452J75822l48646q6528M21873k06649
$$ 809031 377353 277998 808771 707418 564966 740788 392142 305614 727487 520838
16311E20838j35449A7557N49122k0846j06472J08928K56629k37320k21064K45438
$$ 520838 385389 17557 566679 545833 439361 548289 804918 567598 346534 591972
16301E91972k95179M34092k05783K70094k07826j74895K66428L8460k71326o9941
$$ 591972 296793 730885 525102 795196 587370 412475 678903 717363 446037 376096
16291C76096j68223M65592q5898M3975j90764r9729K51205n791k3649J20038k4476
$$ 376096 207873 673465 587567 631542 440778 341049 592254 586463 562814 682852 658376
16280F58376J26076l88822L2023j72896K9075j21391l5443K81440b8045E56190
$$ 658376 784452 395630 427653 254757 283832 162441 126998 408438 -28045 556190
16269B66283K75916j08569k08791c2562D11493N8897j98110J8336M2216Q2943
$$ 266283 542199 433630 224839 -32562 411493 470390 272280 290616 332832 415775
16259D15775g7650A07560K56598Q7212J55846B90997K53073B48672P26899D01309
$$ 415775 -77650 107560 364158 451370 607216 290997 544070 248672 975571 401309
16248F14569K27334C50812J34505q503G9333B7940K94468J34906B07049O7739
$$ 614569 841903 350812 485317 476814 79333 27940 322408 457314 207049 274788
16238B74788M87423B84885L38599B85278A08194R7443L16581p3979A65072M64530
$$ 274788 762211 284885 623484 285278 108194 205637 522218 448239 165072 629602
16228F29602B3705M13577L587N0338d38492A99555K14247o6142A56290L17200
$$ 629602 23705 437282 440869 491207 -438492 199555 413802 347660 156290 473490
16218D73490j08906K68094k33803J14425D3673K18465m1214K52006A97593k9063
$$ 473490 364584 632678 398875 513300 43673 262138 220924 472930 197593 168530
16208A68530O6633J1644R4540N8697A03842J23407Q0107r9759o2548l8305J90216
$$ 168530 235163 246807 341347 400044 103842 227249 307356 207597 145049 106744 296960
16197B96960D14J29323K94093J49844g4623A34928l0885L34335A29689e2292A74782
$$ 296960 414 129737 423830 573674 -74623 134928 104043 438378 129689 -52292 174782
16185A78712J26618q3922F8147d6679B01330J36828C463K56627p232E3177b722
$$ 178712 305330 221408 68147 -46679 201330 338158 3463 260090 252858 53177 -2722
16173C54572C1170L55796A67087f3378C74542I3973B1954P9176m3597M9876J36512
$$ 354572 31170 386966 167087 -63378 374542 93973 21954 101130 57533 107409 243921
16162B43921n9750n9291L10810j61160a37441A27320D6869R5824J08608m2726
$$ 243921 184171 124880 435690 274530 -137441 127320 46869 142693 251301 208575
16152B08575n5707R5243K7791j23599P7883B8990L85501j28803J3719j23114K9581
$$ 208575 152868 248111 275902 152303 230186 28990 414491 285688 299407 176293 205874
16141B05874a36428a4972A32834l9105M782J51354j4923l1084r7170K06120A30036
$$ 205874 -136428 -14972 132834 93729 98511 249865 234942 203858 106688 312808 130036
16129B42789R30J61545f9656C45853N8367f442H859j530J47578C8816L33604o7562
$$ 242789 243719 405264 -69656 345853 404220 -6442 8859 7329 154907 38816 372420 304858
16117C04858O0539j64459C4720K27316E7417M18054m792A48832i88m4789o2629
$$ 304858 365397 200938 34720 262036 57417 475471 470679 148832 -988 -45777 -108406
16106a08406P162n2300A88087c00549f683a542C08468D5220L13101H3643a16573
$$ -108406 -101244 -153544 188087 -300549 -6683 -1542 308468 45220 358321 83643 -116573
16094B84331R2328A78481C1880K32287e8576E6249O0051J66418j1097k1896j5707
$$ 284331 376659 178481 31880 264167 -58576 56249 116300 282718 271621 249725 234018
16083B34018I3393J20851a60638j2489E8251g8342D6909i5995A32895J98932G0317
$$ 234018 93393 214244 -160638 -173127 58251 -78342 46909 -95995 132895 331827 70317
16071A51399R1267E8122a05572O854d606B45067a60739A01583K10630A47278J52767
$$ 151399 242666 58122 -105572 -98718 -4606 245067 -160739 101583 312213 147278 300045
16060C00045a42198C91908F2169b28152A0438J31433J1303J66527a11831A47377
$$ 300045 -142198 391908 62169 -228152 10438 141871 153174 319701 -111831 147377
16049C28179g4041D0237i9966r1728Q8306B68114j25260g4109C1914J14448F7261
$$ 328179 -74041 40237 -99966 -191694 -103388 268114 142854 -74109 31914 146362 67261
16037B0143L30645A37998C4037M1042c44399a38887A54822B8137J41555i0749
$$ 20143 350788 137998 34037 75079 -344399 -138887 154822 28137 169692 -90749
16026A24995n5247j1058J72422n9230G0080a08582A71275c8339A14228K2501b42849
$$ 124995 69748 58690 231112 171882 70080 -108582 171275 -38339 114228 136729 -242849
16014a46134l5587h2965A36615J08175C4710b8149B823a59093b6859j77686b7257
$$ -146134 -181721 -82965 136615 244790 34710 -28149 2823 -159093 -26859 -204545 -27257
16002H7925a00982C73880f5655A44051D8364d1013f561E13c47179B1805a7925
$$ 87925 -100982 373880 -65655 144051 48364 -41013 -6561 513 -347179 21805 -17925
15990H3902J57956o9975p4900h1133H6307J20843b1585B9951Q1000a44450m5172
$$ 83902 241858 171883 96983 -81133 86307 207150 -21585 29951 110951 -144450 -189622
15979a89622e0695C30745A01591J212J67420J99468K25292n3216J83723L35222
$$ -189622 -50695 330745 101591 102803 270223 469691 694983 641767 825490 1160712
15969A160712Q4975E83393L81321j38940l44783G9100a1884I6621b18426a0657
$$ 1160712 1245687 583393 964714 825774 480991 79100 -11884 96621 -218426 -10657
15958A05365d6362a0405G4603a94525K4281I3296K40650A8984c9988q8507r6178
$$ 105365 -46362 -10405 74603 -194525 -170244 93296 333946 18984 -39988 -128495 -224673
15947b24673a00044B36777P4808j21735K7117h5953C34099c5308r610k13715e3358
$$ -224673 -100044 236777 311585 189850 216967 -85953 334099 -35308 -44918 -258633 -53358
15935h3149m0459B86275d37645A2962K83750K08540a86756f146j25192I9983a72048
$$ -83149 -123608 286275 -437645 12962 296712 505252 -186756 -6146 -131338 99983 -172048
15923h5990G8097a88351O7188A7922g7335k57952a20065F1640i4675A89028a83895
$$ -85990 78097 -188351 -121163 17922 -77335 -335287 -120065 61640 -94675 189028 -183895
15911G6636e6003A34757h9573A25894a4140j47620B62801j18499g7212A06881
$$ 76636 -56003 134757 -89573 125894 -14140 -161760 262801 144302 -77212 106881
15900a67915k8140d5315I7136I886M9115R5412N5451b55093A59680b33339g867
$$ -167915 -196055 -45315 97136 9886 59001 154413 209864 -255093 159680 -233339 -7867
15888a05569B02304d4749H9681a90179A817J33573a15466k9370G9126O6441b8194
$$ -105569 202304 -44749 89681 -190179 1817 135390 -115466 -144836 79126 145567 -28194
15876b34427c7921A0582P8346a39450n1859i3512C92385A53105l5165J27962C4187
$$ -234427 -37921 10582 88928 -139450 -191309 -93512 392385 153105 117940 245902 34187
15864D3718J7138J54933B7997d1177A36244D6433J21754o9483Q9824E185a6735
$$ 43718 60856 215789 27997 -41177 136244 46433 168187 98704 188528 5185 -16735
15852c985q871H0871b74754I8597L03941a12417m8732H9116a64017M2459l51237
$$ -3985 -12856 80871 -274754 98597 402538 -112417 -161149 89116 -164017 -121558 -472795
15841d72795C58039H0663b17394B28436A7026b6024j02609j37011i5533j59160
$$ -472795 358039 80663 -217394 228436 17026 -26024 -128633 -265644 -95533 -254693
15831b54693J21567f2794k3828j15434G8165a60244A06705a52016P3301B91304
$$ -254693 -133126 -62794 -86622 -202056 78165 -160244 106705 -152016 -78715 291304
15820B6642b14028P032j6698A36333K03442a08728c9842F1490P0408d8968j81850
$$ 26642 -214028 -206996 -223694 136333 339775 -108728 -39842 61490 131898 -48968 -230818
15809b30818L3605b3137j88053A66345m0646b07980C7516a39486j12589f0747
$$ -230818 -197213 -23137 -211190 166345 125699 -207980 37516 -139486 -252075 -60747
15798A83835m756b38136J8264i0280G409d4498k34383D900a25360B27688H9258
$$ 183835 179079 -238136 -219872 -90280 7409 -44498 -278881 4900 -125360 227688 89258
15786e5125F1252J18618k3010h9086j46593O7610R698A98169K5385a40505d7408
$$ -55125 61252 179870 156860 -89086 -235679 -168069 -158371 198169 223554 -140505 -47408
15774a9318G1669K4015b32267P1929j65404A42068C7268i7758B4863d5749A53164
$$ -19318 71669 95684 -232267 -160338 -325742 142068 37268 -97758 24863 -45749 153164
15762d860k12347G1486N2989c3834A89983m6132D1206K51357A29830L5983p9218
$$ -4860 -217207 71486 124475 -33834 189983 143851 41206 292563 129830 165813 86595
15751H6595O9111k7628C2806O5633m6600J16572b40568C30668j59153c7407A83753
$$ 86595 155706 128078 32806 98439 51839 168411 -240568 330668 171515 -37407 183753
15739a0320A22553a56402B24695c7501j7263J5256A3921R376g2936A42391i4171
$$ -10320 122553 -156402 224695 -37501 -54764 -39508 13921 23297 -72936 142391 -94171
15727g938E0199L1790d9926k3391A9650R3290R7828b54382i9087G6356b67009
$$ -7938 50199 81989 -49926 -73317 19650 112940 210768 -254382 -99087 76356 -267009
15715a40531C01499E9870g6728H1225c4504l7491A6038a92794l2014P5529G3017
$$ -140531 301499 59870 -76728 81225 -34504 -71995 16038 -192794 -224808 -149279 73017
15703d724n4039B7243a61970l7648g4667j93754A29803a64676B67914E0906b17058
$$ -4724 -58763 27243 -161970 -199618 -74667 -268421 129803 -164676 267914 50906 -217058
15691g4274j04615h8444C16316c49790A89114a00232C1633a51271L2662j12569
$$ -74274 -178889 -88444 316316 -349790 189114 -100232 31633 -151271 -118609 -231178
15681b31178E6123R9471k0324b04500c5207E0238L236L4223J30890A8912N0645
$$ -231178 56123 155594 135270 -204500 -35207 50238 53474 87697 218587 18912 69557
15670F9557b8091j10482n9207I1517b26655l6269Q9066K4655N5477l089C46624
$$ 69557 -28091 -138573 -197780 91517 -226655 -262924 -173858 -149203 -93726 -96815 346624
15658A23333a33066i257A12836J6744J15091a11528D64599k12746E920b32381
$$ 123333 -133066 -9257 112836 129580 244671 -111528 464599 251853 5920 -232381
15647a10268N262j17325A39113b31904b1467j39094l3570J0238A50306b98253
$$ -110268 -105006 -222331 139113 -231904 -21467 -160561 -194131 -183893 150306 -298253
15636c44030A44354L2367a64190A28677p314c42056B3637K2165b16562J02867
$$ -344030 144354 176721 -164190 128677 121363 -342056 23637 45802 -216562 -113695
15626a13695I2920g12k01699b0143q3826J3379j10541C69569b62519a1877C18158
$$ -113695 92920 -712 -202411 -20143 -103969 -90590 -201131 369569 -262519 -11877 318158
15614I767J45206b500E0057L887A1638b92k36429a4520k46185a28177q3822B67328
$$ 9767 154973 -2500 50057 53944 11638 -292 -236721 -14520 -260705 -128177 -211999 267328
15601a86378k3748B2752a9374E4292f1799j62042E4898a70668M4442j0844n704
$$ -186378 -210126 22752 -19374 54292 -61799 -223841 54898 -170668 -126226 -137070 -142774
15590a42774l28281b5422j66716R0788k3319M0391A43629a09215H6983a5776l03918
$$ -142774 -471055 -25422 -192138 -101350 -124669 -84278 143629 -109215 86983 -15776 -319694
15579c19694a05306A25317J31425B6058P034d27952a50810a5134A20291a91818
$$ -319694 -105306 125317 256742 26058 33092 -427952 -150810 -15134 120291 -191818
15568A72668e65060A37122b41795F2750a07755B3794J37190A1765Q1275N4626
$$ 172668 -565060 137122 -241795 62750 -107755 23794 160984 11765 93040 147666
15558A47666b04217I7624m6099L7964b3089I7290a56102D7908h1901A40008L6955
$$ 147666 -204217 97624 51525 89489 -23089 97290 -156102 47908 -81901 140008 176963
15547A76963Q4926N6720a74847O5032j47986I0951a95761p271j56119B1733J12872
$$ 176963 261889 318609 -174847 -109815 -257801 90951 -195761 -203032 -359151 21733 134605
15536A34605a62862f1656B8905a19909j54885B14991b44070J06513d6782J3844
$$ 134605 -162862 -61656 28905 -119909 -274794 214991 -244070 -137557 -46782 -32938
15526c2938B52760A2618K01877d16757a42052j16486a10991A15922a44768c235
$$ -32938 252760 12618 214495 -416757 -142052 -258538 -110991 115922 -144768 -3235
15515b49581A57656g0230h445F4199K05773c71806A5041b61386h898j38671A28580
$$ -249581 157656 -70230 -8445 64199 269972 -371806 15041 -261386 -8898 -147569 128580
15503A22444E3046Q8941b9772a4774C51264m029O8745F20J86577K14029g2262
$$ 122444 53046 141987 -29772 -14774 351264 347235 415980 620 187197 401226 -72262
15491C12299O7846A82060G147K15757d0046j34711G7912J22686E2482L53518c3088
$$ 312299 380145 182060 7147 222904 -40046 -174757 77912 200598 52482 406000 -33088
15479A14084L44894o4562a49132C8603R2407N8198b58B51479C2842b39752B15868
$$ 114084 458978 394416 -149132 38603 131010 189208 -258 251479 32842 -239752 215868
15467A91649L6709a60776A76009K12022b8354A28462C9763J57541l9411L95546
$$ 191649 228358 -160776 176009 388031 -28354 128462 39763 197304 157893 553439
15457E53439P0345k32090j00943j28477J63271j20908r8179J12965e8095a6992
$$ 553439 623784 391694 290751 162274 325545 204637 106458 219423 -58095 -16992
15446F1350J41589a95858Q0462C56028A69343J33822A27708K01502b11717D1285
$$ 61350 202939 -195858 -115396 356028 169343 303165 127708 329210 -211717 41285
15435B78972f8061D90302B9679K69837b08794A34312F6399K06949K56908O08453
$$ 278972 -68061 490302 29679 299516 -208794 134312 66399 273348 530256 1138709
15425A138709j47486m40335L42401l60239j72175d919D5901b1640B88453p4799
$$ 1138709 991223 550888 893289 533050 360875 -4919 45901 -21640 288453 213654
15415B13654a78812A91984E8358L48142F1097P7396J44463g127m5243C54346C6447
$$ 213654 -178812 191984 58358 406500 61097 138493 282956 -7127 -52370 354346 36447
15403E8421a48463n7911b0399k6759R163j40358K1721I3576K57750B9081A3095
$$ 58421 -148463 -206374 -20399 -47158 -37995 -178353 -156632 93576 351326 29081 13095
15391A1136e5394E8561J5963K99303a82924C28565b99429J9676F5159j8853J12878
$$ 11136 -55394 58561 74524 373827 -182924 328565 -299429 -279753 65159 46306 159184
15380A59184G8008b01221R3962d1047B50739i8509F9914J05016b4740k04545j76969
$$ 159184 78008 -201221 -107259 -41047 250739 -98509 69914 174930 -24740 -229285 -406254
15369d06254A34927f859n2691j93264A13449K58180d6027j8353C8456b04835F1688
$$ -406254 134927 -6859 -59550 -252814 113449 371629 -46027 -64380 38456 -204835 61688
15357A14194n2294J68280I347J08246g292B38174Q3340a03840L8088A07237N9611
$$ 114194 61900 230180 9347 117593 -7292 238174 321514 -103840 -65752 107237 166848
15346A66848b01991G0136J06587m6953b01648A8060K53357j09082H0771L03361
$$ 166848 -201991 70136 176723 129770 -201648 18060 271417 162335 80771 384132
15336C84132j75014D9590g1274B54428G8477h0162D94700j91583L9653K15415
$$ 384132 209118 49590 -71274 254428 78477 -80162 494700 303117 342770 558185
15326E58185j14054A97967k7221J08466A27419J86981A18000m9499K8151J73140
$$ 558185 444131 197967 170746 279212 127419 314400 118000 68501 96652 269792
15316B69792J25862A06216J39434J34881A43932l715J75075J8740a45897A83983
$$ 269792 395654 106216 245650 380531 143932 140217 315292 334032 -145897 183983
15305A34579J3692a18682C14519F4469g0628A44904b7604C29716n3530j35002
$$ 134579 148271 -118682 314519 64469 -70628 144904 -27604 329716 276186 141184
15295A41184K93200A45413K53036F2937J90261q6632a93117A92731r2082J72443
$$ 141184 434384 145413 398449 62937 253198 166566 -193117 192731 100649 273092
15285B73092a30994I1296J40899m0386b7198A43415C4100O9802B1005M9040a00958
$$ 273092 -130994 91296 232195 191809 -27198 143415 34100 103902 21005 70045 -100958
15273C15093I2966c7057F8614L01082A80285B381a01672b6545n933C620b2748
$$ 315093 92966 -37057 68614 369696 180285 2381 -101672 -26545 -32478 3620 -22748
15261B02171c2147p4048A88597a7942B41399G8881c0617B13143E0379b22867f4400
$$ 202171 -32147 -106195 188597 -17942 241399 78881 -30617 213143 50379 -222867 -64400
15249a22113L5997c11D2700K7358c9003A4321b9194n3545k09640R2901g6651K3388
$$ -122113 -86116 -311 42700 70058 -39003 14321 -29194 -82739 -292379 -199478 -76651 -53263
15237e3263j39517G0490K762L41452A97242R2370J40848P760l2827N85221P08342
$$ -53263 -192780 70490 73252 414704 197242 289612 430460 438220 405393 990614 1698956
15226A698956j79686l19978j61734C31272k1692J1485K25531A55359E5223M46413
$$ 1698956 1519270 1199292 1037558 331272 309580 321065 546596 155359 55223 501636
15216E01636A92463l3877O9213b24657M0735G8170R5679c5430D9091g2486a5127
$$ 501636 192463 158586 227799 -224657 -183922 78170 173849 -35430 49091 -72486 -15127
15204A52277K21367j76744f3586B12504C2512N0359a62548A07351e4878C85328
$$ 152277 373644 196900 -63586 212504 32512 82871 -162548 107351 -54878 385328
15193A23023l3451K4799J55461f7616j91719B44312B7532R5752d0508l66461A84272
$$ 123023 89572 114371 269832 -67616 -259335 244312 27532 123284 -40508 -406969 184272
15181I7223c8255B09670R9379E9224J6119K8514K64806A07536J63903J95377H1066
$$ 97223 -38255 209670 309049 59224 75343 103857 368663 107536 271439 466816 81066
15169A28002K06198G1858M7525c25010A12930c3172D69426m8006G4228a37092
$$ 128002 334200 71858 119383 -325010 112930 -33172 469426 421420 74228 -137092
15158A41483Q4350P4278i5267q64A63143b03789b392H9686A697e541k40710f3097
$$ 141483 225833 300111 -95267 -96131 163143 -203789 -2392 89686 1697 -5541 -246251 -63097
15145A05302k8273F661K64146O5881b08111B54169b34704A40523H651K24583A05303
$$ 105302 77029 6661 270807 336688 -208111 254169 -234704 140523 8651 233234 105303
15133B52811E2482K56649b1019A84935h1750r6190B08163a88320A11765k7498
$$ 252811 52482 309131 -21019 184935 -81750 -177940 208163 -188320 111765 84267
15123H4267K73347A61986k8498l2345J5792l8495M36747e1303j18248A88088j935
$$ 84267 357614 161986 133488 101143 116935 78440 515187 -51303 -169551 188088 186153
15112A86153J10426i7490B37918c30780c8460G5359N3521k1086M09981B29375
$$ 186153 296579 -97490 237918 -330780 -38460 75359 128880 107794 517775 229375
15101C04795r1879M2630E5667c43725B67192A05793J39547a75349A76148g759
$$ 304795 212916 255546 55667 -343725 267192 105793 245340 -175349 176148 -7759
15090a61416D71027a71017B18288m4879N1891C2964b27750P3293A52775R655J2187
$$ -161416 471027 -171017 218288 173409 225300 32964 -227750 -154457 152775 162430 174617
15079A74617Q1201r3340j8552F6800K73276F1226N130j0839Q0374J62827i0310
$$ 174617 255818 162478 143926 66800 340076 61226 66356 55517 135891 298718 -90310
15067B60177G1087Q7648J21627Q317a892j0094D89528H1976K37723G382N50941
$$ 260177 71087 158735 280362 288679 -1892 -11986 489528 81976 319699 7382 558323
15056E58323A1625N0231J11588m0772R1645k3100k0531K12108j42772l5649B5535
$$ 558323 11625 61856 173444 132672 224317 201217 180686 392794 250022 214373 25535
15044F1207N232K94924O6374A83982L08853A19549Q1775k3532G7650M49464A52190
$$ 61207 66439 361363 427737 183982 492835 119549 201324 177792 77650 527114 152190
15032B42161m9164J77588E9036P5936K16867A71974J31262Q3331j55881J08449
$$ 242161 192997 370585 59036 134972 351839 171974 303236 386567 230686 339135
15022C39135j07210J90208a65202C14058K50753J10382j98316j56918M89706L6027
$$ 339135 231925 422133 -165202 314058 564811 675193 476877 319959 809665 845692
15012H45692J12873k52934m3290k12696j21073j45264K97297J01036L2407A91983
$$ 845692 958565 705631 662341 449645 328572 183308 480605 581641 614048 191983
15001A92536L70936j30520m4103p4542J14216J84450B64191J39345j8819j60283
$$ 192536 563472 432952 388849 314307 428523 612973 264191 403536 384717 224434
14991B24434m0888J87839A70718K74155L58077B81795A40809N27969k28231L5359
$$ 224434 183546 371385 170718 444873 802950 281795 140809 668778 440547 475906
14981D75906k6651j60533K14811A27840J20641M13805j94373K31234j69664j66471
$$ 475906 449255 288722 503533 127840 248481 662286 467913 699147 529483 363012
14971C63012J10411j79453L57001q5352J95516K26398o6494P7763k68816j77988
$$ 363012 473423 293970 650971 565619 761135 987533 921039 998802 729986 551998
14961E51998K23835C60718K60336J38973j48712j09059B01045K45506q8723J44036
$$ 551998 775833 360718 621054 760027 611315 502256 201045 446551 357828 501864
14951E01864A63963J39268L8514k4117p1665K99082L8569P9304j33814k59816
$$ 501864 163963 303231 341745 317628 245963 545045 583614 662918 529104 269288
14941B69288M5136M10858B18703O8790J90149j26563J41258j92959J31051J20992
$$ 269288 314424 725282 218703 287493 477642 351079 492337 299378 430429 551421
14931E51421N8Q0022j5238r0144L34981l31125J54883n4968k61736J71603j89169
$$ 551421 551479 631501 616263 526119 861100 529975 684858 629890 368154 539757 350588
14920C50588O51966l07845k59150K90225O4181M78586k69211L78058M8549Q8230
$$ 350588 1002554 694709 435559 725784 789965 1268551 999340 1377398 1425947 1514177
14910A514177J7094L77423j29169j84614J63418J70763o70836N32843L33514J90575
$$ 1514177 1531271 1908694 1779525 1594911 1758329 1929092 1258256 1791099 2124613 2315188
14900B315188j26801l27571k71089j96220k95915m3230o3640m95210M2547M22450
$$ 2315188 2188387 1860816 1589727 1393507 1097592 1054362 990722 495512 538059 960509
14890I60509D74635J5997j09372J23625r6939K5434E0323J97344J47790q9892
$$ 960509 474635 490632 381260 504885 407946 433380 50323 247667 395457 305565
14880C05565K78057l0144B65832N9581M93450k20685N3415k572L30592k47291
$$ 305565 583622 553478 265832 325413 818863 598178 651593 649021 979613 732322
14870G32322k19962P0477L84026J37144k87132J74211l78058J76697L58469n55938
$$ 732322 512360 582837 966863 1104007 816875 991086 613028 789725 1148194 592256
14860E92256k45476J85549l5331L0609L3601J1241j61012J09894K4636J5184l1829
$$ 592256 346780 532329 496998 527607 561208 572449 411437 521331 545967 561151 529322
14849E29322K51246j49000k69582K02769k4599j05435J50073O3214k76237q9671
$$ 529322 780568 631568 361986 564755 540156 434721 584794 648008 371771 282100
14839B82100j04221L04927J40846K9865n850R5072j65817j08846l4814N45377
$$ 282100 177879 482806 623652 653517 647667 742739 576922 468076 433262 978639
14829I78639j55478L23586j55506K62318k3025m06720J85676j10251l2500j23148
$$ 978639 823161 1146747 991241 1253559 1230534 823814 1009490 899239 866739 743591
14819G43591N9274p1870j88846B55887K24375J72065n2603J09157C36905J88605
$$ 743591 802865 730995 542149 255887 480262 652327 599724 708881 336905 525510
14809E25510Q7269L5822l4584N2095l12190M59757j31018L3235J03066k59051
$$ 525510 612779 648601 614017 666112 353922 813679 682661 715896 818962 559911
14799E59911J55861L16399m48331M43194m41459J60391K39233m6999j6059j95429
$$ 559911 715772 1032171 583840 1027034 585575 745966 985199 938200 922141 726712
14789G26712Q8358j90362O10610E33257L16248J10758D29124M04628k20537J3705
$$ 726712 815070 624708 1235318 533257 849505 960263 429124 833752 613215 626920
14779F26920j83319L25216k77902L62627D08236R8735L38384J35179k02195k39992
$$ 626920 443601 768817 490915 853542 408236 506971 845355 980534 778339 538347
14769E38347L62819k58437R4329J50899l71546K38769k80686L58113J74668l66071
$$ 538347 901166 642729 737058 887957 516411 755180 474494 832607 1007275 641204
14759F41204K97508o523l54395k18766K35013K92983k78025J89390m1259K21843
$$ 641204 938712 932189 577794 359028 594041 887024 608999 798389 757130 978973
14749I78973j54326k24200j9311n0389j14880J08878j2594K24328j80307m4696
$$ 978973 824647 600447 581136 530747 415867 524745 512151 736479 556172 511476
14739E11476J06819o3705j10309K36210J17143l87242N5633R8777p1365K09784
$$ 511476 618295 554590 444281 680491 797634 410392 466025 564802 493437 703221
14729G03221J68466j59582J29675r9258O4550j83465M394K50792m6443K03951
$$ 703221 871687 712105 841780 742522 807072 623607 628001 878793 832350 1036301
14719A036301j97242k07360R2924J38721L05395L30222k10962J60830N10871k49444
$$ 1036301 839059 631699 724623 863344 1168739 1498961 1287999 1448829 1959700 1710256
14709A710256J82041o71174j40465J84723l06182o4668J13573k06026Q7795K7956
$$ 1710256 1892297 1221123 1080658 1265381 959199 894531 1008104 802078 889873 917829
14699I17829p1908R2688L1369q0964N5649r0289N92980E29764O90402O3770j99767
$$ 917829 845921 938609 969978 889014 944663 854374 1447354 529764 1220166 1283936 1084169
14688A084169K26178J3830O19377k51465n4112l4191k56980l74657M19975n14303
$$ 1084169 1310347 1324177 1943554 1692089 1637977 1603786 1346806 972149 1392124 877821
14678H77821J57719p8180K65572n12127J0207L54086k24911J14270j90699K09295
$$ 877821 1035540 957360 1222932 710805 721012 1075098 850187 964457 773758 983053
14668I83053j94023J02527J12555K3955o835j64381p7136J96370R273k92058Q6634
$$ 983053 789030 891557 1004112 1028067 1021232 856851 779715 976085 985358 693300 779934
14657G79934K62878m4318j51765K91880j94960Q4340J99373j48698k08173R7280
$$ 779934 1042812 998494 846729 1138609 943649 1027989 1227362 1078664 870491 967771
14647I67771k58504K60378K63615k95601J69448k22417K04474J14709k8990P0442
$$ 967771 709267 969645 1233260 937659 1107107 884690 1089164 1203873 1174883 1245325
14637A245325k10922J86367j9877J58754L1589J15866l67844J73415k42755J02002
$$ 1245325 1034403 1220770 1200893 1359647 1391236 1507102 1139258 1312673 1069918 1171920
14627A171920J64519R5139k15599j0859j78885n8928O80438k06774j49981o5146
$$ 1171920 1336439 1431578 1215979 1205120 1026235 967307 1647745 1440971 1290990 1225844
14617A225844r2969K99769l74911L49882k70873Q3279J97200k19512Q3840j25920
$$ 1225844 1132875 1432644 1057733 1407615 1136742 1220021 1417221 1197709 1281549 1155629
14607A155629K51722k89834K84660J95721m45908M1588L44078j5251Q946j54840
$$ 1155629 1407351 1117517 1402177 1597898 1151990 1193578 1537656 1522405 1531351 1376511
14597A376511N8192Q5091j79961J35985J61170J13644p2038m28771K4668L96699
$$ 1376511 1434703 1519794 1339833 1475818 1636988 1750632 1678594 1249823 1274491 1671190
14587A671190k67534L20416j14030j07936p9546K95697q4756J5388L37531j88053
$$ 1671190 1403656 1724072 1610042 1502106 1422560 1718257 1633501 1648889 1986420 1798367
14577A798367l22521K68284o0343M08616j54484k45894J0497J72913l2928l2509
$$ 1798367 1475846 1744130 1683787 2092403 1937919 1692025 1702522 1875435 1842507 1809998
14567A809998M7921J1713Q9055J43443k75058K32283P19j83342K73217m1107l17283
$$ 1809998 1857919 1869632 1958687 2102130 1827072 2059355 2060074 1876732 2149949 2108842 1791559
14556A791559N20184R7706k6130j92495k2320L07162j75595j25850K74007J30256
$$ 1791559 2311743 2409449 2383319 2190824 2168504 2475666 2300071 2174221 2448228 2578484
14546B578484o1152J1357K40964M48275j39113J71283M28022J55856M71878J042539
$$ 2578484 2517332 2528689 2769653 3217928 3078815 3250098 3678120 3833976 4305854 5348393
14536E348393R51608J507207K767296M087994O619859J1223228j006963j3944585
$$ 5348393 6300001 7807208 10574504 14662498 21282357 32505585 31498622 17554037
14528A7554037p887701l507704j265697p86016M2382M88078N7542j099157o35209
$$ 17554037 9666336 6158632 4892935 4106919 4149301 4637379 4694921 3595764 2960555
14519B960555l35684j10138l74956K46452j59989L05078l06045P4625p1049J33957
$$ 2960555 2624871 2514733 2139777 2386229 2226240 2531318 2225273 2299898 2228849 2362806
14509B362806j11119j60576N13103l69698K66669J64696k91280o8917J58435L26681
$$ 2362806 2251687 2091111 2604214 2234516 2501185 2665881 2374601 2305684 2464119 2790800
14499B790800o10840L31344J58075j34335K51099R7355J19975M6710p9035O3644
$$ 2790800 2179960 2511304 2669379 2535044 2786143 2883498 3003473 3050183 2971148 3034792
14489C034792r2997K12407l99021L29525k869l94777J41063M33945j2592K55111
$$ 3034792 2941795 3154202 2755181 3084706 3081837 2687060 2828123 3262068 3249476 3504587
14479C504587j68566J49203k16443R248K86746l31167M45635k05467K50965n7576
$$ 3504587 3336021 3485224 3268781 3278029 3564775 3233608 3679243 3473776 3724741 3667165
14469C667165P877K75j19603N917n684J78931L51851k76905K44197J43821l8113
$$ 3667165 3675042 3675317 3555714 3561631 3555947 3734878 4086729 3809824 4054021 4197842 4159729
14458D159729J65464j41465Q9382J87588j85476K59910j17657k25077L97420j85374
$$ 4159729 4325193 4183728 4273110 4460698 4275222 4535132 4417475 4192398 4589818 4404444
14448D404444k1300K18277j59039L18104K51906l46128J33698M73599k2233K7267
$$ 4404444 4383144 4601421 4442382 4760486 5012392 4666264 4799962 5273561 5251328 5278595
14438E278595p7047N717K19445l6787J17138j25918K37064J13766M0572l6088
$$ 5278595 5201548 5207265 5426710 5389923 5507061 5381143 5618207 5731973 5772545 5736457
14428E736457l26795M29089J76224k60021N14512k79675L24130M9107p7905L40513
$$ 5736457 5409662 5838751 6014975 5754954 6269466 5989791 6313921 6363028 6285123 6625636
14418F625636K78109k10936R8041K49233R6862j40346M84805l18314K83669J54413
$$ 6625636 6903745 6692809 6790850 7040083 7136945 6996599 7481404 7163090 7446759 7601172
14408G601172O3976O9528N24001P6979P7446K20640J85879j91234J13395n7040
$$ 7601172 7665148 7734676 8258677 8335656 8413102 8633742 8819621 8628387 8741782 8684742
14398H684742J92572J63209Q6813M51234l36231M28817N0853k5037M51757J47680
$$ 8684742 8877314 9040523 9127336 9578570 9242339 9671156 9722009 9696972 10148729 10296409
14388A0296409K12211p4693M45739L06187k36335R8809K80040l77830M22674N24696
$$ 10296409 10508620 10433927 10879666 11185853 10949518 11048327 11328367 10950537 11373211 11897907
14378A1897907N5576N00944l59768O41224K67528q2260L73019L13758J44577Q2861
$$ 11897907 11953483 12454427 12094659 12735883 13003411 12921151 13294170 13607928 13752505 13835366
14368A3835366N37632J80043L50828N06963K58274j89587O62334R4344K86931
$$ 13835366 14372998 14553041 14903869 15410832 15669106 15479519 16141853 16236197 16523128
14359A6523128L43179J34443M23046O47790l56414P55392P53097J11119N43075
$$ 16523128 16866307 17000750 17423796 18071586 17715172 18470564 19223661 19334780 19877855
14350A9877855M34794L38351M31794L70588L64504N58095K82515O13424N62246
$$ 19877855 20312649 20651000 21082794 21453382 21817886 22375981 22658496 23271920 23834166
14341B3834166P71746L60132P59135K12675O36058R74150N65503N31781R42949
$$ 23834166 24605912 24966044 25725179 25937854 26573912 27548062 28113565 28645346 29588295
14332B9588295M40835J348891L82440P92511J286430Q52273P34883R39985J173888
$$ 29588295 30029130 31378021 31760461 32552972 33839402 34691675 35426558 36366543 37540431
14323C7540431J297809O55127J414755J120226J278724J281677J543287J191752
$$ 37540431 38838240 39493367 40908122 42028348 43307072 44588749 46132036 47323788
14315D7323788J803897J432138J487071J964309J979426J541340K358188K267013
$$ 47323788 49127685 50559823 52046894 54011203 55990629 57531969 59890157 62157170
14307F2157170K028374J991216L002489K580077K540745K268094L243400K876552
$$ 62157170 64185544 66176760 69179249 71759326 74300071 76568165 79811565 82688117
14299H2688117L236466L429792L615090M025146M132221M223512M737194M866919
$$ 82688117 85924583 89354375 92969465 96994611 101126832 105350344 110087538 114954457
14291A14954457M938581N591350O090245O177893O348494P489408P294935Q344887
$$ 114954457 119893038 125484388 131574633 137752526 144101020 151590428 158885363 167230250
14283A67230250Q011986Q966300R546793R568677J0796732J1188180J1762430
$$ 167230250 175242236 184208536 193755329 203324006 214120738 225308918 237071348
14276B37071348J2289156J2897495J3999069J3803903J4360707J4323221J4824314
$$ 237071348 249360504 262257999 276257068 290060971 304421678 318744899 333569213
14269C33569213J4776997J4833941J4400353J3821831J2863880J2405989J1121187
$$ 333569213 348346210 363180151 377580504 391402335 404266215 416672204 427793391
14262D27793391J0204184Q670935P413378M060684J079387P40824J887461J525778
$$ 427793391 437997575 446668510 454081888 458142572 459221959 459962783 461850244 463376022
14254D63376022k022197p238800n719550q804396j1694313j3091522j1855201
$$ 463376022 461353825 454115025 448395475 439591079 427896766 414805244 402950043
14247D02950043j3615137j3395797j3752132j4311529j3951599j3671059j4214149
$$ 402950043 389334906 375939109 362186977 347875448 333923849 320252790 306038641
14240C06038641j3249250j3031768j2556009j2491219j1636933j1065106j1162944
$$ 306038641 292789391 279757623 267201614 254710395 243073462 232008356 220845412
14233B20845412j0288638j0944030j0013501r722112q631693q422162q119451
$$ 220845412 210556774 199612744 189599243 179877131 171245438 162823276 154703825
14226A54703825p284144o572227o368984o038586n836520n507068m975042n007089
$$ 154703825 147419681 140847454 134478470 128439884 122603364 117096296 112121254 107114165
14218A07114165m472476l907705l906816l929775l695831l361844l276527l014067
$$ 107114165 102641689 98733984 94827168 90897393 87201562 83839718 80563191 77549124
14210G7549124l151876k255006k753417k614982k100902k396614k019886j922240
$$ 77549124 74397248 72142242 69388825 66773843 64672941 62276327 60256441 58334201
14202E8334201j978199k062591j460171j464876j643115j425850j518252j265961
$$ 58334201 56356002 54293411 52833240 51368364 49725249 48299399 46781147 45515186
14194D5515186j464899j092672o71920j318899j220020j545082q67440j054534
$$ 45515186 44050287 42957615 42285695 40966796 39746776 38201694 37334254 36279720
14186C6279720m70614j171794r79411j052745q47308p43429p97348n68573n09235
$$ 36279720 35809106 34637312 33657901 32605156 31757848 31014419 30217071 29648498 29139263
14177B9139263q61253p01447j016103p28526l18030l13045p87058m97944o39324
$$ 29139263 28278010 27576563 26560460 25831934 25513904 25200859 24413801 23915857 23276533
14168B3276533m81846m64403q4149j061495N7223p44721l09023n27461m76825
$$ 23276533 22794687 22330284 22246135 21184640 21241863 20497142 20188119 19660658 19183833
14159A9183833j36517m82221l95000l1959r43645o5004l80203n18449m5764o57819
$$ 19183833 19047316 18565095 18170095 18138136 17194491 17129487 16749284 16230835 16185071 15527252
14149A5527252P7454j35729l03611j23730n25165m73607j24599M3092n99884P1823
$$ 15527252 15604706 15468977 15165366 15041636 14516471 14042864 13918265 13961357 13361473 13433296
14139A3433296j96551j42288m30189m20830J35112l72246k09721j44567K41560
$$ 13433296 13236745 13094457 12664268 12243438 12378550 12006304 11796583 11652016 11893576
14130A1893576l39344m26206l30545m5305j0540n7170m80359K00388m24246j21627
$$ 11893576 11554232 11128026 10797481 10752176 10741636 10684466 10204107 10404495 9980249 9858622
14120I858622j62495Q0073j28796k83008n0791k63340j48023j57768J13446l80810
$$ 9858622 9696127 9776200 9647404 9364396 9313605 9050265 8902242 8744474 8857920 8477110
14110H477110J32633l32953J36976m22950k60330K99865j62355m26173M25902
$$ 8477110 8609743 8276790 8413766 7990816 7730486 8030351 7867996 7441823 7867725
14101G867725m51203J94904m77438L02001k69573n1335j24232J66379o01863K06569
$$ 7867725 7416522 7611426 7133988 7435989 7166416 7115081 6990849 7157228 6555365 6761934
14091F761934L834J21010n95325j6847K30527j53394o5015m35940J11759K8081
$$ 6761934 6765768 6886778 6291453 6274606 6505133 6351739 6286724 5850784 5962543 5990624
14081E990624r3307O5438l4797J5084l81753M2837j91028M2898L7643l14898J40987
$$ 5990624 5897317 5962755 5927958 5943042 5561289 5604126 5413098 5455996 5493639 5178741 5319728
14070E319728k49440K33361m03405M87219r6804l80054j81733M81902l84543L8491
$$ 5319728 5070288 5303649 4900244 5387463 5290659 4910605 4728872 5210774 4826231 4864722
14060D864722L7247k20880j4855J41681k80779K28226k75087j72308K76321j98470
$$ 4864722 4901969 4681089 4666234 4807915 4527136 4755362 4480275 4307967 4584288 4385818
14050D385818j20264o6258M272L09159k40943j49129M4219J27458J5716J1302
$$ 4385818 4265554 4199296 4203568 4512727 4271784 4122655 4166874 4294332 4310048 4321350
14040D321350l89620j67490J03786l38809K15665k2489L30149m75735Q9445k3631
$$ 4321350 3931730 3764240 3868026 3529217 3744882 3722393 4052542 3576807 3666252 3642621
14030C642621k24164m9659R8146j06296K42442j37828L9544m38702K44771r3642
$$ 3642621 3418457 3368798 3466944 3360648 3603090 3465262 3504806 3066104 3310875 3217233
14020C217233r2712J46092l1855j69078J66090l6040l7947K868j66236J05849
$$ 3217233 3124521 3270613 3238758 3069680 3235770 3199730 3161783 3164651 2998415 3104264
14010C104264m49287l0233J62331j34027L17406o1429m39512K15888J52705l22909
$$ 3104264 2654977 2624744 2787075 2653048 2970454 2909025 2469513 2685401 2838106 2515197
14000B515197j960L52598K3599l13796k47852R2329L08065k71399l43664L64173
$$ 2515197 2513237 2865835 2889434 2575638 2327786 2420115 2728180 2456781 2113117 2477290
13990B477290m0608k15916j40030L81195j06505J23965J81608M8338j44661r2267
$$ 2477290 2436682 2220766 2080736 2461931 2355426 2479391 2660999 2709337 2564676 2472409
13980B472409Q8896L43050j67118M03954N98055J131476K052173L223729O099458
$$ 2472409 2561305 2904355 2737237 3141191 3739246 4870722 6922895 10146624 16246082
13971A6246082J1087370P118815j2134490q132940m789761k626799j094365p38065
$$ 16246082 27333452 34452267 22317777 14184837 9395076 6768277 5673912 4935847
13963D935847n48318k08589m47719j52905n13683J07624K2640p9324m54476O3442
$$ 4935847 4387529 4178940 3731221 3578316 3064633 3172257 3194897 3115573 2661097 2724539
13953B724539l94526J66678m08285K62066J34422l08487j37655K04326L2614j11125
$$ 2724539 2330013 2496691 2088406 2350472 2484894 2176407 2038752 2243078 2275692 2164567
13943B164567O0176J17843o4734n14123L39202L2258J18429k05490J72640l36209
$$ 2164567 2224743 2342586 2277852 1763729 2102931 2135189 2253618 2048128 2220768 1884559
13933A884559K19302k10670j19185J10160R4590J73818l07330k84522J36007J78286
$$ 1884559 2103861 1893191 1774006 1884166 1978756 2152574 1845244 1560722 1696729 1875015
13923A875015J40805k80381k65250M48304m47649L92667j08884l52571K56954
$$ 1875015 2015820 1735439 1470189 1918493 1470844 1863511 1754627 1402056 1659010
13914A659010J1699k00537M81489j46239m55649L99389m5628j97726p1247n4970
$$ 1659010 1670709 1470172 1951661 1805422 1349773 1749162 1703534 1505808 1434561 1379591
13904A379591o305j0931J36659j53593L1349M18924l10441K15133k1537n1033
$$ 1379591 1373286 1362355 1499014 1345421 1376770 1795694 1485253 1700386 1678849 1627816
13894A627816j39145J09933k4446k58788K07382j56618L11702j86176k67191J94874
$$ 1627816 1488671 1598604 1574158 1315370 1522752 1366134 1677836 1491660 1224469 1419343
13884A419343J68314k60026n7030J12653L63026o0551l56450Q6419l99139L51111
$$ 1419343 1587657 1327631 1270601 1383254 1746280 1685729 1329279 1415698 1016559 1367670
13874A367670k63908O0401K5863K48891j87518o8224J46778K6908K3872m25224
$$ 1367670 1103762 1164163 1190026 1438917 1251399 1183175 1329953 1356861 1380733 955509
13864I55509J12630K41255J7392j29543N0670M32338p02159K40483J11570j87834
$$ 955509 1068139 1309394 1326786 1197243 1247913 1680251 978092 1218575 1330145 1142311
13854A142311J83589k48899K12006k27155J35848j3452J07762M1240k48747j27388
$$ 1142311 1325900 1077001 1289007 1061852 1197700 1184248 1292010 1333250 1084503 957115
13844I57115J68720o9951k4348L44347k43643k74184J26120J59150j79538j9020
$$ 957115 1125835 1055884 1031536 1375883 1132240 858056 984176 1143326 963788 944768
13834I44768L42090l78540J02176p1470j2298o3108L06404j98458K18200o5754
$$ 944768 1286858 908318 1010494 939024 926726 863618 1170022 971564 1189764 1124010
13824A124010k65196K5472N9739J46417D84216M45702K39277Q304m15996L55488
$$ 1124010 858814 884286 944025 1090442 484216 929918 1169195 1177499 761503 1116991
13814A116991l78534K40200R1759k6086r408J20248m7872k62903J89239l33363
$$ 1116991 738457 978657 1070416 1044330 1034922 1155170 1107298 844395 1033634 700271
13804G00271J46629j43183K42444L7892k27549K78408o3828l8627k71540j02021
$$ 700271 846900 703717 946161 984053 756504 1034912 971084 932457 660917 558896
13794E58896L89893N5202M3334q6356j33216Q4787n5917j75511M05654L8421l11252
$$ 558896 948789 1003991 1047325 960969 827753 912540 856623 681112 1086766 1125187 813935
13783H13935J55134k56959J36037j99811o1118M97695l70474J5901k966j19318
$$ 813935 969069 712110 848147 648336 587218 1084913 714439 730340 727374 608056
13773F08056K76222j66950P1469n4194K44652m7425l84799K24405L8358j728k22748
$$ 608056 884278 717328 788797 734603 979255 931830 547031 771436 809794 808066 585318
13762E85318J59256M3618O0432K04899D46172K33048j50027K91130J90558j48216
$$ 585318 744574 788192 848624 1053523 446172 679220 529193 820323 1010881 862665
13752H62665j04208r7901m5376l1286j690J82544j36478K10819k50443J17631
$$ 862665 758457 660556 615180 583894 582204 764748 628270 839089 588646 706277
13742G06277j03147J5384J24690B54482M71416p8460J28487P9995J75181D53210
$$ 706277 603130 618514 743204 254482 725898 647438 775925 855920 1031101 453210
13731F08576o4872K3687k1074l6801J12642N3718k79410M28915C68293L99799
$$ 608576 543704 567391 546317 509516 622158 675876 396466 825381 368293 768092
13721G68092j46809o7955K03393C24841L87644l08209J80456K80250C51502L3060
$$ 768092 621283 553328 756721 324841 712485 404276 584732 864982 351502 384562
13711C84562L90107l55643M15559J0916m09982j27096J65401J70295K0356C25125
$$ 384562 774669 419026 834585 845501 435519 308423 473824 644119 664475 325125
13700H11333l79479K05562j32626K85213j16046J22229j88763J43516m3918l30424
$$ 811333 431854 637416 504790 790003 673957 796186 607423 750939 707021 376597
13690C76597K80388q5957Q7190l02451J35081K29374l38763L74836j03365m0960
$$ 376597 656985 571028 658218 355767 490848 720222 381459 756295 652930 611970
13680F11970j53947K47231r5559M3088j26076J33632l12251M88119C98136k4022
$$ 611970 458023 705254 609695 652783 526707 660339 348088 836207 398136 374114
13670C74114L35301j24947j05533j14051J53037K09762l13231Q5771N7853J710
$$ 374114 709415 584468 478935 364884 517921 727683 414452 500223 558076 559786
13660E59786A88055J90738M60510l42066J57545k65324l1620M54613C66440P353
$$ 559786 188055 378793 839303 497237 654782 389458 357838 812451 366440 373793
13650C73793L4487A42968K95986p8053K53743A63209K95775l8160L2262M79944
$$ 373793 408280 142968 438954 360901 614644 163209 458984 420824 453086 933030
13640I33030m32046k04789J52827j09260J99296J00025m669A18563Q3120M17258
$$ 933030 500984 296195 449022 339762 539058 639083 634414 118563 201683 618941
13630F18941k8115J53918k83362K5234K92821l53450r530k4797j02293M9075R7803
$$ 618941 590826 744744 461382 486616 779437 425987 416457 391660 289367 338442 436245
13619D36245P6106k03839L91523k97746P4975j20298J54575K43799C50391K61102
$$ 436245 512351 308512 700035 402289 477264 356966 511541 755340 350391 611493
13609F11493A61250L55274K04662k69713B03443L30836m7860j16155J68901O8178
$$ 611493 161250 516524 721186 451473 203443 534279 486419 370264 539165 607343
13599F07343j12860j38748j36552r4502M19085p6210k18434K61237N3560m2903
$$ 607343 494483 355735 219183 124681 543766 467556 249122 510359 563919 521016
13589E21016p8328r3558q1684M13531k59837l7310J00224j4137P8046B20405K50292
$$ 521016 442688 349130 267446 680977 421140 383830 484054 469917 547963 220405 470697
13578D70697Q9614k76821Q9187Q8836J65048B10068j1853J89348m2234A3836J89444
$$ 470697 560311 283490 372677 461513 626561 210068 198215 387563 345329 13836 203280
13567B03280J62861j82631n5719K66185j15534p9768O8206n4371N9536J42505
$$ 203280 366141 183510 127791 393976 278442 198674 266880 212509 272045 414550
13557D14550J81190N5457k69379o336q9867J56304K08011j94318j87785J12273
$$ 414550 595740 651197 381818 375482 285615 441919 649930 455612 267827 380100
13547C80100P4213B2472L29258M0514j27675m7266J60601F5921M75951j97548
$$ 380100 454313 22472 351730 392244 264569 217303 377904 65921 541872 344324
13537C44324j48036m08J38320j19564J73077A37339J62469a93784A89040L1765
$$ 344324 196288 195880 334200 214636 387713 137339 299808 -193784 189040 220805
13527B20805n2904K69844B11848r6818M4740J09601J25422K0852o047o1628J82523
$$ 220805 167901 437745 211848 115030 159770 269371 394793 415645 409598 347970 530493
13516E30493k48336j16296F3890R0430L20420i0865D99283k36794A07444Q1087
$$ 530493 282157 165861 63890 154320 474740 -90865 499283 262489 107444 188531
13506A88531k9242K82145j36016Q6794A76286Q3288L7170j31966N132C6062J36603
$$ 188531 159289 441434 305418 392212 176286 259574 296744 164778 169910 36062 172665
13495A72665m0240J08340K15493A01955l4389J26413k5821K16214j42418J48872
$$ 172665 132425 240765 456258 101955 67566 193979 168158 384372 241954 390826
13485C90826m595K3302j18093L48443A60313H155J46812K37709j53098m561M8659
$$ 390826 386231 409533 291440 639883 160313 8155 154967 392676 239578 235017 283676
13474B83676A06041M80197G9830K67675j26691K9369I8203R3392q0628K43381
$$ 283676 106041 586238 79830 347505 220814 250183 98203 191595 110967 354348
13464C54348P9912j61526P2845a07474C78550p0155B1473K40580j15725J90609
$$ 354348 434260 272734 345579 -107474 378550 308395 21473 262053 146328 336937
13454C36937J30668j87639q81J30016h9287D10413E7555J97010p6458H2038K82939
$$ 336937 467605 279966 279085 409101 -89287 410413 57555 254565 178107 82038 364977
13443C64977a40123C89371d40A48578c5234B89961j03516J09079a5599D2280K68775
$$ 364977 -140123 389371 -440 148578 -35234 289961 186445 295524 -15599 42280 311055
13432C11055j43693j384E6472K75880B0454L56661A57309N8263N0603K24469k19807
$$ 311055 167362 165978 56472 332352 20454 377115 157309 215572 266175 490644 270837
13421B70837J72720b4454G7549j1076K02873J45800A11290M49131G5863K18756
$$ 270837 443557 -24454 77549 66473 269346 415146 111290 560421 75863 294619
13411B94619A04953e4852E5474M24394A77649K47075J39039B1980K38216L3786
$$ 294619 104953 -54852 55474 479868 177649 424724 563763 21980 260196 293982
13401B93982J1066B8155K66128j0578a1003G1602P9224J03652J66154F3972J22834
$$ 293982 305048 28155 294283 283705 -11003 71602 150826 254478 420632 63972 186806
13390A86806m0318a02108a9670A37963K42321q1093r7839m1846m3836J5598P2921
$$ 186806 146488 -102108 -19670 137963 380284 299191 201352 159506 115670 131268 204189
13379B04189p0219L24990B19322d7136C55793o6042a74C84357A71069D5939b041
$$ 204189 133970 458960 219322 -47136 355793 289751 -174 384357 171069 45939 -2041
13367B38041N7131K28734H3253a688B47924e8134B67560a45128E2096J51455n9316
$$ 238041 295172 523906 83253 -1688 247924 -58134 267560 -145128 52096 203551 144235
13356A44235D9499J8206M34589A51036J78270K64605B1124M84205e6324E13737
$$ 144235 49499 67705 502294 151036 329306 593911 21124 505329 -56324 513737
13345C02273I4685K916J13830i550B54511J96355n0998A70716J97126M8752r1009
$$ 302273 94685 97601 211431 -9550 254511 450866 399868 170716 367842 416594 325585
13334C25585a47647A71191N492K93063j44918p1739P1590J91170k25854L2823
$$ 325585 -147647 171191 176683 469746 324828 253089 324679 515849 289995 322818
13324C22818J71658j52716k0338B2934b8837C26759j0235a04375C45879g7290
$$ 322818 494476 341760 321422 22934 -28837 326759 316524 -104375 345879 -77290
13313C16525j45348l5528J39980J82287G8828e1480D45742A87456L39950k42390
$$ 316525 171177 135649 275629 457916 78828 -51480 445742 187456 527406 285016
13303B85016k0460m4988q8478l0395P7862J1499d001j6220C85751A20103J081
$$ 285016 264556 219568 131090 100695 178557 190056 -4001 -20221 385751 120103 121184
13292A21184O0139C9580M41373A71478K2927K42032C1619Q7044f6541A52499n8886
$$ 121184 181323 39580 480953 171478 194405 436437 31619 118663 -66541 152499 93613
13281I3613K30623D1080K76343K72622r0365H0200J28729p3859J16178r8800O8275
$$ 93613 324236 41080 317423 590045 499680 80200 208929 135070 251248 152448 220723
13270B20723r4007a38311e5261C6676K38452I0982C4898J570L6876N8835K28289
$$ 220723 126716 -138311 -55261 36676 275128 90982 34898 36468 73344 132179 360468
13259C60468j34213P945L4119C9718K41378j16449A4865L56656D6617J52494r6325
$$ 360468 226255 234200 268319 39718 281096 164647 14865 371521 46617 199111 102786
13248A02786D7396M1029J29373J02822a06636B00886a72368A8095M10516I0486
$$ 102786 47396 88425 217798 320620 -106636 200886 -172368 18095 428611 90486
13237B9767J24873b41861K7577A49669F5339a01576B7128j3391K5773q685K29035
$$ 29767 154640 -241861 -214284 149669 65339 -101576 27128 13737 39510 30825 259860
13226B59860a66945E4088f2766I4177K3900O548n6044j6627P7758L23208j07909
$$ 259860 -166945 54088 -62766 94177 118077 124625 68581 51954 129712 452920 345011
13215C45011C4629a15780l3046A06278K49464j40876B920J62053B188O9105Q6582
$$ 345011 34629 -115780 -148826 106278 355742 214866 2920 164973 2188 71293 157875
13204A57875o4641J42965q6761c4536B04613N6317M0443F1731K9836a61478N2255
$$ 157875 93234 236199 149438 -34536 204613 260930 301373 61731 91567 -161478 -109223
13193a09223A53896K42634G6021j8812f8208l1459A39434J21846m803m5998a70990
$$ -109223 153896 396530 76021 57209 -68208 -99667 139434 261280 256477 210479 -170990
13181C5632K85649I0114a85861D21938g3917j79203C52406A15253J7333h4193
$$ 35632 321281 90114 -185861 421938 -73917 -253120 352406 115253 132586 -84193
13170A99001l9433B1607M6303J11575D0459R0545J05122i9002C19740F738J19347
$$ 199001 159568 21607 67910 179485 40459 131004 236126 -99002 319740 6738 126085
13159A26085b29224B28372h2696e736A56414O1666q3704a06738G906a03986D4135
$$ 126085 -229224 228372 -82696 -5736 156414 218080 134376 -106738 7906 -103986 44135
13147A12860i9716C68351H9694N2201m1385b69212G5773J1003J48517b02342D06674
$$ 112860 -99716 368351 89694 141895 100510 -269212 75773 86776 235293 -202342 406674
13135A20948N49804D7206i394B31466H1313M3236e2078A42475b24790A01446d8077
$$ 120948 670752 47206 -9394 231466 81313 124549 -52078 142475 -224790 101446 -48077
13123b7695r8100B30594a45125f2616k114C88254A73639J18873A32286m8700D0505
$$ -27695 -125795 230594 -145125 -62616 -64730 388254 173639 292512 132286 83586 40505
13111E68704B44777c88628r0754e0402j2020B8638b15619k9604A51627a61649
$$ 568704 244777 -388628 -479382 -50402 -62422 28638 -215619 -245223 151627 -161649
13100f0103B62396J05478C6365R7625a73989A60755g0691A26418l5117b6596C5670
$$ -60103 262396 367874 36365 133990 -173989 160755 -70691 126418 91301 -26596 35670
13088d1646a5164p1146F6813b05576F3285h8209k5582n0245j9206e0538B6085
$$ -41646 -15164 -86310 66813 -205576 63285 -88209 -113791 -164036 -183242 -50538 26085
13076A70146a04004A6282M4090J65244C1968b865j93637C9055J8849R8445R4444
$$ 170146 -104004 16282 60372 225616 31968 -2865 -196502 39055 57904 156349 250793
13065B50793a54169B65281b08268A25397E7084K95379B3739G081J77528E1792
$$ 250793 -154169 265281 -208268 125397 57084 352463 23739 7081 184609 51792
13054D7818L6889c5559k65357B33990q0904n1615J77378d3350J9974G2491M6248
$$ 47818 84707 -35559 -300916 233990 153086 101471 278849 -43350 -23376 72491 118739
13043A18739g1984B60395G8108d460E9472M0331C4085J57929m2626m6020b22875
$$ 118739 -71984 260395 78108 -4460 59472 99803 34085 192014 149388 103368 -222875
13031C07504F3881j3296J84694N3213J02210B8188f4162I0688J95424a93014A3146
$$ 307504 63881 50585 235279 288492 390702 28188 -64162 90688 286112 -193014 13146
13019A93416q3142c44784R557C30814n4470c6245C54606C7260K2323K12392h938
$$ 193416 110274 -344784 -335227 330814 276344 -36245 354606 37260 59583 271975 -8938
13007E682O3976J72425J78628A45810a00891G8718j1218Q1841o4060Q3000l6644
$$ 5682 69658 242083 420711 145810 -100891 78718 67500 149341 85281 168281 131637
12996A31637a40520C47877N4859D9335f8274G7689R2295a09673F811e9934j12081
$$ 131637 -140520 347877 402736 49335 -68274 77689 169984 -109673 6811 -59934 -172015
12985a72015B40614N7728E6602J17480n8148o313a6915j41204C3511a49622I6821
$$ -172015 240614 298342 56602 174082 115934 109621 -16915 -158119 33511 -149622 96821
12973I1737f9526A94766K09418A91027c10068i3293B08449K95205f4037k38405
$$ 91737 -69526 194766 404184 191027 -310068 -93293 208449 503654 -64037 -302442
12963c02442A73407G6184J74469L0750b64059i7501i189o073l0135n4298A76122
$$ -302442 173407 76184 250653 281403 -264059 -97501 -9189 -15262 -45397 -99695 176122
12951B78924b8765B3589a23223l3054f5902B10399H9630b5115D12625b12775c4485
$$ 278924 -28765 23589 -123223 -156277 -65902 210399 89630 -25115 412625 -212775 -34485
12939A69017q2460L02269a34082j87666h7813R434o8056F6715J45552a19022A83589
$$ 169017 86557 388826 -134082 -321748 -87813 -78379 -146435 66715 212267 -119022 183589
12927a52821H971a06111A66357J2958D8822a55943j20026B67362a21790b6725
$$ -152821 8971 -106111 166357 179315 48822 -155943 -275969 267362 -121790 -26725
12916B73623J02785o8831D2928J77667a60313f9027P997E103N6558L831b67869
$$ 273623 376408 307577 42928 220595 -160313 -69027 -61030 5103 61661 65492 -267869
12904g1242j23008A1304a27624A41385J07615n8839m6293c6632j93988Q0737C15213
$$ -71242 -194250 11304 -127624 141385 249000 190161 143868 -36632 -230620 -149883 315213
12892C3837Q2322c13999i7868a581H2821L5061C6927L7455a9915l574A37682a37166
$$ 33837 116159 -313999 -97868 -1581 82821 117882 36927 74382 -19915 -23489 137682 -137166
12879b03763D914M23153P8021A7370a46398A83046C8618J44161a69674A24255
$$ -203763 4914 428067 506088 17370 -146398 183046 38618 182779 -169674 124255
12868H5429f3137B791M78041b96742d6447A00203J84528c5246B07367d8239A01650
$$ 85429 -63137 2791 480832 -296742 -46447 100203 284731 -35246 207367 -48239 101650
12856a32908B189h7481k4792C57520A42864O3663H9109a58574l5382e7775C34047
$$ -132908 2189 -87481 -112273 357520 142864 206527 89109 -158574 -193956 -57775 334047
12844a61442A92285Q2825D9059d5033C16247c09699C01008a220E37626b17301
$$ -161442 192285 275110 49059 -45033 316247 -309699 301008 -1220 537626 -217301
12833F9817A1939K05951d104j95593D13865b57854A74746b59273A4400f8755b2899
$$ 69817 11939 217890 -4104 -199697 413865 -257854 174746 -259273 14400 -68755 -22899
12821A22642J47370c9330j01836b321j22889A02655J04805r4850K7880L4754d7410
$$ 122642 270012 -39330 -141166 -2321 -125210 102655 207460 112610 140490 175244 -47410
12809F5882i0075A51059d9686k38355b5518r4318B23563q3441E4383a20364B1262
$$ 65882 -90075 151059 -49686 -288041 -25518 -119836 223563 140122 54383 -120364 21262
12797B14587a47615B63434C7012d0450j05351K3516G723a07404B01g8950D4775
$$ 214587 -147615 263434 37012 -40450 -145801 -122285 7723 -107404 201 -78950 44775
12785d7655H9516c5736A14422j2949M9090f2373B8356K26194c47681J55563J3011
$$ -47655 89516 -35736 114422 101473 150563 -62373 28356 254550 -347681 -192118 -179107
12774a79107f2624n6019B57520a65640b1950D9051a1107l26272P4383c7060A86301
$$ -179107 -62624 -118643 257520 -165640 -21950 49051 -11107 -337379 -262996 -37060 186301
12762a03558k565o2236P783G7082B3063a2339A39078a39359F6137J54305G1522
$$ -103558 -106123 -168359 -160576 77082 23063 -12339 139078 -139359 66137 220442 71522
12750a13892l42073a94020O6026A94852i2257k2792A45644D3811i8752j41235
$$ -113892 -455965 -194020 -127994 194852 -92257 -115049 145644 43811 -98752 -239987
12740b39987R0425k29617C6950P0318J98826A14727b75899E9150L9801d61717
$$ -239987 -149562 -379179 36950 107268 306094 114727 -275899 59150 98951 -461717
12729A58508c22678I4189C7035P8f2767A84871K7959G8384f1408K7458B01355
$$ 158508 -322678 94189 37035 37113 -62767 184871 212830 78384 -61408 -33950 201355
12717h8022E6767g7793j10563B52291A2818J45442K1473F1093O0671c28410g155
$$ -88022 56767 -77793 -188356 252291 12818 158260 179733 61093 121764 -328410 -7155
12705b30703H6198I859a67181I0093j9385B9948K52788Q8924j28939N2221a7562
$$ -230703 86198 9859 -167181 90093 70708 29948 282736 371660 242721 294942 -17562
12693g4624A93058M9905A18463k0629O7135J02417j4652A08724j0599C4279J82573
$$ -74624 193058 242963 118463 97834 164969 267386 252734 108724 98125 34279 216852
12682B16852o4322G3296J02658l7135K06480b24355A43543g9614c3202I1196L5437
$$ 216852 152530 73296 175954 138819 345299 -224355 143543 -79614 -33202 91196 126633
12671A26633e9731B95741h530E24614A31310E1253h9205A04128d3772A651a92787
$$ 126633 -59731 295741 -8530 524614 131310 51253 -89205 104128 -43772 1651 -192787
12659B05145b79348G6657N4674J37313l4753q8962f9447C75482I967J48721h2302
$$ 205145 -279348 76657 131331 268644 233891 144929 -69447 375482 9967 158688 -82302
12647B2089g1673A47852a04738L4002A03074k989D856L08704A53794B5435J9082
$$ 22089 -71673 147852 -104738 -70736 103074 100085 4856 313560 153794 25435 44517
12636D4517o355b33716e1435F8970R1212Q5613j10212O9268a86457D51784a14565
$$ 44517 38162 -233716 -51435 68970 160182 245795 135583 204851 -186457 451784 -114565
12624F8856J30384I3646a07277j47695Q3647B7650C75a83766D09881i396A0268
$$ 68856 199240 93646 -107277 -254972 -171325 27650 375 -183766 409881 -9396 10268
12612B03852I8554Q7124a00800h419A3494J79254a36141A21876n7146J71424a57981
$$ 203852 98554 185678 -100800 -8419 13494 192748 -136141 121876 64730 236154 -157981
12600a00657G4035K51797i0451B42495H0072h3435C12405c5558D51591a7280A3408
$$ -100657 74035 325832 -90451 242495 80072 -83435 312405 -35558 451591 -17280 13408
12588C81517a7760j18703C7515j717a50654k8316E0337A7795R8050O6595g143
$$ 381517 -17760 -136463 37515 35798 -150654 -178970 50337 17795 115845 182440 -7143
12576D310h2326B86966j2430k2105r1263E7467E768b1125F7419c0817I8291J05681
$$ 4310 -82326 286966 274536 252431 161168 57467 5768 -21125 67419 -30817 98291 203972
12564B03972P2116C0430K76451A4109K15129c84900F4591K19698a7226G0346b68784
$$ 203972 276088 30430 306881 14109 229238 -384900 64591 284289 -17226 70346 -268784
12552I4063J34924A3640M5902c00374J37364K3669A22444j3234a21386A04155
$$ 94063 228987 13640 59542 -300374 -163010 -139341 122444 109210 -121386 104155
12541B2260d78464e8212B10147b57032f4351E7017a98481q3798j48810H7552C5624
$$ 22260 -478464 -58212 210147 -257032 -64351 57017 -198481 -282279 -431089 87552 35624
12529C02332H5024J18928D3919e1863A39837F8337J5547K9947C0564i9731E8936
$$ 302332 85024 203952 43919 -51863 139837 68337 83884 113831 30564 -99731 58936
12517c22510H4375q827L7690a34998c6396p000B46327b284l5005k25503A62698
$$ -322510 84375 75548 113238 -134998 -36396 -43396 246327 -2284 -37289 -262792 162698
12505g9460q5522c5910r5367B20808b0544q9250c7502C9001i0072A0874R7620
$$ -79460 -164982 -35910 -131277 220808 -20544 -109794 -37502 39001 -90072 10874 108494
12494A08494L65k0590a3799A9058b65730E4949b35411P3854A48900b2724l4181
$$ 108494 108859 88269 -13799 19058 -265730 54949 -235411 -161557 148900 -22724 -56905
12483e6905F5329f6626E4696M01309a49878r2023h8970i534B2211K97347b53902
$$ -56905 65329 -66626 54696 456005 -149878 -241901 -88970 -9534 22211 319558 -253902
12471a84976E4485b9877G7926d20373b5791j45446B8460d1336I1017a22721A9802
$$ -184976 54485 -29877 77926 -420373 -25791 -171237 28460 -41336 91017 -122721 19802
12459A0347K50001b63092d2894B1271J05281b3027j15828O6900B39289n4776J5089
$$ 10347 260348 -263092 -42894 21271 126552 -23027 -138855 -71955 239289 184513 199602
12448A99602J28672H7177m299a1158j87700A78433J48729E902i7899B5510J79697
$$ 199602 328274 87177 82878 -11158 -198858 178433 327162 5902 -97899 25510 205207
12437B05207I1786a96090k6050K5115F5256B8343J48906M2942b96979a5586k81730
$$ 205207 91786 -196090 -222140 -197025 65256 28343 177249 220191 -296979 -15586 -297316
12426b97316B84567e9208j32530q648f8751I1181j4883b40684D2481L03537n5953
$$ -297316 284567 -59208 -191738 -200386 -68751 91181 76298 -240684 42481 346018 290065
12415B90065a75883k56372f8242k00476a20632q4021m6710F494J61902f5636r7703
$$ 290065 -175883 -432255 -68242 -268718 -120632 -204653 -251363 6494 168396 -65636 -163339
12404a63339a1438A14757l6756l0527J38715A0344b50411a8605j66269c6750E3795
$$ -163339 -11438 114757 78001 47474 186189 10344 -250411 -18605 -184874 -36750 53795
12392B17397A01306D0477R0945a28014K1602m9864j2637A8640J06143a6467l24596
$$ 217397 101306 40477 131422 -128014 -106412 -156276 -168913 18640 124783 -16467 -341063
12381c41063g6425A89936a65016A57260j3210G1511l2497a26544l4684o2796G8189
$$ -341063 -76425 189936 -165016 157260 144050 71511 39014 -126544 -161228 -224024 78189
12369a0674n6745A24941b05979B0703a02661I8855c1009I8391J7309C2135K00059
$$ -10674 -67419 124941 -205979 20703 -102661 98855 -31009 98391 115700 32135 232194
12358B32194b3349A6172c08122F8208M9468a0055j3169o933J2928B02717N4894
$$ 232194 -23349 16172 -308122 68208 117676 -10055 -23224 -30157 -17229 202717 257611
12347B57611d9332G7772a84327I5625b64283d5826B66614g6643B55633B1643b44776
$$ 257611 -49332 77772 -184327 95625 -264283 -45826 266614 -76643 255633 21643 -244776
12335a03452D7153L6323b29638a01718D7999J23460b0685C03174A17531a23826
$$ -103452 47153 83476 -229638 -101718 47999 171459 -20685 303174 117531 -123826
12324A08153a60133F6883g3037D5198a86218C05828C33K29568g1050A20014b5754
$$ 108153 -160133 66883 -73037 45198 -186218 305828 333 229901 -71050 120014 -25754
12312f3725D48517c6606B3479J18581c6061C37346q9175F4680a17601A54944j7138
$$ -63725 448517 -36606 23479 142060 -36061 337346 248171 64680 -117601 154944 137806
12301A37806o1794P5838C6992J91564J71658B1537L75080B6816a03289B1434L6034
$$ 137806 76012 151850 36992 228556 400214 21537 396617 26816 -103289 21434 57468
12290E7468B6216n18K08883i033A59961b26374e9567c539A30477a00362b8474
$$ 57468 26216 25698 234581 -9033 159961 -226374 -59567 -3539 130477 -100362 -28474
12278C3499N2087e3222l694B39948A15265l2164a5046C54926H2736K911d7356
$$ 33499 85586 -53222 -56916 239948 115265 83101 -15046 354926 82736 85647 -47356
12266A12555e6772A13327b9355A6847b3074A9578N16522A57955f9392B86191K0196
$$ 112555 -56772 113327 -29355 16847 -23074 19578 536100 157955 -69392 286191 306387
12255C06387a5207D8923K99731E8636K61752k3964E1573f0550A43458a83766G1833
$$ 306387 -15207 48923 348654 58636 320388 296424 51573 -60550 143458 -183766 71833
12243I2244e1097D60234B28296J07021j53999K22924A10716a8322k59005A79769
$$ 92244 -51097 460234 228296 335317 181318 404242 110716 -18322 -277327 179769
12232A06121b5390C15119n9495b44239A46328O4681b0084B48727j02216c4238
$$ 106121 -25390 315119 255624 -244239 146328 211009 -20084 248727 146511 -34238
12221f8137A84000n3026J6052c0784A8282K33387I736D0c1539A29356h3389D33232
$$ -68137 184000 130974 147026 -30784 18282 251669 9736 40 -31539 129356 -83389 433232
12208A51534J1239h4714F09958b1211j4520C037M91682b7884A49263J44663H4395
$$ 151534 162773 -84714 609958 -21211 -35731 3037 494719 -27884 149263 293926 84395
12196B11541K21437C4756c64948F6833A2496b27580N1836B65144a71516A03258
$$ 211541 432978 34756 -364948 66833 12496 -227580 -175744 265144 -171516 103258
12185A20431J76784A39641J16680R4545f6781A59258K14287A40298j4015a08443
$$ 120431 297215 139641 256321 350866 -66781 159258 373545 140298 126283 -108443
12174D2120J12196B1578J66527Q9317P8394r8596B6135K54392a29439D6463K02313
$$ 42120 154316 21578 188105 277422 355816 257220 26135 280527 -129439 46463 248776
12163B48776m5588D8658A6675Q0769h9221B71627r3982c3747p7949A8705h5294
$$ 248776 203188 48658 16675 97444 -89221 271627 177645 -33747 -111696 18705 -85294
12151B09516m1506l245K25623A39299J87455d5765A68467l5982J79605m1072j16097
$$ 209516 168010 164765 390388 139299 326754 -45765 168467 132485 312090 271018 154921
12140A54921F1585R4006h90B93189k0867a54339f6391C26241j40525m8209m7484
$$ 154921 61585 155591 -890 293189 272322 -154339 -66391 326241 185716 137507 90023
12129I0023K6131n7600J5140J0794J64103B8275K6377c48250i631C5382K59314
$$ 90023 116154 58554 73694 84488 248591 28275 54652 -348250 -9631 35382 294696
12118B94696a55660B0958c40067C75676A76402C4253f0832n1909B15460h6426
$$ 294696 -155660 20958 -340067 375676 176402 34253 -60832 -112741 215460 -86426
12107D860a8056D8551J48954J13516H2070J38741O1693J56051a15985A72806N3222
$$ 4860 -18056 48551 197505 311021 82070 220811 282504 438555 -115985 172806 226028
12096B26028B8783J05743e090A26348J35518b08383B2354f0970B83048A20995
$$ 226028 28783 134526 -5090 126348 261866 -208383 22354 -60970 283048 120995
12085B57625A03815b9062a0466B0710L44579F9246K9845O04271B51043a01668
$$ 257625 103815 -29062 -10466 20710 365289 69246 99091 703362 251043 -101668
12074D25095a08415B70449Q8365b9024B21330C5806Q7223K28073j58621J49627
$$ 425095 -108415 270449 358814 -29024 221330 35806 123029 351102 192481 342108
12064C42108o4223o3747M4908k0518b42087h714k54485A24054i574A53991c4729
$$ 342108 277885 214138 259046 238528 -242087 -8714 -263199 124054 -9574 153991 -34729
12052B06760d9922B06374a9740C12518a2273C24387a31330E186Q3924a49285M3930
$$ 206760 -49922 206374 -19740 312518 -12273 324387 -131330 5186 89110 -149285 -105355
12041a05355M6712m4151A72978a2957j77489G5340b272D09354a49430F8453c27041
$$ -105355 -58643 -102794 172978 -12957 -190446 75340 -2272 409354 -149430 68453 -327041
12029A66169K9638Q7615H0492b37976C8444O917M254d4474o2671H9444a9886B22604
$$ 166169 195807 283422 80492 -237976 38444 45361 49615 -44474 -107145 89444 -19886 222604
12016A06540L04659o356A41781d1015I546L08075j12688G3030a25577E2604d4812
$$ 106540 411199 404843 141781 -41015 9546 317621 204933 73030 -125577 52604 -44812
12004F2132k9503a81175A13405L1677c83398c6647b809j08833J7772C9841i337
$$ 62132 32629 -181175 113405 145082 -383398 -36647 -2809 -111642 -93870 39841 -9337
11992E9085A3966e5793E25856A69027a46127A34611D6890o529g1807k75836B31539
$$ 59085 13966 -55793 525856 169027 -146127 134611 46890 40361 -71807 -347643 231539
11980B19888d1023j86897g934j22774q917A58700K68723A18548m4561a29416G0767
$$ 219888 -41023 -227920 -7934 -130708 -139625 158700 427423 118548 73987 -129416 70767
11968c18626B8458i8198k16234A03815a23083B82434H1491a16990r3321F4767
$$ -318626 28458 -98198 -314432 103815 -123083 282434 81491 -116990 -210311 64767
11957A91525b8887a1698A62786o4150b08773c5725H2572c1138o653j09616A88397
$$ 191525 -28887 -11698 162786 98636 -208773 -35725 82572 -31138 -37791 -147407 188397
11945A9365J09892d9831k878A54645o817l2935c31593C35352a23472K6809j0219
$$ 19365 129257 -49831 -52709 154645 147828 114893 -331593 335352 -123472 -96663 -106882
11934a06882B6201a29161A6379b32571C49250g8988K8301o8194E0065a08861j14799
$$ -106882 26201 -129161 16379 -232571 349250 -78988 -50687 -118881 50065 -108861 -223660
11923b23660d9017D78888H3098d60214b0497B31165D032b55137j05147B50505
$$ -223660 -49017 478888 83098 -460214 -20497 231165 4032 -255137 -360284 250505
11912A21289i6143E6683a80798R011q2222j26186J41800B6922e5991j33054P3848
$$ 121289 -96143 56683 -180798 -171787 -254009 -380195 -238395 26922 -55991 -189045 -115197
11901a15197A31467o4703a11505B2603b86336a06062A2724J49172p7298b45318
$$ -115197 131467 66764 -111505 22603 -286336 -106062 12724 161896 84598 -245318
11890a47095A77950K08162A23091c76797J08676J3493A11793K03045b52301J25297
$$ -147095 177950 386112 123091 -376797 -268121 -254628 111793 314838 -252301 -127004
11880a27004k44596C74176c0859j11564O8199B02139C5500b42021O9523A07419
$$ -127004 -371600 374176 -30859 -142423 -74224 202139 35500 -242021 -172498 107419
11869f06911A75645a26999j8258A72316m5829C0073d5618A90285G1266a45177
$$ -606911 175645 -126999 -145257 172316 126487 30073 -45618 190285 71266 -145177
11858b40670E6124a34623M6420A48379a29594F3455K16348i6785G6893A4360L26213
$$ -240670 56124 -134623 -88203 148379 -129594 63455 279803 -96785 76893 14360 340573
11847C40573d43A11049a83562L2427C2911a42144d9470k73897A83166i393m1198
$$ 340573 -443 111049 -183562 -151135 32911 -142144 -49470 -323367 183166 -9393 -50591
11836e0591b2004k06827I7011Q9168g762H3226k1957b77904g6589K0079m6222
$$ -50591 -22004 -228831 97011 186179 -7762 83226 61269 -277904 -76589 -56510 -102732
11825a02732G5093k9482K34671m2582I863a4645B9955d03725H2217h4564m5291
$$ -102732 75093 45611 280282 237700 9863 -14645 29955 -403725 82217 -84564 -129855
11814a29855b8330A48176i2383j1813d3720k12268E3818i7094o2721O2872H2587
$$ -129855 -28330 148176 -92383 -104196 -43720 -255988 53818 -97094 -159815 -96943 82587
11802A4521O2330d9173k64512j775a20715I139J85255H0290a23116f491k21283
$$ 14521 76851 -49173 -313685 -315460 -120715 9139 194394 80290 -123116 -6491 -227774
11791b27774A34574M4418a00698j21111A56412a25906C1161a16325M9394B348
$$ -227774 134574 178992 -100698 -221809 156412 -125906 31161 -116325 -66931 2348
11780a19904i962A25890g8062j10045F4603c69873A40708K7729j4943b18808j51759
$$ -119904 -9962 125890 -78062 -188107 64603 -369873 140708 168437 153494 -218808 -370567
11769c70567J21378G4275J64134e3391j10438g687A09196K28128e7893A52870
$$ -370567 -249189 74275 238409 -53391 -163829 -7687 109196 337324 -57893 152870
11758G6791a37656f4960J6432A1996b7461j88097g3087C3967N5630k0892b28564
$$ 76791 -137656 -64960 -48528 11996 -27461 -215558 -73087 33967 89597 68705 -228564
11746A33645A9098a08257j9586A49585C9903a7101E2677a32858j5715b6961j15124
$$ 133645 19098 -108257 -127843 149585 39903 -17101 52677 -132858 -148573 -26961 -142085
11735a42085I3716h2641j1906J6627B61921A14078b1010j62193L2940j38452k14895
$$ -142085 93716 -82641 -94547 -77920 261921 114078 -21010 -183203 -150263 -288715 -503610
11724e03610d8668G7064k0615i8042H7265O1952E6382l134A5928h8843j04577
$$ -503610 -48668 77064 56449 -98042 87265 149217 56382 53248 15928 -88843 -193420
11713a93420g05A15826C4911Q5565J647B7490a58870J8526A01141e2495k0734
$$ -193420 -705 115826 34911 120476 122123 27490 -158870 -140344 101141 -52495 -73229
11702g3229A9434g2871j43723B85718m3949b85340c1942p328j44758E5287g2113
$$ -73229 19434 -72871 -216594 285718 241769 -285340 -31942 -39270 -184028 55287 -72113
11690c5576a599A49457K61265e4483A32099h0022j3897A22209b19245M3056E60
$$ -35576 -1599 149457 410722 -54483 132099 -80022 -93919 122209 -219245 -176189 560
11678B7981J40144m4591C4847K15822j14116F0013L85820a02626o5378J3702A54229
$$ 27981 168125 123534 34847 250669 136553 60013 445833 -102626 -168004 -154302 154229
11666b74535C41972j24859a10517A09007O5368a91626b1561B93992J98057j41984
$$ -274535 341972 217113 -110517 109007 174375 -191626 -21561 293992 492049 350065
11656C50065a7133m4624l9828B18200F4988a51850d0279k33769B00233a49625
$$ 350065 -17133 -61757 -101585 218200 64988 -151850 -40279 -274048 200233 -149625
11645a67388f9289j21233D01163a2291q2325k20051J10968B38673f4918A67786
$$ -167388 -69289 -190522 401163 -12291 -94616 -314667 -203699 238673 -64918 167786
11634a55321j1579h1464A87836g8188B14002M5053j05772d54450B22442G5743
$$ -155321 -166900 -81464 187836 -78188 214002 259055 153283 -454450 222442 75743
11623a83066B6731a65227F5812c3893D0350g8069k8632b2633k16236A27713b47853
$$ -183066 26731 -165227 65812 -33893 40350 -78069 -106701 -22633 -238869 127713 -247853
11611a24939a3513j22192H6667j9976L6152a97663h1875l5083A89379g2591A71606
$$ -124939 -13513 -135705 86667 66691 102843 -197663 -81875 -116958 189379 -72591 171606
11599e06105a29952A25927c2186j59198N4152C3521J49021k3981J6122A668J63675
$$ -506105 -129952 125927 -32186 -191384 -137232 33521 182542 158561 174683 1668 165343
11588A65343R6810a44669a5041B51979h9463i177D9322a22722B01563C7753K62537
$$ 165343 262153 -144669 -15041 251979 -89463 -9177 49322 -122722 201563 37753 300290
11577C00290g2842B905J52490a7740B2864J54636K0513C40b90677F4807M7292
$$ 300290 -72842 2905 155395 -17740 22864 177500 198013 340 -290677 64807 112099
11566A12099a22256C70603a70587k1437Q6870E9105c7254C4232K2339a2377C16779
$$ 112099 -122256 370603 -170587 -192024 -105154 59105 -37254 34232 56571 -12377 316779
11554C0372L88931a30950A90036e4712F3293K15013O2314A25022e6980A03648
$$ 30372 419303 -130950 190036 -54712 63293 278306 340620 125022 -56980 103648
11543A92889a4841E9744R4396g9892j5990F5739a76846A72472q5577b49254B44302
$$ 192889 -14841 59744 154140 -79892 -95882 65739 -176846 172472 86895 -249254 244302
11531A44863b55548O8254M3850B92101j3457a86673l9089D41119A30838L52868
$$ 144863 -255548 -187294 -143444 292101 278644 -186673 -225762 441119 130838 483706
11521D83706A39200a6932A8284K05612c33893B3684J97464a87379C5331j3036
$$ 483706 139200 -16932 18284 223896 -333893 23684 221148 -187379 35331 22295
11511B2295J78229a93639A6899a41546C0473Q4264b70513c7720C15783m0236M2879
$$ 22295 200524 -193639 16899 -141546 30473 114737 -270513 -37720 315783 275547 318426
11500C18426m7245c5673m0594A57162P4109a5477l9234o549B50368f2485D8272
$$ 318426 271181 -35673 -76267 157162 231271 -15477 -54711 -61260 250368 -62485 48272
11488B44184H6097B4836a70875A58287o0826J89480o4079r8360a1285C39819M4251
$$ 244184 86097 24836 -170875 158287 97461 286941 222862 124502 -11285 339819 384070
11477C84070a43477A93663I4263i7706A92986d3588I4981m6001J7850k6275K35138
$$ 384070 -143477 193663 94263 -97706 192986 -43588 94981 48980 66830 40555 275693
11466B75693a45380C18804p4082p1767b05091R3910A79693C1657a03208C05524
$$ 275693 -145380 318804 244722 172955 -205091 -111181 179693 31657 -103208 305524
11455D9558P4388a09096C5679K53852E0771j7548M53803C7476J51130h3435B76631
$$ 49558 123946 -109096 35679 289531 50771 33223 487026 37476 188606 -83435 276631
11443i2221A80573d8435A93959k397q0824b5954j81596A71977n3079K2341J63248
$$ -92221 180573 -48435 193959 191562 110738 -25954 -207550 171977 118898 141239 304487
11432C04487a28181B94112I595Q8195a7610o5778c9524j5086c221k59079A80261
$$ 304487 -128181 294112 9595 97790 -17610 -83388 -39524 -54610 -3221 -262300 180261
11420B92207A3945c6008p8690B24273Q5091h2813L5432F1085L48361A03627k7890
$$ 292207 13945 -36008 -114698 224273 309364 -82813 -47381 61085 409446 103627 75737
11409G5737b14538R1647A38563B8869K894K7061c4400G7452L9568b49200A57329
$$ 75737 -214538 -122891 138563 28869 31763 58824 -34400 77452 117020 -249200 157329
11397C7922J16327N3996A6540L4342b87822a37079C1681J2708b42173o048E4962
$$ 37922 154249 208245 16540 50882 -287822 -137079 31681 44389 -242173 -248221 54962
11385I9583P3795J9862E2647a11751j33089F3653J62084d75160a30232c1021A63072
$$ 99583 173378 193240 52647 -111751 -244840 63653 225737 -475160 -130232 -31021 163072
11373C96752b7348j9800j95120B3369g836k8767o4827m8377d2650A89629a19589
$$ 396752 -27348 -47148 -242268 23369 -7836 -36603 -101430 -149807 -42650 189629 -119589
11361f794A18622N1530a3112I6487K19722a20550e0319m0041K0885q4041H9587
$$ -6794 118622 170152 -13112 96487 316209 -120550 -50319 -90360 -69475 -153516 89587
11349b01955G2526e3237j0477K0387j82856H1679a96251C28566j20064a14548
$$ -201955 72526 -53237 -63714 -43327 -226183 81679 -196251 328566 208502 -114548
11338E772J62239b85780A9578J1919c23848J16269B01385r3336K12974B1175f2980
$$ 5772 168011 -285780 19578 31497 -323848 -207579 201385 108049 321023 21175 -62980
11326b6323F4868a85975m4100H9853O8777o951J25734a37376A84859b9081j08697
$$ -26323 64868 -185975 -230075 89853 158630 151679 277413 -137376 184859 -29081 -137778
11315a37778C77893A14280n6274Q9062h4956A58656C2520a77656n3887A17196
$$ -137778 377893 114280 58006 147068 -84956 158656 32520 -177656 -231543 117196
11304B03921a39088j4050j0436j91845F5414A0172J06525b62518f8742j49053
$$ 203921 -139088 -153138 -163574 -355419 65414 10172 116697 -262518 -68742 -217795
11294b17795l5017d4681n8437A04229J10984b40405i2774r2247D03021h6830j04444
$$ -217795 -252812 -44681 -103118 104229 215213 -240405 -92774 -185021 403021 -86830 -191274
11283a91274K012f381B37384a45401A02960a9416A01238b14347p0622A41929b50195
$$ -191274 -189262 -6381 237384 -145401 102960 -19416 101238 -214347 -284969 141929 -250195
11271a06724G1528O7907e9175J8672G1738c12672D8928b72309h678k1793A83131
$$ -106724 71528 139435 -59175 -40503 71738 -312672 48928 -272309 -8678 -30471 183131
11259b55523B12061a25467F9627a19733d7184J2462B36107b64927b7245j13222
$$ -255523 212061 -125467 69627 -119733 -47184 -34722 236107 -264927 -27245 -140467
11249a40467a1952o1096B45891i6376r7088G6756J11352g755j3901H4621a27782
$$ -140467 -11952 -73048 245891 -96376 -193464 76756 188108 -7755 -21656 84621 -127782
11237B88781a65677C87033j61211c41774k0004j59987A86553a29292B6451M3570
$$ 288781 -165677 387033 225822 -341774 -361778 -521765 186553 -129292 26451 70021
11227G0021b50562F7234j9383A5470b25243P6845L1641c0349A1267J59549a91013
$$ 70021 -250562 67234 47851 15470 -225243 -148398 -116757 -30349 11267 170816 -191013
11215d21287J14865a05065k75782B53230a67696j23396B12935d6012b0802q9209
$$ -421287 -306422 -105065 -380847 253230 -167696 -291092 212935 -46012 -20802 -110011
11205a10011l1218j82683a17114k32948I5456a76917c7571B21168b83465F5621
$$ -110011 -141229 -323912 -117114 -350062 95456 -176917 -37571 221168 -283465 65621
11194D4814b59284h205j04830k48259A98584b81860B27636a35065A30385E725
$$ 44814 -259284 -8205 -113035 -361294 198584 -281860 227636 -135065 130385 5725
11183a75965B6285J14746e5415j84103A32886R6033D9868a93620h2400r348k13559
$$ -175965 26285 141031 -55415 -239518 132886 228919 49868 -193620 -82400 -91748 -305307
11172c05307K4419J25610B13492b73841e6242H6122a83851B05505h9170A15917
$$ -305307 -280888 -155278 213492 -273841 -56242 86122 -183851 205505 -89170 115917
11161b62910N2050e6990B09584d49442G9340d1549j8989j91553A50764C8359P7134
$$ -262910 -210860 -56990 209584 -449442 79340 -41549 -60538 -252091 150764 38359 115493
11150A15493g1579j8275d931j34338A28111d0370f430l61382J21653C787a81586
$$ 115493 -71579 -89854 -4931 -139269 128111 -40370 -6430 -367812 -246159 3787 -181586
11138A7812f2643I7262a07640B41357E1024Q6665i1580N228C95596A93368f2756
$$ 17812 -62643 97262 -107640 241357 51024 137689 -91580 -86352 395596 193368 -62756
11126a4503p9669A02816b14760L9613B4607J00428B1585a4777B5483i5070k6819
$$ -14503 -94172 102816 -214760 -175147 24607 125035 21585 -14777 25483 -95070 -121889
11115a21889d7757D7197q233L8059g2032E2245K3907J68559o8426a6221B21244
$$ -121889 -47757 47197 38964 77023 -72032 52245 76152 244711 176285 -16221 221244
11103h2948A42826J68841a75521A56057p4095L3822A9739J57790D5878Q2723j5181
$$ -82948 142826 311667 -175521 156057 81962 115784 19739 177529 45878 128601 113420
11092A13420k8159J12364A2149a52010H0574K16841G0574J2764K07939a1196C33146
$$ 113420 85261 197625 12149 -152010 80574 297415 70574 83338 291277 -11196 333146
11080b8316j08449l3009C28182j35650a66073B45331j569j0729G0491p981e0465
$$ -28316 -136765 -169774 328182 192532 -166073 245331 243762 233033 70491 62510 -50465
11068c1236D81511j86764P1341K10027a1689A70519K4819o2289m896g0313F13914
$$ -31236 481511 294747 366088 576115 -11689 170519 195338 133049 128153 -70313 613914
11056A83043J52432d4887j1996B85032Q19a83967B74074J86395e4499B67426E153
$$ 183043 335475 -44887 -56883 285032 285851 -183967 274074 460469 -54499 267426 5153
11044E88848B65689J41999l6390J9859j37178L31696J32809j0162C47882J49083
$$ 588848 265689 407688 371298 391157 253979 585675 718484 708322 347882 496965
11034D96965B15193J80972j064q966J34982N9905N7923j14832j94108L28374k7070
$$ 496965 215193 396165 395101 386135 521117 581022 638945 524113 330005 658379 631309
11023F31309L77376D08256L27585O8326J23086m15526J96688A52993K69602Q1511
$$ 631309 1008685 408256 735841 804167 927253 511727 708415 152993 422595 504106
11013E04106p5612L20949k75927J27765M1486J03547K429j31057j67970O7954
$$ 504106 428494 749443 473516 601281 642767 746314 748743 617686 449716 517670
11003E17670J06202o9847j6491j65128L6833j06477Q2108K18032j3258o0196m835
$$ 517670 623872 554025 537534 372406 409239 302762 384870 602902 589644 529448 524613
10992E24613n7078j98798j11525J21962J71532M9245q438O828j03033K16698j16072
$$ 524613 467535 268737 157212 279174 450706 499951 491513 498341 395308 612006 495934
10981D95934R8679k82320J55091J22272j55111l5594L40952r4602Q8745C34294
$$ 495934 594613 312293 467384 589656 434545 398951 739903 645301 734046 334294
10970F94159k20334J89099k60309O3015L17276j26175K5480K76455N0957m5819
$$ 694159 473825 662924 402615 465630 782906 656731 682211 958666 1009623 963804
10960I63804K24513L5729L96756J5328j85047K65938J70407k0389k08963M97799
$$ 963804 1188317 1224046 1620802 1636130 1451083 1717021 1887428 1867039 1658076 2155875
10950B155875k1843k96189j34749l37417R7763K5553M0967k80274L54814N4460
$$ 2155875 2134032 1837843 1703094 1365677 1463440 1488993 1529960 1249686 1604500 1658960
10940A658960K54169n73425Q5295j32777M17512m95863Q4011m05868R2907J87839
$$ 1658960 1913129 1339704 1424999 1292222 1709734 1213871 1297882 892014 984921 1172760
10930A172760l78984k96586q3376n0685O8559j35177C7256K75072a43439A96719
$$ 1172760 793776 497190 413814 363129 431688 296511 37256 312328 -143439 196719
10919A66734N4116E565N4859m811J80776a82595I2960L0455J3649C8624a59293
$$ 166734 220850 5565 60424 55613 236389 -182595 92960 123415 137064 38624 -159293
10907b40581I6065a23978A54754c0357j49275h0472k10515j5202A46635g058B9316
$$ -240581 96065 -123978 154754 -30357 -179632 -80472 -290987 -306189 146635 -7058 29316
10895g930D3760c02268A633e0065a51A53156Q5189b94365a3766A82615j4108c6852
$$ -7930 43760 -302268 1633 -50065 -151 153156 238345 -294365 -13766 182615 168507 -36852
10882a25748E0186N3320K29235p3608b50830D53026b76703d4480E2807c5117j00908
$$ -125748 50186 103506 332741 259133 -250830 453026 -276703 -44480 52807 -35117 -136025
10871a36025C46306A32500j0343c56519B33829a74406O0696p4804B85056a46564
$$ -136025 346306 132500 122157 -356519 233829 -174406 -113710 -188514 285056 -146564
10860C2400a15738C285J32230f7600r487n3742k00348a12156a2249j4799j45643
$$ 32400 -115738 3285 135515 -67600 -77087 -130829 -331177 -112156 -12249 -27048 -172691
10849a72691o1806d7645H1334b5321h01A45873J0538c5067j026E0599E665J0470
$$ -172691 -234497 -47645 81334 -25321 -801 145873 156411 -35067 -36093 50599 5665 16135
10837A6135R6776d2574q6884A16696M5647R2759b6288A02768a23712C3938K75654
$$ 16135 112911 -42574 -129458 116696 162343 255102 -26288 102768 -123712 33938 309592
10826C09592a94371H6264b41687j21406A34877I749P1302b35521A60738c4304
$$ 309592 -194371 86264 -241687 -363093 134877 9749 81051 -235521 160738 -34304
10815i6230G7367b56996N3753A9072J20254g5248k2388r927j17482L9506H4546
$$ -96230 77367 -256996 -203243 19072 139326 -75248 -97636 -107563 -225045 -185539 84546
10803a32255F2456J05587Q0080b55683A50308b2570D29438a0329A59108i7830
$$ -132255 62456 168043 248123 -255683 150308 -22570 429438 -10329 159108 -97830
10792d36778b0002l28866a9502j87556g4321A4181M3257A1778J30146i6173K1535
$$ -436778 -20002 -348868 -19502 -207058 -74321 14181 57438 11778 141924 -96173 -74638
10781g4638A24100c02109G5228I387d5353B91650a02761a0806A20358b06974f6698
$$ -74638 124100 -302109 75228 9387 -45353 291650 -102761 -10806 120358 -206974 -66698
10769b41277j42077a24725e8750k56528I2833c26848H2502M6701E371c818l41066
$$ -241277 -383354 -124725 -58750 -315278 92833 -326848 82502 129203 5371 -3818 -344884
10758c44884E3191a6255B375M5498O3502J44171I4826f5055j26909i3362m9418
$$ -344884 53191 -16255 2375 47873 111375 255546 94826 -65055 -191964 -93362 -142780
10747a42780A0628b51465A33098b45799D4530K4135J43537J07866l4883G143b2928
$$ -142780 10628 -251465 133098 -245799 44530 68665 212202 320068 285185 7143 -22928
10735b76310J00499i213B58448A9526R264a94982g8603E7442b27872E73492b99206
$$ -276310 -175811 -9213 258448 19526 28790 -194982 -78603 57442 -227872 573492 -299206
10723f2601B6969R2601b31364e873A57099P7430b13714B2124a29583r8546G6483
$$ -62601 26969 119570 -231364 -5873 157099 234529 -213714 22124 -129583 -228129 76483
10711c51538B92008I2636a41863G1501d87013K29670j24223J44778A54984c04420
$$ -351538 292008 92636 -141863 71501 -487013 -257343 -381566 -236788 154984 -304420
10700g4601H8225a21627D842c192A25237b40153G0668i4540A29473b42182A10665
$$ -74601 88225 -121627 4842 -3192 125237 -240153 70668 -94540 129473 -242182 110665
10688i9772L1397l69460B49433J42981c27046C6539J99817c03718i3978B7005
$$ -99772 -68375 -437835 249433 392414 -327046 36539 236356 -303718 -93978 27005
10677g3925m87973i4480H9130l5691a44646A14447d2782l8006j7830H517b33065
$$ -73925 -561898 -94480 89130 53439 -144646 114447 -42782 -80788 -98618 8517 -233065
10665F7463B031J63091a59665A88847F7531a26856O1221A6448Q5634b40601A39958
$$ 67463 2031 165122 -159665 188847 67531 -126856 -65635 16448 102082 -240601 139958
10653a98702O0156a8208l1045k06411f4324B54071h157B23917a61185b8682E4995
$$ -198702 -138546 -18208 -49253 -255664 -64324 254071 -8157 223917 -161185 -28682 54995
10641A27228R3093f8211B13039c8851A98674b72464K9977q9071J47789E6290h1611
$$ 127228 220321 -68211 213039 -38851 198674 -272464 -242487 -331558 -183769 56290 -81611
10629b7952B74319j31650i5154p342b2628B55439e1611j13217g0915m18639B29951
$$ -27952 274319 142669 -95154 -102496 -22628 255439 -51611 -164828 -70915 -489554 229951
10617A00133a09894q1102H0717a11200j17440m0256i258H1191b77381a09541o0095
$$ 100133 -109894 -190996 80717 -111200 -228640 -268896 -9258 81191 -277381 -109541 -169636
10606a69636B7735J5708J76289o0915g7862l1418a7215B33480A1352N6312d98496
$$ -169636 27735 43443 219732 158817 -77862 -109280 -17215 233480 11352 67664 -498496
10594b37563d087C8598a14675e2875B07437b4059o074j34939f8471E6430a20677
$$ -237563 -4087 38598 -114675 -52875 207437 -24059 -30133 -165072 -68471 56430 -120677
10582e6869j40817d2738k35808I8705a00296K511A89708a39225l2243N9457A58447
$$ -56869 -197686 -42738 -278546 98705 -100296 -97785 189708 -139225 -171468 -112011 158447
10570a3564r5318M5485l47477a13329o6939D2590c34599a46624j22591C81618
$$ -13564 -108882 -63397 -410874 -113329 -180268 42590 -334599 -146624 -269215 381618
10559B01925a57224L5297A11042L7098k7027L2182p0096M03723g6331j19585Q6496
$$ 201925 -157224 -121927 111042 148140 121113 153295 83199 486922 -76331 -195916 -109420
10548a09420k07497A39421b75714h5893A5037a4156j24513A12203b27379A5907
$$ -109420 -316917 139421 -275714 -85893 15037 -14156 -138669 112203 -227379 15907
10537a16701A61165O6312a03678C47668d0688C8288d1104I9518a59917A68919
$$ -116701 161165 227477 -103678 347668 -40688 38288 -41104 99518 -159917 168919
10526a33554D9105j517P8570b51223E0622f1980j6501n1335B6701J30098D904
$$ -133554 49105 47588 126158 -251223 50622 -61980 -78481 -129816 26701 156799 4904
10514c14452K7809a2117k36669B16972A6287a16455r2221A13674c62145a64322
$$ -314452 -286643 -12117 -248786 216972 16287 -116455 -208676 113674 -362145 -164322
10503d6410A362b00078I1326a05224F7901b67005B28097e7282A75725l2825a26968
$$ -46410 1362 -200078 91326 -105224 67901 -267005 228097 -57282 175725 142900 -126968
10491C8027J1158h6314n6081m0412d70j06907K1135A71913C6682L29105a86233
$$ 38027 49185 -86314 -142395 -182807 -470 -107377 -86242 171913 36682 365787 -186233
10479A47962a32778A52705o0160J8105E3306d5501k2862B38079b58532K5854A43672
$$ 147962 -132778 152705 92545 110650 53306 -45501 -68363 238079 -258532 -232678 143672
10467I9544j8601d9267C58055A77672i1676h65B67489L44786G5852N22719j53448
$$ 99544 80943 -49267 358055 177672 -91676 -865 267489 612275 75852 598571 445123
10456D45123j08423A01218c60235J73329g3218K2061B4975J41120K37188D2241
$$ 445123 336700 101218 -360235 -186906 -73218 -51157 24975 166095 403283 42241
10445f4686a6187A40415B0984a9811l1562C56938g1558o811k4600A51614c8285
$$ -64686 -16187 140415 20984 -19811 -51373 356938 -71558 -78369 -102969 151614 -38285
10433c3294G380K57226b25185j10078I3599P7157C6978c42855h8632k04154E840
$$ -33294 7380 264606 -225185 -335263 93599 170756 36978 -342855 -88632 -292786 5840
10421g6351o9329A47328a65309k8858e1720j51687B36215c3275J058j6806B17210
$$ -76351 -145680 147328 -165309 -194167 -51720 -203407 236215 -33275 -32217 -49023 217210
10409f1722A84492A8599e6999K2977j0604p0639b1058E3733a7319C6287a57078
$$ -61722 184492 18599 -56999 -34022 -44626 -115265 -21058 53733 -17319 36287 -157078
10397C15355a13938m8127g1467c2714j30434i27n344E8819J89687B10K4324a38826
$$ 315355 -113938 -162065 -71467 -32714 -163148 -927 -6271 58819 248506 210 24534 -138826
10384a70124N2934E3575b76568F7401N1318n2026L2045b66810i1526A1107M26225
$$ -170124 -117190 53575 -276568 67401 118719 66693 98738 -266810 -91526 11107 437332
10373D37332a01350A27061b63415E74396D9092f5452I1161K43913a10493A75893
$$ 437332 -101350 127061 -263415 574396 49092 -65452 91161 335074 -110493 175893
10362A44277n754F7912l152K99218A30974E907M28971I2773P4115g5761I8603
$$ 144277 138523 67912 64760 363978 130974 5907 434878 92773 166888 -75761 98603
10350A98230Q2618J89837o3101N628L8134D1506J77126r6537a47242f3555A06276
$$ 198230 280848 470685 407584 413212 451346 41506 218632 122095 -147242 -63555 106276
10338B22472m6612J3086n2932j1653J78899n0002q5879J11803A18452K51017D9528
$$ 222472 175860 188946 136014 124361 303260 253258 167379 279182 118452 369469 49528
10326a08926d9945A53778M4296L72334E113P0178K02577a58813B61179a39295
$$ -108926 -49945 153778 198074 570408 5113 75291 277868 -158813 261179 -139295
10315A48089p153C4241P3417B3165b12506C1349K49782a62587G9274J48957j06411
$$ 148089 140936 34241 107658 23165 -212506 31349 281131 -162587 79274 228231 121820
10304A21820a53496j0742B6299J35895G7037J36282i5370B73885F5929J33940
$$ 121820 -153496 -164238 26299 162194 77037 213319 -95370 273885 65929 199869
10294A99869J44047C4079b09107A288O0575N0502M42761g9852a3616C19813a1977
$$ 199869 343916 34079 -209107 1288 61863 112365 555126 -79852 -13616 319813 -11977
10282B70746c65921g4249A9944J89212q8796A286a98152O2896C7724b61783B19168
$$ 270746 -365921 -74249 19944 209156 120360 1286 -198152 -135256 37724 -261783 219168
10270f3658k41332F0194J66222a08748b887A12756c15909o6955j24076H4703a92461
$$ -63658 -304990 60194 226416 -108748 -2887 112756 -315909 -382864 -506940 84703 -192461
10258c27642B3857a31232A01984a9450l61591F4894n28Q2294a84858m9415e5218
$$ -327642 23857 -131232 101984 -19450 -381041 64894 64366 146660 -184858 -234273 -55218
10246A67569h4039B76323i7192o5756D7571J75380d0585C70886a33371A51538
$$ 167569 -84039 276323 -97192 -162948 47571 222951 -40585 370886 -133371 151538
10235C50623q3963B6757J64457F5914K80350e9651B14772m5895Q644p7738g2639
$$ 350623 266660 26757 191214 65914 346264 -59651 214772 168877 177521 99783 -72639
10223c22088B06521b1864B95746B7352a03337b6446j12199L2369J357j06434b874
$$ -322088 206521 -21864 295746 27352 -103337 -26446 -138645 -106276 -104919 -211353 -2874
10211i775C07768F2028a55170j20459A46863G143a43999H2412M6732J3870m3095
$$ -9775 307768 62028 -155170 -275629 146863 7143 -143999 82412 129144 143014 99919
10200I9919k2342k1609B6614g06A1345d41808d6429B06778b26383C71609b70655
$$ 99919 77577 55968 26614 -706 11345 -441808 -46429 206778 -226383 371609 -270655
10188H7309a92756C470b82926A90250d1321c55j59488J3056f6566n2343B8637
$$ 87309 -192756 3470 -282926 190250 -41321 -355 -159843 -146787 -66566 -118909 28637
10176A6168a19226M2848p6325K8548e1610a729k23558e2435A75868b12821A42508
$$ 16168 -119226 -76378 -152703 -124155 -51610 -1729 -225287 -52435 175868 -212821 142508
10164A73122G5510b91462A83604b67720G5323b37339A27382b19227j13687c7288
$$ 173122 75510 -291462 183604 -267720 75323 -237339 127382 -219227 -332914 -37288
10153b35540i0765k14417e1838o9312d2126A22472J9150C261b09866i6223M2279
$$ -235540 -90765 -305182 -51838 -121150 -42126 122472 141622 3261 -209866 -96223 -53944
10142e3944m7045L4154k35978i7858l08954h6644q8087B0247a45069A76865O3865
$$ -53944 -100989 -66835 -302813 -97858 -406812 -86644 -174731 20247 -145069 176865 240730
10131B40730a41967A44605K5906A1973C796L54718a6676k79135n7602J29237A23721
$$ 240730 -141967 144605 170511 11973 3796 358514 -16676 -295811 -353413 -224176 123721
10119a31794l4887d7416m71667b23707M7143f4558B51074C6068a10210A18359
$$ -131794 -166681 -47416 -519083 -223707 -176564 -64558 251074 36068 -110210 118359
10108a9883A2526c20396F6638a01497b6155m0389p8208A99372b5248l16894a56111
$$ -19883 12526 -320396 66638 -101497 -26155 -66544 -144752 199372 -25248 -342142 -156111
10096d1472j4297A57785F2207M845m712B5526Q0880a79936i159o2216r181k02398
$$ -41472 -55769 157785 62207 67052 62340 25526 106406 -179936 -9159 -71375 -80556 -282954
10084b82954P2169O9446A72760c9844p595H0880b29187B73022l8505a27876l96564
$$ -282954 -210785 -141339 172760 -39844 -47439 80880 -229187 273022 234517 -127876 -524440
10073e24440a99799A3990b36352F1159b41493h7565c8392l0653l04835J20472
$$ -524440 -199799 13990 -236352 61159 -241493 -87565 -38392 -69045 -373880 -253408
10063b53408C1205L6569Q5067c55269A53726b09565p3851d596j37105O2840j93335
$$ -253408 31205 67774 152841 -355269 153726 -209565 -283416 -4596 -141701 -78861 -272196
10052b72196M8683M5268e6438A05427c26832a05493j20904j76308a64671j45442
$$ -272196 -223513 -178245 -56438 105427 -326832 -105493 -226397 -402705 -164671 -310113
10042c10113J23164G8038C6243i1243A75575C046N2149f0905A48229K84o7490
$$ -310113 -186949 78038 36243 -91243 175575 3046 55195 -60905 148229 148513 81023
10031H1023c97210a89633h8882a6312p0345l2389l00169K01384Q7998I1296b05723
$$ 81023 -397210 -189633 -88882 -16312 -86657 -119046 -419215 -217831 -129833 91296 -205723
10019B41101r3750b25955e3574f364B6923a54599j80541O0651I9808b15348o3056
$$ 241101 147351 -225955 -53574 -6364 26923 -154599 -335140 -274489 99808 -215348 -278404
10008b78404A96974B4272J21703h1092D3545e26A66917a48361B70506b5525m8505
$$ -278404 196974 24272 145975 -81092 43545 -526 166917 -148361 270506 -25525 -74030
9997g4030B30645K0719A20570L7926A2458K8144j1067K64474c60341E4621K3871
$$ -74030 230645 251364 120570 158496 12458 40602 29535 294009 -360341 54621 78492
9986G8492c14127A66197J7281b117G3242a06549k66298n8913h9413A22484d92891
$$ 78492 -314127 166197 183478 -2117 73242 -106549 -372847 -431760 -89413 122484 -492891
9974c21275G0584C1327K8955a25400H5890k3635e02143B422J57330e2719l9051
$$ -321275 70584 31327 60282 -125400 85890 62255 -502143 2422 159752 -52719 -91770
9963i1770n9546B3071J32834b88205Q4924A9861J79905m7631l2570g5763I880
$$ -91770 -151316 23071 155905 -288205 -203281 19861 199766 152135 119565 -75763 9880
9951A02329e3600k98028I8302a88440E5104a76224H9942i5871B89596E4702j8846
$$ 102329 -53600 -351628 98302 -188440 55104 -176224 89942 -95871 289596 54702 35856
9940C5856a0657n9595K0872J7691k77617A48522a02220p7085E6138J9529C7549
$$ 35856 -10657 -70252 -49380 -31689 -309306 148522 -102220 -179305 56138 75667 37549
9928a24672q3105q1468A11373j3430J30031a07924m2335d7824k57511d2897j08227
$$ -124672 -207777 -289245 111373 97943 227974 -107924 -150259 -47824 -305335 -42897 -151124
9917a51124A97153k7563f6591f622j48952j47892a43582n9346G5591K09739d89217
$$ -151124 197153 169590 -66591 -6622 -155574 -303466 -143582 -202928 75591 285330 -489217
9905a61484B55669A21287c7932j05804I6787b69498B72592a86078C435e1014Q676
$$ -161484 255669 121287 -37932 -143736 96787 -269498 272592 -186078 3435 -51014 -42338
9894d2338j13715K4638O856g877m03974a75428r4445A08972c12188G5000c48195
$$ -42338 -156053 -131415 -124559 -7877 -411851 -175428 -269873 108972 -312188 75000 -348195
9882h4703j15187k13627g8185D432a47647b6029A3272a61174C5661g9034j15826
$$ -84703 -199890 -413517 -78185 4432 -147647 -26029 13272 -161174 35661 -79034 -194860
9871a94860e9147j21272H2167h2411K6391C51839d45114a65875D221b42987M5544
$$ -194860 -59147 -180419 82167 -82411 -56020 351839 -445114 -165875 4221 -242987 -197443
9860a97443i0133m2552K9102b9387j02730A00220a59494k21552h1243K6814k8102
$$ -197443 -90133 -132685 -103583 -29387 -132117 100220 -159494 -381046 -81243 -54429 -82531
9849h2531b5458o7876A139c42783A13678J45217I8658a76263A67726h835j92331
$$ -82531 -25458 -93334 1139 -342783 113678 258895 98658 -176263 167726 -8835 -201166
9838b01166F720N3952b06665j35666e6501j06085k97976A71544h6511H4032A5438
$$ -201166 6720 60672 -206665 -342331 -56501 -162586 -460562 171544 -86511 84032 15438
9826A99651b18112a0809C34811I7135a19988k74606J50534A9455e1281j79190
$$ 199651 -218112 -10809 334811 97135 -119988 -394594 -244060 19455 -51281 -230471
9816b30471i151k0579D3059a2015o1279a7851c152n7098k10937A46122c56500
$$ -230471 -9151 -29730 43059 -12015 -73294 -17851 -3152 -60250 -271187 146122 -356500
9804i7301a3256m7109G9236f85434K65995a90155L6902q487d7642q667A158c32925
$$ -97301 -13256 -60365 79236 -685434 -419439 -190155 -153253 -161740 -47642 -56309 1158 -332925
9791c12586a3379B21930b26212r5644k51826a53925A61969G7501K1983b09433
$$ -312586 -13379 221930 -226212 -321856 -573682 -153925 161969 77501 99484 -209433
9780a04213d8482o9288m9620F6117a66318r7240J31034L2449c4335k0230q8906
$$ -104213 -48482 -117770 -167390 66117 -166318 -263558 -132524 -100075 -34335 -54565 -143471
9769a43471H9068J71127o4976d28647a45309O0812a5526A71870o762C3935J28490
$$ -143471 89068 260195 195219 -428647 -145309 -84497 -15526 171870 165108 33935 162425
9758A62425a3843j3148C0449P029R8203c47138b3716l75008e2237A70622o7448
$$ 162425 -13843 -26991 30449 37478 135681 -347138 -23716 -398724 -52237 170622 103174
9747A03174K6081c14196A71413a15795F9593P7921J32140d5362j11707M4238M6475
$$ 103174 129255 -314196 171413 -115795 69593 147514 279654 -45362 -157069 -112831 -66356
9736f6356A17138C9970b90650h6462j65616E4173K31294A00538b99458I3978d5760
$$ -66356 117138 39970 -290650 -86462 -252078 54173 285467 100538 -299458 93978 -45760
9724b6995l4133j41123G2793c7944A63698a8414l97835i9879B2999J53729p4429
$$ -26995 -61128 -202251 72793 -37944 163698 -18414 -416249 -99879 22999 176728 102299
9713A02299a46072j9998b2442A6217e493k4091k34950D66694b36879a15190C01298
$$ 102299 -146072 -166070 -22442 16217 -5493 -29584 -264534 466694 -236879 -115190 301298
9701b2356c560A83220J43298j12253e4883o8650B31656b72221a12685c7767k33682
$$ -22356 -3560 183220 326518 214265 -54883 -123533 231656 -272221 -112685 -37767 -271449
9690b71449j22774A08444j8449a07014k9569c7647E9303a77383H9666j0571j9145
$$ -271449 -394223 108444 89995 -107014 -136583 -37647 59303 -177383 89666 79095 59950
9679E9950d03501a81499G8857c7532k3485k41119C7710J1794o891J09242r309
$$ 59950 -403501 -181499 78857 -37532 -61017 -302136 37710 49504 42613 151855 142546
9668A42546A675b18806M3211l35436A13293c08526a14793j07613I795c09565O1288
$$ 142546 1675 -218806 -175595 -511031 113293 -308526 -114793 -222406 9795 -309565 -248277
9657b48277N712Q7168m2348R5557j05357e3089A25194h2174A83260O4882j06072
$$ -248277 -242565 -155397 -197745 -102188 -207545 -53089 125194 -82174 183260 248142 142070
9646A42070b23134I7994e3967D6837A4317a2728A14880a03524c2733j22801B65997
$$ 142070 -223134 97994 -53967 46837 14317 -12728 114880 -103524 -32733 -155534 265997
9634E5506L22303A28672a70107F525M8466a73958k8217H0209C2852b96454H3609
$$ 55506 377809 128672 -170107 6525 54991 -173958 -202175 80209 32852 -296454 83609
9622E9012n069J34833c04448C34322C4001P090L798d91465B7678b26560M3683
$$ 59012 53943 188776 -304448 334322 34001 41091 44889 -491465 27678 -226560 -182877
9611a82877k42572B19549b28897P4525j32136J9556q5749A22439a58191j15828
$$ -182877 -425449 219549 -228897 -154372 -286508 -266952 -352701 122439 -158191 -274019
9601b74019B21255b57908H1805J0046a33218p3245j6361G762J25156F3842a18974
$$ -274019 221255 -257908 81805 91851 -133218 -206463 -222824 7762 132918 63842 -118974
9589A64064h5880L434B4149n699G682a46559D2658j1987J64259a15174a0679j17626
$$ 164064 -85880 -82446 24149 18450 7682 -146559 42658 30671 194930 -115174 -10679 -128305
9577a28305B11992H5108h0934B21097o3318b24414N0808j00702d0593B6800J12748
$$ -128305 211992 85108 -80934 221097 157779 -224414 -173606 -274308 -40593 26800 139548
9566A39548G341c05315n2146A63376a95624A2708a5408k24781a15063L9802j54214
$$ 139548 7341 -305315 -357461 163376 -195624 12708 -15408 -240189 -115063 -75261 -229475
9555b29475R2421m1396j49718i7640K4120A08252J52450b18753j55404a59094
$$ -229475 -137054 -178450 -328168 -97640 -73520 108252 260702 -218753 -374157 -159094
9544A772a77908A21054a1810F4228P0553b41645f4627m71492a78174I2383J64920
$$ 1772 -177908 121054 -11810 64228 134781 -241645 -64627 -536119 -178174 92383 257303
9533B57303r4354a1495H2152F347a93005a1162q3713m3655A69193d27813N4658
$$ 257303 162949 -11495 82152 6347 -193005 -11162 -94875 -138530 169193 -427813 -373155
9522c73155D2851J59904a19322K3166k496k5738k06564a43864B47262b23778c3951
$$ -373155 42851 202755 -119322 -96156 -98652 -124390 -330954 -143864 247262 -223778 -33951
9510c51632e4430j95106L9345E4482c8117o1908m7219j49931A04738b12039F377
$$ -351632 -54430 -249536 -210191 54482 -38117 -100025 -147244 -297175 104738 -212039 6377
9498b05435A60613E9088b74953c6874G4564c80042B05839b20033j0688j2773J21633
$$ -205435 160613 59088 -274953 -36874 74564 -380042 205839 -220033 -230721 -243494 -121861
9487a21861K8523j22408c6237j1353A58671a41328j01004G2067h8729j71227I835
$$ -121861 -93338 -215746 -36237 -47590 158671 -141328 -242332 72067 -88729 -259956 9835
9475a39365E840a43303b3338j51184H052J56076K4135q1732J56059A20829d04006
$$ -139365 5840 -143303 -23338 -174522 8052 164128 188263 106531 262590 120829 -404006
9463a86973d6518E1047b10736A17073a09301Q245B80836p4039b77084B71653a8298
$$ -186973 -46518 51047 -210736 117073 -109301 -101056 280836 206797 -277084 271653 -18298
9451I0268J86501b66636i7666k13546B67920b70502c4702j3796j00799j58752
$$ 90268 276769 -266636 -97666 -311212 267920 -270502 -34702 -48498 -149297 -308049
9441c08049E2130c79411K1066m6733B26123b56067j45830B90901c86025A37146
$$ -308049 52130 -379411 -358345 -405078 226123 -256067 -401897 290901 -386025 137146
9430e5865A46775a55031K2790N3570I5121h0777k00482a34639I7227b4614k19927
$$ -55865 146775 -155031 -132241 -78671 95121 -80777 -281259 -134639 97227 -24614 -244541
9419b44541J12563F5550a77443G0933J22342b03501g7520j4026E7167b06798Q5070
$$ -244541 -131978 65550 -177443 70933 193275 -203501 -77520 -91546 57167 -206798 -121728
9408a21728k97409a57496E4250b02667K7920h5561j62694C1171d44909D3954a47097
$$ -121728 -419137 -157496 54250 -202667 -174747 -85561 -248255 31171 -444909 43954 -147097
9396a8258j22165j02492b2075A80245E9502a06382d8397l05933D37614c02294
$$ -18258 -140423 -242915 -22075 180245 59502 -106382 -48397 -354330 437614 -302294
9385f4311A46522g8886F1261h3567J5435j06384q2393B5584g1142J2601o6741
$$ -64311 146522 -78886 61261 -83567 -68132 -174516 -256909 25584 -71142 -58541 -125282
9374a25282c1938j0900J0342A05805P5309b02405I366P673Q4609N3262d07388
$$ -125282 -31938 -42838 -32496 105805 181114 -202405 9366 17039 101648 154910 -407388
9362a33789A09644J68101a48134q6671d5462A00311c01390e9942n5024c587j38505
$$ -133789 109644 277745 -148134 -234805 -45462 100311 -301390 -59942 -114966 -3587 -142092
9351a42092n341B60267G241K99040a61654b4427o6704k12842B53709b49818K9357
$$ -142092 -147433 260267 7241 306281 -161654 -24427 -91131 -303973 253709 -249818 -220461
9340b20461K3697M9679c4505l4913n0247j7979B52964a88329C527K82733b19657
$$ -220461 -196764 -147085 -34505 -69418 -119665 -137644 252964 -188329 3527 286260 -219657
9328b55162F7260b31839m9298j02277A74301b06417n0241i1225c4768j71047D7656
$$ -255162 67260 -231839 -281137 -383414 174301 -206417 -256658 -91225 -34768 -205815 47656
9316C20722c0801j43945A30604c2054j8907A2684b38905M9834k76132g2417A91410
$$ 320722 -30801 -174746 130604 -32054 -50961 12684 -238905 -189071 -465203 -72417 191410
9304D98a66490m0706i5626p4999e9488k06775A0736a76975M5306k0637I9665A0513
$$ 498 -166490 -207196 -95626 -170625 -59488 -266263 10736 -176975 -131669 -152306 99665 10513
9291a71312j8890A06652a07373C3791J09892J86337k0275b06088B75633b10110
$$ -171312 -190202 106652 -107373 33791 143683 330020 309745 -206088 275633 -210110
9280B12831b4876A68727a83638A70047C434J17810b65069k6258Q2467C23073A3342
$$ 212831 -24876 168727 -183638 170047 3434 121244 -265069 -291327 -208860 323073 13342
9268a27177b8957D190Q9265D2125P658K1753R7666h7302b9378A5032e31093B73134
$$ -127177 -28957 4190 93455 42125 49783 71536 169202 -87302 -29378 15032 -531093 273134
9255a58709C9411J633h5483n9882K8781n839F2756J41853a10862j4551B31301
$$ -158709 39411 41044 -85483 -145365 -116584 -122423 62756 204609 -110862 -125413 231301
9243C9102F072h3604j09827C07132h5500j26066B25384a19711j6451G628i5025
$$ 39102 6072 -83604 -193431 307132 -85500 -211566 225384 -119711 -136162 7628 -95025
9231h5227l62894K12953C5220b28387A1722a91334C26925b3204j7030j57126k332
$$ -85227 -448121 -235168 35220 -228387 11722 -191334 326925 -23204 -40234 -197360 -199692
9220a99692A4307J6721a63308b1801k7504k33296O6776k5485k7012C9068l032
$$ -199692 14307 31028 -163308 -21801 -49305 -282601 -215825 -241310 -268322 39068 36036
9209C6036l67J78001G0115c33870Q9648F8474b28230d3756j23869F559g9269A55470
$$ 36036 35669 213670 70115 -333870 -244222 68474 -228230 -43756 -167625 6559 -79269 155470
9196a94070O6241N7958a6594G1978c26960I4960P978l5110a59576j34461a43217
$$ -194070 -127829 -69871 -16594 71978 -326960 94960 102938 67828 -159576 -294037 -143217
9184A02408a86774k1069E7594d04310J45118A26846a76883r6922F2506f6621B39689
$$ 102408 -186774 -207843 57594 -404310 -259192 126846 -176883 -273805 62506 -66621 239689
9172a28811k30330G013b40232i5618F6580J35195D8113a00898j18984A42505D8880
$$ -128811 -359141 7013 -240232 -95618 66580 201775 48113 -100898 -219882 142505 48880
9160A10429c96560a51682k7820L3155M8756b3236A15547K7846m5751N3481M4985
$$ 110429 -396560 -151682 -179502 -146347 -97591 -23236 115547 143393 97642 151123 196108
9149A96108Q3247c08881C5906c20647J49775j01267i60q6844c373A7523j702O2337
$$ 196108 279355 -308881 35906 -320647 -170872 -272139 -960 -87804 -3373 17523 15821 78158
9137G8158g1096A8086J69049a20931q9945H2103b30087A08121d5731a0270o7579
$$ 78158 -71096 18086 187135 -120931 -210876 82103 -230087 108121 -45731 -10270 -77849
9126g7849F8370a97090E5992h0281k16528a18327A56768d99293C97262h6216k40731
$$ -77849 68370 -197090 55992 -80281 -296809 -118327 156768 -499293 397262 -86216 -326947
9115c26947B6628a47942k7833L0103o0455e1455j79987B52979E0159j5551h2374
$$ -326947 26628 -147942 -175775 -145672 -206127 -51455 -231442 252979 50159 34608 -82374
9103D51b5893k02432A78162f5496J2302p9391J0683A24175a45419C6855a48531
$$ 451 -25893 -228325 178162 -65496 -53194 -132585 -121902 124175 -145419 36855 -148531
9091e4104j06550n0471F7343e8956k85505E9052a46919D5996J02877a91590A71033
$$ -54104 -160654 -211125 67343 -58956 -344461 59052 -146919 45996 148873 -191590 171033
9079b192l52k31110g1678k8790C4914a16132B36187q2774e5591o6737f0709J5955
$$ -2192 -2544 -233654 -71678 -100468 34914 -116132 236187 153413 -55591 -122328 -60709 -44754
9067d4754k02101j01J20333l6609A01996P4181m6888a26792l76986a26065q7202
$$ -44754 -246855 -246956 -126623 -163232 101996 176177 129289 -126792 -503778 -126065 -213267
9056b13267g9618C2059J10827d9685F2682c1170p0713k2674N5978I0942a86896
$$ -213267 -79618 32059 142886 -49685 62682 -31170 -101883 -124557 -68579 90942 -186896
9044a58610A72590a50754m1053h0996A10912b30987d0440C3744K73990A48135
$$ -158610 172590 -150754 -191807 -80996 110912 -230987 -40440 33744 307734 148135
9033h6291j59038N5009A94773c63105a42200l0202C7556O1029b56741a3460A41070
$$ -86291 -245329 -190320 194773 -363105 -142200 -172402 37556 98585 -256741 -13460 141070
9021G7406J37806h6283A8155J24681B5303i1890l4295L984j20943A14035L0544
$$ 77406 215212 -86283 18155 142836 25303 -91890 -126185 -122201 -243144 114035 144579
9010A44579d8917k73064R1850g6832K3066r9778D78430j01852i7042I3774g7822
$$ 144579 -48917 -321981 -230131 -76832 -53766 -153544 478430 376578 -97042 93774 -77822
8998c33877N6518e2602j21827D1455N7342M4302C9000a06566A09047b37098d1537
$$ -333877 -277359 -52602 -174429 41455 98797 143099 39000 -106566 109047 -237098 -41537
8986f1786j71716h6990q0957b3779F2197e8276j86868j52862a21988j30063A94866
$$ -61786 -233502 -86990 -167947 -23779 62197 -58276 -245144 -398006 -121988 -252051 194866
8974b74726a21710R620j3490C11590d47634E0490a23669j6091O0955r3875p8350
$$ -274726 -121710 -112090 -125580 311590 -447634 50490 -123669 -139760 -78805 -172680 -251030
8963b51030D1006d7806j02992A34284b24845R3153A04837b49636g8326k36347
$$ -251030 41006 -47806 -150798 134284 -224845 -131692 104837 -249636 -78326 -314673
8953c14673d4566q1891H2265C633c72695I4389J63053j9034a24038B5061K55414
$$ -314673 -44566 -126457 82265 3633 -372695 94389 257442 238408 -124038 25061 280475
8942B80475d6912j32758j31770J55611l1105A57641b42099g4467j35460A21496
$$ 280475 -46912 -179670 -311440 -155829 -186934 157641 -242099 -74467 -209927 121496
8931h4396A11860l3798a28056A34495b67894C3677J20204b62000G44b36836J13239
$$ -84396 111860 78062 -128056 134495 -267894 33677 153881 -262000 744 -236836 -123597
8920a23597H6584M3302C4331K07695K50586b4053j00394B32758j01698o373D6495
$$ -123597 86584 129886 34331 242026 492612 -24053 -124447 232758 131060 124687 46495
8908C24224l2085N65424K83152R40439J879421M618473D173058B019803r23049
$$ 324224 292139 857563 1140715 2081154 3960575 8579048 4173058 2019803 1096754
8899A096754E30816j1332A99168J97896A61978b8184B91370j19877J57682a40802
$$ 1096754 530816 519484 199168 397064 161978 -28184 291370 171493 329175 -140802
8888G2798b4058A12274J35145i3445k13257b6962a762j90482j906g1238j24175
$$ 72798 -24058 112274 247419 -93445 -306702 -26962 -1762 -192244 -194150 -71238 -195413
8877a95413f669r7061B45113q0625b2510o597k01632A47230b87156a36739o7884
$$ -195413 -6669 -103730 245113 164488 -22510 -29107 -230739 147230 -287156 -136739 -204623
8866b04623Q2080D6732d79928a39895k08I3332a21291l6311q4354B74379G561
$$ -204623 -122543 46732 -479928 -139895 -140103 93332 -121291 -157602 -241956 274379 7561
8854B3784b4702F9332g6460C29319b15519a5679E9050J5472r393H059a098H7252
$$ 23784 -24702 69332 -76460 329319 -215519 -15679 59050 74522 65129 8059 -1098 87252
$$ [...]
##END NTUPLES=NMR SPECTRUM
##END=
