
##TITLE=AC1198_BRAAS12062_6528062_i992S6RnTi
##JCAMPDX= 6.0         $$ Bruker NMR JCAMP-DX V2.0
##DATA TYPE= NMR SPECTRUM
##DATA CLASS= NTUPLES
##ORIGIN= BRUKER
##OWNER= Administrator
$$ 1.72 TOPSPIN		Version 2.1
$$ 2012-07-15 09:56:57.140 -0500  Administrator@TOPSPIN
$$ Compression mode = diff/dup
##.OBSERVE FREQUENCY= 400.02188249412
##.OBSERVE NUCLEUS= ^1H
##.ACQUISITION MODE= SIMULTANEOUS (DQD)
##.ACQUISITION SCHEME= undefined
##.AVERAGES= 8
##.DIGITISER RES= 22
##SPECTROMETER/DATA SYSTEM= spect
##.PULSE SEQUENCE= zg30
##.SOLVENT NAME= COFFEE_meoh
##.SHIFT REFERENCE= INTERNAL, COFFEE_meoh, 1, 14.98509
##AUDIT TRAIL= $$ (NUMBER, WHEN, WHO, WHERE, PROCESS, VERSION, WHAT)
$$ ##TITLE= Audit trail, TOPSPIN		Version 2.1
$$ ##JCAMPDX= 5.01
$$ ##ORIGIN= Bruker BioSpin GmbH
$$ ##OWNER= Administrator
$$ $$ C:\Bruker\TOPSPIN/data/COFFEE/nmr/AC1198_BRAAS12062_6528062_i992S6RnTi/10/pdata/1/auditp.txt
$$ ##AUDIT TRAIL=  $$ (NUMBER, WHEN, WHO, WHERE, PROCESS, VERSION, WHAT)
(   1,<2012-07-15 09:56:50.343 -0500>,<Administrator>,<TOPSPIN>,<go>,<TOPSPIN 2.1>,
      <created by zg
	started at 2012-07-15 09:55:43.703 -0500,
	POWCHK enabled, PULCHK disabled,
       configuration hash MD5:
       6B 1B 68 BB D9 2E 58 E2 7F 35 AD 54 07 DF 0E 41
       data hash MD5: 64K
       DE A2 F2 76 C3 37 A9 50 80 03 C9 5D BA B4 D4 7D>)
(   2,<2012-07-15 09:56:52.953 -0500>,<Administrator>,<TOPSPIN>,<proc1d>,<TOPSPIN 2.1>,
      <Start of raw data processing
       efp LB = 0 FT_mod = 6 PKNL = 1 PHC0 = 0 PHC1 = 0 SI = 32K 
       data hash MD5: 32K
       6A 98 7E 97 32 DF DE 0F 58 02 82 3F FF E6 97 80>)
(   3,<2012-07-15 09:56:53.328 -0500>,<Administrator>,<TOPSPIN>,<proc1d>,<TOPSPIN 2.1>,
      <pk PHC0 = 175.5835 PHC1 = 0 
       data hash MD5: 32K
       A5 C3 1B B4 5D B2 E7 20 B1 81 02 83 5C C9 5C BE>)
(   4,<2012-07-15 09:56:53.468 -0500>,<Administrator>,<TOPSPIN>,<proc1d>,<TOPSPIN 2.1>,
      <abs ABSG = 1 
       data hash MD5: 32K
       BA 90 15 44 B6 C3 80 D5 BB 3F DA 9F A1 39 DC 63>)
(   5,<2012-07-15 09:56:53.500 -0500>,<Administrator>,<TOPSPIN>,<proc1d>,<TOPSPIN 2.1>,
      <abs ABSG = 2 
       data hash MD5: 32K
       3C 89 C6 6F 5D D6 AA 45 2F D5 BB C6 85 FE F7 79>)
(   6,<2012-07-15 09:56:53.531 -0500>,<Administrator>,<TOPSPIN>,<proc1d>,<TOPSPIN 2.1>,
      <abs ABSG = 3 
       data hash MD5: 32K
       E3 D8 FD DA 01 2D EE 10 07 52 20 3C F5 D8 3F 13>)
(   7,<2012-07-15 09:56:53.562 -0500>,<Administrator>,<TOPSPIN>,<proc1d>,<TOPSPIN 2.1>,
      <abs ABSG = 4 
       data hash MD5: 32K
       8C F7 6C B5 C2 DC B4 2D 8A 01 50 E6 9E 27 4E D3>)
(   8,<2012-07-15 09:56:53.593 -0500>,<Administrator>,<TOPSPIN>,<proc1d>,<TOPSPIN 2.1>,
      <abs ABSG = 5 
       data hash MD5: 32K
       13 2B A0 BB FA 6D 42 C0 72 23 EE 3C 9D 6D AF EA>)
$$ ##END=
$$ 
$$ $$ hash MD5
$$ $$ 5C CF EF 30 14 1A 0D 1A E7 42 E0 90 55 CE 2F 75
##$RELAX= 
##$RELAX= 
##$RELAX= 
##$RELAX= 
##$RELAX= 
##$RELAX= 
##$RELAX= 
$$ Bruker specific parameters
$$ --------------------------
$$ [...]
150 150 150 150 150 150 150 150
##$TP07= 0
##$TPNAME0= <>
##$TPNAME1= <>
##$TPNAME2= <>
##$TPNAME3= <>
##$TPNAME4= <>
##$TPNAME5= <>
##$TPNAME6= <>
##$TPNAME7= <>
##$TPOAL= (0..7)
0.5 0.5 0.5 0.5 0.5 0.5 0.5 0.5
##$TPOFFS= (0..7)
0 0 0 0 0 0 0 0
##$TUNHIN= 0
##$TUNHOUT= 0
##$TUNXOUT= 0
##$USERA1= <user>
##$USERA2= <user>
##$USERA3= <user>
##$USERA4= <user>
##$USERA5= <user>
##$V9= 5
##$VALIST= <valist>
##$VCLIST= <CCCCCCCCCCCCCCC>
##$VD= 0
##$VDLIST= <DDDDDDDDDDDDDDD>
##$VPLIST= <PPPPPPPPPPPPPPP>
##$VTLIST= <TTTTTTTTTTTTTTT>
##$WBST= 2048
##$WBSW= 25
##$XGAIN= (0..3)
0 0 0 0
##$XL= 0
##$YL= 0
##$YMAX_a= 508056
##$YMIN_a= -648248
##$ZGOPTNS= <>
##$ZL1= 120
##$ZL2= 120
##$ZL3= 120
##$ZL4= 120
##$ABSF1= 14.98509
##$ABSF2= -5.573092
##$ABSG= 5
##$ABSL= 3
##$ALPHA= 0
##$AQORDER= 0
##$ASSFAC= 0
##$ASSFACI= 0
##$ASSFACX= 0
##$ASSWID= 0
##$AUNMP= <proc_prof1d_extract_pilot.lims>
##$AXLEFT= 0
##$AXNAME= <>
##$AXNUC= <1H>
##$AXRIGHT= 0
##$AXTYPE= 0
##$AXUNIT= <>
##$AZFE= 0.1
##$AZFW= 0.1
##$BCFW= 0
##$BC_mod= 0
##$BYTORDP= 0
##$COROFFS= 0
##$CY= 15
##$DATMOD= 1
##$DC= 0
##$DFILT= <>
##$DTYPP= 0
##$F1P= 0
##$F2P= 0
##$FCOR= 0.5
##$FTSIZE= 32768
##$FT_mod= 6
##$GAMMA= 0
##$GB= 0
##$INTBC= 1
##$INTSCL= 1
##$ISEN= 128
##$LB= 0
##$LEV0= 0
##$LPBIN= 0
##$MAXI= 10000
##$MC2= 0
##$MEAN= 0
##$ME_mod= 0
##$MI= 0
##$NCOEF= 0
##$NC_proc= -8
##$NLEV= 6
##$NOISF1= 0
##$NOISF2= 0
##$NSP= 0
##$NTH_PI= 0
##$NZP= 0
##$OFFSET= 14.98509
##$PC= 1
##$PHC0= 175.5835
##$PHC1= 0
##$PH_mod= 1
##$PKNL= yes
##$PPARMOD= 0
##$PPDIAG= 0
##$PPIPTYP= 0
##$PPMPNUM= 2147483647
##$PPRESOL= 1
##$PSCAL= 4
##$PSIGN= 0
##$PYNMP= <proc.py>
##$REVERSE= no
##$SF= 400.02
##$SI= 32768
##$SIGF1= 0
##$SIGF2= 0
##$SINO= 400
##$SIOLD= 32768
##$SPECTYP= <>
##$SREGLST= <1H.CDCl3>
##$SSB= 0
##$STSI= 32768
##$STSR= 0
##$SW_p= 8223.68421052631
##$SYMM= 0
##$S_DEV= 0
##$TDeff= 65536
##$TDoff= 0
##$TI= <>
##$TILT= no
##$TM1= 0
##$TM2= 0
##$TOPLEV= 0
##$USERP1= <user>
##$USERP2= <user>
##$USERP3= <user>
##$USERP4= <user>
##$USERP5= <user>
##$WDW= 1
##$XDIM= 32768
##$YMAX_p= 469838714
##$YMIN_p= -859019
##$CURPLOT= <Network HP LaserJet P1505>
##$CURPRIN= <$Network HP LaserJet P1505>
##$DFORMAT= <normdp>
##$LAYOUT= <+/1D_H.xwp>
##$LFORMAT= <normlp>
##$PFORMAT= <normpl>
##$SURQMSG= 1
$$ End of Bruker specific parameters
$$ ---------------------------------
##NTUPLES= NMR SPECTRUM
##VAR_NAME=  FREQUENCY,     SPECTRUM/REAL,   SPECTRUM/IMAG
##SYMBOL=    X,             R,               I
##VAR_TYPE=  INDEPENDENT,   DEPENDENT,       DEPENDENT
##VAR_FORM=  AFFN,          ASDF,            ASDF
##VAR_DIM=   32768,         32768,           32768
##UNITS=     HZ,            ARBITRARY UNITS, ARBITRARY UNITS
##FACTOR=    0.250966925370066, 1,           1
##FIRST=     8223.43324360094, 16605,        -288595
##LAST=      0,             -97890,          -109779
##MIN=       0,             -859019,         0
##MAX=       8223.43324360094, 469838714,    0
$$ Real data points
##PAGE= N=1
##DATA TABLE= (X++(R..R)), XYDATA
$$ [...]
19532d0941j33420F0292b8286k34802O0919Q4156l3403o6608I6527a98976Q9900
$$ -40941 -174361 60292 -28286 -263088 -202169 -118013 -151416 -218024 96527 -198976 -109076
19521a09076c8910A98692m8651J09806G9068A370h8943a8401j73755m1260l3530
$$ -109076 -38910 198692 150041 259847 79068 1370 -88943 -18401 -192156 -233416 -266946
19510b66946K5264G4265a9589A53765a97813B40816m8297h1935A3024f6287D5302
$$ -266946 -241682 74265 -19589 153765 -197813 240816 192519 -81935 13024 -66287 45302
19498C03990l0240a87756E0678f6825A7732g0653k929F5041a98044M5280K6230
$$ 303990 273750 -187756 50678 -66825 17732 -70653 -73582 65041 -198044 -152764 -126534
19487a26534e5401k54700B29503a22942K4525j20689j66391f2549p738q1496c4656
$$ -126534 -55401 -310101 229503 -122942 -98417 -219106 -385497 -62549 -70287 -151783 -34656
19475c20973A93930b5401F0353a42565f4554A44791L7432b24517F8544i4803j52848
$$ -320973 193930 -25401 60353 -142565 -64554 144791 182223 -224517 68544 -94803 -247651
19464b47651J12088D1980h9451C20277a85499L7778K4065F9965b06467D1134a70064
$$ -247651 -135563 41980 -89451 320277 -185499 -147721 -123656 69965 -206467 41134 -170064
19452D6248i6822c9938l84385K04927A34506m1871C3645R3013i7008H0511n163
$$ 46248 -96822 -39938 -424323 -219396 134506 92635 33645 126658 -97008 80511 75348
19441G5348a52772e7713a615k68136B57874c26348A35696b80775F1521a38427
$$ 75348 -152772 -57713 -1615 -269751 257874 -326348 135696 -280775 61521 -138427
19430h0017q3311B29119A05425a73560a7290D4246A364M19117n5022e7034k90587
$$ -80017 -163328 229119 105425 -173560 -17290 44246 1364 420481 365459 -57034 -347621
19419c47621e7938a5303j80197A08251e7173n1419j7269I7351c6652G3934R0316
$$ -347621 -57938 -15303 -195500 108251 -57173 -108592 -125861 97351 -36652 73934 164250
19408A64250G7004K04702o5886e447k28772A42056a01595a8671B11027q5140e1247
$$ 164250 77004 281706 215820 -5447 -234219 142056 -101595 -18671 211027 125887 -51247
19396a33155o6896j14018H1216J46265b5667k82085h4779j12874f4089j1239k77832
$$ -133155 -200051 -314069 81216 227481 -25667 -307752 -84779 -197653 -64089 -75328 -353160
19385c53160h8998A9587a14448K1173j0283L8265a9985n1839c3124B62662D5862
$$ -353160 -88998 19587 -114448 -93275 -103558 -65293 -19985 -71824 -33124 262662 45862
19373i8323J1950d774q5627c7797r5310O0540R192A7238A608J77328j6175B9934
$$ -98323 -86373 -4774 -90401 -37797 -133107 -72567 -63375 17238 1608 178936 162761 29934
19360b9451k01930D6722A7195a37420I9223a03988A07776b56661C1497Q6291C9026
$$ -29451 -231381 46722 17195 -137420 99223 -103988 107776 -256661 31497 117788 39026
19348f3319C12493a13011q2678j08999a50868q0342g0771A1602J27122g4325c3083
$$ -63319 312493 -113011 -195689 -304688 -150868 -231210 -70771 11602 138724 -74325 -33083
19336b40743J17542A83515b6085b136j24139N255r2980i9509j63242k03005I63
$$ -240743 -123201 183515 -26085 -2136 -126275 -121020 -214000 -99509 -262751 -465756 963
19324i7937B03359e5567F7914b28416d0073k35912A50582a66396A17166b31981
$$ -97937 203359 -55567 67914 -228416 -40073 -275985 150582 -166396 117166 -231981
19313A27421d8003j42020k8353G8503a17554r859a7097A91897n042c18074G6203
$$ 127421 -48003 -190023 -218376 78503 -117554 -127413 -17097 191897 186855 -318074 76203
19301c07269a24603k66716a36287f0761l6223f571p4681r6125C5062a90368A29813
$$ -307269 -124603 -391319 -136287 -60761 -96984 -6571 -81252 -177377 35062 -190368 129813
19289f0451o8729K3695D6488b30531a13685B38860a21508H1587J86829r5220c38167
$$ -60451 -129180 -105485 46488 -230531 -113685 238860 -121508 81587 268416 173196 -338167
19277c9534G0320f8749D73607A16929c68035J41752G4501M8909J32123b97140
$$ -39534 70320 -68749 473607 116929 -368035 -226283 74501 123410 255533 -297140
19266a76568m2113r9742d1999B378b38438D5137L330J374k1069O8427a15708M2454
$$ -176568 -218681 -318423 -41999 2378 -238438 45137 48467 49841 28772 97199 -115708 -73254
19254g3254B23819a1315r8852m2832C9058b8079F4434g8109j64650R2248A85259
$$ -73254 223819 -11315 -110167 -152999 39058 -28079 64434 -78109 -242759 -150511 185259
19242b39431A34248b59645j96590B46674a58137G0421c51784a21861A24889j5973
$$ -239431 134248 -259645 -456235 246674 -158137 70421 -351784 -121861 124889 108916
19232A08916e7430H7863a53045C18271i2917A54270o3594a31639j24441C13360
$$ 108916 -57430 87863 -153045 318271 -92917 154270 90676 -131639 -256080 313360
19221c90940a9628B03896h9250o4799q0654O6244E6911a63753D0247a47264B6003
$$ -390940 -19628 203896 -89250 -154049 -234703 -168459 56911 -163753 40247 -147264 26003
19209b9376l57262a83511A27854a82975A01601J299m4806c45247B20582e5450
$$ -29376 -386638 -183511 127854 -182975 101601 102900 58094 -345247 220582 -55450
19198c3795A59163C3195R029b22788A4824J5599d35697a0822k8681k79079p3093
$$ -33795 159163 33195 42224 -222788 14824 30423 -435697 -10822 -39503 -318582 -391675
19187c91675B4339c12994r6448B59023D3218e590A523b94447c3500r3648k6841
$$ -391675 24339 -312994 -409442 259023 43218 -5590 1523 -294447 -33500 -127148 -153989
19176a53989j12297D7479a48075G0999a52037B9809f7433k9624B0932g717o2311
$$ -153989 -266286 47479 -148075 70999 -152037 29809 -67433 -97057 20932 -7717 -70028
19165g0028A59111c49593C2429f4032A16821b12749A12330a3507H5319h948k55894
$$ -70028 159111 -349593 32429 -64032 116821 -212749 112330 -13507 85319 -8948 -264842
19154b64842F3100i4139B7381a82966A34599j0346d9148c742B58495e6638l40128
$$ -264842 63100 -94139 27381 -182966 134599 124253 -49148 -3742 258495 -56638 -396766
19143c96766i9585A84966k4245e7669j79013J05818B76028j19978f8151k8314
$$ -396766 -99585 184966 160721 -57669 -236682 -130864 276028 156050 -68151 -96465
19133i6465j9808b0652j20547I7039D178a51398j9344n7858j70511A10681J82327
$$ -96465 -116273 -20652 -141199 97039 4178 -151398 -170742 -228600 -399111 110681 293008
19122B93008a966k21863A05875C394h3987k34749J29929N5614d8541o8354B85728
$$ 293008 -1966 -223829 105875 3394 -83987 -318736 -188807 -133193 -48541 -116895 285728
19110b71921e5501A22739f6567l46598A9688a75868e6590j94833R7932G6436f7783
$$ -271921 -55501 122739 -66567 -413165 19688 -175868 -56590 -251423 -153491 76436 -67783
19098i5666J099A95882a46842B1102Q130a22786o0822K485A94228a80024Q5732
$$ -95666 -94567 195882 -146842 21102 29232 -122786 -183608 -181123 194228 -180024 -94292
19087i4292l6750B86025j27117c066o0000A41546j900a35762G9040J27136C8383
$$ -94292 -131042 286025 158908 -3066 -63066 141546 139646 -135762 79040 206176 38383
19075d42031h8323I2357J4652a25407E0491K74475b02570g8594k04917A72783
$$ -442031 -88323 92357 107009 -125407 50491 324966 -202570 -78594 -283511 172783
19064H0622a8850l5412E0632A1126a13790N5552j3249r8517k0340F3975J25623
$$ 80622 -18850 -54262 50632 11126 -113790 -58238 -71487 -170004 -190344 63975 189598
19053A89598b2610k663l5877B45407A22398C5603b65416i3602B52645E9914M6359
$$ 189598 -22610 -25273 -61150 245407 122398 35603 -265416 -93602 252645 59914 106273
19042A06273a74581f6464A43653a26332a0989A09524a23140I2256J85272a4890
$$ 106273 -174581 -66464 143653 -126332 -10989 109524 -123140 92256 277528 -14890
19031B1075J7066R7034Q1105a34910d2097l39054P5598g3312A98886C1606J10706
$$ 21075 38141 135175 216280 -134910 -42097 -381151 -305553 -73312 198886 31606 142312
19020A42312A8672M8203b08214C5351A6403a10420L9842c5083A61779k6048b6058
$$ 142312 18672 66875 -208214 35351 16403 -110420 -70578 -35083 161779 135731 -26058
19008I4772A5368a6817j61351j32379G4235a42830K3192D393P8298b868j68435
$$ 94772 15368 -16817 -178168 -310547 74235 -142830 -119638 4393 82691 -2868 -171303
18997a71303A15242b416C7305h9495j70940K6317R4893m81596b93714M4030j08351
$$ -171303 115242 -2416 37305 -89495 -260435 -234118 -139225 -620821 -293714 -249684 -358035
18986c58035c7229A70086b3052k02674i1554j70811O5004A79849J1661b06368
$$ -358035 -37229 170086 -23052 -225726 -91554 -262365 -197361 179849 191510 -206368
18975I0421a89943C00681e2869A88224f2694A8023b0592G3394R1706a82991A49005
$$ 90421 -189943 300681 -52869 188224 -62694 18023 -20592 73394 165100 -182991 149005
18963a65782j93044J28596c1460A6714J45280b99559H0122b7754k67404B273b27071
$$ -165782 -358826 -230230 -31460 16714 161994 -299559 80122 -27754 -295158 2273 -227071
18951B55990a09683d0918j95614a17648K5552L7119k2263p3931K5764k0609M4637
$$ 255990 -109683 -40918 -236532 -117648 -92096 -54977 -77240 -151171 -125407 -146016 -101379
18940a01379E4071K00601h5387k9520l9895B43821F8989c44042A2903b31209g4597
$$ -101379 54071 254672 -85387 -114907 -154802 243821 68989 -344042 12903 -231209 -74597
18928B17761F2799a23698B60727c97148f9431C44723j54215a67643m5988d5096
$$ 217761 62799 -123698 260727 -397148 -69431 344723 190508 -167643 -213631 -45096
18917B23745a11113B08051b66959k5328a32987o8201N451j62664A19210C3617
$$ 223745 -111113 208051 -266959 -292287 -132987 -201188 -195737 -358401 119210 33617
18906A87465e4456j37260A8864c57709c4508C32353j16519B1838b00329b3560
$$ 187465 -54456 -191716 18864 -357709 -34508 332353 215834 21838 -200329 -23560
18895a17181D024a05358k96535J49435a3471q468k4582j05880A75802J83846F5372
$$ -117181 4024 -105358 -401893 -252458 -13471 -21939 -46521 -152401 175802 359648 65372
18883a8538A7785J13068a83240h4103G6169b96004B9661b51131A07353b32930
$$ -18538 17785 130853 -183240 -84103 76169 -296004 29661 -251131 107353 -232930
18872e5915G0793K8685f2010j96236J00186I9912a44415A689a54569j00584B2559
$$ -55915 70793 99478 -62010 -258246 -158060 99912 -144415 1689 -154569 -255153 22559
18860c02315k955I091J37249a90483j16634d9475J5966j42722I9240G761J39810
$$ -302315 -305270 9091 146340 -190483 -307117 -49475 -33509 -176231 99240 7761 147571
18849A47571n1607L4080i9052c4454B17600E778K49920p3313C2723J71254a46541
$$ 147571 95964 130044 -99052 -34454 217600 5778 255698 182385 32723 203977 -146541
18837a82941A5227d12367a8800j57014q8357J22032p5579F7784N7183O746K8195
$$ -182941 15227 -412367 -18800 -175814 -264171 -142139 -217718 67784 124967 131713 159908
18826A59908M0953l6166b68723B5219f9320A30717E7297a35226e2918C1063h3234
$$ 159908 200861 164695 -268723 25219 -69320 130717 57297 -135226 -52918 31063 -83234
18814C9116a49928B69454H1635a89838B10825E4133J3834L9619j0799c3761A0975
$$ 39116 -149928 269454 81635 -189838 210825 54133 67967 107586 96787 -33761 10975
18802D15480E6624c3660m9439j61629E7003Q670L09400B8351b19502i1619j03233
$$ 415480 56624 -33660 -83099 -244728 57003 65673 375073 28351 -219502 -91619 -194852
18791a94852A99636a73621E8087b22605O0590j63556d7419B4498f2493j20091
$$ -194852 199636 -173621 58087 -222605 -162015 -325571 -47419 24498 -62493 -182584
18781a82584g8028j37261R9996l31617c0318E7406J08000k6911b22933Q9807F9148
$$ -182584 -78028 -215289 -115293 -446910 -30318 57406 165406 138495 -222933 -133126 69148
18769A12576a64103O9335K9685B5734a48886N7573C37679a10595r0043J6281B2069
$$ 112576 -164103 -94768 -65083 25734 -148886 -91313 337679 -110595 -200638 -184357 22069
18757c69923R5925A088d927B3761J16005b84838O0258E7963d18957B46045H0086
$$ -369923 -273998 1088 -4927 23761 139766 -284838 -224580 57963 -418957 246045 80086
18745A65690c58996f6790K3897j7567j73871e3934C18850c751A33322A4316i0443
$$ 165690 -358996 -66790 -42893 -60460 -234331 -53934 318850 -3751 133322 14316 -90443
18733C09669b14271j08628i6673j1298k22586b9738q0383B03063m1229H270d0689
$$ 309669 -214271 -322899 -96673 -107971 -330557 -29738 -110121 203063 161834 8270 -40689
18721A77792c03797C04316a79867P7957d2916p2943r0955L0449E5092c0639k51075
$$ 177792 -303797 304316 -179867 -101910 -42916 -115859 -206814 -176365 55092 -30639 -281714
18710b81714a28767A16025E0790j287k3646A1912a29211G8327c24191A87138E6550
$$ -281714 -128767 116025 50790 49503 25857 11912 -129211 78327 -324191 187138 56550
18698G9616a11836e4134j26211B81612b98152E172a07415B74751i1835k1425k17880
$$ 79616 -111836 -54134 -180345 281612 -298152 5172 -107415 274751 -91835 -113260 -331140
18687c31140P2056e9158B5687J4703d07881B9242J32699n3739D5027J39707i6913
$$ -331140 -259084 -59158 25687 40390 -407881 29242 161941 108202 45027 184734 -96913
18675A9299a4359E6669a59936k2049A60729g2889q4556C2663J32399a48722F4036
$$ 19299 -14359 56669 -159936 -181985 160729 -72889 -157445 32663 165062 -148722 64036
18663H2366c51295g6912H1161L9780e2604H8386J5138a06966j20365o9574c2053
$$ 82366 -351295 -76912 81161 120941 -52604 88386 103524 -106966 -227331 -296905 -32053
18651b95348a45270r413d2821A59691a77606k1875d5420a8251k49068Q2084G0474
$$ -295348 -145270 -154683 -42821 159691 -177606 -199481 -45420 -18251 -267319 -185235 70474
18639B69806b87523C97425c75143O057d8115E5096b30320o3979J30501B50810
$$ 269806 -287523 397425 -375143 -369086 -48115 55096 -230320 -294299 -163798 250810
18628C83894e29966g0448B36617A18068i7243j24023D9757d6114D1451b36391
$$ 383894 -529966 -70448 236617 118068 -97243 -221266 49757 -46114 41451 -236391
18617d8575A55113a78467a6916A54004f7451A37220b63063f6345k5338A56909
$$ -48575 155113 -178467 -16916 154004 -67451 137220 -263063 -66345 -91683 156909
18606i8772j37235O6921f5906J5739j82377N449A41119J39856c05279P5348A47783
$$ -98772 -236007 -169086 -65906 -50167 -232544 -227095 141119 280975 -305279 -229931 147783
18594C52487a86666F9063a98352c3250r2282e3550k70105D562a83399M3570j70990
$$ 352487 -186666 69063 -198352 -33250 -125532 -53550 -323655 4562 -183399 -139829 -310819
18583c10819B76048E6459Q649M8871i2632n9897m3331c1843B02714a25392A70720
$$ -310819 276048 56459 65108 113979 -92632 -152529 -195860 -31843 202714 -125392 170720
18571f0200k24739D709a55702M5831J3420d3237C9340a34876j22043j25948Q4679
$$ -60200 -284939 4709 -155702 -109871 -96451 -43237 39340 -134876 -256919 -382867 -298188
18560b98188h1887B29274a88093B8636K84948F1391b13894h877F1692a478l48819
$$ -298188 -81887 229274 -188093 28636 313584 61391 -213894 -8877 61692 -1478 -350297
18549c50297C2470M0752b26796a05711M2649k89573D4492b60821a079m8870j8762
$$ -350297 32470 73222 -226796 -105711 -63062 -352635 44492 -260821 -1079 -49949 -68711
18538f8711F985L8618a12434J8858A85733b06746F4073a59108r6951O2956R4861
$$ -68711 6985 45603 -112434 -93576 185733 -206746 64073 -159108 -256059 -193103 -98242
18527i8242C0640L0420Q0519h1214F492J12612L2149e56828A05638c28811C71790
$$ -98242 30640 61060 141579 -81214 6492 119104 151253 -556828 105638 -328811 371790
18515a71328A43045k459D3925J13507a3540k99213J20334D4080f9080I4320j6259
$$ -171328 143045 140586 43925 157432 -13540 -312753 -192419 44080 -69080 94320 78061
18504G8061J36492K5184r5284b134D27154a90983j03435A08292f8944j71464d4848
$$ 78061 214553 239737 144453 -2134 427154 -190983 -294418 108292 -68944 -240408 -44848
18492a74528k30365J09870a36282A25470b66780B52489a86634A6077a43091G0702
$$ -174528 -404893 -295023 -136282 125470 -266780 252489 -186634 16077 -143091 70702
18481B92010A45392m292a82560J784c5732C48790G1378M466Q1935b60814b0544
$$ 292010 145392 141100 -182560 -180776 -35732 348790 71378 75844 157779 -260814 -20544
18469e63815E5304g0342l8936A4726o141O1921M617K4932h5590r4561j19599a46786
$$ -563815 55304 -70342 -109278 14726 8585 70506 75123 100055 -85590 -180151 -299750 -146786
18456a62379f9856J0006I0249a01401L2421k85449a01098C36111b58425o5663
$$ -162379 -69856 -59850 90249 -101401 -68980 -354429 -101098 336111 -258425 -324088
18446c24088A1458J22515F587L73859o6339a92523m6443m9019k5691a53952k35697
$$ -324088 11458 133973 6587 380446 314107 -192523 -238966 -287985 -313676 -153952 -389649
18435c89649a12820E0352A4136b5009B37932b42278M8626o7240J116B01030B0178
$$ -389649 -112820 50352 14136 -25009 237932 -242278 -193652 -260892 -259776 201030 20178
18423a09065j1940j80769A6811i6817j98115e3398I8104C2368b93089I798L09214
$$ -109065 -121005 -301774 16811 -96817 -294932 -53398 98104 32368 -293089 9798 319012
18412C19012b38628a6434j18294m0332C1544c66465E7634J69177E6618a172B49260
$$ 319012 -238628 -16434 -134728 -175060 31544 -366465 57634 226811 56618 -1172 249260
18400b87239R3659k17930H5114a44906a5822j06265r2674R8543A2107J72922a22667
$$ -287239 -193580 -411510 85114 -144906 -15822 -122087 -214761 -116218 12107 185029 -122667
18388I3271M8140k3335c48089j01587a57576M2061A69951j5035A7753K71919A22868
$$ 93271 141411 118076 -348089 -449676 -157576 -115515 169951 154916 17753 289672 122868
18376b35882A86290h0126A35018d6365j51198g4479B57438A28601i669j94020
$$ -235882 186290 -80126 135018 -46365 -197563 -74479 257438 128601 -9669 -203689
18366b03689c1468j3350A22162a38615A16987J7007b9071A33131L2980b19431
$$ -203689 -31468 -44818 122162 -138615 116987 133994 -29071 133131 166111 -219431
18355d34110a52793j38813I9425a70117p3917D2224a57979D4664c50614a24737
$$ -434110 -152793 -291606 99425 -170117 -244034 42224 -157979 44664 -350614 -124737
18344b4469m0926D7375J57123b48252R3913m014B01702a06134A4436a68904B0342
$$ -24469 -65395 47375 204498 -248252 -154339 -158353 201702 -106134 14436 -168904 20342
18332b00901G9335c07039B05417B8768Q5807a61357F1692a24879B42573b19874
$$ -200901 79335 -307039 205417 28768 114575 -161357 61692 -124879 242573 -219874
18321c08859D9994j0310a52641A90548D9207L85207A94149n0434a76509B1574
$$ -308859 49994 39684 -152641 190548 49207 434414 194149 143715 -176509 21574
18310E9435a40161I3436a05257a7995A42666g3543k79812J31161A98310c4291
$$ 59435 -140161 93436 -105257 -17995 142666 -73543 -353355 -222194 198310 -34291
18299b1727j10153M8563j26634B17049b15039E5937A2467a91873B40091e1166
$$ -21727 -131880 -83317 -209951 217049 -215039 55937 12467 -191873 240091 -51166
18288A36312b16181A13067c26488A47074m0930h0683m2110B3865d48135I36J4332
$$ 136312 -216181 113067 -326488 147074 106144 -80683 -122793 23865 -448135 936 15268
18277A5268b42589A20286Q5766C9409P884K77980c7677k75557J33154A35450C7122
$$ 15268 -242589 120286 206052 39409 47293 325273 -37677 -313234 -180080 135450 37122
18265a26718G3372a8500B5689K92616a20488q253A03786a19010J0029D2241a94401
$$ -126718 73372 -18500 25689 318305 -120488 -128741 103786 -119010 -108981 42241 -194401
18253A57716f0510C7408d5324H5997b1577j89629e3234J4123n6340K8524K2181
$$ 157716 -60510 37408 -45324 85997 -21577 -211206 -53234 -39111 -95451 -66927 -44746
18242d4746D5237a14412k71988J09346f7259c1478I4355M2897K039K5891g0394
$$ -44746 45237 -114412 -386400 -277054 -67259 -31478 94355 137252 139291 165182 -70394
18230c0574l39625H0069b592B49644c53859C5231b04099A00096b68057d7685H1819
$$ -30574 -370199 80069 -2592 249644 -353859 35231 -204099 100096 -268057 -47685 81819
18218e3775C03503b33062A42666J75302c23922a05450C6754b01836L2958B49539
$$ -53775 303503 -233062 142666 317968 -323922 -105450 36754 -201836 -168878 249539
18207b25856c3819J3752j17472H890O4330N20052a71818e0573k23881o7358A17618
$$ -225856 -33819 -20067 -137539 8890 73220 593272 -171818 -50573 -274454 -341812 117618
18195c10280d7152l9952B0192J0683b14749E2278A7701J2481h1251C9764b7179
$$ -310280 -47152 -87104 20192 30875 -214749 52278 17701 30182 -81251 39764 -27179
18183i969A80323Q3566D1628a90434B51730k0755a58488j18221B14826o7382L1579
$$ -9969 180323 263889 41628 -190434 251730 230975 -158488 -276709 214826 147444 179023
18172A79023b11286N4590e7767m67252H2436A874Q4256A1200a65442B45585i478
$$ 179023 -211286 -156696 -57767 -525019 82436 1874 86130 11200 -165442 245585 -9478
18160c8429A25248d5715p3910I9973a57655B80305q4090b63450H2578i6412l4585
$$ -38429 125248 -45715 -119625 99973 -157655 280305 196215 -263450 82578 -96412 -130997
18149a30997C19873A7160N9087c24788A1408K58232r1213c84534A91954a30972
$$ -130997 319873 17160 76247 -324788 11408 269640 178427 -384534 191954 -130972
18138b44464G4423o052k7328A9996J04410l2457d35078a53389l0400M7347o0737
$$ -244464 74423 68371 41043 19996 124406 91949 -435078 -153389 -183789 -136442 -197179
18127a97179B0545a7433A68332B1326K0542a875A23382n0196h6314E9719a60058
$$ -197179 20545 -17433 168332 21326 41868 -1875 123382 73186 -86314 59719 -160058
18115A71728a52698e0063k12583l5939a4453o1359K2143j4443n4679k00449g5221
$$ 171728 -152698 -50063 -262646 -298585 -14453 -75812 -53669 -68112 -122791 -323240 -75221
18103f6061b6978E8571b0156A84295c16256E68b20577g5174K6885m516r3899I7314
$$ -66061 -26978 58571 -20156 184295 -316256 568 -220577 -75174 -48289 -52805 -146704 97314
18090B0202c29585p6527J61192c1949j16834g1442k38969m8979J68133L7839j4116
$$ 20202 -329585 -406112 -244920 -31949 -148783 -71442 -310411 -359390 -191257 -153418 -167534
18079a67534H3838a72992l0988B4008b20562e2697m1667a716l06630A26863K51309
$$ -167534 83838 -172992 -203980 24008 -220562 -52697 -94364 -1716 -308346 126863 378172
18068C78172H0690L8718p229h9600j07965h7363D8359j585g4779A14813c5415
$$ 378172 80690 119408 112179 -89600 -197565 -87363 48359 46774 -74779 114813 -35415
18056a60052L4431j01238A29560a43821A61929h3985a694C14724a36128Q478m7836
$$ -160052 -125621 -226859 129560 -143821 161929 -83985 -1694 314724 -136128 -127650 -175486
18045a75486A1803B74b1162l77557h6697A50503o8987J19563l5972G8789b0210
$$ -175486 11803 274 -21162 -398719 -86697 150503 81516 201079 165107 78789 -20210
18033A42551A2443N0865K98299i1527b4306I9283K85611h7328j12294A32218G702
$$ 142551 12443 63308 361607 -91527 -24306 99283 384894 -87328 -199622 132218 7702
18021A40578M4159b91914C20383c70048a81892N2662j25055f1612B65218L0458
$$ 140578 184737 -291914 320383 -370048 -181892 -129230 -254285 -61612 265218 295676
18011B95676C4265P5887B797d1174B29480a82053f1293B2990a42220e5916I1686
$$ 295676 34265 110152 2797 -41174 229480 -182053 -61293 22990 -142220 -55916 91686
17999d6489i693A37982a35501A51370a54388A03097m6636k3486K5909c72808a71230
$$ -46489 -9693 137982 -135501 151370 -154388 103097 56461 32975 58884 -372808 -171230
17987b65752I2068b35097A87879e0563p3807A10256b56944I4198a25096E4409
$$ -265752 92068 -235097 187879 -50563 -124370 110256 -256944 94198 -125096 54409
17976A32841b30012a05279B6106b04872f7838a3266j84247B41474b22738L8553
$$ 132841 -230012 -105279 26106 -204872 -67838 -13266 -197513 241474 -222738 -184185
17966a84185j66675G6107h2155E9486N0377c33490h0300b8287j22001j11024d4434
$$ -184185 -350860 76107 -82155 59486 109863 -333490 -80300 -28287 -150288 -261312 -44434
17954b02207e5545b1667j67218H0924J00044E9505c09467h9233b7365B490a16772
$$ -202207 -55545 -21667 -188885 80924 180968 59505 -309467 -89233 -27365 2490 -116772
17942A64172J24393l8077b54842D97089E7095N2679b13292I395K3299e8377j37577
$$ 164172 288565 250488 -254842 497089 57095 109774 -213292 9395 32694 -58377 -195954
17931a95954d69j896I1882B3177b23864F7163J24491a43645C2813N2121P6965
$$ -195954 -469 -2365 91882 23177 -223864 67163 191654 -143645 32813 84934 161899
17920A61899c1199k58668a28507C36528H3127O1567g5332q5125K3719l0449b9961
$$ 161899 -31199 -289867 -128507 336528 83127 144694 -75332 -160457 -136738 -167187 -29961
17908A95469i30j43552A65894b41869A11660J61339a40664A806K01037O6900b31766
$$ 195469 -930 -144482 165894 -241869 111660 272999 -140664 1806 202843 269743 -231766
17896A11954B267L50813G0732J53630C4016b22748A51229J7557D7330h4638L2598
$$ 111954 2267 353080 70732 224362 34016 -222748 151229 168786 47330 -84638 -52040
17885e2040n7130K4152C4419N7467j5460a02109G2164O4852F818P9621J13327
$$ -52040 -109170 -85018 34419 91886 76426 -102109 72164 137016 6818 86439 199766
17874A99766F5239J963c9333k27544a2485k08965A97585b72500D09529h9672d0745
$$ 199766 65239 67202 -39333 -266877 -12485 -221450 197585 -272500 409529 -89672 -40745
17862a70161b1447k53552a2822j9917j10882C72331a16053n7521J5360A11377
$$ -170161 -21447 -274999 -12822 -32739 -143621 372331 -116053 -173574 -158214 111377
17851c15241H3664J2796J87081C0481a39783d4199B24777C470c15261A9899J25937
$$ -315241 83664 96460 283541 30481 -139783 -44199 224777 3470 -315261 19899 145836
17840A45836b85131i6969j39256B65124g1639a1169B63252D6299a50653I8528
$$ 145836 -285131 -96969 -236225 265124 -71639 -11169 263252 46299 -150653 98528
17829A8691a30268A06963a38632B06720o9207g4878I4134O5766C3987b76870A36751
$$ 18691 -130268 106963 -138632 206720 137513 -74878 94134 159900 33987 -276870 136751
17817C95278b9048A23107f9690c4030A81455N8907I7082J02825h6864B80147c3474
$$ 395278 -29048 123107 -69690 -34030 181455 240362 97082 199907 -86864 280147 -33474
17805a5910j71563A6857e1639j936A10768J11686B7139J02240j2807C9464b07967
$$ -15910 -187473 16857 -51639 -53575 110768 222454 27139 129379 116572 39464 -207967
17793a48564j52213b398B00865n6440c023J311A6399M92267A05479a63459P9825
$$ -148564 -300777 -2398 200865 144425 -3023 -1712 16399 508666 105479 -163459 -83634
17782h3634j76234a07662N0064J617B1460a05122N2180h94r8643k5606A00651
$$ -83634 -259868 -107662 -57598 -55981 21460 -105122 -52942 -894 -99537 -125143 100651
17770E885J56255o7589a41610J7378C60287C5294a96895m2501G8156b86828J05586
$$ 5885 162140 94551 -141610 -124232 360287 35294 -196895 -239396 78156 -286828 -181242
17759a81242B20631E3953b75923Q2923B51723a00293C5736b4737D0246K27057
$$ -181242 220631 53953 -275923 -193000 251723 -100293 35736 -24737 40246 267303
17749B67303D7475R1651P3557a13113n9992B12981E3992B1996K58646G5603f9102
$$ 267303 47475 139126 212683 -113113 -173105 212981 53992 21996 280642 75603 -69102
17737a26885j55569A40642a00513A37031e0004A70670k1989b9132B395J63405
$$ -126885 -282454 140642 -100513 137031 -50004 170670 148681 -29132 2395 165800
17727A65800a07240j50287p99k2983J13434G4746a69952L7673j081K9968A00883
$$ 165800 -107240 -257527 -258326 -281309 -167875 74746 -169952 -132279 -133360 -103392 100883
17715I1326d0649j48336H8981e3038C79983b09044n0665I7076a70648B57844e7047
$$ 91326 -40649 -188985 88981 -53038 379983 -209044 -259709 97076 -170648 257844 -57047
17703b78392B98962m6909a79827e3912j25237B37269a2129m1022j34213a4011
$$ -278392 298962 252053 -179827 -53912 -179149 237269 -12129 -53151 -187364 -14011
17692A15545a78210j7523l5709h6545J7855b8007j04902M3775j18370c3250A84390
$$ 115545 -178210 -195733 -231442 -86545 -68690 -28007 -132909 -89134 -207504 -33250 184390
17680a04208L3440a8349j99011h7581A41575F4922K59292d8389a9219A65129m1336
$$ -104208 -70768 -18349 -217360 -87581 141575 64922 324214 -48389 -19219 165129 123793
17669A23793a92077A58682C8530b88581J24149h1507a4643B0723L23057p4215
$$ 123793 -192077 158682 38530 -288581 -164432 -81507 -14643 20723 343780 269565
17659B69565a53969H643P2275a13854l5121A97841O9950g9686C07752b39588C09227
$$ 269565 -153969 8643 80918 -113854 -148975 197841 267791 -79686 307752 -239588 309227
17647B46467i4929C0133k098a43517B60248j17490i6582E6410F161e4877j59964
$$ 246467 -94929 30133 28035 -143517 260248 142758 -96582 56410 6161 -54877 -214841
17636b14841h3915j56828Q5185e1703A40210A8886K12167e7841r8827A09319J15617
$$ -214841 -83915 -240743 -155558 -51703 140210 18886 231053 -57841 -156668 109319 224936
17625B24936f5201A04484b63623B10528D6530A3393c05670B6281d1167o2721A03774
$$ 224936 -65201 104484 -263623 210528 46530 13393 -305670 26281 -41167 -103888 103774
17613A62629e9151C5970j314a77364I2385n15A8503e6550E3107A1740b08585G239
$$ 162629 -59151 35970 34656 -177364 92385 91870 18503 -56550 53107 11740 -208585 7239
17600c502j29269C1993R7263a46968A15691l0592d5397C47565a35626G0427J14091
$$ -3502 -132771 31993 129256 -146968 115691 85099 -45397 347565 -135626 70427 184518
17589A84518F2320K14125G0368R4802F0382B4129a23535e0048B64254r8182D0957
$$ 184518 62320 276445 70368 165170 60382 24129 -123535 -50048 264254 166072 40957
17577B32747a59277M2005A86259h9996A13801b35018h4567j0111K2552a398j26792
$$ 232747 -159277 -117272 186259 -89996 113801 -235018 -84567 -94678 -72126 -1398 -128190
17566a28190J6889A13867a43932B1361N5835K16882A35155f3488k3012c0405A43194
$$ -128190 -111301 113867 -143932 21361 77196 294078 135155 -63488 -86500 -30405 143194
17554A34129a30997f3025B39315B6065M4576K45750H2363e4308G6484B1821K84460
$$ 134129 -130997 -63025 239315 26065 70641 316391 82363 -54308 76484 21821 306281
17543C06281a90894c017r4736d0277f623A50666p0343J38871b12172A92495B1342
$$ 306281 -190894 -3017 -97753 -40277 -6623 150666 80323 219194 -212172 192495 21342
17531a78954I230M1433K72540q574b288r6974d146B10391a9082B90884o4910K3585
$$ -178954 9230 50663 323203 314629 -2288 -99262 -4146 210391 -19082 290884 225974 249559
17519B49559K10841A84781k4421J50585J13302H6102K8262l7115K53364c1316
$$ 249559 460400 184781 160360 310945 424247 86102 114364 77249 330613 -31316
17508A55596J16545K34664b9801m3067m7249L201C83402j43744J29138c0545C87928
$$ 155596 272141 506805 -29801 -72868 -120117 -116916 383402 239658 368796 -30545 387928
17496B07622b7960B8938a39850F3101K15591P5264J12319F477K25717m7457C5547
$$ 207622 -27960 28938 -139850 63101 278692 353956 466275 6477 232194 184737 35547
17484A05907K6609m3976K9615J8331M3156k8196L12948A05658J66955G853L07444
$$ 105907 132516 88540 118155 136486 179642 151446 464394 105658 272613 7853 315297
17473C15297k4285j24023L24621b8385i392B01230J44089k8039n5134P142b8231
$$ 315297 291012 166989 491610 -28385 -9392 201230 345319 317280 262146 269288 -28231
17461E7142K53213j3862b1033C97464q7814I9650i4492A91885Q2331L1303M2571
$$ 57142 310355 296493 -21033 397464 309650 99650 -94492 191885 274216 305519 348090
17450C48090a13330C58028r0276l4451L33130B02526b5175A42274J0503J14712
$$ 348090 -113330 358028 267752 233301 566431 202526 -25175 142274 152777 267489
17440B67489o9646l4160P0395j12556m300K27695j13920h071B27928L0851J06598
$$ 267489 197843 163683 234078 121522 117222 344917 230997 -8071 227928 258779 365377
17429C65377l5038I1507a44761D66799J28543B33165j7176K38990A87802F7930
$$ 365377 330339 91507 -144761 466799 595342 233165 215989 454979 187802 67930
17418B76933o8804J23419R5860A98661r567K41154j89059N4703M55640A99295
$$ 276933 208129 331548 427408 198661 189094 430248 241189 295892 751532 199295
17407C40564N3278I6037J62981b3815j79149d4515A43733l2298g4317a8461k05261
$$ 340564 393842 96037 259018 -23815 -202964 -44515 143733 111435 -74317 -18461 -223722
17396b23722I4084J56544A5825J09403J99928L9857A44295J17697A5316O2524
$$ -223722 94084 250628 15825 125228 325156 365013 144295 261992 15316 77840
17386G7840M2092M40069H0842b55819E87730A36848m6120N2112a16222e1583r7602
$$ 77840 119932 560001 80842 -255819 587730 136848 90728 142840 -116222 -51583 -149185
17375a49185A19595J88289n382J4861j10899Q8051r833H1064l4236J94926r1810
$$ -149185 119595 307884 302502 317363 206464 294515 284682 81064 46828 241754 149944
17364A49944G2736J11156p9627c9312A50268c9421A99078m1789n6136M7347f9374
$$ 149944 72736 183892 104265 -39312 150268 -39421 199078 157289 101153 148500 -69374
17352B22609p4740J91334j03832o6023M3650l7154E813M2402j7236J44314k5283
$$ 222609 147869 339203 235371 169348 212998 175844 5813 48215 30979 175293 150010
17341A50010b9954D11670j95450r5478h1637c7051H4048L18337c22526a44703
$$ 150010 -29954 411670 216220 120742 -81637 -37051 84048 402385 -322526 -144703
17330I5436j1297J67918a87963B76050a07273e1164B78789c06779B00142m2233
$$ 95436 84139 252057 -187963 276050 -107273 -51164 278789 -306779 200142 157909
17320A57909c7652A16899c9110C94846F5594M5225J5433N3860m4680K95971H8901
$$ 157909 -37652 116899 -39110 394846 65594 110819 126252 180112 135432 431403 88901
17308C76217j20821b58505n9278A12027j9386q656J21854L5170N1723i2702l2583
$$ 376217 255396 -258505 -317783 112027 92641 83985 205839 241009 292732 -92702 -125285
17297a25285C01048A00183R9151r252R0854j292i7743A83781K80073A30142J8789
$$ -125285 301048 100183 199334 190082 280936 279644 -97743 183781 463854 130142 148931
17286A48931J1353i0619B00670k2435R6290A15348J38427L7797I3889L07518A21877
$$ 148931 160284 -90619 200670 178235 274525 115348 253775 291572 93889 401407 121877
17274d5745B09253J17143A59088A4174J66151n5837J4L97870A30572K60936M8237
$$ -45745 209253 326396 159088 14174 180325 124488 124502 522372 130572 391508 439745
17263D39745A48774J82569j44565J30408A31904o4219J71638I8312J43984m0872
$$ 439745 148774 331343 186778 317186 131904 67685 239323 98312 242296 201424
17253B01424D7079f1897I2217J5983e999B78597l9447p169P8612H8351a49312
$$ 201424 47079 -61897 92217 108200 -5999 278597 239150 231981 310593 88351 -149312
17241B94754K169A35058M0369k5489b3946E2388J87801j5904k4039B4366L87730
$$ 294754 296923 135058 175427 149938 -23946 52388 240189 224285 200246 24366 412096
17230D12096G1132K4826J76620D3468Q3416J66879J38489Q3842D3495J18824K04283
$$ 412096 71132 95958 272578 43468 126884 293763 432252 516094 43495 162319 366602
17219C66602J5461K68125B43052J65242n7232c9595A82066J75284A73434O3666
$$ 366602 382063 650188 243052 408294 351062 -39595 182066 357350 173434 237100
17209B37100r8699N5353M354P3395j06046K99235j70973M3392E2979K02394j24771
$$ 237100 138401 193754 198108 271503 165457 464692 293719 337111 52979 255373 130602
17198A30602J54898j32730n669J36477K24337B7838L93629d3144F9822J60124
$$ 130602 285500 152770 147101 283578 507915 27838 421467 -43144 69822 229946
17188B29946J20244N587d2201D45379j96148J07353G5789R1156L04664j30269
$$ 229946 350190 355777 -42201 445379 249231 356584 75789 166945 471609 341340
17178C41340j11472C8481L07214J8243j18212o2414i1814C20611J060q5565L08936
$$ 341340 229868 38481 345695 363938 245726 183312 -91814 320611 321671 236106 545042
17167E45042j52404A51982J27653o768A22300B4187L63526j46772L22239R8764
$$ 545042 392638 151982 279635 272867 122300 24187 387713 240941 563180 661944
17157F61944C22003A04463M31162P6137m7028B44954K10935k10439j3960M6528
$$ 661944 322003 104463 535625 611762 564734 244954 455889 245450 231490 278018
17147B78018K75478k35227J07454k05680K85735Q8925j67838Q477m8693q6292
$$ 278018 553496 318269 425723 220043 505778 594703 426865 435342 386649 300357
17137C00357p8888J03854K75654j69786C9610J48312N11763H793M07106j79686
$$ 300357 221469 325323 600977 431191 39610 187922 699685 8793 415899 236213
17127B36213J99459k4596o9935L4662A77489J67662A30401Q7984b4269B05737
$$ 236213 435672 411076 341141 375803 177489 345151 130401 218385 -24269 205737
17116b2757D24880L7358J90226k4324B71140M3237m7990j12613L21763j21347
$$ -22757 424880 462238 652464 628140 271140 314377 266387 153774 475537 354190
17106C54190M501N07049B71629K68255j15452j26076J12456J00443B54500M25417
$$ 354190 358691 865740 271629 539884 424432 298356 410812 511255 254500 679917
17096F79917l25733L11365B79707J55302j44163K89874j8039p0764J78396J4495
$$ 679917 354184 665549 279707 435009 290846 580720 562681 491917 670313 684808
17086F84808k36967K30253k55631k4918J6309J3742K29862Q259k70227o2341K15917
$$ 684808 447841 678094 422463 397545 413854 427596 657458 665717 395490 333149 549066
17075E49066K7237m6070k58762J78128R9894j74797R4378j2588o3256L57899j81866
$$ 549066 576303 530233 271471 449599 549493 374696 469074 456486 393230 751129 569263
17064E69263k02288K25568m8808c3327D00117m9334N60115q9836B81211P2389
$$ 569263 366975 592543 543735 -33327 400117 350783 910898 821062 281211 353600
17054C53600K23857k33481J91650j10051A64763L59726L1533p6189K12678j74362
$$ 353600 577457 343976 535626 425575 164763 524489 556022 479833 692511 518149
17044E18149j34136J29769J20001B32056L66821J54729K13864C34348J37489j30606
$$ 518149 384013 513782 633783 232056 598877 753606 967470 334348 471837 341231
17034C41231Q2764J34265m0911J20170j10923l3597N5543k9445K25648k58665
$$ 341231 423995 558260 517349 637519 526596 492999 548542 519097 744745 486080
17024D86080R1880j49501J99649K87705l22832j84317J2124k9179L07689O4817
$$ 486080 577960 428459 628108 915813 592981 408664 420788 391609 699298 764115
17014G64115R7973j66988Q5244n9776j99114J37545J82269j94985j6313N6388
$$ 764115 862088 695100 780344 720568 521454 658999 841268 646283 629970 686358
17004F86358J35812M5411O8465K1217K8359J14995j6943n36042K34024k61030
$$ 686358 822170 867581 936046 957263 985622 1100617 1083674 547632 781656 520626
16994E20626K82795p251q7375j04658J07570l08744L67520J70859N0158n2865
$$ 520626 803421 796170 708795 604137 711707 402963 770483 941342 991500 938635
16984I38635J11056l04340K75471k08954J71115j8733j29042J24843K04493k73175
$$ 938635 1049691 745351 1020822 811868 982983 964250 835208 960051 1164544 891369
16974H91369O4004M5413j56466J883M63287l57631n4845L712J11366l0444q6763
$$ 891369 955373 1000786 844320 846203 1309490 951859 897014 900726 1012092 981648 894885
16963H94885M4607j31368L39223j3220r8595K47547j58169k06101K81459o57P4804
$$ 894885 939492 808124 1147347 1134127 1035532 1283079 1124910 918809 1200268 1199611 1274415
16952A274415q280o8716k40818J96521j53767k7423J74888K41952k59007J59724
$$ 1274415 1266135 1197419 956601 1153122 999355 971932 1146820 1388772 1129765 1289489
16942A289489k26228K94250L47353j68194k17994n7567K96602j60764K67735j93707
$$ 1289489 1063261 1357511 1704864 1536670 1318676 1261109 1557711 1396947 1664682 1470975
16932A470975M4259m83366L32938K55944n8442o6152l25103K03930Q5892l9381
$$ 1470975 1515234 1031868 1364806 1620750 1562308 1496156 1171053 1374983 1460875 1421494
16922A421494R6327K82872j53766l21440K14559L61830l38621l2805M2199J23077
$$ 1421494 1517821 1800693 1646927 1325487 1540046 1901876 1563255 1530450 1572649 1695726
16912A695726j76710J27461K8955n2545j58385J93927k81693L99308J73416j48301
$$ 1695726 1519016 1646477 1675432 1622887 1464502 1658429 1376736 1776044 1949460 1801159
16902A801159k83699O86668j98373k0769K04677k09834j34817L1153J28280l3310
$$ 1801159 1517460 2204128 2005755 1984986 2189663 1979829 1845012 1876165 2004445 1971135
16892A971135j6633J8118J56794k63988K71343q7707k62194j40726N70496k18716
$$ 1971135 1954502 1972620 2129414 1865426 2136769 2049062 1786868 1646142 2216638 1997922
16882A997922K06351K25690J92565m83651J8556K78194j97195L83272j46407j90372
$$ 1997922 2204273 2429963 2622528 2138877 2157433 2435627 2238432 2621704 2475297 2284925
16872B284925M16607k43385J12286R4415L812J24566K71248k17093J90318q1728
$$ 2284925 2701532 2458147 2570433 2664848 2668660 2793226 3064474 2847381 3037699 2955971
16862B955971q2835K07083l3272j36444M6402K33420m8672J78842j75248K28195
$$ 2955971 2873136 3080219 3046947 2910503 2956905 3190325 3141653 3320495 3145247 3373442
16852C373442k6399j15902j77321L47051N555K37813M3752l9832j22621M55408
$$ 3373442 3347043 3231141 3053820 3400871 3406426 3644239 3687991 3648159 3525538 3980946
16842C980946j53537K16735M7085J16302o9519M5392R5367n4634m1931J51557
$$ 3980946 3827409 4044144 4091229 4207531 4138012 4183404 4278771 4224137 4182206 4333763
16832D333763M11337N0798m3926k11733O71831k68624K40664J20284k55951L31791
$$ 4333763 4745100 4795898 4751972 4540239 5212070 4943446 5184110 5304394 5048443 5380234
16822E380234K4637L32990j03165K45401j20360M00274j34650J41617M15906k37340
$$ 5380234 5404871 5737861 5634696 5880097 5759737 6160011 6025361 6166978 6582884 6345544
16812F345544K87511J78394M1238K0966N11472O4425j040J92602J88205N66200
$$ 6345544 6633055 6811449 6852687 6873653 7385125 7449550 7448510 7641112 7829317 8395517
16802H395517j83890K45413P8386L60730L41420o5523J67714N04875J04014K42100
$$ 8395517 8211627 8457040 8535426 8896156 9237576 9172053 9339767 9844642 9948656 10190756
16792A0190756J51325L34626K69523M06140K09425J66431O59497M18211k945O68573
$$ 10190756 10342081 10676707 10946230 11352370 11561795 11728226 12387723 12805934 12802989 13471562
16782A3471562K72725N32345J26010N24414N88305K67456N03736K65978P64616
$$ 13471562 13744287 14276632 14402642 14927056 15515361 15782817 16286553 16552531 17317147
16773A7317147Q48089L75987M56802P99374P42377P85250N54258J028615N29443
$$ 17317147 18165236 18541223 18998025 19797399 20539776 21325026 21879284 22907899 23437342
16764B3437342R43734R93104J178748J052763J273219O02790J060994J656722
$$ 23437342 24381076 25374180 26552928 27605691 28878910 29481700 30542694 32199416
16756C2199416J142577J722991J763470J531076J391339K295089J850507K542528
$$ 32199416 33341993 35064984 36828454 38359530 39750869 42045958 43896465 46438993
16748D6438993J756294K747314K192916K827432K994439L206924L268885L893853
$$ 46438993 48195287 50942601 53135517 55962949 58957388 62164312 65433197 69327050
16740F9327050M106327L845731M887273M525799N147526N147017N965985O041827
$$ 69327050 73433377 77279108 82166381 86692180 91839706 96986723 102952708 108994535
16732A08994535O495814O610057P537388P601848O949025P752369P615621P165738
$$ 108994535 115490349 122100406 129637794 137239642 144188667 151941036 159556657 166722395
16724A66722395P137325O931325O116212M986655M652725L040998J724743N43866
$$ 166722395 173859720 180791045 186907257 191893912 196546637 199587635 201312378 201856244
16716B01856244r06336j819856l575244m216237n262304o419147p084175p240022
$$ 201856244 200949908 199130052 195554808 191338571 186076267 179657120 172572945 165332923
16708A65332923p529124p975109p678403p807008p492499p099259o784905o787361
$$ 165332923 157803799 149828690 142150287 134343279 126850780 119751521 112966616 106179255
16700A06179255n946896n827114n657846m976966m782092m768605m429116l679117
$$ 106179255 100232359 94405245 88747399 83770433 78988341 74219736 69790620 66111503
16692F6111503l792624l658399k823726l043135k709617k564260k634744k092222
$$ 66111503 62318879 58660480 55836754 52793619 50084002 47519742 44884998 42792776
16684D2792776j972040j927193j603334j961513j778104j589787j081183j578747
$$ 42792776 40820736 38893543 37290209 35328696 33550592 31960805 30879622 29300875
16676B9300875j036726j330615j115892j119827q66799r44673r96139n60839r28044
$$ 29300875 28264149 26933534 25817642 24697815 23831016 22886343 21890204 21329365 20401321
16667B0401321p06731m11343o18630j179525j95874k84862j033413l92366p59541
$$ 20401321 19694590 19283247 18664617 17485092 17289218 17004356 15970943 15578577 14819036
16658A4819036l44567k78165q06773m82798j55952j67045q02280M8309j97210
$$ 14819036 14474469 14196304 13389531 12906733 12750781 12583736 11781456 11829765 11632555
16649A1632555o05376j33390n39084l63021l06946k3279j89014m48508l19675
$$ 11632555 11027179 10893789 10354705 9991684 9684738 9661459 9472445 9023937 8704262
16640H704262r8725j54099k16931n87195K13204m28345Q1863o8790j34555l97601
$$ 8704262 8605537 8451438 8234507 7647312 7860516 7432171 7514034 7445244 7310689 6913088
16630F913088m35805L34707l17483k97530Q283k77958o264l44399L17915r3703
$$ 6913088 6477283 6811990 6494507 6196977 6205260 5927302 5921038 5576639 5894554 5800851
16620E800851m60734k45375q6889J32123m08107J73821j04741L43954o63978K99330
$$ 5800851 5340117 5094742 5007853 5139976 4731869 4905690 4800949 5144903 4480925 4780255
16610D780255l36458j55448j1458O050p1984m639l44184J17670k29811p3651R7418
$$ 4780255 4443797 4288349 4276891 4282941 4210957 4206318 3862134 3979804 3749993 3676342 3773760
16599C773760N149l37992O330P3138m47511N76429l00024m02556J69660j67982
$$ 3773760 3778909 3440917 3447247 3520385 3072874 3649303 3349279 2946723 3116383 2948401
16589B948401K83289k14923q5j74826l47777M62324k65392J68700j55734j25442
$$ 2948401 3231690 3016767 3016682 2841856 2494079 2956403 2691011 2859711 2703977 2578535
16579B578535K6098J96930m70560O552K69691o49817L88174l8311l93399K82100
$$ 2578535 2604633 2801563 2331003 2337555 2607246 1957429 2345603 2307292 1913893 2195993
16569B195993j63141L4709K40913k50819j21749J58979j13430l63937M12785N44130
$$ 2195993 2032852 2067561 2308474 2057655 1935906 2094885 1981455 1617518 2030303 2574433
16559B574433n58076l99039M17714l930l96060L82365n18836L46836k22451K85672
$$ 2574433 2016357 1617318 2035032 2031102 1635042 2017407 1498571 1845407 1622956 1908628
16549A908628l01824L53808m74720r9514J42140p1316q6278L50084n85633J60771
$$ 1908628 1606804 1960612 1485892 1386378 1528518 1457202 1370924 1721008 1135375 1296146
16539A296146N01560m18229K94496m40740M03926j15764j47771J3085m9849j02634
$$ 1296146 1797706 1379477 1673973 1233233 1637159 1521395 1373624 1386709 1336860 1234226
16529A234226j59642L04303m6207J54421l0360m26413J5642J76355J7124k4247
$$ 1234226 1074584 1378887 1332680 1487101 1456741 1030328 1045970 1222325 1239449 1215202
16519A215202j7417j45713J94396L1182l11817L92201j86371L255P9791Q8852
$$ 1215202 1197785 1052072 1246468 1277650 965833 1358034 1171663 1174918 1254709 1343561
16509A343561m68986K48047k06252J13688Q5411k96278L72473q6537k92989J84040
$$ 1343561 874575 1122622 916370 1030058 1115469 819191 1191664 1105127 812138 996178
16499I96178L35817l05581p7326j71742M8621j88102K09283l2873J76704M0199
$$ 996178 1331995 1026414 949088 777346 825967 637865 847148 814275 990979 1031178
16489A031178k3372n3174k14044J93689k52059J75782l38085N50471m53730Q4731
$$ 1031178 1007806 954632 740588 934277 682218 858000 519915 1070386 616656 701387
16479G01387R2947p3019j27745K23478N5273j10609j26438K22904k01223r9616
$$ 701387 794334 721315 593570 817048 872321 761712 635274 858178 656955 557339
16469E57339j2025K02071L4495m8311k06119K73345j17021j50389r5737N81358
$$ 557339 545314 747385 781880 733569 527450 800795 683774 533385 437648 1019006
16459A019006j43612j79252J58258j85532C15646L29882r3228M27776l86804l4726
$$ 1019006 875394 696142 854400 668868 315646 645528 552300 980076 593272 558546
16449E58546o5741Q0108k20397P8395K41512N4888r2758O9496l08031J47952J34998
$$ 558546 492805 572913 352516 430911 672423 727311 634553 704049 396018 543970 678968
16438F78968C04198L81550p2956J26604l49525A76378L38508L4536K09535k62465
$$ 678968 304198 685748 612792 739396 389871 176378 514886 549422 758957 496492
16428D96492J76490C34392p6503M83561l09655R2777N4041j56824J93906k28259
$$ 496492 672982 334392 257889 741450 431795 524572 578613 421789 615695 387436
16418C87436J66037p3900A19148N20961B42375L54402N5608p9575k44077J08020
$$ 387436 553473 479573 119148 640109 242375 596777 652385 572810 328733 436753
16408D36753j68781L30997M1596k53914j43949J20572J17695j62795J2205j28798
$$ 436753 267972 598969 640565 386651 242702 363274 480969 318174 330379 201581
16398B01581L6434P7885n3649l9000J05872J57244j62078j59548j7439K70436
$$ 201581 238015 315900 262251 223251 329123 486367 324289 164741 147302 417738
16388D17738k9958P7364j3650n9087J74306M0420k80325Q9956N089J03539N9250
$$ 417738 387780 465144 451494 392407 566713 607133 326808 416764 421853 525392 584642
16377E84642q5372j78323A26423M59838J8667A48051K41683F1251K08807K39283
$$ 584642 499270 320947 126423 586261 604928 148051 389734 61251 270058 509341
16367E09341j4677j87836r319J62399A41151m0730p541L7740L43695A50265J09704
$$ 509341 494664 306828 297509 459908 141151 100421 92880 130620 474315 150265 259969
16356B59969J61216o1094j24118K43977A56225M87202B55301k1179J61741n1918
$$ 259969 421185 360091 235973 479950 156225 643427 255301 234122 395863 343945
16346C43945E1829L96920p6209A63880o8781E256L08350j45878o9073J6817L16484
$$ 343945 51829 448749 372540 163880 95099 5256 313606 167728 98655 115472 431956
16335D31956j55296O9175i9237D08697e2956A86656h5020B41009I9596J30316
$$ 431956 276660 345835 -99237 408697 -52956 186656 -85020 241009 99596 229912
16325B29912l0130k6335K04448J87308B75303A9546M4994p039N69331j85882J96857
$$ 229912 199782 173447 377895 565203 275303 19546 64540 57501 626832 440950 637807
16314F37807c457B51892N655n7362F7615B1339L10097a55077A33440j9038H330
$$ 637807 -3457 251892 257547 200185 67615 21339 331436 -155077 133440 114402 8330
16302D06743J4023j48686A22571g023D4289J7374K71877a15927B47858r8790K16790
$$ 406743 420766 272080 122571 -7023 44289 61663 333540 -115927 247858 149068 365858
16291C65858r5355A23347c2936H7504K34237N2172A43857K6744J82487A26143
$$ 365858 270503 123347 -32936 87504 321741 373913 143857 170601 353088 126143
16280B39436K86639A23305K72610l1790C2509c5639B1213O5147K69281a463C25648
$$ 239436 526075 123305 395915 364125 32509 -35639 21213 86360 355641 -1463 325648
16268C79615A25579n7879J22999a30349C86631p7520p7708g8906A03909K70354
$$ 379615 125579 67700 190699 -130349 386631 309111 231403 -78906 103909 374263
16258C74263g7208D3316J11883n9687N0368K98117A20898D369c12864E24286A75102
$$ 374263 -77208 43316 155199 95512 145880 443997 120898 4369 -312864 524286 175102
16246a06325B48653a14003C49835A62838P9008m6795K9170a6672C28672i4382
$$ -106325 248653 -114003 349835 162838 241846 195051 224221 -16672 328672 -94382
16235C87575F5039N2120K34625a98497A48023b6395A02028a80218A57683b8942
$$ 387575 65039 117159 351784 -198497 148023 -26395 102028 -180218 157683 -28942
16224A93897G9868O60330e0166B6875h0930A83036C2521a93510A63742a41644
$$ 193897 79868 740198 -50166 26875 -80930 183036 32521 -193510 163742 -141644
16213A92156q7402f7996B06973a24587n8607d4607F8419L0284a43879m9243A80527
$$ 192156 104754 -67996 206973 -124587 -183194 -44607 68419 98703 -143879 -193122 180527
16201b2766A47301O1127n8994k9654L33372A56537a10770A53608n3251J32025
$$ -22766 147301 208428 149434 119780 453152 156537 -110770 153608 100357 232382
16191B32382q4076c702B03935j2608f9460D6800J63471b44085J03691B50514J79270
$$ 232382 148306 -3702 203935 191327 -69460 46800 210271 -244085 -140394 250514 429784
16180D29784B03692K1345a42472r8736A06215k6773L38603F6290C66N079e147
$$ 429784 203692 225037 -142472 -241208 106215 79442 418045 66290 366 5445 -5147
16168E8332J72364a18550B54979H6871b22104c6753A88058L60471a2286B48377
$$ 58332 230696 -118550 254979 86871 -222104 -36753 188058 548529 -12286 248377
16157a51835A52565b05837D8039K14254a09286L321B27402K2871j7285m1606a34546
$$ -151835 152565 -205837 48039 262293 -109286 -105965 227402 250273 232988 191382 -134546
16145A51247F6872h8612b8850A46816J2213L7090L1875I3728e9820o7679J0211
$$ 151247 66872 -88612 -28850 146816 159029 196119 227994 93728 -59820 -127499 -117288
16134a17288r6934D9474K45730c3784A82313q8971a83191G234c8782A48050Q3805
$$ -117288 -214222 49474 295204 -33784 182313 93342 -183191 7234 -38782 148050 231855
16123B31855B9640Q5035i9386A60858a88733a581j09098O749A01582c9362m4676
$$ 231855 29640 114675 -99386 160858 -188733 -1581 -110679 -103930 101582 -39362 -84038
16112h4038A36669c45203a15956N3597A72595a09549A3531a6034A7444J17174
$$ -84038 136669 -345203 -115956 -62359 172595 -109549 13531 -16034 17444 134618
16102A34618K7525b6319B97412b54568e368B02099R8965A19870h75o7974j5706
$$ 134618 162143 -26319 297412 -254568 -5368 202099 301064 119870 -875 -68849 -84555
16091h4555g82j46969f8231j88569J19226C58934B1030f2607a2833A82525e6831
$$ -84555 -782 -147751 -68231 -256800 -137574 358934 21030 -62607 -12833 182525 -56831
16079C29292a6931o4769n7955j92272g6655j77584D8194b50283a08731c42k09172
$$ 329292 -16931 -81700 -139655 -331927 -76655 -254239 48194 -250283 -108731 -342 -209514
16068b09514R7690j873B44113b04048c9803A53018m2767Q6616n0929A697K75125
$$ -209514 -111824 -113697 244113 -204048 -39803 153018 110251 196867 145938 1697 276822
16057B76822F7368d9903A4911K35282J86079b49777a03608j60659B7917a19674
$$ 276822 67368 -49903 14911 250193 436272 -249777 -103608 -264267 27917 -119674
16046b79188I1566a85604A8245b75464C3416J246d99950b005l41007d0060p4859
$$ -279188 91566 -185604 18245 -275464 33416 34662 -499950 -2005 -343012 -40060 -114919
16035a14919A32417a20082B54654F9452a02076B99716I4895a9635r0288A10715
$$ -114919 132417 -120082 254654 69452 -102076 299716 94895 -19635 -109923 110715
16024b12521P2713c1613D5154P8034k6526g7854L97L6607c714m15533B1501a51038
$$ -212521 -139808 -31613 45154 123188 96662 -77854 -77457 -40850 -3714 -419247 21501 -151038
16011G8180a15757B01204E1004J1016a16605c4312B877b36182I1498b53664C4527
$$ 78180 -115757 201204 51004 62020 -116605 -34312 2877 -236182 91498 -253664 34527
15999B3976a97337e8251j43020A04470a0158C51814H5574a58496j13368Q9314
$$ 23976 -197337 -58251 -201271 104470 -10158 351814 85574 -158496 -271864 -182550
15989a82550B98121B4566d7200B39953C4550K00480G8850L27844A97614q4818
$$ -182550 298121 24566 -47200 239953 34550 235030 78850 406694 197614 112796
15979A12796l4038J31918n6461C4766d28406B74215I7780J7675c50821B81715
$$ 112796 78758 210676 154215 34766 -428406 274215 97780 115455 -350821 281715
15968B51079a11071B42669c5456J3041E4197h2258B53139E3856L602P5619b14710
$$ 251079 -111071 242669 -35456 -22415 54197 -82258 253139 53856 57458 133077 -214710
15956I5290j7388R2743L1948D2746e6855j14062G6906a88172B38678h7501C25298
$$ 95290 77902 170645 202593 42746 -56855 -170917 76906 -188172 238678 -87501 325298
15944D3492b10790B2571c58296a55449d716m7593m07118B7356g4851c7240C8948
$$ 43492 -210790 22571 -358296 -155449 -4716 -52309 -459427 27356 -74851 -37240 38948
15932A71267g0205o9172k79308I7074J21647N3317h1941r2811p7865j18906a20787
$$ 171267 -70205 -139377 -418685 97074 218721 272038 -81941 -174752 -252617 -371523 -120787
15920D9984Q9302h8494r2548B4610a33624k18411A58532m1806P0425a90152j4479
$$ 49984 139286 -88494 -181042 24610 -133624 -352035 158532 116726 187151 -190152 -204631
15909b04631l3069C33097g4290q7739B97620a01454j55607A43497J5839l955a53377
$$ -204631 -237700 333097 -74290 -162029 297620 -101454 -257061 143497 159336 155381 -153377
15897C07383h5176N398l63627e7687f961q0210l6210j5566F7562i2198B92263
$$ 307383 -85176 -79778 -443405 -57687 -6961 -87171 -123381 -138947 67562 -92198 292263
15885a2587j81663I267J08604b09041M7506C4163a239j4907j24952J0329b075
$$ -12587 -194250 9267 117871 -209041 -161535 34163 -1239 -16146 -141098 -130769 -2075
15873B7350e3715g083A68664g5425j64683j00059h0114F1317h622l18591m4024
$$ 27350 -53715 -7083 168664 -75425 -240108 -340167 -80114 61317 -8622 -327213 -371237
15862c71237B8166N9688e7021g239C50657B1029R4368c23762E0261K4525h7528
$$ -371237 28166 87854 -57021 -7239 350657 21029 115397 -323762 50261 74786 -87528
15850A94101m4442A9494a20271l2974A93417h4944A84924b43133e4626J955L135
$$ 194101 149659 19494 -120271 -153245 193417 -84944 184924 -243133 -54626 -52671 -49536
15839d9536J7649o8908d1852j96321A32669m3037J3183e5348i631l12782D7352
$$ -49536 -31887 -100795 -41852 -238173 132669 89632 102815 -55348 -9631 -322413 47352
15827A0566L05813c727A3812a4236L800k18433A9821L81504b18159j18986a62003
$$ 10566 316379 -3727 13812 -14236 -10436 -228869 19821 401325 -218159 -337145 -162003
15815A99894a35334L6476l11917B39880c3893k553A44601f0305C43939a02775
$$ 199894 -135334 -98858 -410775 239880 -33893 -36446 144601 -60305 343939 -102775
15804B86239I0901J3089K3577a51860m9711J2287B2353O6084B0749K6245M21975
$$ 286239 90901 103990 127567 -151860 -201571 -189284 22353 88437 20749 46994 468969
15793D68969g955k9073j84866B26401a85442k705B86078A11134a30317E3217b57167
$$ 468969 -7955 -37028 -221894 226401 -185442 -188147 286078 111134 -130317 53217 -257167
15781a59987I2151D231K96686j18915a75496d8733J9471o7503k13062i4172j08713
$$ -159987 92151 4231 300917 182002 -175496 -48733 -29262 -96765 -309827 -94172 -202885
15770b02885g3592L301A61942f98718B0922i4613p1191A09010B4131a34665p333
$$ -202885 -73592 -70291 161942 -698718 20922 -94613 -165804 109010 24131 -134665 -141998
15759a41998B10327q6977l471j4003b27317e6556B68836b12636B21106a05582
$$ -141998 210327 123350 119879 105876 -227317 -56556 268836 -212636 221106 -105582
15748d9287l7390F7354h392n4186B6737Q2778g4197C0561f0616A21149e8648j19512
$$ -49287 -86677 67354 -8392 -62578 26737 109515 -74197 30561 -60616 121149 -58648 -178160
15736a78160P2061L9315D5488a14172b4264p0028n5436P2218A6527a42450A02549
$$ -178160 -106099 -66784 45488 -114172 -24264 -94292 -149728 -77510 16527 -142450 102549
15724b3303C29852b83146a27185a5750n1710n9082L9460a4379A06852e0811K2637
$$ -23303 329852 -283146 -127185 -15750 -67460 -126542 -87082 -14379 106852 -50811 -28174
15713b8174n8513F491b90625a04553C02553A20723L3026f2520K0303a2513j95992
$$ -28174 -86687 6491 -290625 -104553 302553 120723 153749 -62520 -42217 -12513 -208505
15702b08505E4676c98109f2412o0532J1935K5390p2868D4121f3935A03666b2396
$$ -208505 54676 -398109 -62412 -122944 -111009 -85619 -158487 44121 -63935 103666 -22396
15690A23824a10513E770b93075o5703D3124P8947d02662g6214l38374a38657A00594
$$ 123824 -110513 5770 -293075 -358778 43124 122071 -402662 -76214 -414588 -138657 100594
15678a27237r8108F6010a10980A82216Q3474@a12467A74741c32193d1190B06482
$$ -127237 -225345 66010 -110980 182216 265690 0 -112467 174741 -332193 -41190 206482
15666b39984F23K8910f4255C46083a8095O234q8294A3343J96267J54046h5349
$$ -239984 623 29533 -64255 346083 -18095 -11861 -100155 13343 209610 363656 -85349
15654b73799b2613m1750K157A38093K8850a16844K324E4974c25276g8593l6224
$$ -273799 -22613 -64363 -62206 138093 166943 -116844 -114520 54974 -325276 -78593 -114817
15643a14817b5737A21992J16352c0926B80535A8850Q9561h2918J0880E9527b42761
$$ -114817 -25737 121992 238344 -30926 280535 18850 108411 -82918 -72038 59527 -242761
15631g043j62822I0383a70473A98873e3106Q637j91489f5695A50033A5573J70518
$$ -7043 -169865 90383 -170473 198873 -53106 -44469 -235958 -65695 150033 15573 186091
15620A86091a93330B4210M7900d734k32319A38228K4406J1312c03450l4941N6654
$$ 186091 -193330 24210 72110 -4734 -237053 138228 162634 173946 -303450 -338391 -281737
15609b81737O3360l0113M9025F291b37560P8434d7754A01491b36124A0857b60579
$$ -281737 -218377 -248490 -199465 6291 -237560 -159126 -47754 101491 -236124 10857 -260579
15597a71270K0149l20450A44723P4879l9656F4223N6918b22472b4755A42501i5173
$$ -171270 -151121 -471571 144723 219602 179946 64223 121141 -222472 -24755 142501 -95173
15585a24827j48187J20350m30834K20124a48230b1048m8900l3105D1223a40578
$$ -124827 -273014 -152664 -583498 -363374 -148230 -21048 -69948 -103053 41223 -140578
15574D2743a08490r5787D4441d010G0502a65193e0355a4104A52358k2400b31747
$$ 42743 -108490 -204277 44441 -4010 70502 -165193 -50355 -14104 152358 129958 -231747
15562g9600A58676m6312K5087e002B42884I2017l3655K94994b10778k3831h3510
$$ -79600 158676 112364 137451 -5002 242884 92017 58362 353356 -210778 -234609 -83510
15550c312G7252c4578C75092G9111c91774A630a39439H6317a44137b9768I8734
$$ -3312 77252 -34578 375092 79111 -391774 1630 -139439 86317 -144137 -29768 98734
15538a15084B06684b67993i7616j88297C1118a1247p2775C86010b66662C22199
$$ -115084 206684 -267993 -97616 -285913 31118 -11247 -84022 386010 -266662 322199
15527A97217n0037J85100a59610c6045A42564a07092k7057d95A3975f2007a6068
$$ 197217 147180 332280 -159610 -36045 142564 -107092 -134149 -495 13975 -62007 -16068
15515c04094a25338C63387d8342k48503d4005E0128a69173h3857j59684B92795
$$ -304094 -125338 363387 -48342 -296845 -44005 50128 -169173 -83857 -243541 292795
15504A56647G4929a29292o7488e2609j80381a00467j61338B16658a1096l3032
$$ 156647 74929 -129292 -196780 -52609 -232990 -100467 -261805 216658 -11096 -44128
15494d4128j8459n4088j06843C38025e4528K3857D35016c51343a09820M6179b8180
$$ -44128 -62587 -116675 -223518 338025 -54528 -30671 435016 -351343 -109820 -63641 -28180
15482a54726M4086B91307c06137g3685E4943i8996C32638d77128A82827R2490
$$ -154726 -110640 291307 -306137 -73685 54943 -98996 332638 -477128 182827 275317
15472B75317D7783c06772H8015c21879a14379c2943A191a8543m5832j56243A28369
$$ 275317 47783 -306772 88015 -321879 -114379 -32943 1191 -18543 -64375 -220618 128369
15460g363j25988N3418A28047d0512F4057A9910c17241b4645B54560J2495b47590
$$ -7363 -133351 -79933 128047 -40512 64057 19910 -317241 -24645 254560 267055 -247590
15448B93294r1141i6552B88301d4222k508C23559b00347A86575a41928A26998
$$ 293294 202153 -96552 288301 -44222 -46730 323559 -200347 186575 -141928 126998
15437D02804k00887f3620A57113h2045I065L701J58893H1343k6191i5F1043K55167
$$ 402804 201917 -63620 157113 -82045 9065 12766 171659 81343 55152 -95 61043 316210
15425C16210K61E8973d1013q3849M1274A20625b01242I9451e15451B00786a81442
$$ 316210 316471 58973 -41013 -124862 -83588 120625 -201242 99451 -515451 200786 -181442
15413a33635j3284C2221e1990k10589c8748D9377L74070c3381L578a2192C44278
$$ -133635 -146919 32221 -51990 -262579 -38748 49377 423447 -33381 -29803 -12192 344278
15401B12837c0103q2350A97508d01919B14549a7531A40530E4489a67781E5960
$$ 212837 -30103 -112453 197508 -401919 214549 -17531 140530 54489 -167781 55960
15390A36579L2453c1453j71325c4770l08649A95216J83945q3042a80534n3761
$$ 136579 169032 -31453 -202778 -34770 -343419 195216 379161 296119 -180534 -234295
15380b34295g2130C07356o9824g831m3718h850m9655C188d84444c1303q3737J6161
$$ -234295 -72130 307356 237532 -7831 -51549 -8850 -58505 3188 -484444 -31303 -115040 -98879
15368i8879H75O7847M3762B2276J99701A6480a35761k02642B53318M9251h274
$$ -98879 875 68722 112484 22276 221977 16480 -135761 -338403 253318 302569 -8274
15356G8513K13517C2048J16657f4469I5593P9167f8881H7648b90027g5084j73952
$$ 78513 292030 32048 148705 -64469 95593 174760 -68881 87648 -290027 -75084 -249036
15345b49036C64242c6044C0067a72849I6648b22749B23321d04923b3275A52065
$$ -249036 364242 -36044 30067 -172849 96648 -222749 223321 -404923 -23275 152065
15334g7052A04279d8722l086J3832j96032l5320h3464o8205g4621m5374e8164
$$ -77052 104279 -48722 -51808 -37976 -234008 -269328 -83464 -151669 -74621 -119995 -58164
15322i6848E5129J48871l8561I199J10330C4166a53726j0368e7132A28243a89347
$$ -96848 55129 204000 165439 9199 119529 34166 -153726 -164094 -57132 128243 -189347
15310a80706q7231A55693a56540a8065k5749B53041D1553g7262A4837L30624M187
$$ -180706 -267937 155693 -156540 -18065 -43814 253041 41553 -77262 14837 345461 349648
15299C49648B5835K44228D3104K7744h24l163D7312q230a70498j28260f39B26403
$$ 349648 25835 270063 43104 70848 -824 -3987 47312 39082 -170498 -298758 -639 226403
15286b31631d0720D04256I7501C8424c0506n1025C00093q7695I6638L8359A8734
$$ -231631 -40720 404256 97501 38424 -30506 -81531 300093 212398 96638 134997 18734
15274A96090a83848g3908H8273d4280l22081h432A98828n6637K16550C0510b1533
$$ 196090 -183848 -73908 88273 -44280 -366361 -8432 198828 142191 358741 30510 -21533
15262A44947a72421B7600a92211f1234A69477D8766J34212b49210A99677J32335
$$ 144947 -172421 27600 -192211 -61234 169477 48766 182978 -249210 199677 332012
15252C32012D9013J11634K52275J6809N44871Q26371m77780K98278p5343F14675
$$ 332012 49013 160647 412922 429731 974602 1800973 1323193 1621471 1546128 614675
15241A97642o7792O7567b846m497D778L82224A24302b42270B9195g2219j15811
$$ 197642 129850 197417 -2846 -7343 4778 387002 124302 -242270 29195 -72219 -188030
15230a88030E8501a05735C6174a06961I864N9340b8990j36161D51982j19290e4725
$$ -188030 58501 -105735 36174 -106961 9864 69204 -28990 -165151 451982 332692 -54725
15218a21265k1846l14016D28363n2191j64190g156j19063A58193M0770b21368
$$ -121265 -143111 -457127 428363 376172 211982 -7156 -126219 158193 198963 -221368
15207a9794A55739a28009A73925p189l3932K6321n6274b5030B38523R7745G0217
$$ -19794 155739 -128009 173925 166736 132804 159125 102851 -25030 238523 336268 70217
15195A53876a78800C62737I4550r539K43917N0734j06659e4867A52036C736M04244
$$ 153876 -178800 362737 94550 85011 328928 379662 273003 -54867 152036 3736 407980
15184D07980j17238f7567I7978a10855D58535i1788C55298E0928J44248J31160
$$ 407980 290742 -67567 97978 -110855 458535 -91788 355298 50928 195176 326336
15174C26336A6451J27381C4607J39050E8868K5989Q6212g1048k3009A43092a79559
$$ 326336 16451 143832 34607 173657 58868 84857 171069 -71048 -94057 143092 -179559
15162I2032j1218J09732I2932k8849i6545A41538N9241J75848B2267d90021A04477
$$ 92032 80814 190546 92932 64083 -96545 141538 200779 376627 22267 -490021 104477
15150b47822C01250l7721J02489A50014D3069K06193p9926i2689r5574C38464
$$ -247822 301250 263529 366018 150014 43069 249262 169336 -92689 -188263 338464
15139e062C4579b99064C65635e893D55927a20269C6454e9354A68358p5707K40287
$$ -5062 34579 -299064 365635 -5893 455927 -120269 36454 -59354 168358 92651 332938
15128C32938a2180E1873b8495l1446j60273A83112a04403C4230N61417C8324M3853
$$ 332938 -12180 51873 -28495 -59941 -220214 183112 -104403 34230 595647 38324 82177
15117H2177a19037B54510G6436a3778C37590m5709q4245H8664f9632B19870J40031
$$ 82177 -119037 254510 76436 -13778 337590 291881 207636 88664 -69632 219870 359901
15106C59901a13101C19623A17439b8967A62379F9390J81285O9544J46107B03406
$$ 359901 -113101 319623 117439 -28967 162379 69390 250675 320219 466326 203406
15095A55142J20217g7799A58538n7779J75810b0205A66217P4835K46140F0808
$$ 155142 275359 -77799 158538 100759 276569 -20205 166217 241052 487192 60808
15084A11895J65506M5247J98182B16088K88937b64034h2642A47940E6869b7839
$$ 111895 277401 322648 520830 216088 505025 -264034 -82642 147940 56869 -27839
15073b7295B84165m1249g3533B34066I9932J10497e0218B48718A16937i9028B64322
$$ -27295 284165 242916 -73533 234066 99932 210429 -50218 248718 116937 -99028 264322
15061i7184B70602K11147e0357J6097j3081C56264q443D919J39524R7153L8687
$$ -97184 270602 481749 -50357 -34260 -47341 356264 347821 4919 144443 241596 280283
15050B80283a27670E17261A13732a08050b0165B87723J70462I4317J8135K56337
$$ 280283 -127670 517261 113732 -108050 -20165 287723 458185 94317 112452 368789
15040C68789o3235m967j03785e8947B7676K72206p1085J24675K5156r4276G6671
$$ 368789 305554 300587 196802 -58947 27676 299882 228797 353472 378628 284352 76671
15028C44469L4277A02039a52930I3858K91706g3047B0280K08172J12212O9800
$$ 344469 378746 102039 -152930 93858 385564 -73047 20280 228452 340664 410464
15018D10464A53516N32205C21331B8787M3395J48326N7406j34195L62746A39632
$$ 410464 153516 685721 321331 28787 72182 220508 277914 143719 506465 139632
15007a82394B12231J58264j76907j4489F5120J23165P7234D6172M99122e7821
$$ -182394 212231 370495 193588 179099 65120 188285 265519 46172 545294 -57821
14996B224Q0696L27649H1521C9031L31144J8452l1011p3044j21029B057a06719
$$ 2224 82920 410569 81521 39031 370175 388627 357616 284572 163543 2057 -106719
14984b6837B69582l4438R0943j37120Q2412a81713C13380m719A09326K6842C8661
$$ -26837 269582 235144 326087 188967 271379 -181713 313380 308661 109326 136168 38661
14972B43755K08557l248A74436J11112L51020H2499K39578C021J46192J52135
$$ 243755 452312 449064 174436 285548 636568 82499 322077 3021 149213 301348
14962C01348J7016J20893A63345L42899j89943J49774k8228j27893k4448K33088
$$ 301348 318364 439257 163345 506244 316301 466075 437847 309954 285506 518594
14952E18594E6938J95834l3187J7395I6038D0146a71363B71235G6921L61959c4536
$$ 518594 56938 252772 219585 236980 96038 40146 -171363 271235 76921 438880 -34536
14940C45473r8152L79355B98802Q5942K60753l6470K58230B89064N7372j14396
$$ 345473 247321 626676 298802 384744 645497 609027 867257 289064 346436 232040
14930B32040J7552N3578o8612K58733A48530J38939A40996k321K17074J90322
$$ 232040 249592 303170 234558 493291 148530 287469 140996 138675 355749 546071
14920E46071A44977K02335K43104j23173A58609J52129J78996j0639J78391B76205
$$ 546071 144977 347312 590416 467243 158609 310738 489734 479095 657486 276205
14909D23827A89562K15081M2239K9740G5595B5039L36633J34740q4988L8786J73733
$$ 423827 189562 404643 446882 476622 75595 25039 361672 496412 411424 450210 623943
14898F23943j05499k1262k8282N867j40712j59216O09444l04945q8444n7773K03858
$$ 623943 518444 497182 468900 474767 334055 174839 784283 479338 390894 333121 536979
14887E36979A19820K75344d0545D35040r2098j54014K51156J65620j28355J18431
$$ 536979 119820 395164 -40545 435040 342942 188928 440084 605704 477349 595780
14877E95780j0632j98988J83759j79197m8794J94831j2286B34472J10164j68715
$$ 595780 585148 386160 569919 390722 341928 536759 524473 234472 344636 175921
14867A75921N14166k90312J37935k24491P5588J59353j13832J01319j00652A52174
$$ 175921 690087 399775 537710 313219 388807 548160 434328 535647 434995 152174
14856B31819J42517K68345j48418j17349L84520k70154j49522j26674J83134K05407
$$ 231819 374336 642681 494263 376914 761434 491280 341758 215084 398218 603625
14846F03625k46397K88839N4722C48945R1599l017A85497B3947L42193K58790
$$ 603625 357228 646067 700789 348945 440544 437527 185497 23947 366140 624930
14836F24930k60443K20493J51138k64057N2876j38012p7361r317n6030J76542
$$ 624930 364487 584980 736118 472061 524937 386925 309564 300247 244217 420759
14826D20759l6504K49651o1917j16104J30001k5446j37038K46776B26935J54638
$$ 420759 384255 633906 571989 455885 585886 560440 423402 670178 226935 381573
14816C81573L02275R7893k74329L48091J37683D80689M13914p8163l41329J30541
$$ 381573 683848 781741 507412 855503 993186 480689 894603 816440 475111 605652
14806F05652k49525o3863K60589J01514m2706K03236k49039J24866j39610q0013
$$ 605652 356127 292264 552853 654367 611661 814897 565858 690724 551114 471101
14796D71101J84791Q4001B56189K03902L72150C09887L44214q1101L19368l45713
$$ 471101 655892 739893 256189 460091 832241 309887 654101 573000 892368 546655
14786E46655L0476O3820B95806J00763J89645O9064J7863k82774O4448M20792
$$ 546655 577131 640951 295806 396569 586214 655278 673141 390367 454815 875607
14776H75607k76494K22802j31221j56848k00527M50331j24299m0904m1216O2808
$$ 875607 599113 821915 690694 533846 333319 783650 659351 618447 577231 640039
14766F40039J15875O2421l36026M44773l83945L20936l80927J17887K2483q463
$$ 640039 755914 818335 482309 927082 543137 864073 483146 601033 623516 615053
14756F15053j70865K56315J10480o826J577j82331j07830J43543J1457K013L4812
$$ 615053 444188 700503 810983 804157 805734 623403 515573 659116 670573 672586 707398
14745G07398J59392j49052j3590P1495K2603O5136l3121j70808K52046k53881
$$ 707398 866790 717738 704148 775643 798246 863382 830261 659453 911499 657618
14735F57618K47967k35133r413P1074J34129k32092R9229J63620l9941J1215j63452
$$ 657618 905585 670452 661039 732113 866242 634150 733379 896999 857058 868273 704821
14724G04821K78440J97921j52974r0207o3606M1086L30373k41585L67085n52484
$$ 704821 983261 1181182 1028208 938001 874395 915481 1245854 1004269 1371354 818870
14714H18870l7390J68001k03636j10957J11751j80871N8387M32273j15139Q2848
$$ 818870 781480 949481 745845 634888 746639 565768 624155 1056428 941289 1024137
14704A024137q8263k6345o8792O2958J03779J04071k89514P9137R4401R165n3604
$$ 1024137 935874 909529 840737 903695 1007474 1111545 822031 901168 995569 1004734 951130
14693I51130l4885J72338l12335O6328r2507J80679K44414j18716J30714r5051
$$ 951130 916245 1088583 776248 842576 750069 930748 1175162 1056446 1187160 1092109
14683A092109k19252L05638l40266N3339J51116K89640k31296j01214L35192j79802
$$ 1092109 872857 1178495 838229 891568 1042684 1332324 1101028 999814 1335006 1155204
14673A155204p5180R7056o5137o0410J78724j81906P7700K40652m26660O4921
$$ 1155204 1080024 1177080 1111943 1051533 1230257 1048351 1126051 1366703 940043 1004964
14663A004964K38860k14990K39250M8595l50112K86250J10592j0104Q3514p6774
$$ 1004964 1243824 1028834 1268084 1316679 966567 1252817 1363409 1353305 1436819 1360045
14653A360045K67978l09192R1640l0715l54116m5473j5354M45838R4799J86368
$$ 1360045 1628023 1318831 1410471 1379756 1025640 980167 964813 1410651 1505450 1691818
14643A691818l68927K06900l40363J30955L16708k46570j3751L79455m73805N7318
$$ 1691818 1322891 1529791 1189428 1320383 1637091 1390521 1376770 1756225 1282420 1339738
14633A339738J6426J30352K81041m98242j57405O04999q4158J23258j58121k02485
$$ 1339738 1356164 1486516 1767557 1269315 1111910 1716909 1632751 1756009 1597888 1395403
14623A395403l69807L57075J87691J7618j64772K48632n8319K05264k35399P6470
$$ 1395403 1025596 1382671 1570362 1587980 1423208 1671840 1613521 1818785 1583386 1659856
14613A659856j80265N9136M2559K84856j37511l7836k02546n2659N11907J2238
$$ 1659856 1479591 1538727 1581286 1866142 1728631 1690795 1488249 1435590 1947497 1959735
14603A959735J02236k05923j80997N3192J52581K53772j42758K49742j87556j86398
$$ 1959735 2061971 1856048 1675051 1728243 1880824 2134596 1991838 2241580 2054024 1867626
14593A867626j95001P9080J75825J1962n1914O6933N50226p16514M70621j39084
$$ 1867626 1672625 1751705 1927530 1939492 1887578 1954511 2504737 1788223 2258844 2119760
14583B119760j35772K40227k26334L92589j65744k0164r8748P2389K52841M4120
$$ 2119760 1983988 2224215 1997881 2390470 2224726 2204562 2105814 2178203 2431044 2475164
14573B475164k95141K29397Q230o2178N3908P3308L69542k24025j03688J41787
$$ 2475164 2180023 2409420 2417650 2355472 2409380 2482688 2852230 2628205 2524517 2666304
14563B666304J09000K01119j54751L38218J86817J06007j08536J85112L37414
$$ 2666304 2775304 2976423 2821672 3159890 3346707 3452714 3344178 3529290 3866704
14554C866704o8153P15369L72678O14566J147624K639885M666637Q798911J5327310
$$ 3866704 3798551 4513920 4886598 5501164 6648788 9288673 13955310 22754221 38081531
14545C8081531L301790j8002694j1327236E903316k117858n89134p53823l9089
$$ 38081531 41383321 23380627 12053391 5903316 3785458 3196324 2442501 2403412
14537B403412q0864p8429M2712j20785L10706n7565j20482J66133m29446O98299
$$ 2403412 2322548 2244119 2286831 2166046 2476752 2419187 2298705 2464838 2035392 2733691
14527B733691l15782J74433j21348M45558K8730m47032K29742N5141k09665J07234
$$ 2733691 2417909 2592342 2470994 2916552 2945282 2498250 2727992 2783133 2573468 2680702
14517B680702M82048l67388L8015l83595N28940j7965r410J08504L16682j16532
$$ 2680702 3162750 2795362 2833377 2449782 2978722 2960757 2951347 3059851 3376533 3260001
14507C260001j70194M76915j68375k92664L60359K91454k37988K58307p5901J6413
$$ 3260001 3089807 3566722 3398347 3105683 3466042 3757496 3519508 3777815 3701914 3718327
14497C718327R9726j71522J63321l41246K78964j8590K43146j45980K88764K48425
$$ 3718327 3818053 3646531 3809852 3468606 3747570 3728980 3972126 3826146 4114910 4363335
14487D363335k59079K72414n66915M43539P9933j94860M10840m1613k0236j11057
$$ 4363335 4104256 4376670 3809755 4253294 4333227 4138367 4549207 4507594 4487358 4376301
14477D376301J65591M4487L38892m12962N27980m62851K89838K50825l44148K74823
$$ 4376301 4541892 4586379 4925271 4512309 5040289 4577438 4867276 5118101 4773953 5048776
14467E048776q0497J54599k41968J79212L69601J70457j58304k0744L10052p2172
$$ 5048776 4968279 5122878 4880910 5060122 5429723 5600180 5441876 5421132 5731184 5659012
14457E659012j49551L07531l29192L44802L5921J99210n68358P36115k43966L47068
$$ 5659012 5509461 5816992 5487800 5832602 5868523 6067733 5499375 6235490 5991524 6338592
14447F338592J39470l50681L57187j48848O47285n33590L07592K33063J86813
$$ 6338592 6478062 6127381 6484568 6335720 6983005 6449415 6757007 6990070 7176883
14438G176883l05873L70393J07553q9509J06065O0967J03187j33879M04789Q1790
$$ 7176883 6871010 7241403 7348956 7259447 7365512 7426479 7529666 7395787 7800576 7882366
14428G882366K6615L74725l79944K96097K61589K8484L84714J47629k11236J48498
$$ 7882366 7908981 8283706 7903762 8199859 8461448 8489932 8874646 9022275 8811039 8959537
14418H959537K49135M05762j81425J05309J20834J18818m9230K80320K82028K62861
$$ 8959537 9208672 9614434 9433009 9538318 9659152 9777970 9728740 10009060 10291088 10553949
14408A0553949K17444m47943O06870R8900J51011M51108K278J54443K89729j88770
$$ 10553949 10771393 10323450 10930320 11029220 11180231 11631339 11633617 11788060 12077789 11889019
14398A1889019M76261J3906J78580L75954K34088J62422M7075K07915N53883K57500
$$ 11889019 12365280 12379186 12557766 12933720 13167808 13330230 13377305 13585220 14139103 14396603
14388A4396603P8816L01684M0950N31621K46486J71308L27026R9259L54051N46307
$$ 14396603 14475419 14777103 14818053 15349674 15596160 15767468 16094494 16193753 16547804 17094111
14378A7094111L72268j04564M84695Q53878r1222M7913P31219O74680L06545J44151
$$ 17094111 17466379 17361815 17846510 18700388 18609166 18657079 19388298 20062978 20369523 20513674
14368B0513674M11332N82831L55216L20607P08582L64729P78245M7755J025565
$$ 20513674 20925006 21507837 21863053 22183660 22892242 23256971 24035216 24082971 25108536
14359B5108536N49753L65814M26720L95460J088358K51816J040534O19693P00636
$$ 25108536 25658289 26024103 26450823 26846283 27934641 28186457 29226991 29846684 30547320
14350C0547320P24456J005856P06098O19118R31918Q01710J220475M81799J294110
$$ 30547320 31271776 32277632 32983730 33602848 34534766 35336476 36556951 37038750 38332860
14341C8332860P93886J056584J069309J097906J149763J748957J078672P91661
$$ 38332860 39126746 40183330 41252639 42350545 43500308 45249265 46327937 47119598
14333D7119598J764088J470105J515279J603038J833000J810969J668979J882578
$$ 47119598 48883686 50353791 51869070 53472108 55305108 57116077 58785056 60667634
14325F0667634J825163J854496K664339J997754K450386K650849K499717K692221
$$ 60667634 62492797 64347293 67011632 69009386 71459772 74110621 76610338 79302559
14317G9302559K857542L148477K965041L531970L670618L510081M322915L867704
$$ 79302559 82160101 85308578 88273619 91805589 95476207 98986288 103309203 107176907
14309A07176907M207466M952732N038291M771110N771232N679218O108214O449661
$$ 107176907 111384373 116337105 121375396 126146506 131917738 137596956 143705170 150154831
14301A50154831O857068P419388P488914Q287863Q496441Q770432R655143R723858
$$ 150154831 157011899 164431287 171920201 180208064 188704505 197474937 207130080 216853938
14293B16853938J0624274J1293644J1963888J1902747J2764122J3137104J3391957
$$ 216853938 227478212 238771856 250735744 262638491 275402613 288539717 301931674
14286C01931674J4120521J4198360J5125131J4553487J4846624J4561560J4379646
$$ 301931674 316052195 330250555 345375686 359929173 374775797 389337357 403717003
14279D03717003J3943266J2700961J1868073J0510688Q424482O056634K617607
$$ 403717003 417660269 430361230 442229303 452739991 461164473 467221107 469838714
14272D69838714k05663j049181j624562l40813m915029o201702q376072j0224053
$$ 469838714 469633051 468583870 466959308 466618495 461703466 455501764 447125692 436901639
14264D36901639j0938861j2481975j3518301j4450958j4567342j5198998j5470545
$$ 436901639 425962778 413480803 399962502 385511544 370944202 355745204 340274659
14257C40274659j5100400j4916552j4730090j3446218j3135714j3328285j2628519
$$ 340274659 325174259 310257707 295527617 282081399 268945685 255617400 242988881
14250B42988881j1899113j1027069j0681993j0037751r707091q596769q380791
$$ 242988881 231089768 220062699 209380706 199342955 189635864 181039095 172658304
14243A72658304p973205p641525p470332o639685n872955n810804n611791n233083
$$ 172658304 164685099 157043574 149573242 142933557 137060602 131249798 125638007 120404924
14235A20404924n432449m838755m279770m281083l698665l475674l840724l350169
$$ 120404924 114972475 110133720 105853950 101572867 97874202 94398528 90557804 87207635
14227H7207635l334930l208042k928522k902500k398626k524600k433352k129756
$$ 87207635 83872705 80664663 77736141 74833641 72435015 69910415 67477063 65347307
14219F5347307k274678j952197k050872j900518j596427j517268j865632j168329
$$ 65347307 63072629 61120432 59069560 57169042 55572615 54055347 52189715 51021386
14211E1021386j926202j683141j295183j082022p05330j359333j232340j320317
$$ 51021386 49095184 47412043 46116860 45034838 44329508 42970175 41737835 40417518
14203D0417518j224705j024105r22927n38506r90219j233377q76649r65553m50492
$$ 40417518 39192813 38168708 37245781 36707275 35717056 34483679 33607030 32641477 32190985
14194C2190985q07379o40752r43260o38814r31114n71281p44132m97235l03449
$$ 32190985 31383606 30742854 29799594 29160780 28229666 27658385 26914253 26417018 26113569
14185B6113569p96246q03294m58053o06726n45950m6589q82724k99021l20333
$$ 26113569 25317323 24514029 24055976 23449250 22903300 22856711 21973987 21674966 21354633
14176B1354633o15928l65527n36189j58529n71927j37324m94289l84702l18466
$$ 21354633 20738705 20373178 19836989 19678460 19106533 18969209 18474920 18090218 17771752
14167A7771752o33189j96949m68701J23316k07617n94607Q9782l77741l23079
$$ 17771752 17138563 16941614 16472913 16596229 16388612 15794005 15883787 15506046 15182967
14158A5182967n75726l31407J00625k21756n11714p6929m1212l26538j51882K5189
$$ 15182967 14607241 14275834 14376459 14154703 13642989 13566060 13524848 13198310 13046428 13071617
14148A3071617o54024k5025n05477J81883l48394j24964R0535o62519L18883n12265
$$ 13071617 12417593 12392568 11887091 12068974 11720580 11595616 11686151 11023632 11342515 10830250
14138A0830250q5458J61683k73364k17135j47262l79330M5671J3128l11549k57066
$$ 10830250 10744792 10906475 10633111 10415976 10268714 9889384 9935055 9948183 9636634 9379568
14128I379568o0812j6843J22m37566J94069m58805J1154K67512o72353l4177o3375
$$ 9379568 9318756 9301913 9302035 8864469 9058538 8599733 8610887 8878399 8206046 8171869 8108494
14117H108494j97822J09488k4641k97003j68123N2502j92741o783K39139k32820
$$ 8108494 7910672 8020160 7995519 7698516 7530393 7582895 7390154 7383371 7622510 7389690
14107G389690l84264l58785L12441N3479R992n09205K25501j9823k53639j1622
$$ 7389690 7005426 6646641 6959082 7012561 7022553 6513348 6738849 6719026 6465387 6453765
14097F453765o0736j56061R5452Q4804j69755n7434k99758M5300k08712m62781
$$ 6453765 6393029 6236968 6332420 6417224 6247469 6190035 5890277 5935577 5726865 5264084
14087E264084N52575j97279J884j50534k61326J51693k09499K03976j12994m6332
$$ 5264084 5816659 5619380 5621264 5470730 5209404 5361097 5151598 5355574 5242580 5196248
14077E196248L6044j07205k11672j65676j63399M02949k31916n7479k04476l9097
$$ 5196248 5232292 5125087 4913415 4747739 4584340 4987289 4755373 4697894 4493418 4454321
14067D454321P2967J07993n41316J71629J95129j39304l9693J16549j5680m13541
$$ 4454321 4527288 4635281 4093965 4265594 4460723 4321419 4281726 4398275 4382595 3969054
14057C969054L27882J0495K14522k60174l28588L417M96768p82194K01615J06896
$$ 3969054 4296936 4307431 4521953 4261779 3933191 3936608 4433376 3651182 3852797 3959693
14047C959693l97748J50054j39228r9474K65353l27654N8656J90940J656j43690
$$ 3959693 3561945 3711999 3572771 3473297 3738650 3410996 3469652 3660592 3662248 3518558
14037C518558p4950Q8855k09183j55241L25712j40353m29086L13401J08561p6320
$$ 3518558 3443608 3532463 3323280 3168039 3493751 3353398 2924312 3237713 3346274 3269954
14027C269954j78149J7899N9415n9278j26757m3284J27461m28693K99236m14918
$$ 3269954 3091805 3109704 3169119 3109841 2983084 2939800 3067261 2638568 2937804 2522886
14017B522886K93388m73815M39793m5415k28876L27241l7792l45297J13027J05440
$$ 2522886 2816274 2342459 2782252 2736837 2507961 2835202 2797410 2452113 2565140 2670580
14007B670580J37665k70712J54181m60645J59744K02743m42815J88993J70594
$$ 2670580 2808245 2537533 2691714 2231069 2390813 2593556 2150741 2339734 2510328
13998B510328l323k08955j48462J01039N7252L02504L3242N5970P31834J231125
$$ 2510328 2507005 2298050 2149588 2250627 2307879 2610383 2643625 2699595 3431429 4662554
13988D662554L780188P624432J6014318R747378j5020970j2770126n228449k372585
$$ 4662554 8442742 16067174 32081492 41828870 26807900 14037774 8809325 6436740
13980F436740r70589j294192J24163n48214n72459J68047R5643n75855J01126
$$ 6436740 5466151 4171959 4296122 3747908 3175449 3343496 3439139 2863284 2964410
13971B964410j78195J51841k1534l78166r0126K55150k11124j28380K4377j83858
$$ 2964410 2786215 2938056 2916522 2538356 2448230 2703380 2492256 2363876 2388253 2204395
13961B204395m579j19870L1873M18200j98026l19591L85033m04833M42470r1197
$$ 2204395 2199816 2079946 2111819 2530019 2331993 2012402 2397435 1992602 2435072 2343875
13951B343875p4386j16369k09917j44673N50478l01252J60455l46654k7500M06102
$$ 2343875 2269489 2153120 1943203 1798530 2349008 2047756 2208211 1861557 1834057 2240159
13941B240159m88284J04558L04378o66536K19368K94473j59692J60233j7971j40620
$$ 2240159 1751875 1856433 2160811 1494275 1713643 2008116 1848424 2008657 1990686 1850066
13931A850066k57614J66263K0470j60026K20849j15969J27641o4818j38819j92656
$$ 1850066 1592452 1758715 1779185 1619159 1840008 1724039 1851680 1786862 1648043 1455387
13921A455387N04408p9006N6933l26976J17059K4729j86333k57404K96196J02589
$$ 1455387 1959795 1880789 1937722 1610746 1727805 1752534 1566201 1308797 1604993 1707582
13911A707582l25998J52918K72284l59754j28125K33283k5795q1643k22491R0419
$$ 1707582 1381584 1534502 1806786 1447032 1318907 1552190 1526395 1444752 1222261 1312680
13901A312680N6708r5630M5986K18534k8139m87615L61217J42943k95665K65122
$$ 1312680 1369388 1273758 1319744 1538278 1510139 1022524 1383741 1526684 1231019 1496141
13891A496141m4655L5805m2425L924k89792K53092j64488j2641L41122k14449
$$ 1496141 1451486 1487291 1444866 1448790 1158998 1412090 1247602 1234961 1576083 1361634
13881A361634j2852j26115l1922K64713n929R8384o3249l3154k95248o7721J92271
$$ 1361634 1348782 1222667 1190745 1455458 1449529 1547913 1484664 1451510 1156262 1088541 1280812
13870A280812K52318k50472l234O8021q8060k09555N3030r5900L92963k30229
$$ 1280812 1533130 1282658 1279424 1347445 1259385 1049830 1102860 1006960 1399923 1169694
13860A169694j46422J17451j7796m900K45159J3204o0686n80168L76044P6370
$$ 1169694 1023272 1140723 1122927 1118027 1363186 1376390 1315704 735536 1111580 1187950
13850A187950M2003q0072m240K40369m61034k06187L88446K3889l7711l21468
$$ 1187950 1229953 1149881 1145641 1386010 924976 718789 1107235 1131124 1093413 771945
13840G71945K57656J78254r3689k42512R2101J59700l6970K3556L7302l1961o5115
$$ 771945 1029601 1207855 1114166 871654 963755 1123455 1086485 1110041 1147343 1115382 1050267
13829A050267j85401J47703k20519J15446M03556n88497L79007O5010m4072m04078
$$ 1050267 864866 1012569 792050 907496 1311052 722555 1101562 1166572 1122500 718422
13819G18422Q9683m8578L45004j56373J37164j93671J23071M7274l6311J3682
$$ 718422 808105 759527 1104531 948158 1085322 891651 1014722 1061996 1025685 1039367
13809A039367j62335l0656L07137k92221J49508k41287K8115j15379J42287L80118
$$ 1039367 877032 846376 1153513 861292 1010800 769513 797628 682249 824536 1204654
13799A204654D23761K59875K49831p8248L9857k73623N84994j80388J48413l04690
$$ 1204654 423761 683636 933467 855219 895076 621453 1206447 1026059 1174472 869782
13789H69782k41952J83711Q9273j86157q9268K11747o1175N5082p6024K16096
$$ 869782 627830 811541 900814 714657 625389 837136 775961 831043 755019 971115
13779I71115j1038J9136m49981L61690k91030k3745J99249J18377l81678M34595
$$ 971115 960077 979213 529232 890922 599892 576147 775396 893773 512095 946690
13769I46690J33381E15697N11305o0327j8688k30658N3432k59702L61637k51608
$$ 946690 1080071 515697 1027002 966675 947987 717329 770761 511059 872696 621088
13759F21088j0925O5703q4251K35649R0196J03115m40521J21983n6483r7445M21678
$$ 621088 610163 675866 591615 827264 917460 1020575 580054 702037 645554 548109 969787
13748I69787j70984k21580K71519l09256J41737l66r6896j11621P1393k7571L43026
$$ 969787 798803 577223 848742 539486 681223 680857 583961 472340 543733 516162 859188
13737H59188m807l90557K09421k96275M43719m3484q7591k24503N0420j6662J4994
$$ 859188 854381 463824 673245 376970 820689 777205 689614 465111 515531 498869 513863
13726E13863P9410k1342j41607J56352K23620C09904K74782q6257K76813n9013
$$ 513863 593273 571931 430324 586676 810296 309904 584686 498429 775242 716229
13716G16229m0755k90692L28538p6627L3887K82293l45545j08690N7600J02827
$$ 716229 675474 384782 713320 636693 670580 952873 607328 498638 556238 659065
13706F59065m7696A61895J88856J33753n2462J80109n0982n8992J59355B89567
$$ 659065 611369 161895 350751 484504 432042 612151 561169 502177 661532 289567
13695F53089B45435K41609q0210K39272B36867K65422j00152Q8904K60952k02807
$$ 653089 245435 487044 406834 646106 236867 502289 402137 491041 751993 549186
13685E49186B27432L91003o7606p8032M8950J9402j00876j35090K63414k57476
$$ 549186 227432 618435 550829 472797 521747 541149 440273 305183 568597 311121
13675C11121L53644l3520n9016k8732j42449L24429j90443j17942A99611K84863
$$ 311121 664765 631245 572229 543497 401048 725477 535034 417092 199611 484474
13665D84474j11887J73646m4815O899J930N0597p7667o1017m2667L59612l55883
$$ 484474 372587 546233 501418 508317 510247 560844 483177 422160 379493 739105 383222
13654C83222M74130B47782P2310M0966L11951k23519J14209l5104J74196p8072
$$ 383222 857352 247782 320092 361058 673009 449490 563699 528595 702791 624719
13644F24719j97086j48246K88162k5960J2003O2466K18866l08481j49390N3819
$$ 624719 427633 279387 567549 541589 553592 616058 834924 526443 377053 430872
13634D30872M7208k02183J09130R2898L2739k42559c2180F02830j11280A78077
$$ 430872 478080 275897 385027 477925 510664 268105 -32180 602830 491550 178077
13623C62835J27092o5685J24627k1448j46778P8262j05143K66304A73367J73313
$$ 362835 489927 424242 548869 527421 380643 458905 353762 620066 173367 346680
13613C46680A37761K07031r80J307J7048n5918o1668M21835k05715A07001L74708
$$ 346680 137761 344792 343812 345119 362167 306249 244581 666416 460701 107001 481709
13602D81709l2237k5792j03790J30425A67425L72502k1290O5607K16772l99295
$$ 481709 449472 423680 319890 450315 167425 539927 518637 584244 801016 401721
13592D01721j57345K0125K48778B27414L78674A27852R8116K65957k31585A28366
$$ 401721 244376 264501 513279 227414 606088 127852 225968 491925 260340 128366
13581E33283k5815j62202J63647d512B64422K47922A80598N44245k46310o5184
$$ 533283 507468 345266 508913 -4512 264422 512344 180598 724843 478533 413349
13571D13349n0610L42422C40474j539K8959P8471N1011j03558o404j45459L14036
$$ 413349 362739 705161 340474 338935 367894 446365 497376 393818 387414 241955 555991
13560E55991o6369j19805q3613J5321K01463L4940j67043j83440R5540j37424
$$ 555991 489622 369817 286204 301525 502988 537928 370885 187445 282985 145561
13550A45561K31831j00923Q2707O6790A25335J0831K32309j48412j02368M68233
$$ 145561 377392 276469 359176 425966 125335 136166 368475 220063 117695 585928
13540E85928j4322D0078L40713J38309k22061M9791o6957O0608L5911q4817K07079
$$ 585928 571606 40078 380791 519100 297039 346830 279873 340481 376392 291575 498654
13529D98654B04890G0823N00443H5536L11729j80304K66447k23330R6116o0314
$$ 498654 204890 70823 571266 85536 397265 216961 483408 260078 356194 295880
13519B95880j18818K76304A68632m8089k470J49707a75655g2177C20640k2435
$$ 295880 177062 453366 168632 120543 118073 267780 -175655 -72177 320640 298205
13509B98205J68937A94361J98793K4357a61113D81728k927j50082j32201q2874
$$ 298205 467142 194361 393154 417511 -161113 481728 478801 328719 196518 113644
13499A13644L1901K91536j31801j6068L5241A53325J50631k9376A06953P1422
$$ 113644 145545 437081 305280 289212 324453 153325 303956 274580 106953 178375
13489A78375J9983J90473a57954C58913J05869F1541P2667J30404H0118R3845
$$ 178375 198358 388831 -157954 358913 464782 61541 134208 264612 80118 173963
13479A73963k7174K62853e5245C26053k5900P9984J42798K2217E1732P2874D1560
$$ 173963 146789 409642 -55245 326053 300153 380137 522935 545152 51732 124606 41560
13467G3463P4645K1642F0473J69842Q797a01051A35123P0845P1728Q7614A0411
$$ 73463 148108 169750 60473 230315 239112 -101051 135123 205968 277696 365310 10411
13455A11763K04041M4473q5074j6569H6362M00686b3553E14268c9228k22799F6125
$$ 111763 315804 360277 275203 258634 86362 487048 -23553 514268 -39228 -262027 66125
13443D80473k19104j13650L01092B13138J10664q6392J37150b9215A44498K77394
$$ 480473 261369 147719 448811 213138 323802 237410 374560 -29215 144498 421892
13433D21892j19819a0145D04621J64416A38657O2483K16742A45055J68943E7559
$$ 421892 302073 -10145 404621 569037 138657 201140 417882 145055 313998 57559
13422G61221C06791A05086L42452k05777L0924J36467k0723m0851a6327A76049
$$ 761221 306791 105086 447538 241761 272685 409152 388429 347578 -16327 176049
13411B96171l4533o9090K66207A11748J75267A21583a03574B59950e1479C55246
$$ 296171 261638 192548 458755 111748 287015 121583 -103574 259950 -51479 355246
13400E11315B09052l7201O2978K36644k18901H8054k6827K23491l9637P1995A51749
$$ 511315 209052 171851 234829 471473 252572 88054 61227 284718 245081 317076 151749
13388A19755D219L95065A17308c4797M318B08719M9586M947m152J9565j25908
$$ 119755 4219 399284 117308 -34797 -30479 208719 258305 263252 259100 278665 152757
13377A52757K15599Q0657j60539J6169R4878j10489J54145i0763B97376A26246
$$ 152757 368356 449013 288474 304643 399521 289032 443177 -90763 297376 126246
13366B06202K5020O9052j45564R7231j25623l3503P4600L7366K54686A32126L9200
$$ 206202 231222 300274 154710 251941 126318 92815 167415 204781 459467 132126 171326
13355A71326R6586j05013o7304J58504m6608j01866R1648L05396k8953c21C49771
$$ 171326 267912 162899 95595 254099 207491 105625 197273 502669 473716 -321 349771
13343A72021K70851A30002P0206J00756q64A02603L70376j54785A3469M22918
$$ 172021 442872 130002 200208 300964 300100 102603 472979 318194 13469 436387
13333D36387l5590n8047r2300e0914l9864A46598F8009J53235i0402b6890A47714
$$ 436387 400797 342750 250450 -50914 -90778 146598 68009 221244 -90402 -26890 147714
13321B35197p0823L26994a45521a8097H8162g5689D04917K05460k20949R859J28222
$$ 235197 164374 491368 -145521 -18097 88162 -75689 404917 610377 389428 399287 527509
13310E27509A16125b0766A75526J72121i5294B01771D8905J42465F4284J45951
$$ 527509 116125 -20766 175526 347647 -95294 201771 48905 191370 64284 210235
13300B10235P1972J10495a9457j34813b4052D7179k3150b17313B32909j12162
$$ 210235 282207 392702 -19457 -154270 -24052 47179 24029 -217313 232909 120747
13290A20747J05160l3875E3560A2521M0545J34301R4405p7218P8880c66664e1670
$$ 120747 225907 192032 53560 12521 53066 187367 281772 204554 283434 -366664 -51670
13278c0506A37415L56447H6543P7752M4074a2996B66095I0014Q3041R9713M2541
$$ -30506 137415 493862 86543 164295 208369 -12996 266095 90014 173055 272768 315309
13267C15309j34994o870h1169G1063K54239K3621K7587A80215O1822b08299C31730
$$ 315309 180315 173445 -81169 71063 325302 348923 376510 180215 242037 -208299 331730
13255C15853o2826K45481A4559b72385b7646k91141A07577a098A08761K25016
$$ 315853 253027 498508 14559 -272385 -27646 -318787 107577 -1098 108761 333777
13245C33777A33063g8079D73618j13536E0077O2838A7111c36606N2538E35584
$$ 333777 133063 -78079 473618 360082 50077 112915 17111 -336606 -284068 535584
13234D52930c6685A86495J00051m2745J6490K47218c9396A30422K94622j17155
$$ 452930 -36685 186495 286546 243801 260291 507509 -39396 130422 425044 307889
13224C07889Q2050a09657C36572b5907D04130a22695A47533f3488l8174C23514
$$ 307889 389939 -109657 336572 -25907 404130 -122695 147533 -63488 -101662 323514
13213a2097p5927A19009h8117A25712d5418B42210k636A06635P1526J51957A47193
$$ -12097 -88024 119009 -88117 125712 -45418 242210 239574 106635 178161 330118 147193
13201B14956Q6185A19293Q217j1835N4201b42770C04814m3551A14511C3383J5914
$$ 214956 301141 119293 127510 115675 169876 -242770 304814 261263 114511 33383 49297
13190D9297K02632f9192j71543J20313C29707B3398K57725B671h051C73334H6852
$$ 49297 251929 -69192 -240735 -120422 329707 23398 281123 2671 -8051 373334 86852
13178A50483D0193P9829J44527d732A93125E2233g1941A36796e6596A48485a45892
$$ 150483 40193 120022 264549 -4732 193125 52233 -71941 136796 -56596 148485 -145892
13166A73757B6958O3690K61586A21123L4173a22078A15072f2465H2976a14082
$$ 173757 26958 90648 352234 121123 155296 -122078 115072 -62465 82976 -114082
13155I2617J84055d5340A19947a01338A02814K11842j6187j16930J19951f0649
$$ 92617 276672 -45340 119947 -101338 102814 314656 298469 181539 301490 -60649
13144C7783a68793e6924B01437J34539j11207a413A68806E1146J06187d8718h821
$$ 37783 -168793 -56924 201437 335976 224769 -1413 168806 51146 157333 -48718 -8821
13132g4720i089j49129C18812n4951b78467E278K75284c07853a05558b3648D37220
$$ -74720 -9089 -158218 318812 263861 -278467 5278 280562 -307853 -105558 -23648 437220
13120d66331A11137b0126E65724B31075K9037M6804O4781N7608B08473o6581O2529
$$ -466331 111137 -20126 565724 231075 260112 306916 371697 429305 208473 141892 204421
13109B04421m480K70443G5289h2001k29167e7899B95488A40423a35655B74301
$$ 204421 199941 470384 75289 -82001 -311168 -57899 295488 140423 -135655 274301
13098A78173b34814h9409b6815q2399M1134C09030I4788a28095J9461B26508K3844
$$ 178173 -234814 -89409 -26815 -109214 -68080 309030 94788 -128095 -108634 226508 250352
13087B50352A10144R3956J11490I8827D2816O5962J70574j25602i1591D4499b18791
$$ 250352 110144 204100 315590 98827 42816 108778 279352 153750 -91591 44499 -218791
13075A03888A6848b00948A13128K09125j10843d0555q5864A77042b80974B97223
$$ 103888 16848 -200948 113128 322253 211410 -40555 -126419 177042 -280974 297223
13064A12352C3927J49173j0970P9264j0649J43750A74780h2934B68629A29520
$$ 112352 33927 183100 172130 251394 240745 384495 174780 -82934 268629 129520
13053i9862C61932b36591C32487c65744a20861F32K12633A06143h7487A81572
$$ -99862 361932 -236591 332487 -365744 -120861 632 213265 106143 -87487 181572
13042G9115d130m7913H9723J8575J36690l9706q2797O4468e3810A95163n2888
$$ 79115 -4130 -52043 89723 108298 244988 205282 122485 186953 -53810 195163 142275
13031A42275K37795A62413D2764M11099B5592O3478c8208j34334B08810M4672
$$ 142275 380070 162413 42764 453863 25592 89070 -38208 -172542 208810 253482
13021B53482a2502G349M22633j22533Q968l6588K247b37294B56112H7861b0375
$$ 253482 -12502 7349 429982 307449 316417 279829 282076 -237294 256112 87861 -20375
13009C19448C8643a67147D58227I868h47A37204a31085p5691B01079I6005J70918
$$ 319448 38643 -167147 458227 9868 -847 137204 -131085 -206776 201079 96005 266923
12998B66923a94475A10560K2993J17757j02723K5245a29592p5057A83794d04j29442
$$ 266923 -194475 110560 133553 251310 148587 173832 -129592 -204649 183794 -404 -129846
12987a29846A31713j3932b21299j33081a42100m6214F1325q123J97040i6342D1112
$$ -129846 131713 117781 -221299 -354380 -142100 -188314 61325 53202 250242 -96342 41112
12975B56232g913A24576L8448a31627I854J61499c4585j479j88080c390A9166
$$ 256232 -7913 124576 163024 -131627 9854 171353 -34585 -36064 -224144 -3390 19166
12963B30677j4449G3021b6854A37149c76817B42262l3147f4926I9399e160o1667
$$ 230677 216228 73021 -26854 137149 -376817 242262 209115 -64926 99399 -5160 -66827
12952f6827B71866n1918b18815A65232N5912g6658B10668q3593a8647C7840Q8859
$$ -66827 271866 219948 -218815 165232 221144 -76658 210668 127075 -18647 37840 126699
12941A26699a72139A45922N9620f7864C9308r887K84471A31342J41135c35544
$$ 126699 -172139 145922 205542 -67864 39308 29421 313892 131342 272477 -335544
12930C0677K35097r2696J73324q8814J0063C2363a56616A81915J7597J18218N442
$$ 30677 265774 173078 346402 257588 267651 32363 -156616 181915 199512 317730 323172
12919C23172C5965J37650J9016J16551f5437B4582b6282D3741b0232j01741A30900
$$ 323172 35965 173615 192631 309182 -65437 24582 -26282 43741 -20232 -121973 130900
12907f3347q9870H6644J2479J17999l0155b00802o39B4658J01152D8447J42816
$$ -63347 -153217 86644 99123 217122 186967 -200802 -201441 24658 125810 48447 191263
12896A91263D920K30239G8409r511l0560a24282A08982c8639B50545F4999R0170
$$ 191263 4920 235159 78409 68898 38338 -124282 108982 -38639 250545 64999 155169
12885A55169B2559b32560C5302g8559i655H1861c9375A74881m0702M3070J07620
$$ 155169 22559 -232560 35302 -78559 -9655 81861 -39375 174881 134179 177249 284869
12874B84869A8364J60942c01925c8868e562A80378k474H4206J4526O6214i1661
$$ 284869 18364 179306 -301925 -38868 -5562 180378 177904 84206 98732 164946 -91661
12862F1389c62888e9684J3312A96973C3501M5548B0112h338j32687B73318B2526
$$ 61389 -362888 -59684 -46372 196973 33501 79049 20112 -8338 -141025 273318 22526
12850A12353m6960J6137b34871q0199A23575k60M7047a03267N373l0660A48240
$$ 112353 65393 81530 -234871 -315070 123575 123315 170362 -103267 -97894 -128554 148240
12838A17124L7383J70598C5820e8258j9847E4917J36406a20816B33510F303J67056
$$ 117124 154507 325105 35820 -58258 -78105 54917 191323 -120816 233510 6303 173359
12827A73359q1168m5594P2685m8288a09029B18348C3827b12843N5998d3607A65246
$$ 173359 92191 46597 119282 70994 -109029 218348 33827 -212843 -156845 -43607 165246
12815A60239J0001L5751L5906Q5009f7520B84501K211a50442F5881O4067l1075
$$ 160239 170240 205991 241897 326906 -67520 284501 286712 -150442 65881 129948 98873
12804I8873b06712F0382i6271a5916g756m26273A01859c1921m6274C324J00459
$$ 98873 -206712 60382 -96271 -15916 -7756 -434029 101859 -31921 -78195 3324 103783
12793A03783c51762h4665j177G2662J28593j7928h3754f152F3452Q3785J78235
$$ 103783 -351762 -84665 -85842 72662 201255 183327 -83754 -6152 63452 147237 325472
12782C25472E1879b2588m8752A12277J51184q5739b65208A10201m3731K02759
$$ 325472 51879 -22588 -71340 112277 263461 177722 -265208 110201 66470 269229
12772B69229b25543h7364B22256Q2545A24086m6842g2384r0389I3932a13289C82049
$$ 269229 -225543 -87364 222256 304801 124086 77244 -72384 -162773 93932 -113289 382049
12760B11099J67585C5960d6054j38867R2331A66122i5093B69241b35623A3673
$$ 211099 378684 35960 -46054 -184921 -92590 166122 -95093 269241 -235623 13673
12749C8885g7510q9530C8765b39776d9501C3610a6790j14909Q960c0003B30549
$$ 38885 -77510 -167040 38765 -239776 -49501 33610 -16790 -131699 -122739 -30003 230549
12737d9858A46955O4039P461J90328r8793K3648b0881A89393K87383b8890A81335
$$ -49858 146955 210994 218455 408783 309990 333638 -20881 189393 476776 -28890 181335
12725b75434C08674c0817E855b98861A50665O9656a15993b1718k24717A24637
$$ -275434 308674 -30817 5855 -298861 150665 220321 -115993 -21718 -246435 124637
12714B21106a50336K5792I4735K88533A70759L47186b1895C24963A2285J73243
$$ 221106 -150336 -124544 94735 383268 170759 517945 -21895 324963 12285 185528
12704A85528O9737m2604J28415A43637h3831J7690A18347C114J79991a45776m08659
$$ 185528 255265 212661 341076 143637 -83831 -66141 118347 3114 183105 -145776 -554435
12693e54435G3463g450j19515A56666a24606j25839B80454d3974i820G8428c6669
$$ -554435 73463 -7450 -126965 156666 -124606 -250445 280454 -43974 -9820 78428 -36669
12681B0557M5685b65505C25538I0552J18426r7707a3967B31115A06736J0532a06464
$$ 20557 66242 -265505 325538 90552 208978 111271 -13967 231115 106736 117268 -106464
12669f6716b7725j08737c0243A59318a93282B6930J86764a13767B66191q8198
$$ -66716 -27725 -136462 -30243 159318 -193282 26930 213694 -113767 266191 177993
12659A77993a02480b3304A25995M53273h7389A15519A9580J20715A5559K15145
$$ 177993 -102480 -23304 125995 579268 -87389 115519 19580 140295 15559 230704
12649B30704c39610i1775A68114k5173c9848j3067A56822E0212L33J90280b1500
$$ 230704 -339610 -91775 168114 142941 -39848 -52915 156822 50212 50545 240825 -21500
12637b3497k38364B51560A6701J89558g272D08517c03913a07621B16407K84765
$$ -23497 -261861 251560 16701 206259 -7272 408517 -303913 -107621 216407 501172
12627E01172B20450C5241R9578J07101a01318B31223r3141F2282K76382f395G2535
$$ 501172 220450 35241 134819 241920 -101318 231223 138082 62282 338664 -6395 72535
12615B26663E8878n291k494c4586A90188G8501K06268B89K62905K9353D5237i254
$$ 226663 58878 53587 51093 -34586 190188 78501 284769 289 263194 292547 45237 -9254
12602C333b864D4075a1733C40834e8466A97759p3506a86334P4132D6136K00834
$$ 3333 -2864 44075 -11733 340834 -58466 197759 124253 -186334 -112202 46136 246970
12591B46970b07397F627c49951H1869K3037e0969C85792a14441B40378i311m24546
$$ 246970 -207397 6627 -349951 81869 104906 -50969 385792 -114441 240378 -9311 -433857
12580d33857A9412b04440A41773J22634o9119a76348I2311J65529J03749H5127
$$ -433857 19412 -204440 141773 264407 195288 -176348 92311 257840 361589 85127
12569D338R4178O4089b35603A44349m5731f3171j48908E1757a56056B64372d5494
$$ 4338 98516 162605 -235603 144349 98618 -63171 -212079 51757 -156056 264372 -45494
12557a42593E4003B4776c21321A73677l7603c38685a51521A16951J88997D4676
$$ -142593 54003 24776 -321321 173677 136074 -338685 -151521 116951 305948 44676
12546A84418b18454B52747D5258K7197L5972J00741a2343o0608B7939L2644d25612
$$ 184418 -218454 252747 45258 72455 108427 209168 -12343 -72951 27939 60583 -425612
12534c46154F1880a30870A07012a67270I3057D1106L33610B7091N533O9399a5229
$$ -346154 61880 -130870 107012 -167270 93057 41106 374716 27091 32624 102023 -15229
12522G3859f2811F7808K06548A3024O2872a3336A62906a75628I5753a7256j62196
$$ 73859 -62811 67808 274356 13024 75896 -13336 162906 -175628 95753 -17256 -179452
12511a79452B75407H9956a0441A99888b69860A24526J6847e8254G4607L87112
$$ -179452 275407 89956 -10441 199888 -269860 124526 141373 -58254 74607 461719
12501D61719h530A86449Q5750g9509o1297f7739B47310i1408B57064F1302C5Q5005
$$ 461719 -8530 186449 272199 -79509 -140806 -67739 247310 -91408 257064 61302 35 85040
12489H5040M2771a22445m466k07691H5016b9560A44898a069j08526B4305d9020
$$ 85040 127811 -122445 -126911 -334602 85016 -29560 144898 -1069 -109595 24305 -49020
12477d0935l4337a2282j66068j08463b3349A93419c00702g1482D28315b5237A43175
$$ -40935 -75272 -12282 -178350 -286813 -23349 193419 -300702 -71482 428315 -25237 143175
12465a8809j85864R9086A48532a12174E1476q982f3073D8563d8621G6317e05654
$$ -18809 -204673 -105587 148532 -112174 51476 42494 -63073 48563 -48621 76317 -505654
12453A79167H8904e5356A85416A9247g1532D9969L25360c16347m6309A12638d2684
$$ 179167 88904 -55356 185416 19247 -71532 49969 375329 -316347 -362656 112638 -42684
12441b4081C23279a47695E0169Q3589D0205K33566d764k83175A24719a05400A80631
$$ -24081 323279 -147695 50169 133758 40205 273771 -4764 -287939 124719 -105400 180631
12429G8004B1656a38978E8321B33M7132K11960A23586l1431N9556A3700b73529
$$ 78004 21656 -138978 58321 233 47365 259325 123586 92155 151711 13700 -273529
12417B24765d22045e8484a2788l3182C58902a93171B91148b26855A97109M2842
$$ 224765 -422045 -58484 -12788 -45970 358902 -193171 291148 -226855 197109 239951
12407B39951B7484a53978m5302g8439L5342A40528b48777C04218c49003b880j37309
$$ 239951 27484 -153978 -199280 -78439 -43097 140528 -248777 304218 -349003 -2880 -140189
12396a40189K9404A5651f4473J6935A74241G1487a84786K0488A41032a96084e4499
$$ -140189 -110785 15651 -64473 -47538 174241 71487 -184786 -164298 141032 -196084 -54499
12384f4121E216L8994a87370A85072D4028K4963J11156a70672b9913B28242P757
$$ -64121 5216 44210 -187370 185072 44028 68991 180147 -170672 -29913 228242 235999
12373B35999F9867d1061l4625C2598b99638A42307a426m0355j58796A39903L9839
$$ 235999 69867 -41061 -75686 32598 -299638 142307 -1426 -41781 -200577 139903 179742
12362A79742a4490p6226j68537B34034c2927r7031H7540P6912A4042Q5135a99369
$$ 179742 -14490 -90716 -259253 234034 -32927 -129958 87540 164452 14042 99177 -199369
12350B69300A8049c48438e5845B48041d7510G4916a1836j26285A89563b8872o2703
$$ 269300 18049 -348438 -55845 248041 -47510 74916 -11836 -138121 189563 -28872 -91575
12339i1575B85606H6938m1918L8211e4639n752G420a98389H1165c8349G4307P162
$$ -91575 285606 86938 45020 83231 -54639 -60391 7420 -198389 81165 -38349 74307 81469
12327H1469o641a71136j31640B45006F4588P7684l4139f2980j30869N4104B31195
$$ 81469 74828 -171136 -302776 245006 64588 142272 108133 -62980 -193849 -139745 231195
12315a37298c1131E9918j4313Q4450a66819g7866C31686a35668O2992B88369c9991
$$ -137298 -31131 59918 45605 130055 -166819 -77866 331686 -135668 -72676 288369 -39991
12303A85999R6828b22636D1159Q7481K3934J46354a24817a1289j97931F6528K9412
$$ 185999 282827 -222636 41159 128640 152574 298928 -124817 -11289 -209220 66528 95940
12292I5940J30038A3237L76559e7385j2090B56376b02134E1351L27403H5501e7508
$$ 95940 225978 13237 389796 -57385 -69475 256376 -202134 51351 378754 85501 -57508
12280A89552A6438J7851a06811G9290K2473J67826l7802K63781o2848A24707D0200
$$ 189552 16438 34289 -106811 79290 101763 269589 231787 495568 432720 124707 40200
12268a8278k92219A69633i4659A53371h6268B13526N7834b71139l4803A12113
$$ -18278 -310497 169633 -94659 153371 -86268 213526 271360 -271139 -305942 112113
12257A19086R2028B6567O4397e1898j9396B23697A5394b05305C62671a6270A3967
$$ 119086 211114 26567 90964 -51898 -71294 223697 15394 -205305 362671 -16270 13967
12245B17177c00888A62815Q1009q009m4974O1765A00753L11071d5467F4495a778
$$ 217177 -300888 162815 243824 235815 190841 252606 100753 411824 -45467 64495 -1778
12233A06402J42507H0485b03288D00346q1196m5514a07883A33980K12978A16121
$$ 106402 248909 80485 -203288 400346 319150 273636 -107883 133980 346958 116121
12222C26729j10963q4338k590e8763F4725B3565L19633j63337P7208B6484F811
$$ 326729 215766 131428 128838 -58763 64725 23565 343198 179861 257069 26484 6811
12210a07844A49699D8368R0373D7882K27598O30c2143B93100a19007j16114h2404
$$ -107844 149699 48368 138741 47882 275480 276110 -32143 293100 -119007 -235121 -82404
12198A37463L05922j22262b1338B0771J07878J02881A13523e6844j2335q2764
$$ 137463 443385 321123 -21338 20771 128649 231530 113523 -56844 -69179 -151943
12188a51943B70602O9738M5967a82238D61257C1903K45262A13591f3771C05555
$$ -151943 270602 340340 386307 -182238 461257 31903 277165 113591 -63771 305555
12177i3416L0B19468i8592A02005R6361k372a80182B80359G2864g3369A24030
$$ -93416 -93386 219468 -98592 102005 198366 195994 -180182 280359 72864 -73369 124030
12165B9082J31714R2474j568K894D3519a56605A94199r4809C4705h3625K2471
$$ 29082 160796 253270 251702 254596 43519 -156605 194199 99390 34705 -83625 -61154
12154f1154j8078k31339C17830K886M2065j45911c264A11502a92701G0562J46734
$$ -61154 -79232 -310571 317830 320716 362781 216870 -3264 111502 -192701 70562 217296
12143B17296G1616d9575i36H0627c11900e163o6865L501B42593j14842D5362g9803
$$ 217296 71616 -49575 -936 80627 -311900 -5163 -72028 -68527 242593 127751 45362 -79803
12130a06862j6353G8424J29667c4889H0225d0789l5336j89001g4170B32998a19622
$$ -106862 -123215 78424 208091 -34889 80225 -40789 -76125 -265126 -74170 232998 -119622
12118A00311a44981B11318b50451G7613c0054H6426J111b10159C1554c3972j78872
$$ 100311 -144981 211318 -250451 77613 -30054 86426 87537 -210159 31554 -33972 -212844
12107b12844B82706G6365c47939a62533G9754P3989h1840D1452b15125b8636j33448
$$ -212844 282706 76365 -347939 -162533 79754 153743 -81840 41452 -215125 -28636 -162084
12096a62084C9230a73974A145J12020N1308d0379j17055A75277i9793B58594E8797
$$ -162084 39230 -173974 1145 113165 164473 -40379 -157434 175277 -99793 258594 58797
12084d8909H9274j2560K389C8979g332A38801A4527J2164K80012I5046J046M40222
$$ -48909 89274 76714 79103 38979 -7332 138801 14527 26691 306703 95046 96092 536314
12072E36314r0594P54000k7648D06112J7152B03102J36611h4410A64380M1312
$$ 536314 445720 1199720 1172072 406112 423264 203102 339713 -84410 164380 205692
12062B05692a07202A67082j4007n0175c5871k77709c0307A52421a66306k9616
$$ 205692 -107202 167082 153075 102900 -35871 -313580 -30307 152421 -166306 -195922
12052a95922j00619H0245L649J9240c1131j24835B65541G1894O0608b8939F8310
$$ -195922 -296541 80245 83894 103134 -31131 -155966 265541 71894 132502 -28939 68310
12040a68855Q1139I8682Q5945I718b18051G236J95245Q0575h2798m096H2740b02471
$$ -168855 -87716 98682 184627 9718 -218051 7236 202481 283056 -82798 -86894 82740 -202471
12027a62806G0257M5775K77973I6394O6515a67991C25635Q7047C7044a43665N3890
$$ -162806 70257 116032 394005 96394 162909 -167991 325635 412682 37044 -143665 -89775
12016h9775q9938A64589j5027a0983o8505a4883H0369J99667h2252E5179f3282
$$ -89775 -179713 164589 149562 -10983 -79488 -14883 80369 280036 -82252 55179 -63282
12004F1603J39604F4356a01713a0569j48584l4241f1073A22036m4929i9104L9179
$$ 61603 201207 64356 -101713 -10569 -159153 -193394 -61073 122036 77107 -99104 -59925
11993e9925F528g1091j08803A58541O6726D1979G739d02063J24725J26962r7767
$$ -59925 6528 -71091 -179894 158541 225267 41979 7739 -402063 -277338 -150376 -248143
11982b48143P7244A90705J75807c13348G0470K00890A11523a3061j0654N388j47589
$$ -248143 -170899 190705 366512 -313348 70470 271360 111523 -13061 -23715 -18327 -165916
11971a65916E6635a80536j64015B00319a14934H0153c53934a25519A03554c1635
$$ -165916 56635 -180536 -344551 200319 -114934 80153 -353934 -125519 103554 -31635
11960b71854A14805Q7114B5311a18046l0433A38549F7380c3139B70968a7707G9939
$$ -271854 114805 201919 25311 -118046 -148479 138549 67380 -33139 270968 -17707 79939
11948e0515j01255m9100R6938d7880E9834N9635i182k2748A42437b52929c962
$$ -50515 -151770 -200870 -103932 -47880 59834 119469 -9182 -31930 142437 -252929 -3962
11936E6208a93166B7384J3812J5980K79218a8655j48291G8937a7987k33488B4431
$$ 56208 -193166 27384 41196 57176 336394 -18655 -166946 78937 -17987 -251475 24431
11924A75477a78879Q6215I4347g6975k14703O5833o1114f2194E0165a2151j56999
$$ 175477 -178879 -92664 94347 -76975 -291678 -225845 -286959 -62194 50165 -12151 -169150
11913a69150b3034r8922i144A98113j9415G4921J19105b23780G8252B7983Q7646
$$ -169150 -23034 -121956 -9144 198113 178698 74921 194026 -223780 78252 27983 115629
11902A15629Q7355h8776k59691f3292c550F1498b3502k7835A08854f5726H6290
$$ 115629 202984 -88776 -348467 -63292 -3550 61498 -23502 -51337 108854 -65726 86290
11890f7488p3076A85527J10783E4301M5373c05540i2753E1720f1461l8661p7818
$$ -67488 -140564 185527 296310 54301 99674 -305540 -92753 51720 -61461 -100122 -177940
11879a77940a8714A10894B768J934b90794B40662I8517C627a2739A65937C0087
$$ -177940 -18714 110894 2768 4702 -290794 240662 98517 3627 -12739 165937 30087
11867a54277N4858q1221e7339j38158A05303C2487a89117A35994b85787a26072
$$ -154277 -99419 -180640 -57339 -195497 105303 32487 -189117 135994 -285787 -126072
11856e8160j13179A70712G000a25500J1389C50658d7468j09322p0480B4085b14844
$$ -58160 -171339 170712 7000 -125500 -114111 350658 -47468 -156790 -227270 24085 -214844
11844G3883J41762C4867a17147J0976A69289C1313k933a0827k78260B882a38670
$$ 73883 215645 34867 -117147 -106171 169289 31313 28380 -10827 -289087 2882 -138670
11832A6519F234R0316b9049I3317Q689p704h1989c1332a2135A39997D8936a99449
$$ 16519 6234 96550 -29049 93317 102006 94302 -81989 -31332 -12135 139997 48936 -199449
11819D5835N151a47134c2331F3847h2262q0266q9483m6195a1567j6249D33359
$$ 45835 50986 -147134 -32331 63847 -82262 -162528 -252011 -298206 -11567 -27816 433359
11807a84164j34442J08775n2443p0544K7439J37383f0706l6389q3348E4667c71147
$$ -184164 -318606 -209831 -262274 -332818 -305379 -167996 -60706 -97095 -180443 54667 -371147
11795c53313F7931b17145C28290A05575K6732g3271m5226L8747I4321e03774B9570
$$ -353313 67931 -217145 328290 105575 132307 -73271 -118497 -79750 94321 -503774 29570
11783A96485b93185C6904c80318I7891P5690C2569M68058H4677C4745J55852Q4222
$$ 196485 -293185 36904 -380318 97891 173581 32569 500627 84677 34745 190597 274819
11772B74819c48655j20584E7754B930a80166B25135H765K61328F0J01215D8615
$$ 274819 -348655 -469239 57754 2930 -180166 225135 8765 270093 60 101275 48615
11760b62310c1227k57078C75181A78461E9906b1784j48453b7745j4471p9479A63569
$$ -262310 -31227 -288305 375181 178461 59906 -21784 -170237 -27745 -42216 -121695 163569
11748A68622b90334b8040M921j77966C13521c0706o0164A1082c46003A99268B2446
$$ 168622 -290334 -28040 -23119 -201085 313521 -30706 -90870 11082 -346003 199268 22446
11736c275G9549a10399A55515k1750a2155A07896E3814L10098d10714D8067K1809
$$ -3275 79549 -110399 155515 133765 -12155 107896 53814 363912 -410714 48067 69876
11725F9876f5878A50052c41054G2492J28797K1348I0715b55302A69945a67854
$$ 69876 -65878 150052 -341054 72492 201289 222637 90715 -255302 169945 -167854
11714C5428L060L5558J52012b73408C31924a86152C20755E0115b35363A88271
$$ 35428 38488 74046 226058 -273408 331924 -186152 320755 50115 -235363 188271
11703g8844A2630J07490K13411d8533A1306K99622d2534C928a71688A99998n060
$$ -78844 12630 120120 333531 -48533 11306 310928 -42534 3928 -171688 199998 194938
11692A94938h1341E5793L77162R7730D0138N6869K77664B5682a76764d0590A91702
$$ 194938 -81341 55793 432955 530685 40138 97007 374671 25682 -176764 -40590 191702
11680A81054a33534D35232a86089B54943d9354Q006I4438L810a07450A61925H0588
$$ 181054 -133534 435232 -186089 254943 -49354 -41348 94438 98248 -107450 161925 80588
11668A44948g7779C1794J56417a99320I4832a82692e1332D1c4251M46B07237H7497
$$ 144948 -77779 31794 188211 -199320 94832 -182692 -51332 41 -34251 -33805 207237 87497
11655C5223M3652K25129J44666G7733O6894B5198P9709b89490A25033b91024a5657
$$ 35223 78875 304004 448670 77733 144627 25198 104907 -289490 125033 -291024 -15657
11643a0930A2322P1768e632k19255b8408A1088J2990b75376j577F1238d3082A63522
$$ -10930 12322 84090 -5632 -224887 -28408 11088 24078 -275376 -276953 61238 -43082 163522
11630b80066B20529a13525j6452C9432B529J60537r852o3513a12883c4263H7579
$$ -280066 220529 -113525 -129977 39432 2529 163066 153214 89701 -112883 -34263 87579
11618A37623c05970c1122H8975f1506B11427q0407a12452C35854j15340o9963
$$ 137623 -305970 -31122 88975 -61506 211427 131020 -112452 335854 220514 150551
11608A50551G2603J77978b67151A38973a66965f2174A97335a10400d1413A70643
$$ 150551 72603 250581 -267151 138973 -166965 -62174 197335 -110400 -41413 170643
11597B49164m7870D1428A9483a63806N1956B07943e7A41865P5072H1460a13996
$$ 249164 201294 41428 19483 -163806 -111850 207943 -57 141865 216937 81460 -113996
11585A08753J3975J10007L782H1952h434j42367O860j03536N5403B23667b35647
$$ 108753 122728 232735 236517 81952 -8434 -150801 -143941 -247477 -192074 223667 -235647
11573g0403A77957l3614f5286A85096O4186J19894F2757P389a10945C9504J63659
$$ -70403 177957 144343 -65286 185096 249282 369176 62757 70146 -110945 39504 203163
11562B03163o2498j26J31822B8397c58895b2866j0389B99342j49177C547d9788
$$ 203163 140665 140539 272361 28397 -358895 -22866 -33255 299342 150165 3547 -49788
11550b5336j64562B27808A08916J8805J63371O3981B4896K31327d0872F7467a14783
$$ -25336 -189898 227808 108916 127721 291092 355073 24896 256223 -40872 67467 -114783
11538A8170c02416Q5192G6069b21272A62194a11752B20994c96594c5421n2802
$$ 18170 -302416 -217224 76069 -221272 162194 -111752 220994 -396594 -35421 -88223
11528h8223B43356p8481K14091i2104b1713j30997i971j16810j66897d7061Q778
$$ -88223 243356 164875 378966 -92104 -21713 -152710 -9971 -126781 -293678 -47061 -38283
11517c8283q6556F087J11346J72265b58639J1184A16990Q3853r3551R2442N0210
$$ -38283 -124839 6087 117433 289698 -258639 -247455 116990 200843 107292 199734 249944
11506B49944P9963d0489C52357b9545j84769C79470M9189D4860d2741n9672E26617
$$ 249944 329907 -40489 352357 -29545 -214314 379470 428659 44860 -42741 -102413 526617
11494B4176R4618B6009L59828B3669J84133l5831a07408o2810F4165J58394b04552
$$ 24176 118794 26009 385837 23669 207802 171971 -107408 -170218 64165 222559 -204552
11482D491K55844l6134o4659k8846b33563C64427i0638H3322N03988A58345n5367
$$ 4491 260335 224201 159542 130696 -233563 364427 -90638 83322 587310 158345 102978
11471A02978P7840N8838K45871k24748A2595J89215D1907K64183G2016k3987K26469
$$ 102978 180818 239656 485527 260779 12595 201810 41907 306090 72016 48029 274498
11460B74498a74786B402a68625B76258R987q8373J37235a31248C09317j30410
$$ 274498 -174786 2402 -168625 276258 286245 197872 335107 -131248 309317 178907
11450A78907D6609K77187A34898c8707j41908B25873f9111B38561A00131e6570
$$ 178907 46609 323796 134898 -38707 -180615 225873 -69111 238561 100131 -56570
11439C23340c7417C1046k871L59683B0918i6520j03037Q6431A93626f3381l931
$$ 323340 -37417 31046 28175 387858 20918 -96520 -199557 -113126 193626 -63381 -67312
11428f7312I6565N6978K04813j78146b35118H3303J46246K26712A25932h9257
$$ -67312 96565 153543 358356 180210 -235118 83303 229549 456261 125932 -89257
11417B5925Q2989K6346b23472F800a7852k55995F5588J22325D0255a1812B015
$$ 25925 108914 135260 -223472 6800 -17852 -273847 65588 187913 40255 -11812 2015
11405d1436H2887a81939L4318n1047B73913G3374l6441j2060e1923A75128a18708
$$ -41436 82887 -181939 -147621 -198668 273913 73374 36933 24873 -51923 175128 -118708
11393A24593O2245C7203e5114D8241a77465A39085a98767d7431p2322H0063L6727
$$ 124593 186838 37203 -55114 48241 -177465 139085 -198767 -47431 -119753 80063 116790
11382A16790a15105A9655a42978C29917I6062d7719A26831a67783Q3089B38886
$$ 116790 -115105 19655 -142978 329917 96062 -47719 126831 -167783 -84694 238886
11371d4769k4833A44603h6380j9254F9303c8894B5279J97931l7616H6649N786
$$ -44769 -69602 144603 -86380 -105634 69303 -38894 25279 223210 185594 86649 92435
11360I2435m1487J50643H7598K1947f9036p2565A15063i4711C49824A68302A8269
$$ 92435 50948 201591 87598 109545 -69036 -141601 115063 -94711 349824 168302 18269
11348b9694C35174A38308C9897e1937A61638o0413a2191k504q1548C2223a78113
$$ -29694 335174 138308 39897 -51937 161638 101225 -12191 -14695 -96243 32223 -178113
11336f9566r4023B65068a89958k47554b9781m22467g9392A62549a625H4789A2866
$$ -69566 -163589 265068 -189958 -437512 -29781 -452248 -79392 162549 -1625 84789 12866
11324F3428b68231N4266b6974j48622L7827a9057m1783i946l2715k52860F1199
$$ 63428 -268231 -213965 -26974 -175596 -137769 -19057 -60840 -9946 -42661 -295521 61199
11312A85599a67978a2578j51055k11477B85927o1566G0157H774j039A202e3958
$$ 185599 -167978 -12578 -163633 -375110 285927 224361 70157 8774 7735 1202 -53958
11300d48393a34280A54386a12135j69058B4002J2927i798G3481b88814C77831
$$ -448393 -134280 154386 -112135 -281193 24002 36929 -9798 73481 -288814 377831
11289F7731k8775c1033j41650e7753K016J3049A53069c27801M6959M8847K299
$$ 67731 38956 -31033 -172683 -57753 -55737 -42688 153069 -327801 -280842 -231995 -229696
11278b29696b3908m6182n6952B0920c30601J47253l4764B52776b78933J31238
$$ -229696 -23908 -70090 -127042 20920 -330601 -183348 -218112 252776 -278933 -147695
11268a47695B3345c43451J26115B78457L9655a36070A6937c33815d6234j13311
$$ -147695 23345 -343451 -217336 278457 318112 -136070 16937 -333815 -46234 -159545
11258a59545a7159j49186e9888l00926h4288p0091K7749c2459F2398J8098C8989
$$ -159545 -17159 -166345 -59888 -360814 -84288 -154379 -126630 -32459 62398 80496 38989
11246a72689k80613C0694c05021j67568a08641c3383A35875A4234a33831B2959
$$ -172689 -453302 30694 -305021 -472589 -108641 -33383 135875 14234 -133831 22959
11235d2721B19568n0637m7553a29155j16109B4978c83503a52290B09714d03688
$$ -42721 219568 168931 121378 -129155 -245264 24978 -383503 -152290 209714 -403688
11224e2352j4932E2588R5416b41497B08443q826k3687F2419R2036c62751A0902
$$ -52352 -67284 52588 148004 -241497 208443 199617 175930 62419 154455 -362751 10902
11212a39853A85901A542a13518G6348b05999A67061a56163d0271B49152I5810
$$ -139853 185901 1542 -113518 76348 -205999 167061 -156163 -40271 249152 95810
11201F1634d88153e0274k2504I4936c10879M7123C1911K5536a14084j4507B37122
$$ 61634 -488153 -50274 -72778 94936 -310879 -263756 31911 57447 -114084 -128591 237122
11189B5524J33101d2149B31362a03087k06061h6195l9180b1375B4486a08235a0455
$$ 25524 158625 -42149 231362 -103087 -309148 -86195 -125375 -21375 24486 -108235 -10455
11177e2671C93693A18688g454E9224j1452J8033b16068e8077D3036K49902c09442
$$ -52671 393693 118688 -7454 59224 47772 65805 -216068 -58077 43036 292938 -309442
11165b04488H9820c71814a40382e762j94513A36130L66248a62013Q083B48398
$$ -204488 89820 -371814 -140382 -5762 -200275 136130 502378 -162013 -153930 248398
11154b0649j46535q8788j06314A38386o0565B5572c84660a48592A99754c34335
$$ -20649 -167184 -255972 -362286 138386 77821 25572 -384660 -148592 199754 -334335
11143c8916C10886D3584i7577p4281c8546k0656l5658p7657B4330K16851i1408
$$ -38916 310886 43584 -97577 -171858 -38546 -59202 -94860 -172517 24330 241181 -91408
11131f3856B58007g6503D30861D6255J51281A1043d1109n1163D3582I522i2256
$$ -63856 258007 -76503 430861 46255 197536 11043 -41109 -92272 43582 9522 -92256
11119a13884C3729J37726c05577C38356b00869D4512N1195K40220K3825j00599
$$ -113884 33729 171455 -305577 338356 -200869 44512 95707 335927 359752 259153
11109B59153m834k622G2712J38707A9040J45237J03684j25639K07806o3269l5456
$$ 259153 254319 251697 72712 211419 19040 164277 267961 142322 350128 286859 251403
11098B51403N8848c7861C83372A04428A4949e3422b2704G1060K43962J80445j00837
$$ 251403 310251 -37861 383372 104428 14949 -53422 -22704 71060 315022 495467 394630
11087C94630c8331D19434C1816J13666J71922j26650L1303M8765j23451g269H1081
$$ 394630 -38331 419434 31816 145482 317404 190754 222057 270822 147371 -7269 81081
11075A78670J01359L6811A53873N7998J24855o9268J01503D8287M06630J21156
$$ 178670 280029 316840 153873 211871 336726 267458 368961 48287 454917 576073
11065E76073k76018J17112P4011k16144L20452J00057r802k58753J99967j42617
$$ 576073 300055 417167 491178 275034 595486 695543 685741 426988 626955 484338
11055D84338N17183k56813j58320O9889J18376o096o2040N7860J21071k41133
$$ 484338 1001521 744708 586388 656277 774653 768557 706517 764377 885448 644315
11045F44315L8262R7014L1918j85115r257L56828N5886j24668j71672k39893J94250
$$ 644315 682577 779591 811509 626394 617137 973965 1029851 905183 733511 493618 687868
11034F87868k00418Q0636K14398q0149m6810K33103L15566m91038J49218k50345
$$ 687868 487450 568086 782484 702335 655525 888628 1204194 713156 862374 612029
11024F12029R7096j64618J42399Q0156C58715K93878K07572l00294J09063j88730
$$ 612029 709125 544507 686906 767062 358715 652593 860165 559871 668934 480204
11014D80204L93611k52923j3030k9087J15369O2989k48143o0497J32763K02541
$$ 480204 873815 620892 607862 578775 694144 757133 508990 448493 581256 783797
11004G83797P8064J60171D81750K47033r5834N0193J43203j24392j2603P5113
$$ 783797 861861 1022032 481750 728783 632949 683142 826345 701953 689350 764463
10994G64463J14732j56403j27155L23055j87935L06489j04397J44656j28857J56362
$$ 764463 879195 722792 595637 918692 730757 1037246 932849 1077505 948648 1105010
10984A105010j57083p254J71493J00602o0471N57587J59626l28020M20044J9674
$$ 1105010 947927 940673 1112166 1212768 1152297 1709884 1869510 1541490 1961534 1981208
10974A981208M10520M04389l01833L66154k35497r5268j70351j74310j19944k80235
$$ 1981208 2391728 2796117 2494284 2860438 2624941 2529673 2359322 2185012 2065068 1784833
10964A784833l44952L73614J00375n61759P44758k33069l1395R7280o8914L6163
$$ 1784833 1439881 1813495 1913870 1352111 2096869 1863800 1832405 1929685 1860771 1896934
10954A896934n91254J23541k06203j92870r1845k13255j88062l298j10306k06757
$$ 1896934 1305680 1429221 1223018 1030148 938303 725048 536986 533688 423382 216625
10944B16625R5149N0302j69976a7683E95306B82504b5260r2781M1131B71247a00593
$$ 216625 311774 362076 192100 -17683 595306 282504 -25260 -118041 -76910 271247 -100593
10932E3119i7029B6168f4264c0207n3697f67k18784A01445f7858a4690j57290
$$ 53119 -97029 26168 -64264 -30207 -83904 -667 -219451 101445 -67858 -14690 -171980
10921a71980C43763a17044r5250I3697P3255f4347C2072O1470E76L27425J04067
$$ -171980 343763 -117044 -212294 93697 166952 -64347 32072 93542 576 328001 432068
10910D32068A93911b22892e2182A9465P1824K2704K1820a64232e4181B08703c73665
$$ 432068 193911 -222892 -52182 19465 91289 113993 135813 -164232 -54181 208703 -373665
10898a03763B76791O4651I3861K0016C9722a18334D3474J76101a3406D36040b75996
$$ -103763 276791 341442 93861 113877 39722 -118334 43474 219575 -13406 436040 -275996
10886f4145J6187q8140p8277c7958A64942G2165L26968b81441a35824p69q6868
$$ -64145 -47958 -136098 -214375 -37958 164942 72165 399133 -281441 -135824 -136593 -223461
10875b23461H0563L95246b24358B54386D8867b62037A41375A0486R1164C1873
$$ -223461 80563 475809 -224358 254386 48867 -262037 141375 10486 101650 31873
10864F2555K22909k669h2477G0324a14529D2940J8586c1203q2482d905I7431n184
$$ 62555 285464 282795 -82477 70324 -114529 42940 61526 -31203 -113685 -4905 97431 92247
10852I2247J27552a03141b7587j40154j7066j12297B45477a1101p3329n4736A02126
$$ 92247 219799 -103141 -27587 -167741 -184807 -297104 245477 -11101 -84430 -139166 102126
10840B53703i431C43483f4650D1437J07862b82196P9092m8010H3332b93763c8628
$$ 253703 -9431 343483 -64650 41437 149299 -282196 -203104 -251114 83332 -293763 -38628
10828D8847a10163m1606j13738B58789a53331A02427a26056C59310a97455F5159
$$ 48847 -110163 -151769 -265507 258789 -153331 102427 -126056 359310 -197455 65159
10817b54903a469j17385l154C8819a20604F2036J4645i0005B69130b0379A6201
$$ -254903 -1469 -118854 -122008 38819 -120604 62036 76681 -90005 269130 -20379 16201
10805d7539A44940a43817F3595J51303a23337k88818b03295p2385J27096c1424
$$ -47539 144940 -143817 63595 214898 -123337 -412155 -203295 -275680 -148584 -31424
10794c1655A13030b85785J7262A39566O1497c36250a22757m6918E3602f3133j58598
$$ -31655 113030 -285785 -268523 139566 201063 -336250 -122757 -169675 53602 -63133 -221731
10783b21731j98200a90145F5967D709L0443a03087m1029A84690D3272M0527b62235
$$ -221731 -419931 -190145 65967 4709 35152 -103087 -144116 184690 43272 83799 -262235
10771A06397f2349m3576A02980a55947b6350C33450B0649h4250F7128J95674c7738
$$ 106397 -62349 -105925 102980 -155947 -26350 333450 20649 -84250 67128 262802 -37738
10759a55091m3529B0153Q5321a11629H8317j748a08046j03941B69992J2750c52273
$$ -155091 -198620 20153 105474 -111629 88317 86569 -108046 -211987 269992 282742 -352273
10747D0348a74530F6114c12314E7306J01583n5741a87324C747b42904e1262k24235
$$ 40348 -174530 66114 -312314 57306 158889 103148 -187324 3747 -242904 -51262 -275497
10736b75497o964f7673K2714l10688b0410I356M2881B5080J48453K9392d5965
$$ -275497 -282461 -67673 -44959 -355647 -20410 9356 52237 25080 173533 202925 -45965
10724a08533b8149D4654L7332A6242N040d5600C5807J02931J43359m9213f9065
$$ -108533 -28149 44654 81986 16242 21282 -45600 35807 138738 282097 232884 -69065
10712A79265d6308A25743a67107N5265k2898o8569A97289b53327f8370b3833A65333
$$ 179265 -46308 125743 -167107 -111842 -134740 -203309 197289 -253327 -68370 -23833 165333
10700C00378n7680c44531i3841r0081k7484j34501E3919e4212k0014k92133f4348
$$ 300378 242698 -344531 -93841 -183922 -211406 -345907 53919 -54212 -74226 -366359 -64348
10688a36774A9365c15880N7573C8994b06195A60238d0991l2935B1063b41773B6342
$$ -136774 19365 -315880 -258307 38994 -206195 160238 -40991 -73926 21063 -241773 26342
10676a33789n9574j40738a5244D043h9769l93148a51370L6481o5629g8481b1688
$$ -133789 -193363 -334101 -15244 4043 -89769 -482917 -151370 -114889 -180518 -78481 -21688
10664a33526O4112j93779J0558Q3579m2607K1061n7699D9624a54365C70374A64284
$$ -133526 -69414 -263193 -252635 -169056 -211663 -190602 -248301 49624 -154365 370374 164284
10652f4925A08925b0123I5866c6106B70482a35570l5379B0403k123b10451h9885
$$ -64925 108925 -20123 95866 -36106 270482 -135570 -170949 20403 18280 -210451 -89885
10640B55835i8582i435j01164A71548f7939o2911m676N755j13598l3685N9311
$$ 255835 -98582 -9435 -110599 171548 -67939 -130850 -135526 -129771 -243369 -277054 -217743
10629b17743A48373d03375a54427N2082j51646k02956C14336o6126k0202a03984
$$ -217743 148373 -403375 -154427 -102345 -253991 -456947 314336 248210 228008 -103984
10618a90029E9146f6234n9947A49691a25689A09823D2879c06218F3991b85801
$$ -190029 59146 -66234 -126181 149691 -125689 109823 42879 -306218 63991 -285801
10607b64786A31252a33467M3730n7529j4234F4002b50616e8203I5998g1453B67758
$$ -264786 131252 -133467 -89737 -147266 -161500 64002 -250616 -58203 95998 -71453 267758
10595B5517K71294b9436j36466H9156a27076M3148j9505M6763k05715A68923a50703
$$ 25517 296811 -29436 -165902 89156 -127076 -83928 -103433 -56670 -262385 168923 -150703
10583a06336b8595D64825a90873G1428c28506h7697A30490f74A8566b65781E6135
$$ -106336 -28595 464825 -190873 71428 -328506 -87697 130490 -674 18566 -265781 56135
10571B0179d6500j4842k40149a4805A91338a61334B04631G6913c10362a12826
$$ 20179 -46500 -61342 -301491 -14805 191338 -161334 204631 76913 -310362 -112826
10560E4636K2768L6354a99504A49224d16472c9856k51692J11652f7530H4931j9493
$$ 54636 77404 113758 -199504 149224 -416472 -39856 -291548 -179896 -67530 84931 65438
10549F5438a24421c6226k37016A96319A9074K48909h59019C1790i4468J3390A50813
$$ 65438 -124421 -36226 -273242 196319 19074 267983 -859019 31790 -94468 -81078 150813
10537F1405b31051B8526a60430e8096l2043B12662a21757k4823r1396C7389a14847
$$ 61405 -231051 28526 -160430 -58096 -90139 212662 -121757 -146580 -237976 37389 -114847
10525b06887Q5098C3249J63829f4390f317B77438b38089c6534j10608n120F2831
$$ -206887 -121789 33249 197078 -64390 -6317 277438 -238089 -36534 -147142 -152262 62831
10513d3569r9552p8787L1815A5024a02595H8198J17297d4693l01518A1803c04498
$$ -43569 -143121 -221908 -190093 15024 -102595 88198 205495 -44693 -346211 11803 -304498
10501h4774J4887A47086d6063F0075c35741B07330J09022D8328J27889J35520
$$ -84774 -69887 147086 -46063 60075 -335741 207330 316352 48328 176217 311737
10491C11737A1781J60526c04064i9325B32536h8730C2348p255J53531L02070J33732
$$ 311737 11781 172307 -304064 -99325 232536 -88730 32348 25093 178624 480694 614426
10480F14426Q3774B56992J78867j69730D5859J00361K26980a77506h2622B8058
$$ 614426 698200 256992 435859 266129 45859 146220 373200 -177506 -82622 28058
10469A11697m4170b58667B25314a46099o6245B87318a2861n2169C87211A00358
$$ 111697 67527 -258667 225314 -146099 -212344 287318 -12861 -65030 387211 100358
10458a71392A20428D8797a77374b2183k40399E6592a45400E3836f8930H8434k4933
$$ -171392 120428 48797 -177374 -22183 -262582 56592 -145400 53836 -68930 88434 63501
10447F3501k6146g5070A39506A6580J48764o140O7709h3508a9255j44943A10781
$$ 63501 37355 -75070 139506 16580 165344 159204 226913 -83508 -19255 -164198 110781
10435B2320J63678b2650A1511a79306G6531c32744a12016B31239a39364A60751
$$ 22320 185998 -22650 11511 -179306 76531 -332744 -112016 231239 -139364 160751
10424b65580k3748c6576k11941F4323c04497A4516m639J79229b1663A25396a03950
$$ -265580 -289328 -36576 -248517 64323 -304497 14516 9877 189106 -21663 125396 -103950
10412C3370K34096b13858B20634q4765b9105f552A11282b70077g5973p230H774
$$ 33370 267466 -213858 220634 135869 -29105 -6552 111282 -270077 -75973 -83203 8774
10400A81128k6641A2592k172K53053I3504Q9469b56547b1273A14580J58064g2609
$$ 181128 154487 12592 10420 263473 93504 182973 -256547 -21273 114580 272644 -72609
10388A40813c6788n4644m3062A47697a24562B43248O2701J5203I9644K03217I2288
$$ 140813 -36788 -91432 -134494 147697 -124562 243248 305949 321152 99644 302861 92288
10376B32852k3531a97071D79434A15351J37597k5310l6540J77607j16743K96704
$$ 232852 209321 -197071 479434 115351 252948 227638 191098 368705 251962 548666
10366E48666j86439b1289D09746r218A67137N6452o4093J0741M2972K37645A56880
$$ 548666 362227 -21289 409746 400528 167137 223589 159496 170237 213209 450854 156880
10354B46700A16689J62503K72741J83600j75964q285k40985J3507e3800F5121
$$ 246700 116689 279192 551933 735533 559569 551284 310299 323806 -53800 65121
10343D20924o4656A05883B4112O1215b0396p5751E65089k25259L5582G728Q5353
$$ 420924 356268 105883 24112 85327 -20396 -96147 565089 339830 375412 7728 93081
10332I3081a13097A25353c7365j10043g2696B91998i8415j01285A82648c3388
$$ 93081 -113097 125353 -37365 -147408 -72696 291998 -98415 -199700 182648 -33388
10321G0746l4201K01611n4456J79216c1728A32097K58822j44580K7644E224J52980
$$ 70746 36545 238156 183700 362916 -31728 132097 390919 246339 273983 5224 158204
10310A58204J16108j27149J85615m0761F8501h313D83930i7597p1197A91996D484
$$ 158204 274312 147163 332778 292017 68501 -8313 483930 -97597 -168794 191996 4484
10298a13902C4999K21386Q1874A3437O2257i2743B22961a69529k67759J46019
$$ -113902 34999 256385 338259 13437 75694 -92743 222961 -169529 -437288 -291269
10288b91269q9154o2630c9710k91608A05707D5839b89204H5995M1420a33955k11314
$$ -291269 -380423 -443053 -39710 -331318 105707 45839 -289204 85995 127415 -133955 -345269
10277c45269g382j69305B04203J0987c750l60155B4276a57655E9995L1284J17210
$$ -345269 -7382 -176687 204203 215190 -3750 -363905 24276 -157655 59995 91279 208489
10266B08489P9179g048k40154A95320B7320K18419P325O8208N8081J78759k07909
$$ 208489 287668 -7048 -247202 195320 27320 245739 253064 321272 379353 558112 350203
10255C50203j8999B83L97623a78083m5393A68297f4483a2238k16844O2771A95579
$$ 350203 331204 283 397906 -178083 -223476 168297 -64483 -12238 -229082 -166311 195579
10243a72022I8968L9327i9435L7831A46692b07545G0788a04513l9639m9704A18378
$$ -172022 98968 138295 -99435 -61604 146692 -207545 70788 -104513 -144152 -193856 118378
10231c96954D5233a55998j75328M0079B1486c18711B73620c11310a21168J7095
$$ -396954 45233 -155998 -331326 -291247 21486 -318711 273620 -311310 -121168 -104073
10221a04073J159d4604k37415R2610f5258k04320B375K60012a89236c417A83492
$$ -104073 -102914 -44604 -282019 -189409 -65258 -269578 2375 262387 -189236 -3417 183492
10209b64652A35680a40191j41369P3659A09490H14c0886n04764A90562g8924A2955
$$ -264652 135680 -140191 -281560 -207901 109490 814 -30886 -535650 190562 -78924 12955
10197A26740J3162b89488H2798k7743a78028l3921O7599l52961a69234a1000k4121
$$ 126740 139902 -289488 82798 55055 -178028 -211949 -144350 -497311 -169234 -11000 -35121
10186c5121B47697b0962H399M6682e8952b0854j79470a9944j46455a5053j08960
$$ -35121 247697 -20962 8399 55081 -58952 -20854 -200324 -19944 -166399 -15053 -124013
10175a24013j26773G5069k8317a5076A50356b13768q3818J0719d1782j27819n3191
$$ -124013 -250786 75069 46752 -15076 150356 -213768 -297586 -286867 -41782 -169601 -222792
10164b22792h1537j99401a29705L9018c4948l70969r338G2981J49143k4353d769
$$ -222792 -81537 -280938 -129705 -90687 -34948 -405917 -415255 72981 222124 197771 -4769
10152a44701b6566I8573c22309a45129L615l16591A5176K19950F4831O8929a55262
$$ -144701 -26566 98573 -322309 -145129 -141514 -458105 15176 235126 64831 133760 -155262
10140D0092K72651l4110b10752r9749m7345f670n06729G400a91024O1049k90413
$$ 40092 312743 278633 -210752 -310501 -357846 -6670 -513399 7400 -191024 -129975 -420388
10129d20388C4074N6817c04632b8320C0962a37225M3534B60222b41238k6218b4716
$$ -420388 34074 90891 -304632 -28320 30962 -137225 -93691 260222 -241238 -267456 -24716
10117F2788K84344A23370h8036G6374b36049H046M4259a27783k51969J81920k55913
$$ 62788 347132 123370 -88036 76374 -236049 8046 52305 -127783 -379752 -197832 -453745
10106d53745I7347f3309j97899C03263fk50830A3614d8738n8500j50494N6594
$$ -453745 97347 -63309 -261208 303263 -6 -250836 13614 -48738 -107238 -257732 -201138
10095b01138D2496b07586f328j11333o3617A26536J42440A17505R6777l5135a07151
$$ -201138 42496 -207586 -6328 -117661 -181278 126536 268976 117505 214282 179147 -107151
10083a1622k3702n5850K2278C65622B1902c1854n0427j1307q2905R079j3560h8481
$$ -11622 -35324 -91174 -68896 365622 21902 -31854 -82281 -93588 -176493 -167414 -180974 -88481
10070B45324d9990o2484B5491a49781q8113A23997c33914R5178F1062B3766e0532
$$ 245324 -49990 -112474 25491 -149781 -237894 123997 -333914 -238736 61062 23766 -50532
10058F9477M3396f1973H4610b96765L2978I359j735b40485A79648b86504J05229
$$ 69477 112873 -61973 84610 -296765 -263787 9359 7624 -240485 179648 -286504 -181275
10047a81275O6031C56409I3107l1551j6138c6492A300h0402k04445J18717j10000
$$ -181275 -115244 356409 93107 61556 45418 -36492 1300 -80402 -284847 -166130 -276130
10036b76130I1364A9157L0327J07901a10014r2348N1648B5160a52617l1542N9601
$$ -276130 91364 19157 49484 157385 -110014 -202362 -150714 25160 -152617 -184159 -124558
10025a24558C04192A1328d4385A2760a30212A8559N0339c05975I0022C8908a09771
$$ -124558 304192 11328 -44385 12760 -130212 18559 68898 -305975 90022 38908 -109771
10013a45022k04854a06166D3048a74129A1840a27818A44419a65366C96911a34206
$$ -145022 -349876 -106166 43048 -174129 11840 -127818 144419 -165366 396911 -134206
10002A10971a98859B08137K51539a32734e9397k49892E7725J41195Q1772f0522
$$ 110971 -198859 208137 459676 -132734 -59397 -309289 57725 198920 280692 -60522
9991F6321b97741H6727b03127P0963l55719a2394B681J26374a02662a2043j96583
$$ 66321 -297741 86727 -203127 -132164 -487883 -12394 2681 129055 -102662 -12043 -208626
9980b08626a4583j39768j10381e953p0477B1947a45991G3302a12045F3667c9946
$$ -208626 -14583 -154351 -264732 -5953 -76430 21947 -145991 73302 -112045 63667 -39946
9968i3106E2128K5563j8033a6804A72280c41123b2197A3449a42485H4894k6306
$$ -93106 52128 77691 59658 -16804 172280 -341123 -22197 13449 -142485 84894 58588
9957E8588a72830p2808A17171J65238b12795K7349R0344K0176m7593M4835A34320
$$ 58588 -172830 -245638 117171 282409 -212795 -185446 -95102 -74926 -122519 -77684 134320
9945A18767a06371i920j95602A55196a1344j97257B83336H2710J63832e06638
$$ 118767 -106371 -9920 -205522 155196 -11344 -208601 283336 82710 246542 -506638
9934a3383k72875E7057N4426a37574c6392a2289p3928K6761j52613j41013a35281
$$ -13383 -286258 57057 111483 -137574 -36392 -12289 -86217 -59456 -212069 -353082 -135281
9922h2849j76847B07218n8544J30713e33295d160r5715L7535k3411d1694E000
$$ -82849 -259696 207218 148674 279387 -533295 -4160 -99875 -62340 -85751 -41694 5000
9910A35002B7514p393b1282C27610c26563G3664d09616A46806K08066h9047n8774
$$ 135002 27514 20121 -21282 327610 -326563 73664 -409616 146806 354872 -89047 -147821
9899a47821f0320k9811A36376j4520h6568o0779C0590J06123c55716A4367L095
$$ -147821 -60320 -90131 136376 121856 -86568 -147347 30590 136713 -355716 14367 17462
9888A7462a11933B42498i8171l8678q9727j43790F4459i4783G4777l0648b25496
$$ 17462 -111933 242498 -98171 -136849 -226576 -370366 64459 -94783 74777 44129 -225496
9876D20478i0755m2426o1269m09550a68593I26M24164a77292L5596K9089k3133
$$ 420478 -90755 -133181 -194450 -604000 -168593 926 425090 -177292 -141696 -112607 -135740
9865a35740K585B50712c40633H1422c24523J08856L6929H7769f8238m6379E0471
$$ -135740 -133155 250712 -340633 81422 -324523 -215667 -178738 87769 -68238 -114617 50471
9853a02098n8998C750i8869j68761P1454A5037a858A29329b84565i1763k3533
$$ -102098 -161096 3750 -98869 -267630 -196176 15037 -1858 129329 -284565 -91763 -115296
9842a15296e987j03732q859o9229A00697a13427F508a7880m0539B48615a52874
$$ -115296 -5987 -109719 -118578 -187807 100697 -113427 6508 -17880 -58419 248615 -152874
9830a80832C3635f3767m2670O160m1557j22619I9689R1528g4402N154C3727a14314
$$ -180832 33635 -63767 -106437 -100277 -141834 -264453 99689 191217 -74402 -69248 33727 -114314
9817F1907k8385a03944B03251f1503K1969A68237c21316E4492a82201A28216b27935
$$ 61907 33522 -103944 203251 -61503 -39534 168237 -321316 54492 -182201 128216 -227935
9805i1598j19901a00589r006a7197A16307a10263m9983K2928j32317a9619m0958
$$ -91598 -211499 -100589 -109595 -17197 116307 -110263 -160246 -137318 -269635 -19619 -60577
9794f0577q7986A24107b51644a9522k02480H6150A7906M9630h4316A64111i5433
$$ -60577 -148563 124107 -251644 -19522 -222002 86150 17906 67536 -84316 164111 -95433
9782e77928b8152H0373J70813E4827b97765a42436J5067B64663a64817A49648
$$ -577928 -28152 80373 251186 54827 -297765 -142436 -127369 264663 -164817 149648
9771a19741k53742A27892b01231C00856A16097a59104j14708a3068l132B6358
$$ -119741 -373483 127892 -201231 300856 116097 -159104 -273812 -13068 -16200 26358
9760c49061p9536B30604D4910d248A2255b43345E4589B4709b72257B68767H2680
$$ -349061 -428597 230604 44910 -4248 12255 -243345 54589 24709 -272257 268767 82680
9748a14306L7274j03022j87468C3908a57123k48073A27649a24868A16332f6287
$$ -114306 -77032 -180054 -367522 33908 -157123 -405196 127649 -124868 116332 -66287
9737b0815D799K15724a64322m7954L9426c5315F774b34375A80238E9769e332A56551
$$ -20815 4799 220523 -164322 -212276 -172850 -35315 6774 -234375 180238 59769 -5332 156551
9724b65269g8406G5095K54967b34316k3312e7533F63Q8837a72738A4034a05694
$$ -265269 -78406 75095 330062 -234316 -257628 -57533 663 89500 -172738 14034 -105694
9712b58728C4747i4296n1328q0919C4868i4052l7536j9422P4323j38763A92257
$$ -258728 34747 -94296 -145624 -226543 34868 -94052 -131588 -151010 -76687 -215450 192257
9700b83690A01482J04851M4986a34281D4010d67j01392p5065A08434B1626b05754
$$ -283690 101482 206333 251319 -134281 44010 -467 -101859 -176924 108434 21626 -205754
9688A3116a2191A83094f5480R818k34904a01409p8556r0710P0270j1227a02231
$$ 13116 -12191 183094 -65480 -55662 -290566 -101409 -179965 -270675 -200405 -211632 -102231
9676a38368q7355A54755b77564d6000A78573d44122a90259A1211d03636a54251
$$ -138368 -225723 154755 -277564 -46000 178573 -444122 -190259 11211 -403636 -154251
9665d359j13265j08360B13240a50860k4339q1873P6665j32819a35476R789b3242
$$ -4359 -117624 -225984 213240 -150860 -175199 -257072 -180407 -313226 -135476 -125687 -23242
9653A72039i1040N900l4989q1046k1860D7316M9372c23121E9023a31057n4180
$$ 172039 -91040 -85140 -120129 -201175 -223035 47316 96688 -323121 59023 -131057 -185237
9642a85237g7214C7449c44770A97090C6501j1450h1743A82346a53225L3277G0138
$$ -185237 -77214 37449 -344770 197090 36501 25051 -81743 182346 -153225 -119948 70138
9630B8048L10973b20599k70803b0313l14712i2721j55311O4318A2127K5900a57239
$$ 28048 339021 -220599 -491402 -20313 -335025 -92721 -248032 -183714 12127 38027 -157239
9618a58607B30415a58907j7042F7185C3038e1089j0736D7439J15557a72705A86924
$$ -158607 230415 -158907 -175949 67185 33038 -51089 -61825 47439 162996 -172705 186924
9606c44325a00996l4726G2966l3406b80493a09868l47159A03735a46397p7169
$$ -344325 -100996 -135722 72966 39560 -280493 -109868 -457027 103735 -146397 -223566
9596b23566C5193b365B86014b57839Q8817A86441c73644O1690A88851d90410G6824
$$ -223566 35193 -2365 286014 -257839 -169022 186441 -373644 -311954 188851 -490410 76824
9584A53917b00510I0104a73470o2183J00611B71348G9776c39754C5625a39569
$$ 153917 -200510 90104 -173470 -235653 -135042 271348 79776 -339754 35625 -139569
9573a4355l4801j28612A00253g6691h563C5272a5395F4848a29300M8897F7342
$$ -14355 -49156 -177768 100253 -76691 -8563 35272 -15395 64848 -129300 -80403 67342
9561B38944b2173A19694i7110n7879f7406J4282m38230f4076a972k87471R8525
$$ 238944 -22173 119694 -97110 -154989 -67406 -53124 -491354 -64076 -1972 -289443 -190918
9550a90918R4192a9948B84501b25516A67650a7042l0469r258J5814j11468K8655
$$ -190918 -96726 -19948 284501 -225516 167650 -17042 -47511 -56769 -40955 -152423 -123768
9539a23768M1651A2628f6904o7148K9890j00339i8868C51364j55617P4072a34509
$$ -123768 -82117 12628 -66904 -134052 -104162 -204501 -98868 351364 195747 269819 -134509
9527b56013B13954o833J17442a37921K9732l16061K03913b2102j3145F9221M3018
$$ -256013 213954 207121 324563 -137921 -108189 -424250 -220337 -22102 -35247 69221 112239
9516A12239h4662k34968A96288f5973j44605B18749h6692m5105d9808A32658a11418
$$ 112239 -84662 -319630 196288 -65973 -210578 218749 -86692 -131797 -49808 132658 -111418
9504c57275a25514F2920e40488b9441l64859L5544d6347A30490L13929h0858j87093
$$ -357275 -125514 62920 -540488 -29441 -394300 -358756 -46347 130490 444419 -80858 -267951
9493b67951a4056A61111a46289B21808a4557k69309c0487f579j26000J5261J1355
$$ -267951 -14056 161111 -146289 221808 -14557 -283866 -30487 -6579 -132579 -117318 -105963
9482a05963R97k58762J52088C5469n330a76460D9260J46807a16775k19520A84263
$$ -105963 -104966 -363728 -211640 35469 30139 -176460 49260 196067 -116775 -336295 184263
9470B3717c1763R832q2667A5084J12745f2863n8905A8470a13152A38964c51714
$$ 23717 -31763 -21931 -104598 15084 127829 -62863 -121768 18470 -113152 138964 -351714
9458B4149c87558J11325A18599a75777B18947b96776c2913n2021q4650h2176k60489
$$ 24149 -387558 -276233 118599 -175777 218947 -296776 -32913 -84934 -169584 -82176 -342665
9447c42665g1917A52928a13478E7381b62181C3413L7893m76c71027J04366D3600
$$ -342665 -71917 152928 -113478 57381 -262181 33413 71306 70830 -371027 -266661 43600
9435A29692A6286d35213e2075I0161i4390c1185A37085a91156A94879a4730B46815
$$ 129692 16286 -435213 -52075 90161 -94390 -31185 137085 -191156 194879 -14730 246815
9423a63291m3353M7122P5872j96884I7221b83299a1004j89636N4203j0251A45689
$$ -163291 -206644 -159522 -83650 -280534 97221 -283299 -11004 -200640 -146437 -156688 145689
9411a66604I8172b03667H7706J89745d09931g8369n5119b9837E4078a60527k2637
$$ -166604 98172 -203667 87706 277451 -409931 -78369 -133488 -29837 54078 -160527 -183164
9400a83164f2272l0202o1221m0284A32873a15553k56258I2430h2815B50283a29702
$$ -183164 -62272 -92474 -153695 -193979 132873 -115553 -371811 92430 -82815 250283 -129702
9388b15442j39263d7129K2942n8929A74301a57312K5462b3091k78979a12761b1002
$$ -215442 -354705 -47129 -24187 -83116 174301 -157312 -131850 -23091 -302070 -112761 -21002
9376D6250c21493a03304B52374J88228c22232B4803K5327p175b05915k39051H5550
$$ 46250 -321493 -103304 252374 440602 -322232 24803 50130 42955 -205915 -444966 85550
9364d3827j14093I4039l7224J68883E0777b04918D653J06123K6338a18458j86355
$$ -43827 -157920 94039 56815 225698 50777 -204918 4653 110776 137114 -118458 -304813
9353c04813A57783b10208A66910a0049r0929A51225A8599J47760F4680b0322k85659
$$ -304813 157783 -210208 166910 -10049 -100978 151225 18599 166359 64680 -20322 -305981
9342c05981J51242j92736A46021a11180i008E4334O4546a27881A49211h6467j00197
$$ -305981 -154739 -347475 146021 -111180 -9008 54334 118880 -127881 149211 -86467 -186664
9331a86664e951j02054L5660j316m7237D8762M9624d03054a8853q1861A50684
$$ -186664 -5951 -108005 -72345 -73661 -120898 48762 98386 -403054 -18853 -100714 150684
9319h1466I0363a53403A69290F9120a57786d0722q5584m4801c7500k15615A59379
$$ -81466 90363 -153403 169290 69120 -157786 -40722 -126306 -171107 -37500 -253115 159379
9307G2102c02115j62939C73558j25070E3793J92087a98894C01144b70030A8277
$$ 72102 -302115 -465054 373558 248488 53793 245880 -198894 301144 -270030 18277
9296G5215c22026g6974K7511q0811A02566i9016r6442B6869a63278a3341j98096
$$ 75215 -322026 -76974 -49463 -130274 102566 -99016 -195458 26869 -163278 -13341 -211437
9285b11437L2545E7722c14572d5939B28199b60652f0340j27680A8460c2326q0393
$$ -211437 -178892 57722 -314572 -45939 228199 -260652 -60340 -188020 18460 -32326 -112719
9274a12719J2236j82208A31167e126A15602a37157E4582a58026A86978q6171L3306
$$ -112719 -100483 -282691 131167 -5126 115602 -137157 54582 -158026 186978 100807 134113
9263A34113h0703k50870M8569c1826G6840a56084B5293M64544i0127A58009n6660
$$ 134113 -80703 -331573 -283004 -31826 76840 -156084 25293 489837 -90127 158009 101349
9252A01349a88925B46516J29672b81979J28517m751q325M4251H3430a02068A66429
$$ 101349 -188925 246516 376188 -281979 -153462 -158213 -166538 -122287 83430 -102068 166429
9240F0077a77409A19308c378m4081l49584J53724j19118a3130d35E7917a12785
$$ 60077 -177409 119308 -3378 -47459 -397043 -243319 -362437 -13130 -435 57917 -112785
9228b38765m9438f3694G3854i3976q3357A09922c05570G0809j0604i481m11938
$$ -238765 -288203 -63694 73854 -93976 -177333 109922 -305570 70809 60205 -9481 -421419
9217d21419A11028P3125h3820k3139b8252l00335A00229b29420c2987G3887b35335
$$ -421419 111028 184153 -83820 -106959 -28252 -328587 100229 -229420 -32987 73887 -235335
9205A27126d41278A3917a6566m716B15822q4082J44025d5734A355a31710a1157
$$ 127126 -441278 13917 -16566 -21282 215822 131740 275765 -45734 1355 -131710 -11157
9193a49506B87363c5533j02747j68820I7289f2050k9549D9058m690J09431a36960
$$ -149506 287363 -35533 -138280 -307100 97289 -62050 -91599 49058 44368 153799 -136960
9181d53755B38506a56991A10296h8216M0481j47615i2729j33197D2719a23276
$$ -453755 238506 -156991 110296 -88216 -47735 -195350 -92729 -225926 42719 -123276
9170b15309l7814D2270i8398p6620C1356c10809A42621e30493a9040j08756D4059
$$ -215309 -253123 42270 -98398 -175018 31356 -310809 142621 -530493 -19040 -127796 44059
9158b44301H0569c3010o2749j0618j56486B53979a02217q424a3593B73467H9201
$$ -244301 80569 -33010 -95759 -106377 -262863 253979 -102217 -110641 -13593 273467 89201
9146a95153h2580j00154B8780N2525f3423G9562b14070k32267a7396B09205o5149
$$ -195153 -82580 -182734 28780 81305 -63423 79562 -214070 -446337 -17396 209205 144056
9135A44056a95822R1328L6871j04188m5271k4528R713g3570j33278L6934K651
$$ 144056 -195822 -104494 -67623 -171811 -217082 -241610 -231897 -73570 -206848 -169914 -167263
9124a67263M9442J5413A38814J6382f7218H5031J51063e1661A12032P9608i6598
$$ -167263 -117821 -102408 138814 155196 -67218 85031 236094 -51661 112032 191640 -96598
9112B35101M2542G2542b63826B52502a1258B17930a05952N0987n5817G6741h6372
$$ 235101 277643 72542 -263826 252502 -11258 217930 -105952 -54965 -110782 76741 -86372
9100a87205j35911L5843J31196K2813L0324L7248k1643j50112d9254H1101N622
$$ -187205 -323116 -287273 -156077 -133264 -102940 -65692 -87335 -237447 -49254 81101 86723
9089H6723b11952p5369A27875a52415B56197b38474M2340A15960a56135b1323
$$ 86723 -211952 -287321 127875 -152415 256197 -238474 -196134 115960 -156135 -21323
9078G3711b41906j61933A41960L6854I789d67996A13298a751j50570K9755c555
$$ 73711 -241906 -403839 141960 178814 9789 -467996 113298 -1751 -152321 -122566 -3555
9066D021b00307K6092K4357e7068l39629A20438i3746j22809l8971i0612n1192
$$ 4021 -200307 -174215 -149858 -57068 -396697 120438 -93746 -216555 -255526 -90612 -141804
9055a41804n4462a7922A28857C1081b25782C8847d61816a29509j87419a47056
$$ -141804 -196266 -17922 128857 31081 -225782 38847 -461816 -129509 -316928 -147056
9044b16792l1576A12029i718m15287c7028B72337i1557J3638F8020b03012P4027
$$ -216792 -248368 112029 -9718 -425005 -37028 272337 -91557 -77919 68020 -203012 -128985
9033a28985E6697b71472i5388q7821I6275b58554F8492j3329J24627a92547A06388
$$ -128985 56697 -271472 -95388 -183209 96275 -258554 68492 55163 179790 -192547 106388
9021I4995b85560a13696k7898b5287q5371e063q6835d3784B9147j2843c12111
$$ 94995 -285560 -113696 -141594 -25287 -110658 -5063 -91898 -43784 29147 16304 -312111
9009d3756j96573J05547C01313a35634j5082k08629F4100j2202C559b70287f7556
$$ -43756 -240329 -134782 301313 -135634 -150716 -359345 64100 51898 3559 -270287 -67556
8997B36532c13333C88294E1770a03757B61355a17900j06860B68717f9276b3064
$$ 236532 -313333 388294 51770 -103757 261355 -117900 -224760 268717 -69276 -23064
8986B96251n2344b61317i5835A32921A5576a13262q5258c6620C2157b40982Q4194
$$ 296251 243907 -261317 -95835 132921 15576 -113262 -198520 -36620 32157 -240982 -156788
8975a56788c6549A70485b37770j27229J80013k2006l1458i6337B08166a07238
$$ -156788 -36549 170485 -237770 -364999 -184986 -206992 -238450 -96337 208166 -107238
8964F8967e3663D7500a49077f8139A23847a82618g1130p6392C0403b7521b820
$$ 68967 -53663 47500 -149077 -68139 123847 -182618 -71130 -147522 30403 -27521 -2820
8952g1208B33679b04762a02104k22388G7177c58122a06752r0717M8089C75360
$$ -71208 233679 -204762 -102104 -324492 77177 -358122 -106752 -197469 -149380 375360
8941A03079b44163a5937p2310k4976A82415J02833a68528F829K58608c9828p6777
$$ 103079 -244163 -15937 -88247 -113223 182415 285248 -168528 6829 265437 -39828 -116605
8930a16605M5513B36521a04194Q876E01104K70755J27149J644867M205605M41530
$$ -116605 -71092 236521 -104194 -95318 501104 771859 899008 2543875 6749480 7191010
8920G191010B073790F56789j54782m7337B2459L9757P488a81449A37256a81781
$$ 7191010 2073790 656789 502007 454670 22459 62216 69704 -181449 137256 -181781
8909c7930A3694J73544K8190B4603O4917l8169Q5368m2708f5247b46A79551b58146
$$ -37930 13694 187238 215428 24603 89520 51351 136719 94011 -65247 -246 179551 -258146
8896g4175I7134e9995l6017n7222e1699k64086A73031c5439B54116D2213K12400
$$ -74175 97134 -59995 -96012 -153234 -51699 -315785 173031 -35439 254116 42213 254613
8885B54613d834n0617N867A17126a33342d6911n37600C13013b7574k66708A89247
$$ 254613 -4834 -55451 -49584 117126 -133342 -46911 -584511 313013 -27574 -294282 189247
8873a19530j63824B41392r9250r716b44407j2487g9836l8148k79633L2779B704
$$ -119530 -283354 241392 142142 132426 -244407 -256894 -79836 -117984 -397617 -364838 2704
8861a05910l492j28630A27280c43820f2460K3945j61369K3548I1416b4697A82140
$$ -105910 -109402 -238032 127280 -343820 -62460 -38515 -199884 -176336 91416 -24697 182140
$$ [...]
##END NTUPLES=NMR SPECTRUM
##END=
