
##TITLE=AC1198_BRAAS12062_6528062_i992S6RnTi
##JCAMPDX= 6.0         $$ Bruker NMR JCAMP-DX V2.0
##DATA TYPE= NMR SPECTRUM
##DATA CLASS= NTUPLES
##ORIGIN= BRUKER
##OWNER= Administrator
$$ 1.72 TOPSPIN		Version 2.1
$$ 2012-07-15 10:10:19.328 -0500  Administrator@TOPSPIN
$$ Compression mode = diff/dup
##.OBSERVE FREQUENCY= 400.02188249412
##.OBSERVE NUCLEUS= ^1H
##.ACQUISITION MODE= SIMULTANEOUS (DQD)
##.ACQUISITION SCHEME= undefined
##.AVERAGES= 64
##.DIGITISER RES= 22
##SPECTROMETER/DATA SYSTEM= spect
##.PULSE SEQUENCE= noesygpps1d.comp
##.SOLVENT NAME= COFFEE_meoh
##.SHIFT REFERENCE= INTERNAL, COFFEE_meoh, 1, 14.9609
##AUDIT TRAIL= $$ (NUMBER, WHEN, WHO, WHERE, PROCESS, VERSION, WHAT)
$$ ##TITLE= Audit trail, TOPSPIN		Version 2.1
$$ ##JCAMPDX= 5.01
$$ ##ORIGIN= Bruker BioSpin GmbH
$$ ##OWNER= Administrator
$$ $$ C:\Bruker\TOPSPIN/data/COFFEE/nmr/AC1198_BRAAS12062_6528062_i992S6RnTi/12/pdata/1/auditp.txt
$$ ##AUDIT TRAIL=  $$ (NUMBER, WHEN, WHO, WHERE, PROCESS, VERSION, WHAT)
(   1,<2012-07-15 10:10:13.000 -0500>,<Administrator>,<TOPSPIN>,<go>,<TOPSPIN 2.1>,
      <created by zg
	started at 2012-07-15 09:58:42.187 -0500,
	POWCHK enabled, PULCHK disabled,
       configuration hash MD5:
       6B 1B 68 BB D9 2E 58 E2 7F 35 AD 54 07 DF 0E 41
       data hash MD5: 64K
       FF 81 B8 AE E8 5A 17 94 59 60 85 A2 78 13 FE EF>)
(   2,<2012-07-15 10:10:16.281 -0500>,<Administrator>,<TOPSPIN>,<proc1d>,<TOPSPIN 2.1>,
      <Start of raw data processing
       efp LB = 0.3 FT_mod = 6 PKNL = 1 PHC0 = 0 PHC1 = 0 SI = 128K 
       data hash MD5: 128K
       56 5E CC 97 0B B2 F8 C5 1F 07 2E 71 D1 45 B2 13>)
(   3,<2012-07-15 10:10:18.484 -0500>,<Administrator>,<TOPSPIN>,<proc1d>,<TOPSPIN 2.1>,
      <pk PHC0 = -1.598511 PHC1 = 0 
       data hash MD5: 128K
       E8 02 FD E5 3A 42 F1 40 31 E0 EE 99 31 97 CB EA>)
(   4,<2012-07-15 10:10:18.750 -0500>,<Administrator>,<TOPSPIN>,<proc1d>,<TOPSPIN 2.1>,
      <abs ABSG = 1 
       data hash MD5: 128K
       36 73 05 BE 2E B2 D2 B2 2A 8F 2D 27 0D 29 49 B8>)
(   5,<2012-07-15 10:10:18.843 -0500>,<Administrator>,<TOPSPIN>,<proc1d>,<TOPSPIN 2.1>,
      <abs ABSG = 2 
       data hash MD5: 128K
       28 7B F3 43 75 97 25 4B 68 70 F4 6E 00 5A FA F9>)
(   6,<2012-07-15 10:10:18.906 -0500>,<Administrator>,<TOPSPIN>,<proc1d>,<TOPSPIN 2.1>,
      <abs ABSG = 3 
       data hash MD5: 128K
       02 E4 07 FA 33 95 A2 05 64 42 7D E9 4F 8A 66 39>)
(   7,<2012-07-15 10:10:18.953 -0500>,<Administrator>,<TOPSPIN>,<proc1d>,<TOPSPIN 2.1>,
      <abs ABSG = 4 
       data hash MD5: 128K
       E7 A9 32 ED 7A 20 4A 67 A3 F4 CB 75 9A 07 08 EC>)
(   8,<2012-07-15 10:10:19.234 -0500>,<Administrator>,<TOPSPIN>,<proc1d>,<TOPSPIN 2.1>,
      <abs ABSG = 5 
       data hash MD5: 128K
       D1 9D 82 00 7D 65 A0 BA 53 C1 5C 87 BF A0 44 B4>)
$$ ##END=
$$ 
$$ $$ hash MD5
$$ $$ A9 D7 A9 96 F0 33 CA 7E DA 3C 3D 87 03 ED 18 E5
##$RELAX= 
##$RELAX= 
##$RELAX= 
##$RELAX= 
##$RELAX= 
##$RELAX= 
##$RELAX= 
##$RELAX= 
$$ Bruker specific parameters
$$ [...]
150 150 150 150 150 150 150 150
##$TP07= 0
##$TPNAME0= <>
##$TPNAME1= <>
##$TPNAME2= <>
##$TPNAME3= <>
##$TPNAME4= <>
##$TPNAME5= <>
##$TPNAME6= <>
##$TPNAME7= <>
##$TPOAL= (0..7)
0.5 0.5 0.5 0.5 0.5 0.5 0.5 0.5
##$TPOFFS= (0..7)
0 0 0 0 0 0 0 0
##$TUNHIN= 0
##$TUNHOUT= 0
##$TUNXOUT= 0
##$USERA1= <user>
##$USERA2= <user>
##$USERA3= <user>
##$USERA4= <user>
##$USERA5= <user>
##$V9= 5
##$VALIST= <valist>
##$VCLIST= <CCCCCCCCCCCCCCC>
##$VD= 0
##$VDLIST= <DDDDDDDDDDDDDDD>
##$VPLIST= <PPPPPPPPPPPPPPP>
##$VTLIST= <TTTTTTTTTTTTTTT>
##$WBST= 2048
##$WBSW= 25
##$XGAIN= (0..3)
0 0 0 0
##$XL= 0
##$YL= 0
##$YMAX_a= 11976839
##$YMIN_a= -9504014
##$ZGOPTNS= <>
##$ZL1= 120
##$ZL2= 120
##$ZL3= 120
##$ZL4= 120
##$ABSF1= 14.9609
##$ABSF2= -5.597281
##$ABSG= 5
##$ABSL= 3
##$ALPHA= 0
##$AQORDER= 0
##$ASSFAC= 0
##$ASSFACI= 0
##$ASSFACX= 0
##$ASSWID= 0
##$AUNMP= <proc_prof1d_extract.lims>
##$AXLEFT= 0
##$AXNAME= <>
##$AXNUC= <1H>
##$AXRIGHT= 0
##$AXTYPE= 0
##$AXUNIT= <>
##$AZFE= 0.1
##$AZFW= 0.1
##$BCFW= 0
##$BC_mod= 0
##$BYTORDP= 0
##$COROFFS= 0
##$CY= 15
##$DATMOD= 1
##$DC= 0
##$DFILT= <>
##$DTYPP= 0
##$F1P= 0
##$F2P= 0
##$FCOR= 0.5
##$FTSIZE= 131072
##$FT_mod= 6
##$GAMMA= 0
##$GB= 0
##$INTBC= 1
##$INTSCL= 1
##$ISEN= 128
##$LB= 0.3
##$LEV0= 0
##$LPBIN= 0
##$MAXI= 10000
##$MC2= 0
##$MEAN= 0
##$ME_mod= 0
##$MI= 0
##$NCOEF= 0
##$NC_proc= -2
##$NLEV= 6
##$NOISF1= 0
##$NOISF2= 0
##$NSP= 0
##$NTH_PI= 0
##$NZP= 0
##$OFFSET= 14.9609
##$PC= 1
##$PHC0= -1.598511
##$PHC1= 0
##$PH_mod= 1
##$PKNL= yes
##$PPARMOD= 0
##$PPDIAG= 0
##$PPIPTYP= 0
##$PPMPNUM= 2147483647
##$PPRESOL= 1
##$PSCAL= 4
##$PSIGN= 0
##$PYNMP= <proc.py>
##$REVERSE= no
##$SF= 400.020009676438
##$SI= 131072
##$SIGF1= 0
##$SIGF2= 0
##$SINO= 400
##$SIOLD= 131072
##$SPECTYP= <>
##$SREGLST= <1H.CDCl3>
##$SSB= 0
##$STSI= 131072
##$STSR= 0
##$SW_p= 8223.68421052631
##$SYMM= 0
##$S_DEV= 0
##$TDeff= 65536
##$TDoff= 0
##$TI= <>
##$TILT= no
##$TM1= 0
##$TM2= 0
##$TOPLEV= 0
##$USERP1= <user>
##$USERP2= <user>
##$USERP3= <user>
##$USERP4= <user>
##$USERP5= <user>
##$WDW= 1
##$XDIM= 131072
##$YMAX_p= 405779106
##$YMIN_p= -11777
##$CURPLOT= <Network HP LaserJet P1505>
##$CURPRIN= <$Network HP LaserJet P1505>
##$DFORMAT= <normdp>
##$LAYOUT= <+/1D_H.xwp>
##$LFORMAT= <normlp>
##$PFORMAT= <normpl>
##$SURQMSG= 1
$$ End of Bruker specific parameters
$$ ---------------------------------
##NTUPLES= NMR SPECTRUM
##VAR_NAME=  FREQUENCY,     SPECTRUM/REAL,   SPECTRUM/IMAG
##SYMBOL=    X,             R,               I
##VAR_TYPE=  INDEPENDENT,   DEPENDENT,       DEPENDENT
##VAR_FORM=  AFFN,          ASDF,            ASDF
##VAR_DIM=   131072,        131072,          131072
##UNITS=     HZ,            ARBITRARY UNITS, ARBITRARY UNITS
##FACTOR=    0.0627417313425164, 1,          1
##FIRST=     8223.62146879497, -482,         -59482
##LAST=      0,             1784,            -60088
##MIN=       0,             -11777,          0
##MAX=       8223.62146879497, 405779106,    0
$$ Real data points
##PAGE= N=1
##DATA TABLE= (X++(R..R)), XYDATA
$$ [...]
63923E435916k2874o2034j01173j38360j71529j99801k22798k39932k50952k56434
$$ 5435916 5413042 5351008 5249835 5111475 4939946 4740145 4517347 4277415 4026463 3770029
63913C770029k57115k53353k45678k35176k22732k08368j91876j73890j55821
$$ 3770029 3512914 3259561 3013883 2778707 2555975 2347607 2155731 1981841 1826020
63904A826020j38878j23375j08980r5440q3080p2514o3849n6456m9827m4229m0047
$$ 1826020 1687142 1563767 1454787 1359347 1276267 1203753 1139904 1083448 1033621 989392 949345
63893I49345l6789l3488l0034k7260k5611k4453k2979k1215j9716j8745j8129
$$ 949345 912556 879068 849034 821774 796163 771710 748731 727516 707800 689055 670926
63882F70926j7600j6894j5744j4079j2034r671o884l749o68K038M344O305P893
$$ 670926 653326 636432 620688 606609 594575 584904 578020 574271 573603 575641 579985 586290 594183
63869E94183R300J1006J3228J5554J7421J8752J9811K0606K0819K0380J9691J9178
$$ 594183 603483 614489 627717 643271 660692 679444 699255 719861 740680 761060 780751 799929
63857G99929J8800J8110J6732J4699J2318R820P183M289J200j847m689p386j0025
$$ 799929 818729 836839 853571 868270 880588 890408 897591 901880 903080 901233 896544 889158 879133
63844H79133j2507j4639j6465j8327k0496k2782k4686k5905k6518k6690k6467
$$ 879133 866626 851987 835522 817195 796699 773917 749231 723326 696808 670118 643651
63833F43651k6014k5749k5854k5846k5017k3293k1300j9585j8127j6669j5189
$$ 643651 617637 591888 566034 540188 515171 491878 470578 450993 432866 416197 401008
63822D01008j3897j3014j2580j2293j1534r975q130o913o592o590o349n867n267
$$ 401008 387111 374097 361517 349224 337690 327715 319585 312672 306080 299490 293141 287274 282007
63809B82007m417l299k316j829j749j763j710j487j054o51o69j073j464j800k433
$$ 282007 277590 274291 271975 270146 268397 266634 264924 263437 262383 261732 261063 259990 258526 256726 254293
63794B54293l222l439k873k287k236k200j632j050j271k064k604k752k931l038
$$ 254293 251071 247632 244759 242472 240236 238036 236404 235354 234083 232019 229415 226663 223732 220694
63780B20694k514j434n39k53m16q45j354j377n43M43M88l17p59k60M71P50Q10
$$ 220694 218180 216746 216207 215954 215538 214693 213339 211962 211419 211862 212350 212033 211274 211014 211485 212235 213045
63763B13045R73Q85K29n42q11o02k86L4L42L74J6l12j67K73M68K29k23o17p29
$$ 213045 214018 214903 215132 214590 213779 213177 212891 212925 213267 213641 213657 213345 213178 213451 213919 214148 213925 213308 212579
63744B12579l52M74J333J807J932K109K641L430M029L997L421K967L097L400L168
$$ 212579 212227 212701 214034 215841 217773 219882 222523 225953 229982 233979 237400 240367 243464 246864 250032
63729B50032K551K425L041L594L394K800K503K555K682K978L604M139M026L531
$$ 250032 252583 255008 258049 261643 265037 267837 270340 272895 275577 278555 282159 286298 290324 293855
63715B93855L442L812L701K435N88p26j190j503k330l448m116m026l531l025k506
$$ 293855 297297 301109 304810 307245 307833 307107 305917 304414 302084 298636 294520 290494 286963 283938 281432
63700B81432j901j460j330j090k32R86J803K021K235K747K978K350J274P31J171
$$ 281432 279531 278071 276741 275651 275419 276405 278208 280229 282464 285211 288189 290539 291813 292544 293715
63685B93715K229L296L897L682K572R95l17q88p17j16M72O14K17k52j57N99J438
$$ 293715 295944 299240 303137 306819 309391 310386 310069 309181 308464 308348 308820 309434 309651 309399 309242 309841 311279
63668C11279J787J722J806K319K848K773K007J041K24o64j920l275m144m410m536
$$ 311279 313066 314788 316594 318913 321761 324534 326541 327582 327806 327142 325222 321947 317803 313393 308857
63653C08857m876n246n286m928m376l838l409k962k178r18L48Q77N70J95M29J050
$$ 308857 303981 298735 293449 288521 284145 280307 276898 273936 271758 270840 271188 272065 272635 272830 273259 274309
63637B74309J437J597K174L440M750N214M725M027L828M127M522M917N602O607
$$ 274309 275746 277343 279517 282957 287707 292921 297646 301673 305501 309628 314150 319067 324669 331276
63623C31276P462P823Q023Q644R770J0990J2078J3197J4518J5997J7507J8867
$$ 331276 338738 346561 354584 363228 372998 383988 396066 409263 423781 439778 457285 476152
63611D76152J9848K0494K1410K3213K5700K7992K9590L0735L1571L1534K9917
$$ 476152 496000 516494 537904 561117 586817 614809 644399 675134 706705 738239 768156
63600G68156K6709K2481J7727J2604P260K050k545o126q523r797j0100r742r456
$$ 768156 794865 817346 835073 847677 854937 856987 854442 848316 839793 829996 819896 810154 800698
63587H00698j0204j2263j4732j6574j7985j9983k2647k4677k5015k4082k2853
$$ 800698 790494 778231 763499 746925 728940 708957 686310 661633 636618 612536 589683
63576E89683k1413j9241j6435j3806j1796j0021p991n685l332j043J088K851M122
$$ 589683 568270 549029 532594 518788 506992 496971 488980 483295 479963 478920 480008 482859 486981
63563D86981N029N763O352O798P311Q148R195R921J0036J0033J0738J2378J4395
$$ 486981 492010 497773 504125 510923 518234 526382 535577 545498 555534 565567 576305 588683 603078
63550F03078J6336J8379K0791K3324K5707K8285L1556L5232L8301L9801L8975
$$ 603078 619414 637793 658584 681908 707615 735900 767456 802688 840989 880790 919765
63539I19765L5039K7795J8523R363J598m854j0228j4061j5795j5540j3928j1842
$$ 919765 954804 982599 1001122 1010485 1012083 1007229 997001 982940 967145 951605 937677 925835
63527I25835j0484j0864j2880j5514j8162k1094k4384k7381k9669l1584l3115
$$ 925835 915351 904487 891607 876093 857931 836837 812453 785072 755403 723819 690704
63516F90704l3302l1544k8766k6324k4357k2185j9805j7882j6552j5259j3705
$$ 690704 657402 625858 597092 570768 546411 524226 504421 486539 469987 454728 441023
63505D41023j2117j0646r221p927o902n964m914m053l763l847l878l882m016l840
$$ 441023 428906 418260 409039 401112 394210 388246 383332 379279 375516 371669 367791 363909 359893 356053
63491C56053k834j438o29n35l93J00L28p8n19k47O88J684K309K474K318K159K226
$$ 356053 353219 351781 351152 350617 350224 350324 350652 350574 350055 349808 350496 352180 354489 356963 359281 361440 363666
63474C63666K426K579K789L116L039J938R8j455k207k621l210l768l819l275k417
$$ 363666 366092 368671 371460 374576 377615 379553 379651 378196 375989 373368 370158 366390 362571 359296 356879
63459C56879j694j615k336l141k990j769m37L26R40K032L397M399M892N122N093
$$ 356879 355185 353570 351234 348093 345103 343334 342897 343223 344163 346195 349592 353991 358883 364005 369098
63444C69098M771M656N448P057Q567R348R817J0842J2701J4899J6930J8852K0979
$$ 369098 373869 378525 383973 391030 399597 408945 418762 429604 442305 457204 474134 492986 513965
63431E13965K3227K5087K6167K6390K5544K3091J8907J3930R674P152O570P775
$$ 513965 537192 562279 588446 614836 640380 663471 682378 696308 705982 713134 719704 727479
63419G27479J0451J3994J7817K1880K6379L0845L4181L5746L5874L5056L3087
$$ 727479 737930 751924 769741 791621 818000 848845 883026 918772 954646 989702 1022789
63408A022789K9385K3802J6780R069J594m662r112j1892j3526j4404j4708j4741
$$ 1022789 1052174 1075976 1092756 1101825 1103419 1098757 1089645 1077753 1064227 1049823 1035115 1020374
63396A020374j5096j6420j8955k2287k5588k8312l0491l2245l3237l3046l1925
$$ 1020374 1005278 988858 969903 947616 922028 893716 863225 830980 797743 764697 732772
63385G32772l0609k9371k7734k5268k2205j9088j6237j3723j1443r101o458l759
$$ 732772 702163 672792 645058 619790 597585 578497 562260 548537 537094 527993 521535 517776
63373E17776j539J35J776L729N776P637R368J0985J2248J3211J4444J6306J8398
$$ 517776 516237 516372 518148 521877 527653 535290 544658 555643 567891 581102 595546 611852 630250
63360F30250K0205K1867K3820K6016K8064K9919L1834L3718L5120L5701L5343
$$ 630250 650455 672322 696142 722158 750222 780141 811975 845693 880813 916514 951857
63349I51857L3793L0783K6444K1170J5117Q290J273m753q953j1522j3207j4439
$$ 951857 985650 1016433 1042877 1064047 1079164 1087454 1088727 1083974 1075021 1063499 1050292 1035853
63337A035853j5197j5510j5784j6576j8235k0739k3779k6936k9768l1810l2647
$$ 1035853 1020656 1005146 989362 972786 954551 933812 910033 883097 853329 821519 788872
63326G88872l2191l0798k8959k6784k3980k0375j6334j2518r349o843m969l955
$$ 788872 756681 725883 696924 670140 646160 625785 609451 596933 587584 580741 575772 571817
63314E71817m165n824q886j2919j6901j9392j9505j7726j5484j3748j2394j0961
$$ 571817 567652 561828 552942 540023 523122 503730 484225 466499 451015 437267 424873 413912
63302D13912r453q082o787n502m566m269m204l702k818k240k288k557k591k430
$$ 413912 404459 396377 389590 384088 379522 375253 371049 367347 364529 362289 360001 357444 354853 352423
63288C52423k404k797l718m824n266m530l255k597k692k597j782q73m83k38L78
$$ 352423 350019 347222 343504 338680 333414 328884 325629 323032 320340 317743 315961 315088 314605 314367 314745
63273C14745R45O74k62q37n12J65L94J20K2O64J764K393K057J413J496K354L066
$$ 314745 315690 316364 316102 315265 314753 314918 315312 315432 315454 316118 317882 320275 322332 323745 325241 327595 330661
63256C30661L155L215L849M781N427N732N852N681N282N268O033P059P636P839
$$ 330661 333816 337031 340880 345661 351088 356820 362672 368353 373635 378903 384936 391995 399631 407470
63242D07470Q145Q610R239J0586J3007J5672J7411J8315J9394K0906K2248K3402
$$ 407470 415615 424225 433464 444050 457057 472729 490140 508455 527849 548755 571003 594405
63230E94405K5042K7004K8021K7623K6966K7033K7149K6223K4562K3322K2832
$$ 594405 619447 646451 674472 702095 729061 756094 783243 809466 834028 857350 880182
63219H80182K2624K2683K3377K4306K4401K3395K2174K1376K0424J8319J4780
$$ 880182 902806 925489 948866 973172 997573 1020968 1043142 1064518 1084942 1103261 1118041
63208A118041J0135M623j637q169j4211j9240k3276k6590k9253l1012l1639l1369
$$ 1118041 1128176 1132799 1131162 1122993 1108782 1089542 1066266 1039676 1010423 979411 947772 916403
63196I16403l0757k9921k8167k4862k0519j6479j3297j0154o206k008J092K746
$$ 916403 885646 855725 827558 802696 782177 765698 752401 742247 736041 734033 735125 737871
63184G37871M030O113R045J2086J4650J6554J7700J8086J8026J8049J8345J8565
$$ 737871 741901 748014 757059 769145 783795 800349 818049 836135 854161 872210 890555 909120
63172I09120J8222J7282J6252J5650J5387J4765J3202J0827Q155N323J977k053
$$ 909120 927342 944624 960876 976526 991913 1006678 1019880 1030707 1038862 1044185 1046162 1044109
63160A044109o457j0928j5530k0256k4598k7981l0412l2279l3667l4292l4002
$$ 1044109 1037652 1026724 1011194 990938 966340 938359 907947 875668 842001 807709 773707
63149G73707l2898l1084k8620k5742k2766j9896j7357j5393j3807j1880r410p472
$$ 773707 740809 709725 681105 655363 632597 612701 595344 579951 566144 554264 544854 537382
63137E37382p176p834p508n513l298k378k471k421j961j565j189l09J062K309
$$ 537382 530206 522372 514864 509351 506053 503675 501204 498783 496822 495257 494068 493759 494821 497130
63123D97130L157L831M398M684M854N289N809N728M910M098L905M003L691K892
$$ 497130 500287 504118 508516 513200 518054 523343 529152 534880 539790 543888 547793 551796 555487 558379
63109E58379K133J754J550J268J110J543K544L292K939J667O16N72J169J628J797
$$ 558379 560512 562266 563816 565084 566194 567737 570281 573573 576512 578179 578795 579367 580536 582164 583961
63094E83961J980K155K085J962K164K467K243J506J000J030R73L55k60k2R74J920
$$ 583961 585941 588096 590181 592143 594307 596774 599017 600523 601523 602553 603526 603881 603621 603599 604573 606493
63078F06493K504L186M219N048N027M501M620N993P901R139R477R817J0893J2358
$$ 606493 608997 612183 616402 621450 626477 630978 635598 641591 649492 658631 668108 677925 688818 701176
63064G01176J3482J4241J5214J6721J8591K0665K2959K5420K8064L1267L5376
$$ 701176 714658 728899 744113 760834 779425 800090 823049 848469 876533 907800 943176
63053I43176L9957M4056M7263N0010N2746N5337N7516N9325O0880O2065O2732
$$ 943176 983133 1027189 1074452 1124462 1177208 1232545 1290061 1349386 1410266 1472331 1535063
63042A535063O2844O2288O1009N9460N8445N8215N8191N7820N7176N6409N5187
$$ 1535063 1597907 1660195 1721204 1780664 1839109 1897324 1955515 2013335 2070511 2126920 2182107
63031B182107N3177N0562M7458M3145L6525K7250J5950L542r236k1797l3795m5183
$$ 2182107 2235284 2285846 2333304 2376449 2412974 2440224 2456174 2459716 2450480 2428683 2394888 2349705
63019B349705n5790o4913p1751p6133p8415p8755p7034p3432o8542o2745n5934
$$ 2349705 2293915 2229002 2157251 2081118 2002703 1923948 1846914 1773482 1704940 1642195 1586261
63008A586261m8014l9408l0852k2856j5485q480j595N061J1049J6073K0297K3982
$$ 1586261 1538247 1498839 1467987 1445131 1429646 1421166 1419571 1424632 1435681 1451754 1472051 1496033
62996A496033K7013K9144L0533L1590L2365L2605L2333L1810L0994K9631K8001
$$ 1496033 1523046 1552190 1582723 1614313 1646678 1679283 1711616 1743426 1774420 1804051 1832052
62985A832052K6807K5993K4338K0752J5401R019J714o773j5990k4892l3022m0703
$$ 1832052 1858859 1884852 1909190 1929942 1945343 1954362 1956076 1949303 1933313 1908421 1875399 1834696
62973A834696m8055n4510n9518o2978o4775o4664o3039o1008n9141n6676n2774
$$ 1834696 1786641 1732131 1672613 1609635 1544860 1480196 1417157 1356149 1297008 1240332 1187558
62962A187558m8021m3803m0489l7291l3822l0780k8752k7301k5744k4095k2672
$$ 1187558 1139537 1095734 1055245 1017954 984132 953352 924600 897299 871555 847460 824788
62951H24788k1335j9873j8671j8272j8438j8355j7676j6743j5872j5019j4147
$$ 824788 803453 783580 764909 746637 728199 709844 692168 675425 659553 644534 630387
62940F30387j3389j2720j2030j1508j1339j1030r757p631n836n107m758l860k704
$$ 630387 616998 604278 592248 580740 569401 558371 548614 540983 535147 530040 525282 521422 518718
62927E18718k245k555k766k518k367k563k394j290N2M40l03j255j672j659j599
$$ 518718 516473 513918 511152 508634 506267 503704 501310 500020 500072 500512 500209 498954 497282 495623 494024
62912D94024j546j463j551j958k462k746k801k763k599k312k236k641l155l091
$$ 494024 492478 491015 489464 487506 485044 482298 479497 476734 474135 471823 469587 466946 463791 460700
62898D60700k389j723j507j370q76k75m5q3Q2M60O13M14K39L03K95o1m95n53k37
$$ 460700 458311 456588 455081 453711 452835 452560 452515 452432 452514 452974 453587 454001 454240 454543 454838 454777 454282 453729 453492
62879D53492n3l99j076j420r91j36K98m5n73n69j64j02o28j243j492j426j180
$$ 453492 453439 453040 451964 450544 449553 449417 449715 449670 449097 448528 448364 448262 447634 446391 444899 443473 442293
62862D42293o91j43j12q44j696j834j198m25m3o5k47l17o0M98J054J379J572J767
$$ 442293 441602 441459 441347 440503 438807 436973 435775 435350 435307 435242 434995 434678 434618 435116 436170 437549 439121 440888
62844D40888J757J269M85p0r7K41O15P84O30K22j65l39l89m61m37j74P9o0m67
$$ 440888 442645 443914 444399 444329 444232 444473 445088 445872 446502 446724 446559 446220 445831 445370 444933 444759 444838 444778 444311
62825D44311m98K41J402K291K561K376K126K108K404K892L419L907M341M680M891
$$ 444311 443813 444054 445456 447747 450308 452684 454810 456918 459322 462214 465633 469540 473881 478561 483452
62810D83452N012N106N243N572O188O799O841O212N676O090P379Q763R838J0883
$$ 483452 488464 493570 498813 504385 510573 517372 524213 530425 536101 542191 549570 558333 568171 579054
62796E79054J2080J3121J3796J4462J5529J6926J8468K0354K2901K6028K9432
$$ 579054 591134 604255 618051 632513 648042 664968 683436 703790 726691 752719 782151
62785G82151L3047L6938M1025M5340N0313N6219O2478O8230P3563P9404Q5959
$$ 782151 815198 852136 893161 938501 988814 1045033 1107511 1175741 1249304 1328708 1414667
62774A414667R2044R6354R8830J00037R9682R6601R0137Q0855O9699N7036M2838
$$ 1414667 1506711 1603065 1701895 1801932 1901614 1998215 2088352 2169207 2238906 2295942 2338780
62763B338780K7329J1040n550k2082l8104n2971o5991p6648q4718r0334r3781
$$ 2338780 2366109 2377149 2371599 2349517 2311413 2258442 2192451 2115803 2031085 1940751 1846970
62752A846970r5219r4724r2617q9509q5890q1880p7373p2265o6484o0245n4403
$$ 1846970 1751751 1657027 1564410 1474901 1389011 1307131 1229758 1157493 1091009 1030764 976361
62741I76361m9979m6945m3903l9618l4585l0367k7513k4976k1701j8025j5067
$$ 976361 926382 879437 835534 795916 761331 730964 703451 678475 656774 638749 623682
62730F23682j3310j2284j1309j0023q454o880n629m680l636k266q39K94J185K074
$$ 623682 610372 598088 586779 576756 568302 561422 555793 551113 547477 545211 544372 544666 545851 547925
62716E47925K953L741M711O290Q515J0990J3361J5502J7337J8820K0181K1894
$$ 547925 550878 554619 559330 565620 574135 585125 598486 613988 631325 650145 670326 692220
62704F92220K4356K7692L1780L6221M0487M4409M8449N3100N8106O2679O6440
$$ 692220 716576 744268 776048 812269 852756 897165 945614 998714 1056820 1119499 1185939
62693A185939O9611P2185P3601P3552P2476P0718O7540O1741N3140M2841L1861
$$ 1185939 1255550 1327735 1401336 1474888 1547364 1618082 1685622 1747363 1800503 1843344 1875205
62682A875205K0085O893p516k1916l5030m6366n6076o4290p0779p5161p7302p7533
$$ 1875205 1895290 1902183 1894667 1872751 1837721 1791355 1735279 1670989 1600210 1525049 1447747 1370214
62670A370214p6459p4532p1805o8129o3594n8645n3789m9296m5189m1308l7358
$$ 1370214 1293755 1219223 1147418 1079289 1015695 957050 903261 853965 808776 767468 730110
62659G30110l3202k9235k6108k3873k1655j8679j5369j2919j1822j1467j1197
$$ 730110 696908 667673 641565 617692 596037 577358 561989 549070 537248 525781 514584
62648E14584j1036j1091j0886r929q506p333o595n892n045m305l759l049j928
$$ 514584 503548 492457 481571 471642 463136 455803 449208 443316 438271 433966 430207 427158 425230
62635D25230p80k87o20j180j193n40J11J13l55o19n04n27r32j199r17n08m25j46
$$ 425230 424450 424163 423543 422363 421170 420630 420741 420854 420499 419880 419376 418849 417917 416718 415801 415293 414868 414722
62617D14722J132K994M049L818L473M205N624O441O225N877O450Q076J0016J1404
$$ 414722 415854 418848 422897 426715 430188 434393 440017 446458 452683 458560 465010 473086 483102 494506
62603D94506J1911J1960J2379J3766J6111J9023K2120K5222K8281L1253L4020
$$ 494506 506417 518377 530756 544522 560633 579656 601776 626998 655279 686532 720552
62592G20552L6492L8859M1579M4797M7830M9572M9375M7275M3445L7988L1315
$$ 720552 757044 795903 837482 882279 930109 979681 1029056 1076331 1119776 1157764 1189079
62581A189079K4163J6937R384J184p497j6202k4528l1947l7696m1348m3321m4482
$$ 1189079 1213242 1230179 1239563 1240747 1233250 1217048 1192520 1160573 1122877 1081529 1038208 993726
62569I93726m5285m5489m4571m2249l8871l5454l2989l1425k9655k6895k3664
$$ 993726 948441 902952 858381 816132 777261 741807 708818 677393 647738 620843 597179
62558E97179k0992j9042j7146j4950j2871j1335j0207r078p791o480n388m647
$$ 597179 576187 557145 539999 525049 512178 500843 490636 481558 473767 467287 461899 457252
62546D57252m069l265k186j325j017q93m60M9J29K1M20J174J275M24l32j0J066
$$ 457252 453183 449918 447732 446407 445390 444497 444037 444086 444215 444236 444656 445830 447105 447529 447197 447187 448253
62529D48253K002K621L266L888M263M764O055Q105J0247J2208J4322J6705J8944
$$ 448253 450255 452876 456142 460030 464293 469057 475112 483217 493464 505672 519994 536699 555643
62516E55643K0870K2950K5618K8705L1798L4778L7667M0278M2344M3734M4293
$$ 555643 576513 599463 625081 653786 685584 720362 758029 798307 840651 884385 928678
62505I28678M3725M1884L8965L5190L0473K4694J8041J0902L652l264r318j4324
$$ 928678 972403 1014287 1053252 1088442 1118915 1143609 1161650 1172552 1176204 1172940 1163622 1149298
62493A149298j8585k2265k4808k5472k4272k1910j8902j5250j1015o574k155K417
$$ 1149298 1130713 1108448 1083640 1058168 1033896 1011986 993084 977834 966819 960245 958090 960507
62481I60507P219J1879J5967J9428K2319K4399K5281K4801K2982J9803J5297R813
$$ 960507 967726 979605 995572 1015000 1037319 1061718 1086999 1111800 1134782 1154585 1169882 1179695
62469A179695L981j606o698j1592j7014k3401l0023l5345l8575m0518m2364m4019
$$ 1179695 1183676 1182070 1175372 1163780 1146766 1123365 1093342 1057997 1019422 978904 936540 892521
62457H92521m4346m2854m0365l7813l5164l1876k7913k3828k0084j6718j3580
$$ 892521 848175 805321 764956 727143 691979 660103 632190 608362 588278 571560 557980
62446E57980j0640q038n934m275k778j342l05Q3L28J297L038M577N160N098M993
$$ 557980 547340 539302 533368 529093 526315 524973 524668 524751 525079 526376 529414 533991 539151 544249 549242
62431E49242M664L519J676q1j346k519m074n954p756r135r885j0014r821r573
$$ 549242 553906 557425 559101 559020 557674 555155 551081 545127 537371 528236 518351 508337 498516 488943
62417D88943r109q104o783n888n775n912n589m723l703k803k185k183k986m019
$$ 488943 479834 471730 464947 459059 453284 447372 441783 437060 433357 430554 428369 426186 423200 419181
62403D19181m244l327k142j705j829j326L47K178K698J796Q31R12J668K062J863
$$ 419181 414937 411610 409468 407763 405934 404608 404955 407133 409831 411627 412458 413370 415038 417100 418963
62388D18963J712J918K026J685J282J338J799K332L006M100N420O366O796P310
$$ 418963 420675 422593 424619 426304 427586 428924 430723 433055 436061 440161 445581 451947 458743 466053
62374D66053Q440R862J0769J0920J0931J1480J2470J3275J3690J4245J5527J7532
$$ 466053 474493 484355 495124 506044 516975 528455 540925 554200 567890 582135 597662 615194
62362F15194J9883K2391K5007K7571L0104L3251L7680M3002M7835N1304N3835
$$ 615194 635077 657468 682475 710046 740150 773401 811081 854083 901918 953222 1007057
62351A007057N6078N7611N7314N4695N0123M3997L6400K7608J8243Q853j97q332
$$ 1007057 1063135 1120746 1178060 1232755 1282878 1326875 1363275 1390883 1409126 1417979 1417782 1409450
62339A409450j4960k0246k5080k9943l4321l7554l9715m1159m1722m1076l9536
$$ 1409450 1394490 1374244 1349164 1319221 1284900 1247346 1207631 1166472 1124750 1083674 1044138
62328A044138l7689l5410l2056k7744k3689k0943j9402j8405j7703j7369j7242
$$ 1044138 1006449 971039 938983 911239 887550 866607 847205 828800 811097 793728 776486
62317G76486j7152j7411j8415j9771k0488k0144j9279j8489j7627j6349j4877
$$ 776486 759334 741923 723508 703737 683249 663105 643826 625337 607710 591361 576484
62306E76484j3730j2876j1703r841p602n643m417m002m042l891l091j843p87k69
$$ 576484 562754 549878 538175 528334 520732 515089 510672 506670 502628 498737 495646 493803 493016 492747
62292D92747r4L5K42O35J320K061K366K220K277K986L879M219M012L800L708L396
$$ 492747 492653 492688 492930 493565 494885 496946 499312 501532 503809 506795 510674 514893 518905 522705 526413 529809
62276E29809K917K872L521M336M746M850N115N799O957Q629J0618J2379J3586
$$ 529809 532726 535598 539119 543455 548201 553051 558166 563965 570922 579551 590169 602548 616134
62263F16134J4616J6159J8480K1346K4542K8067L1923L6013M0246M4566M8865
$$ 616134 630750 646909 665389 686735 711277 739344 771267 807280 847526 892092 940957
62252I40957N3018N6756N9433O0169N8599N5187N0464M4239L6111K6554J6786
$$ 940957 993975 1050731 1110164 1170333 1228932 1284119 1334583 1378822 1414933 1441487 1458273
62241A458273P538j404j0310j8793k6424l3421m0187m6400n1172n4052n5387n5639
$$ 1458273 1465811 1464407 1454097 1435304 1408880 1375459 1335272 1288872 1237700 1183648 1128261 1072622
62229A072622n4770n2512m8994m4770m0317l5807l1399k7456k4162k1071j7493
$$ 1072622 1017852 965340 916346 871576 831259 795452 764053 736597 712435 691364 673871
62218F73871j3453r889p582o266n110l853k859k235j554o46n3l70j436k561l260
$$ 673871 660418 650529 642947 636681 631571 627718 624859 622624 621070 620424 620371 620001 618565 616004 612744
62203F12744l506l445l176k768k358k256k775l743m243l400j474L20J255J789
$$ 612744 609238 605793 602617 599849 597491 595235 592460 588717 584474 581074 579600 579920 581175 582964
62189E82964K566L454M120M899O228P638Q178P791P425P726Q382Q838Q969Q804
$$ 582964 585530 588984 593104 598003 604231 611869 620047 627838 635263 642989 651371 660209 669178 677982
62175F77982Q267P517P017O985P244P869R418J2178J5637J9121K2631K6511L0699
$$ 677982 686249 693766 700783 707768 715012 722881 732299 744477 760114 779235 801866 828377 859076
62162H59076L4704L8123M0723M2188M2259M1073L8880L5522L0554K3873J6009
$$ 859076 893780 931903 972626 1014814 1057073 1098146 1137026 1172548 1203102 1226975 1242984
62151A242984P862L30o023j1344j6280k1149k5470k8756l1385l4016l6298l7018
$$ 1242984 1250846 1251176 1245153 1233809 1217529 1196380 1170910 1142154 1110769 1076753 1040455 1003437
62139A003437l5645l3009l0165k7273k4051k0667j7562j4781j2114r694p794o223
$$ 1003437 967792 934783 904618 877345 853294 832627 815065 800284 788170 778476 770682 764459
62127G64459m528k850j939k109k584k205n45J802L823M878N111N272O022P235
$$ 764459 759931 757081 755142 753033 750449 748244 747699 749501 753324 758202 763313 768585 774607 781842
62113G81842Q081P846O507M515K201l10k715m310m423l142j542r56j855l569n140
$$ 781842 789923 797769 804276 808791 810992 810682 807967 803657 799234 796092 794550 793594 791739 788170 783030
62098G83030o229o942p145o511n218l989l217k471j109R12L090M882N918O078
$$ 783030 776801 769859 762714 756203 750985 746996 743779 741308 740199 741111 744201 749083 755001 761079
62084G61079N741N736O603Q022R321J0325J1353J2543J3711J4773J5859J6952
$$ 761079 766820 772556 779159 787181 796502 806827 818180 830723 844434 859207 875066 892018
62072H92018J7838J8484J9066J9608J9908J9929J9920K0125K0681K1842K3790
$$ 892018 909856 928340 947406 967014 986922 1006851 1026771 1046896 1067577 1089419 1113209
62061A113209K6073K7709K8146K7776K7241K6449K4581K0869J5193Q163R26n365
$$ 1113209 1139282 1166991 1195137 1222913 1250154 1276603 1301184 1322053 1337246 1345409 1346335 1340970
62049A340970j0233j4086j7694k1569k5811l0184l4141l7206l9591m1998m4476
$$ 1340970 1330737 1316651 1298957 1277388 1251577 1221393 1187252 1150046 1110455 1068457 1023981
62038A023981m5864m4951m2000l8550l5800l3698l1597k9199k6645k4096k1630
$$ 1023981 978117 933166 891166 852616 816816 783118 751521 722322 695677 671581 649951
62027F49951j9327j7256j5369j3575j1876j0405r311q581p989p330o761o691p221
$$ 649951 630624 613368 597999 584424 572548 562143 552832 544251 536262 528932 522171 515480 508259
62014E08259p828p840p080n898m754l962l602l405k872j836o99J18P78J677K780
$$ 508259 500431 492591 485511 479613 474859 470897 467295 463890 461018 459182 458483 458601 459379 461056 463836
61999D63836L757M611N538O325O508O152N774N432M609L250K100J549Q64p56k839
$$ 463836 467593 472204 477742 484067 490575 496727 502501 507933 512542 515792 517892 519441 520305 519549 516710
61984E16710m216m645m986n800o583o690o309o059o034n782n088m334m036m283
$$ 516710 512494 507849 502863 497063 490480 483790 477481 471422 465388 459606 454518 450184 446148 441865
61970D41865m722m961m870m629m473m379m015l142k003j151p91n47q3L07Q1o26
$$ 441865 437143 432182 427312 422683 418210 413831 409816 406674 404671 403520 402729 402182 402099 402406 402487 401861
61954D01861r42k85R02J702J808J712K045K950M074M942N389N826O908Q738J0528
$$ 401861 400919 400634 401536 403238 405046 406758 408803 411753 415827 420769 426158 431984 438892 447630 458158
61939D58158J1377J1235J0841J0783J1066J1508J2146J3018J3851J4102J3371
$$ 458158 469535 480770 491611 502394 513460 524968 537114 550132 563983 578085 591456
61928E91456J1789J0072Q934Q231O988M654K052M51j18q89k681m927o600p362
$$ 591456 603245 613317 622251 630482 637470 642124 644176 644627 644509 643620 640939 636012 629412 622050
61914F22050p443o968n985m674l040p46K215N014O766P709Q920J0848J2665J3194
$$ 622050 614607 607639 601654 596980 593940 593194 595409 600423 607189 614898 623818 634666 647331 660525
61900F60525J2072R787P030M295J887j16j960m010o297q277r246r002q067p217
$$ 660525 672597 682384 689414 693709 695596 695480 693520 689510 683213 674936 665690 656688 648621 641404
61886F41404o894p098p593p985p808o928n835n239n389o047o955p951q710q951
$$ 641404 634510 627412 619819 611834 604026 597098 591263 586024 580635 574588 567633 559682 550972 542021
61872E42021q918r117r390q825o938m430k398j213n56r9L61J155K540M324O056
$$ 542021 533103 523986 514596 505771 498833 494403 492005 490792 490236 490137 490498 491653 494193 498517 504573
61857E04573P492Q677R750J0958J2549J4348J5787J6707J7794J9691K1942K3412
$$ 504573 512065 520742 530492 541450 553999 568347 584134 600841 618635 638326 660268 683680
61845F83680K3573K2868K1911K0905J9774J8241J5871J2495Q655N068J743j785
$$ 683680 707253 730121 752032 772937 792711 810952 826823 839318 847973 853041 854784 852999
61833H52999n365q126r578j0156j0297r663p778m937j936P63L099M931O124O964
$$ 852999 847634 839508 829930 819774 809477 799814 792036 787099 785163 785926 789025 793956 800080 807044
61819H07044P871Q571Q089N861K431j196m711q548j2854j6925j9801k1220k1630
$$ 807044 814915 823486 831575 837436 839867 838671 833960 825412 812558 795633 775832 754612 732982
61806G32982k1454k0740j9542j8196j6977j5780j4441j3188j2489j2419j2469
$$ 732982 711528 690788 671246 653050 636073 620293 605852 592664 580175 567756 555287
61795E55287j1979j0694q922p274o190n612n179m725m385m172l790l061k283j875
$$ 555287 543308 532614 523692 516418 510228 504616 499437 494712 490327 486155 482365 479304 477021 475146
61781D75146j858j900j753j360p67j72P7j46n48q14r82j127r33n5J218K105K158
$$ 475146 473288 471388 469635 468275 467508 467336 467413 467267 466719 465905 464923 463796 462863 462808 464026 466131 468289
61764D68289J629J113J074J615K381K892L173L724M568M869M125L223L363M254
$$ 468289 469918 471031 472105 473720 476101 478993 482166 485890 490458 495327 499452 502675 506038 510292
61750E10292M447L409K070J112k2j836l610m380m347m388m689m786m613m575m610
$$ 510292 514739 518148 520218 521330 521308 519472 515862 511482 507135 502747 498058 493272 488659 484084 479474
61735D79474m071k682j078j72k84r43j279p24M17J193J084O35O64J106J228R04
$$ 479474 475403 472721 471643 471471 471187 470244 468965 468241 468658 469851 470935 471570 472234 473340 474568 475472
61719D75472R39J895L161L576K728J306L30K67Q54J483J719J486R52K83m06j073
$$ 475472 476411 478306 481467 485043 487771 489077 489407 489674 490528 492011 493730 495216 496168 496451 496045 494972
61703D94972j757k484l062l148k741k424k795l655m114l608k578j914j949k201
$$ 494972 493215 490731 487669 484521 481780 479356 476561 472906 468792 465184 462606 460692 458743 456542
61689D56542k075j571j180j291j786k245k392k324k322k527k782k790k463k048
$$ 456542 454467 452896 451716 450425 448639 446394 444002 441678 439356 436829 434047 431257 428794 426746
61675D26746j889k060k410k829l213l181k289q22R2l54j525j999j254j88J36l10
$$ 426746 424857 422797 420387 417558 414345 411164 408875 408053 408145 407791 406266 404267 403013 402825 402961 402651
61659D02651p77p05p5P91J461J626J430J356J576J708J440J094J147J469J522
$$ 402651 401874 401169 401094 401885 403346 404972 406402 407758 409334 411042 412482 413576 414723 416192 417714
61644D17714J206J016J260J590J517J201J346K252L169K932J352l43q50l84k85
$$ 417714 418920 419936 421196 422786 424303 425504 426850 429102 432271 435203 436555 436212 435362 434978 434693
61629D34693j063j670j096R0N18j78j228k038k676l117l059k725k878l624l958
$$ 434693 433630 431960 430864 430954 431472 431294 430066 428028 425352 422235 419176 416451 413573 409949 405991
61614D05991l142j843j206j323j416j291j610k730m056m855n088n082m908m532
$$ 405991 402849 401006 399800 398477 397061 395770 394160 391430 387374 382519 377431 372349 367441 362909
61600C62909m172m039l910l460k910k841l310l641l238k320j573j351j486j688
$$ 362909 358737 354698 350788 347328 344418 341577 338267 334626 331388 329068 327495 326144 324658 322970
61586C22970j858j953j869j561j225j226j780k642l168k894k092j522j532j626
$$ 322970 321112 319159 317290 315729 314504 313278 311498 308856 305688 302794 300702 299180 297648 296022
61572B96022j151j65O85J020J034R59O76M8p10j209j307j131q56n87l72j40L11
$$ 296022 294871 294706 295391 296411 297445 298404 299080 299128 298418 297209 295902 294771 293915 293328 292956 292816 293127
61555B93127J134K187L028L198K564J453M89J39M38J097J718J895J337K57n61
$$ 293127 294261 296448 299476 302674 305238 306691 307180 307319 307757 308854 310572 312467 313804 314061 313500
61540C13500m55L71J132J420J460J429J144O85O25J197J657J121j90j151j120
$$ 313500 313045 313416 314548 315968 317428 318857 320001 320686 321311 322508 324165 325286 325096 323945 322825
61525C22825n92l55n53q18q97q59q27q23p73n32n5L72K65m45j107r75j64M14J38
$$ 322825 322233 321878 321325 320507 319610 318751 317924 317101 316328 315796 315741 316113 316378 315933 314826 313851 313687 314101 314239
61506C14239n82q90n78j71m6j7J36K02n1l19j38M04Q21J049J536K337K688J955
$$ 314239 313657 312767 312189 312018 311972 311955 312091 312293 312242 311923 311785 312189 313010 314059 315595 317932 320620 322575
61488C22575O95J59O88J130K17j739l019k450p03O59J066J259J896K607K718K240
$$ 322575 323270 323429 324117 325247 325464 323725 320706 318256 317553 318212 319278 320537 322433 325040 327758 329998
61472C29998J624J068O21N81J035J341P89k69p81m49o3l08j008j698k160k164
$$ 329998 331622 332690 333311 333892 334927 336268 337057 336788 336007 335558 335495 335187 334179 332481 330321 328157
61456C28157j459m51j32p82j375r06K71J007R06N45N10Q86J513K100K117J289
$$ 328157 326698 326247 326115 325333 323958 323052 323323 324330 325236 325781 326291 327177 328690 330790 332907 334196
61440C34196J75j91N98J958L062L591L721L680L485L045K431K004J960J881J148
$$ 334196 334371 334180 334778 336736 339798 343389 347110 350790 354275 357320 359751 361755 363715 365596 366744
61425C66744Nm10M75J724K026J398J007J444K071K104J678J521J929K424K234
$$ 366744 366749 366339 366814 368538 370564 371962 372969 374413 376484 378588 380266 381787 383716 386140 388374
61410C88374J079m58j402j392j005r17j074j099j081j343j665j472q25n28j088
$$ 388374 389453 388995 387593 386201 385196 384279 383205 382106 381025 379682 378017 376545 375720 375192 374104
61395C74104k034k403j635J9J543J762M41j236j826j227n04k22J15Q30J276R05
$$ 374104 372070 369667 368032 368051 369594 371356 371797 370561 368735 367508 367004 366782 366897 367727 369003 369908
61379C69908K39J15M49O47P68J379K393K940K537J708J174J012R12Q70J190J933
$$ 369908 370147 370262 370711 371358 372126 373505 375898 378838 381375 383083 384257 385269 386181 387051 388241 390174
61363C90174K735L086K731J830R71P55J188J543J211O09Q29K208L725M207L845
$$ 390174 392909 395995 398726 400556 401527 402282 403470 405013 406224 406833 407662 409870 413595 417802 421647
61348D21647L959N271P022P914P443O084M647L719L458L467L173K536K144K369
$$ 421647 425606 430877 437899 445813 453256 459340 463987 467706 471164 474631 477804 480340 482484 484853
61334D84853K782K765K299J733J104L43k39k84o2q7k09J06O95P31J5o36n90j77
$$ 484853 487635 490400 492699 494432 495536 495879 495640 495356 495294 495207 494998 495104 495799 496530 496545 495909 495319 495142
61316D95142J48O94J932L544M821N634O411P277P928Q226Q463Q975R890J1189
$$ 495142 495290 495984 497916 501460 506281 511915 518326 525603 533531 541757 550220 559195 569085 580274
61302E80274J2566J3330J2876J1390R659Q047O075L230q4k857m551n546o484p489
$$ 580274 592840 606170 619046 630436 640095 648142 654217 657447 657363 654506 649955 644409 637925 630436
61288F30436q266q670q922r210r423r388r170q976q792q306p246n681m046k806
$$ 630436 622170 613500 604578 595368 585945 576557 567387 558411 549619 541313 534067 528386 524340 521534
61274E21534k037j333k83R51J767J931J922K305L043L711M107M326M384M232M082
$$ 521534 519497 518164 517881 518832 520599 522530 524452 526757 529800 533511 537618 541944 546328 550560 554642
61259E54642M301N014O091P386Q671R417R137P955O472N039L647K421J692J439
$$ 554642 558943 563957 570048 577434 586105 595522 604659 612614 619086 624125 627772 630193 631885 633324
61245F33324J201P39L38J55j91j021j947k319k113j888j975k086j866j442j235
$$ 633324 634525 635264 635602 635757 635566 634545 632598 630279 628166 626278 624303 622217 620351 618909 617674
61230F17674j360j420r38R9J315K426L436M267M643M542M480M902N534N783N610
$$ 617674 616314 614894 613956 614055 615370 617796 621232 625499 630142 634684 639164 644066 649600 655383 660993
61215F60993N501N667N879N990O051N860N084L991L306L130K698J584M81K55P53
$$ 660993 666494 672161 678040 684030 690081 695941 701025 705016 708322 711452 714150 715734 716215 716470 717223
61200G17223J270J697K505L811N210O488P838R328J0673J1602J2013J1783J0878
$$ 717223 718493 720190 722695 726506 731716 738204 746042 755370 766043 777645 789658 801441 812319
61187H12319R649Q506P219N150K374Qr91r08p39r80j519k354l633n022n801n868
$$ 812319 821968 830474 837693 842843 845217 845225 844234 843326 842587 841607 840088 837734 834101 829079 823278 817410
61171H17410n958o570p234p365p309p811q810r604j0030j0559j1178j1182j0370
$$ 817410 811452 804882 797648 790283 782974 775163 766353 756749 746719 736160 724982 713800 703430
61158G03430r592r533r722r355q494p699p026o155n173m366l498k123n11N13O44
$$ 703430 693838 684305 674583 665228 656734 649035 642009 635854 630681 626315 622817 620694 620183 620696 621340
61143F21340K91k36j032k108l233m361n565o492o540n654m377l072j750o41r6
$$ 621340 621631 621395 620363 618255 615022 610661 605096 598604 592064 586410 582033 578961 577211 576570 576474
61128E76474K13J208L138N142O423P204Q124R368J0817J2472J4229J5644J6518
$$ 576474 576687 577895 581033 586175 592598 599802 607926 617294 628111 640583 654812 670456 686974
61115F86974J7276J8362J9580K0488K1144K1955K2977K3780K3897K3153K1760
$$ 686974 704250 722612 742192 762680 783824 805779 828756 852536 876433 899586 921346
61104I21346K0235J9087J8315J7375J5690J3029R476N429J611j470m160p200j0561
$$ 921346 941581 960668 978983 996358 1012048 1025077 1034553 1039982 1041593 1040123 1035963 1028763 1018202
61091A018202j3408j5388j7150j9188k0899k1460k1095k0739k0710k0414j9376
$$ 1018202 1004794 989406 972256 953068 932169 910709 889614 868875 848165 827751 808375
61080H08375j7963j6986j6791j6821j6072j4123j1656r773q836q333p716o813
$$ 808375 790412 773426 756635 739814 723742 709619 697963 688190 679354 671021 663305 656492
61068F56492n519l751j840l30P70J893K968L395L169L151L819M623N083N697P062
$$ 656492 650973 647222 645382 645052 645822 647715 650683 654078 657247 660398 664217 668840 673923 679620 686682
61053F86682Q782J0059J0838J1567J2239J2503J2517J2972J4338J6471J8905K1196
$$ 686682 695464 705523 716361 727928 740167 752670 765187 778159 792497 808968 827873 849069
61041H49069K3163K4982K6804K8274K8931K9161L0067L2118L4600L6663L8193
$$ 849069 872232 897214 924018 952292 981223 1010384 1040451 1072569 1107169 1143832 1182025
61030A182025L9435M0563M2064M4650M8245N1801N4527N6550N8041N8830N9459
$$ 1182025 1221460 1262023 1304087 1348737 1396982 1448783 1503310 1559860 1617901 1676731 1736190
61019A736190O1352O5286P0718P7433Q6394R8009J10959J24180J38752J56427
$$ 1736190 1797542 1862828 1933546 2010979 2097373 2195382 2306341 2430521 2569273 2725700
61009B725700J77529K02143K32312K71101L20178L80155M52425N38807O40643
$$ 2725700 2903229 3105372 3337684 3608785 3928963 4309118 4761543 5300350 5940993
61000E940993P60987R06573J083854J292399J524076J765592J992775K158300
$$ 5940993 6701980 7608553 8692407 9984806 11508882 13274474 15267249 17425549
60992A7425549K193909K040992J691059J201192O71890K08537j07389k33882j81592
$$ 17425549 19619458 21660450 23351509 24552701 25224591 25433128 25325739 25091857 24910265
60983B4910265k2411J25130J41281m1920m15188r05918j412500j836309k105617
$$ 24910265 24887854 25012984 25154265 25112345 24697157 23791239 22378739 20542430 18436813
60974A8436813k192923k118786j935123j697760j448256j212250j004166q29228
$$ 18436813 16243890 14125104 12189981 10492221 9043965 7831715 6827549 5998321
60966E998321o85108n66708m70165l92450l29870k79169k38685k06894j81176
$$ 5998321 5313213 4746505 4276340 3883890 3554020 3274851 3036166 2829272 2648096
60957B648096j59463j41567j27245j14434j01179q8106p6987o7749n8913n0300
$$ 2648096 2488633 2347066 2219821 2105387 2004208 1916102 1839115 1771366 1712453 1662153
60947A662153m3251l8389l5032l2700l1511l0982k9952k8036k5947k4212k2610
$$ 1662153 1618902 1580513 1545481 1512781 1481270 1450288 1420336 1392300 1366353 1342141 1319531
60936A319531k1000j9692j8740j7717j6409j4987j3532j2027j0834j0360j0341
$$ 1319531 1298531 1278839 1260099 1242382 1225973 1210986 1197454 1185427 1174593 1164233 1153892
60925A153892j0203j0092j0703j2076j3441j4300j4873j5357j5549j5388j5156
$$ 1153892 1143689 1133597 1122894 1110818 1097377 1083077 1068204 1052847 1037298 1021910 1006754
60914A006754j4963j4622j4211j4124j4338j4369j4111j4077j4440j4515j3700
$$ 1006754 991791 977169 962958 948834 934496 920127 906016 891939 877499 862984 849284
60903H49284j2395j1406j0808j0009q787p657p154p230p498p691p699p389o741
$$ 849284 836889 825483 814675 804666 795879 788222 781068 773838 766340 758649 750950 743561 736820
60890G36820o083n875o195o665o921o990p127p515q204r046r602r468q901q635
$$ 736820 730737 724862 718667 712002 705081 698091 690964 683449 675245 666199 656597 647129 638228 629593
60876F29593q845q785p952o977o668o713o241n346m932n184n351n091m943n171
$$ 629593 620748 611963 604011 597034 590366 583653 577412 572066 567134 561950 556599 551508 546565 541394
60862E41394n240m763m065l404k584j668j181j140q38j19J23p23j941k510k342
$$ 541394 536154 531391 527326 523922 521338 519670 518489 517349 516511 516392 516515 515792 513851 511341 508999
60847E08999j905j405j040j276k097k753k889l183m118m977m948m454m413m834
$$ 508999 507094 505689 504649 503373 501276 498523 495634 492451 488333 483356 478408 473954 469541 464707
60833D64707n192n500n913n827m566k644j219n96k43N7O9j29k35l51o04n36J83
$$ 464707 459515 454015 448102 442275 437709 435065 433846 433250 433007 433064 433133 433004 432769 432418 431814 431278 431461
60816D31461Q67O79K3j02K17R5m01l09L87M96m45j289r55R3O39K32o80j486j830
$$ 431461 432328 433007 433030 432928 433145 433240 432839 432530 432917 433413 432968 431679 430724 430817 431456 431688 431008 429522 427692
60797D27692j673j315j071r11p80j052k033l192l624l259k891l013l376l635l687
$$ 427692 426019 424704 423633 422722 421942 420890 418857 415665 412041 408782 405891 402878 399502 395867 392180
60782C92180l390k728k171k109k053j353n30p37j900k604k107j250r84j126j107
$$ 392180 388790 386062 383891 381782 379729 378376 377846 377109 375209 372605 370498 369248 368264 367138 366031
60767C66031r44p98m46J83O55Q37J301K347L301L442L067K963L320L718L783L320
$$ 366031 365087 364289 363843 364026 364681 365518 366819 369166 372467 375909 378976 381939 385259 388977 392760 396080
60751C96080K230P99k36m03j8K98L18K29K69N79J009J013J45j235k343l009l652
$$ 396080 398310 399109 398873 398470 398452 398750 399068 399297 399566 400145 401154 402167 402312 401077 398734 395725 392073
60734C92073m207m112l515l433m159m637m088l297l329l818l615k620j819j731
$$ 392073 387866 383754 380239 376806 372647 368010 363922 360625 357296 353478 349863 347243 345424 343693
60720C43693j886j760j438j210j144j147j085q55o30p58j172j270p60j86j47m02
$$ 343693 341807 340047 338609 337399 336255 335108 334023 333168 332538 331780 330608 329338 328578 328392 328245 327843
60704C27843l72q6J0j22j33M7K74O52J277J687J337N79M10J175K152K542K333
$$ 327843 327471 327385 327395 327273 327140 327187 327461 328113 329390 331077 332414 332993 333403 334578 336730 339272 341605
60687C41605K010J892J991K179K295K317K456K929L597M077M167L929L440K802
$$ 341605 343615 345507 347498 349677 351972 354289 356745 359674 363271 367348 371515 375444 378884 381686
60673C81686K270K200K731L678M590M863M094K555J025j20j362l139m909n608
$$ 381686 383956 386156 388887 392565 397155 402018 406112 408667 409692 409572 408210 405071 400162 394554
60659C94554m914l526k317j683j620j865j958j612j070p14m66j7M85O28N86R84
$$ 394554 389640 386114 383797 382114 380494 378629 376671 375059 373989 373275 372809 372792 373277 373905 374491 375475
60643C75475J747J795M19j655l063l321l004k685k373j985j725j733j720j307
$$ 375475 377222 379017 379436 377781 374718 371397 368393 365708 363335 361350 359625 357892 356172 354865
60629C54865n34K04O85R95J125P74j74j209j604j257p75o19o04l71j4J51J53K44
$$ 354865 354331 354535 355220 356215 357340 358114 357940 356731 355127 353870 353095 352476 351872 351501 351487 351638 351791 352035
60611C52035M10M43M29O74J135J309R34L30j2J16P20J704K675L042K635J939J395
$$ 352035 352445 352888 353317 353991 355126 356435 357369 357699 357687 357803 358523 360227 362902 365944 368579 370518 371913
60594C71913R06M06M64J517K776K830J483N9m29m66p99r78j53J297K175K280K541
$$ 371913 372819 373225 373689 375206 377982 380812 382295 382354 381925 381459 380660 379682 379529 380826 383001 385281 387822
60577C87822L260L611L202K877L293L823L821L995N300P198Q364Q717R445J1062
$$ 387822 391082 394693 397895 400772 404065 407888 411709 415704 421004 428202 436566 445283 454728 465790
60563D65790J2713J3490J3316J2305J0347P687M964K342n43l440n284n608n323
$$ 465790 478503 491993 505309 517614 527961 535648 540612 542954 542411 538971 533687 528079 522756
60550E22756n398n595n160m110k952j678J29K411M621O484Q175R925J1812J3809
$$ 522756 517358 511763 506603 502493 499541 497863 497992 500403 505024 511508 519683 529608 541420 555229
60536E55229J5665J6982J7730J8312J8794J8564J7135J4793J1928Q306L747r03
$$ 555229 570894 587876 605606 623918 642712 661276 678411 693204 705132 713438 717185 716282
60524G16282m422o568q074r416j0408j0827j0701r985q691p310o315n320l593
$$ 716282 711860 705292 697218 687802 677394 666567 655866 645881 637190 629880 623565 618245 614652
60511F14652j431k6K58O02K165M595O683P946Q890J0129J1874J4138J6898K0120
$$ 614652 613221 613195 613453 614055 616220 620815 627498 635444 644334 654463 666337 680475 697373 717493
60497G17493K3908K8430L3454L8216M2092M5129M7525M8841M8282M5678M1643
$$ 717493 741401 769831 803285 841501 883593 928722 976247 1025088 1073370 1119048 1160691
60486A160691L6684L0688K3450J5257O616k282j1417k0456k8832l6332m3074m8748
$$ 1160691 1197375 1228063 1251513 1266770 1273386 1271104 1259687 1239231 1210399 1174067 1130993 1082245
60474A082245n2328n3068n1610m9511m7531m4890m0617l5194l0281k6939k4711
$$ 1082245 1029917 976849 925239 875728 828197 783307 742690 707496 677215 650276 625565
60463F25565k2515j9912j7192j4667j2440j0627r316q272p157o143n827o271o569
$$ 625565 603050 583138 565946 551279 538839 528212 518896 510624 503467 497324 491497 485226 478657
60450D78657n831m386l386l329l576l450l091k883k663k126j582j583j962k000
$$ 478657 472826 468440 465054 461725 458149 454699 451608 448725 446062 443936 442354 440771 438809 436809
60436D36809j502j009q23n75n5K43j60q83j148p98m08n14j094j691j765j062P7
$$ 436809 435307 434298 433475 432900 432845 433088 432928 432045 430897 430099 429691 429177 428083 426392 424627 423565 423642
60419D23642Q40O59k53j148j362o53O73J812K017J438J074J593K437K622K050
$$ 423642 424482 425141 424888 423740 422378 421725 422398 424210 426227 427665 428739 430332 432769 435391 437441
60404D37441J468J259J014M27m6K09J077J812J934J742J945K885M183N094N179
$$ 437441 438909 440168 441182 441609 441563 441772 442849 444661 446595 448337 450282 453167 457350 462444 467623
60389D67623M609L873L325L037K922K812K588K316K176K190K228K379L031M233
$$ 467623 472232 476105 479430 482467 485389 488201 490789 493105 495281 497471 499699 502078 505109 509342
60375E09342N239N112L901K773K797L736M389M061L406L521M441N006M375L152
$$ 509342 514581 519693 523594 526367 529164 532900 537289 541350 544756 548277 552718 557724 562099 565251
60361E65251K537K758L042L004L130L682M017L627L175L765N539P738R976J2512
$$ 565251 567788 570546 573588 576592 579722 583404 587421 591048 594223 597988 603527 611265 621241 633753
60347F33753J5209J7027J7004J5372J3241J1345R447O859L253j099n618r653j2532
$$ 633753 648962 665989 682993 698365 711606 722951 732398 739257 742510 741411 735793 726140 713608
60334G13608j3768j3486j2435j1295j0084q580p152o627p248q259q750q510p942
$$ 713608 699840 686354 673919 662624 652540 643960 636808 630181 622933 614674 605924 597414 589472
60321E89472p498p359p327o850n532l750k288j220J93K310M446N855O748P823
$$ 589472 581974 574615 567288 560438 554906 551156 548868 547648 547841 550151 554597 560452 567200 575023
60307E75023R353J1316J3892J7043K0089K2414K4255K5925K6648K5151K1263J5992
$$ 575023 584376 595692 609584 626627 646716 669130 693385 719310 745958 771109 792372 808364
60295H08364J0012L052m949j3034j9997k5287k8740l0075k9201k6722k3558k0205
$$ 808364 818376 821428 816479 803445 783448 758161 729421 699346 670145 643423 619865 599660
60283E99660j6714j3234j0204p997o539n444m475l786l602l751l770l543l422
$$ 599660 582946 569712 559508 551511 544972 539528 535053 531267 527665 523914 520144 516601 513179
60270E13179l582l674l432l153l205l331l022k258j413p42m97j062k293l048k361
$$ 513179 509597 505923 502491 499338 496133 492802 489780 487522 486109 485367 484870 483808 481515 478467 476106
60255D76106r48n31j575k732k785k106j671j546j160m38J66N28R29J387J540J333
$$ 476106 475158 474627 473052 470320 467535 465429 463758 462212 461052 460614 460780 461308 462237 463624 465164 466497
60239D66497J239J576J937J651P17j1K63J348K269K414K108K003K239K480K499
$$ 466497 467736 469312 471249 472900 473617 473606 473869 475217 477486 479900 482008 484011 486250 488730 491229
60224D91229K306J937J434R73O65M38M01J003K397L893M609M526M339M449M697
$$ 491229 493535 495472 496906 497879 498544 498982 499383 500386 502783 506676 511285 515811 520150 524599 529296
60209E29296N094N958P209Q166Q297P763O981O147N338M676M221L944L926M169
$$ 529296 534390 540348 547557 555723 564020 571783 578764 584911 590249 594925 599146 603090 607016 611185
60195F11185M288L798K863K206K172K332K192J826J564J467J325R00M9j121k236
$$ 611185 615473 619271 622134 624340 626512 628844 631036 632862 634426 635893 637218 638118 638167 637046 634810
60180F34810l037l710m432m758m119k866k067k197k644k764k585k264j617o99
$$ 634810 631773 628063 623631 618873 614754 611888 609821 607624 604980 602216 599631 597367 595750 595051
60166E95051j79n59j478k257k732l085l292l279l224l199k826j829o82j59l85
$$ 595051 594872 594313 592835 590578 587846 584761 581469 578190 574966 571767 568941 567112 566430 566271 565886
60151E65886p87q63n81j27L25O35Q38J203J842K345K132J243M83O95J927L397
$$ 565886 565099 564236 563655 563528 563853 564488 565326 566529 568371 570716 572848 574091 574574 575269 577196 580593
60135E80593M252M336M212M358M579M370L680K939K421J971J454J007P72P50J006
$$ 580593 584845 589181 593393 597751 602330 606700 610380 613319 615740 617711 619165 620172 620944 621694 622700
60120F22700J632K426K923K950K765K642K617K744L167L759M077L885L396K926
$$ 622700 624332 626758 629681 632631 635396 638038 640655 643399 646566 650325 654402 658287 661683 664609
60106F64609K570K291J964J319K48q44j389j403j372j523j731k137l040m088m406
$$ 664609 667179 669470 671434 672753 673001 672157 670768 669365 667993 666470 664739 662602 659562 655474 651068
60091F51068l811l092k779k448j638p16k34j13p0k71q84j532j776j794j967k186
$$ 651068 647257 644165 641386 638938 637300 636584 636350 636237 636167 635896 635012 633480 631704 629910 627943 625757
60075F25757k164k085k405l237m421n850p279q146q081p346o455n682n238n335
$$ 625757 623593 621508 619103 615866 611445 605595 598316 590170 582089 574743 568288 562606 557368 552033
60061E52033n693n535m645l804l630l649l215k735k940l510l444k614j852j620
$$ 552033 546340 540805 536160 532356 528726 525077 521862 519127 516187 512677 509233 506619 504767 503147
60047E03147j494j024k04Q98K224L321L633L405L558M468N493N919N839N745N651
$$ 503147 501653 500629 500425 501323 503547 506868 510501 513906 517464 521932 527425 533344 539183 544928 550579
60032E50579M988L282Q32j283k054j595j087j445k361l053l424l934m645n158
$$ 550579 555567 558849 559681 558398 556344 554749 553662 552217 549856 546803 543379 539445 534800 529642
60018E29642n330n309n028m321l528l231l380l344k838k200j734j459j504k033
$$ 529642 524312 519003 513975 509654 506126 502895 499515 496171 493333 491133 489399 487940 486436 484403
60004D84403k632k461j353j58K31k49j057j651j724j308r20j089j666j899j395
$$ 484403 481771 479310 477957 477799 478030 477781 476724 475073 473349 472041 471121 470032 468366 466467 465072
59989D65072m94L53J083J747K260K650L113L586L682L276K723K268J684P38l03
$$ 465072 464578 464931 466014 467761 470021 472671 475784 479370 483052 486328 489051 491319 493003 493741 493438
59974D93438r70j082p89m32m73j196k232k789k596k199k114k060j471m41L45M94
$$ 493438 492468 491386 490597 490165 489692 488496 486264 483475 480879 478680 476566 474506 473035 472594 472939 473433
59958D73433L21L99Q75J296J033m8j213j451n09P94J488J451J318J500J670J262
$$ 473433 473754 474153 475028 476324 477357 477309 476096 474645 474136 474930 476418 477869 479187 480687 482357 483619
59942D83619L36l47r2R17J777J825J253O53K95O6m9J50P62J604K383K847K896
$$ 483619 483955 483608 483516 484433 486210 488035 489288 489941 490236 490302 490253 490403 491165 492769 495152 497999 500895
59925E00895K759K866L295L573L437L482M466O094P204P184O620O268O128N802
$$ 500895 503654 506520 509815 513388 516825 520307 524773 530867 538071 545255 551875 558143 564271 570073
59911E70073N230M543L608K235O45p06j638k292k753l008l207l568m002m106l639
$$ 570073 575303 579846 583454 585689 586334 585628 583990 581698 578945 575937 572730 569162 565160 561054 557415
59896E57415k790j926j166m12L43Q64J005J051J581K899M654O111O723O492N853
$$ 557415 554625 552699 551533 551121 551464 552328 553333 554384 555965 558864 563518 569629 576352 582844 588697
59881E88697N260M849M465M104M150M888N856O134N407M313L536K958K049O88
$$ 588697 593957 598806 603271 607375 611525 616413 622269 628403 633810 638123 641659 644617 646666 647354
59867F47354q72k528m248n644o158n742m990m569m709n141n253m497l011j608
$$ 647354 646482 643954 639706 634062 627904 622162 617172 612603 607894 602753 597500 593003 589992 588384
59853E88384q82m41M72J890L087L659M108N197P055Q951R895R421P960O231M361
$$ 588384 587502 587061 587533 589423 592510 596169 600277 605474 612529 621480 631375 640796 648756 654987 659348
59838F59348J983o48k379k421j287M4J211J991J535o94l627n501n996o290p033
$$ 659348 661331 660683 658304 655883 654596 654640 655851 657842 659377 658683 655056 649555 643559 637269 630236
59823F30236p517p117o285n680n258m752m188l534k586j659j498k059k261j528
$$ 630236 622719 615602 609317 603637 598379 593627 589439 585905 583319 581660 580162 578103 575842 574314
59809E74314p30r42k019l167m130m965n278m692l699l067k671j810n56J02m55
$$ 574314 573584 572642 570623 567456 563326 558361 553083 548391 544692 541625 538954 537144 536588 536690 536235
59794E36235j768k899l253k758j831j183j183j394j127m06J00N9j60j70j09k47
$$ 536235 534467 531568 528315 525557 523726 522543 521360 519966 518839 518433 518533 518592 518432 518262 518153 517906
59778E17906m77n41m82n76q30q53k71P56J620J904J830J880K116K175J943J772
$$ 517906 517429 516888 516406 515830 515000 514147 513876 514632 516252 518156 519986 521866 523982 526157 528100 529872
59762E29872J860J800J170K96L0P62J947K688K630K259K345L085L899M177M098
$$ 529872 531732 533532 534702 534998 535028 535790 537737 540425 543055 545314 547659 550744 554643 558820 562918
59747E62918M304M846N001M367L565L419L766L714K893J860J218Q96N61L23N33
$$ 562918 567222 572068 577069 581436 585001 588420 592186 595900 598793 600653 601871 602767 603328 603651 604184
59732F04184J032J147N80l2J25R32J409R34j18j099j877k505k636j920p30J78
$$ 604184 605216 606363 606943 606911 607036 607968 609377 610311 610193 609094 607217 604712 602076 600156 599426 599604
59716E99604N83P88Q61O33L22L92O79N44j3j60M71J203J421J441J785K283K633
$$ 599604 600187 600975 601836 602469 602791 603183 603862 604406 604393 604233 604704 605907 607328 608769 610554 612837 615470
59699F15470L170M217N157N088M173L461L448L545L065K080J148P18R05J397J474
$$ 615470 618640 622857 628014 633102 637275 640736 644184 647729 650794 652874 654022 654740 655645 657042 658516
59684F58516O19p63j594j301m46m5n37j572k568l200l500l722m117m673n095n112
$$ 658516 659135 658372 656778 655477 655031 654986 654449 652877 650309 647109 643609 639887 635770 631097 626002 620890
59668F20890m805m483m233l742k781j760j463k118l019l198k304o21J417L344
$$ 620890 616085 611602 607369 603627 600846 599086 597623 595505 592486 589288 586984 586363 587780 591124
59654E91124M595M829M377L933L836L968M145M197L708K315K83j614k887l589
$$ 591124 595719 600548 604925 608858 612694 616662 620807 625004 628712 631027 631310 629696 626809 623220
59640F23220l946m232m890o082p125p105o133n245m940m629l812k938k563k519
$$ 623220 619274 615042 610152 604070 596945 589840 583707 578462 573522 568893 565081 562143 559580 557061
59626E57061k433k428k626k646k262k084k780m001m817m961m838m591l931k920
$$ 557061 554628 552200 549574 546928 544666 542582 539802 535801 530984 526023 521185 516594 512663 509743
59612E09743k124j933k220k738l282l420k611r25P43J481J268Q59Q40J039R40
$$ 509743 507619 505686 503466 500728 497446 494026 491415 490490 491233 492714 493982 494841 495681 496720 497660
59597D97660N04K79O34J237J545J515J403J144M96k86o01l11J26L64M15J78n02
$$ 497660 498164 498443 499077 500314 501859 503374 504777 505921 506417 506131 505530 505219 505345 505709 506124 506302 505800
59580E05800j256j453j202j314k076k831l116l283l633l873l885m103m489m104
$$ 505800 504544 503091 501889 500575 498499 495668 492552 489269 485636 481763 477878 473775 469286 465182
59566D65182k500p16K2j42l18l46o58j171j397j322j210q39J68J421K119K114
$$ 465182 462682 461966 461988 461846 461528 461182 460524 459353 457956 456634 455424 454585 454753 456174 458293 460407
59550D60407J966K060K414L052L860M363M314M232M734N670O665P930R780J1799
$$ 460407 462373 464433 466847 469899 473759 478122 482436 486668 491402 497072 503737 511667 521447 533246
59536E33246J3474J5144J7222J8796J8211J4934R812L813k293p176r407r027p558
$$ 533246 546720 561864 579086 597882 616093 631027 640839 644652 642359 635183 625776 616749 609191
59523F09191o137m588k598o53O47J347J690J559Q14l24j560k759l800m649n577
$$ 609191 603054 598466 595868 595215 595862 597209 598899 600458 601272 600948 599388 596629 592829 588180 582603
59508E82603o780p819q114p871p818q074q070p528o705n733m576l623l322l263
$$ 582603 575823 568004 559890 552019 544201 536127 528057 520529 513824 508091 503515 499892 496570 493307
59494D93307k614j530r95j117q67K16J229J362J011Q67Q89Q35R34J307J531J431
$$ 493307 490693 489163 488168 487051 486184 486400 487629 488991 490002 490869 491758 492593 493527 494834 496365 497796
59478D97796J571K324L137L371L201L096K988K614K084J578J052O87R35J579J633
$$ 497796 499367 501691 504828 508199 511400 514496 517484 520098 522182 523760 524812 525499 526434 528013 529646
59463E29646P63K4L89J328J790J780J973K388K614K903L796M960N558N664O184
$$ 529646 530409 530433 530822 532150 533940 535720 537693 540081 542695 545598 549394 554354 559912 565576 571760
59448E71760P317Q150P949O929N526L776J765o0j448k689m070n395o344o917p196
$$ 571760 579077 587227 595176 602105 607631 611407 613172 613112 611664 608975 604905 599510 593166 586249 579053
59433E79053p074o394n251l906k619j664j217j005l47J169L100M525N083N493
$$ 579053 571979 565585 560334 556428 553809 552145 550928 549923 549576 550745 553845 558370 563453 568946
59419E68946O802R094J1287J2403J2820J3724J5559J7633J9312K0779K2146K2482
$$ 568946 575748 584842 596129 608532 621352 635076 650635 668268 687580 708359 730505 752987
59407G52987K0436J5541Q435K69p501j3067j5153j3995j0876o641j474L794P141
$$ 752987 773423 788964 797399 797668 790167 777100 761947 747952 737076 730435 728961 732755 739896
59394G39896O849L119k436q443j4268j9137k1785k1532j9168j6263j3701j1288
$$ 739896 746745 749864 747428 738985 724717 705580 683795 662263 643095 626832 613131 601843
59382F01843q698o146m033k308o48R39K062K499K480K461K751L366M025M384M382
$$ 601843 593145 586999 582966 580658 580010 580949 583011 585510 587990 590451 593202 596568 600593 604977 609359
59367F09359M352M554M790M690M299M048M231M748N303N597N445N062N074N857
$$ 609359 613711 618265 623055 627745 632044 636092 640323 645071 650374 655971 661416 666478 671552 677409
59353F77409O989P790Q240Q831R636J0197J0377J0567J0962J1246J1293J1437
$$ 677409 684398 692188 700428 709259 718895 729092 739469 750036 760998 772244 783537 794974
59341G94974J1744J1748J1270J0794J0503R642P610N116L290J986Qk960n723p174
$$ 794974 806718 818466 829736 840530 851033 860675 868285 873401 876691 878677 878685 875725 870002 862828
59327H62828p700q440r710j0844j1337j1419j1405j1095j0220r092q260p612o499
$$ 862828 855128 846688 836978 826134 814797 803378 791973 780878 770658 761566 753306 745694 739195
59314G39195m915l935m375n413n341l698j840j173j439j251N8J717K597K529K426
$$ 739195 734280 730345 725970 720557 715216 711518 709678 708505 707066 705815 705873 707590 710187 712716 715142
59299G15142L308N392Q096J0677J2606J3403J2544R806N448j18o496j2820j7594
$$ 715142 718450 723842 731938 742615 755221 768624 781168 790974 796422 796304 789808 776988 759394
59286G59394j9720j9509j8147j6361j4210j1903r862p973n665k971o83Q26K100
$$ 759394 739674 720165 702018 685657 671447 659544 649682 641709 636044 633073 632390 633216 635316
59273F35316L539M711N269N842P214R128J0599J1125J0966J0461R667Q588P225
$$ 635316 638855 643566 648835 654677 661891 671019 681618 692743 703709 714170 723837 732425 739650
59260G39650N450L159N70j870l786n029n736o373p373q572r284r170q591p991
$$ 739650 745100 748259 748829 746959 743173 738144 732408 726035 718662 710090 700806 691636 683045 675054
59246F75054p356o598n887n202m012k025J18J425J668J474J486J890K582L331
$$ 675054 667698 661100 655213 650011 645999 643974 644092 645517 647185 648659 650145 652035 654617 657948
59232F57948L759L633L153K770K654K577K191J334J53r45j703k331l184m062m336
$$ 657948 661707 665340 668493 671263 673917 676494 678685 680019 680172 679227 677524 675193 672009 667947 663611
59217F63611l856l210k828k388j597r24r43j314j197m78Q8l9n64r79j229j504
$$ 663611 659755 656545 653717 651329 649732 648808 647865 646551 645354 644876 644964 644925 644361 643382 642153 640649
59201F40649j777j878j871k010k216j925p13R39J888J561O69K92O05R02Q04P03
$$ 640649 638872 636994 635123 633113 630897 628972 628259 629198 631086 632647 633316 633608 634213 635115 635919 636622
59185F36622R82J445J752J909K057K160K172K170K185K203K427L114M097M802
$$ 636622 637604 639049 640801 642710 644767 646927 649099 651269 653454 655657 658084 661198 665295 670097
59171F70097M851M330L542K931L072M088N205N558N395N641O366O748O568O504
$$ 670097 674948 679278 682820 685751 688823 692911 698116 703674 709069 714710 721076 727824 734392 740896
59157G40896O605N786L473O81j351k642l812m829n392n800o508p284p667p791
$$ 740896 747501 753287 756760 757441 756090 753448 749636 744807 739415 733615 727107 719823 712156 704365
59143G04365q014q202q107p889p659p103o255n931o531p122o653n490m724m494
$$ 704365 696351 688149 680042 672153 664494 657391 651136 645205 638674 631552 624899 619409 614685 610191
59129F10191m066l192k289j521p22J5N41J237K550M191N577O719P844Q626Q760
$$ 610191 606125 602933 600644 599123 598401 598416 598957 600194 602744 606935 612512 619231 627075 635701 644461
59114F44461Q868R724J0858J1069J0117Q867P946P343P089P134O696M986K662
$$ 644461 653329 663053 673911 684980 695097 703964 711910 719253 726342 733476 740172 745158 747820
59101G47820J326J405J716J286M64r8n68j452k770m092m931m939m233l506l251
$$ 747820 749146 750551 752267 753553 754017 753919 753351 751899 749129 745037 740106 735167 730934 727428 724177
59086G24177l065k386j607j554k184k904l794n196o366o148n105n164o734p885
$$ 724177 721112 718726 717119 715565 713381 710477 706683 701487 695121 688973 683868 678704 671970 664085
59072F64085p203n781n339n703n608m961m725n114n324m949m421m072l712l259
$$ 664085 656882 651101 645762 640059 634451 629490 624765 619651 614327 609378 604957 600885 597173 593914
59058E93914l021l159l403l486l463l513l605l466k779j520k02M02n1j111j947
$$ 593914 590893 587734 584331 580845 577382 573869 570264 566798 564019 562499 562297 562699 562648 561537 559590
59043E59590j941j031K56J043Q12rm14J21J195K036K183J680J005Q69J684L156
$$ 559590 557649 556618 556874 557917 558729 558720 558306 558427 559622 561658 563841 565521 566526 567395 569079 572235
59027E72235M655N876O817P346P416P541Q335R587J0454J0651J0724J0966J0913
$$ 572235 576890 582766 589583 596929 604345 611886 620221 629808 640262 650913 661637 672603 683516
59014F83516J0180R073P886O208L582N00j855k796k747k650k972l266k717j134
$$ 683516 693696 702769 710655 716863 720445 720945 719090 716294 713547 710897 707925 704659 701942 700808
59000G00808P92K326L439M409N061N011M399L749L196K482J590P28j34j074j685
$$ 700808 701600 703926 707365 711774 716835 721846 726245 729994 733190 735672 737262 737990 737856 736782 735097
58985G35097j534j103j338k337l232l499l352k817j430P18K642L666M239N122
$$ 735097 733563 732460 731122 728785 725553 722054 718702 715885 714455 715173 717815 721481 725720 730842
58971G30842O419P825R204J0404J1154J1533J2001J2610J2794J2311J1733J1515
$$ 730842 737261 745086 754290 764694 775848 787381 799382 811992 824786 837097 848830 860345
58959H60345J1247J0351Q937P392N594L181K23k893n959q836j1168j2721j3769
$$ 860345 871592 881943 890880 898272 903866 907047 907270 904377 898418 889582 878414 865693 851924
58946H51924j4685j5287j5133j4282j3348j2710j2014j0608q389o062m487l788
$$ 851924 837239 821952 806819 792537 779189 766479 754465 743857 735468 729406 724919 721131
58934G21131l356k739k189k105k378k672k948l182k947j974q45l52m66o40q88
$$ 721131 717775 715036 712847 710742 708364 705692 702744 699562 696615 694641 693796 693444 692978 692338 691450
58919F91450j633k607k934k343j504j065j105j486j912j720m73J202K274K707
$$ 691450 689817 687210 684276 681933 680429 679364 678259 676773 674861 673141 672668 673870 676144 678851
58905F78851L306M304N237O136P614R646J1503J2961J4380J5467J5383J4339J3591
$$ 678851 682157 686461 691698 697834 705448 715094 726597 739558 753938 769405 784788 799127 812718
58892H12718J3539J3343J2883J3415J5387J7318J7848J7587J7762J8274J8317
$$ 812718 826257 839600 852483 865898 881285 898603 916451 934038 951800 970074 988391
58881I88391J7842J7020J5217J1842P592L607J7l590o842q926r842j0303j0745
$$ 988391 1006233 1023253 1038470 1050312 1057904 1061511 1061528 1057938 1051096 1042170 1032328 1022025 1011280
58868A011280j1246j1953j2719j2758j1558r743q386p919q251r219j0218j0251
$$ 1011280 1000034 988081 975362 962604 951046 941303 932917 924998 916747 907528 897310 887059
58856H87059r190q279q548r443r967j0204j0693j1123j0939j0566j0696j0906
$$ 887059 877869 869590 861042 851599 841632 831428 820735 809612 798673 788107 777411 766505
58844G66505j0240q801p533o827o477o555p188p763p653p321p568q042p750o720
$$ 766505 756265 747464 739931 733104 726627 720072 712884 705121 697468 690147 682579 674537 666787 660067
58830F60067n822n266m599l931l739l579k496p54L42N11Q99K160L496M130M428
$$ 660067 654245 648979 644380 640449 636710 633131 630635 629881 630223 630734 631633 633793 637289 641419 645847
58815F45847M904N253N074M700M625M687M462L902L167K257J254M32j31p67j711
$$ 645847 650751 656004 661078 665778 670403 675090 679552 683454 686621 688878 690132 690564 690433 689666 687955
58800F87955k746l474l721l576l382l566m182m699m669m363m260m213l712k736
$$ 687955 685209 681735 678014 674438 671056 667490 663308 658609 653940 649577 645317 641104 637392 634656
58786F34656j680n72Q34K306L326L981M919O325P626Q330Q517Q447Q246P938P221
$$ 634656 632976 632404 633238 635544 638870 642851 647770 654095 661721 670051 678568 687015 695261 703199 710420
58771G10420N316J822k358n694p672r031j0329j1214j1237j0584r598q310o821
$$ 710420 715736 717558 715200 709506 701834 692803 682474 671260 660023 649439 639841 631531 624710
58758F24710n581m892m473l904l115k292j539q34j40N69J220J623J754J900K244
$$ 624710 619129 614237 609764 605860 602745 600453 598914 598080 597940 598509 599729 601352 603106 605006 607250
58743F07250K622K958L592M674N667O107O467P468Q794R460R295R102R236R081
$$ 607250 609872 612830 616422 621096 626763 632870 639337 646805 655599 665059 674354 683456 692692 701773
58729G01773Q244P370P180P371O999N678L902K408J503R77M82J1n5M68J194J649
$$ 701773 710017 717387 724567 731938 738937 744615 748517 750925 752428 753405 753887 753898 753843 754311 755505 757154
58713G57154J927K469L373M276M828M848M192K867J181n90k575m946p439r675
$$ 757154 759081 761550 764923 769199 774027 778875 783067 785934 787115 786525 783950 779004 771565 761890
58699G61890j1731j3848j5727j6698j6581j5928j5342j4922j4405j3534j2310
$$ 761890 750159 736311 720584 703886 687305 671377 656035 641113 626708 613174 600864
58688F00864j0978r704q216o243m283l388l842m699n024m899m668m066k854j657
$$ 600864 589886 580182 571966 565723 561440 558052 554210 549511 544487 539588 534920 530854 528000 526343
58674E26343j163r39o8J389K559L206L996N379P086Q790J0520J2201J3423J3743
$$ 526343 525180 524241 524173 525562 528121 531327 535323 540702 547788 556578 567098 579299 592722 606465
58660F06465J2932J1073Q636O195L644K98l880p668r914j0807j1135j0947r906
$$ 606465 619397 630470 639106 645301 648945 649243 645363 637695 627781 616974 605839 594892 584986
58647E84986q389p198o445n744n169n085n256n036m283l244j905k99Q88J031O23
$$ 584986 576597 569399 562954 557210 552041 546956 541700 536664 532381 529137 527232 526933 527821 528852 529475
58632E29475P70J760K958L758L905L293K336K055K894L911M000L328K655K074
$$ 529475 530245 532005 534963 538721 542626 545919 548255 550310 553204 557115 561115 564443 567098 569172
58618E69172J587J960L557N020M840L682L361M017M170L394K856L139L443L223
$$ 569172 570759 572719 576276 581296 586136 589818 593179 597196 601366 604760 607616 610755 614198 617421
58604F17421K862K405J241m91j663j731j294q48l51j23o55j361j073K8N93L97
$$ 617421 620283 622688 623929 623438 621775 620044 618750 617902 617551 617428 616773 615412 614339 614367 614960 615357
58588F15357P41K111L349L748M274N811P711R046R880J0486J0506R840R247R192
$$ 615357 616098 618209 621558 625306 629580 635391 643102 652148 662028 672514 683020 692860 702107 711299
58574G11299R133Q611Q050P823P584P200P362Q553J0352J2276J4369J6510J8183
$$ 711299 720432 729043 737093 744916 752500 759700 767062 775615 785967 798243 812612 829122 847305
58561H47305J9468K1125K3248K4856K5393K5329K4855K3261K0276J6803J3494
$$ 847305 866773 887898 911146 936002 961395 986724 1011579 1034840 1055116 1071919 1085413
58550A085413R859N527J307j914m310o340p822q631r405j0701j2220j3590j5098
$$ 1085413 1095272 1100799 1102106 1100192 1095882 1089542 1081720 1073089 1063684 1052983 1040763 1027173 1012075
58537A012075j6991j8850k0234k1175k1587k1125k0095j9372j8990j7832j5367
$$ 1012075 995084 976234 956000 934825 913238 892113 872018 852646 833656 815824 800457
58526H00457j2493j0057p774n363l533k869k738k262j532j060q85r92j689k805
$$ 800457 787964 777907 770133 764770 761237 758368 755630 753368 751836 750776 749891 748899 747210 744405
58512G44405l383k992k444k485k658k240j513j212j411j686j770j475o33M00Q34
$$ 744405 741022 738030 735586 733101 730443 728203 726690 725478 724067 722381 720611 719136 718503 718903 719737
58497G19737N14J38J44K34K46M97R20R37N86P08J641K874M195N900P608Q390Q497
$$ 719737 720251 720389 720533 720767 721013 721510 722430 723367 723953 724661 726302 729176 733371 739271 746879 755269 763766
58480G63766R457J1750J3962J4980J5495J6446J7349J7205J5926J3943J1396Q391
$$ 763766 773223 784973 798935 813915 829410 845856 863205 880410 896336 910279 921675 930066
58468I30066N067J097l712q083j0147r990r573r645q822o403l875k499j381O80
$$ 930066 935133 936230 932518 924435 914288 904298 894725 885080 876258 869855 865980 863481 862100 862780
58454H62780L263N546P726R852J0917J0461R495Q612O832L633L07k101m346p041
$$ 862780 866043 871589 879315 889167 900084 910545 920040 928652 935484 939117 939424 937323 932977 925936
58440I25936r091r699r983j0748j0632q458n674m206l531k110k42R61K031M032
$$ 925936 916845 907146 897163 886415 875783 867325 861651 857445 853914 851804 851562 852523 854554 858586
58426H58586O100O670O293O791Q237R131Q986Q597Q142P102N661M327K598k30
$$ 858586 864686 871356 877649 884440 892677 901808 910794 919391 927533 934635 940296 944623 947221 946991
58412I46991l329n166n662n962o542p059p475p946q072p446o285m610j913J305
$$ 946991 943662 938496 932834 926872 920330 913271 905796 897850 889778 882332 876047 871437 869524 870829
58398H70829L193L078K759L724M892M934M956O506Q538Q952P931P111O620N552
$$ 870829 874022 877100 879859 883583 888475 893409 898365 904871 913409 922361 930292 937403 944023 949575
58384I49575M394M301M701M238L423L793N069N684N567N947O841P271P471Q484
$$ 949575 953969 958270 962971 967209 970632 974425 979494 985178 990745 996692 1003533 1010804 1018275 1026759
58370A026759R877J0209R497R057R232R405R730J0704J1603J1518J1341J2457
$$ 1026759 1036636 1046845 1056342 1065399 1074631 1084036 1093766 1104470 1116073 1127591 1138932 1151389
58358A151389J4147J4591J3846J3359J3163J2091J0290Q943P856N894L476K198
$$ 1151389 1165536 1180127 1193973 1207332 1220495 1232586 1242876 1251819 1259675 1265569 1269045 1271243
58346A271243K260K649L430N293P242P482O499O594Q321R920J0362J0594J1587
$$ 1271243 1273503 1276152 1279582 1284875 1292117 1299599 1306098 1312692 1321013 1330933 1341295 1351889 1363476
58333A363476J3196J5098J6984J8013J7743J7188J7303J7260J6084J4771J4565
$$ 1363476 1376672 1391770 1408754 1426767 1444510 1461698 1479001 1496261 1512345 1527116 1541681
58322A541681J4411J2714J0399R443R456Q768P850Q401R897J0385J0073J0801
$$ 1541681 1556092 1568806 1579205 1588648 1598104 1606872 1614722 1623123 1633020 1643405 1653478 1664279
58310A664279J2515J3538J3902J5083J6887J7946J8732K0703K2922K3163K1953
$$ 1664279 1676794 1690332 1704234 1719317 1736204 1754150 1772882 1793585 1816507 1839670 1861623
58299A861623K1883K3171K3626K2835K2674K3662K4448K4941K6363K8207K8749
$$ 1861623 1883506 1906677 1930303 1953138 1975812 1999474 2023922 2048863 2075226 2103433 2132182
58288B132182K8497K9548L1659L2697L2744L3879L5979L6923L6932L8523M1852
$$ 2132182 2160679 2190227 2221886 2254583 2287327 2321206 2357185 2394108 2431040 2469563 2511415
58277B511415M4260M4916M5807M7747M9314N0251N2029N4640N6582N8238O1399
$$ 2511415 2555675 2600591 2646398 2694145 2743459 2793710 2845739 2900379 2956961 3015199 3076598
58266C076598O5434O7928O9143P1673P5780P9330Q2171Q6022R0143R1914R1730
$$ 3076598 3142032 3209960 3279103 3350776 3426556 3505886 3588057 3674079 3764222 3856136 3947866
58255C947866R2522R4518R5366R5307R6944R9998J01771J02874J06814J13791
$$ 3947866 4040388 4134906 4230272 4325579 4422523 4522521 4624292 4727166 4833980 4947771
58245D947771J20560J26531J34074J42805J49836J55857J64521J75613J85487
$$ 4947771 5068331 5194862 5328936 5471741 5621577 5777434 5941955 6117568 6303055
58236F303055J94387K06206K20807K34108K46248K61733K80839K99001L15708
$$ 6303055 6497442 6703648 6924455 7158563 7404811 7666544 7947383 8246384 8562092
58227H562092L35581L59600L83942M08728M38924M75137N12705N51358N96256
$$ 8562092 8897673 9257273 9641215 10049943 10488867 10964004 11476709 12028067 12624323
58218A2624323O48160P02779P61309Q30773R12410J001325J099341J215840J353973
$$ 12624323 13272483 13975262 14736571 15567344 16479754 17481079 18580420 19796260 21150233
58209B1150233J509660J686701J898475K151898K445493K787028L196531L688091
$$ 21150233 22659893 24346594 26245069 28396967 30842460 33629488 36826019 40514110
58201D0514110M267003M949337N764220O731836P862292R183231J0744445J2589807
$$ 40514110 44781113 49730450 55494670 62226506 70088798 79272029 90016474 102606281
58193A02606281J4754872J7295385K0265142K3625835K7191474L0645930L3515540
$$ 102606281 117361153 134656538 154921680 178547515 205738989 236384919 269900459
58186B69900459L5056549L4275089L0286026K2835780J2568779Q56424j0619919
$$ 269900459 304957008 339232097 369518123 392353903 404922682 405779106 395159187
58179C95159187k0301038k7133076l0832088l1856779l1052835k9224921k6923814
$$ 395159187 374858149 347725073 316892985 285036206 253983371 224758450 197834636
58172A97834636k4461929k1987765j9543092j7138107j4824106j2689834j0798326
$$ 197834636 173372707 151384942 131841850 114703743 99879637 87189803 76391477
58165G6391477r159637p761959o593617n629366m827516m154788l596227l135804
$$ 76391477 67231840 59469881 52876264 47246898 42419382 38264594 34668367 31532563
58157C1532563k747652k413292k129516j892287j688323j508556j355121j228449
$$ 31532563 28784911 26371619 24242103 22349816 20661493 19152937 17797816 16569367
58149A6569367j119938j022813r38273q65634p97511p29979o67453o12760n61726
$$ 16569367 15449429 14426616 13488343 12622709 11825198 11095219 10427766 9815006 9253280
58140I253280n11759m66709m28928l94817l62203l34261l12585k93816k76318
$$ 9253280 8741521 8274812 7845884 7451067 7088864 6754603 6442018 6148202 5871884
58131E871884k62767k53121k42319k28077k14020k02286j89976j75673j62578
$$ 5871884 5609117 5355996 5113677 4885600 4671580 4469294 4279318 4103645 3941067
58122C941067j52198j41610j29893j20720j15461j10156j02508r5724r2056q8539
$$ 3941067 3788869 3647259 3517366 3396646 3281185 3171029 3068521 2972797 2880741 2792202
58112B792202q2652p6713p3051o9884o5441o1465n9369n7345n4357n2579n3008
$$ 2792202 2709550 2632837 2559786 2489902 2424461 2362996 2303627 2246282 2191925 2139346 2086338
58101B086338n2959n0722m8494m7892m6842m3764m0739l9574l8499l5723l2628
$$ 2086338 2033379 1982657 1934163 1886271 1839429 1795665 1754926 1715352 1676853 1641130 1608502
58090A608502l0727k8872k6147k4140k3809k3346k1559k0075j9998j9769j8653
$$ 1608502 1577775 1548903 1522756 1498616 1474807 1451461 1429902 1409827 1389829 1370060 1351407
58079A351407j8794k1220k3309k2862k1577k1669k2178k1387k0136j9869j9894
$$ 1351407 1332613 1311393 1288084 1265222 1243645 1221976 1199798 1178411 1158275 1138406 1118512
58068A118512j9167j8488j8530j7969j5900j3822j3084j2617j1278j0106j0143
$$ 1118512 1099345 1080857 1062327 1044358 1028458 1014636 1001552 988935 977657 967551 957408
58057I57408j0327r632r106r779j0724j1069j1633j2712j2587j0316p776o859
$$ 957408 947081 937449 928343 918564 907840 896771 885138 872426 859839 849523 841747 834888
58045H34888o808o297n894o381o788o267n943o790p663p406o965p382p718p055
$$ 834888 828080 821783 815889 809508 802720 796453 790510 783720 776057 768651 761686 754304 746586 739531
58031G39531o602p593q935r157q987r781j0949j1112j0431r812r145q132p493
$$ 739531 732929 725336 716401 707244 698257 688476 677527 666415 655984 646172 637027 628895 621402
58018F21402p533p020n212l548l547m474m835m655m501l779j948j71J47o23j300
$$ 621402 613869 606849 601637 598089 594542 590068 585233 580578 576077 572298 570350 570179 570326 569703 568403
58003E68403j656j833j387m11j68j056j529m91Q61J209J362K472L667L542K607
$$ 568403 566747 564914 563527 563116 562948 561892 560363 559872 560733 561942 563304 565776 569443 572985 575592
57988E75592K219K302K090J896K219K259J201n2l06j12n62j183r70m19o33j251
$$ 575592 577811 580113 582203 584099 586318 588577 589778 589726 589420 589308 588746 587563 586593 586174 585541 584290
57972E84290j207p30p48j011o02L45R65J049P72j90j807k898k567j637j313j482
$$ 584290 583083 582353 581605 580594 579992 580337 581302 582351 583123 582933 581126 578228 575661 574024 572711 571229
57956E71229j574j964k987l796l710l591m262m813m158l074k880l155k719j821
$$ 571229 569655 567691 564704 560908 557198 553607 549345 544532 540374 537300 534420 531265 528546 526725
57942E26725j444j336o20N06J460K781N046P210P943P852Q354R187R060Q077P442
$$ 526725 525281 523945 523325 523831 525291 528072 533118 540328 548271 556123 564477 573664 582724 590801 598243
57927E98243P285O736N696M650L273J065j184k351k805l506m104l864l629m569
$$ 598243 605528 612264 617960 622610 625883 626948 625764 623413 620608 617102 612998 609134 605505 600936
57913F00936n694n099l150j917j728r84N88J301M89m14m53n30j350k126k298k689
$$ 600936 595242 590143 586993 585076 583348 582364 582952 584253 584742 584328 583875 583345 581995 579869 577571 574882
57897E74882l910n072n133m339l483k773k125j622j085q6J196J972J986J816J813
$$ 574882 570972 565900 560767 556428 552945 550172 548047 546425 545340 545254 546450 548422 550408 552224 554037
57882E54037J741J588J746K096J972J260O28L95J41l27n40k50J02J44J50N02J170
$$ 554037 555778 557366 559112 561208 563180 564440 565068 565463 565604 565277 564737 564487 564589 564733 564883 565385 566555
57865E66555J789J926J344M68K23R27J763K048K289L118L856L448K319J916K607
$$ 566555 568344 570270 571614 572082 572305 573232 574995 577043 579332 582450 586306 589754 592073 593989 596596
57850E96596L434L805L996M013L304J899O02j50o48j070j280j576k560m032n022
$$ 596596 600030 603835 607831 611844 615148 617047 617649 617499 616851 615781 614501 612925 610365 606333 601311
57835F01311n048m587m101l459k421j057L05J064O49n41j038k7J394J743J351
$$ 601311 596263 591676 587575 584116 581695 580638 580943 582007 582656 582115 581077 581050 582444 584187 585538
57820E85538J660K824L610L493L253L391L471L238L049K890K200R51k07j098k234
$$ 585538 587198 590022 593632 597125 600378 603769 607240 610478 613527 616417 618617 619568 619361 618263 616029
57805F16029l693m818n222n114m566l469k278j696j512q37M50J563K200K832L532
$$ 616029 612336 607518 602296 597182 592616 589147 586869 585173 583661 582824 583274 584837 587037 589869 593401
57790E93401L709L268K946L205L776M395N038N335M849M022L791M190M404M248
$$ 593401 597110 600378 603324 606529 610305 614700 619738 625073 629922 633944 637735 641925 646329 650577
57776F50577M318M662M632M202M112M419M262L393K610K262J630L11r61j520j787
$$ 650577 654895 659557 664189 668391 672503 676922 681184 684577 687187 689449 691079 691390 690429 688909 687122
57761F87122k493l677m849n459n027l652k282j623j012M93K242K839K586L181
$$ 687122 684629 680952 676103 670644 665617 661965 659683 658060 657048 657541 659783 662622 665208 668389
57747F68389M854N949N822N964P301Q487Q124O981O520O646O408N736N079M313
$$ 668389 673243 679192 685014 690978 698279 706766 714890 721871 728391 735037 741445 747181 752260 756573
57733G56573L294K653K737K645J541J28m19k60l22o03l32N65J385J694J525Q95
$$ 756573 759867 762520 765257 767902 769443 769571 769152 768892 768570 767967 767635 768200 769585 771279 772804 773699
57717G73699l0o69p08n70o62o84m35m59j020j277m89O38R33M53L2k59r34j712
$$ 773699 773669 773000 772292 771722 771060 770376 769941 769482 768462 767185 766696 767334 768267 768720 768752 768493 767559 765847
57699G65847j675o73N44J500K276K726K478J787J471J853K437K752K822K865L054
$$ 765847 764172 763499 764043 765543 767819 770545 773023 774810 776281 778134 780571 783323 786145 789010 792064
57684G92064L491M003M141L977M529O645R768J2557J4545J6319J8333K0581K3466
$$ 792064 795555 799558 803699 807676 812205 818850 828618 841175 855720 872039 890372 910953 934419
57671I34419K7939L4333M1869M9610N7306O4684P0322P1758O6714N4180L4815
$$ 934419 962358 996691 1038560 1088170 1145476 1210160 1280482 1352240 1418954 1473134 1507949
57660A507949J0845j4279l6658n3129o2340o4898o2400n6369m8151l9321l1436
$$ 1507949 1518794 1504515 1467857 1414728 1352388 1287490 1225090 1168721 1120570 1081249 1049813
57649A049813k5171k0232j6180j2879j0191p860n968m796m029k793q29J028J966
$$ 1049813 1024642 1004410 988230 975351 965160 957300 951332 946536 942507 939714 938885 939913 941879
57636I41879K155K200K314K533L050L699L778L086K567L117M190M454L501K102
$$ 941879 944034 946234 948548 951081 954131 957830 961608 964694 967261 970378 974568 979022 982523 984625
57622I84625J048N34N44J094J992K894L573L811L292K082R81Q14J545K459L095
$$ 984625 985673 986207 986751 987845 989837 992731 996304 1000115 1003407 1005489 1006470 1007284 1008829 1011288 1014383
57607A014383L432L526L432L404L653M015M256M455M700M682M139L409L038K984
$$ 1014383 1017815 1021341 1024773 1028177 1031830 1035845 1040101 1044556 1049256 1053938 1058077 1061486 1064524 1067508
57593A067508K755K215J693J467J567K014K801L672M316M654M749M679M740N369
$$ 1067508 1070263 1072478 1074171 1075638 1077205 1079219 1082020 1085692 1090008 1094662 1099411 1104090 1108830 1114199
57579A114199O428P022O511N384M582M262L904L320K840K670K770L250M193N073
$$ 1114199 1120627 1127649 1134160 1139544 1144126 1148388 1152292 1155612 1158452 1161122 1163892 1167142 1171335 1176408
57565A176408N073M172L316L359M211N170N779O094O440P015P699Q184Q340Q314
$$ 1176408 1181481 1185653 1188969 1192328 1196539 1201709 1207488 1213582 1220022 1227037 1234736 1242920 1251260 1259574
57551A259574Q280Q338Q661R364J0057J0001R005P808P199P123P016O616O024
$$ 1259574 1267854 1276192 1284853 1294217 1304274 1314275 1323280 1331088 1338287 1345410 1352426 1359042 1365066
57538A365066N387M964N175O085P100P553P364O835O248N997O577P862Q901R052
$$ 1365066 1370453 1375417 1380592 1386677 1393777 1401330 1408694 1415529 1421777 1427774 1434351 1442213 1451114 1460166
57524A460166Q765Q653Q394P479O541O757Q145R500J0066J0162J0122R648Q659
$$ 1460166 1468931 1477584 1485978 1493457 1499998 1506755 1514900 1524400 1534466 1544628 1554750 1564398 1573057
57511A573057P827P741Q089Q212P979P691P420O938O232N747N987O938P997Q516
$$ 1573057 1580884 1588625 1596714 1604926 1612905 1620596 1628016 1634954 1641186 1646933 1652920 1659858 1667855 1676371
57497A676371Q480Q365Q429Q414Q155P916P918P915P705P594P925Q537R171R996
$$ 1676371 1684851 1693216 1701645 1710059 1718214 1726130 1734048 1741963 1749668 1757262 1765187 1773724 1782895 1792891
57483A792891J1130J2009J1977J1278J0740J0723J0948J1244J1647J1912J1684
$$ 1792891 1804021 1816030 1828007 1839285 1850025 1860748 1871696 1882940 1894587 1906499 1918183
57472A918183J1123J0734J0531J0069R327Q855Q975R408R831J0275J0795J1275
$$ 1918183 1929306 1940040 1950571 1960640 1969967 1978822 1987797 1997205 2007036 2017311 2028106 2039381
57460B039381J1668J2057J2400J2561J2620J2745J2849J2787J2795J3206J3798
$$ 2039381 2051049 2063106 2075506 2088067 2100687 2113432 2126281 2139068 2151863 2165069 2178867
57449B178867J3986J3617J3093J2679J2265J1861J1779J2167J2760J3200J3355
$$ 2178867 2192853 2206470 2219563 2232242 2244507 2256368 2268147 2280314 2293074 2306274 2319629
57438B319629J3312J3369J3861J4622J4893J4192J3128J2752J3264J3954J4320
$$ 2319629 2332941 2346310 2360171 2374793 2389686 2403878 2417006 2429758 2443022 2456976 2471296
57427B471296J4532J4821J5125J5416J5772J6058J6028J5819J5880J6324J6824
$$ 2471296 2485828 2500649 2515774 2531190 2546962 2563020 2579048 2594867 2610747 2627071 2643895
57416B643895J7112J7143J6896J6443J6118J6073J5967J5654J5841J7145J8735
$$ 2643895 2661007 2678150 2695046 2711489 2727607 2743680 2759647 2775301 2791142 2808287 2827022
57405B827022J8974J7441J5418J4256J4199J4881J5908J6724J6837J6597J6873
$$ 2827022 2845996 2863437 2878855 2893111 2907310 2922191 2938099 2954823 2971660 2988257 3005130
57394C005130J7638J7868J7205J6688J7212J8221J8718J8763J9023J9467J9470
$$ 3005130 3022768 3040636 3057841 3074529 3091741 3109962 3128680 3147443 3166466 3185933 3205403
57383C205403J8948J8469J8414J8619J8795J8723J8258J7564J7189J7448J7913
$$ 3205403 3224351 3242820 3261234 3279853 3298648 3317371 3335629 3353193 3370382 3387830 3405743
57372C405743J7972J7655J7475J7603J7739J7697J7640J7714J7835J7907J7953
$$ 3405743 3423715 3441370 3458845 3476448 3494187 3511884 3529524 3547238 3565073 3582980 3600933
57361C600933J8016J8106J8249J8499J8857J9259J9594J9666J9399J9081J9241
$$ 3600933 3618949 3637055 3655304 3673803 3692660 3711919 3731513 3751179 3770578 3789659 3808900
57350C808900K0032K0965K1358K1024K0375J9921J9825J9919K0075K0372K0823
$$ 3808900 3828932 3849897 3871255 3892279 3912654 3932575 3952400 3972319 3992394 4012766 4033589
57339D033589K1060K0704K0035J9869K0521K1390K1841K2038K2384K2723K2717
$$ 4033589 4054649 4075353 4095388 4115257 4135778 4157168 4179009 4201047 4223431 4246154 4268871
57328D268871K2640K2942K3340K3191K2642K2494K2959K3469K3769K4232K4884
$$ 4268871 4291511 4314453 4337793 4360984 4383626 4406120 4429079 4452548 4476317 4500549 4525433
57317D525433K5001K4115K2777K1956K2087K2919K3779K3919K3181K2319K2074
$$ 4525433 4550434 4574549 4597326 4619282 4641369 4664288 4688067 4711986 4735167 4757486 4779560
57306D779560K2138K1718K1027K1066K1906K2379K1821K0882K0253J9697J8960
$$ 4779560 4801698 4823416 4844443 4865509 4887415 4909794 4931615 4952497 4972750 4992447 5011407
57295E011407J8541J8720J8867J8464J8010J7996J7864J6954J5782J5342J5650
$$ 5011407 5029948 5048668 5067535 5085999 5104009 5122005 5139869 5156823 5172605 5187947 5203597
57284E203597J5983J6130J6386J6615J6240J5113J3703J2554J2015J2188J2608
$$ 5203597 5219580 5235710 5252096 5268711 5284951 5300064 5313767 5326321 5338336 5350524 5363132
57273E363132J2458J1639J1123J1565J2211J2016J1223J0863J1052J1003J0455
$$ 5363132 5375590 5387229 5398352 5409917 5422128 5434144 5445367 5456230 5467282 5478285 5488740
57262E488740J0013J0058J0290J0423J0521J0563J0435J0353J0602J0853J0460
$$ 5488740 5498753 5508811 5519101 5529524 5540045 5550608 5561043 5571396 5581998 5592851 5603311
57251E603311R472Q678Q615R160R969J0626J0444R003P020N872N991O405O056
$$ 5603311 5612783 5621461 5630076 5639236 5649205 5659831 5670275 5679278 5686298 5692170 5698161 5704566 5710622
57238E710622M947L699K676J940J660J992K707L170K822J750Q00Q76J829K466
$$ 5710622 5715569 5719268 5721944 5723884 5725544 5727536 5730243 5733413 5736235 5737985 5738785 5739661 5741490 5743956
57224E743956K009J164J178K162L101L318L070K762K362J799J266R20P78R07J242
$$ 5743956 5745965 5747129 5748307 5750469 5753570 5756888 5759958 5762720 5765082 5766881 5768147 5769067 5769845 5770752 5771994
57209E771994J272N64m90j095j251j693k571l104k802k269k368l230m482n787
$$ 5771994 5773266 5773830 5773340 5772245 5770994 5769301 5766730 5763626 5760824 5758555 5756187 5752957 5748475 5742688
57195E742688o787p078o737o433o649p168p626q042q467q670q552q442q520q376
$$ 5742688 5735901 5728823 5722086 5715653 5709004 5701836 5694210 5686168 5677701 5669031 5660479 5652037 5643517 5635141
57181E635141p606o485n624n361n768o801p980q452p991p526q015r148r863r867
$$ 5635141 5627535 5621050 5615426 5610065 5604297 5597496 5589516 5581064 5573073 5565547 5557532 5548384 5538521 5528654
57167E528654r795j0046j0317j0455j0932j2083j3461j4384j4830j5467j6887
$$ 5528654 5518859 5508813 5498496 5488041 5477109 5465026 5451565 5437181 5422351 5406884 5389997
57156E389997j8978k0991k2225k2802k3664k5555k8134l0410l1927l2974l3779
$$ 5389997 5371019 5350028 5327803 5305001 5281337 5255782 5227648 5197238 5165311 5132337 5098558
57145E098558l4219l4456l5062l6027l6353l5305l3565l2340l1560k9845k6293
$$ 5098558 5064339 5029883 4994821 4958794 4922441 4887136 4853571 4821231 4789671 4759826 4733533
57134D733533k1480j6579j2239q684o240n196n393o386p756r081r896j0075r909
$$ 4733533 4712053 4695474 4683235 4674551 4668311 4663115 4657722 4651336 4643580 4634499 4624603 4614528 4604619
57121D604619r540q651o923m357p94M305J1027J8479K5765L3144M1507N1013O1176
$$ 4604619 4595079 4586428 4579505 4575148 4574354 4578659 4589686 4608165 4633930 4667074 4708581 4759594 4820770
57108D820770P2180Q5187J01249J20765J44119J72087K05437K44811K91217L46023
$$ 4820770 4892950 4978137 5079386 5200151 5344270 5516357 5721794 5966605 6257822 6603845
57098F603845M10288M84560N69195O64204P68727Q81246R99953J121997J242524
$$ 6603845 7014133 7498693 8067888 8732092 9500819 10382065 11382018 12504015 13746539
57089A3746539J355471J455072J535864J592465J621225J620489J585115J501157
$$ 13746539 15102010 16557082 18092946 19685411 21306636 22927125 24512240 26013397
57081B6013397J352870J140294Q87444O27341L77554J31419j29413m17632p32120
$$ 26013397 27366267 28506561 29394005 30021346 30398900 30530319 30400906 29983274 29251154
57072B9251154j057180j364526j620508j799177j892218j907459j860072j766227
$$ 29251154 28193974 26829448 25208940 23409763 21517545 19610086 17750014 15983787
57064A5983787j641700j501032j355440j212130j075654r49078q34067p31190
$$ 15983787 14342087 12841055 11485615 10273485 9197831 8248753 7414686 6683496
57056F683496o40583n61875m93792m34686l83447l39266l00895k67046k37369
$$ 6683496 6042913 5481038 4987246 4552560 4169113 3829847 3528952 3261906 3024537
57047C024537k12136j91001j72915j57255j44048j32925j22724j12534j02473
$$ 3024537 2812401 2621400 2448485 2291230 2147182 2014257 1891533 1778999 1676526
57038A676526r3034q4284p6080o8587o1993n5935m9751m3139l6174k8766k0583
$$ 1676526 1583492 1499208 1423128 1354541 1292548 1236613 1186862 1143723 1107549 1078783 1058200
57027A058200j1532j947P727J7024K4892K9509K9202K3462J2688k714k2068m3081
$$ 1058200 1046668 1044721 1052448 1069472 1094364 1123873 1153075 1176537 1189225 1186511 1164443 1121362
57015A121362o1758p4580q0572q0931p7174p0453o2068n3474m5501l8258l1870
$$ 1121362 1059604 985024 904452 823521 746347 675894 613826 560352 514851 476593 444723
57004D44723k6652k2585j9309j6737j4974j3638j2086j0528r892j0342j0768j0251
$$ 444723 418071 395486 376177 359440 344466 330828 318742 308214 298322 287980 277212 266961
56992B66961r125p993o595m505k246p58m0Q20K408M458O271P011N853K619j694
$$ 266961 257836 249843 243248 238743 236497 235739 235699 236519 238927 243385 249656 256667 262520 265139 263445
56977B63445n678q702j0971j2633j3478j3411j2581j1004q662n961l560j638J69
$$ 263445 257767 249065 238094 225461 211983 198572 185991 174987 166325 160364 156804 155166 155335
56964A55335K064L870N559P511R900J2331J4227J5398J5912J5634J4049J0606
$$ 155335 157399 161269 166828 174339 184239 196570 210797 226195 242107 257741 271790 282396
56952B82396N292r68o637j0646j3079j4600j5365j4949j3229j0754q109n385k554
$$ 282396 287688 286720 280083 269437 256358 241758 226393 211444 198215 187461 179352 173967 171413
56939A71413J60K559M863P409J0202J3129J6394K0187K3881K6014K5322K1617
$$ 171413 171573 174132 178995 186404 196606 209735 226129 246316 270197 296211 321533 343150
56927C43150J5572P960n19q899j5966k0851k3404k3919k2790k0545j7912j5426
$$ 343150 358722 366682 366163 357264 341298 320447 297043 273124 250334 229789 211877 196451
56915A96451j3107j0764q474o488m837l377k183j465j144q84n12n5O09J605K544
$$ 196451 183344 172580 164106 157618 152781 149404 147221 145756 144612 143728 143216 143161 143770 145375 147919
56900A47919K823K537K611L605M997N953O427O978P896R030J0294J1774J3446
$$ 147919 150742 153279 155890 159495 164492 170445 176872 183850 191746 200776 211070 222844 236290
56887B36290J5166J6832J8183J8469J6825J3075P924K280l324q549j2791j5205
$$ 236290 251456 268288 286471 304940 321765 334840 342764 345044 341720 333171 320380 305175
56875C05175j5346j3705j1413r216o879l826j82L240O047Q819J2397J6967K2133
$$ 305175 289829 276124 264711 255495 248616 244790 244608 247848 253895 262714 275111 292078 314211
56862C14211K7486L2747L7528M1148M2554M0341L3379K1903P815o355j8619k7723
$$ 314211 341697 374444 411972 453120 495674 536015 569394 591297 599112 592757 574138 546415
56850E46415l2829l3702l1098k6382k0694j4594q293j891M559J0990J7398K4100
$$ 546415 513586 479884 448786 422404 401710 387116 378823 376932 381491 392481 409879 433979
56838D33979L1664M0269M9334N7954O5383P0720P2416O8601N8086M1053J9112
$$ 433979 465643 505912 555246 613200 678583 749303 821719 890320 948406 989459 1008571
56827A008571m957k7776m6311n8666o4332o4031n9393n2258m3936l5136k6517
$$ 1008571 1003614 975838 929527 870861 806529 742498 683105 630847 586911 551775 525258
56816E25258j8642j1311l668M580J2616J9693K6246L3142M0156M5898M8866M7874
$$ 525258 506616 495305 491637 496217 508833 528526 554772 587914 628070 673968 722834 770708
56804G70708M1828L0134J3643n349k4026l9820n0760n6009n6217n2868m7249m0364
$$ 770708 812536 842670 856313 850964 826938 787118 736358 680349 624132 571264 524015 483651
56792D83651l3357k7167k1783j6556j1280o293j574L396Q734J3796J7994K1275
$$ 483651 450294 423127 401344 384788 373508 367215 365641 369037 377771 391567 409561 430836
56780D30836K3454K3700K1099J5447P224k738j3253k2826l0154l4559l5931l4635
$$ 430836 454290 477990 499089 514536 521760 519022 505769 482943 452789 418230 382299 347664
56768C47664l1602k8106k5061k2557k0146j7406j4295j1289r204q472q531q260
$$ 347664 316062 287956 262895 240338 220192 202786 188491 177202 167998 159526 150995 142735
56756A42735p157n747m684l926l105k341k187k737l255k953j995j388j712k241
$$ 142735 135578 129831 125147 121221 118116 115775 113588 110851 107596 104643 102648 101260 99548 97307
56742I7307j770j78J362J780J150J55p62j306j090j73O14N79K1m92j099j979k296
$$ 97307 95537 95359 96721 98501 99651 99806 99044 97738 96648 96475 97089 97668 97689 97197 96098 94119 91823
56725I1823j086R29J786P53p73j221n98K25R04J521J853J607J052P28P11O27K48
$$ 91823 90737 91666 93452 94205 93432 92211 91613 91838 92742 94263 96116 97723 98775 99503 100214 100841 101089
56708A01089k64m98p5R23J768J758J186J018J462J602P72l48o37L1Q19J082R02
$$ 101089 100825 100327 100252 101175 102943 104701 105887 106905 108367 109969 110741 110393 109756 109787 110606 111688 112590
56691A12590O80O57P43N89J9n14l15N22J067Q62O71J334K437K872K436J954J951
$$ 112590 113270 113927 114670 115259 115278 114764 114449 114971 116038 116900 117571 118905 121342 124214 126650 128604 130555
56674A30555K005J659J215J219J553J626J281J037J287J637J400N82o5q4J79L55
$$ 130555 132560 134219 135434 136653 138206 139832 141113 142150 143437 145074 146474 147056 146991 146907 147086 147441
56658A47441P23J517K064J522L62PQ87J764J418K11n96m34K85R82J358J274P99
$$ 147441 148164 149681 151745 153267 153629 153636 154523 156287 157705 157916 157320 156886 157171 158153 159511 160785 161584
56641A61584L08J47K91N20O48M45l20j429k199k233j896j716j607j108j13R31
$$ 161584 161892 162039 162330 162850 163498 163943 163623 162194 159995 157762 155866 154150 152543 151435 151322 152253
56625A52253J429J016j69j371j736j218o44o71j112j517j900k366k578k176j474
$$ 152253 153682 154698 154529 153158 151422 150204 149560 148889 147777 146260 144360 141994 139416 137240 135766
56610A35766j040q69n23KJ82k69r93j414j231n43K37N98L73n9j55K58R01J299
$$ 135766 134726 133857 133334 133336 133518 133249 132256 130842 129611 129068 129305 129903 130276 130217 130062 130320 131221 132520
56592A32520J028Q6q35q31J49J128J324J114J318J906K100J569Q72O28Q28J080
$$ 132520 133548 133634 132799 131968 132117 133245 134569 135683 137001 138907 141007 142576 143448 144076 144904 145984
56576A45984J180J272J582K079K396K198J733J718K514L647M393M565M515M589
$$ 145984 147164 148436 150018 152097 154493 156691 158424 160142 162656 166303 170696 175261 179776 184365
56562A84365M927N522O219O761P108P514Q093Q548Q500P839O499M349J607r01
$$ 184365 189292 194814 201033 207794 214902 222416 230509 239057 247557 255396 261895 266244 267851 266950
56548B66950k421k974l103l142l047k707k094j288o30n66j138j835k234k450k682
$$ 266950 264529 261555 258452 255310 252263 249556 247462 246174 245544 244978 243840 242005 239771 237321 234639
56533B34639k779k586k360k408k679l010l426l769l507k401j012m4M20N64K54
$$ 234639 231860 229274 226914 224506 221827 218817 215391 211622 208115 205714 204702 204658 205078 205642 205896
56518B05896n56j281j319j002j110j689k063j922j664j575j446j083o03j23L93
$$ 205896 205340 204059 202740 201738 200628 198939 196876 194954 193290 191715 190269 189186 188583 188460 188853
56503A88853Q08P67J44p37j390j557j361j218j405j612j159M5J214J619J372R27
$$ 188853 189661 190428 190572 189835 188445 186888 185527 184309 182904 181292 180133 180178 181392 183011 184383 185310
56487A85310L50l60p62n26j59l82j025j330j162j078j230j053k10P99J244R61
$$ 185310 185660 185300 184538 184012 183853 183471 182446 181116 179954 178876 177646 176593 176383 177182 178426 179387
56471A79387M38L53J020J952K173J277j5o87m97J26Q13J338J332O55j77n86p25
$$ 179387 179825 180178 181198 183150 185323 186600 186585 185898 185401 185527 186340 187678 189010 189665 189488 188902 188177
56454A88177j066j467j382p96j80L34J035J963K754L091K832J966R45O16J110
$$ 188177 187111 185644 184262 183466 183286 183620 184655 186618 189372 192463 195295 197261 198206 198822 199932
56439A99932J360N16o62q51j21L91L54M07O58M77j15l51j91n24j457j803q26O66
$$ 199932 201292 201808 201146 200295 200174 200565 200919 201326 201984 202461 202346 201995 201804 201280 199823 198020 197194 197860
56421A97860J605J990K227K089J238P2o53o26NQ63J294P75k53o41l4N92K95o40
$$ 197860 199465 201455 203682 205771 207009 207081 206428 205802 205807 206670 207964 208739 208486 207845 207811 208403 208698 208058
56403B08058j340j457j175p56n07o91j012q07m1O03R10J567K886L932L714K612
$$ 208058 206718 205261 204086 203330 202823 202132 201120 200313 200272 200875 201785 203352 206238 210170 213884 216496
56387B16496J926K336L436M365M411L413K046J338J559J972J969J895K293K924
$$ 216496 218422 220758 224194 228559 232970 236383 238429 239767 241326 243298 245267 247162 249455 252379
56373B52379L081K455J321K33j65L74J139J008n8q08m01M38O02J67j6K66M75L18
$$ 252379 255460 257915 259236 259469 259304 259678 260817 261825 261767 260959 260558 260996 261598 261765 261749 262015 262490 262808
56355B62808M6j3K87R81J759K002J461O44J03k44o65r31o38J23R31J517J683J207
$$ 262808 262854 262841 263128 264109 265868 267870 269331 269975 270078 269834 269169 268238 267600 267723 268654 270171 271854 273061
56337B73061L73J65J256L061M418M883M805M464L913L464L547M027M266L966L444
$$ 273061 273434 273599 274855 277916 282334 287217 292022 296486 300399 303863 307410 311437 315703 319669 323113
56322C23113L043K679K134J513J146J223J572J799J625J126N44N1k10K1Q87K078
$$ 323113 326156 328835 330969 332482 333628 334851 336423 338222 339847 340973 341517 341568 341358 341379 342266 344344
56306C44344L049L526L539L191K753K675L018L152K651K178K641L735M343M231
$$ 344344 347393 350919 354458 357649 360402 363077 366095 369247 371898 374076 376717 380452 384795 389026
56292C89026M230M699N036M950M991N432N734N636N708O290O931P387Q119R165
$$ 389026 393256 397955 402991 407941 412932 418364 424098 429734 435442 441732 448663 456050 464169 473334
56278D73334R620R017Q214Q148Q602R060R742J0856J1735J1881J2063J3275J5205
$$ 473334 482954 491971 500185 508333 516935 525995 535737 546593 558328 570209 582272 595547 610752
56265F10752J6864J8232K0111K2694K5361K7695K9826L1998L4532L8002M2710
$$ 610752 627616 645848 665959 688653 714014 741709 771535 803533 838065 876067 918777
56254I18777M8190N3809N9562O5825P2800Q0607Q9361R8609J07356J15226J22856
$$ 918777 966967 1020776 1080338 1146163 1218963 1299570 1388931 1487540 1594896 1710122 1832978
56243A832978J30516J37165J41647J43908J44120J41476J35049J25146J12612
$$ 1832978 1963494 2100659 2242306 2386214 2530334 2671810 2806859 2932005 3044617
56234C044617R7353P8816N7457L4594J1074j2727l5891n7136p5849r1943j04981
$$ 3044617 3141970 3220786 3278243 3312837 3323911 3311184 3275293 3218157 3142308 3050365 2945384
56223B945384j14458j20783j24906j27068j26807j24155j19864j14555j08471
$$ 2945384 2830926 2710143 2585237 2458169 2331362 2207207 2087343 1972788 1864317
56214A864317j02028r5692q9430q2952p6514p0740o5779o1249n6862n2518m8087
$$ 1864317 1762289 1666597 1577167 1494215 1417701 1346961 1281182 1219933 1163071 1110553 1062466
56203A062466m3687l9875l6978l4502l1769k8760k5839k3139k0766j8948j7377
$$ 1062466 1018779 978904 941926 907424 875655 846895 821056 797917 777151 758203 740826
56192G40826j5117j1978r246q155q270q237p521o446n286m285l947m265m286l393
$$ 740826 725709 713731 704485 696330 688060 679823 672302 665856 660570 656285 652338 648073 643787 640394
56178F40394k276j702j233l45K37j88o59R9J474J927J601J943L030L398K681K402
$$ 640394 638118 636416 635183 634838 635075 634887 634228 634327 635801 637728 639329 641272 644302 647700 650381 652783
56162F52783L751O103Q257R809J0815J1285J1494J1931J2712J3703J5112J7094
$$ 652783 656534 662637 670894 680703 691518 702803 714297 726228 738940 752643 767755 784849
56150G84849J8988K0043K0688K2058K4371K6970K9819L3738L9178M5770N3040
$$ 784849 803837 823880 844568 866626 890997 917967 947786 981524 1020702 1066472 1119512
56139A119512O0645O8037P4905Q1653Q8355R3537R5114R2385Q6220P7723O7875
$$ 1119512 1180157 1248194 1323099 1404752 1493107 1586644 1681758 1774143 1860363 1938086 2005961
56128B005961N8140N0000M3877L9360L6028L3137K9106K2723J4444N596l125j1352
$$ 2005961 2064101 2114101 2157978 2197338 2233366 2266503 2295609 2318332 2332776 2338372 2335247 2323895
56116B323895j8310k3898k9697l7368m6746n6833o7413p7931q5952q9130q7936
$$ 2323895 2305585 2281687 2251990 2214622 2167876 2111043 2043630 1965699 1879747 1790617 1702681
56105A702681q4292p8425o9526n8827m9107m1349l4425k7923k2618j8283j3693
$$ 1702681 1618389 1539964 1470438 1411611 1362504 1321155 1286730 1258807 1236189 1217906 1204213
56094A204213r109o166n040m051k336o40P66K560M560N747O351P612R351J0107
$$ 1204213 1195104 1188938 1183898 1179847 1177511 1176871 1177637 1180197 1184757 1190504 1196855 1204467 1213818 1223925
56080A223925R826R884J0383J0080R238R742J1855J3608J4013J4264J5123J5841
$$ 1223925 1233751 1243635 1254018 1264098 1273336 1283078 1294933 1308541 1322554 1336818 1351941 1367782
56068A367782J6280J7438J9113J9724J9189J9378K0966K2485K3191K4086K5295
$$ 1367782 1384062 1401500 1420613 1440337 1459526 1478904 1499870 1522355 1545546 1569632 1594927
56057A594927K5349K4130K3680K4866K5934K5521K4560K4037K3471K2728K2884
$$ 1594927 1620276 1644406 1668086 1692952 1718886 1744407 1768967 1793004 1816475 1839203 1862087
56046A862087K4134K5297K6168K7840L0046L1046L0921L1876L4488L6736L7734
$$ 1862087 1886221 1911518 1937686 1965526 1995572 2026618 2057539 2089415 2123903 2160639 2198373
56035B198373L9002M1032M2184M2270M3563M6771M9567N0754N2243N5099N7339
$$ 2198373 2237375 2278407 2320591 2362861 2406424 2453195 2502762 2553516 2605759 2660858 2718197
56024B718197N7720N8161O0253O2763O4637O7100P0619P3378P4824P7157Q1191
$$ 2718197 2775917 2834078 2894331 2957094 3021731 3088831 3159450 3232828 3307652 3384809 3466000
56013C466000Q4522Q6121Q8833R4672J01462J06824J11762J17514J22655J26325
$$ 3466000 3550522 3636643 3725476 3820148 3921610 4028434 4140196 4257710 4380365 4506690
56003D506690J30637J36973J43419J48708J54970J63750J73185J81941J91910
$$ 4506690 4637327 4774300 4917719 5066427 5221397 5385147 5558332 5740273 5932183
55994E932183K04198K16639K28250K41657K58119K74894K90633L08462L30342
$$ 5932183 6136381 6353020 6581270 6822927 7081046 7355940 7646573 7955035 8285377
55985H285377L53607L76614M02370M32893M65684M99699N38740N84873O34992
$$ 8285377 8638984 9015598 9417968 9850861 10316545 10816244 11354984 11939857 12574849
55976A2574849O88198P49566Q22021R02154R89318J090665J211544J349828J506396
$$ 12574849 13263047 14012613 14834634 15736788 16726106 17816771 19028315 20378143 21884539
55967B1884539J691746J915026K176593K479961K840721L275038L791063M401773
$$ 21884539 23576285 25491311 27667904 30147865 32988586 36263624 40054687 44456460
55959D4456460N133249O008615P038275Q239782R652408J1318765J3272277J5557621
$$ 44456460 49589709 55598324 62636599 70876381 80528789 91847554 105119831 120677452
55951A20677452J8226566K1265758K4528827K7742393L0503182L2174393L1830598
$$ 120677452 138904018 160169776 184698603 212440996 242944178 275118571 306949169
55944C06949169K8517378K1787895J2098228P23878j0689996k0596408k7863410
$$ 306949169 335466547 357254442 369352670 370076548 359386552 338790144 310926734
55937C10926734l1972720l3082717l1867462k9185299k5791975k2234719j8866198
$$ 310926734 278954014 245871297 214003835 184818536 159026561 136791842 117925644
55930A17925644j5873449j3311617j1163144r389614p942724o761064n785843
$$ 117925644 102052195 88740578 77577434 68187820 60245096 53484032 47698189
55923D7698189m977466m307869l747302l269885k862918k519243k226652j972876
$$ 47698189 42720723 38412854 34665552 31395667 28532749 26013506 23786854 21813978
55915B1813978j753500j566246j403553j258217j130271j021214r26821q41998
$$ 21813978 20060478 18494232 17090679 15832462 14702191 13680977 12754156 11912158
55907A1912158p67037p02950o45823n91787n42670n01097m64660m30048l98350
$$ 11912158 11145121 10442171 9796348 9204561 8661891 8160794 7696134 7266086 6867736
55898F867736l71128l45852l20210k96543k77077k59017k39292k20010k04316
$$ 6867736 6496608 6150756 5830546 5534003 5256926 4997909 4758617 4538607 4334291
55889D334291j90707j76390j62598j51614j41839j30654j19172j09506j00161
$$ 4334291 4143584 3967194 3804596 3652982 3511143 3380489 3261317 3151811 3051650
55880C051650q8852p7454o9656o5782o3850o3650o5824o8991p1430p3838p7080
$$ 3051650 2962798 2885344 2815688 2749906 2686056 2622406 2556582 2487591 2416161 2342323 2265243
55869B265243p9356p8810p6801p5354p3536o9707o5127o1864n9126n5103n0634
$$ 2265243 2185887 2107077 2030276 1954922 1881386 1811679 1746552 1684688 1625562 1570459 1519825
55858A519825m7610m5398m2171l8325l5451l3341l0958k8890k7990k7185k5401
$$ 1519825 1472215 1426817 1384646 1346321 1310870 1277529 1246571 1217681 1189691 1162506 1137105
55847A137105k4148k5174k7119k7435k6237k5327k4757k3421k1908k1639k2004
$$ 1137105 1112957 1087783 1060664 1033229 1006992 981665 956908 933487 911579 889940 867936
55836H67936k1228j9327j7729j6633j5211j3737j3152j3126j2637j1749j0984
$$ 867936 846708 827381 809652 793019 777808 764071 750919 737793 725156 713407 702423
55825G02423r915q224p131p777r267j0192j0842j2026j2998j2641j1559j0865
$$ 702423 692508 684284 677153 669376 660109 649917 639075 627049 614051 601410 589851 578986
55813E78986j0193q881p827p997q337p426n927n185m681l215j431o49k69J151
$$ 578986 568793 559912 552085 544088 535751 528325 522398 517213 512532 509317 507886 507237 506968 508119
55799E08119L142M110M048M094M077K915Q62q12j802k563k903k713l044m463n440
$$ 508119 511261 515371 519419 523513 527590 530505 531367 530555 528753 526190 523287 520574 517530 513067 507627
55784E07627m535l065l173m544n578o720r612j3686j6558j7445j7447j6789j4621
$$ 507627 503092 500027 496854 492310 486732 480012 470400 456714 440156 422711 405264 388475 373854
55771C73854j1364q587o512m101j522j08O7K17M70j31j317j703j308j575k736
$$ 373854 362490 353903 347391 343290 341768 341660 341727 341944 342414 342283 340966 339263 337955 336380 333644
55756C33644l402l027k532k362k082k057l271n156n830m863l798l615l742l821
$$ 333644 330242 327215 324683 322321 320239 318182 314911 309755 303925 299062 295264 291649 287907 284086
55742B84086m295m793m148k553j644j918k064j377q26j007j059l97K59M01N31
$$ 284086 279791 274998 270850 268297 266653 264735 262671 261294 260468 259461 258402 258005 258264 258665 259196
55727B59196P75L01j159k696l808m993o304o962o930p147p565o881m888l203k657
$$ 259196 259971 260272 259113 256417 252609 247616 241312 234350 227420 220273 212708 205827 200939 197736 195079
55712A95079j921Q2K186K851K502K372K306J375k42j560k343l025l546l570l496
$$ 195079 193158 193240 195426 198277 200779 203151 205457 206832 206590 205030 202687 199662 196116 192546 189050
55697A89050m077n232o081o089n523m876m402m031l438k367j006K03J162K066
$$ 189050 184973 179741 173660 167571 162048 157172 152770 148739 145301 142934 141928 142131 143293 145359
55683A45359K825L109L026L053L306L498L646M001M271L748K398J001J29l35n74
$$ 145359 148184 151293 154319 157372 160678 164176 167822 171823 176094 179842 182240 183241 183370 183035 182461
55668A82461n32l55l57m82m73m61o33n59K10J113J217P43P31J285J486J031O46
$$ 182461 181929 181574 181217 180735 180262 179801 179168 178609 178819 179932 181149 181892 182623 183908 185394 186425 187071
55651A87071O98P44O68R48J490J463O65j89q51j905l407m420m469m224m276m358
$$ 187071 187769 188513 189181 190129 191619 193082 193747 193558 192707 190802 187395 182975 178506 174282 170006 165648
55635A65648m256m352m716m743m188l513k917k160j598j997k931k943j832j180
$$ 165648 161392 157040 152324 147581 143393 139880 136963 134803 133205 131208 128277 125334 123502 122322
55621A22322j753k124j028M92P07k08q70j015j463k318k741k406j887j632j464
$$ 122322 120569 118445 117417 117909 118616 118408 117538 116523 115060 112742 110001 107595 105708 104076 102612
55606A02612j179q88p93j008j483j833j599q70k71j06j47k75n74o51J07J290J543
$$ 102612 101433 100545 99752 98744 97261 95428 93829 92959 92688 92582 92435 92160 91586 90935 91042 92332 93875
55589I3875M52p60r28l35K40O80R55N41n31j036j34J249J753J525J653K295K678
$$ 93875 94327 93567 92639 92304 92544 93224 94179 94720 94189 93153 93019 94268 96021 97546 99199 101494 104172
55572A04172K574K518K789L233L857M661N062M408K912J338J6j083j685j572j368
$$ 104172 106746 109264 112053 115286 119143 123804 128866 133274 136186 137524 137540 136457 134772 133200 131832
55557A31832j995l367m534n014n215n438n306m435l069j812j053q23r28j141j328
$$ 131832 129837 126470 121936 116922 111707 106269 100963 96528 93459 91647 90594 89771 88843 87702 86374
55542H6374j389j096l54M09N76K08M8M42Q72Q50O43O64P81P57P25P27L39o35j612
$$ 86374 84985 83889 83535 83944 84520 84728 84776 85218 86090 86940 87583 88247 89028 89785 90510 91237 91576 90941 89329
55523H9329j960j829j744j822j958k221k473k173j218m73p11j472j701j110k48
$$ 89329 87369 85540 83796 81974 80016 77795 75322 73149 71931 71458 70747 69275 67574 66464 66216
55508F6216M12O66L09n41j144r08k21J62L04Q56J918K837L077K671J961J374J324
$$ 66216 66628 67294 67603 67062 65918 65010 64789 64951 65255 66111 68029 70866 73943 76614 78575 79949 81273
55491H1273J737J908J262Q8q69j255j117o14j55k94r11j050k91L85r5j210j536
$$ 81273 83010 84918 86180 86268 85399 84144 83027 82413 82258 81964 81053 80003 79712 80097 80002 78792 77256
55474G7256p63J11L68K69J84M5j87l20l90o60j067j252j175j122j135j014p99
$$ 77256 76493 76604 76972 77241 77425 77470 77283 76963 76573 75913 74846 73594 72419 71297 70162 69148 68349
55457F8349o87n43j60R2l66j274j677j197n16l98p75j047q32k12M41P53O89O05
$$ 68349 67662 67119 66959 67051 66685 65411 63734 62537 62021 61623 60848 59801 58969 58757 59198 59951 60640 61245
55439F1245O98O69K69j15K2M22M05o5l57k17j04l97q35r72o81j34L35K86m17j187
$$ 61245 61943 62612 62881 62766 62788 63210 63615 63550 63193 62976 62872 62475 61640 60668 59987 59853 60188 60474 60057 58870
55419E8870j143j39J018J499J278R24Q46Q96O07j81r13p60L53J474J641R36K22
$$ 58870 57727 57588 58606 60105 61383 62307 63153 64049 64656 64475 63562 62802 63155 64629 66270 67206 67428
55402F7428Q6M44R12J213J310J371J457J198K39r88j629j669j918k386j906j07
$$ 67428 67514 67958 68870 70083 71393 72764 74221 75419 75658 74670 73041 71372 69454 67068 65162 65055
55386F5055J415J166k6k64O56J332J146P26L45m11j189r52J37N52k82j105q71
$$ 65055 66470 67636 67610 67346 68002 69334 70480 71206 71551 71140 69951 68999 69136 69688 69406 68301 67430
55369F7430k48j56k11K18N49n6j075j260m27N20R80J017O56j15p90p13r4K00j16
$$ 67430 67182 67026 66815 67033 67582 67526 66451 65191 64764 65284 66264 67281 67937 67822 67032 66319 66225 66425 66309
55350F6309l68L1P94J156P42j23o91m35L23N93j48j189j419p52j50k49n77m07
$$ 66309 65941 65972 66766 67922 68664 68541 67850 67415 67738 68331 68183 66994 65575 64823 64673 64424 63847 63440
55332F3440J37L01k12q06p82k33J00k02o78n71J88R14J008N64M9l22o02p51o54
$$ 63440 63577 63878 63666 62860 62078 61845 61945 61743 61065 60494 60682 61596 62604 63168 63217 62895 62293 61542 60888
55313F0888m60n01p72p17P5J139J502Q54k2k38J13L13J54R5L46N89P39J211K038
$$ 60888 60428 59927 59155 58438 58513 59652 61154 62008 61986 61748 61861 62174 62328 62423 62769 63358 64097 65308 67346
55294F7346K435J887J029P14O50p5j422k323k200j576j080o68j79J42J00KJ89
$$ 67346 69781 71668 72697 73411 74061 73986 72564 70241 68041 66465 65385 64717 64538 64680 64780 64782 64971
55277F4971N10O58O84P65P56L52l98j099j400j192n24L80J067J092M77k42n05
$$ 64971 65481 66139 66823 67588 68344 68696 68298 67199 65799 64607 64083 64463 65530 66622 67099 66857 66352
55260F6352l28k02l87m93q4N70Q25O26N16N85K38o44j118m66O66J152R38P47P44
$$ 66352 66024 65822 65435 64942 64858 65428 66253 66879 67395 67980 68218 67574 66456 65990 66656 67808 68746 69493 70237
55241G0237M76l3k72k33m08p09m87K65O71K90k40l12k36n11r31j006p36m47k46
$$ 70237 70713 70680 70408 70175 69767 69058 68571 68836 69507 69797 69557 69245 69009 68498 67567 66561 65825 65378 65132
55222F5132o7Q5K66O10R85J023O98M15L24J17k86m34p0M05N34L66J39j56n14p06
$$ 65132 65065 65150 65416 66026 67011 68034 68732 69147 69471 69588 69302 68868 68798 69203 69737 70103 70242 70086 69572 68866
55202F8866o62o03n32j39M81O56N8p12r18n03K53J194J929J715M52p82r00p6P72
$$ 68866 68204 67601 67069 66930 67411 68067 68125 67413 66495 65992 66245 67439 69368 71083 71535 70753 69853 69777 70549
55183G0549J263J511J304L77p59j191q03k76J9L25O57N38j95r06q95j90N33O35
$$ 70549 71812 73323 74627 75004 74245 73054 72251 71975 71994 72319 72976 73514 73319 72413 71518 71328 71861 72496
55165G2496Q1m26n9J077J777J155j38p34l63P2L3k3K27K89j86o37m12K14N25M00
$$ 72496 72577 72151 72092 73169 74946 76101 75963 75229 74866 74938 74971 74948 75175 75464 75278 74641 74229 74443 74968 75368
55145G5368K53K16P9j78l74n19o58m42N33J861K409J588J25p21n23L6J21l74q82
$$ 75368 75621 75837 75916 75738 75364 74845 74187 73745 74278 76139 78548 80136 80261 79540 79017 79053 79174 78800 77918
55126G7918r01m52J13N61Q90J037Q13K61j62o2L29M23L7m53p28p93o04K9Q67J156
$$ 77918 77017 76565 76678 77239 78129 79166 79979 80240 80078 80016 80345 80768 80805 80352 79624 78831 78227 78256 79123 80279
55106H0279N87p3O3P30R02L33j78r1J71R9j31j85k28m45m25L07J441K154K052
$$ 80279 80866 80793 80856 81586 82488 82821 82643 82552 82723 82822 82691 82506 82278 81833 81408 81715 83156 85310 87362
55087H7362J403O59J43J7R4p1n66q27m25K57N95O27P04O98K98j44PN40N09l93
$$ 87362 88765 89424 89567 89584 89678 89607 89041 88214 87789 88046 88641 89268 89972 90670 90968 90824 90831 91371 91880 91487
55067I1487j391j705j373q44m38l71o73q40k52Q51J430J000K25q3M2J70K28L77
$$ 91487 90096 88391 87018 86174 85736 85365 84692 83852 83600 84451 85881 86881 87106 87023 87065 87235 87463 87840
55049H7840N85P73J013J204R60J88n71p63m62j72l02r62j852k239j538j83P09
$$ 87840 88425 89198 90211 91415 92375 92563 91992 91229 90767 90595 90293 89331 87479 85240 83702 83519 84228
55032H4228P41O14Q45R01K60m88m45J75L60k29r15j063p59l72p9N6nr7P6N65J017
$$ 84228 84969 85583 86428 87329 87589 87101 86656 86831 87191 86962 86047 84984 84225 83853 83774 83830 83825 83728 83804 84369 85386
55011H5386R65K49p11j175p69rK68l3k26Q6N00O30P57J205J667J683J374J090
$$ 85386 86351 86600 85889 84714 83945 83936 84204 84171 83945 84031 84531 85161 85918 87123 88790 90473 91847 92937
54993I2937P74K07l75n52l57j34M0K67L47o2q48j456j441p74J90Q61Q13L40K01
$$ 92937 93711 93918 93543 92991 92634 92500 92540 92807 93154 93092 92244 90788 89347 88573 88763 89624 90437 90777 90978
54974I0978N47O56P5n64m61K14Q09J253J796K113J676P61J29j65o70j315j322
$$ 90978 91525 92181 92256 91692 91231 91445 92254 93507 95303 97416 99092 99853 99982 99817 99147 97832 96510
54957I6510n01K86L09r1j17M70J254J631J200Q8r61j165n37J51J65o31j839k662
$$ 96510 96009 96295 96604 96513 96396 96866 98120 99751 100951 101039 100078 98913 98376 98527 98692 98061 96222 93560
54939I3560k251n49J258J792R37k45q54p85k17O26J191J027O50J072K274L087
$$ 93560 91309 90760 92018 93810 94747 94502 93648 92863 92646 93272 94463 95490 96140 97212 99486 102573
54923A02573K907K555K898L619M087M535N439O351O500O177O404P140P012N088
$$ 102573 105480 108035 110933 114552 118639 123174 128613 134964 141464 147641 154045 161185 168197 173285
54909A73285K159l01j820l015m339n479o006o071o092o077n650m694l593k776
$$ 173285 175444 175143 173323 170308 165969 160490 154484 148413 142321 136244 130594 125900 122307 119531
54895A19531k314k115k129k175j880j160m93l29m70m32j62Q1L76J028J883K390
$$ 119531 117217 115102 112973 110798 108918 107758 107265 106936 106466 106034 105872 105953 106329 107357 109240 111630
54879A11630K455K645L350M305N148N935O761P318P186O380N301M343L656L119
$$ 111630 114085 116730 120080 124385 129533 135468 142229 149547 156733 163113 168414 172757 176413 179532
54865A79532K356J036q07k877n017p097q608q863p878o524n565m909m142l352
$$ 179532 181888 182924 182117 179240 174223 167126 158518 149655 141777 135253 129688 124779 120637 117285
54851A17285k954k897k575j593l21L95K1j146k186k411j992j601j543j506j160
$$ 117285 114331 111434 108859 107266 106945 107340 107361 106215 104029 101618 99626 98025 96482 94976 93816
54836I3816n82PN68J043J155P05p7p04q86o76k81J53O19J095J313R17J1o63n78
$$ 93816 93234 93241 93809 94852 96007 96712 96635 95931 95045 94369 94088 94241 94860 95955 97268 98185 98196 97533 96955
54817I6955j93l12q10p71N5P78O67J61m0p6m10p09k37Q35J469J195O68N57O21
$$ 96955 96762 96450 95640 94869 94924 95702 96369 96530 96490 96414 96004 95295 95058 95893 97362 98557 99225 99782 100403
54798A00403L19j79j44O71J662J980J301%j141j410o95L80R94R49P93J004J320
$$ 100403 100722 100543 100399 101070 102732 104712 106013 106013 104872 103462 102767 103147 104141 105090 105883 106887 108207
54781A08207J157N41J24K61N52N54M59O70J046J122R32J005J618K462L202L882
$$ 108207 109364 109905 110029 110290 110842 111396 111855 112525 113571 114693 115625 116630 118248 120710 123912 127794
54765A27794M623N307N709N785N718N805O216O645O366M988L098J594N34q22k777
$$ 127794 132417 137724 143433 149218 154936 160741 166957 173602 179968 184956 188054 189648 190182 189360 186583
54750A86583m644n729o177o508o770o668o154n413m489l333k107j117n83o22j207
$$ 186583 181939 176210 170033 163525 156755 150087 143933 138520 134031 130698 128591 127474 126891 126269 125062
54735A25062j882j902j051m1L61L13N65J269J801J755J506J594K085K756L545
$$ 125062 123180 121278 120227 120186 120547 120860 121425 122694 124495 126250 127756 129350 131435 134191 137736
54720A37736M378M914M849M492M505N017N368M914L782K468J008r34l167m812
$$ 137736 142114 147028 151877 156369 160874 165891 171259 176173 179955 182423 183431 182497 179330 174518
54706A74518n332n198n121n065m568l751l282l384l533l275k765k338k017j717
$$ 174518 169186 163988 158867 153802 149234 145483 142201 138817 135284 132009 129244 126906 124889 123172
54692A23172j539j620j960k513l085l146k245q29jj65n23l20n4o94k054k793k031
$$ 123172 121633 120013 118053 115540 112455 109309 107064 106235 106234 106069 105546 105226 105172 104478 102424 99631 97600
54675I7600k92J305K169K341J922R94r2q32j090j253j632j906j520n96K4j48n65
$$ 97600 97308 98613 100782 103123 105045 106039 105947 105115 104025 102772 101140 99234 97714 97118 97142 96994 96429
54658I6429n10j43j07l18j3R40J692J631J204J053J031P01K61K36N17M91K7l25
$$ 96429 95919 95776 95669 95351 95338 96278 97970 99601 100805 101858 102889 103590 103851 104087 104604 105095 105122 104797
54640A04797j86J23O0m76j056j135n41K85O51L88R1L53R45J127N76l25j017j269
$$ 104797 104611 104734 104794 104318 103262 102127 101586 101871 102522 102910 103001 103354 104299 105426 106002 105677 104660 103391
54622A03391j112p10k60J21M31N71L50j46m46l04j42m29q02m33P80J951K277J844
$$ 103391 102279 101569 101309 101430 101861 102432 102782 102636 102190 101886 101744 101315 100513 100080 100860 102811 105088 106932
54604A06932J222P13L51K11K94L10m2o19r83r84r27j139j497j547r85k0Q09J137
$$ 106932 108154 108867 109218 109429 109723 110033 109991 109372 108389 107405 106478 105339 103842 102295 101310 101290 102099 103236
54586A03236J077R48P42J37q70j616j343j19J168J753J557P93m25j730k214j346
$$ 103236 104313 105261 106003 106140 105270 103654 102311 102192 103360 105113 106670 107463 107038 105308 103094 101748
54570A01748Q8P40M27K61Q30J258O53l86o30L4P20J055J411J798J662R49L82L92
$$ 101748 101836 102576 103003 103264 104094 105352 106005 105619 104989 105023 105743 106798 108209 110007 111669 112618 113000 113392
54552A13392O05O60O66O32K18m70p18k34L91O78R56J475J726J346R79J346K026
$$ 113392 113997 114657 115323 115955 116173 115703 114985 114751 115142 115820 116776 118251 119977 121323 122302 123648 125674
54535A25674K091J523J012P16J80o34j181j234j140j135j048p84n65n69p90j174
$$ 125674 127765 129288 130300 131016 131196 130562 129381 128147 127007 125872 124824 124040 123475 122906 122116 120942
54519A20942j480j203k10O94N60l58q14k03P00Q09j3r96j332q11N1M22%o16p11
$$ 120942 119462 118259 118049 118743 119303 118945 118131 117928 118628 119437 119424 118428 117096 116285 116336 116758 116758 116142 115431
54500A15431n16q03j557j842j159j19N65J047J732K293K064J150M43M48O73L75
$$ 115431 114915 114112 112555 110713 109554 109435 110000 111047 112779 115072 117136 118286 118729 119177 119850 120225
54484A20225m33j005p86L5R33J725K525L163L100K177J023L72K73K99L13M89P26
$$ 120225 119792 118787 118001 118036 118969 120694 123219 126382 129482 131659 132682 133054 133327 133626 133939 134428 135154
54467A35154N79j06r38j416j362r16m04j10N9N63J534K273J963Q07j15j98K7k42
$$ 135154 135733 135627 134689 133273 131911 130995 130591 130481 130540 131103 132637 134910 136873 137680 137565 137367 137394 137152
54449A37152j025j595j297j99Q43P83n62k073k335j195J54O27L48Q6K02M28M14
$$ 137152 136127 134532 133235 133036 133879 134662 134100 132027 129692 128497 128651 129278 129626 129712 129914 130342 130756
54432A30756Q0l88o66n11L8P46J323J351L93j297k413j666N74K414K446J073l47
$$ 130756 130836 130448 129782 129271 129309 130055 131378 132729 133122 131825 129412 127746 128320 130734 133180 134253 133906
54415A33906j042j081p35k44O9Pk55m45n30n82n54m60m53m36JR16J688J719J216
$$ 133906 132864 131783 131048 130804 130873 130880 130625 130180 129650 129068 128514 128054 127601 127165 127166 128082 129770 131489 132705
54396A32705P78N82M85N86J043J499J469J155J211J595J472M78o10r01n56m02
$$ 132705 133483 134065 134550 135136 136179 137678 139147 140302 141513 143108 144580 145058 144448 143547 142991 142589
54380A42589p27j045r27n07j03J81L49L47K62M60J163J986K180J485N94N14J488
$$ 142589 141862 140817 139890 139383 139280 139461 139810 140157 140419 140879 142042 144028 146208 147693 148287 148801 150289
54363A50289K704L124K508J475P11K97j16o48r77p61m9Q46J706K453K884K716
$$ 150289 152993 156117 158625 160100 160811 161108 160992 160344 159367 158606 158557 159403 161109 163562 166446 169162
54347A69162J942R47O4p35j539k184k481k651l134l844m066l245j737m96j47n12
$$ 169162 171104 172051 172115 171380 169841 167657 165176 162525 159391 155547 151481 148236 146499 146003 145856 145344
54331A45344j009j245j159q75n50l29j97M2M66P38L85n11j253j283p71j85M01
$$ 145344 144335 143090 141931 141056 140506 140177 139980 140022 140488 141226 141611 141100 139847 138564 137793 137608 138009
54314A38009J091J540J188J68o41o50k00L4j30m07m86k42J48J31p16j918k347
$$ 138009 139100 140640 141828 141996 141355 140705 140505 140539 140409 140002 139516 139274 139422 139553 138837 136919 134572
54297A34572j577m69qj12r0J93L39K01l9l84q93j195q12L9O63Q59J054J376J318
$$ 134572 132995 132526 132518 132406 132316 132509 132848 133049 133010 132626 131733 130538 129726 129765 130428 131287 132341 133717 135035
54278A35035N34n27j114r34k50N04J029J270J333J178N91l46r87p98p9L62K45
$$ 135035 135569 135042 133928 132994 132744 133248 134277 135547 136880 138058 138649 138303 137316 136518 136439 136801 137046
54261A37046jrR2N8p5r1J81P45J353J646J617J670J944J988J473P91L82m1q65
$$ 137046 137045 137036 137128 137186 137111 137020 137201 137946 139299 140945 142562 144232 146176 148164 149637 150428 150810 150769 149904
54242A49904j575j425p69o55j169j358q68m63n94o30l1O81P97M66J70j51p25j251
$$ 149904 148329 146904 146135 145480 144311 142953 142085 141622 141028 140398 140367 141048 141845 142311 142481 142330 141605 140354
54224A40354j316j131j141j236r69l50J63L64N02P59R49P90K73k85n43n08m80
$$ 140354 139038 137907 136766 135530 134561 134211 134374 134738 135240 135999 136948 137738 138011 137726 137183 136675 136195
54207A36195n40l72J78O50N55Q4k92o22j166j569j244m62j13l25l52J48P28J194
$$ 136195 135655 135283 135461 136111 136666 136750 136458 135836 134670 133101 131857 131395 131282 130957 130605 130753 131481 132675
54189A32675J860K454K019M27j077j450r99l64M61J411J721J060M04P16J437J354
$$ 132675 134535 136989 139008 139435 138358 136908 135909 135545 136006 137417 139138 140198 140602 141318 142755 144109
54173A44109L91n07p93o59l37qp2o61j167j014n81n83r69j173j042p62k71M12
$$ 144109 144500 143993 143200 142541 142204 142196 142124 141463 140296 139282 138701 138118 137149 135976 134934 134172 133901 134313
54155A34313P44M21J17N66J300J330O14j08o18j185j560j196l64J05J34K91M73
$$ 134313 135057 135478 135595 136161 137461 138791 139405 139297 138679 137494 135934 134738 134374 134479 134613 134904 135377
54138A35377r3j317k009j483m08L37P00R55J074J052J216J637J858J559J049P85
$$ 135377 135284 133967 131958 130475 130067 130404 131104 132059 133133 134185 135401 137038 138896 140455 141504 142289
54122A42289P44O41L13j74n12k71N69J256J066L42Q6N54R81Q38M95M31M88L11
$$ 142289 143033 143674 143987 143813 143301 143030 143599 144855 145921 146263 146349 146903 147884 148722 149217 149648 150136 150447
54104A50447j1j39L5L28M81L29J7o1J87L17R7R7P63J376Q80l51q21j00N25n2j218
$$ 150447 150436 150297 150332 150660 151141 151470 151487 151426 151613 151930 152027 152124 152887 154263 155143 154792 153971 153871 154396 154344 153126
54083A53126j639r31L07J443K138K230J914J728J930K176K087J831J790K094K666
$$ 153126 151487 150556 150863 152306 154444 156674 158588 160316 162246 164422 166509 168340 170130 172224 174890
54068A74890L379L959M143M087M163M182L433J727j08j203j621k026k754l551
$$ 174890 178269 182228 186371 190458 194621 198803 202236 203963 203855 202652 201031 199005 196251 192700
54054A92700l933l555k505j424r91j196j406j142l81P97K233L290L237K251J442
$$ 192700 188767 185212 182707 181283 180292 179096 177690 176548 176167 176964 179197 182487 185724 187975 189417
54039A89417J606K527L638M699N510N759N522N376N558N618N237M747M479M198
$$ 189417 191023 193550 197188 201887 207397 213156 218678 224054 229612 235230 240467 245214 249693 253891
54025B53891L712L349L372L395K988K389K046J893J612J214Q62L70n29j712k802
$$ 253891 257603 260952 264324 267719 270707 273096 275142 277035 278647 279861 280723 281093 280564 278852 276050
54010B76050l558l890l862l925m696o057o992o664n320l829k735k093j754j458
$$ 276050 272492 268602 264740 260815 256119 250062 243070 236406 231086 227257 224522 222429 220675 219217
53996B19217j030p23r10j315j182m05L59Q44J444J908J100j123k959k787j398
$$ 219217 218187 217464 216554 215239 214057 213652 214011 214855 216299 218207 219307 218184 215225 212438 211040
53981B11040p87j435k205k437k585k818k531j527o11n13j063j668j960j782j125
$$ 211040 210253 208818 206613 204176 201591 198773 196242 194715 194104 193591 192528 190860 188900 187118 185993
53966A85993k95L11O81R81J059O76J10j14P1M53J151K283L201L023J928J046R92
$$ 185993 185698 186009 186690 187671 188730 189406 189516 189402 189473 189926 191077 193360 196561 199584 201512 202558 203550
53949B03550J318J580J973K700L439L911M256M556M594M386M356M697N073N306
$$ 203550 204868 206448 208421 211121 214560 218471 222727 227283 231877 236263 240619 245316 250389 255695
53935B55695N712O383O747O306N427M901N003N352N479N272M978N038N728O872
$$ 255695 261407 267790 274537 280843 286270 291171 296174 301526 307005 312277 317255 322293 328021 334893
53921C34893Q073R233J0406J1166J0649Q520N467K541L01j165j815j607p20L91
$$ 334893 342966 352199 362605 373771 384420 392940 398407 400948 401249 400084 398269 396662 395942 396333
53907C96333J119R74R2o35m60J76O3j181k556l049k881k914l364l733l788l894
$$ 396333 397452 398426 398518 397883 397423 397599 397662 396481 393925 390876 387995 385081 381717 377984 374196 370302
53891C70302m403n168n759n932n857n974o545p256p455o939o252n992o064n894
$$ 370302 365899 360731 354972 349040 343183 337209 330664 323408 315953 309014 302762 296770 290706 284812
53877B84812n217m370l872l928m308m537m325l927l904m361m676m234l305k781
$$ 284812 279595 275225 271353 267425 263117 258580 254255 250328 246424 242063 237387 233153 229848 227067
53863B27067l011l294k751j441l16j14o70j422k114k717k898k345j511j367k083
$$ 227067 224056 220762 218011 216570 216254 216140 215470 214048 211934 209217 206319 203974 202463 201096 199013
53848A99013k642k162j032j74K54O27Q04L99j42Q4Q66Q83l47j569j501n53o0m20
$$ 199013 196371 194209 193177 193003 193257 193884 194688 195087 194945 195029 195895 196778 196431 194862 193361 192808 192748 192328
53830A92328r01q69l73L20J044J584J742J565J145L88o25j310j115k43O38J259
$$ 192328 191427 190558 190185 190505 191549 193133 194875 196440 197585 197973 197348 196038 194923 194680 195318 196577
53814A96577J800K185J991J184M75O79J919L498M406M085L017K420L054M368N237
$$ 196577 198377 200562 202553 203737 204212 204891 206810 210308 214714 218799 221816 224236 227290 231658 236895
53799B36895N363N414N828O149N775M821L879L255K827K442K141K035K129K198
$$ 236895 242258 247672 253500 259649 265424 270245 274124 277379 280206 282648 284789 286824 288953 291151
53785B91151J881J025k5p33r87j169j558k036k420k741l023l170l338l962n040
$$ 291151 293032 294057 294032 293299 292312 291143 289585 287549 285129 282388 279365 276195 272857 268895 263855
53770B63855n756n346m153l294l347l847m078l855l378k792k167j590j074n68
$$ 263855 258099 252753 248600 245306 241959 238112 234034 230179 226801 224009 221842 220252 219178 218610
53756B18610k47m90j346k202k369j883j459j622k132k341j950j278q01n92l57
$$ 218610 218363 217873 216527 214325 211956 210073 208614 206992 204860 202519 200569 199291 198490 197898 197541
53741A97541k3J4n76j391j622j011j23M62P65R78R36N04J11L03Q89J198J094J138
$$ 197541 197518 197532 196956 195565 193943 192932 192809 193271 194036 195014 195950 196454 196565 196868 197757 198955 200049 201187
53723B01187J558J754J200L21oL83P85O16J12J0O85J772K529K547K072J668J589
$$ 201187 202745 204499 205699 206020 206014 206397 207182 207798 207910 207920 208605 210377 212906 215453 217525 219193 220782
53706B20782J616J523J488J915K845L723L808K950J834J362J652J993J843J572
$$ 220782 222398 223921 225409 227324 230169 233892 237700 240650 242484 243846 245498 247491 249334 250906
53692B50906J855K607L098K963K525K135J745J252P65L10k58q87j348j707k270
$$ 250906 252761 255368 258466 261429 263954 266089 267834 269086 269851 270161 269903 269016 267668 265961 263691
53677B63691k815k572j277K98J252J490J340Q28n5q35j001p18n23n58o26o93p68
$$ 263691 260876 258304 257027 257325 258577 260067 261407 262235 262180 261345 260344 259626 259103 258545 257919 257226 256458
53660B56458n61J17Q27R97P66O61O40K37m44o65j06O55Q99M54l82j146j363q76
$$ 256458 255897 256014 256841 257838 258604 259265 259905 260142 259698 259033 258927 259582 260481 260935 260553 259407 258044 257168
53642B57168p3N88J169J894K409K158J350P73O34M13QP0R16J902K302K188J965
$$ 257168 257095 257683 258852 260746 263155 265313 266663 267436 268070 268483 268491 268561 269477 271379 273681 275869 277834
53625B77834J672J264J055J389K173L014L511L267K195J009Q57K061L781N182
$$ 277834 279506 280770 281825 283214 285387 288401 291912 295179 297374 298383 299240 301301 305082 310264
53611C10264O212O856O576N199L760L444M073M467M109L650L811M461M885M432
$$ 310264 316476 323332 329908 335107 338867 342311 346384 350851 354960 358610 362421 366882 371767 376199
53597C76199K953R93n15j118j263j556j873j725j181q08q29r45j007j261j793
$$ 376199 379152 380145 379630 378512 377249 375693 373820 372095 370914 370106 369277 368332 367325 366064 364271
53582C64271k210k078j403o21k58m96r37r81o00l98o62q35m37N9j0l19j20L45
$$ 364271 362061 359983 358580 357959 357701 357205 356268 355287 354687 354289 353627 352792 352355 352414 352404 352085 351965 352310
53564C52310J10p79j032K9J409J805J220N00K3l60n36j67O60J483K095K541K668
$$ 352310 352420 351641 350609 350638 352047 353852 355072 355572 355595 355235 354699 354532 355192 356675 358770 361311 363979
53547C63979K281J716J633K179K807L092L232L547L918M034L926L944M299M856
$$ 363979 366260 367976 369609 371788 374595 377687 380919 384466 388384 392418 396344 400288 404587 409443
53533D09443N333N591N800O340P440Q809R815J0180J0329J0891J1944J2997J3674
$$ 409443 414776 420367 426167 432507 439947 448756 458571 468751 479080 489971 501915 514912 528586
53520E28586J4082J4471J4816J4906J4778J4825J5455J6764J8459K0081K1315
$$ 528586 542668 557139 571955 586861 601639 616464 631919 648683 667142 687223 708538
53509G08538K2197K2990K3790K4347K4373K3933K3414K3167K3274K3594K3832
$$ 708538 730735 753725 777515 801862 826235 850168 873582 896749 920023 943617 967449
53498I67449K3641K2847K1591K0184J8869J7885J7562J7998J8709J8998J8744
$$ 967449 991090 1013937 1035528 1055712 1074581 1092466 1110028 1128026 1146735 1165733 1184477
53487A184477J8498J8616J8747J8350J7510J6848J6760J7056J7224J6888J5987
$$ 1184477 1202975 1221591 1240338 1258688 1276198 1293046 1309806 1326862 1344086 1360974 1376961
53476A376961J4701J3195J1435R281O837M473K407M59j678m032o401q572j0376
$$ 1376961 1391662 1404857 1416292 1425573 1432410 1436883 1439290 1439749 1438071 1434039 1427638 1419066 1408690
53463A408690j1696j2593j3276j3806j3997j3846j3829j4480j5735j7001j7840
$$ 1408690 1396994 1384401 1371125 1357319 1343322 1329476 1315647 1301167 1285432 1268431 1250591
53452A250591j8343j8849j9459j9925j9904j9345j8605j8097j7773j7088j5611
$$ 1250591 1232248 1213399 1193940 1174015 1154111 1134766 1116161 1098064 1080291 1063203 1047592
53441A047592j3563j1631j0278r304q053o078l707j885j161r88l47J013K423L312
$$ 1047592 1034029 1022398 1012120 1002816 994763 988685 984978 983093 981932 980944 980597 981610 984033 987345
53427I87345L836M315M778N413O770Q999J1369J3111J4313J5445J6490J7291J8268
$$ 987345 991181 995496 1000274 1005687 1012457 1021456 1032825 1045936 1060249 1075694 1092184 1109475 1127743
53414A127743J9928K1849K3147K3870K5027K7118K9496L1385L2775L4027L5324
$$ 1127743 1147671 1169520 1192667 1216537 1241564 1268682 1298178 1329563 1362338 1396365 1431689
53403A431689L6829L8745M0873M2577M3610M4514M5884M7672M9502N1158N2462
$$ 1431689 1468518 1507263 1548136 1590713 1634323 1678837 1724721 1772393 1821895 1873053 1925515
53392A925515N3138N3240N3271N3490N3494N2880N1854N0707M9176M6958M4463
$$ 1925515 1978653 2031893 2085164 2138654 2192148 2245028 2296882 2347589 2396765 2443723 2488186
53381B488186M2350M0427L7794L4057K9826K5867K2341J8945J5369J1360O771
$$ 2488186 2530536 2570963 2608757 2642814 2672640 2698507 2720848 2739793 2755162 2766522 2773293
53370B773293J760l290q263j3480j9260k5438l1466l6859m1383m4953m7486m8955
$$ 2773293 2775053 2771763 2763500 2750020 2730760 2705322 2673856 2636997 2595614 2550661 2503175 2454220
53358B454220m9606n0026n0734n1572n1745n0653m8558m6181m3821m1334l8905
$$ 2454220 2404614 2354588 2303854 2252282 2200537 2149884 2101326 2055145 2011324 1969990 1931085
53347A931085l7336l7288l8446l9672l9970l9205l7993l6921l5846l4047l1181
$$ 1931085 1893749 1856461 1818015 1778343 1738373 1699168 1661175 1624254 1588408 1554361 1523180
53336A523180k7860k5022k2904k0994j8975j7170j5934j5089j4271j3511j3099
$$ 1523180 1495320 1470298 1447394 1426400 1407425 1390255 1374321 1359232 1344961 1331450 1318351
53325A318351j3105j3359j3740j4122j4221j3857j3274j2810j2363j1599j0562
$$ 1318351 1305246 1291887 1278147 1264025 1249804 1235947 1222673 1209863 1197500 1185901 1175339
53314A175339r576q566p073n113l343k061p05J179K985L858M045M655O061P533
$$ 1175339 1165763 1157197 1150124 1145011 1141668 1139607 1138902 1140081 1143066 1146924 1150969 1155624 1161685 1169218
53300A169218Q585R825J1917J4419J6375J7703J9217K1338K3489K4898K5489K5688
$$ 1169218 1177803 1187628 1199545 1213964 1230339 1248042 1267259 1288597 1312086 1336984 1362473 1388161
53288A388161K5691K5258K4160K2568K0950J9614J8410J6936J4994J2751J0430
$$ 1388161 1413852 1439110 1463270 1485838 1506788 1526402 1544812 1561748 1576742 1589493 1599923
53277A599923Q040N529K972L78k514n965r746j3211j5755j7145j7586j7759j8607
$$ 1599923 1607963 1613492 1616464 1616842 1614328 1608363 1598617 1585406 1569651 1552506 1534920 1517161 1498554
53264A498554k0574k3070k5131k6527k7766k8998k9618k9286k8621k8310k8073
$$ 1498554 1477980 1454910 1429779 1403252 1375486 1346488 1316870 1287584 1258963 1230653 1202580
53253A202580k7176k5723k4555k3985k3496k2817k2474k2851k3403k3460k3225
$$ 1202580 1175404 1149681 1125126 1101141 1077645 1054828 1032354 1009503 986100 962640 939415
53242I39415k3270k3405k2947k1974k1337k1201k0532j8576j6076j4348j3571
$$ 939415 916145 892740 869793 847819 826482 805281 784749 766173 750097 735749 722178
53231G22178j2830j1608j0341r501q997q730r001r897j0774j0880j0343j0040
$$ 722178 709348 697740 687399 677898 668901 660171 651170 641273 630499 619619 609276 599236
53219E99236j0655j2098j3723j4832j5047j4533j3804j3237j2728j1986j0970
$$ 599236 588581 576483 562760 547928 532881 518348 504544 491307 478579 466593 455623
53208D55623r900r008q406q070p806p387o891o686o935p353p631p818q039q112
$$ 455623 445723 436715 428309 420239 412433 405046 398155 391469 384534 377181 369550 361732 353693 345581
53194C45581p751o985o094n327m923n060n448n346m458l504l280l465l099k139
$$ 345581 337830 330845 324751 319424 314501 309441 303993 298647 294189 290685 287405 283940 280841 278702
53180B78702j612k090k877l059k594j916j117k68M6o98j979k624k243j642j581
$$ 278702 277090 275000 272123 269064 266470 264554 263437 263169 263215 262517 260538 257914 255671 254029 252448
53165B52448j745j417o81l65p53j082o26J70K04p51j703j752j160p46p58q18p16
$$ 252448 250703 249286 248605 248240 247487 246405 245779 245949 246153 245402 243699 241947 240787 240041 239283 238465 237749
53148B37749n60k98L09J119J558J275N30j66n22n30l82m13p65j122j019m48J94
$$ 237749 237189 236891 237200 238319 239877 241152 241682 241516 240994 240464 240082 239669 238904 237782 236763 236315 236509
53131B36509O61R66J053Q03M81N87J105J445J218P25M77O46J119J631J729J131
$$ 236509 237170 238136 239189 239992 240473 241060 242165 243610 244828 245553 246030 246676 247795 249426 251155 252286
53115B52286K23k78l06m28p29n61K44Q07M36l35p25j019j890k952l147k326j443
$$ 252286 252509 252231 251925 251497 250768 250207 250451 251258 251694 251359 250634 249615 247725 244773 241626 239300 237857
53098B37857j046p06j09K61k9n49o55m55n56j053j337q46K34J115J161N19o7j25
$$ 237857 236811 236105 235996 236257 236228 235679 235024 234569 234013 232960 231623 230777 231011 232126 233287 233806 233739 233614
53080B33614Ok38p17p43q0O53Q07M56J04q5l99j076j915k395k082j095j67p4q30
$$ 233614 233620 233382 232665 231922 231842 232495 233302 233758 233862 233777 233378 232302 230387 227992 225910 224815 224648 224574 223744
53061B23744j612j629r51l15k37n75q99r91q50m54J85P70Q55M14J5J27M87M58
$$ 223744 222132 220503 219552 219237 219000 218425 217526 216535 215685 215231 215416 216186 217041 217455 217470 217597 218084 218542
53043B18542k7l30j6N22N94M3p04j159j081n24K17P60R52Q94N89k7o39o00K30
$$ 218542 218515 218185 218169 218691 219285 219328 218624 217465 216384 215860 216077 216837 217789 218683 219272 219245 218606 218006 218236
53024B18236J103J261Q61N59M99L57Q2n8q4l05o41o28k00J45J28Q9K84M30K71
$$ 218236 219339 220600 221461 222020 222519 222876 222958 222900 222816 222511 221870 221242 221042 221187 221315 221404 221688 222118 222389
53005B22389K36Q96J994K566K053R62J98k8l05j052j758j524k60J118J731J519
$$ 222389 222625 223521 225515 228081 230134 231096 231294 231266 230961 229909 228151 226627 226367 227485 229216 230735
52989B30735Q61Np14p24R6R23R63N53O13J222J666J749J971K331K126J308R04
$$ 230735 231596 231601 230887 230163 230259 231182 232145 232698 233311 234533 236199 237948 239919 242250 244376 245684 246588
52972B46588J476K073J585L89k63k4L82N22O87R75Q56Oj071j629j546j272j129
$$ 246588 248064 250137 251722 252111 251848 251824 252206 252728 253415 254390 255246 255252 254181 252552 251006 249734 248605
52955B48605r53m56K60O56L06n92j390j663j516j270j119j125j216j111o44k25
$$ 248605 247652 247196 247456 248112 248418 247826 246436 244773 243257 241987 240868 239743 238527 237416 236772 236547
52939B36547m67j221j573j084m34l68o01n11l32p64j568j648n91P33J382J367
$$ 236547 236080 234859 233286 232202 231768 231400 230799 230288 229956 229192 227624 225976 225385 226118 227500 228867
52923B28867J167Q85M04l3p1J87K59o3n16p81q26q21r07j086j204j069o01L6M79
$$ 228867 230034 230919 231323 231290 231219 231406 231665 231602 231086 230305 229479 228658 227751 226665 225461 224392 223791 223827 224306
52904B24306L92j80o94n07L97J286J443R09K34k83o78q75p00l97n33j152j490
$$ 224306 224698 224518 223824 223317 223714 225000 226443 227352 227586 227303 226625 225750 225050 224653 224120 222968 221478
52887B21478q94K79J100J098N26j65o42n82J51J089J363O50l24n20K70J341J966
$$ 221478 220584 220863 221963 223061 223587 223422 222780 222198 222349 223438 224801 225451 225127 224607 224877 226218 228184
52870B28184K040J790J360R33R42J601K349K273J237J03k96l9L38O90J119J370
$$ 228184 230224 232014 233374 234307 235249 236850 239199 241472 242709 242812 242516 242477 242815 243505 244624 245994
52854B45994J015K15l51m61o48j367k318k933l107l074k870k381j804j567j778
$$ 245994 247009 247224 246873 246412 245764 244397 242079 239146 236039 232965 230095 227714 225910 224343 222565
52839B22565k092k202k145k049j822j287n56k9k5m50q85r28m53L74J160J447J014
$$ 222565 220473 218271 216126 214077 212255 210968 210412 210383 210358 209908 209023 208095 207642 208016 209176 210623 211637
52822B11637J38n70p86p86r73j261j194o78j69n8r6K39J017J625J392L60o00n60
$$ 211637 211775 211205 210419 209633 208660 207399 206205 205527 205358 205300 205204 205443 206460 208085 209477 209837 209237 208677
52804B08677M34J311J077j15j292j836j916j807j450q51l78k97l65k66j39k70
$$ 208677 209111 210422 211499 211384 210092 208256 206340 204533 203083 202232 201854 201557 201192 200926 200787 200517
52788B00517n26n59l82k41j12K44P03Q01M16N7K51R05J434J366P55J37L4L93N60
$$ 200517 199991 199432 199050 198809 198697 198941 199644 200445 200861 200918 201169 202074 203508 204874 205629 205766 205800 206193 206753
52769B06753N3q03j247j037o59n39n54m04j16N3M1M6K65P03J116J170P91L69L04
$$ 206753 206806 206003 204756 203719 203060 202521 201967 201563 201447 201500 201541 201587 201852 202555 203671 204841 205632 206001 206305
52750B06305M46L40M9K48J234K321K598K023J317J025J088J268J464J599J579
$$ 206305 206751 207091 207140 207388 208622 210943 213541 215564 216881 217906 218994 220262 221726 223325 224904
52735B24904J495J557J670J447Q12K83L50P60Q20L79J21O48J525J645N07j204
$$ 224904 226399 227956 229626 231073 231885 232168 232518 233278 234098 234477 234598 235246 236771 238416 238923 237719
52719B37719k420k740k498k066j575j146r37q86p70o09o47p99n16M71J578J946
$$ 237719 235299 232559 230061 227995 226420 225274 224337 223451 222681 222072 221425 220626 220110 220581 222159 224105
52703B24105J405N51o1m55r19j481j792j508p45p8Pl01l38K12R78J504J824K171
$$ 224105 225510 226061 226000 225545 224626 223145 221353 219845 219100 219022 219029 218728 218390 218602 219580 221084 222908 225079
52685B25079K459K426K082J596R05j59j350k093k036j336l72M45O98K26o21j257
$$ 225079 227538 229964 232046 233642 234547 234388 233038 230945 228909 227573 227201 227646 228344 228570 227949 226692
52669B26692j433j298r47l53K71N04K83Q1L31R00J324J320R48M39N6KL26R51J693
$$ 226692 225259 223961 223014 222661 222932 223436 223719 223800 224131 225031 226355 227675 228623 229062 229118 229120 229446 230397 232090
52650B32090K255K360K124K012K100J732L91j328k305k330k145k046j502l53M72
$$ 232090 234345 236705 238829 240841 242941 244673 245064 243736 241431 239101 236956 234910 233408 233055 233527
52635B33527J60q22j406j304r40n12P2O15P60P00R88J633K041J914J651J633J590
$$ 233527 233687 232865 231459 230155 229215 228703 228775 229390 230150 230850 231838 233471 235512 237426 239077 240710 242300
52618B42300R83k88j686k454k238j432q51q85j110r46l78K54Q93J642K202K066
$$ 242300 243283 242995 241309 238855 236617 235185 234334 233449 232339 231393 231015 231269 232162 233804 236006 238072
52602B38072J326P13O89R90J185J207J178J057P30J82n42j240j440p89K83Q06
$$ 238072 239398 240111 240800 241790 242975 244182 245360 246417 247147 247329 246787 245547 244107 243318 243601 244407
52586B44407M01k55l22J99P09Q97R16Q82O60J62m57r24j016o61l2N21P01M49n7
$$ 244407 244808 244553 244231 244430 245139 246036 246952 247834 248494 248656 248199 247275 246259 245598 245566 246087 246788 247237 247180
52567B47180m53l23L95J075Q90j80j209j414j034p68p31m99J8L52J58l64q81j276
$$ 247180 246727 246404 246799 247874 248764 248584 247375 245961 244927 244159 243428 242929 242947 243299 243457 243093 242212 240936
52549B40936j460j235n46K90Q71J007O82n7r20j397j211o32r4M10J176K100K548
$$ 240936 239476 238241 237695 237985 238856 239863 240545 240488 239568 238171 236960 236328 236234 236644 237820 239920 242468
52532B42468K064R92J32p9R5J35j00k13K64J185J671R68n55j605j356k99N84J056
$$ 242468 244532 245524 245656 245577 245672 245807 245707 245494 245758 246943 248614 249582 249027 247422 246066 245767 246351 247407
52514B47407J531J992J913J308R85J410J941J786J192R95J380J798J947J978J797
$$ 247407 248938 250930 252843 254151 255136 256546 258487 260273 261465 262460 263840 265638 267585 269563 271360
52499B71360R52m96j675j908j594j679k498l462l755l048j697m69ml19q36r89
$$ 271360 272312 271816 270141 268233 266639 264960 262462 259000 255245 252197 250500 250031 250027 249708 248872 247883
52483B47883o74j46K79L61L7m32n60p6Q02J648K205K445K362J936J212L51l36
$$ 247883 247209 247063 247342 247703 247740 247308 246748 246672 247474 249122 251327 253772 256134 258070 259282 259633 259297
52466B59297m33K59J391K257K443K157J893J954K341K803K890K171O78j031k348
$$ 259297 258864 259123 260514 262771 265214 267371 269264 271218 273559 276362 279252 281423 282101 281070 278722
52451B78722l040l151k833k448k514l136l696l532k745j982j526j075m68o4j53
$$ 278722 275682 272531 269698 267250 264736 261600 257904 254372 251627 249645 248119 247044 246576 246512 246359
52436B46359l98k72J58L32L0l71n53p24j076j145k97J206K207K028J235P58P12
$$ 246359 245961 245689 245847 246179 246209 245838 245285 244561 243485 242340 242043 243249 245456 247484 248719 249477 250189
52419B50189O18M50P02J438K001J871J296Q43P72J093J777K627L340L974N009
$$ 250189 250807 251257 251959 253397 255398 257269 258565 259408 260180 261273 263050 265677 269017 272991 278000
52404B78000O624Q254R211R371Q888P588N259K286n64k860m559n486n445m829
$$ 278000 284624 292878 302089 311460 320348 327936 333195 335481 334917 332057 327498 322012 316567 311738
52390C11738m409m328l869k658j481j374k172k635j937n15O95J351J701J929J951
$$ 311738 307329 303001 299132 296474 294993 293619 291447 288812 286875 286360 287055 288406 290107 292036 293987
52375B93987J837J916K363K971L536M120M702M892M423L767L705M273M561L724
$$ 293987 295824 297740 300103 303074 306610 310730 315432 320324 324747 328514 332219 336492 341053 344777
52361C44777J881j53j630k239k030j342o57k29N2M00Q46J258J477J362R57O74
$$ 344777 346658 346505 344875 342636 340606 339264 338607 338378 338430 338830 339676 340934 342411 343773 344730 345404
52345C45404J017J984L011L586L663L416L042K967L690N071O260O718O898P427
$$ 345404 346421 348405 351416 355002 358665 362081 365123 368090 371780 376851 383111 389829 396727 404154
52331D04154Q150Q605R029J0084J1717J3187J4234J5413J7048J8566J9316J9511
$$ 404154 412304 420909 429938 440022 451739 464926 479160 494573 511621 530187 549503 569014
52319E69014J9850K0486K0857K0453J9388J8259J7596J7554J7971J8652J9517
$$ 569014 588864 609350 630207 650660 670048 688307 705903 723457 741428 760080 779597
52308G79597K0419K0983K0819J9936J8761J7764J7108J6583J5793J4543J3119
$$ 779597 800016 820999 841818 861754 880515 898279 915387 931970 947763 962306 975425
52297I75425J2092J1659J1339J0448Q718O293L438N21k006l995n799p605q872
$$ 975425 987517 999176 1010515 1020963 1029681 1035974 1039412 1039933 1037927 1033932 1028133 1020528 1011656
52284A011656q928q003p076o700o581o305n874n304m339k853j122N58K216L941
$$ 1011656 1002728 994725 987649 980949 974368 968063 962189 956885 952546 949693 948571 949129 951345 955286
52270I55286N587P053Q479R963J1315J2355J3159J3777J4016J3828J3568J3616
$$ 955286 960873 967926 976405 986368 997683 1010038 1023197 1036974 1050990 1064818 1078386 1092002
52258A092002J3867J3959J3767J3490J3341J3425J3720J3933J3580J2501J1017
$$ 1092002 1105869 1119828 1133595 1147085 1160426 1173851 1187571 1201504 1215084 1227585 1238602
52247A238602R418P508N027K223m58l052n808q379r944j0362j0571j1421j2602
$$ 1238602 1248020 1255528 1260555 1262778 1262320 1259268 1253460 1245081 1235137 1224775 1214204 1202783 1190181
52234A190181j3231j3178j3113j3367j3469j2940j1993j1131j0523j0166j0185
$$ 1190181 1176950 1163772 1150659 1137292 1123823 1110883 1098890 1087759 1077236 1067070 1056885
52223A056885j0438j0201q921p171o075n803n407m301l050k314j820r79R2R72
$$ 1056885 1046447 1036246 1027325 1020154 1014079 1008276 1002869 998568 995518 993204 991384 990405 990497 991469
52209I91469J822L048M393N165N299N387N680N831N624N263M856M300L808L824
$$ 991469 993291 996339 1000732 1005897 1011196 1016583 1022263 1028094 1033718 1038981 1043837 1048137 1051945 1055769
52195A055769M316M718M741M593M327L696K954K905L738M490M177K915J430M4
$$ 1055769 1060085 1064803 1069544 1074137 1078464 1082160 1085114 1088019 1091757 1096247 1100424 1103339 1104769 1104813
52181A104813j293k439l252l989m968o052p014q033r251j0138r944q702p187n949
$$ 1104813 1103520 1101081 1097829 1093840 1088872 1082820 1075806 1067773 1058522 1048384 1038440 1029738 1022551 1016602
52167A016602m934l947k984k039j076k01L78O72R31J410K219L201L830L549K483
$$ 1016602 1011668 1007721 1004737 1002698 1001622 1001421 1001799 1002471 1003402 1004812 1007031 1010232 1014062 1017611 1020094
52152A020094J467J091J002O17j8m54n65m11K06J372K513L004L039L122K940J752
$$ 1020094 1021561 1022652 1023654 1024271 1024253 1023799 1023234 1022823 1023029 1024401 1026914 1029918 1032957 1036079 1039019 1040771
52136A040771p3j034k21J703L519M698N401O103P482R950J2879J5104J6508J8277
$$ 1040771 1040698 1039664 1039443 1041146 1044665 1049363 1054764 1060867 1068349 1078299 1091178 1106282 1122790 1141067
52122A141067K1079K3944K5724K6766K8102K9702L0719L1055L1362L1524L0441
$$ 1141067 1162146 1186090 1211814 1238580 1266682 1296384 1327103 1358158 1389520 1421044 1451485
$$ [...]
##END NTUPLES=NMR SPECTRUM
##END=
