
##TITLE=AC1198_BRAAS12062_7165602_QtzWtNK4mk
##JCAMPDX= 6.0         $$ Bruker NMR JCAMP-DX V2.0
##DATA TYPE= NMR SPECTRUM
##DATA CLASS= NTUPLES
##ORIGIN= BRUKER
##OWNER= Administrator
$$ 1.72 TOPSPIN		Version 2.1
$$ 2013-01-30 00:43:50.079 -0500  Administrator@X
$$ Compression mode = diff/dup
##.OBSERVE FREQUENCY= 400.02188249412
##.OBSERVE NUCLEUS= ^1H
##.ACQUISITION MODE= SIMULTANEOUS (DQD)
##.ACQUISITION SCHEME= undefined
##.AVERAGES= 64
##.DIGITISER RES= 22
##SPECTROMETER/DATA SYSTEM= spect
##.PULSE SEQUENCE= noesygpps1d.comp
##.SOLVENT NAME= COFFEE_meoh
##.SHIFT REFERENCE= INTERNAL, COFFEE_meoh, 1, 14.96242
##AUDIT TRAIL= $$ (NUMBER, WHEN, WHO, WHERE, PROCESS, VERSION, WHAT)
$$ ##TITLE= Audit trail, TOPSPIN		Version 2.1
$$ ##JCAMPDX= 5.01
$$ ##ORIGIN= Bruker BioSpin GmbH
$$ ##OWNER= Administrator
$$ $$ E:\/data/COFFEE/nmr/AC1198_BRAAS12062_7165602_QtzWtNK4mk/22/pdata/1/auditp.txt
$$ ##AUDIT TRAIL=  $$ (NUMBER, WHEN, WHO, WHERE, PROCESS, VERSION, WHAT)
(   1,<2013-01-30 00:43:44.251 -0500>,<Administrator>,<X>,<go>,<TOPSPIN 2.1>,
      <created by zg
	started at 2013-01-30 00:32:14.048 -0500,
	POWCHK enabled, PULCHK disabled,
       configuration hash MD5:
       86 BA 57 50 F2 9D 5C 9B 26 00 A9 28 5F 66 2E 89
       data hash MD5: 64K
       12 59 76 02 55 55 6D 39 0D AE E6 4C 05 06 F9 9B>)
(   2,<2013-01-30 00:43:47.329 -0500>,<Administrator>,<X>,<proc1d>,<TOPSPIN 2.1>,
      <Start of raw data processing
       efp LB = 0.3 FT_mod = 6 PKNL = 1 PHC0 = 0 PHC1 = 0 SI = 128K 
       data hash MD5: 128K
       24 C6 4F 23 B2 45 8E 5B DA 6B A6 A6 54 91 DD CD>)
(   3,<2013-01-30 00:43:48.376 -0500>,<Administrator>,<X>,<proc1d>,<TOPSPIN 2.1>,
      <pk PHC0 = -77.79968 PHC1 = 0 
       data hash MD5: 128K
       FB E9 1A EC 72 61 8F 76 44 E0 F3 D5 19 9B 4F 41>)
(   4,<2013-01-30 00:43:49.017 -0500>,<Administrator>,<X>,<proc1d>,<TOPSPIN 2.1>,
      <abs ABSG = 1 
       data hash MD5: 128K
       4E 06 35 30 83 AE 3B 5D 5B E8 2B E6 14 2A 90 1C>)
(   5,<2013-01-30 00:43:49.204 -0500>,<Administrator>,<X>,<proc1d>,<TOPSPIN 2.1>,
      <abs ABSG = 2 
       data hash MD5: 128K
       8E CB E0 FB CF 1F BA 71 AE C5 A4 1B 17 99 AC 66>)
(   6,<2013-01-30 00:43:49.376 -0500>,<Administrator>,<X>,<proc1d>,<TOPSPIN 2.1>,
      <abs ABSG = 3 
       data hash MD5: 128K
       82 BE 52 D3 9A 65 38 37 3E 4A 78 2B 85 E3 F2 77>)
(   7,<2013-01-30 00:43:49.563 -0500>,<Administrator>,<X>,<proc1d>,<TOPSPIN 2.1>,
      <abs ABSG = 4 
       data hash MD5: 128K
       8C 2E 3B B7 24 56 9D 29 8A 4B DF 5B 9C A8 E1 B9>)
(   8,<2013-01-30 00:43:49.735 -0500>,<Administrator>,<X>,<proc1d>,<TOPSPIN 2.1>,
      <abs ABSG = 5 
       data hash MD5: 128K
       70 7B 5E 0A 99 D1 9C F8 A1 56 33 03 C0 47 D0 9B>)
$$ ##END=
$$ 
$$ $$ hash MD5
$$ $$ E4 C7 E6 E8 A7 5B 02 A3 54 F7 3A 97 B9 B2 BB 44
##$RELAX= 
##$RELAX= 
##$RELAX= 
##$RELAX= 
##$RELAX= 
##$RELAX= 
##$RELAX= 
##$RELAX= 
$$ Bruker specific parameters
$$ --------------------------
##$DU= <E:\>
##$EXPNO= 22
$$ [...]
##$TP07= 0
##$TPNAME0= <>
##$TPNAME1= <>
##$TPNAME2= <>
##$TPNAME3= <>
##$TPNAME4= <>
##$TPNAME5= <>
##$TPNAME6= <>
##$TPNAME7= <>
##$TPOAL= (0..7)
0.5 0.5 0.5 0.5 0.5 0.5 0.5 0.5
##$TPOFFS= (0..7)
0 0 0 0 0 0 0 0
##$TUNHIN= 0
##$TUNHOUT= 0
##$TUNXOUT= 0
##$USERA1= <user>
##$USERA2= <user>
##$USERA3= <user>
##$USERA4= <user>
##$USERA5= <user>
##$V9= 5
##$VALIST= <valist>
##$VCLIST= <CCCCCCCCCCCCCCC>
##$VD= 0
##$VDLIST= <DDDDDDDDDDDDDDD>
##$VPLIST= <PPPPPPPPPPPPPPP>
##$VTLIST= <TTTTTTTTTTTTTTT>
##$WBST= 1024
##$WBSW= 4
##$XGAIN= (0..3)
0 0 0 0
##$XL= 0
##$YL= 0
##$YMAX_a= 9056663
##$YMIN_a= -19177192
##$ZGOPTNS= <>
##$ZL1= 120
##$ZL2= 120
##$ZL3= 120
##$ZL4= 120
##$ABSF1= 14.96242
##$ABSF2= -5.595761
##$ABSG= 5
##$ABSL= 3
##$ALPHA= 0
##$AQORDER= 0
##$ASSFAC= 0
##$ASSFACI= 0
##$ASSFACX= 0
##$ASSWID= 0
##$AUNMP= <proc_prof1d_extract.lims>
##$AXLEFT= 0
##$AXNAME= <>
##$AXNUC= <1H>
##$AXRIGHT= 0
##$AXTYPE= 0
##$AXUNIT= <>
##$AZFE= 0.1
##$AZFW= 0.1
##$BCFW= 0
##$BC_mod= 0
##$BYTORDP= 0
##$COROFFS= 0
##$CY= 15
##$DATMOD= 1
##$DC= 0
##$DFILT= <>
##$DTYPP= 0
##$F1P= 0
##$F2P= 0
##$FCOR= 0.5
##$FTSIZE= 131072
##$FT_mod= 6
##$GAMMA= 0
##$GB= 0
##$INTBC= 1
##$INTSCL= 1
##$ISEN= 128
##$LB= 0.3
##$LEV0= 0
##$LPBIN= 0
##$MAXI= 10000
##$MC2= 0
##$MEAN= 0
##$ME_mod= 0
##$MI= 0
##$NCOEF= 0
##$NC_proc= -2
##$NLEV= 6
##$NOISF1= 0
##$NOISF2= 0
##$NSP= 0
##$NTH_PI= 0
##$NZP= 0
##$OFFSET= 14.96242
##$PC= 1
##$PHC0= -77.79968
##$PHC1= 0
##$PH_mod= 1
##$PKNL= yes
##$PPARMOD= 0
##$PPDIAG= 0
##$PPIPTYP= 0
##$PPMPNUM= 2147483647
##$PPRESOL= 1
##$PSCAL= 4
##$PSIGN= 0
##$PYNMP= <proc.py>
##$REVERSE= no
##$SF= 400.020009068627
##$SI= 131072
##$SIGF1= 0
##$SIGF2= 0
##$SINO= 400
##$SIOLD= 131072
##$SPECTYP= <>
##$SREGLST= <1H.CDCl3>
##$SSB= 0
##$STSI= 131072
##$STSR= 0
##$SW_p= 8223.68421052631
##$SYMM= 0
##$S_DEV= 0
##$TDeff= 65536
##$TDoff= 0
##$TI= <>
##$TILT= no
##$TM1= 0
##$TM2= 0
##$TOPLEV= 0
##$USERP1= <user>
##$USERP2= <user>
##$USERP3= <user>
##$USERP4= <user>
##$USERP5= <user>
##$WDW= 1
##$XDIM= 131072
##$YMAX_p= 452908174
##$YMIN_p= -12108
##$CURPLOT= <Network HP LaserJet P1505>
##$CURPRIN= <$Network HP LaserJet P1505>
##$DFORMAT= <normdp>
##$LAYOUT= <+/1D_H.xwp>
##$LFORMAT= <normlp>
##$PFORMAT= <normpl>
##$SURQMSG= 1
$$ End of Bruker specific parameters
$$ ---------------------------------
##NTUPLES= NMR SPECTRUM
##VAR_NAME=  FREQUENCY,     SPECTRUM/REAL,   SPECTRUM/IMAG
##SYMBOL=    X,             R,               I
##VAR_TYPE=  INDEPENDENT,   DEPENDENT,       DEPENDENT
##VAR_FORM=  AFFN,          ASDF,            ASDF
##VAR_DIM=   131072,        131072,          131072
##UNITS=     HZ,            ARBITRARY UNITS, ARBITRARY UNITS
##FACTOR=    0.0627417313425164, 1,          1
##FIRST=     8223.62146879497, 3085,         -76420
##LAST=      0,             6003,            -76318
##MIN=       0,             -12108,          0
##MAX=       8223.62146879497, 452908174,    0
$$ Real data points
##PAGE= N=1
##DATA TABLE= (X++(R..R)), XYDATA
$$ [...]
60975F376160R45094J157710J419710J724704K058003K385616K624029K634264
$$ 6376160 7321254 8478964 9898674 11623378 13681381 16066997 18691026 21325290
60967B1325290K290495J594511P26254m2023n03483o06704m21458o1111L39638
$$ 21325290 23615785 25210296 25936550 25894527 25391044 24784340 24362882 24301771 24641409
60958B4641409O05345N51319R1381o75498j504757k151319k494055k549604k403557
$$ 24641409 25246754 25798073 25889454 25213956 23709199 21557880 19063825 16514221 14110664
60949A4110664k143959j838101j533439j258185j022547q26561o67687n41569
$$ 14110664 11966705 10128604 8595165 7336980 6314433 5487872 4820185 4278616
60941D278616m41308l60789k97427k49671k13987j86517j65635j50540j38875
$$ 4278616 3837308 3476519 3179092 2929421 2715434 2528917 2363282 2212742 2073867
60932B073867j28046j17591j08110r8957q8986p8569o8977o0561n3235m7775m4871
$$ 2073867 1945821 1828230 1720120 1621163 1532177 1453608 1384631 1324070 1270835 1223060 1178189
60921A178189m3622m2657m1918m1685m0848l8068l3951l0125k6816k3230j9726
$$ 1178189 1134567 1091910 1049992 1008307 967459 929391 895440 865315 838499 815269 795543
60910G95543j7475j6302j4955j3360j2493j2119j0785q330o377n790n499m452
$$ 795543 778068 761766 746811 733451 720958 708839 698054 689724 683347 677557 672058 667606
60898F67606l153k497k383k186j564k92J695L645M411L951L433L585L839L517
$$ 667606 664453 661956 659573 657387 655823 655531 657226 660871 665282 669233 672666 676251 680090 683607
60884F83607K750J773L15j791m127o292q293j0052j1206j1690j1854j1823j1364
$$ 683607 686357 688130 688445 686654 682527 676235 667942 657890 646684 634994 623140 611317 599953
60871E99953j0488r500q381o964n725n407n722n437l952j986l48R99K369L707
$$ 599953 589465 579965 571584 564620 558895 553488 547766 542329 538377 536391 536043 537042 539411 543118
60857E43118M855N788O346O452O733Q055J0295J2336J3503J4173J4868J5646J6525
$$ 543118 547973 553761 560107 566559 573292 581347 591642 603978 617481 631654 646522 662168 678693
60844F78693J7523J8101J7608J6423J5636J5351J4521J2709J0676Q741O127K731
$$ 678693 696216 714317 731925 748348 763984 779335 793856 806565 817241 825982 832109 834840
60832H34840J13m91n2l60j566k455k549k572l145m221n726p588r190r758r495
$$ 834840 834953 834462 834410 834050 832484 830029 827480 824908 821763 817542 811816 804228 795038 785280 775785
60817G75785r428r956j0309r797q943q868r857j0955j1051j0093r018q522q210
$$ 775785 766357 756401 746092 736295 727352 718484 708627 697672 686621 676528 667510 658988 650778
60804F50778p187n287l353k246j999k021j752j000P4J185K286L681N494P252Q345
$$ 650778 643591 638304 634951 632705 630706 628685 626933 625933 626007 627192 629478 633159 638653 645905 654250
60789F54250Q823R249R888J0489J0765J0606R963Q990Q167P651O824N226L635
$$ 654250 663073 672322 682210 692699 703464 714070 724033 733023 741190 748841 755665 760891 764526
60776G64526L211L811M226M092M191M767M983M595M753O233Q005Q579P980P263
$$ 764526 767737 771548 775774 779866 784057 788824 793807 798402 803155 809388 817393 825972 833952 841215
60762H41215O759N883M370K680J261K33l48n56q46j693k935l878l996l297k267
$$ 841215 847974 853857 858227 860907 862168 862401 862053 861497 860651 858958 856023 852145 848149 844852 842585
60747H42585j602j684k066j912j193r96k206m374o287p265p411p005o295n658
$$ 842585 840983 839299 837233 835321 834128 833132 830926 826552 820265 813000 805589 798584 792289 786631
60733G86631n368n278n079m838m850n109n233m985m609m589n153n965o454o426
$$ 786631 781263 775985 770906 766068 761218 756109 750876 745891 741282 736693 731540 725575 719121 712695
60719G12695o198n874m952l153j286m80o53o74m1N86O91P34J202J731J769J371
$$ 712695 706497 700623 695671 692518 691232 690752 690099 689425 689384 689970 690661 691395 692597 694328 696097 697468
60703F97468P76j23j320k222k399k376l002m368n853o983p734q276q845r677j0711
$$ 697468 698244 698121 696801 694579 692180 689804 686802 682434 676581 669598 661864 653588 644743 635066 624355
60688F24355j1562j1964j1967j1557j0579r264q270p900p747p316o585n653m472
$$ 624355 612793 600829 588862 577305 566726 557462 549192 541292 533545 526229 519644 513991 509519
60675E09519l217k276j576m79J241K884L741L900L807L616L418L501L915M238
$$ 509519 506302 504026 502450 501971 503212 506096 509837 513737 517544 521160 524578 528079 531994 536232
60661E36232M218M085L979L739L526L833M491M568L882L590M510N797O277O230
$$ 536232 540450 544535 548514 552253 555779 559612 564103 568671 572553 576143 580653 586450 592727 598957
60647E98957O700P662Q174P986P765P892Q087Q207Q492Q954R362R838J0696J1770
$$ 598957 605657 613319 621493 629479 637244 645136 653223 661430 669922 678876 688238 698076 708772 720542
60633G20542J2517J2776J2760J2359J1211R445P713O315M871K936N43j946m169
$$ 720542 733059 745835 758595 770954 782165 791610 799323 805638 810509 813445 813988 812042 807873
60620H07873n987p513q935j0083j0571j0507j0645j1337j1901j1536j0435r376
$$ 807873 801886 794373 785438 775355 764784 754277 743632 732295 720394 708858 698423 689047
60608F89047q491p211n265k995q04J169K842M170N265O168O542O027M750L249
$$ 689047 680556 673345 668080 665085 664281 665450 668292 672462 677727 683895 690437 696464 701214 704463
60594G04463J995J213Q76O19O5n11k67J176L271N370P290Q729Q926P654N833M377
$$ 704463 706458 707671 708547 709166 709231 708720 708453 709629 712900 718270 725560 734289 743215 750869 756702 761079
60578G61079L066J386j48o72n54j095k687m407n437n998o663p533q331q789q792
$$ 761079 764145 765531 765383 764711 764157 763062 760375 755968 750531 744533 737870 730337 722006 713217 704425
60563G04425q560q613r216r950j0260j0109r639q589o754m680l065j727K1K134
$$ 704425 695865 687252 678036 668086 657826 647717 638078 629489 622735 618055 614990 613263 613284 615418
60549F15418L823M819N751P085Q467R485J0504J2230J4700J7120J8838K0369K3105
$$ 615418 619241 624060 629811 636896 645363 654848 665352 677582 692282 709402 728240 748609 771714
60536G71714K7707L3033L7401M0640M3854M6836M7160M2684L3930K2888J0544
$$ 771714 799421 832454 869855 910495 954349 1001185 1048345 1091029 1124959 1147847 1158391
60525A158391k949j6235k6799l3185l5922l6055l3906k9547k3581j6952j0541
$$ 1158391 1155442 1139207 1112408 1079223 1043301 1007246 973340 943793 920212 903260 892719
60514H92719n087r40K182M764O853Q247R057R476R404Q868Q482Q751R444J0480
$$ 892719 887632 886692 888874 893638 900491 908738 917795 927271 936675 945543 954025 962776 972220 982700
60500I82700J2874J7581K3880L0215L6474M3898N2847O2300P1871Q2642R5254
$$ 982700 995574 1013155 1037035 1067250 1103724 1147622 1200469 1262769 1334640 1417282 1512536
60489A512536J08512J20894J32567J44957J59107J75461J94749K17989K45441
$$ 1512536 1621048 1741942 1874509 2019466 2178573 2354034 2548783 2766772 3012213
60480C012213K75816L05987L30684L42586L33812K98640K35846J49221M6250o3679
$$ 3012213 3288029 3594016 3924700 4267286 4601098 4899738 5135584 5284805 5331055 5267376
60470E267376j70241k62736l31873l72728l86297l77890l54077l20923k83729
$$ 5267376 5097135 4834399 4502526 4129798 3743501 3365611 3011534 2690611 2406882
60461B406882k46701k12463j82326j56864j35793j17819j01609q6987p4615o4766
$$ 2406882 2160181 1947718 1765392 1608528 1472735 1354916 1253307 1166320 1091705 1026939
60451A026939n6996n0631m4847l8723l2188k6559k3102k1236j9238j6491j3926
$$ 1026939 969943 919312 874465 835742 803554 776995 753893 732657 713419 696928 683002
60440F83002j2351j1545j1077j0841j0590r932r037q472q246p852p237o699n926
$$ 683002 670651 659106 648029 637188 626598 616666 607629 599157 590911 583059 575822 569123 563197
60427E63197m278k100o01k27k90l53p71j497j632p06O72J863K884L580L286K061
$$ 563197 558919 556819 556218 555991 555701 555348 554577 553080 551448 550742 551414 553277 556161 559741 563027 565088
60411E65088J194J651K746L162K682K112K047K371K729K897K930L145L767M556
$$ 565088 566282 567933 570679 573841 576523 578635 580682 583053 585782 588679 591609 594754 598521 603077
60397F03077N208N903O886P682P623O992O631O474N684M313L454L411L104J857
$$ 603077 608285 614188 621074 628756 636379 643371 650002 656476 662160 666473 669927 673338 676442 678299
60383F78299M71k03n67j336k364l252m172n189n617n012m034l444k981k111j235
$$ 678299 678770 678567 678000 676664 674300 671048 666876 661687 656070 651058 647024 643580 640599 638488 637253
60368F37253j083j408j259l10Q74J693K039K140K400L028L632L580L009K751L036
$$ 637253 636170 634762 633503 633193 634067 635760 637799 639939 642339 645367 648999 652579 655588 658339 661375
60353F61375L143K784K838L905N151N464N106N150N864O638P127P427P358O514
$$ 661375 664518 667302 670140 674045 679196 684660 689766 694916 700780 707418 714545 721972 729330 735844
60339G35844N000L395K098J167N92K15l48j153j684j559j140q92o30M4R82J780
$$ 735844 740844 744239 746337 747504 748096 748311 747963 746810 745126 743567 742427 741535 740905 740949 741931 743711
60323G43711K473L234L696L290K056N44r00k227l258l752l747l521l258l021k855
$$ 743711 746184 749418 753114 756404 758460 759004 758104 755877 752619 748867 745120 741599 738341 735320 732465
60308G32465k713k512k409k614k881k762k388k326k529k294j555j083r67n7K199
$$ 732465 729752 727240 724831 722217 719336 716574 714186 711860 709331 707037 705482 704399 703432 703375 705574
60293G05574M445N062M302L602L380K885J898J188J230J548J596J429J319J337
$$ 705574 710019 715081 719383 722985 726365 729250 731148 732336 733566 735114 736710 738139 739458 740795
60279G40795J546K039K728L367L917M462M956N349N872O805Q149R740J1472J3135
$$ 740795 742341 744380 747108 750475 754392 758854 763810 769159 775031 781836 789985 799725 811197 824332
60265H24332J4373J5152J5910J6921J8003J9154K0938K3700K6919K9965L2995
$$ 824332 838705 853857 869767 886688 904691 923845 944783 968483 995402 1025367 1058362
60254A058362L6417L9930M2989M6003N0190N6108O2992O9640P5611Q1389Q7654
$$ 1058362 1094779 1134709 1177698 1223701 1273891 1329999 1392991 1462631 1538242 1619631 1707285
60243A707285R4395J00747J05830J09701J12960J15430J15905J13491J08528J01766
$$ 1707285 1801680 1902427 2008257 2117958 2230918 2346348 2462253 2575744 2684272 2786038
60233B786038R3327Q2992P0952N7726M3718K9310J4902N90j3595k6805l7550m5247
$$ 2786038 2879365 2962357 3033309 3091035 3134753 3164063 3178965 3179555 3165960 3139155 3101605 3056358
60221C056358n0707n4470n5683n3504m8668m2443l4824k5092j3706k144R061K0806
$$ 3056358 3005651 2951181 2895498 2841994 2793326 2750883 2716059 2690967 2677261 2675117 2684178 2704984
60209B704984L3803M7502O0885P3463Q5217R6209J06478J15780J23286J27851
$$ 2704984 2738787 2786289 2847174 2920637 3005854 3102063 3208541 3324321 3447607 3575458
60199C575458J28653J25384J18111J07300R3728P7996O0336M1226K1648K273j7067
$$ 3575458 3704111 3829495 3947606 4054906 4148634 4226630 4286966 4328192 4349840 4352113 4335046
60188D335046l6493n5135p1687q5528r6565j04358j08163j07724j03400r5757
$$ 4335046 4298553 4243418 4171731 4086203 3989638 3885280 3777117 3669393 3565993 3470236
60178C470236q5516p3540o0350m5943l0431j4435J563J7576L3323M7910O0924
$$ 3470236 3384720 3311180 3250830 3204887 3174456 3160021 3161584 3179160 3212483 3260393 3321317
60167C321317P2835Q3437R0780R2984R0450Q4968P7148O6210N2042L5975J9388
$$ 3321317 3394152 3477589 3568369 3661353 3751803 3836771 3913919 3980129 4032171 4068146 4087534
60156D087534K847j3129k7602l9762m9220n5544n8207n7093n2433m4333l2972
$$ 4087534 4090381 4077252 4049650 4009888 3960668 3905124 3846917 3789824 3737391 3693058 3660086
60145C660086j9060l392J3783L2266N1213O9879Q8864J09554J32397J56606J81448
$$ 3660086 3641026 3637634 3651417 3683683 3734896 3804775 3893639 4003193 4135590 4292196 4473644
60134D473644K06884K32975K59507K86186L12466L37261L59437L78180L92226
$$ 4473644 4680528 4913503 5173010 5459196 5771662 6108923 6468360 6846540 7238766
60125G238766L99393L98009L88315L71290L46674L13714K73412K28251J79539
$$ 7238766 7638159 8036168 8424483 8795773 9142447 9456161 9729573 9957824 10137363
60116A0137363J26918P0705J2926m4660j01962j58964k13964k64285l07745l42457
$$ 10137363 10264281 10334986 10347912 10303252 10201290 10042326 9828362 9564077 9256332 8913875
60106H913875l66253l77583l76716l65383l45461l18615k86550k50896k12863
$$ 8913875 8547622 8170039 7793323 7427940 7082479 6763864 6477314 6226418 6013555
60097F013555j73422j33598r4268n5926j8860J6652N0367Q1807J09782J32503
$$ 6013555 5840133 5706535 5612267 5556341 5537481 5554133 5604500 5686307 5796089 5928592
60087E928592J48425J56798J57527J50825J37013J16340Q9213N7057K2674j0757
$$ 5928592 6077017 6233815 6391342 6542167 6679180 6795520 6884733 6941790 6964464 6953707
60077F953707m1123o7595r0059j09042j25681j40705j53532j63256j70165j75287
$$ 6953707 6912584 6844989 6754930 6645888 6520207 6379502 6225970 6062714 5892549 5717262
60067E717262j78619j79051j76093j70436j62631j52321j39301j24346j08468
$$ 5717262 5538643 5359592 5183499 5013063 4850432 4698111 4558810 4434464 4325996
60058D325996r2033p5009n7478l9560k1407l435J3929L0831M7687O4313Q0079
$$ 4325996 4233963 4158954 4101476 4061916 4040509 4037074 4051003 4081834 4129521 4193834 4273913
60047D273913R4742J08300J19960J28193J32001J31265J25845J15336R9940Q0639
$$ 4273913 4368655 4476955 4596915 4725108 4857109 4988374 5114219 5229555 5329495 5410134
60037E410134N8264L3290O725j9875m5725p1116r5941j18695j37454j51134j59430
$$ 5410134 5468398 5501688 5508413 5488538 5442813 5371697 5275756 5157061 5019607 4868473 4709043
60026D709043j62352j60345j54265j44762j32219j17497j01923q6226p0091n3109
$$ 4709043 4546691 4386346 4232081 4087319 3955100 3837603 3735680 3649454 3579363 3526254
60016C526254l5542j7843j63J7413L4820N2412P0723Q9564J08061J25829J43239
$$ 3526254 3490712 3472869 3472706 3490119 3524939 3577351 3648074 3737638 3845699 3971528 4114767
60005D114767J60241J75723J88326J97027K00624J97646J87399J70543J48207
$$ 4114767 4275008 4450731 4639057 4836084 5036708 5234354 5421753 5592296 5740503
59996E740503J21365R1347N9984K8583k707l3953o4514r3350j19528j41925j59184
$$ 5740503 5861868 5953215 6013199 6041782 6039075 6005122 5940608 5847258 5727730 5585805 5426621
59985E426621j70506j76005j75948j70359j59740j45365j28380j09218q8327o6695
$$ 5426621 5256115 5080110 4904162 4733803 4574063 4428698 4300318 4191100 4102773 4036078
59975D036078m5063k3373j548J9702L9448N7402P3678Q8168J00525J10299J16813
$$ 4036078 3991015 3967642 3966094 3985796 4025244 4082646 4156324 4244492 4345017 4455316 4572129
59964D572129J19549J18886J15830J10645J02558R1225P7659O3217M8472L3680
$$ 4572129 4691678 4810564 4926394 5037039 5139597 5230822 5308481 5371698 5420170 5453850
59954E453850J9683P431k860j1402j7854k1108j9919j3553k266J2873L1147N3222
$$ 5453850 5473533 5480964 5478104 5466702 5448848 5427740 5407821 5394268 5392002 5404875 5436022 5489244
59942E489244Q0180J11583J45585J81180K19114K59932L02334L44224L84307M21486
$$ 5489244 5569424 5681007 5826592 6007772 6226886 6486818 6789152 7133376 7517683 7939169
59932G939169M53340M76292M86918M82330M59787M17050L53379K70089J70721
$$ 7939169 8392509 8868801 9355719 9838049 10297836 10714886 11068265 11338354 11509075
59923A1509075O1080n1541j60036k58527l42134m06916m50895m74585m79976m69582
$$ 11509075 11570155 11518614 11358578 11100051 10757917 10351001 9900106 9425521 8945545 8475963
59913H475963m46756m15816l80559l42803l02968k61634k19920j78798j38804
$$ 8475963 8029207 7613391 7232832 6890029 6587061 6325427 6105507 5926709 5787905
59904E787905j00222o3035k6894Q420M2752P5917J07883J38261J66193J90843
$$ 5787905 5687683 5624648 5597754 5606174 5648926 5724843 5832726 5970987 6137180 6328023
59894F328023K11374K26214K33095K30262K16972J92616J56390J08600N1591j1112
$$ 6328023 6539397 6765611 6998706 7228968 7445940 7638556 7794946 7903546 7955137 7944025
59884G944025p5871j38811j95884k44141k82594l11142l29427l37305l35758l26460
$$ 7944025 7868154 7729343 7533459 7289318 7006724 6695582 6366155 6028850 5693092 5366632
59874E366632l10979k90972k68384k44611k19979j94677j69656j45954j23818
$$ 5366632 5055653 4764681 4496297 4251686 4031707 3837030 3667374 3521420 3397602
59865C397602j03195q4475o8070n3880m1880l2678k6772k3844k3343k4965k7937
$$ 3397602 3294407 3209932 3141862 3087982 3046102 3013424 2986652 2962808 2939465 2914500 2886563
59854B886563l0603l1673l1153k9322k5571j9282j1172k724N247J2523J8508K2205
$$ 2886563 2855960 2824287 2793134 2763812 2738241 2718959 2707787 2705063 2710310 2722833 2741341 2763546
59842B763546K2841J9849J2819K259j0197k3020l5623m7326n6489o1748o3458
$$ 2763546 2786387 2806236 2819055 2821314 2811117 2788097 2752474 2705148 2648659 2586911 2523453
59831B523453o2814o0241n5644m9525m2646l5021k6417j7315q388M76R512J8033
$$ 2523453 2460639 2400398 2344754 2295229 2252583 2217562 2191145 2173830 2165442 2165918 2175430 2193463
59819B193463K5152L1055L6421M1186M5013M8465N2407N6797O1149O5435O9026
$$ 2193463 2218615 2249670 2286091 2327277 2372290 2420755 2473162 2529959 2591108 2656543 2725569
59808B725569O9481O4330N3949M1009K7420J3555L30j0254j7233k1515k3931k3955
$$ 2725569 2795050 2859380 2913329 2954338 2981758 2995313 2995643 2985389 2968156 2946641 2922710 2898755
59796B898755k1139j6409j0852m153M714J5887K8527M1981N6360P2227R0046J09900
$$ 2898755 2877616 2861207 2850355 2846202 2850916 2866803 2895330 2937311 2993671 3065898 3155944 3265844
59784C265844J31674J55634J82652K13413K47731K84956L24464L64610M01385
$$ 3265844 3397518 3553152 3735804 3949217 4196948 4481904 4806368 5170978 5572363
59775E572363M28717M39859M27788L85581L09244K01829P4555n6654j76048k71356
$$ 5572363 6001080 6440939 6868727 7254308 7563552 7765381 7839936 7783282 7607234 7335878
59765G335878l35714l68571l74648l60928l33982k99196k60980k22742j86733
$$ 7335878 7000164 6631593 6256945 5896017 5562035 5262839 5001859 4779117 4592384
59756D592384j54148j25198r9250p5528n3868l4506j7338j768J2819K6963M1250
$$ 4592384 4438236 4313038 4213788 4138260 4084392 4049886 4032548 4030780 4043599 4070562 4111812
59745D111812N5972P0822Q5460J00187J15521J31539J48336J66676J87284K09799
$$ 4111812 4167784 4238606 4324066 4424253 4539774 4671313 4819649 4986325 5173609 5383408
59735E383408K33423K58379K85613L15315L46892L80425M16754M55749M95531
$$ 5383408 5616831 5875210 6160823 6476138 6823030 7203455 7620209 8075958 8571489
59726H571489N33810N69107O00069O24327O38674O40181O27175N99817N60334
$$ 8571489 9105299 9674406 10274475 10898802 11537476 12177657 12804832 13404649 13964983
59717A3964983N12625M61633M13086L73020L46479L36400L43878L68827M09470
$$ 13964983 14477608 14939241 15352327 15725347 16071826 16408226 16752104 17120931 17530401
59708A7530401M61618N19684N78491O33315O78508P07513P14607O95866O48677
$$ 17530401 17992019 18511703 19090194 19723509 20402017 21109530 21824137 22520003 23168680
59699B3168680N71897M67485L41361K02153N9424p7212j98727k97885l70139m13513
$$ 23168680 23740577 24208062 24549423 24751576 24811000 24733788 24535061 24237176 23867037 23453524
59689B3453524m28196m16251l81092l26653k56893j75600q5814J0737J13297K21234
$$ 23453524 23025328 22609077 22227985 21901332 21644439 21468839 21383025 21393762 21507059 21728293
59679B1728293L33899M50934N71986O95943Q20484R41641J052840J144584J205856
$$ 21728293 22062192 22513126 23085112 23781055 24601539 25543180 26596020 27740604 28946460
59670B8946460J225746J193684J099808R37746P08435M21526R4089k50988n86826
$$ 28946460 30172206 31365890 32465698 33403444 34111879 34533405 34627494 34376506 33789680
59661C3789680q86694j129628j303739j405777j439292j413205j340017j233469
$$ 33789680 32902986 31773358 30469619 29063842 27624550 26211345 24871328 23637859
59653B3637859j107192r74643q48913p41984o64430o24773o26728o65745p28851
$$ 23637859 22530667 21556024 20707111 19965127 19300697 18675924 18049196 17383451 16654600
59644A6654600p98938q59979r00156r13174q98667q61155q07517p44730o78768
$$ 16654600 15855662 14995683 14095527 13182353 12283686 11422531 10615014 9870284 9191516
59635I191516o13942n52389m94696m41233l92559l48868l09856k75233k44594
$$ 9191516 8577574 8025185 7530489 7089256 6696697 6347829 6037973 5762740 5518146
59626E518146k16958j91347j67806j46859j28101j10387r3465p8177o4913n3146
$$ 5518146 5301188 5109841 4942035 4795176 4667075 4556688 4463223 4385046 4320133 4266987
59616D266987m2759l4629k9368k6556k5742k7246l1441l8027m6519n6566o7324
$$ 4266987 4224228 4189599 4160231 4133675 4107933 4080687 4049246 4011219 3964700 3908134 3840810
59605C840810p7330q5552r1920r6521r8897r8553r5485r0007q2678p4624o7058
$$ 3840810 3763480 3677928 3586008 3489487 3390590 3292037 3196552 3106545 3023867 2949243 2882185
59594B882185o0207n3287m5680l7432k8689j9626j1049l916J991P953J4471K0534
$$ 2882185 2821978 2768691 2723011 2685579 2656890 2637264 2626215 2622299 2624290 2632243 2646714 2667248
59582B667248K4978K7660K8926K8935K7959K6475K4490K1539J7754J4211J1989
$$ 2667248 2692226 2719886 2748812 2777747 2805706 2832181 2856671 2878210 2895964 2910175 2922164
59571B922164J1602J3373J7362K2739K8331L4069M0850M8834N7133O5471P4821
$$ 2922164 2933766 2947139 2964501 2987240 3015571 3049640 3090490 3139324 3196457 3261928 3336749
59560C336749Q5806R7762J10120J23472J38469J54684J71447J88897K07411K26611
$$ 3336749 3422555 3520317 3630437 3753909 3892378 4047062 4218509 4407406 4614817 4841428
59550D841428K45710K64183K81559K97106L10120L19898L25236L24950L19181
$$ 4841428 5087138 5351321 5632880 5929986 6240106 6560004 6885240 7210190 7529371
59541G529371L09250K95951K79162K59457K38786K18895K00133J82175J64582
$$ 7529371 7838621 8134572 8413734 8673191 8911977 9130872 9331005 9513180 9677762
59532I677762J46268J26241J06082R0258Q2579Q3200Q9829J00465J13409J25777
$$ 9677762 9824030 9950271 10056353 10146611 10229190 10312390 10402219 10502684 10616093 10741870
59522A0741870J33843J34525J25479J04438O9981K2855l4399r8732j66888k35145
$$ 10741870 10875713 11010238 11135717 11240155 11310136 11332991 11298592 11199860 11032972 10797827
59512A0797827k99912l58298m07527m44709m68300m79262m79735m71118m54300
$$ 10797827 10497915 10139617 9732090 9287381 8819081 8339819 7860084 7388966 6934666
59503F934666m31059m03752l73930l42244l09552k77116k45865k16366j89247
$$ 6934666 6503607 6099855 5725925 5383681 5074129 4797013 4551148 4334782 4145535
59494D145535j64861j42763j22337j03707q7262p2540n8502m4698l1444j8866
$$ 4145535 3980674 3837911 3715574 3611867 3524605 3452065 3393563 3348865 3317421 3298555
59484C298555o480O180J9122L2159M5312N8970P3740Q9969J07380J25488J44314
$$ 3298555 3292075 3298255 3317377 3349536 3394848 3453818 3527558 3617527 3724907 3850395 3994709
59473C994709J64082J84337K04201K23633K43303K62842K80163K92879K99403
$$ 3994709 4158791 4343128 4547329 4770962 5014265 5277107 5557270 5850149 6149552
59464F149552K98199K87262K65265K32364J89123J35796P3753O750o0434j24228
$$ 6149552 6447751 6735013 7000278 7232642 7421765 7557561 7631314 7638064 7577630 7453402
59454G453402j82384k32720k73075l02312l20501l28373l27254l19146l06058
$$ 7453402 7271018 7038298 6765223 6462911 6142410 5814037 5486783 5167637 4861579
59445D861579k89415k70423k50402k30241k10108j90200j71191j53482j36764
$$ 4861579 4572164 4301741 4051339 3821098 3610990 3420790 3249599 3096117 2959353
59436B959353j20921j06561r4119q3146p3092o3972n5640m7384l8918l1021k4339
$$ 2959353 2838432 2731871 2637752 2554606 2481514 2417542 2361902 2314518 2275600 2244579 2220240
59425B220240j8427j2588o816j320L936Q581J1899J4218J6925K0368K3173K4675
$$ 2220240 2201813 2189225 2182409 2181089 2185025 2193606 2205505 2219723 2236648 2257016 2280189 2304864
59413B304864K6429L0004L4784L9380M3508M6598M6270M0919L3172K8202K8828
$$ 2304864 2331293 2361297 2396081 2435461 2478969 2525567 2571837 2612756 2645928 2674130 2702958
59402B702958L4231M2959N4645O8713Q3825R9241J14952J29969J42303J51576
$$ 2702958 2737189 2780148 2834793 2903506 2987331 3086572 3201524 3331493 3473796 3625372
59392C625372J60463J72783J90926K15362K45472K80268L18897L60863M05361
$$ 3625372 3785835 3958618 4149544 4364906 4610378 4890646 5209543 5570406 5975767
59383E975767M50571M94181N34247N68701N94470O08146O07587N92097N61792
$$ 5975767 6426338 6920519 7454766 8023467 8617937 9226083 9833670 10425767 10987559
59374A0987559N18190M65270M08345L51471K96687K45488J99538J59572J24657
$$ 10987559 11505749 11971019 12379364 12730835 13027522 13273010 13472548 13632120 13756777
59365A3756777R2834O1826K9085p756n0018r7795j50322k05589k59855l08550
$$ 13756777 13849611 13911437 13940522 13932766 13882748 13784953 13634631 13429042 13169187 12860637
59355A2860637l47903l75308l88690l86890l70911l44096l11101k77131k47454
$$ 12860637 12512734 12137426 11748736 11361846 10990935 10646839 10335738 10058607 9811153
59346I811153k26174k15020k13812k21784k37624k58654k81189l01925l18424
$$ 9811153 9584979 9369959 9156147 8934363 8696739 8438085 8156896 7854971 7536547
59337G536547l28786l31904l28043l18219l03194k83759k61511k38175k14363
$$ 7536547 7207761 6875857 6547814 6229595 5926401 5642642 5381131 5142956 4928593
59328D928593j90084j66155j43892j23524j04163q5392o7684n1222l5413j9868
$$ 4928593 4738509 4572354 4428462 4304938 4200775 4115383 4047699 3996477 3961064 3941196
59318C941196m920R025K1923L3745M4415N4028O2541O9397P4045P6464P6490P3126
$$ 3941196 3936276 3945301 3967224 4000969 4045384 4099412 4161953 4231350 4305395 4381859 4458349 4531475
59306D531475O5583N4573M1648K7552J2316l541j9052l3767m7375n8648o6088
$$ 4531475 4597058 4651631 4693279 4720831 4733147 4729606 4710554 4676787 4629412 4570764 4504676
59295D504676o9551p0053o8071o3306n6023m7208l7272k5758j2507J967J7380
$$ 4504676 4435125 4365072 4297001 4233695 4177672 4130464 4093192 4067434 4054927 4056894 4074274
59284D074274L3896N1269O8803Q6301J04198J22562J40672J57643J72833J85746
$$ 4074274 4108170 4159439 4228242 4314543 4418741 4541303 4681975 4839618 5012451 5198197
59274E198197J96081K03543K07011K04591J95265J79743J58641J30847R5392N4461
$$ 5198197 5394278 5597821 5804832 6009423 6204688 6384431 6543072 6673919 6769311 6823772
59264F823772J2957k4674n5997p9810r5914j05645j10945j12709j11376j08694
$$ 6823772 6836729 6812055 6756058 6676248 6580334 6474689 6363744 6251035 6139659 6030965
59254F030965j07098j07299j08110j08725j09493j10438j10727j09796j07558
$$ 6030965 5923867 5816568 5708458 5599733 5490240 5379802 5269075 5159279 5051721
59245E051721j03364r6409q7181p6869o5178n0425l1986j0975J1768L6592O3709
$$ 5051721 4948357 4851948 4764767 4687898 4622720 4572295 4540309 4529334 4541102 4577694 4641403
59234D641403R2730J23944J58269J95438K33854K72668L12192L51519L87426M16273
$$ 4641403 4734133 4858077 5016346 5211784 5445638 5718306 6030498 6382017 6769443 7185716
59224G185716M35494M42521M34099M07747L62991L00627K22273J31169L2143p0027
$$ 7185716 7621210 8063731 8497830 8905577 9268568 9569195 9791468 9922637 9954780 9884753
59214I884753j71080k65977l48986m15869m64890m95391n07230n02209m84296
$$ 9884753 9713673 9447696 9098710 8682841 8217951 7722560 7215330 6713121 6228825
59205F228825m57368m23986l86841l49437l14201k81312k50362k21791j95954
$$ 6228825 5771457 5347471 4960630 4611193 4296992 4015680 3765318 3543527 3347573
59196C347573j72397j51043j32566j16648j01643q7087p4840o6297o0021n3698
$$ 3347573 3175176 3024133 2891567 2774919 2673276 2586189 2511349 2445052 2385031 2331333
59186B331333m7099m1408l6816l2466k8024k3658j9079j3950q703l876P95N644
$$ 2331333 2284234 2242826 2206010 2173544 2145520 2121862 2102783 2088833 2080130 2076254 2077049 2082693
59174B082693J0188J4049J7879K2317K6815L0633L4255L8648M3775M8927N3942
$$ 2082693 2092881 2106930 2124809 2147126 2173941 2204574 2238829 2277477 2321252 2370179 2424121
59163B424121N9111O4366O9567P5008Q0758Q6133R0589R4401R7717R9757R9799
$$ 2424121 2483232 2547598 2617165 2692173 2772931 2859064 2949653 3044054 3141771 3241528 3341327
59152C341327R8018R4504Q8445P9388O8324N6298M2883K7454J1181l836j7012
$$ 3341327 3439345 3533849 3622294 3701682 3770006 3826304 3869187 3896641 3907822 3903986 3886974
59141C886974k9301m0919n0530n6791n9602n9623n7429n3368m7617m0209l1254
$$ 3886974 3857673 3816754 3766224 3709433 3649831 3590208 3532779 3479411 3431794 3391585 3360331
59130C360331k1037r659L062J7023L1568M6085O0487P4911Q9597J05293J22907
$$ 3360331 3339294 3329635 3332697 3349720 3381288 3427373 3487860 3562771 3652368 3757661 3880568
59119C880568J42342J62366J82028K01497K21081K40436K59233K77642K95369
$$ 3880568 4022910 4185276 4367304 4568801 4789882 5030318 5289551 5567193 5862562
59110E862562L10923L22407L28196L26299L13895K88396K48679J95273J30542
$$ 5862562 6173485 6495892 6824088 7150387 7464282 7752678 8001357 8196630 8327172
59101H327172N9103j3159q1501j43207j96000k37270k65882k83568k93448k97923
$$ 8327172 8386275 8373116 8291615 8148408 7952408 7715138 7449256 7165688 6872240 6574317
59091F574317k98683k97382k94953k90990k84923k77096k67904k56846k43525
$$ 6574317 6275634 5978252 5683299 5392309 5107386 4830290 4562386 4305540 4062015
59082D062015k28720k13420j97709j81657j66387j53026j41248j30139j19767
$$ 4062015 3833295 3619875 3422166 3240509 3074122 2921096 2779848 2649709 2529942
59073B529942j10775j02956r5460q8002q0891p4283o8274o3203n8926n4417m8952
$$ 2529942 2419167 2316211 2220751 2132749 2051858 1977575 1909301 1846098 1787172 1732755 1683803
59062A683803m3075l7612l2473k7379k2923j9812j7806j6429j6046j6989j8301
$$ 1683803 1640728 1603116 1570643 1543264 1520341 1500529 1482723 1466294 1450248 1433259 1414958
59051A414958j8580j7650j6259j4666j2572j0033p223l697J088O676J1932J6097
$$ 1414958 1396378 1378728 1362469 1347803 1335231 1325198 1317975 1314278 1315366 1322042 1333974 1350071
59039A350071J8843J9798J8790J6238J2640Q374M598L311N433R581J3828J7911
$$ 1350071 1368914 1388712 1407502 1423740 1436380 1444754 1449352 1452663 1458096 1467677 1481505 1499416
59027A499416K2522K7159L0175L0549K8459K4306J8429J1660N075q83o330j1184
$$ 1499416 1521938 1549097 1579272 1609821 1638280 1662586 1681015 1692675 1697750 1696867 1690537 1679353
59015A679353j4881j6645j5716j1906o350r68L194O495R289J1240J2421J3610
$$ 1679353 1664472 1647827 1632111 1620205 1613855 1612887 1616081 1622576 1631865 1643105 1655526 1669136
59003A669136J4606J3661R736M105j449o772j2407j7789k1882k4618k6223k6076
$$ 1669136 1683742 1697403 1707139 1711244 1709795 1703023 1690616 1672827 1650945 1626327 1600104 1574028
58991A574028k3782k0451j7385j4364j0759p288m925l007m19K187L414L810N251
$$ 1574028 1550246 1529795 1512410 1498046 1487287 1479999 1475074 1472067 1471648 1473835 1477249 1481059 1486310
58978A486310P995J0534J2327J4498J7503K0217K1874K3260K5257K7513K9261
$$ 1486310 1494305 1504839 1517166 1531664 1549167 1569384 1591258 1614518 1639775 1667288 1696549
58967A696549L0439L1462L2649L4195L6043L7619L8372L8538L8814L9369L9840
$$ 1696549 1726988 1758450 1791099 1825294 1861337 1898956 1937328 1975866 2014680 2054049 2093889
58956B093889M0136M0532M1169M2012M3053M4131M5055M6354M9118N3573N8739
$$ 2093889 2134025 2174557 2215726 2257738 2300791 2344922 2389977 2436331 2485449 2539022 2597761
58945B597761O4260P1342Q0886R1806J02548J13202J24631J36427J47416J57528
$$ 2597761 2662021 2733363 2814249 2906055 3008603 3121805 3246436 3382863 3530279 3687807
58935C687807J67504J77295J86542J96288K08593K24672K44681K68971K98070
$$ 3687807 3855311 4032606 4219148 4415436 4624029 4848701 5093382 5362353 5660423
58926E660423L31561L68447M08505M52116M99030N48386N99563O51791P03329
$$ 5660423 5991984 6360431 6768936 7221052 7720082 8268468 8868031 9519822 10223151
58917A0223151P52035P96099Q32940Q57992Q65910Q52403Q13756P45839O45828
$$ 10223151 10975186 11771285 12604225 13462217 14328127 15180530 15994286 16740125 17385953
58908A7385953N14955L58387J83229j783j85701l57313n08404o34277p31888p99468
$$ 17385953 17900908 18259295 18442524 18440741 18255040 17897727 17389323 16755046 16023158 15223690
58898A5223690q37875q50584q42086q17198p81053p37806o89530o37734n85401
$$ 15223690 14385815 13535231 12693145 11875947 11094894 10357088 9667558 9029824 8444423
58889H444423n35721m89357m44980m02277l62575l26795k94740k66433k42195
$$ 8444423 7908702 7419345 6974365 6572088 6209513 5882718 5587978 5321545 5079350
58880E079350k21456k03103j86917j73078j60532j47806j35257j24507j15654
$$ 5079350 4857894 4654791 4467874 4294796 4134264 3986458 3851201 3726694 3611040
58871C611040j06995r7628q8379q0115p2980o7393o3859o1488n8505n4500n0483
$$ 3611040 3504045 3406417 3318038 3237923 3164943 3097550 3033691 2972203 2913698 2859198 2808715
58860B808715m6663m1994l6239l0537k5527k0544j5091r495l809K438R058J5194
$$ 2808715 2762052 2720058 2683819 2653282 2627755 2607211 2592120 2582625 2578816 2581254 2590312 2605506
58848B605506K0733K6433L2516L8485M4237N0001N5432O0269O5560P2509Q0508
$$ 2605506 2626239 2652672 2685188 2723673 2767910 2817911 2873343 2933612 2999172 3071681 3152189
58837C152189Q8179R5943J05287J15943J26275J36456J48537J63020J78067J92739
$$ 3152189 3240368 3336311 3441598 3557541 3683816 3820272 3968809 4131829 4309896 4502635
58827D502635K08580K27061K47775K70191K95197L23697L55458L90342M29079
$$ 4502635 4711215 4938276 5186051 5456242 5751439 6075136 6430594 6820936 7250015
58818G250015M71846N17550N65280O15035O66103P15872P60711P96812Q19901
$$ 7250015 7721861 8239411 8804691 9419726 10085829 10801701 11562412 12359224 13179125
58809A3179125Q25512Q09931P69742P00908O00589M70385L16293J45527l4536
$$ 13179125 14004637 14814568 15584310 16285218 16885807 17356192 17672485 17818012 17783476
58800A7783476k14481l83094n31024o52928p45911q08413q41685q50200q39134
$$ 17783476 17568995 17185901 16654877 16001949 15256038 14447625 13605940 12755740 11916606
58791A1916606q12532p74287p28873o79955o29592n79460n31381m86132m43384
$$ 11916606 11104074 10329787 9600914 8920959 8291367 7711907 7180526 6694394 6251010
58782F251010m03269l66563l33123l02076k73700k49067k27605k07368j88186
$$ 6251010 5847741 5481178 5148055 4845979 4572279 4323212 4095607 3888239 3700053
58773C700053j72005j59514j48995j39337j31429j25400j19214j11527j03624
$$ 3700053 3528048 3368534 3219539 3080202 2948773 2823373 2704159 2592632 2489008
58764B489008r6896r0548q3462p6229o9627o2869n5165m7276m0000l2673k4762
$$ 2489008 2392112 2301564 2218102 2141873 2072246 2009377 1954212 1906936 1866936 1834263 1809501
58753A809501j7335j1410o326j179L583P481J1381J6132K1201K5933L0607L4843
$$ 1809501 1792166 1780756 1774430 1773251 1776834 1784315 1795696 1811828 1833029 1858962 1889569 1924412
58741A924412L6508L3761K6794J6362K354j4471l0972m3841n2330n7354n9275
$$ 1924412 1960920 1994681 2021475 2037837 2040191 2025720 1994748 1950907 1898577 1841223 1781948
58730A781948n8277n5732n3139n0483m7121m3599m1122l9876l9140l8410l7391
$$ 1781948 1723671 1667939 1614800 1564317 1517196 1473597 1432475 1392599 1353459 1315049 1277658
58719A277658l5638l3180l0812k8945k7029k4704k2446k0447j8136j5490j3502
$$ 1277658 1242020 1208840 1178028 1149083 1122054 1097350 1074904 1054457 1036321 1020831 1007329
58708A007329j2526j1639j0383r684j0090j0662j0509j0017r583q671p097n771
$$ 1007329 994803 983164 972781 963097 953007 942345 931836 921819 912236 903565 896468 890697
58696H90697n197m746m250m637o052p167p427q196j0329j2463j3012j2256j1121
$$ 890697 885500 880754 876504 871867 865815 858648 851221 843025 832696 820233 807221 794965 783844
58683G83844r590p647o176n447m266j911O60K751N273Q780J1967J3691J4788J6227
$$ 783844 774254 766607 760431 754984 750718 748807 749467 752218 757491 766271 778238 791929 806717 822944
58669H22944J7114J6226J4072J1831R656P536O304O261O138M848K876P13k314
$$ 822944 840058 856284 870356 882187 891843 899379 905683 911944 918082 922930 925806 926519 924205
58656I24205o294r657j1342j2245j2998j2333r407n756k977k64L640P773J0533
$$ 924205 917911 908254 896912 884667 871669 859336 849929 844173 841196 840932 844572 852345 862878
58643H62878J2312J4427J6704J8309J9749K2028K4899K7689L0731L4347L7856
$$ 862878 875190 889617 906321 924630 944379 966407 991306 1018995 1049726 1084073 1121929
58632A121929M1183M5829N2501N9524O5481P1703Q0110R0299J00968J12542J26100
$$ 1121929 1163112 1208941 1261442 1320966 1386447 1458150 1538260 1628559 1729527 1842069 1968169
58621A968169J41187J57004J74285J93623K13372K31425K47636K61953K71489
$$ 1968169 2109356 2266360 2440645 2634268 2847640 3079065 3326701 3588654 3860143
58612C860143K71978K61069K37973K01486J51237R0230K3684m3877j08481j65137
$$ 3860143 4132121 4393190 4631163 4832649 4983886 5074116 5097800 5053923 4945442 4780305
58602D780305k09287k39443k56469k61297k55348k41959k24881k05950j86005
$$ 4780305 4571018 4331575 4075106 3813809 3558461 3316502 3091621 2885671 2699666
58593B699666j66761j49650j34078j19065j05383r3915q3380p2164o1157n2103
$$ 2699666 2532905 2383255 2249177 2130112 2024729 1930814 1847434 1775270 1714113 1662010
58583A662010m4388l6096k7292j9481j2846o660j578J242K642M477O898R028J1629
$$ 1662010 1617622 1581526 1554234 1534753 1521907 1515247 1513669 1514911 1517553 1522030 1528928 1537956 1549585
58570A549585J6420K3336L0788L8070M5207N1037N3715N2485M6876L5190J6295
$$ 1549585 1566005 1589341 1620129 1658199 1703406 1754443 1808158 1860643 1907519 1942709 1959004
58559A959004p647l2443n5123p4033q7050r2525r1484q6602p9473p0696o1601
$$ 1959004 1951357 1918914 1863791 1789758 1702708 1610183 1518699 1432097 1352624 1281928 1220327
58548A220327n3626m6707m0292l4977l1312k8278k4875k1880k0040j8278j5814
$$ 1220327 1166701 1119994 1079702 1044725 1013413 985135 960260 938380 918340 900062 884248
58537H84248j4140j4331j4377j2056q644o756o263n603n277o579q296q348p503
$$ 884248 870108 855777 841400 829344 820700 813944 807681 802078 796801 790222 781926 773578 766075
58524G66075p938r238r305q115p115o056l983k192k396l090j595J232K394J936
$$ 766075 758137 748899 739594 731479 724364 718308 714325 712133 709737 706647 705052 706284 708678 710614
58510G10614K580M803O483P144Q419J0388J1401J1650J3058J5632J7439J8235
$$ 710614 713194 717997 724480 731624 740043 750431 761832 773482 786540 802172 819611 837846
58498H37846J9552K1297K1999K2329K4637K8787L2021L3190L3567L3360L0895
$$ 837846 857398 878695 900694 923023 947660 976447 1008468 1041658 1075225 1108585 1139480
58487A139480K5707J9243J2298M769k293p581j2364j9003k6897l3126l6815l9457
$$ 1139480 1165187 1184430 1196728 1201497 1199204 1191623 1179259 1160256 1133359 1100233 1063418 1023961
58475A023961m1199m0533l7608l4310l1098k7126k3180k0947j9668j7163j3822
$$ 1023961 982762 942229 904621 870311 839213 812087 788907 767960 748292 731129 717307
58464G17307j1895j1243r709p299n981n635m376k592k360l107k165L62J824K061
$$ 717307 705412 694169 684460 677161 671180 665545 661169 658577 656217 653110 650945 651307 653131 655192
58450F55192L616O746Q876R481J0873J3563J5388J5960J7543K0757K3660K5705
$$ 655192 658808 665554 674430 683911 694784 708347 723735 739695 757238 777995 801655 827360
58438H27360K8289L0786L0487K7138K3104J8481J0627m96j1155j9019k5127k9882
$$ 827360 855649 886435 916922 944060 967164 985645 996272 995776 984621 965602 940475 910593
58426I10593l1614l0313k8331k6278k2462j7219j3403j1521q929m799j368P52
$$ 910593 878979 848666 820335 794057 771595 754376 740973 729452 720523 715724 714356 715108
58414G15108L750Q044J1217J2834J5579K0225K4049K5686K7008K8632K8114K4167
$$ 715108 718858 726902 738119 750953 766532 786757 810806 836492 863500 892132 920246 944413
58402I44413J8479J1975L581o013j3736j8496k2013k4486k4074k1465j9958j9872
$$ 944413 962892 974867 978448 972435 958699 940203 918190 893704 869630 848165 828207 808335
58390H08335j7927j3291r209p398o048m554m849o638o719m626l523m194l644j123
$$ 808335 790408 777117 767908 760510 754462 749908 745059 738421 731702 727076 723553 719359 715715 714592
58376G14592L50RQ41L307L914K107K220N988R383R653R417J0788J1588J0509J0243
$$ 714592 714942 714951 715792 719099 723013 725120 727340 733328 742711 752364 761781 772569 784157 794666 804909
58361H04909J2170J3501J2816J3030J5766J8345J9257K1023K4658K7008K6526
$$ 804909 817079 830580 843396 856426 872192 890537 909794 930817 955475 982483 1009009
58350A009009K5806K5487K1703J2954L446l670j0240j7061k0501j9031j6778j6577
$$ 1009009 1034815 1060302 1082005 1094959 1098405 1094735 1084495 1067434 1046933 1027902 1011124 994547
58338I94547j5501j1256o867m871k963M66K591K079K588O111Q984Q754Q760J1469
$$ 994547 979046 967790 960923 956052 953089 953555 956146 958225 960813 966924 975908 984662 993422 1004891
58324A004891J3718J3135J3028J6022J9151J9974K1387K5511K9129K9934L0865
$$ 1004891 1018609 1031744 1044772 1060794 1079945 1099919 1121306 1146817 1175946 1205880 1236745
58313A236745L3441L3380K7993K1263J6495J0657J429p019j0912j2817j5284j5363
$$ 1236745 1270186 1303566 1331559 1352822 1369317 1379974 1381403 1374384 1363472 1350655 1335371 1320008
58301A320008j1123o712n160l043K095O276O775P758J2122J5563J5140J5740K1133
$$ 1320008 1308885 1302173 1297013 1293970 1296065 1302341 1309116 1316874 1328996 1344559 1359699 1375439 1396572
58288A396572K6504K7188K6990L0378L4156L4777L6239M2669N0426N5432O0886
$$ 1396572 1423076 1450264 1477254 1507632 1541788 1576565 1612804 1655473 1705899 1761331 1822217
58277A822217O9853P7853Q0835Q2558Q5926Q5232P5603O1887M9504L5046J5199
$$ 1822217 1892070 1969923 2050758 2133316 2219242 2304474 2380077 2441964 2491468 2526514 2541713
58266B541713l708j4720k0601k5705k6333j9059r849m595P73J0680J9761K2853
$$ 2541713 2538005 2523285 2502684 2476979 2450646 2431587 2421738 2417143 2417916 2428596 2448357 2471210
58254B471210K5530L3586M1649M3727M5189N2265N9654O0963O1427O7549P4318
$$ 2471210 2496740 2530326 2571975 2615702 2660891 2713156 2772810 2833773 2895200 2962749 3037067
58243C037067P5777P7696Q6174R4567R5876R7016J06145J17185J22037J26461
$$ 3037067 3112844 3190540 3276714 3371281 3467157 3564173 3670318 3787503 3909540 4036001
58233D036001J37991J50184J55278J60257J73547J88488J97332K08045K28960
$$ 4036001 4173992 4324176 4479454 4639711 4813258 5001746 5199078 5407123 5636083
58224E636083K51135K65047K79896L06185L35074L56449L80637M19349M62493
$$ 5636083 5887218 6152265 6432161 6738346 7073420 7429869 7810506 8229855 8692348
58215H692348M98204N37683N94661O59682P21966P95997Q97456J015158J138081
$$ 8692348 9190552 9728235 10322896 10982578 11704544 12500541 13397997 14413155 15551236
58206A5551236J286496J483809J724736K007055K363965K824701L377095M013929
$$ 15551236 16837732 18321541 20046277 22053332 24417297 27241998 30619093 34633022
58198C4633022M779240N721935O851775Q200350R874793J1992293J4636722J7956391
$$ 34633022 39412262 45134197 51985972 60186322 70061115 82053408 96690130 114646521
58190A14646521K2188203K7430104L3448657L9774400M5652080M9421385M8140376
$$ 114646521 136834724 164264828 197713485 237487885 283139965 332561350 380701726
58183C80701726L8845432K1133432j422087k2900132l8449773m6445716m8013080
$$ 380701726 419547158 440680590 439258503 416358371 377908598 331462882 283449802
58176B83449802m5271276m0143960l4091338k8122467k2781991j8254053j4557952
$$ 283449802 238178526 198034566 163943228 135820761 113038770 94784717 80226765
58169H0226765j1636549r352361p542106o098106m955072m032537l250528k574457
$$ 80226765 68590216 59237855 51695749 45597643 40642571 36610034 33359506 30785049
58161C0785049j990757j461531r43864m22631J15000P03095J357977K048498K720196
$$ 30785049 28794292 27332761 26388897 25966266 26081266 26784361 28142338 30190836 32911032
58152C2911032L273020L469248K971418J621035l09397k229632l625761m325415
$$ 32911032 36184052 39653300 42624718 44245753 43936356 41706724 38080963 33755548
58144C3755548m438537m163216l678399l124174k589739k112275j705483j378923
$$ 33755548 29317011 25153795 21475396 18351222 15761483 13649208 11943725 10564802
58136A0564802j127232r28367p66644o41013n46148m66574l95397l39341l00042
$$ 10564802 9437570 8509203 7742559 7101546 6555398 6088824 5693427 5354086 5054044
58127E054044k68212k39943k20845k10663k00721j89263j82754j79958j71154
$$ 5054044 4785832 4545889 4325044 4114381 3913660 3724397 3541643 3361685 3190531
58118C190531j55129j40949j31007j18001j00519q6178p7149o7431n6672n2372
$$ 3190531 3035402 2894453 2763446 2645445 2544926 2458748 2381599 2314168 2257496 2205124
58108B205124n5858n9389n9316n9495o0147n6049m7510m0949l6973k9673j8900
$$ 2205124 2149266 2089877 2030561 1971066 1910919 1854870 1807360 1766411 1729438 1699765 1680865
58097A680865j1506r167o722l842o691j6243k6034l3201m1208n0110n4656n3772
$$ 1680865 1669359 1660192 1653470 1649628 1642937 1626694 1600660 1567459 1526251 1476141 1421485 1367713
58085A367713n2118n0885m6679m0501l7787l8376l6249l0473k6715k6577k5185
$$ 1367713 1315595 1264710 1218031 1177530 1139743 1101367 1065118 1034645 1007930 981353 956168
58074I56168k0957j8295j8662j8075j5372j4264j5320j4371j0707q725r672r686
$$ 956168 935211 916916 898254 880179 864807 850543 835223 820852 810145 801420 791748 782062
58062G82062p558o621p433o463l609l320o616r360r938j1258j3806j4130j1769
$$ 782062 774504 767883 760450 753987 750378 747058 740442 731082 721144 709886 696080 681950 670181
58049F70181j0438j0963j0012p126n848o688o126l791l399n254n224k585j473
$$ 670181 659743 648780 638768 631642 625794 619106 612980 609189 605790 600536 595312 592727 591254
58036E91254k864k596O91K954K305J986L451L431O25j319l62N90k79l30K033M117
$$ 591254 588390 585794 586485 589439 591744 593730 597181 600612 601237 599918 599556 600146 599867 599537 601570 605687
58020F05687M070M063N671P122P438Q430J0401J0841R415R339J1766J3768J3882
$$ 605687 609757 613820 619491 626613 634051 642481 652882 663723 673138 682477 694243 708011 721893
58007G21893J4553J7052J8953J8923J9209K0923K1497J9102J5396J1641O309j362
$$ 721893 736446 753498 772451 791374 810583 831506 853003 872105 887501 899142 905451 904089
57995I04089r350j6193k2543k8028l0569l0199k9490k9112k7095k3378k0523j8875
$$ 904089 894739 878546 856003 827975 797406 767207 737717 708605 681510 658132 637609 618734
57983F18734j5882j1357q507q252p532m887k727k279j308J128K567J980J967L855
$$ 618734 602852 591495 582988 574736 567204 562317 559590 557311 556003 557131 559698 561678 563645 567500
57969E67500N133M208L333M285N341N055N029O499P918Q250Q980J0716J1503J0561
$$ 567500 572633 576841 580174 584459 589800 594855 599884 606383 614301 622551 631531 642247 653750 664311
57955F64311R976J0593J0020O821L015M01j946m542n690m823m021m281l925k500
$$ 664311 674287 684880 694900 701721 704736 705137 703191 698649 692959 688136 684115 679834 675909 673409
57941F73409k284m039n309n071n942r394j2875j4204j4921j6578j7611j6698j5590
$$ 673409 671125 667086 661777 656706 650764 641370 628495 614291 599370 582792 565181 548483 532893
57928E32893j5755j5666j4213j3280j4042j4137j1602q451p199o802n194l085
$$ 532893 517138 501472 487259 473979 459937 445800 434198 425747 418548 411746 406552 403467
57916D03467k103j604l28R20R94P31J213J835K163L403N977Q070Q546Q739R511
$$ 403467 401364 399760 399432 400352 401346 402077 403290 405125 407288 410691 416668 424738 433284 442023 451534
57901D51534R375P552N935N793N536L978K840L478M108K936J282Q68P40l93j401
$$ 451534 460909 468461 474396 480189 485725 489703 492543 496021 500129 503065 504347 505215 505955 505562 504161
57886E04161j105r11k189l503l185k412k867l547k781j403j100j455j299j113
$$ 504161 503056 502145 499956 496453 493268 490856 487989 484442 481661 480258 479158 477703 476404 475291
57872D75291j659j930r49K47O56J326L060M195L118J017k17q30j709k167j624
$$ 475291 473632 471702 470753 471000 471656 472982 476042 480237 483355 484372 484155 483325 481616 479449 477825
57857D77825j409k504l465k960k213k605l030k186j179j264j135O71K838L553
$$ 477825 476416 473912 470447 467487 465274 462669 459639 457453 456274 455010 453875 454546 457384 460937
57843D60937L654M569N189M031K598L197M905N038L379J761N57j290l567n098
$$ 460937 464591 469160 474349 478380 480978 484175 489080 494118 497497 499258 499815 498525 494958 489860
57829D89860o017p236q316q343p988q509r531j0009j0309j1235j2068j1686j0514
$$ 489860 483843 476607 468291 459948 451960 443451 433920 423911 413602 402367 390299 378613 368099
57816C68099r351p699n274l585l792m470l873k799k772k989j851p7N41L10P89
$$ 368099 358748 351049 345775 342190 338398 333928 330055 327256 324484 321495 319644 319567 320108 320418 321207
57801C21207J885K475K922M330O188P296Q116R741J1521J2056J1568J0888R343
$$ 321207 323092 325567 328489 332819 339007 346303 354419 364160 375681 387737 399305 410193 419536
57788D19536O177K936J698J963J865J439J901K750K471J384R53R45k7j772l067
$$ 419536 425713 428649 430347 432310 434175 435614 437515 440265 442736 444120 445073 446018 445991 444219 441152
57773D41152m201o264q493r153q524q296q416p326m992k963j696l74R20J401J633
$$ 441152 436951 430687 422194 413041 404517 396221 387805 380479 375487 372524 370828 370454 371374 372775 374408
57758C74408K728L873L303J554R52J874K298J255Q0j41R1L32R66J780J797J021
$$ 374408 377136 381009 384312 385866 386818 388692 390990 392245 392325 392184 392275 392607 393573 395353 397150 398171
57742C98171N96R34J287J306J427J641J465J134J332J852K023K105K825L882M532
$$ 398171 398767 399701 400988 402294 403721 405362 406827 407961 409293 411145 413168 415273 418098 421980 426512
57727D26512N081O242P545Q182Q715J0093J1652J2106J1939J2599J3923J4554
$$ 426512 431593 437835 445380 453562 462277 472370 484022 496128 508067 520666 534589 549143
57715E49143J4493J5008J6264J7269J7929J9086K0683K1987K3435K6133K9677
$$ 549143 563636 578644 594908 612177 630106 649192 669875 691862 715297 741430 771107
57704G71107L2560L4687L7491M1684M6744N2496N9365O7196P5697Q5632R7872
$$ 771107 803667 838354 875845 917529 964273 1016769 1076134 1143330 1219027 1304659 1402531
57693A402531J11704J25973J41326J59217J79338K00151K21259K42729K62477
$$ 1402531 1514235 1640208 1781534 1940751 2120089 2320240 2541499 2784228 3046705
57684C046705K76932K83970K82746K71067K45850K06463J55403R6106L2741k8079
$$ 3046705 3323637 3607607 3890353 4161420 4407270 4613733 4769136 4865242 4897983 4869904
57674D869904p8761j14708j34915j38992j26769j01195o8810l6877j2779n981
$$ 4869904 4791143 4676435 4541520 4402528 4275759 4174564 4105754 4068877 4056098 4050117
57664D050117k5653p2927j36851j99835k46838k70328k70484k53261k26781j97125
$$ 4050117 4024464 3951537 3814686 3614851 3368013 3097685 2827201 2573940 2347159 2150034
57654B150034j67069j38235j12539r1044p3246n8347m6028l5612k6001j6973r165
$$ 2150034 1982965 1844730 1732191 1641147 1567901 1509554 1463526 1427914 1401913 1384940 1375775
57643A375775k483M085J1016J8018K5255L3220M1545M9788N9084P1002Q4887R8663
$$ 1375775 1373292 1377377 1388393 1406411 1431666 1464886 1506431 1556219 1615303 1686305 1771192 1869855
57631A869855J12170J27234J44275J61558J78157J94843K11284K24951K33637
$$ 1869855 1982025 2109259 2253534 2415092 2593249 2788092 2999376 3224327 3457964
57622C457964K36428K31167K13794J81922J37238Q3237K2956l9776r9317j50684
$$ 3457964 3694392 3925559 4139353 4321275 4458513 4541750 4564706 4524930 4425613 4274929
57612D274929j91834k22234k40948k47820k45061k35900k22508k06314j88972
$$ 4274929 4083095 3860861 3619913 3372093 3127032 2891132 2668624 2462310 2273338
57603B273338j71692j54615j38047j23245j10897r9960q9132p8574o9234o1416
$$ 2273338 2101646 1947031 1808984 1685739 1574842 1474882 1385750 1307176 1237942 1176526
57593A176526n4916m9665m5404m1476l7543l3810l0226k6525k3230k1289k0427
$$ 1176526 1121610 1071945 1026541 985065 947522 913712 883486 856961 833731 812442 792015
57582G92015j9231j7242j5440j4294j3013j1284j0024r690r433q646p790o974
$$ 792015 772784 755542 740102 725808 712795 701511 691487 681797 672364 663718 655928 648954
57570F48954n427l252j920j996k015p16J088K102K534L252M226N149O469Q501
$$ 648954 643527 640275 638355 636359 634344 633628 634716 636818 639352 642604 646830 651979 658448 666949
57556F66949J0436J1427J1908J2867J4506J6467J8725K1449K4606K8181L2189
$$ 666949 677385 688812 700720 713587 728093 744560 763285 784734 809340 837521 869710
57545H69710L6202L9779M3523M8672N5488O3191P1528Q1041R1628J02492J13730
$$ 869710 905912 945691 989214 1037886 1093374 1156565 1228093 1309134 1400762 1503254 1616984
57534A616984J26326J40224J53983J66714J78464J88232J93466J92113J83395
$$ 1616984 1743310 1883534 2037517 2204231 2382695 2570927 2764393 2956506 3139901
57525C139901J66079J38228R9849N4080M845m4860r1712j31490j61364j81246
$$ 3139901 3305980 3444208 3544057 3598137 3602982 3558122 3466410 3334920 3173556 2992310
57515B992310j91906j93515j87248j76216j63205j48872j33456j18524j05483
$$ 2992310 2800404 2606889 2419641 2243425 2080220 1931348 1797892 1679368 1573885
57506A573885r3882q2729p2267o3099n4923m7431m1137l6029l0832k4946j9643
$$ 1573885 1480003 1397274 1325007 1261908 1206985 1159554 1118417 1082388 1051556 1026610 1006967
57495A006967j5926j2731q745m585j436J157M414Q287J1968J5506J9519K4096
$$ 1006967 991041 978310 969565 964980 963544 964701 969115 977402 989370 1004876 1024395 1048491
57483A048491K9206L5195M1879M8334N4573O2098P1628Q1920R2079J03318J16822
$$ 1048491 1077697 1112892 1154771 1203105 1257678 1319776 1391404 1473324 1565403 1668721 1785543
57472A785543J31453J45350J58253J70361J80116J85068J83693J74542J55054
$$ 1785543 1916996 2062346 2220599 2390960 2571076 2756144 2939837 3114379 3269433
57463C269433J23598Q2007L4233j6546o7656j14985j53853j81725j98573k05322
$$ 3269433 3393031 3475038 3509271 3492725 3425069 3310084 3156231 2974506 2775933 2570611
57453B570611k03569j95933j84751j70809j54774j38767j24774j12377j00103
$$ 2570611 2367042 2171109 1986358 1815549 1660775 1522008 1397234 1284857 1184754
57444A184754q8164p7920o9367o1351n3732m7314m2036l7161l2880k9824k7395
$$ 1184754 1096590 1018670 949303 887952 834220 786906 744870 707709 674829 645005 617610
57433F17610k4504k1572j9845j9015j7612j5558j4297j4268j4220j3234j1754
$$ 617610 593106 571534 551689 532674 515062 499504 485207 470939 456719 443485 431731
57422D31731j0346q982p843p380p359p010o249n675n397n009m544m352m202l589
$$ 431731 421385 412403 404560 397180 389821 382811 376562 370887 365490 360481 355937 351585 347383 343794
57408C43794k721k157j797j317j104j620k227k005j259r34r80o62mL95N83R49
$$ 343794 341073 338916 337119 335802 334698 333078 330851 328846 327587 326653 325673 325011 325007 325402 325985 326934
57392C26934J107M95l96p34p90j221j532q06M84J058Q17O71P69N62K01K59L26
$$ 326934 328041 328536 328140 327406 326616 325395 323863 323057 323541 324599 325416 326087 326856 327418 327619 327878 328204
57375C28204l33j063o17N56P22m33j405j308q93q75r15o61l81j79K27P60J085
$$ 328204 327871 326808 326191 326747 327469 327036 325631 324323 323430 322555 321640 320979 320598 320419 320646 321406 322491
57358C22491J379J899K027J090j60l38N44J283J466J649J803J377Q30J368K889
$$ 322491 323870 325769 327796 328886 328726 328388 328932 330215 331681 333330 335133 336510 337340 338708 341597
57343C41597L857L461K434J558Q50L98N45J011J128R66J062J181P95N12J343K702
$$ 341597 345454 348915 351349 352907 353757 354155 354700 355711 356839 357805 358867 360048 360843 361355 362698 365400
57327C65400K971K026J376J652J929J772J967K782L374L440L714M271M173L379
$$ 365400 368371 370397 371773 373425 375354 377126 379093 381875 385249 388689 392403 396674 400847 404226
57313D04226L314M606N986O272O022O291P083P896Q626R123Q948Q298Q122Q732
$$ 404226 407540 412146 418132 424404 430426 436717 443800 451696 460322 469445 478393 486691 494813 503545
57299E03545R389R767J0628J2402J4281J5478J6332J7437J8670J9719K0735K1857
$$ 503545 512934 522701 533329 545731 560012 575490 591822 609259 627929 647648 668383 690240
57287F90240K2840K3669K4754K6119K7224K7827K8155K8098K7213K5662K4023
$$ 690240 713080 736749 761503 787622 814846 842673 870828 898926 926139 951801 975824
57276I75824K2032J8687J3841Q444K964l167j0171j7211k3434k8588l2361l4328
$$ 975824 997856 1016543 1030384 1038828 1041792 1038625 1028454 1011243 987809 959221 926860 892532
57264H92532l4922l5142l5012l3571l0696k7517k4642k1486j7788j4351j1696
$$ 892532 857610 822468 787456 753885 723189 695672 671030 649544 631756 617405 605709
57253F05709r436p522o524n984m292j193J159J039l46n67Q46K405L008K850K445
$$ 605709 596273 588751 582227 576243 571951 570758 571917 572956 572610 572043 572889 575294 578302 581152 583597
57238E83597K080K051K476K932K934K604K405K486K680K888L100L320L584L810
$$ 583597 585677 587728 590204 593136 596070 598674 601079 603565 606245 609133 612233 615553 619137 622947
57224F22947L755L489L640M534N485N749N782O406P206P143O444O303O718O491
$$ 622947 626702 630191 633831 638365 643850 649599 655381 661787 668993 676136 682580 688883 695601 702092
57210G02092N551N426O841Q558R323R483R831J0254J0472J0800J1335J1428J0861
$$ 702092 707643 713069 719910 728468 737791 747274 757105 767359 777831 788631 799966 811394 822255
57197H22255J0496J0980J1769J2211J2529J3018J3167J2448J1216J0138R385Q904
$$ 822255 832751 843731 855500 867711 880240 893258 906425 918873 930089 940227 949612 958516
57185I58516Q750Q705Q349P809P770Q466R547J0993J3110J5522J7376J8653K0060
$$ 958516 967266 975971 984320 992129 999899 1008365 1017912 1028905 1042015 1057537 1074913 1093566 1113626
57172A113626K1492K2079K1916K2192K3213K3966K4072K4481K5577K6378K6403
$$ 1113626 1135118 1157197 1179113 1201305 1224518 1248484 1272556 1297037 1322614 1348992 1375395
57161A375395K6665K7806K8870K9071K9263L0417L1837L2313L1991L1909L2453
$$ 1375395 1402060 1429866 1458736 1487807 1517070 1547487 1579324 1611637 1643628 1675537 1707990
57150A707990L3346L4482L5798L6961L7891L8984M0324M1468M2369M3575M5160
$$ 1707990 1741336 1775818 1811616 1848577 1886468 1925452 1965776 2007244 2049613 2093188 2138348
57139B138348M6486M7426M8641N0249N1443N1930N2530N3863N5633N7625O0131
$$ 2138348 2184834 2232260 2280901 2331150 2382593 2434523 2487053 2540916 2596549 2654174 2714305
57128B714305O2945O5342O7482P0461P4562P8963Q3608Q9719R7832J06865J15765
$$ 2714305 2777250 2842592 2910074 2980535 3055097 3134060 3217668 3307387 3405219 3512084 3627849
57117C627849J24592J33542J42471J51999J63498J77500J93614K12431K35873
$$ 3627849 3752441 3885983 4028454 4180453 4343951 4521451 4715065 4927496 5163369
57108E163369K65492L02128L47299M02810M68825N44900O33653P41303Q74417
$$ 5163369 5428861 5730989 6078288 6481098 6949923 7494823 8128476 8869779 9744196
57099I744196J038478J239660J484911J779239K125416K526915K988903L516217
$$ 9744196 10782674 12022334 13507245 15286484 17411900 19938815 22927718 26443935
57091B6443935M112325M778065N505821O273909P050168P800808Q493584R098216
$$ 26443935 30556260 35334325 40840146 47114055 54164223 61965031 70458615 79556831
57083G9556831R591726R952751J0123919R971972R316632Q042446O200325L993375
$$ 79556831 89148557 99101308 109225227 119197199 128513831 136556277 142756602 146749977
57075A46749977J658553o41113k831259m872995o714013q278170r482866j0265735
$$ 146749977 148408530 147767417 144936158 140063163 133349150 125070980 115588114 105322379
57067A05322379j0607633j0539174j0127620r457148q615671p686585o739760
$$ 105322379 94714746 84175572 74047952 64590804 55975133 48288548 41548788
57060D1548788n825637m977601m217477l556585k994658k522775k129049j801838
$$ 41548788 35723151 30745550 26528073 22971488 19976830 17454055 15325006 13523168
57052A3523168j530280j305004j118612r64551q36279p28178o36255n57216m88150
$$ 13523168 11992888 10687884 9569272 8604721 7768442 7040264 6404009 5846793 5358643
57043E358643m27650l75886l32517k95742k63828k36212k12535j92032j74443
$$ 5358643 4930993 4555107 4222590 3926848 3663020 3426808 3214273 3022241 2847798
57034B847798j60060j48313j37740j27808j19225j11976j04673r6452q8004q0164
$$ 2847798 2687738 2539425 2401685 2273877 2154652 2042676 1938003 1841551 1753547 1673383
57024A673383p2945o6461o1209n6905n2461m7678m3542m0471l7739l4975l2635
$$ 1673383 1600438 1533977 1472768 1415863 1363402 1315724 1272182 1231711 1193972 1158997 1126362
57013A126362l0608k7901k4152j9995j5601j0401m412J775Q589J7429K8863M2488
$$ 1126362 1095754 1067853 1043701 1023706 1008105 997704 993292 995067 1003656 1021085 1049948 1092436
57001A092436N8536P7956J00871J26121J50684J66445J59302J17680M5126l8292
$$ 1092436 1150972 1228928 1329799 1455920 1606604 1773049 1932351 2050031 2095157 2056865
56991B056865j09385j55656j76633j77163j63168j41076j16419r2142o9701n1081
$$ 2056865 1947480 1791824 1615191 1438028 1274860 1133784 1017365 925223 855522 804441
56981H04441l8380l2321l2453l7677m5398n1582n3429n1358m7306m2195l6151
$$ 804441 766061 733740 701287 663610 618212 566630 513201 461843 414537 372342 336191
56970C36191k9799k3811j7987j2035o441j597L006P808J2496J7062K2242K8039
$$ 336191 306392 282581 264594 252559 246118 244521 247527 255335 267831 284893 307135 335174
56958C35174L3154L6825L9638M1214L8725K9524J4409k964j8945l1074l7829l9078
$$ 335174 368328 405153 444791 486005 524730 554254 568663 565699 546754 515680 477851 438773
56946D38773l6360l1523k5583j9387j4144j0188o384j956K216N283Q300J2893
$$ 438773 402413 370890 345307 325920 311776 301588 295204 293248 295464 300747 309047 321940
56934C21940J9041K5575L2147L9148M5904M9954M7974L7283J7853o194k8195m3396
$$ 321940 340981 366556 398703 437851 483755 533709 581683 618966 636819 630625 602430 559034
56922E59034n1376n3960n2334m7300m0625l4224k8626k3514j9105j5778j3196
$$ 559034 507658 453698 401364 354064 313439 279215 250589 227075 207970 192192 178996
56911A78996j0961r400q617p668n873m063l308l213k704j743r59k74Q22K220L473
$$ 178996 168035 158635 150018 142350 136477 132414 129106 125893 123189 121446 120487 120213 121035 123255 126728
56896A26728M690O123P523Q832J0778J3899J7681K1578K5982L1240L6599M0908
$$ 126728 131418 137541 145064 153896 164674 178573 196254 217832 243814 275054 311653 352561
56884C52561M3343M2465L6045K3447P395p926j9859k7466l0213k8430k4208j9924
$$ 352561 395904 438369 474414 497861 505256 497330 477471 450005 419792 391362 367154 347230
56872C47230j6024j1482o001l42N047J0404J6026K2414L0563M0858N2096O2789
$$ 347230 331206 319724 313723 313381 318428 328832 344858 367272 397835 438693 490789 553578
56860E53578P2882Q2649Q9940Q9767P7141N0544J3768k4789n5870p4301q0780
$$ 553578 626460 709109 799049 888816 965957 1016501 1030269 1005480 949610 875309 794529
56849G94529p8907p1506o0250m7073l3959k1763j0435J04J0285K1228L3711M7531
$$ 794529 715622 644116 583866 536793 502834 481071 470636 470740 481025 502253 535964 583495
56837E83495O2746Q0378J00605J21282J39213J51201J52211J34691R3678L3459
$$ 583495 646241 726619 827224 948506 1087719 1238920 1391131 1525822 1619500 1652959
56827A652959l2642q9795j28722j47264j48366j37447j19873r9343p8342n9097
$$ 1652959 1620317 1530522 1401800 1254536 1106170 968723 848850 749507 671165 612068
56817F12068m2925k9162j6214l541Q500K0389L3484M8373O4378Q0615R6127J08553
$$ 612068 569143 539981 523767 520226 528726 549115 582599 630972 695350 775965 872092 980645
56805I80645J13268J04471P7892L4412j7707o5509r8629j14644j17376j11423
$$ 980645 1093913 1198384 1276276 1310688 1292981 1227472 1128843 1014199 896823 785400
56795G85400r9697q4609o8754n3842m0377k8581j8593r934j872N833J3333K1355
$$ 785400 685703 601094 532340 478498 438121 409540 390947 381013 379141 384974 398307 419662
56783D19662L0366L9685M8335N5788O0426N8317M5677K2847n333l2604n3907o6278
$$ 419662 450028 489713 538048 593836 654262 712579 758256 781103 775770 743166 689259 622981
56771F22981o9655o6852o1160n3878m5194l6493k9744k5024k0678j6035j2105
$$ 622981 553326 486474 425314 371436 326242 289749 260005 234981 214303 198268 186163
56760A86163r570p887o608n887n439m473l089k281k305k329j905j546j631j917
$$ 186163 176593 168706 162098 156211 150772 146299 143210 140929 138624 136295 134390 132844 131213 129296
56746A29296k268k770l029k477j431p47n55l15l2j67n64o78p17j347k312k600
$$ 129296 127028 124258 121229 118752 117321 116574 116019 115704 115672 115505 114941 114263 113546 112199 109887 107287
56730A07287j911q91j07J90k69j264j663q49R6r9q64q51k39j29l55lM26l51j774
$$ 107287 105376 104485 104378 104568 104299 103035 101372 100523 100619 100520 99656 98805 98566 98437 98082 98079 98505 98154 96380
56711I6380j883m63O01M03J35O11R05K32p02j078j014o14M12J584J724Q42L59
$$ 96380 94497 94034 94635 95038 95173 95784 96689 96921 96219 95141 94127 93513 93925 95509 97233 98075 98434
56694I8434Q12J033L20k48L38J342J563J082P69R49J481K319L213L519K924J834
$$ 98434 99246 100279 100599 100351 100689 102031 103594 104676 105445 106394 107875 110194 113407 116926 119850 121684
56678A21684Q48L37N40J250J606J057L46M65R93Q05Kl59j99l62p86n80R4P5o34
$$ 121684 122532 122869 123409 124659 126265 127322 127668 128133 129126 129931 129933 129574 129375 129013 128227 127647 127741 127816 127182
56659A27182p23J34P43N41M10P95Q96L28j36k06o70j679k079j323m90n87j222
$$ 127182 126459 126593 127336 127877 128287 129082 129978 130306 130170 129964 129294 127615 125536 124213 123723 123136 121914
56642A21914j771k409l209l605l470l444l620l220k123j300j137q47r6K91J8P1
$$ 121914 120143 117734 114525 110920 107450 104006 100386 97166 95043 93743 92606 91759 91663 91954 91972 92043
56626I2043R84J767J511P82N27P74J136J490J568R87J59L2N70Q46P46J083J757
$$ 92043 93027 94794 96305 97087 97614 98388 99524 101014 102582 103569 103728 103760 104330 105176 105922 107005 108762
56609A08762J631O78K55P86J053M94J20L52M5j233k033j346k68J5J53J075K084
$$ 108762 110393 111071 111326 112112 113165 113659 113779 114131 114176 112943 110910 109564 109296 109311 109464 110539 112623
56592A12623K011J011p1q75j077j50J388J996J388J200K357L519L410K808K810
$$ 112623 114634 115645 115574 114699 113622 113472 114860 116856 118244 119444 121801 125320 128730 131538 134348
56577A34348K844K077J262J397J913J880J736K180K595K295K144L239M959N932
$$ 134348 137192 139269 140531 141928 143841 145721 147457 149637 152232 154527 156671 159910 164869 170801
56563A70801N987N691N024M067L873M980O083N777M655M068L886L217K447K562
$$ 170801 176788 182479 187503 191570 195443 200423 206506 212283 216938 221006 224892 228109 230556 233118
56549B33118L119K790J509L59l68j372k856m128m683m627m303m231m940o054o309
$$ 233118 236237 239027 240536 240895 240527 239155 236299 232171 227488 222861 218558 214327 209387 203333 197024
56534A97024n226l939l478l282k426j246o63p75j222j987k830l028k730l324n204
$$ 197024 191798 187859 184381 181099 178673 177427 176764 175989 174767 172780 169950 166922 164192 160868 155664
56519A55664o581n867l991k747k109j042K02N73K68L16P01O35K75M34J039J365
$$ 155664 149083 143216 139225 136478 134369 133327 133529 134102 134370 134686 135387 136022 136297 136731 137770 139135
56503A39135J417J586J433L49j008j411q55l20o2M12R82Q85K9q17j095q38k20
$$ 139135 140552 142138 143571 143920 142912 141501 140646 140326 140264 140676 141658 142543 142572 141755 140660 139822 139602
56486A39602N06R55J066J228J515J605J734K595L744L627J961O21R97J997K073
$$ 139602 140108 141063 142129 143357 144872 146477 148211 150806 154550 158177 160138 160759 161756 163753 165826
56471A65826J644J959K808L180L107L149K993K213J552J845K484K453K027J958
$$ 165826 167470 169429 172237 175417 178524 181673 184666 186879 188431 190276 192760 195213 197240 199198
56457A99198J960J429P48L83k82j649k602k098r63m26o1R69J871J510O44P56J479
$$ 199198 201158 202587 203335 203718 203436 201787 199185 197087 196124 195698 195637 196606 198477 199987 200631 201387 202866
56440B02866J412O75N01R00Q26K12k51p70j936l080l162k738l071l810l634k723
$$ 202866 204278 204953 205454 206354 207180 207392 207141 206371 204435 201355 198193 195455 192384 188574 184940 182217
56424A82217k440k947l116k642k239k012j496j065j425k009j662o79l29o83p05
$$ 182217 179777 176830 173714 171072 168833 166821 165325 164260 162835 160826 159164 158485 158156 157473 156768
56409A56768k05J05J96O16J103R91O68R15J314R80M35Q85K013K434J868J119L21
$$ 156768 156563 156668 156864 157480 158583 159574 160242 161157 162471 163451 163886 164771 166784 169218 171086 172205 172526
56392A72526q29j581r15N17J132R00J106K013K622K595K613K909L052L019L006
$$ 172526 171697 170116 169201 169718 170850 171750 172856 174869 177491 180086 182699 185608 188660 191679 194685
56377A94685K619J708J259J940K623K083J190J427K333K511K173K357K564J732
$$ 194685 197304 199012 200271 202211 204834 206917 208107 209534 211867 214378 216551 218908 221472 223204
56363B23204O96J020K038J812M81j33K45L10MN05J511J440L17k46N1L3k70M13
$$ 223204 223900 224920 226958 228770 229251 229118 229363 229673 229677 230182 231693 233133 233450 233204 233255 233288 233018 233431
56345B33431J870K391J761J615K513L196L110L152L594L717L731M652O068O436
$$ 233431 235301 237692 239453 241068 243581 246777 249887 253039 256633 260350 264081 268733 274801 281237
56331B81237N797N738O492O579N605M873M968N126N233N953O746O285N027M816
$$ 281237 287034 292772 299264 305843 311448 316321 321289 326415 331648 337601 344347 350632 355659 360475
56317C60475N696N794M557L401K850J864M13j13L42P2j411k549k486k135j960
$$ 360475 366171 371965 376522 379923 382773 384637 385050 384937 385279 385351 383940 381391 378905 376770 374810
56302C74810j227PO53P29J330K170J850Q40J295L442N032N083N204O469P841Q603
$$ 374810 373583 373590 374243 374972 376302 378472 380322 381162 382457 385899 390931 396014 401218 407687 415528 424131
56286D24131R604J1132J2134J2408J3204J4887J6418J7663J9659K2142K3570K4146
$$ 424131 433735 444867 457001 469409 482613 497500 513918 531581 551240 573382 596952 621098
56274F21098K5920K9362L2701L5259L8424M2692M6858N0930N6639O4232P1895
$$ 621098 647018 676380 709081 744340 782764 825456 872314 923244 979883 1044115 1116010
56263A116010P9302Q8419R9752J11070J21180J31661J43368J54453J63447J71323
$$ 1116010 1195312 1283731 1383483 1494553 1615733 1747394 1890762 2045215 2208662 2379985
56253B379985J78776J84131J85612J83171J76682J64910J47644J26550J02845
$$ 2379985 2558761 2742892 2928504 3111675 3288357 3453267 3600911 3727461 3830306
56244C830306P6568M8947K2571j655k4738m6035o2763p4077q2247q8620r1893
$$ 3830306 3906874 3955821 3978392 3976737 3951999 3905964 3843201 3769124 3686877 3598257 3506364
56233C506364r1826r1045r1411r1881r1702r2449r5151r8457j01401j04854j08691
$$ 3506364 3414538 3323493 3232082 3140201 3048499 2956050 2860899 2762442 2661041 2556187 2447496
56222B447496j10862j10887j10963j11887j11343j08007j03787j00072r5372q8825
$$ 2447496 2336634 2225747 2114784 2002897 1891554 1783547 1679760 1579688 1484316 1395491
56212A395491q2396p7316p1831o4859n8388n3772m9189m3311l8143l5337l3091
$$ 1395491 1313095 1235779 1163948 1099089 1040701 986929 937740 894429 856286 820949 787858
56201G87858k9542k6031k4084k2253j9006j5868j4604j4009j2405j0731j0212
$$ 787858 758316 732285 708201 685948 666942 651074 636470 622461 610056 599325 589113
56190E89113r575p446n088m030l400k110j184j393j187M95K037K130K283L857
$$ 589113 579538 572092 567004 562974 559574 557464 556280 554887 553700 554195 556232 558362 560645 564502
56176E64502N489N895O323P746Q528P504O414O689O847N598M379M259L596J510
$$ 564502 569991 575886 582209 589955 598483 605987 612401 619090 625937 631535 635914 640173 643769 645279
56162F45279K72J362K540J829R97J991L404L683M364O724Q665Q514Q620J1522
$$ 645279 645551 646913 649453 651282 652279 654270 657674 661357 665721 672445 681110 689624 698244 709766
56148G09766J5690J8741K1699K6406L1843L6777M3024N2351O3132P3648Q5528
$$ 709766 725456 744197 765896 792302 824145 860922 903946 956297 1019429 1093077 1178605
56137A178605J00297J15551J28083J37460J42943J40798J29002J11562R4076P8188
$$ 1178605 1278902 1394453 1522536 1659996 1802939 1943737 2072739 2184301 2278377 2356565
56127B356565O4057N4196N0034M7820M2646L3751K2241P472r679k3808l0677l3038
$$ 2356565 2420622 2474818 2524852 2572672 2615318 2649069 2671310 2678782 2669103 2645295 2614618 2581580
56115B581580l6306m1751m8637n9179p5509r4373j10078j20419j25379j23382
$$ 2581580 2545274 2503523 2454886 2395707 2320198 2225825 2115747 1995328 1869949 1746567
56105A746567j13914j00877q8335p5789o2042n0043m2804l8230l3231k9315k8645
$$ 1746567 1632653 1531776 1443441 1367652 1305610 1255567 1212763 1174533 1141302 1111987 1083342
56094A083342k8483k5514k1953k1265k1421j8721j4798j3292j2912j0399p247
$$ 1083342 1054859 1029345 1007392 986127 964706 945985 931187 917895 904983 894584 887337
56083H87337o695p112n022j854r57r41J324M086L949K704M014O232N655L947N102
$$ 887337 880642 873530 868508 866654 865697 864756 866080 870166 874115 876819 880833 887065 892720 896667 901769
56068I01769P923Q696Q434J0176J2150J1114R370J0848J3324J2445J0246J1487
$$ 901769 909692 918388 926822 936998 949148 960262 969632 980480 993804 1006249 1016495 1027982
56056A027982J4605J4780J3031J3671J5551J4620J2475J3510J6257J6334J5268
$$ 1027982 1042587 1057367 1070398 1084069 1099620 1114240 1126715 1140225 1156482 1172816 1188084
56045A188084J7301K0398J9748J7419J8839K2445K2720K0797K1953K5133K5344
$$ 1188084 1205385 1225783 1245531 1262950 1281789 1304234 1326954 1347751 1369704 1394837 1420181
56034A420181K4056K6597L1470L2886L1786L3597L7336L7823L6480L8771M3082
$$ 1420181 1444237 1470834 1502304 1535190 1566976 1600573 1637909 1675732 1712212 1750983 1794065
56023A794065M3519M1462M2837M6319M6107M3964M6144N0836N1260M8900N0657
$$ 1794065 1837584 1879046 1921883 1968202 2014309 2058273 2104417 2155253 2206513 2255413 2306070
56012B306070N5260N5924N4089N6798O2708O4847O4834O9814P7775Q0946Q1242
$$ 2306070 2361330 2417254 2471343 2528141 2590849 2655696 2720530 2790344 2868119 2949065 3030307
56001C030307Q6763R5523R8984R9156J05157J15443J21097J24208J34420J49507
$$ 3030307 3117070 3212593 3311577 3410733 3515890 3631333 3752430 3876638 4011058 4160565
55991D160565J58698J63166J73428J88502J98329K04780K18708K38238K52359
$$ 4160565 4319263 4482429 4655857 4844359 5042688 5247468 5466176 5704414 5956773
55982E956773K63869K85323L14580L39008L61407L95573M38829M76888N13355
$$ 5956773 6220642 6505965 6820545 7159553 7520960 7916533 8355362 8832250 9345605
55973I345605N64909O29999O93912P61898Q53487R67236J087687J224042J403030
$$ 9345605 9910514 10540513 11234425 11996323 12849810 13817046 14904733 16128775 17531805
55964A7531805J628243J890041K210242K628068L147173L751181M466137N348172
$$ 17531805 19160048 21050089 23260331 25888399 29035572 32786753 37252890 42601062
55956D2601062O419864P692403R243240J1192881J3627126J6651068K0488046
$$ 42601062 49020926 56713329 65956569 77149450 90776576 107427644 127915690
55949A27915690K5349527L1172118L7597166M4053537M9346255N0976298M5589004
$$ 127915690 153265217 184437335 222034501 266088038 315434293 366410591 411999595
55942D11999595L1229035R679544j3722896l3064720m4992268m9488678m8462780
$$ 411999595 443228630 452908174 439185278 406120558 361128290 311639612 263176832
55935B63176832m4096119l8135525l1835313k5973306k0895689j6686516j3322091
$$ 263176832 219080713 180945188 149109875 123136569 102240880 85554364 72232273
55928G2232273j0700739q659790p055222n803310m834309m063323l430166k918551
$$ 72232273 61531534 52871744 45816522 40013212 35178903 31115580 27685414 24766863
55920B4766863k512914k175951j883773j641836j449015j281278j124862r91541
$$ 24766863 22253949 20077998 18194225 16552389 15103374 13822096 12697234 11705693
55912A1705693q87131p95680p07193o31839n74610n22758m69429m24645l92594
$$ 11705693 10818562 10022882 9315689 8683850 8109240 7586482 7117053 6692408 6299814
55903F299814l61685l26635k97879k79995k62308k39441k20621k10253j99013
$$ 6299814 5938129 5611494 5313615 5033620 4771312 4531871 4311250 4100997 3901984
55894C901984j82225j68312j61269j52737j38934j28081j23751j17653j06050
$$ 3901984 3719759 3551447 3390178 3237441 3098507 2970426 2846675 2729022 2622972
55885B622972r7107r4915r1842q3727p7526p6980p5170o8316o3039o3104o2244
$$ 2622972 2525865 2430950 2339108 2255381 2177855 2100875 2025705 1957389 1894350 1831246 1769002
55874A769002n6801n2579n2717n1163m4660l9197l8258l6336l0350k6175k7537
$$ 1769002 1712201 1659622 1606905 1555742 1511082 1471885 1433627 1397291 1366941 1340766 1313229
55863A313229k9174k7079k5109k5652k3937j7565j1846r903o941q0N248M307j51
$$ 1313229 1284055 1256976 1231867 1206215 1182278 1164713 1152867 1142964 1136023 1135943 1141191 1145498 1145347
55850A145347n051j2202k1404k7135k7292k7041k9274k9520k5010k0350j9208
$$ 1145347 1140296 1128094 1106690 1079555 1052263 1025222 995948 966428 941418 921068 901860
55839I01860j8512j5790j4380j6368j8025j7187j7593k1187k3545k1821j9851
$$ 901860 883348 867558 853178 836810 818785 801598 784005 762818 739273 717452 697601
55828F97601k0516k0305j6482j2588j1673j0909p981o271q391j0770r886q050
$$ 697601 677085 656780 640298 627710 616037 605128 597147 590876 582485 571715 561829 553779
55816E53779q126q169o117m285m510m061q62K369L289M046O282P406N750M123
$$ 553779 545653 537484 531367 527082 522572 518511 517649 520018 523307 527353 533635 541041 546791 550914
55802E50914M297L416j95l166l133l166n930q870r483j0100j2882j5142j4252
$$ 550914 555211 558627 558432 555266 552133 548967 543037 534167 524684 514584 501702 486560 472308
55789D72308j2458j2351j2211j0177q365q535q229n620l554m420n435l545o82
$$ 472308 459850 447499 435288 425111 416746 408211 399982 394362 390808 386388 380953 377408 376726
55776C76726L00N09J319J66n000j0898j3432j3564j4151j4415j2330r257p496
$$ 376726 377026 377535 378854 379020 374020 363122 349690 336126 321975 307560 295230 285973 278477
55763B78477n994k899K71J090K95m26j958n306q339q759p823p679p623o308m962
$$ 278477 272483 269584 269855 270945 271240 270814 268856 263550 255211 246452 238629 230950 223327 217019 212057
55748B12057m990n138m138l421m146m495l082j880k601l350k230j012j708k664
$$ 212057 207067 201929 197791 194370 190224 185729 182647 180767 178166 174816 172586 171574 169866 167202
55734A67202j665P6O51J150K915M078K664L28p05j615m107o349n887m117l868
$$ 167202 165537 165613 166264 167414 170329 174407 177071 177399 176694 175079 170972 164623 158736 154619 150751
55719A50751m683m387l264k843k516r82P26J078R85J800K458J864J831M256P473
$$ 150751 146068 141681 138417 135574 133058 132076 132802 133880 134865 136665 139123 140987 142818 147074 154547
55704A54547Q824Q767R091R209P747N712M600L282K89k708l216j989j401j541
$$ 154547 163371 172138 181229 190438 198185 203897 208497 211779 212068 209360 206144 204155 202754 201213
55690B01213j198r92k083l417l453l060l618l973k422QJ403K234L766N100N012
$$ 201213 200015 199023 196940 193523 190070 187010 183392 179419 176997 177005 178408 180642 184408 189508 194520
55675A94520M730N608O036M109J420O23J073N66m48j37Q15N69pJ216L425M007
$$ 194520 199250 204858 210894 215003 216423 217046 218119 218685 218237 218100 218915 219484 219477 220693 224118 228125
55659B28125K977K582L220L261K295J331L86j076k125j747j330k751n069o028
$$ 228125 231102 233684 236904 240165 242460 243791 244177 243101 240976 239229 237899 235148 230079 224051
55645B24051n826o326p544q146q318r101r745q839p171o530o628o119n507n920
$$ 224051 218225 211899 204355 196209 187891 178790 169045 160206 153035 146505 139877 133758 128251 122331
55631A22331o275m940l118l131m360m398l295l024l473k791j242j073k635l929
$$ 122331 116056 111116 107998 104867 100507 96109 92814 89790 86317 83526 82284 81211 78576 74647
55617G4647m020l699l019j298M94M81j001j765j172n11k91J13L93k46r71l04J072
$$ 74647 70627 66928 63909 62611 63105 63586 62585 60820 59648 59137 58846 58959 59352 59106 58135 57831 58903
55600E8903J229K67j06K50N6n22j51P20L57j063j626j023p61j113q22J30L09m34
$$ 58903 60132 60399 60293 60543 60599 60077 59926 60646 61003 59940 58314 57291 56530 55417 54595 54725 55034 54600
55582E4600p36m47q91k201k931k574k122j941j364n00k70o09o38m58p83j162o87
$$ 54600 53864 53417 52526 50325 47394 44820 42698 40757 39393 38893 38623 38014 37376 36918 36135 34973 34286
55565C4286J26K35J51P96J265L36q28l65Q40O12m74l9J626J884L87l62O02J462
$$ 34286 34412 34647 34798 35594 36859 37195 36367 36002 36842 37454 36980 36941 38567 40451 40838 40476 41078 42540
55547D2540J277J422K533L290L120L172L719L420K059J310J861K389K173K235
$$ 42540 43817 45239 47772 51062 54182 57354 61073 64493 66552 67862 69723 72112 74285 76520
55533G6520L050L594L421L350L409K534R61M58J429K105J384J64p47j640k326
$$ 76520 79570 83164 86585 89935 93344 95878 96839 97297 98726 100831 102215 102379 101632 99992 97666
55518I7666j905q64r95k501l531l289l163l959m533m126l741m071m249l710l269
$$ 97666 95761 94897 93902 91401 87870 84581 81418 77459 72926 68800 65059 60988 56739 53029 49760
55503D9760l328k940j597k00M95O62K12j252k820k848j590j055j704j828q03l05
$$ 49760 46432 43492 41895 41695 42190 42852 43064 41812 38992 36144 34554 33499 31795 29967 29164 28859
55487B8859j210j941j265m09p76j608j525o91L6O33J224J277O20N1rj99q27j209
$$ 28859 27649 25708 24443 24034 23258 21650 20125 19434 19470 20103 21327 22604 23224 23275 23266 23067 22240 21031
55469B1031j008q66j006p31J17O89O33N31M22l94j641j978j108k10J53O55J360
$$ 21031 20023 19157 18151 17420 17537 18226 18859 19390 19812 19418 17777 15799 14691 14481 14634 15289 16649
55452A6649J282L47k31j36m26j276j421n49m6n53r95q02q82j477j395l77J40l05
$$ 16649 17931 18278 18047 17911 17485 16209 14788 14239 14193 13640 12645 11843 10961 9484 8089 7712 7852 7547
55434G547j50J272K199J363J87L68J299J649J619J812J597M87l96k6P22O03M6
$$ 7547 7397 8669 10868 12231 12418 12786 14085 15734 17353 19165 20762 21249 20853 20827 21549 22152 22198
55417B2198O8M52M68L22L93K25m63q44l69J22p2j46P80K049K504K101J382M74
$$ 22198 22266 22718 23186 23508 23901 24126 23663 22819 22450 22572 22500 22354 23134 25183 27687 29788 31170 31644
55399C1644l73m96n9k76j377j873r03K06J2q65r93l24L13O96Q83N06l90q66m86
$$ 31644 31271 30775 30716 30440 29063 27190 26287 26493 26505 25640 24647 24323 24636 25332 26215 26721 26331 25465 24979
55380B4979j57n29q94o50m58q14q79qR05R07N25N41N45o1q41j338j989k881k991
$$ 24979 24822 24293 23399 22749 22291 21477 20598 20590 21495 22402 22927 23468 24013 23952 23111 21773 19784 16903 13912
55361A3912j973j195j618k109j355l9N05M32N98Q30O44N47R84J122L01m68j11
$$ 13912 11939 10744 9126 7017 5662 5623 6128 6560 7158 7988 8632 9179 10163 11285 11586 11118 11007
55344A1007N78L18m90o95m82o44p37J16J323J538P34n0m15n34j35Q49J337N00
$$ 11007 11585 11903 11413 10718 10236 9592 8855 8971 10294 11832 12566 12516 12101 11567 11432 12281 13618 14118
55326A4118o18m85M98O70l27j311j489j092m18L58P12L58p2l5p4o98j096l47Q78
$$ 14118 13500 13015 13513 14183 13856 12545 11056 9964 9546 9904 10616 10974 10902 10867 10793 10095 8999 8652 9530
55307I530J272Q88O83P90P64Q70J512J967J268l8o42n15o25j066j086o81n65p03
$$ 9530 10802 11690 12373 13163 13927 14797 16309 18276 19544 19506 18864 18349 17724 16658 15572 14891 14326 13623
55289A3623m30J21J47l43n07j42J30M9K5K32M02M14K71k07q78r56j24O52M42j98
$$ 13623 13193 13314 13461 13118 12611 12469 12599 12648 12673 12905 13307 13721 13992 13785 12907 11951 11827 12479 12921 12723
55269A2723j74M00O50N79P82J108R49N09M11L99k26j195j574j259q76n13K19J091
$$ 12723 12549 12949 13599 14178 14960 16068 17017 17526 17937 18336 18110 16915 15341 14082 13206 12693 12912 14003
55251A4003J451J306J108Q25K96O6O21J191O71n80j203q48l99l75m32l87m83o27
$$ 14003 15454 16760 17868 18693 18989 19055 19676 20867 21538 20958 19755 18907 18508 18133 17701 17314 16831 16204
55233A6204m67j82k38m74l66p0k03p38j030p49m0R20J759J799R27O0r3p0n79j178
$$ 16204 15737 15555 15317 14843 14477 14407 14204 13466 12436 11687 11647 12567 14326 16125 17052 17112 17019 16949 16370 15192
55213A5192j102o18l82k18K24M32j1k83L40Q74L2j417j567k06J127J596J752J893
$$ 15192 14090 13472 13090 12872 13096 13528 13517 13234 13574 14448 14480 13063 11496 11290 12417 14013 15765 17658
55195A7658J608R52N24K97j84o03l32J66n1o12l97L58K69p88j400q90j25K57P12
$$ 17658 19266 20218 20742 21039 20855 20252 19920 20086 20035 19423 19026 19384 19653 18865 17465 16575 16450 16707 17419
55176A7419J402J583R48K44lj86o03q91q02n44j67L95O36Lq80q24M6L87k76r60
$$ 17419 18821 20404 21352 21596 21593 21407 20804 19913 19111 18567 18400 18795 19431 19434 18554 17730 17776 18163 17887 16927
55156A6927q68l12K96R18J178N04o35r66k66L72L59K96M64K02o05q68J5J057J140
$$ 16927 16059 15747 16043 16961 18139 18643 18008 17042 16776 17148 17507 17803 18267 18469 17864 16996 17011 18068 19208
55137A9208N78L33N43P05O76P38J014J401J729J767J384Q32M22P4l24m27kL21
$$ 19208 19786 20119 20662 21367 22043 22781 23795 25196 26925 28692 30076 30908 31330 31404 31080 30653 30651 30972
55119C0972j39r36j131q58r60j340j120l03K12L04P80J680J966J270N04L00K53
$$ 30972 30833 29897 28766 27908 26948 25608 24488 24185 24397 24701 25481 27161 29127 30397 30901 31201 31454
55102C1454J34M13J019J039L45R9R14J731J461N75Q5Rj92m43l32R2O32J427K432
$$ 31454 31588 32001 33020 34059 34404 34503 35417 37148 38609 39184 39269 39278 39086 38643 38311 38403 39035 40462 42894
55083D2894K908K263R54j0j85Q3K18j70r70j570j515j176j152j170m23R25J642
$$ 42894 45802 48065 49019 49009 48824 48907 49125 48955 47985 46415 44900 43724 42572 41402 40979 41904 43546
55066D3546J046j63r49j004n28J44M04k15j223j530r11k04M4K35P11J159J324
$$ 43546 44592 44429 43480 42476 41948 42092 42496 42281 41058 39528 38617 38413 38457 38692 39403 40562 41886
55049D1886J424J475J159O21M64O25L32n00r45o16l86r44j650j596r18k96Q0L77
$$ 41886 43310 44785 45944 46565 47029 47654 47986 47486 46541 45925 45539 44595 42945 41349 40431 40135 40215 40592
55031D0592N68O55Q88J197J089N01J42M83J020J050O18K43K82P65J431J631Q84
$$ 40592 41160 41815 42703 43900 44989 45490 45632 46115 47135 48185 48803 49046 49328 50093 51524 53155 54039
55014E4039l30j035j091j217j603j562q68k80k13J6R17J760J567M81n72j071j095
$$ 54039 53709 52674 51583 50366 48763 47201 46333 46053 45840 45856 46773 48533 50100 50581 50009 48938 47843
54997D7843q01l44J5J43J00j06m53o13l18J4k26p39o25K03Q99J022R68Q70K87
$$ 47843 47042 46698 46713 46856 46956 46850 46397 45784 45466 45480 45254 44515 43890 44093 44992 46014 46982 47852 48139
54978D8139o33q40J57J485K035J641P80m3k38O26K039K898K931K933L319L549
$$ 48139 47506 46666 46823 48308 50343 51984 52764 52721 52483 53109 55148 58046 60977 63910 67229 70778
54962G0778L278L011L145L476M014N158O642P487P677Q579J0977J3824J5702J6431
$$ 70778 74056 77067 80212 83688 87702 92860 99502 106989 114666 123245 134222 148046 163748 180179
54948A80179J6469J5796J4357J2590J0529P240K111l937r337j3355j6032j7426
$$ 180179 196648 212444 226801 239391 249920 257160 259271 255334 245997 232642 216610 199184
54936A99184j7693j7223j6115j4092j1396r012p503o504n682n222m949m170k921
$$ 199184 181491 164268 148153 134061 122665 113653 106150 99646 93964 88742 83793 79623 76702
54923G6702k119j877j019R12K594K900K595K929L739M300M911O205P776Q882R842
$$ 76702 74583 72706 71687 72599 75193 78093 80688 83617 87356 91656 96567 102772 110548 119430 129272
54908A29272J1359J3197J4665J5766J6654J6583J4666J1156O899K101l221q237
$$ 129272 140631 153828 168493 184259 200913 217496 232162 243318 250217 252318 249097 240860
54896B40860j1959j4443j6200j7009j6414j4854j3126j1243r000p064o229o094
$$ 240860 228901 214458 198258 181249 164835 149981 136855 125612 116612 109548 103319 97225
54884I7225n629m677l700k592j109k9l93j793k694k417j633j076q98j210k013
$$ 97225 91596 86919 83219 80627 79518 79489 79096 77303 74609 72192 70559 69483 68585 67375 65362
54869F5362k620k188r68m4M7l46q66j374j534j125o84q51j261j058l41Mj47k0
$$ 65362 62742 60554 59586 59542 59589 59243 58377 57003 55469 54344 53660 52809 51548 50490 50149 50153 50006 49986
54851D9986N85P85J1j030j317q20l65n84j326j928j864j200m18K11P45J132J172
$$ 49986 50571 51356 51367 50337 49020 48200 47835 47251 45925 43997 42133 40933 40515 40726 41471 42603 43775
54834D3775J001J048J303J291R87Q87R60N42k73l78N51J253Q05J00K82Q68Q17
$$ 43775 44776 45824 47127 48418 49405 50292 51252 51794 51521 51143 51694 52947 53752 53852 54134 55002 55819
54817E5819M45P24J493J836J780J959K215J978J656K029K745K923K925L800N268
$$ 55819 56264 56988 58481 60317 62097 64056 66271 68249 69905 71934 74679 77602 80527 84327 89595
54802H9595O063O217P182R448J1779J3190J4197J5553J7059J8138J8407J7305
$$ 89595 95658 101875 109057 118505 130284 143474 157671 173224 190283 208421 226828 244133
54790B44133J4227R531M438l50n028r450j2685j4173j4368j3867j2845j1549j0423
$$ 244133 258360 267891 272329 271979 266951 257501 244816 230643 216275 202408 189563 178014 167591
54777A67591r373p869o094n009m919m893m061k646j241J26J645L103M185M982
$$ 167591 158218 150349 144255 139246 134327 129434 125373 122727 121486 121612 123257 126360 130545 135527
54763A35527N772O655P635Q701R784J0986J2760J5309J7924J9577K0144K0306
$$ 135527 141299 147954 155589 164290 174074 185060 197820 213129 231053 250630 270774 291080
54751B91080K0334J9655J7724J4515J0149M725j341p411j3131j8263k2162k4179
$$ 291080 311414 331069 348793 363308 373457 378182 376841 369430 356299 338036 315874 291695
54739B91695k4523k3986k2884k0931j8187j5277j2711j0622r099q066p038n773
$$ 291695 267172 243186 220302 199371 181184 165907 153196 142574 133475 125409 118371 112598
54727A12598m865m823m896l951k275j240j235j315r24o39q84j205j249j292j344
$$ 112598 107733 102910 98014 94063 91788 90548 89313 87998 87074 86435 85551 84346 83097 81805 80461
54712H0461r07r1J44n26j092o76K26O83O52O50P87Q92J011J126Q92K38j97J57
$$ 80461 79554 79463 79607 79081 77989 77313 77539 78222 78874 79524 80311 81203 82214 83340 84232 84470 84273 84430
54694H4430R75J463J288O80m0o42r65j016r19o97l22ON0MK71P90J112J134J183
$$ 84430 85405 86868 88156 88836 88796 88154 87189 86173 85254 84557 84235 84241 84291 84295 84566 85356 86468 87602 88785
54675H8785J360J394J264J336J808K547L461M524N367N533N163M838M774M717
$$ 88785 90145 91539 92803 94139 95947 98494 101955 106479 111846 117379 122542 127380 132154 136871
54661A36871M572M467M280L850L599M185N558P058Q377R630J0688J1312J1939
$$ 136871 141443 145910 150190 154040 157639 161824 167382 174440 182817 192447 203135 214447 226386
54648B26386J3294J5177J6576J7025J6971J6676J5760J3836J0776O332N27n616
$$ 226386 239680 254857 271433 288458 305429 322105 337865 351701 362477 368809 369336 363720
54636C63720j0763j4757j8286k1203k2448k1790k0275j8717j6938j4921j3206
$$ 363720 352957 338200 319914 298711 276263 254473 234198 215481 198543 183622 170416
54625A70416j1792r900p488n671n089m964m418l568k779j950j149q80j094r93
$$ 170416 158624 148724 141236 135565 130476 125512 121094 117526 114747 112797 111648 110768 109674 108681
54611A08681l62O5O8M31J314J585O75k98k75J27r2o16o89o48j169j892k128k188
$$ 108681 108319 108384 108452 108883 110197 111782 112457 112159 111884 112011 111919 111303 110614 109966 108797 106905 104777 102589
54593A02589k625k936k385j555j573k264k464j882j323j211j180j038j026j079
$$ 102589 99964 97028 94643 93088 91515 89251 86787 84905 83582 82371 81191 80153 79127 78048
54579G8048q67n40n99j009j282j252j138r56o27l77l77k48K93P37N26J01K80R07
$$ 78048 77181 76641 76042 75033 73751 72499 71361 70405 69778 69401 69024 68776 69069 69806 70332 70433 70713 71620
54561G1620J150R13Q76J204J257P51K41K51O83J250J852K367K657K825L079L273
$$ 71620 72770 73683 74559 75763 77020 77771 78012 78263 78946 80196 82048 84415 87072 89897 92976 96249
54545I6249L168K994L199L728M175M589N422O605P411P439P205P360P774P702
$$ 96249 99417 102411 105610 109338 113513 118102 123524 130129 137540 144979 152184 159544 167318 175020
54531A75020O653M845K854R72j019l350n684p396q340q922r274q976p862o582
$$ 175020 181673 186518 189372 190344 189325 185975 180291 172895 164555 155633 146359 137383 129521 122939
54517A22939n850n561n133m373l641l347l620m217m521l986k840j906j524j195
$$ 122939 117089 111528 106395 102022 98381 95034 91414 87197 82676 78690 75850 73944 72420 71225
54503G1225n60n4j35m74m74r3L47P54J187J637K141K653K599J398l22r95j69Q16
$$ 71225 70665 70611 70476 70002 69528 69435 69782 70536 71723 73360 75501 78154 80753 82151 81829 80834 80665 81481
54485H1481Q48N37P61R51K49o78n89K15M25j4J8O75Q29P9n44k22O14J292J646
$$ 81481 82329 82866 83627 84578 84827 84149 83560 83775 84200 84186 84204 84879 85708 85787 85243 85021 85635 86927 88573
54466H8573J424K49j309j844r94j62n31j353j177n1O00K4r79j254o08K59O69N13
$$ 88573 89997 90246 88937 87093 86099 85937 85406 84053 82876 82825 83425 83449 82470 81216 80608 80867 81536 82049
54448H2049R5k50l74k88j37j61m56p89q81q76j097j335r88j02M20P4m74m31jK32
$$ 82049 82144 81894 81520 81232 81095 80934 80478 79689 78808 77932 76835 75500 74512 74410 74830 74904 74430 73999 73998 74230
54428G4230L43N89N83k2m98P9J177J390N56k7L53Q84P20J79j21k91n91o72j54
$$ 74230 74573 75162 75745 75723 75225 75304 76481 77871 78427 78400 78753 79637 80357 80536 80415 80124 79533 78861 78707
54409G8707N81R20R15J071J480J762J728J645J848K345K823K983K879K815K824
$$ 78707 79288 80208 81123 82194 83674 85436 87164 88809 90657 93002 95825 98808 101687 104502 107326
54394A07326K538J919J681K400L444L554K412Q54m03j387k087k118j548j266j811
$$ 107326 109864 111783 113464 115864 119308 122862 125274 126128 125725 124338 122251 120133 118585 117319 115508
54379A15508k478k249j259o45j083k067k643k473k028j893k024j856j128l78k97
$$ 115508 113030 110781 109522 108877 107794 105727 103084 100611 98583 96690 94666 92810 91682 91304 91007
54364I1007p90j134r49m94PO73J466J946J869J575J443J315Q69K99J80P41J571
$$ 91007 90217 89083 88134 87640 87647 88320 89786 91732 93601 95176 96619 97934 98803 99102 99282 100023 101594
54347A01594K045J944J553J270J211J262J452J991K794L312L126K441J693Q91
$$ 101594 103639 105583 107136 108406 109617 110879 112331 114322 117116 120428 123554 125995 127688 128579
54333A28579j83j301j860j604q82k30o7o33j753k745l062k935k931l033k800k360
$$ 128579 128396 127095 125235 123631 122749 122519 122452 121819 120066 117321 114259 111324 108393 105360 102560 100200
54317A00200k456l288m027l862k971k113j668j502j406j254r10l80j6k37j042
$$ 100200 97744 94456 90429 86567 83596 81483 79815 78313 76907 75653 74743 74363 74347 74110 73068
54302G3068j886k125j573o84p7N0j8q7l04p23j015r34p55q47j049r00l38K66O05
$$ 73068 71182 69057 67484 66800 66723 66773 66755 66668 66364 65641 64626 63692 62937 62090 61041 60141 59803 60069 60674
54283F0674N53N1p36j274j147n56L5M80P87P88M83L38O16Q15N45M23J155K098
$$ 60674 61227 61278 60542 59268 58121 57565 57600 58080 58867 59655 60138 60476 61092 61907 62452 62875 64030 66128
54265F6128J961Q03N6M32J097J200J009R84Q06J31n62o93m87n45q57r29n19K32
$$ 66128 68089 68892 68948 69380 70477 71677 72686 73670 74476 74607 74045 73352 72865 72320 71463 70534 70015 70247
54247G0247J057J633J639J165O50L07j5k85k50o0k07n99n20J16M20r3o08l43J64
$$ 70247 71304 72937 74576 75741 76391 76698 76683 76398 76148 76088 75881 75282 74762 74878 75298 75205 74597 74254 74418
54228G4418j1o09o64j36M4n47j346j755j708j284n62%j68r02j368j134o59m95
$$ 74418 74407 73798 73134 72998 73042 72495 71149 69394 67686 66402 65840 65840 65672 64770 63402 62268 61609 61114
54210F1114n72n26k57R2L85M34N9n51q07l54M57R60R46P92Q68J032P97k2r21j115
$$ 61114 60542 60016 59759 59851 60236 60670 60729 60178 59371 59017 59474 60434 61380 62172 63040 64072 64869 64847 63926 62811
54190F2811m23M52O77K51q2J42N61N40L0m65o02n23m42k64R2L05p6q65j246p08
$$ 62811 62388 62840 63517 63768 63686 63828 64389 64929 64959 64494 63892 63369 62927 62663 62755 63060 62984 62119 60873 60165
54170F0165K92Q73P18K41l2R4N43J035J093L88p69j563j474p26J31P69J108J140
$$ 60165 60457 61330 62048 62289 62257 62351 62894 63929 65022 65410 64641 63078 61604 60878 61009 61778 62886 64026
54152F4026R45P57P58Q70Q83P68O37N04K20l22r51j298j117n19J20M78N05L52
$$ 64026 64971 65728 66486 67356 68239 69007 69644 70148 70368 70046 69095 67797 66680 66161 66281 66759 67264 67616
54134F7616K13J62N1l72j044j439j176o62o32j033j029l05L67L11NK24O97N36
$$ 67616 67829 67991 68042 67670 66626 65187 64011 63349 62717 61684 60655 60350 60717 61028 61033 61257 61954 62490
54116F2490k82q19n91j38q4k77k84j30j38l92o41o20l03R0K98L61N89J046J341
$$ 62490 62208 61389 60798 60660 60576 60299 60015 59885 59747 59355 58714 58094 57791 57881 58179 58540 59129 60175 61516
54097F1516J191Q48O01K28n12j149r70m7P84R23L64o00j479j632j051p34j429
$$ 61516 62707 63555 64156 64384 63872 62723 61753 61706 62490 63413 63777 63177 61698 60066 59015 58281 56852
54080E6852k248j686R6J284R49K18M29J306J738J440R67O73N43N74P02O17K54
$$ 56852 54604 52918 53014 54298 55247 55465 55894 57200 58938 60378 61345 62018 62561 63135 63837 64454 64708
54063F4708J02N38J238J645J712J735J740J520R87K61l42l57L91J227J195M24
$$ 64708 64810 65348 66586 68231 69943 71678 73418 74938 75925 76186 75844 75487 75878 77105 78300 78724
54047G8724J98J239K606K926K129J295J222J838K681L339L559L494L675M351N064
$$ 78724 78922 80161 82767 85693 87822 89117 90339 92177 94858 98197 101756 105250 108925 113276 118340
54032A18340N282N098M927M916N045N439O009O202N649M812M325M017L246K030
$$ 118340 123622 128720 133647 138563 143608 149047 155056 161258 166907 171719 176044 180061 183307 185337
54018A85337J107Q89R88R57Q95J105J495J627J226M49l17r08j524k371l266l779
$$ 185337 186444 187333 188321 189278 190173 191278 192773 194400 195626 196075 195758 194850 193326 190955 187689 183910
54002A83910l783l557l418l481l749m051l952l205k250j713j505j075o08r49k121
$$ 183910 180127 176570 173152 169671 165922 161871 157919 154714 152464 150751 149246 148171 147563 146614 144493
53987A44493k863k323j261q46r30n83K05M66j93r94j136q00o83r57j156q41j87
$$ 144493 141630 139307 138046 137200 136270 135687 135892 136358 136165 135171 134035 133235 132552 131595 130439 129598 129411
53970A29411K68M02P37J599K327J939N57n97p91o14q74j411j529j020j97O14J144
$$ 129411 129679 130081 130818 132417 134744 136683 137240 136643 135852 135238 134364 132953 131424 130404 130207 130821 131965
53953A31965J182R39J020J634K286K535K538K485K266K071K543L699M576M652
$$ 131965 133147 134086 135106 136740 139026 141561 144099 146584 148850 150921 153464 157163 161739 166391
53939A66391M764N706O736O582N277L868K704J321l66j866l058m117m744m487
$$ 166391 171155 176861 183597 190179 195456 199324 202028 203349 202983 201117 198059 193942 189198 184711
53925A84711l714l161k623j232R31K736L629M207M894N239M972M685M851N003
$$ 184711 180997 177836 175213 173981 174912 177648 181277 185484 190378 195617 200589 205274 210125 215128
53911B15128M585L975L961M679N628O431P058P500P547O908N472L600K015J111
$$ 215128 219713 223688 227649 232328 237956 244387 251445 258945 266492 273400 278872 282472 284487 285598
53897B85598M25o89k069k989l258l351l425l046k192j736k387l720m728n081n340
$$ 285598 286023 285334 283265 280276 277018 273667 270242 267196 265004 263268 260881 257161 252433 247352 242012
53882B42012o092p211p983p808o811n691m982m614m337m171m124l904l386l012
$$ 242012 235920 228709 220726 212918 206107 200416 195434 190820 186483 182312 178188 174284 170898 167886
53868A67886l115l277l045k859l359m066l876k810k036k059k151j892j969k757
$$ 167886 164771 161494 158449 155590 152231 148165 144289 141479 139443 137384 135233 133341 131372 128615
53854A28615l311k698j513r97j280j525j383j267j327j149o11k07l36q07j226
$$ 128615 125304 122606 121093 120096 118816 117291 115908 114641 113314 112165 111554 111347 111011 110204 108978
53839A08978j449j427j059l73L53Q33R50O93J33m11m27K70J147J334N74m22p63
$$ 108978 107529 106102 105043 104670 105023 105856 106806 107499 107632 107221 106794 107064 108211 109545 110119 109697 108934
53822A08934m05o2r1j2O09J304J313P29L79O37J013J025Q56Q43Q77P03N22Q24
$$ 108934 108529 108467 108376 108364 108973 110277 111590 112319 112698 113335 114348 115373 116229 117072 117949 118652 119174 119998
53804A19998J713K693L200L182L129L492M155M636M778M897N166N266N026M960
$$ 119998 121711 124404 127604 130786 133915 137407 141562 146198 150976 155873 161039 166305 171331 176291
53790A76291N588O469O529N362L651K288J638J637K077K513K458J829R79J89m74
$$ 176291 181879 188348 194877 200239 203890 206178 207816 209453 211530 214043 216501 218330 219309 219498 219024
53775B19024q63p78m20l38p62j377j896k419l081l714m067m091l885l602l407
$$ 219024 218161 217383 216963 216625 215863 214486 212590 210171 207090 203376 199309 195218 191333 187731 184324
53760A84324l210k580j355k61k44j120j649j176n13p12j571j951j304k92O4n55
$$ 184324 181114 178534 177179 176918 176674 175554 173905 172729 172216 171504 169933 167982 166678 166386 166450 165895
53744A65895j545k029j730j151r24j113j414j740k115k155j420l07J39m69j399
$$ 165895 164350 162321 160591 159440 158516 157403 155989 154249 152134 149979 148559 148252 148391 147922 146523
53729A46523j862j866j630r35L40J591K117J994J780J632J379J207J523K208K620
$$ 146523 144661 142795 141165 140230 140570 142161 144278 146272 148052 149684 151063 152270 153793 156001 158621
53714A58621K452K029J696J389J020Q66J247K037K787L284L700M162M477M378
$$ 158621 161073 163102 164798 166187 167207 168073 169320 171357 174144 177428 181128 185290 189767 194145
53700A94145L980L739L943M424M850N082N141N019M724M315L713K741J659J288
$$ 194145 198125 201864 205807 210231 215081 220163 225304 230323 235047 239362 243075 245816 247475 248763
53686B48763K100L390L971L585L104L218L621L644L207K811K845L182L263K589
$$ 248763 250863 254253 258224 261809 264913 268131 271752 275396 278603 281414 284259 287441 290704 293293
53672B93293J367N80J013K207K823K107N90p26j302j138m63K88N79K33m06q69
$$ 293293 294660 295240 296253 298460 301283 303390 303980 303254 301952 300814 300351 300639 301218 301451 301045 300176
53656C00176q95m42J98L74l59j498j970j386m30R3J7n38j473k361k464j662p79
$$ 300176 299281 298839 299037 299411 299052 297554 295584 294198 293768 293861 293878 293340 291867 289506 287042 285380 284601
53639B84601n36o27m10j2l7m95p29l40L52Q16Q23N39L65O69J351J833J710J313
$$ 284601 284065 283438 283028 283016 282979 282484 281755 281415 281767 282583 283406 283945 284310 284979 286330 288163 289873 291186
53621B91186J295J827K530L112L642M215M640M676M355L992L844L901M056M428
$$ 291186 292481 294308 296838 299950 303592 307807 312447 317123 321478 325470 329314 333215 337271 341699
53607C41699N266O472P462P838P904Q179Q582Q571Q042P490P277P255P217P186
$$ 341699 346965 353437 360899 368737 376641 384820 393402 401973 410015 417505 424782 432037 439254 446440
53593D46440P150P039P010P289P611P430O830O554O937P413P394P036O736O495
$$ 446440 453590 460629 467639 474928 482539 489969 496799 503353 510290 517703 525097 532133 538869 545364
53579E45364O173N860N570N031M233L712L801M039L738K838J752P74P4j64j22
$$ 545364 551537 557397 562967 567998 572231 575943 579744 583783 587521 590359 592111 592885 592959 592795 592673
53564E92673m55j493k632l074k863k666k791k966k922k673k322j986j827j868
$$ 592673 592218 590725 588093 585019 582156 579490 576699 573733 570811 568138 565816 563830 562003 560135
53550E60135j946k044k314k559k190j157l82o87j659k162j748r42l28n5m1j00
$$ 560135 558189 556145 553831 551272 549082 547925 547543 546856 545197 543035 541287 540345 540017 539962 539921 539821
53534E39821J29Q44J714K222K375K674L481M728O077P068P308O973O859P547Q733
$$ 539821 539950 540794 542508 544730 547105 549779 553260 557988 564065 571133 578441 585414 592273 599820 608553
53519F08553R777J0675J1809J3056J3813J3944J4018J4522J5403J6482J7813J9421
$$ 608553 618330 629005 640814 653870 667683 681627 695645 710167 725570 742052 759865 779286
53507G79286K1136K2810K4363K5521K5952K5865K6101K7288K9164L0971L2382
$$ 779286 800422 823232 847595 873116 899068 924933 951034 978322 1007486 1038457 1070839
53496A070839L3674L5085L6441L7550L8611L9824M0737M0636L9659L8889L8958
$$ 1070839 1104513 1139598 1176039 1213589 1252200 1292024 1332761 1373397 1413056 1451945 1490903
53485A490903L9223L8941L8670L9497M1274M2748M3461M4214M5535M6798M7357
$$ 1490903 1530126 1569067 1607737 1647234 1688508 1731256 1774717 1818931 1864466 1911264 1958621
53474A958621M7365M6842M5000M1401L7029L3356L0823K8989K7478K6109K4590
$$ 1958621 2005986 2052828 2097828 2139229 2176258 2209614 2240437 2269426 2296904 2323013 2347603
53463B347603K2921K1609K0883K0302J9756K0000K1238K1989K0547J6983J2633
$$ 2347603 2370524 2392133 2413016 2433318 2453074 2473074 2494312 2516301 2536848 2553831 2566464
53452B566464Q181L548p85m013o469r526j3824j8670k3247k7296l0568l2760l4249
$$ 2566464 2574645 2578193 2577408 2573395 2566926 2557400 2543576 2524906 2501659 2474363 2443795 2411035 2376786
53439B376786l5853l7661l9126m0334m2065m4344m6101m6737m6942m7315m7224
$$ 2376786 2340933 2303272 2264146 2223812 2181747 2137403 2091302 2044565 1997623 1950308 1903084
53428A903084m5834m3521m1432m0137l9323l8436l7064l4998l2464k9961k7582
$$ 1903084 1857250 1813729 1772297 1732160 1692837 1654401 1617337 1582339 1549875 1519914 1492332
53417A492332k4759k1071j6989j3357j0399p482l846N99N186R140J2412J5678
$$ 1492332 1467573 1446502 1429513 1416156 1405757 1398275 1394429 1395028 1400214 1409354 1421766 1437444
53405A437444J9303K2755K5414K7547K9819L2174L4072L5614L7433L9575M1431
$$ 1437444 1456747 1479502 1504916 1532463 1562282 1594456 1628528 1664142 1701575 1741150 1782581
53394A782581M2991M5060M7992N1163N4057N6977O0221O3471O6554P0021P4369
$$ 1782581 1825572 1870632 1918624 1969787 2023844 2080821 2141042 2204513 2271067 2341088 2415457
53383B415457P9272Q4159Q8888R3352R6982R9397J01048J02626J04207J05497
$$ 2415457 2494729 2578888 2667776 2761128 2858110 2957507 3058555 3161181 3265388 3370885
53373C370885J06461J07126J07189J06420J05146J03652J01443R7632R2019Q5305
$$ 3370885 3477346 3584472 3691661 3798081 3903227 4006879 4108322 4205954 4297973 4383278
53363D383278P8437P2179O7102O3437O0853N8635N6105N2778M8370M2907L6633
$$ 4383278 4461715 4533894 4600996 4664433 4725286 4783921 4840026 4892804 4941174 4984081 5020714
53352E020714K9745K2392J4912P459p92j1487k5614m2528o0561p8030r3333j04853
$$ 5020714 5050459 5072851 5087763 5095222 5094430 5082943 5057329 5014801 4954240 4876210 4782877 4678024
53340D678024j11752j14700j15259j14623j13307j11728j10370j09384j08484
$$ 4678024 4566272 4451572 4336313 4221690 4108383 3996655 3886285 3776901 3668417
53331C668417j07276j05564j03496j01645j00610j00246r9568r7807r5199r2344
$$ 3668417 3561141 3455577 3352081 3250436 3149826 3049580 2950012 2852205 2757006 2664662
53321B664662q9192q5240q0433p5275p0092o4813n9383n3902m8423m3134l8671
$$ 2664662 2575470 2490230 2409797 2334522 2264430 2199617 2140234 2086332 2037909 1994775 1956104
53310A956104l5687l3937l2305k9892k6735k3343j9934j6413j2831r542o933n112
$$ 1956104 1920417 1886480 1854175 1824283 1797548 1774205 1754271 1737858 1725027 1715485 1708552 1703440
53298A703440l856k791j675n09N99J572K385L117M080N706Q135J1003J3842J6546
$$ 1703440 1699584 1696793 1695118 1694609 1695208 1696780 1699165 1702282 1706362 1712068 1720203 1731206 1745048 1761594
53284A761594J9395K2713K6620L0993L5517L9797M3504M6428M8463M9624N0054
$$ 1761594 1780989 1803702 1830322 1861315 1896832 1936629 1980133 2026561 2075024 2124648 2174702
53273B174702M9807M8828M7434M6539M6832M7745M7921M6733M4746M2552M0050
$$ 2174702 2224509 2273337 2320771 2367310 2414142 2461887 2509808 2556541 2601287 2643839 2683889
53262B683889L7293L5142L4257L3980L3049L0982K8054K4205J9071J2959O855
$$ 2683889 2721182 2756324 2790581 2824561 2857610 2888592 2916646 2940851 2959922 2972881 2979736
53251B979736J198m593j1112j8146k5178l2121l9121m5917n1916n6731o0386o3087
$$ 2979736 2980934 2976341 2965229 2947083 2921905 2889784 2850663 2804746 2752830 2696099 2635713 2572626
53239B572626o5026o6324o7046o7210o6759o5502o3224o0107n6897n4398n2803
$$ 2572626 2507600 2441276 2374230 2307020 2240261 2174759 2111535 2051428 1994531 1940133 1887330
53228A887330n1792n1160n1018n1367n1942n2558n3279n4047n4541n4517n3897
$$ 1887330 1835538 1784378 1733360 1681993 1630051 1577493 1524214 1470167 1415626 1361109 1307212
53217A307212n2395m9503m5356m1045l7530l4512l1176k7845k5842k5509k5382
$$ 1307212 1254817 1205314 1159958 1118913 1081383 1046871 1015695 987850 962008 936499 911117
53206I11117k4055k2115k1218k1702k2222k1735k0688j9845j9033j7715j6141
$$ 911117 887062 864947 843729 822027 799805 778070 757382 737537 718504 700789 684648
53195F84648j5054j4607j4320j3928j3642j3684j4106j4872j5609j5601j4648
$$ 684648 669594 654987 640667 626739 613097 599413 585307 570435 554826 539225 524577
53184E24577j3687j3730j4422j4553j3924j3565j3891j3834j2449j0414r072q629
$$ 524577 510890 497160 482738 468185 454261 440696 426805 412971 400522 390108 381036 372407
53172C72407q301p772p498p643p625o941n863n059m864n089n290n115m556l890
$$ 372407 364106 356334 348836 341193 333568 326627 320764 315705 310841 305752 300462 295347 290791 286901
53158B86901l370l036k914l139l659m028l798l058k287j762j337q03k12K16L45
$$ 286901 283531 280495 277581 274442 270783 266755 262957 259899 257612 255850 254513 253710 253498 253714 254059
53143B54059K32K9k11n24q69j041r18p19o68n78m0Q86J697K122K382K660K770
$$ 254059 254291 254320 254109 253585 252716 251675 250757 250038 249370 248792 248752 249638 251335 253457 255839 258499 261269
53126B61269K584K278J939J338M76j50k10j06m06j030j477j620j756k085k559
$$ 261269 263853 266131 268070 269408 269884 269734 269524 269418 269012 267982 266505 264885 263129 261044 258485
53111B58485l105l589l717l440l169l208l210k757k209k278k817k944k378j928
$$ 258485 255380 251791 248074 244634 241465 238257 235047 232290 230081 227803 224986 222042 219664 217736
53097B17736k255k942l235l106l050l131k986k559k246k243k309k272k283k377
$$ 217736 215481 212539 209304 206198 203148 200017 197031 194472 192226 189983 187674 185402 183119 180742
53083A80742k188j464n55QJ38J19j9m56j000j128p47m13m64m27K18J083J257N02
$$ 180742 178554 177090 176535 176543 176681 176800 176781 176325 175325 174197 173450 173037 172573 172146 172364 173447 174704 175206
53065A75206m84r29o71n0M28L57k08o53m68P9L34J64J7J10J98J31P4P5Rm1J71
$$ 175206 174722 173793 173122 173072 173500 173857 173649 172996 172528 172607 172941 173105 173122 173232 173430 173561 173635 173710 173719 173678 173849
53044A73849M63L68j11m98o95j065j487j246j97P56P85M3r84k096k890k605j330
$$ 173849 174312 174680 174569 174071 173376 172311 170824 169578 169381 170137 170922 170965 169981 167885 164995 162390 161060
53027A61060m98j185k544l028k558k246k353j966p90J02j88j049j223m08M68L87
$$ 161060 160562 159377 156833 153805 151247 149001 146648 144682 143892 143994 143806 142757 141534 141126 141594 141981
53011A41981o99j806j848p71M21R09R71J224J482J118K67k65k08q6j47m8K01p5
$$ 141981 141282 139476 137628 136857 137278 138187 139158 140382 141864 142982 143249 142984 142776 142690 142543 142495 142696 142621
52993A42621r93j499o29J079K273K485K405K674L140L434L545L574L394K985K771
$$ 142621 141628 140129 139500 140579 142852 145337 147742 150416 153556 156990 160535 164109 167503 170488 173259
52978A73259L157L789L734K661J400R43J129Q35m60j914k373j726q23l77m33p73
$$ 173259 176416 180205 183939 186600 188000 188943 190072 190907 190447 188533 186160 184434 183611 183234 182801 182028
52962A82028j229j531j335o95k34n30j397k030j873j259r75j258j476r88j9O24
$$ 182028 180799 179268 177933 177238 177004 176474 175077 173047 171174 169915 168940 167682 166206 165218 165199 165823
52946A65823N31m4p69j464j811j384l23O13Q85O71L01k02p69j005p14k52K6L29
$$ 165823 166354 166310 165541 164077 162266 160882 160559 161172 162057 162728 163029 162827 162058 161053 160339 160087 160113 160442
52928A60442R09J444J451J035O97N94M35J0n38q34n12L82J123R48J36k51J28M25
$$ 160442 161351 162795 164246 165281 165978 166572 167007 167017 166479 165645 165133 165515 166638 167586 167722 167471 167599 168024
52910A68024J43J08J068K174J961M29j043j557j344p70J85J290J904J724J117
$$ 168024 168167 168275 169343 171517 173478 173907 172864 171307 169963 169193 169378 170668 172572 174296 175413
52895A75413N98M70Q57J467J570Q05j47l38K49R04J299J513J350O28r5j35K03
$$ 175413 176011 176481 177338 178805 180375 181180 181033 180695 180944 181848 183147 184660 186010 186638 186543 186408 186611
52878A86611J04k47M5R25J333J011R56J658K196J735P96L18L81O19J088J951K828
$$ 186611 186715 186468 186513 187438 188771 189782 190738 192396 194592 196327 197123 197441 197822 198441 199529 201480 204308
52861B04308L125K661J636M89RP92K253K977K450J617J327J182N84q0j91j19o49
$$ 204308 207433 210094 211730 212219 212228 213020 215273 218250 220700 222317 223644 224826 225410 225330 225139 225020 224371
52844B24371j596k006j456m61L21O48O08M73M62L73k78j421k324k628k907l662
$$ 224371 222775 220769 219313 218852 219173 219821 220429 220902 221364 221737 221459 220038 217714 215086 212179 208517
52828B08517m304l880k455j004k60k52o99j244j525j574j894k659l170k726j692
$$ 208517 204213 200333 197878 196874 196614 196362 195663 194419 192894 191320 189426 186767 183597 180871 179179
52813A79179j055j186j693k177k448k209j346n13o01j493k088j706q49l26j96
$$ 179179 178124 176938 175245 173068 170620 168411 167065 166552 165951 164458 162370 160664 159815 159489 159293
52798A59293l0K06Q9n10j079j076o67n33r00j169q32l89p01j650k177j778j138
$$ 159293 159263 159469 159558 159048 157969 156893 156226 155693 154793 153624 152792 152403 151702 150052 147875 146097 144959
52781A44959j032j260j185o54M6O24P07n2j228j696j020j78j85o42o25l63q00
$$ 144959 143927 142667 141482 140828 140874 141498 142205 142153 140925 139229 138209 138031 137846 137204 136579 136216 135416
52764A35416j843k327j775j000p20o98n94p63j609k765l398l009j708j41P09K21
$$ 135416 133573 131246 129471 128471 127751 127053 126459 125696 124087 121322 117924 114915 113207 113066 113775 113996
52748A13996j079j956j849j323r97p58l64j73o61j616k362k489j943p94O08J504
$$ 113996 112917 110961 109112 107789 106792 106034 105670 105497 104836 103220 100858 98369 96426 95632 96240 97744
52732I7744J379O12J2j60k67n10o37n03k93m5N22J344J709J110J21k01K70N70
$$ 97744 99123 99735 99747 99587 99320 98810 98173 97670 97377 97332 97854 99198 100907 102017 102138 101937 102207 102777
52714A02777J00m35rJ254K219K189J545R33N11J83N1K04L77K48k04q47j671k507
$$ 102777 102877 102442 102433 103687 105906 108095 109640 110573 111084 111267 111318 111522 111899 112147 111943 111096 109425 106918
52696A06918k862k455j764j451j405r49%N88J84o78r56m08K35L09l9l49o28j264
$$ 106918 104056 101601 99837 98386 96981 96032 96032 96620 96804 96126 95170 94762 94997 95306 95267 94918 94290 93026
52678I3026k233k808k319j012Q2J94m44j011j009o45l59k48o4K64M01Q3l29j37
$$ 93026 90793 87985 85666 84654 84736 84930 84486 83475 82466 81821 81462 81214 81150 81414 81815 81898 81569 81432
52660H1432P45J526J454P17Q9j08k18n55r81j200r91j92J052J973J705L59r57
$$ 81432 82177 83703 85157 85874 85963 85855 85637 85082 84101 82901 81910 81718 82770 84743 86448 86807 85850
52643H5850j459j461j524j381l87J266K510K588J823J043O77N58M94O38J279K221
$$ 85850 84391 82930 81406 80025 79638 80904 83414 86002 87825 88868 89545 90103 90597 91235 92514 94735
52627I4735K604J645m23k366l007k217q41J68M06J35j16j09n1j85m04m64l88k70
$$ 94735 97339 98984 98561 96195 93188 90971 90130 90298 90704 90839 90723 90614 90563 90378 89974 89510 89122 88852
52609H8852LM89P67M79J09M66J337J543O07m75o24n8M05P04J401K412K864K239
$$ 88852 88855 89344 90111 90590 90699 91165 92502 94045 94652 94177 93553 93495 93900 94604 96005 98417 101281 103520
52591A03520J057K98M48J216J905K026J604R71L53r9o2O73J645K019J624J181
$$ 103520 104577 104875 105323 106539 108444 110470 112074 113045 113398 113299 113237 113910 115555 117574 119198 120379
52575A20379J243J522J544J328J111Q77O83Q55J387J608J051K03j44Q0L59M41
$$ 120379 121622 123144 124688 126016 127127 128004 128687 129542 130929 132537 133588 133791 133647 133727 134086 134527
52559A34527M58M77M90O06Q69J067J096J110J070N94k61p04k47M76N36j12q57
$$ 134527 134985 135462 135952 136558 137427 138494 139590 140700 141770 142364 142103 141399 141152 141628 142164 142052 141195
52542A41195j381j614j319n10R7j13p06q15l70Q7M43R50J416J381R84P65P63O67
$$ 141195 139814 138200 136881 136371 136468 136355 135649 134834 134464 134551 134994 135944 137360 138741 139725 140490 141253 141920
52524A41920O11R62J423J310P14L85N20N78L47K35M28O72R76J588K185K022J139
$$ 141920 142531 143493 144916 146226 146940 147325 147845 148423 148770 149005 149433 150105 151081 152669 154854 156876 158015
52507A58015M75N05O28K72k10k19K15O08O56L65l9j94L9K70J04j57K7M59N17K66
$$ 158015 158490 158995 159623 159895 159685 159466 159681 160289 160945 161310 161271 161077 161116 161386 161490 161333 161360 161819 162336 162602
52487A62602L95J059J754K284K826L012K159O32k14J11O11M74K01M44Q61Q97O95
$$ 162602 162997 164056 165810 168094 170920 173932 176091 176723 176509 176620 177231 177705 177906 178350 179211 180108 180803
52470A80803M85j14j291k293k368j765j126n33Pn1j001k084k406k157j978j766
$$ 180803 181288 181174 179883 177590 175222 173457 172331 171798 171805 171754 170753 168669 166263 164106 162128 160362
52454A60362j085l87n13j210j306m67K43j10j111j663j419r86j006j300j141k86
$$ 160362 159277 158890 158377 157167 155861 155394 155637 155527 154416 152753 151334 150348 149342 148042 146901 146615
52438A46615M98L48l73l98P00J820J823R57K51J64N05J100J741J843J077K2m94
$$ 146615 147113 147461 147088 146690 147390 149210 151033 151990 152241 152405 152910 154010 155751 157594 158671 158693 158199
52421A58199m89n29o78n65k80k43l39O0J041J970K395K497K506K279J671Q16o9
$$ 158199 157710 157181 156503 155938 155658 155415 155076 155136 156177 158147 160542 163039 165545 167824 169495 170311 170242
52404A70242p34p80mJ088J665J525J214J187J369J554J715J717J334P90Q23J838
$$ 170242 169508 168728 168724 169812 171477 173002 174216 175403 176772 178326 180041 181758 183092 183882 184705 186543
52388A86543L197L777L057J580M61M57J373K285K434J958J617J875K388K379J459
$$ 186543 189740 193517 196574 198154 198615 199072 200445 202730 205164 207122 208739 210614 213002 215381 216840
52373B16840J47m34L20J719K397J899J176J273K097K844L110L020K689K299K317
$$ 216840 216987 216553 216873 218592 220989 222888 224064 225337 227434 230278 233388 236408 239097 241396 243713
52358B43713K931L476L179K266J597J408J272J196J648K442K576J705Q14R69J959
$$ 243713 246644 250120 253299 255565 257162 258570 259842 261038 262686 265128 267704 269409 270223 271192 273151
52343B73151K786K960K814K820L151L624L820L447K774K417K526K641K529K579
$$ 273151 275937 278897 281711 284531 287682 291306 295126 298573 301347 303764 306290 308931 311460 314039
52329C14039K994L222K764K141K333L449M595N022M844M569M486M622M923N226
$$ 314039 317033 320255 323019 325160 327493 330942 335537 340559 345403 349972 354458 359080 364003 369229
52315C69229N286N044M721M641M938N522O181O775P380Q176R149R964J0317J0313
$$ 369229 374515 379559 384280 388921 393859 399381 405562 412337 419717 427893 437042 447006 457323 467636
52301D67636J0412J0994J2006J3065J3866J4593J5766J7507J9077J9554J9049
$$ 467636 478048 489042 501048 514113 527979 542572 558338 575845 594922 614476 633525
52290F33525J8660J9036J9515J9232J8518J8444J9137J9580J9113J8290J7836
$$ 633525 652185 671221 690736 709968 728486 746930 766067 785647 804760 823050 840886
52279H40886J7540J6792J5629J4483J3289J1666R856Q630Q072P278N584L483J862
$$ 840886 858426 875218 890847 905330 918619 930285 940141 948771 956843 964121 969705 973188 975050
52266I75050P70m07j891l239m080m486m570m253l740l739m723o150o839o239m948
$$ 975050 975820 975413 973522 970283 966203 961717 957147 952894 949154 945415 940692 934542 927703 921464 916516
52251I16516l847l024j882j44J731L255M547N967P434Q601R519J0518J1523J2090
$$ 916516 912669 909645 907763 907619 909350 912605 917152 923119 930553 939154 948673 959191 970714 982804
52237I82804J2289J2884J4368J6264J7704J8214J7669J6103J4050J2526J2030
$$ 982804 995093 1007977 1022345 1038609 1056313 1074527 1092196 1108299 1122349 1134875 1146905
52226A146905J1928J1368J0374R340Q067O160M028K389J022q62l068m512m994
$$ 1146905 1158833 1170201 1180575 1189915 1197982 1204142 1208170 1210559 1211581 1210719 1207651 1203139 1198145
52213A198145n614o985q241q499q292q721r923j1219j2167j2623j2340j1351j0351
$$ 1198145 1192531 1185546 1177305 1168806 1160514 1151793 1141870 1130651 1118484 1105861 1093521 1082170 1071819
52200A071819r987j0023r880r576r419r145q216o768n516m811m467m356m420m282
$$ 1071819 1061832 1051809 1041929 1032353 1022934 1013789 1005573 998805 993289 988478 984011 979655 975235 970953
52186I70953l528k432j736j658j756j732j768j992k167k059j627q93j4N26L49
$$ 970953 967425 964993 963257 961599 959843 958111 956343 954351 952184 950125 948498 947605 947591 948117 948466
52171I48466j98m21k66l84j125k080k716k919k800k531k493l028l837m144l680
$$ 948466 948268 947847 947581 947197 946072 943992 941276 938357 935557 933026 930533 927505 923668 919524 915844
52156I15844l025k733k743k895l343l993m123l279k188k072l174m512n096m893
$$ 915844 912819 910086 907343 904448 901105 897112 892989 889710 887522 885450 882276 877764 872668 867775
52142H67775m554m682n454o507p071o603n487m790n090n814o003n536n085n056
$$ 867775 863221 858539 853085 846578 839507 832904 827417 822627 817537 811723 805720 800184 795099 790043
52128G90043n116m887m591m582m648m261l382k492j833j205n15r2j76n31p58o85
$$ 790043 784927 780040 775449 770867 766219 761958 758576 756084 754251 753046 752531 752439 752263 751732 750974 750289
52112G50289k31O81J898L021L916M886O119P332Q308R360J0810J2367J3536J4356
$$ 750289 750058 750739 752637 755658 759574 764460 770579 777911 786219 795579 806389 818756 832292 846648
52098H46648J5270J6440J7750J9208K0847K2345K3320K3963K4740K5563K5820
$$ 846648 861918 878358 896108 915316 936163 958508 981828 1005791 1030531 1056094 1081914
52087A081914K5300K4583K4225K4072K3538K2260K0317J8064J5865J3882J2045
$$ 1081914 1107214 1131797 1156022 1180094 1203632 1225892 1246209 1264273 1280138 1294020 1306065
52076A306065J0282Q616O922M921K664O87p08j969l563n138o152o979q450j0362
$$ 1306065 1316347 1324963 1331885 1336806 1339470 1340157 1339449 1337480 1333917 1328779 1322627 1315648 1307198 1296836
52062A296836j1551j1546j1227j1366j1504j0862r624q594p948p123n712l903
$$ 1296836 1285285 1273739 1262512 1251146 1239642 1228780 1219156 1210562 1202614 1195491 1189779 1185876
52050A185876k102n71O03J549K578L872N220O247O820P128P484Q159R182J0201
$$ 1185876 1183774 1183203 1183806 1185355 1187933 1191805 1197025 1203272 1210092 1217220 1224704 1232863 1242045 1252246
52036A252246J0687J0454R858R421R388R650R850R547Q517P036N583M285K903
$$ 1252246 1262933 1273387 1283245 1292666 1302054 1311704 1321554 1331101 1339618 1346654 1352237 1356522 1359425
52023A359425J364n3j115j901k636l643n391q017j0704j2174j2215j2074j2989
$$ 1359425 1360789 1360736 1359621 1357720 1355084 1351441 1346050 1338033 1327329 1315155 1302940 1290866 1277877
52010A277877j4758j6338j7371j8406j9821k1276k2297k2870k3227k3491k3656
$$ 1277877 1263119 1246781 1229410 1211004 1191183 1169907 1147610 1124740 1101513 1078022 1054366
51999A054366k3768k3929k4212k4593k4923k5019k4876k4669k4469k4091k3388
$$ 1054366 1030598 1006669 982457 957864 932941 907922 883046 858377 833908 809817 786429
51988G86429k2488k1632k0866k0117j9442j8993j8781j8721j8694j8491j7814
$$ 786429 763941 742309 721443 701326 681884 662891 644110 625389 606695 588204 570390
51977E70390j6652j5464j4672j4043j2943j1281r762r026q877q623q049p575p517
$$ 570390 553738 538274 523602 509559 496616 485335 475573 466547 457670 449047 440998 433423 425906
51964D25906p538p118o259n434m929m604m298m114m162m309m388m336m002l208
$$ 425906 418368 411250 404991 399557 394628 390024 385726 381612 377450 373141 368753 364417 360415 357207
51950C57207k185j613j823k369k742l204m249n545o127n595m503l475k676k201
$$ 357207 355022 353409 351586 349217 346475 343271 339022 333477 327350 321755 317252 313777 311101 308900
51936C08900k284k807l237l358l508l852l894l237k247j530j189j097j409k185
$$ 308900 306616 303809 300572 297214 293706 289854 285960 282723 280476 278946 277757 276660 275251 273066
51922B73066k751k247p94N34R57P22M68L44N1n39j108j239q76m17m04r97j794
$$ 273066 270315 268068 267274 267808 268765 269487 269955 270299 270350 269811 268703 267464 266588 266171 265767 264770 262976
51905B62976k212k034j591j401j680k225k623k595k110j353o73m97r67j590j597
$$ 262976 260764 258730 257139 255738 254058 251833 249210 246615 244505 243152 242479 241982 241015 239425 237828
51890B37828q80k50m26j092j416j179p84l53K92Q12L81j034k230k111r87k8J83
$$ 237828 236948 236698 236272 235180 233764 232585 231801 231448 231740 232552 232933 231899 229669 227558 226571 226543 226726
51873B26726J4M5M60J081J519J453J009P36R92J557K006K177K000J351M83J49
$$ 226726 226740 226785 227245 228326 229845 231298 232307 233043 234035 235592 237598 239775 241775 243126 243609 243758
51857B43758P85J798K243J938J413R78N15O8l0K13L64K40J71M19P68R26R13P71
$$ 243758 244543 246341 248584 250522 251935 252913 253428 253496 253466 253679 254043 254283 254454 254873 255641 256567 257480 258251
51839B58251K87n51j170r36q6M22J36k38L09J730K912K963K157J374J041R60Q96
$$ 258251 258538 257987 256817 255881 255795 256217 256353 256115 256424 258154 261066 264029 266186 267560 268601 269561 270457
51822B70457Q31P14M61K40K70L16j22r87j576j533j343j500j716j443p91l29k87
$$ 270457 271288 272002 272463 272703 272973 273289 273167 272180 270604 269071 267728 266228 264512 263069 262278 261949 261662
51805B61662n05q88j328j318l77J092J962J615N24m88j094j381j351r17j95N30
$$ 261662 261157 260269 258941 257623 257246 258338 260300 261915 262439 261951 260857 259476 258125 257208 257013 257543
51789B57543J034J218J048O06J43j07q9J10M27Q48J311J665J757J558J194Q93
$$ 257543 258577 259795 260843 261449 261592 261485 261396 261506 261933 262781 264092 265757 267514 269072 270266 271159
51773B71159Q99J370K267L291M075M519M876N355N752N621M789L442J794r0k076
$$ 271159 272058 273428 275695 278986 283061 287580 292456 297811 303563 309184 313973 317415 319209 319119 317043
51758C17043l851n133n840n972n598m974m456m152l872l465k956k351j618r35
$$ 317043 313192 308059 302219 296247 290649 285675 281219 277067 273195 269730 266774 264423 262805 261870
51744B61870o18o80p58o63o40q92j139r56l33L24O70O70M97K61j47r03j725j776
$$ 261870 261252 260572 259814 259151 258511 257619 256480 255524 255191 255515 256185 256855 257352 257613 257466 256563 254838 253062
51726B53062n85J063J760J150K35j02j88o70j269j189k98P60J461J724J498O43
$$ 253062 252477 253540 255300 256450 256685 256583 256395 255725 254456 253267 252969 253729 255190 256914 258412 259055
51710B59055p09k052k883l000k558j984j654j490j213j020j458k411k881k290
$$ 259055 258346 256294 253411 250411 247853 245869 244215 242725 241512 240492 239034 236623 233742 231452
51696B31452j309p98n11K39J175J470J287J701L001M190M506M480M912N653O057
$$ 231452 230143 229345 228834 229073 230248 231718 233005 234706 237707 241897 246403 250883 255795 261448 267505
51681B67505O168O624P444P590N996K761q33l455m738n133n095m757m317m168
$$ 267505 273673 280297 287741 295331 301327 304088 303255 299800 295062 289929 284834 280077 275760 271592
51667B71592m341m313l737k945k368j824r62K0O43R15J153J293J019L95k99j217
$$ 271592 267251 262938 259201 256256 253888 252064 251102 251122 251765 252680 253833 255126 256145 256540 256241 255024
51651B55024k660m249n122n010m433l883l418l119l149l286l081k579k200j890
$$ 255024 252364 248115 242993 237983 233550 229667 226249 223130 219981 216695 213614 211035 208835 206945
51637B06945j204k79J79O8Q0M44M45k20o75j12R07J313R79N51K50j91p12r13p82
$$ 206945 205741 205462 205641 205709 205789 206233 206678 206458 205783 205671 206578 207891 208870 209421 209671 209480 208768 207855 207073
51618B07073o66o11l54J47O71J170J638J782J417J070J476K488L173L067K639
$$ 207073 206407 205796 205442 205589 206260 207430 209068 210850 212267 213337 214813 217301 220474 223541 226180
51603B26180K409K307K206K386K995L557L606L414L559M057M531M991N717O409
$$ 226180 228589 230896 233102 235488 238483 242040 245646 249060 252619 256676 261207 266198 271915 278324
51589B78324O249N062L748L122K909K420J758J612J985K027J191j05j141j619
$$ 278324 284573 289635 293383 296505 299414 301834 303592 305204 307189 309216 310407 310302 309161 307542
51575C07542j516q76q6K36J05L21J302K326K646K775L725N301O255O037N368M901
$$ 307542 306026 305150 305064 305300 305405 305726 307028 309354 312000 314775 318500 323801 330056 336093 341461 346362
51559C46362M373L505K787K753L049K895K116J145K93m17q93r80p66n28l44j36
$$ 346362 350735 354240 357027 359780 362829 365724 367840 368985 369278 368861 367968 366988 366222 365694 365350 365214
51543C65214ql40j415l081m753n834o156o042n788n277m326l244k667k775l151
$$ 365214 365206 364866 363451 360370 355617 349783 343627 337585 331797 326520 322194 318950 316283 313508 310357
51528C10357l466l762l953l599k564j461r88j115j354j558j968k560k883k580
$$ 310357 306891 303129 299176 295577 293013 291552 290564 289449 288095 286537 284569 282009 279126 276546
51514B76546j802j044p04q36j120j140p92m33n09j103j871k322k073j094J18P92
$$ 276546 274744 273700 272996 272160 271040 269900 269108 268675 268166 267063 265192 262870 260797 259703 259821 260613
51498B60613N49k12p80q75p41o32m55pO66J316J789K127K357K419K343K429K904
$$ 260613 261162 260950 260170 259295 258554 257922 257467 257460 258126 259442 261231 263358 265715 268134 270477 272906 275810
51481B75810L498L670L348L044L109L288L322L510M179M958N230N080N104N319
$$ 275810 279308 282978 286326 289370 292479 295767 299089 302599 306778 311736 316966 322046 327150 332469
51467C32469N075M134L084K486K238K082K098K285K216J542M13r28k468l953m692
$$ 332469 337544 341678 344762 347248 349486 351568 353666 355951 358167 359709 360122 359194 356726 352773 348081
51452C48081m419l973m357n431o223o367o442o870p197o794n715m507l536k839
$$ 348081 343662 339689 335332 329901 323678 317311 310869 303999 296802 290008 284293 279786 276250 273411
51438B73411k468k536k917l146k783j810n80N33J402K008K263K110J753J587J844
$$ 273411 270943 268407 265490 262344 259561 257751 257171 257704 259106 261114 263377 265487 267240 268827 270671
51423B70671K408K952L097K531J202n45k143l159l486l342l256l780m841n556
$$ 270671 273079 276031 279128 281659 282861 282316 280173 277014 273528 270186 266930 263150 258309 252753
51409B52753n186m265m092n007n789n178l493k201k148k825l320l406l476l713
$$ 252753 247567 243302 239210 234203 228414 223236 219743 217542 215394 212569 209249 205843 202367 198654
51395A98654l782l366k753k516k654k517j745r42r03j482j765j362q93j047j726
$$ 198654 194872 191506 188753 186237 183583 181066 179321 178379 177476 175994 174229 172867 171974 170927 169201
51380A69201k334k457k018j150k50Q6m32j361j779j025O86K217K310P61j291k506
$$ 169201 166867 164410 162392 161242 160992 161078 160646 159285 157506 156481 157167 159384 161694 162455 161164 158658
51364A58658k605k131j462o81j85l86q30n56M81J235J176J085J773K783L097K490
$$ 158658 156053 153922 152460 151779 151594 151208 150378 149822 150303 151538 152714 153799 155572 158355 161452 163942
51348A63942J561Q43N82R51J847K680K932K775K810L373M358N348N721N017L550
$$ 163942 165503 166346 166928 167879 169726 172406 175338 178113 180923 184296 188654 194002 199723 204740 208290
51333B08290K215J481J023M37k80j260k757m234m437l146j989k565m402n722n626
$$ 208290 210505 211986 213009 213446 213166 211906 209149 204915 200478 197332 195343 192778 188376 182654 177028
51318A77028m549l141j894j498k320l573m048l573k918k450j940j504j516j607
$$ 177028 172479 169338 167444 165946 163626 160053 156005 152432 149514 147064 145124 143620 142104 140497
51304A40497r27L69J096O96o5m58p01j094j204o47Q9L40K39L27O05O51L62L5j14
$$ 140497 139570 139939 141035 141731 141666 141208 140507 139413 138209 137562 137651 137991 138230 138557 139162 139813 140175 140210 140096
51285A40096r3K5J46J81K77P33J494K028J991J680J612J829J917J553Q10O9l00
$$ 140096 140003 140028 140174 140355 140632 141365 142859 144887 146878 148558 150170 151999 153916 155469 156279 156348 156048
51268A56048l07m71j267k411l049k714j857j235j137j351j572j610j416j138r84
$$ 156048 155741 155270 154003 151592 148543 145829 143972 142737 141600 140249 138677 137067 135651 134513 133529
51253A33529r44p91m65j84j43k67m09m92m35j77P2n4n37q02l25O65J351J149L62
$$ 133529 132585 131794 131329 131145 131002 130735 130326 129834 129399 129222 129294 129240 128703 127901 127576 128241 129592 130741 131103
51234A31103m7N44J676K224J690P98N03P64Q28N21M89J056J524J061j44j070j014
$$ 131103 131056 131600 133276 135500 137190 137988 138491 139255 140083 140604 141093 142149 143673 144734 144590 143520 142506
51217A42506k35N45R19J019J091J088Q57O10Q49J615K179J881J012M31M84P99
$$ 142506 142271 142816 143735 144754 145845 146933 147790 148400 149249 150864 153043 154924 155936 156367 156851 157650
51201A57650J078J449J977K299K024J255N25L38P34J170R52L5q03q71m19j77l25
$$ 157650 158728 160177 162154 164453 166477 167732 168257 168595 169329 170499 171451 171486 170683 169812 169393 169216 168891
51184A68891n14o98j206j928k193j690r63o94r41j283j359j084p00o16r45j210
$$ 168891 168377 167679 166473 164545 162352 160662 159699 159005 158064 156781 155422 154338 153638 153022 152077 150867
51168A50867r62n55p18j348j493o80M67J142J263J108P91M66M95Q63J000N91J51
$$ 150867 149905 149350 148632 147284 145791 145111 145578 146720 147983 149091 149882 150348 150843 151706 152706 153297 153448
51151A53448K43O14O47K90k4j46k86n10o43o47o49o79o98p99j084j388j458j274
$$ 153448 153691 154305 154952 155242 155218 155072 154786 154276 153633 152986 152337 151658 150960 150161 149077 147689 146231 144957
51133A44957r94o60k82n2k72r63j732k020j531n79N7j23p22q47j92O01P61K09
$$ 144957 143963 143303 143021 142969 142697 141734 140002 137982 136451 135872 135929 135806 135084 134237 134045 134646 135407 135616
51115A35616n31r16p23j33L75M44K50J81J77j11m98k80P29J809K282K292K271
$$ 135616 135085 134169 133446 133313 133688 134132 134382 134563 134740 134629 134131 133851 134580 136389 138671 140963 143234
51098A43234K181J782J191P29N81R16J856K923L142K239J185R27J156J032O09
$$ 143234 145415 147197 148388 149117 149698 150614 152470 155393 158535 160774 161959 162886 164042 165074 165683
51083A65683N46Q03O72N7k98Q5Q31J438J849K077K011J745J640J743J770J696
$$ 165683 166229 167032 167704 167761 167463 167548 168379 169817 171666 173743 175754 177499 179139 180882 182652 184348
51067A84348J890K381K629K273J614J110Q23N86K73l00j214j934j644m71K57m05
$$ 184348 186238 188619 191248 193521 195135 196245 197068 197654 197927 197627 196413 194479 192835 192364 192621 192216
51051A92216j664k016j215l64k67n81p09o55o32n29k18R9K58N00J019J527J687
$$ 192216 190552 188536 187321 186957 186690 186109 185400 184745 184113 183584 183366 183465 183723 184223 185242 186769 188456
51034A88456J671J790J775J134L9p24o90o8P81J603J964J441L71l60n25q67j722
$$ 188456 190127 191917 193692 194826 194865 194141 193451 193383 194164 195767 197731 199172 199543 199183 198658 197791 196069
51017A96069k167j317K38J161J195J161J407J345P28L11Q12J930K818L108L039
$$ 196069 193902 192585 192823 193984 195179 196340 197747 199092 199820 200131 200943 202873 205691 208799 211838
51002B11838K960L077L462L972M350M485M458M413M571N212O297P191P320O930
$$ 211838 214798 217875 221337 225309 229659 234144 238602 243015 247586 252798 259095 266286 273606 280536
50988B80536O751P020P422P873Q619R590J0432J1282J2633J4339J5606J6325J7495
$$ 280536 287287 294307 301729 309602 318221 327811 338243 349525 362158 376497 392103 408428 425923
50975D25923J9912K3146K6315K9124L1766L4471L7701M1962M6914N1431N5078
$$ 425923 445835 468981 495296 524420 556186 590657 628358 670320 717234 768665 823743
50964H23743N8705O2937O6962O9778P1717P3636P5235P5461P4137P1834O8362
$$ 823743 882448 945385 1012347 1082125 1153842 1227478 1302713 1378174 1452311 1524145 1592507
50953A592507O2734N4791M5676L6500K7535J8868J0867L564l489j0292j5986j9836
$$ 1592507 1655241 1710032 1755708 1792208 1819743 1838611 1849478 1853042 1849553 1839261 1823275 1803439
50941A803439k2060k3171k3021k1076j7593j3994j1895j1813j2908j4127j5539
$$ 1803439 1781379 1758208 1735187 1714111 1696518 1682524 1670629 1658816 1645908 1631781 1616242
50930A616242j8130k2284k7132l1741l6213m0923m5425m9073n2237n5622n8659
$$ 1616242 1598112 1575828 1548696 1516955 1480742 1439819 1394394 1345321 1293084 1237462 1178803
50919A178803n9928n9156n7576n5957n3657n0102m5939m2012l8194l4196l0576
$$ 1178803 1118875 1059719 1002143 946186 892529 842427 796488 754476 716282 682086 651510
50908F51510k7964k5889k3429k0636j8217j6119j3561j0436p704o066n045l729
$$ 651510 623546 597657 574228 553592 535375 519256 505695 495259 487555 481489 476444 472715
50896D72715j887j5J299J824J708J393J243J230J092Q80R96J593K302K702K893
$$ 472715 470828 470813 472112 473936 475644 477037 478280 479510 480602 481482 482478 484071 486373 489075 491968
50881D91968L294M105N189O321P290P845P914P889Q352R395J0522J1369J2222
$$ 491968 495262 499367 504556 510877 518167 526012 533926 541815 550167 559562 570084 581453 593675
50868E93675J3484J4957J6103J6999J8442K0933K4051K7156L0309L4068L8593
$$ 593675 607159 622116 638219 655218 673660 694593 718644 745800 776109 810177 848770
50857H48770M3446M8344N3594N9709O6888P5059Q4193R4253J04964J15785J26224
$$ 848770 892216 940560 994154 1053863 1120751 1195810 1280003 1374256 1479220 1595005 1721229
50846A721229J36058J45255J53766J61358J67587J71789J73174J71110J65331
$$ 1721229 1857287 2002542 2156308 2317666 2485253 2657042 2830216 3001326 3166657
50837C166657J55760J42142J24211J02414P8167N3104K8303M569j6904l4852m8809
$$ 3166657 3322417 3464559 3588770 3691184 3769351 3822455 3850758 3855327 3838423 3803571 3754762
50826C754762n8968o5225o7095o4670n8879n0558m0122k8597j8153j0853p376
$$ 3754762 3695794 3630569 3563474 3498804 3439925 3389367 3349245 3320648 3302495 3291642 3284266
50815C284266p549j1586j9872l1877m6096o1046p5752q9487j01750j12404j21247
$$ 3284266 3276717 3265131 3245259 3213382 3167286 3106240 3030488 2941001 2839251 2726847 2605600
50804B605600j27504j30374j29977j27147j22349j15366j06083r4952q2657o9877
$$ 2605600 2478096 2347722 2217745 2090598 1968249 1852883 1746800 1651848 1569191 1499314
50794A499314n7358m5576l4223k2510j0165K246J4046K5051L5366M5053N4059
$$ 1499314 1441956 1396380 1362157 1339647 1329482 1331728 1345774 1370825 1406191 1451244 1505303
50783A505303O2085O8369P2022P2686P0567O5910N8813M9622L9022K7639J5858
$$ 1505303 1567388 1635757 1707779 1780465 1851032 1916942 1975755 2025377 2064399 2092038 2107896
50772B107896M130o924j6760k5067l1776l7236m2255m7506n2934n8017o2423o5978
$$ 2107896 2112026 2105102 2088342 2063275 2031499 1994263 1952008 1904502 1851568 1793551 1731128 1665150
50760A665150o8261o8841o7834o5685o2521n8292n3353m8166m2628l6408k9899
$$ 1665150 1596889 1528048 1460214 1394529 1332008 1273716 1220363 1172197 1129569 1093161 1063262
50749A063262k3951j8600j3086p214j698L144P994J3314J8478K2785K6642L0994
$$ 1063262 1039311 1020711 1007625 1000411 998713 1001857 1009851 1023165 1041643 1064428 1091070 1122064
50737A122064L6131M1809M8095N5349O3595P2423Q1402R0133R8179J05302J11572
$$ 1122064 1158195 1200004 1248099 1303448 1367043 1439466 1520868 1611001 1709180 1814482 1926054
50726A926054J16750J19883J19931J16591J10256J01391R0270P7021O1556M3764
$$ 1926054 2042804 2162687 2282618 2399209 2509465 2610856 2701126 2778147 2839703 2883467
50716B883467K4149M027j5250l2905m8324o0434o8167p1382p0885o7545o1770
$$ 2883467 2907616 2911643 2896393 2863488 2815164 2754730 2686563 2615181 2544296 2476751 2414981
50705B414981n3777m4013l3361k3056j4388q192m706l884n665r952j6588k5473
$$ 2414981 2361204 2317191 2283830 2260774 2246386 2238194 2233488 2229604 2223939 2213987 2197399 2171926
50693B171926l6220m7557n7622o5140p0017p2510p2415o9526o4367n7838n0327
$$ 2171926 2135706 2088149 2030527 1965387 1895370 1822860 1750445 1680919 1616552 1558714 1508387
50682A508387m1795l2408k2544j2309j601R393K0392L1636M3678N6547O9605Q2504
$$ 1508387 1466592 1434184 1411640 1399331 1397730 1407123 1427515 1459151 1502829 1559376 1628981 1711485
50670A711485R5652J09483J23512J36512J47328J55244J59652J59809J55077J45320
$$ 1711485 1807137 1916620 2040132 2176644 2323972 2479216 2638868 2798677 2953754 3099074
50660C099074J30984J12988R2590P1266N0300L0421J1948m688j8970l1018m1842
$$ 3099074 3230058 3343046 3435636 3506902 3557202 3587623 3599571 3594883 3575913 3544895 3503053
50649C503053n2427o2714p1901p9581q5945r1051r4460r5763r4868r1681q6026
$$ 3503053 3450626 3387912 3316011 3236430 3150485 3059434 2964974 2869211 2774343 2682662 2596636
50638B596636p8155o8782n8435m7229l5481k4028j3612m431L378R278J2805J4133
$$ 2596636 2518481 2449699 2391264 2344035 2308554 2284526 2270914 2266483 2269861 2279139 2291944 2306077
50626B306077J3761J1940Q812M852P42l096o473r106j0591j0586q928n657j071
$$ 2306077 2319838 2331778 2340590 2345442 2346184 2343088 2336615 2327509 2316918 2306332 2297404 2291747 2290676
50613B290676M415J0428J6454K1518K4612K5601K5242K4170K2213J8929J4295
$$ 2290676 2295091 2305519 2321973 2343491 2368103 2393704 2418946 2443116 2465329 2484258 2498553
50602B498553Q714K711l261r238j6095k4866l5474m6652n7319o7304p6491q4020
$$ 2498553 2507267 2509978 2506717 2497479 2481384 2456518 2421044 2374392 2317073 2249769 2173278 2089258
50590B089258q8979r1283r1340q9403q5766q1083p5876p0222o4262n8525n3230
$$ 2089258 2000279 1908996 1817656 1728253 1642487 1561404 1485528 1415306 1351044 1292519 1239289
50579A239289m7971m2556l7508l3118k8728k3727j8584j4049r991n883j852J750
$$ 1239289 1191318 1148762 1111254 1078136 1049408 1025681 1007097 993048 983057 977174 975322 977072
50567I77072N288R297J3428J7063K0535K4639K9196L3280L6654L9850M3047M6097
$$ 977072 982360 991657 1005085 1022148 1042683 1067322 1096518 1129798 1166452 1206302 1249349 1295446
50555A295446M9546N4302O0223O6256P2164P8799Q6454R4198J01187J07334J12044
$$ 1295446 1344992 1399294 1459517 1525773 1597937 1676736 1763190 1857388 1958575 2065909 2177953
50544B177953J13631J10838J04133R4680Q2913O9011N4164M0378K9187K1136J6087
$$ 2177953 2291584 2402422 2506555 2601235 2684148 2753159 2807323 2847701 2876888 2898024 2914111
50533B914111J3360J1848J0582R175P491N349K913J010M97J646M475R328J6481
$$ 2914111 2927471 2939319 2949901 2959076 2966567 2971916 2974829 2975839 2976336 2977982 2982457 2991785 3008266
50520C008266K5454L5163M4677N3339O0368O4875O6449O5318O1743N5427M5756
$$ 3008266 3033720 3068883 3113560 3166899 3227267 3292142 3358591 3423909 3485652 3541079 3586835
50509C586835L2669J7150O58j5906l2425m8732o4087p7748q9517r9058j05071
$$ 3586835 3619504 3636654 3637312 3621406 3588981 3540249 3476162 3398414 3308897 3209839 3104768
50498C104768j06137j02301r4969q5099p2478n7038m0040k3287p760O398J9023
$$ 3104768 2998631 2896330 2801361 2716262 2643784 2586746 2546706 2523419 2515659 2522057 2541080
50487B541080K9613L7638M2690M4416M2623L7198K7798J3987m033k5030m7264
$$ 2541080 2570693 2608331 2651021 2695437 2738060 2775258 2803056 2817043 2813010 2787980 2740716
50476B740716o9079q8930j05351j17394j24860j27925j26887j22453j15882j08411
$$ 2740716 2671637 2582707 2477356 2359962 2235102 2107177 1980290 1857837 1741955 1633544
50466A633544j00676r2789q4730p6544o8488o1051n4438m8064m1142l3890k7475
$$ 1633544 1532868 1440079 1355349 1278805 1210317 1149266 1094828 1046764 1005622 971732 944257
50455I44257k2576j8639j4924j1446q429n595k712k01J590L243N613Q613J1484
$$ 944257 921681 903042 888118 876672 868243 862648 859936 859735 861325 864568 870181 878794 890278
50442H90278J3901J6005J7587J8349J8855K0261K2781K5266K6727K7607K9048
$$ 890278 904179 920184 937771 956120 974975 995236 1018017 1043283 1070010 1097617 1126665
50431A126665L1340L3650L5112L5726L6127L6802L7693L8500L9119L9596L9777
$$ 1126665 1158005 1191655 1226767 1262493 1298620 1335422 1373115 1411615 1450734 1490330 1530107
50420A530107L9339L8322L7216L6301L5161L3281L0905K8924K8032K8340K9662
$$ 1530107 1569446 1607768 1644984 1681285 1716446 1749727 1780632 1809556 1837588 1865928 1895590
50409A895590L1663L3737L5154L5604L5377L5006L4778L4560L3824L1967K8836
$$ 1895590 1927253 1960990 1996144 2031748 2067125 2102131 2136909 2171469 2205293 2237260 2266096
50398B266096K4972K0999J6849J1817N416k152j0416j9282k9071l9919n1264o1989
$$ 2266096 2291068 2312067 2328916 2340733 2346149 2343997 2333581 2314299 2285228 2245309 2194045 2132056
50386B132056p1105p8321q3800q7416q8545q6701q2078p5279o6858n7357m7465
$$ 2132056 2060951 1982630 1898830 1811414 1722869 1636168 1554090 1478811 1411953 1354596 1307131
50375A307131l7609k7639j7370p351J527R088J5873K1925K6163K7348K5285K0724
$$ 1307131 1269522 1241883 1224513 1217162 1218689 1227777 1243650 1265575 1291738 1319086 1344371 1365095
50363A365095J4370O423k957j3176k3254l2207l9381m4577m7940m9597m9529m7854
$$ 1365095 1379465 1385888 1382931 1369755 1346501 1314294 1274913 1230336 1182396 1132799 1083270 1035416
50351A035416m5167m2331l9851l7595l5182l2427k9373k6063k2606j9292j6436
$$ 1035416 990249 947918 908067 870472 835290 802863 773490 747427 724821 705529 689093
50340F89093j4079j2078j0413r008p381m997k189j06O70R95K151M247O330P781
$$ 689093 675014 662936 652523 643515 636134 631137 628948 628842 629512 630507 632658 636905 643235 651016
50326F51016Q839R826J0689J1517J2740J4452J6082J7123J7720J8271J8856J9393
$$ 651016 659855 669681 680370 691887 704627 719079 735161 752284 770004 788275 807131 826524
50314H26524J9911K0350K0601K1003K2244K4298K5967K6175K5284K4472K4072
$$ 826524 846435 866785 887386 908389 930633 954931 980898 1007073 1032357 1056829 1080901
50303A080901K3331K1707J9593J7600J5723J3573J0963P997M820J566j574m381
$$ 1080901 1104232 1125939 1145532 1163132 1178855 1192428 1203391 1211388 1216208 1217774 1216200 1211819
50291A211819o720q598j0167j1655j3204j4820j6526j8411k0565k3021k5723k8297
$$ 1211819 1205099 1196501 1186334 1174679 1161475 1146655 1130129 1111718 1091153 1068132 1042409 1014112
50279A014112k9992l0269k9482k8488k7569k6295k4601k3145k2199k0973j8770
$$ 1014112 984120 953851 924369 895881 868312 842017 817416 794271 772072 751099 732329
50268G32329j6168j4287j3327j2660j1871j0730q662n421k143m08j36K90J616
$$ 732329 716161 701874 688547 675887 664016 653286 644624 639203 637060 636652 636516 636806 638422
50255F38422K795K948K912L820N130N398M439L550L638M184M185L341K092R92
$$ 638422 641217 644165 647077 650897 656027 661425 665864 669414 673052 677236 681421 684762 686854 687846
50241F87846K69k45r16j815k570k878l040l565m351m771m617m457m876n654o019
$$ 687846 688115 687870 686954 685139 682569 679691 676651 673086 668735 663964 659347 654890 650014 644360 638341
50226F38341n526m465l460k874k553k114j394o15o7K68O74J303K024K632L132
$$ 638341 632815 628350 624890 622016 619463 617349 615955 615340 615273 615541 616215 617518 619542 622174 625306
50211F25306L702M462N297N855N750M966M028L631L805L696K401J30j803k345
$$ 625306 629008 633470 638767 644622 650372 655338 659366 662997 666802 670498 672899 673029 671226 668881
50197F68881j806j381j701k299k475k254k164k466k994l590m245m823n088n112
$$ 668881 667075 665694 663993 661694 659219 656965 654801 652335 649341 645751 641506 636683 631595 626483
50183F26483n360o137p175p914q065p799p476p334p332p150o381m872k945j233
$$ 626483 621123 614986 607811 599897 591832 584033 576557 569223 561891 554741 548360 543488 540543 539310
50169E39310k06J42K69O86J550K564L196L032K041O32n90j381k071l095m273m959
$$ 539310 539104 539246 539515 540201 541751 544315 547511 550543 552584 553216 552626 551245 549174 546079 541806 536847
50153E36847m935m830n297o110o397n650m151k544j375q89q69o76J02J054J417
$$ 536847 531912 527082 521785 515675 509278 503628 499477 496933 495558 494669 493800 493124 493226 494280 495697
50138D95697J135R45J303J769J779J543J715K410L066L208L006L009L517M295
$$ 495697 496832 497777 499080 500849 502628 504171 505886 508296 511362 514570 517576 520585 524102 528397
50124E28397M827M818M512M410M686N031N087M835M409L840L206K876L200M033
$$ 528397 533224 538042 542554 546964 551650 556681 561768 566603 571012 574852 578058 580934 584134 588167
50110E88167M768N004M946N099N635O199O438O569P277Q847J0626J1627J1627
$$ 588167 592935 597939 602885 607984 613619 619818 626256 632825 640102 648949 659575 671202 682829
50097F82829J1386J1697J2594J3630J4664J6044J8117K0847K3815K6602K9171
$$ 682829 694215 705912 718506 732136 746800 762844 780961 801808 825623 852225 881396
50086H81396L2000L5641M0116M4985N0099N5934O2972P1118Q0083R0090J01718
$$ 881396 913396 949037 989153 1034138 1084237 1140171 1203143 1274261 1354344 1444434 1546152
50075A546152J15165J30073J45939J62077J77087J88858J95305J94993J87119
$$ 1546152 1661317 1791390 1937329 2099406 2276493 2465351 2660656 2855649 3042768
50066C042768J71655J49808J24083R7536P3050N3172L9893L3943L4347L8905M4852
$$ 3042768 3214423 3364231 3488314 3585850 3658900 3712072 3751965 3785908 3820255 3859160 3904012
50055C904012M8899M7432L7612J8524q912m2778q0344j17853j51255j77637j95596
$$ 3904012 3952911 4000343 4037955 4056479 4047567 4004789 3924445 3806592 3655337 3477700 3282104
50044C282104k04472k04209j96294j83815j69555j54492j38680j22969j08786
$$ 3282104 3077632 2873423 2677129 2493314 2323759 2169267 2030587 1907618 1798832
50035A798832r6547q5445p5031o5926n8678n2743m7322m2489l8737l5771l2559
$$ 1798832 1702285 1616840 1541809 1475883 1417205 1364462 1317140 1274651 1235914 1200143 1167584
50024A167584k8520k4096k0048j6708j4081j2193j1051j0429r955r399q695p742
$$ 1167584 1139064 1114968 1094920 1078212 1064131 1051938 1040887 1030458 1020503 1011104 1002409 994667
50012I94667o311m274j874L36J856K564K665K505K411K566K848K978K904K846
$$ 994667 988356 984082 982208 982544 984400 986964 989629 992134 994545 997111 999959 1002937 1005841 1008687
49998A008687K760K142P81n43p64J67J304K035K655L521M437N248O332P917R537
$$ 1008687 1011447 1013589 1014370 1013827 1013063 1013230 1014534 1016569 1019224 1022745 1027182 1032430 1038762 1046679 1056216
49983A056216J0713J1740J3077J4510J5603J6632J8283K0609K3124K5765K8951
$$ 1056216 1066929 1078669 1091746 1106256 1121859 1138491 1156774 1177383 1200507 1226272 1255223
49972A255223L2743L6722M0744M5063M9679N4404N9692O6577P5480Q5858R7388
$$ 1255223 1287966 1324688 1365432 1410495 1460174 1514578 1574270 1640847 1716327 1802185 1899573
49961A899573J10798J27024J46075J67242J89937K13616K37132K58578K75650
$$ 1899573 2010371 2137395 2283470 2450712 2640649 2854265 3091397 3349975 3625625
49952C625625K85885K87007K77810K59001K33213K04332J76604J53620J37359
$$ 3625625 3911510 4198517 4476327 4735328 4968541 5172873 5349477 5503097 5640456
49943E640456J28005J24553J25185J26920J25668J17392R9368P0416L0670j8136
$$ 5640456 5768461 5893014 6018199 6145119 6270787 6388179 6487547 6557963 6588633 6570497
49933F570497p2306j26791j76581k17809k48491k68946k81286k87733k89211k85821
$$ 6570497 6498191 6371400 6194819 5977010 5728519 5459573 5178287 4890554 4601343 4315522
49923D315522k78320k68326k57024k44412k30065k14182j97531j80711j63908
$$ 4315522 4037202 3768876 3511852 3267440 3037375 2823193 2625662 2444951 2281043
49914B281043j47290j31437j17253j05402r5606q6681p7541o8292o0057n3678
$$ 2281043 2133753 2002316 1885063 1779661 1684055 1597374 1519833 1451541 1391484 1337806
49904A337806m8826m4499m0126l6015l2893l1163l0628l0705l0837l0675k9973
$$ 1337806 1288980 1244481 1204355 1168340 1135447 1104284 1073656 1042951 1012114 981439 951466
49893I51466k8642k7038k5850k5335k4831k3446k1226j9127j7735j6499j4526
$$ 951466 922824 895786 869936 844601 819770 796324 775098 755971 738236 721737 707211
49882G07211j1853r428p972p245o547n658n023n052n422n325m349k945j831j133
$$ 707211 695358 685930 677958 670713 664166 658508 653485 648433 643011 637686 633337 630392 628561 627428
49868F27428l67P80K032L005L786M810O146P217P321O523N819O267P856R548J0572
$$ 627428 627061 627841 629873 632878 636664 641474 647620 654837 662158 668681 674500 680767 688623 698171 708743
49853G08743J1355J2857J5200J7610J9693K2107K5607K9981L4458L8884M3928
$$ 708743 720098 732955 748155 765765 785458 807565 833172 863153 897611 936495 980423
49842I80423N0164N7614O6235P6400Q8449J02121J16852J32536J49470J67279
$$ 980423 1030587 1088201 1154436 1230836 1319285 1421406 1538258 1670794 1820264 1987543
49832A987543J84080J97095K04081K03987J96302J80489J56789J27547R7166P0258
$$ 1987543 2171623 2368718 2572799 2776786 2973088 3153577 3310366 3437913 3535079 3605337
49822C605337M9783L6799L1259L2362L8130M5178M9346M6622L3913R740k5231
$$ 3605337 3655120 3691919 3723178 3755540 3793670 3838848 3888194 3934816 3968729 3978469 3953238
49811C953238o8084j14288j58675j96398k23837k39379k43553k38293k25879k08414
$$ 3953238 3885154 3770866 3612191 3415793 3191956 2952577 2709024 2470731 2244852 2036438
49801B036438j87957j66644j46350j28087j11869r7213q3872p2075o2158n4071
$$ 2036438 1848481 1681837 1535487 1407400 1295531 1198318 1114446 1042371 980213 926142
49791I26142m7380m1706l6990l3290l0385k7738k4878k1801j8995j6988j5771
$$ 926142 878762 837056 800066 766776 736391 708653 683775 661974 642979 625991 610220
49780F10220j4759j3439j2006j1072j0670j0047q703p264o760p190p431o691n443
$$ 610220 595461 582022 570016 558944 548274 538227 529524 522260 515500 508310 500879 494188 488745
49767D88745m586m279m097l955m088m256l699k173n12K19j67j013j732k202k406
$$ 488745 484159 479880 475783 471828 467740 463484 459785 457612 457100 457319 457152 456139 454407 452205 449799
49752D49799k125j271k54K77R2l84n76l15J72O91J193J487J204L06n95p91k94
$$ 449799 447674 446403 446149 446426 446518 446134 445558 445243 445415 446106 447299 448786 449990 450296 449701 448910 448616
49735D48616K62M87O58J156J823K176K044J638J178O74Q5n78j213j610j460p31
$$ 448616 448878 449365 450023 451179 453002 455178 457222 458860 460038 460712 460797 460219 459006 457396 455936 455205
49719D55205L8J15o22j457j601r91k27J82K33K18L24N16O89Q16R65J205J470J594
$$ 455205 455243 455358 454736 453279 451678 450687 450460 450642 450875 451093 451417 451933 452622 453438 454403 455608 457078 458672
49701D58672J563J664K135K710K817K328J839J930K399K594K373K267K616L001
$$ 458672 460235 461899 464034 466744 469561 471889 473728 475658 478057 480651 483024 485291 487907 490908
49687D90908K794J955R84L45J59L21N65M94q4q78j389j449j257r58n43j66j16
$$ 490908 493702 495657 496641 496986 497145 497466 498031 498525 498441 497563 496174 494725 493468 492510 491967 491801 491685
$$ [...]
##END NTUPLES=NMR SPECTRUM
##END=
