
##TITLE=AC1199_HACAH12052_5973650_oDCHfXS053
##JCAMPDX= 6.0         $$ Bruker NMR JCAMP-DX V2.0
##DATA TYPE= NMR SPECTRUM
##DATA CLASS= NTUPLES
##ORIGIN= BRUKER
##OWNER= Administrator
$$ 1.72 TOPSPIN		Version 2.1
$$ 2012-04-16 19:10:55.156 -0500  Administrator@TOPSPIN
$$ Compression mode = diff/dup
##.OBSERVE FREQUENCY= 400.13188235
##.OBSERVE NUCLEUS= ^1H
##.ACQUISITION MODE= SIMULTANEOUS (DQD)
##.ACQUISITION SCHEME= undefined
##.AVERAGES= 64
##.DIGITISER RES= 22
##SPECTROMETER/DATA SYSTEM= spect
##.PULSE SEQUENCE= noesygpps1d.comp
##.SOLVENT NAME= COFFEE_meoh
##.SHIFT REFERENCE= INTERNAL, COFFEE_meoh, 1, 14.96867
##AUDIT TRAIL= $$ (NUMBER, WHEN, WHO, WHERE, PROCESS, VERSION, WHAT)
$$ ##TITLE= Audit trail, TOPSPIN		Version 2.1
$$ ##JCAMPDX= 5.01
$$ ##ORIGIN= Bruker BioSpin GmbH
$$ ##OWNER= Administrator
$$ $$ C:\Bruker\TOPSPIN/data/COFFEE/nmr/AC1199_HACAH12052_5973650_oDCHfXS053/12/pdata/1/auditp.txt
$$ ##AUDIT TRAIL=  $$ (NUMBER, WHEN, WHO, WHERE, PROCESS, VERSION, WHAT)
(   1,<2012-04-15 21:28:37.593 -0500>,<Administrator>,<TOPSPIN>,<go>,<TOPSPIN 2.1>,
      <created by zg
	started at 2012-04-15 21:17:05.875 -0500,
	POWCHK enabled, PULCHK disabled,
       configuration hash MD5:
       1A 1E CE 29 27 FD 77 03 67 4E F0 E3 C4 B2 CB 90
       data hash MD5: 64K
       E4 BA 2F CA 04 C2 D0 90 4A 41 C3 DD E5 A3 23 EF>)
(   2,<2012-04-15 21:28:40.421 -0500>,<Administrator>,<TOPSPIN>,<proc1d>,<TOPSPIN 2.1>,
      <Start of raw data processing
       efp LB = 0.3 FT_mod = 6 PKNL = 1 PHC0 = 0 PHC1 = 0 SI = 128K 
       data hash MD5: 128K
       79 A4 B8 6B 22 F8 15 35 75 FD 25 F8 6A EA AB B8>)
(   3,<2012-04-15 21:28:41.578 -0500>,<Administrator>,<TOPSPIN>,<proc1d>,<TOPSPIN 2.1>,
      <pk PHC0 = 32.15149 PHC1 = 0 
       data hash MD5: 128K
       BE A3 01 FA B7 EE C0 79 A3 C7 0B 39 AA C1 E4 2F>)
(   4,<2012-04-15 21:28:42.203 -0500>,<Administrator>,<TOPSPIN>,<proc1d>,<TOPSPIN 2.1>,
      <abs ABSG = 1 
       data hash MD5: 128K
       70 7D AC BA A8 AE 9F 0E 5D 91 BD F6 60 2E DF 6B>)
(   5,<2012-04-15 21:28:42.296 -0500>,<Administrator>,<TOPSPIN>,<proc1d>,<TOPSPIN 2.1>,
      <abs ABSG = 2 
       data hash MD5: 128K
       98 04 47 5B E4 78 D3 FE 91 62 56 31 C6 B8 C5 AC>)
(   6,<2012-04-15 21:28:42.359 -0500>,<Administrator>,<TOPSPIN>,<proc1d>,<TOPSPIN 2.1>,
      <abs ABSG = 3 
       data hash MD5: 128K
       E8 A2 86 00 94 31 C1 15 65 89 58 77 48 03 3C 14>)
(   7,<2012-04-15 21:28:42.421 -0500>,<Administrator>,<TOPSPIN>,<proc1d>,<TOPSPIN 2.1>,
      <abs ABSG = 4 
       data hash MD5: 128K
       A8 CC F8 9F F2 16 F0 5B 8F 58 56 7B D3 C6 15 49>)
(   8,<2012-04-15 21:28:42.468 -0500>,<Administrator>,<TOPSPIN>,<proc1d>,<TOPSPIN 2.1>,
      <abs ABSG = 5 
       data hash MD5: 128K
       1F 82 3F 91 CD FA 9E E4 56 8C 66 23 C0 C7 AB BE>)
(   9,<2012-04-15 21:28:42.703 -0500>,<Administrator>,<TOPSPIN>,<audit>,<TOPSPIN 2.1>,
      <user comment:
       ICON-NMR User ID: COFFEE
       data hash MD5: 128K
$$ [...]
##$TP07= 0
##$TPNAME0= <>
##$TPNAME1= <>
##$TPNAME2= <>
##$TPNAME3= <>
##$TPNAME4= <>
##$TPNAME5= <>
##$TPNAME6= <>
##$TPNAME7= <>
##$TPOAL= (0..7)
0.5 0.5 0.5 0.5 0.5 0.5 0.5 0.5
##$TPOFFS= (0..7)
0 0 0 0 0 0 0 0
##$TUNHIN= 0
##$TUNHOUT= 0
##$TUNXOUT= 0
##$USERA1= <user>
##$USERA2= <user>
##$USERA3= <user>
##$USERA4= <user>
##$USERA5= <user>
##$V9= 5
##$VALIST= <valist>
##$VCLIST= <CCCCCCCCCCCCCCC>
##$VD= 0
##$VDLIST= <DDDDDDDDDDDDDDD>
##$VPLIST= <PPPPPPPPPPPPPPP>
##$VTLIST= <TTTTTTTTTTTTTTT>
##$WBST= 2048
##$WBSW= 25
##$XGAIN= (0..3)
0 0 0 0
##$XL= 0
##$YL= 0
##$YMAX_a= 11602125
##$YMIN_a= -6278261
##$ZGOPTNS= <>
##$ZL1= 120
##$ZL2= 120
##$ZL3= 120
##$ZL4= 120
##$ABSF1= 14.96867
##$ABSF2= -5.58386
##$ABSG= 5
##$ABSL= 3
##$ALPHA= 0
##$AQORDER= 0
##$ASSFAC= 0
##$ASSFACI= 0
##$ASSFACX= 0
##$ASSWID= 0
##$AUNMP= <proc_prof1d_extract.lims>
##$AXLEFT= 0
##$AXNAME= <>
##$AXNUC= <1H>
##$AXRIGHT= 0
##$AXTYPE= 0
##$AXUNIT= <>
##$AZFE= 0.1
##$AZFW= 0.1
##$BCFW= 0
##$BC_mod= 0
##$BYTORDP= 0
##$COROFFS= 0
##$CY= 15
##$DATMOD= 1
##$DC= 0
##$DFILT= <>
##$DTYPP= 0
##$F1P= 0
##$F2P= 0
##$FCOR= 0.5
##$FTSIZE= 131072
##$FT_mod= 6
##$GAMMA= 0
##$GB= 0
##$INTBC= 1
##$INTSCL= 1
##$ISEN= 128
##$LB= 0.3
##$LEV0= 0
##$LPBIN= 0
##$MAXI= 10000
##$MC2= 0
##$MEAN= 0
##$ME_mod= 0
##$MI= 0
##$NCOEF= 0
##$NC_proc= -3
##$NLEV= 6
##$NOISF1= 0
##$NOISF2= 0
##$NSP= 0
##$NTH_PI= 0
##$NZP= 0
##$OFFSET= 14.96867
##$PC= 1
##$PHC0= 32.15149
##$PHC1= 0
##$PH_mod= 1
##$PKNL= yes
##$PPARMOD= 0
##$PPDIAG= 0
##$PPIPTYP= 0
##$PPMPNUM= 2147483647
##$PPRESOL= 1
##$PSCAL= 4
##$PSIGN= 0
##$PYNMP= <proc.py>
##$REVERSE= no
##$SF= 400.130004779276
##$SI= 131072
##$SIGF1= 0
##$SIGF2= 0
##$SINO= 400
##$SIOLD= 131072
##$SPECTYP= <>
##$SREGLST= <1H.CDCl3>
##$SSB= 0
##$STSI= 131072
##$STSR= 0
##$SW_p= 8223.68421052632
##$SYMM= 0
##$S_DEV= 0
##$TDeff= 65536
##$TDoff= 0
##$TI= <>
##$TILT= no
##$TM1= 0
##$TM2= 0
##$TOPLEV= 0
##$USERP1= <user>
##$USERP2= <user>
##$USERP3= <user>
##$USERP4= <user>
##$USERP5= <user>
##$WDW= 1
##$XDIM= 131072
##$YMAX_p= 466765384
##$YMIN_p= -579977494
##$CURPLOT= <Network HP LaserJet P1505>
##$CURPRIN= <$Network HP LaserJet P1505>
##$DFORMAT= <normdp>
##$LAYOUT= <+/1D_H.xwp>
##$LFORMAT= <normlp>
##$PFORMAT= <normpl>
##$SURQMSG= 1
$$ End of Bruker specific parameters
$$ ---------------------------------
##NTUPLES= NMR SPECTRUM
##VAR_NAME=  FREQUENCY,     SPECTRUM/REAL,   SPECTRUM/IMAG
##SYMBOL=    X,             R,               I
##VAR_TYPE=  INDEPENDENT,   DEPENDENT,       DEPENDENT
##VAR_FORM=  AFFN,          ASDF,            ASDF
##VAR_DIM=   131072,        131072,          131072
##UNITS=     HZ,            ARBITRARY UNITS, ARBITRARY UNITS
##FACTOR=    0.0627417313425165, 1,          1
##FIRST=     8223.62146879498, 3905,         -75255
##LAST=      0,             4975,            -74920
##MIN=       0,             -579977494,      0
##MAX=       8223.62146879498, 466765384,    0
$$ Real data points
##PAGE= N=1
##DATA TABLE= (X++(R..R)), XYDATA
$$ [...]
$$ plain form
61760 2733052 2753814 2777980 2807525 2842222 2880135 2920542 2965051 3015521 3071939 3132961 3197889
61749 3197889 3267377 3342542 3424155 3512903 3609915 3716498 3833183 3959257 4093563 4235848
61739 4235848 4387118 4548683 4721383 4906166 5104848 5319484 5551113 5799945 6066971
61730 6066971 6354630 6665775 7002816 7368228 7765037 8196284 8664956 9175342 9733683
61721 9733683 10346152 11016402 11746134 12538029 13397076 14329011 15338426 16428337 17600242
61712 17600242 18853805 20186626 21593590 23064328 24579643 26109872 27615429 29046659
61704 29046659 30343005 31436030 32258559 32755422 32890719 32651992 32053329 31134610 29953485
61695 29953485 28573741 27057579 25463220 23842738 22238095 20679460 19187983 17779089
$$ packed form
61760B733052K0762K4166K9545L4697L7913M0407M4509N0470N6418O1022O4928
61749C197889O9488P5165Q1613Q8748R7012J06583J16685J26074J34306J42285
61739D235848J51270J61565J72700J84783J98682K14636K31629K48832K67026
61730F066971K87659L11145L37041L65412L96809M31247M68672N10386N58341
61721I733683O12469O70250P29732P91895Q59047R31935J009415J089911J171905
61712A7600242J253563J332821J406964J470738J515315J530229J505557J431230
61704B9046659J296346J093025Q22529M96863J35297k38727n98663r18719j181125
61695B9953485j379744j516162j594359j620482j604643j558635j491477j408894
$$ plain form
61687 17779089 16462684 15242580 14118383 13088149 12148505 11293332 10514570 9805059 9159873
61678 9159873 8574775 8044246 7561592 7120712 6717478 6349465 6014447 5709332 5430698
61669 5430698 5176051 4943897 4732512 4539321 4361798 4198407 4048268 3910384 3783474
61660 3783474 3666042 3556331 3452923 3355747 3265743 3182996 3105963 3033158 2964699 2901210 2842026
61649 2842026 2785757 2732194 2682263 2636203 2592979 2551455 2510992 2470862 2430426 2390223 2351715
61638 2351715 2315371 2279920 2243987 2207501 2170924 2134104 2096952 2060596 2026700 1995757 1966897
61627 1966897 1939303 1912991 1888152 1864549 1841961 1820718 1801375 1784058 1768484 1754402 1741597
61616 1741597 1729478 1717134 1704120 1691063 1679156 1669048 1660444 1652714 1645564 1638999 1633043 1627718
$$ packed form
61687A7779089j316405j220104j124197j030234r39644q55173p78762p09511o45186
61678I159873n85098n30529m82654m40880m03234l68013l35018l05115k78634
61669E430698k54647k32154k11385j93191j77523j63391j50139j37884j26910
61660C783474j17432j09711j03408r7176r0004q2747p7033p2805o8459o3489n9184
61649B842026n6269n3563m9931m6060m3224m1524m0463m0130m0436m0203l8508
61638B351715l6344l5451l5933l6486l6577l6820l7152l6356l3896l0943k8860
61627A966897k7594k6312k4839k3603k2588k1243j9343j7317j5574j4082j2805
61616A741597j2119j2344j3014j3057j1907j0108q604p730p150o565n956n325
$$ plain form
61604 1627718 1623056 1618823 1614378 1609085 1602771 1595714 1588436 1581631 1575942 1571409 1567343 1562918 1557674 1551380
61590 1551380 1543966 1535975 1528522 1522223 1516555 1510837 1505402 1501093 1497941 1495212 1492608 1490645 1489873 1490400
61576 1490400 1492029 1494210 1496079 1497404 1499250 1502744 1507367 1511646 1515465 1520258 1526622 1533220 1538699 1543334
61562 1543334 1547827 1551738 1554344 1556259 1558797 1562143 1565327 1567660 1568976 1568643 1565665 1560125 1553577 1547516
61548 1547516 1541933 1535665 1527770 1518313 1508066 1497687 1487203 1476431 1465869 1456729 1449716 1444168 1438854
61535 1438854 1433285 1427717 1422262 1416900 1412289 1409757 1410226 1413615 1419298 1426545 1434483 1442398 1450571 1460492
61521 1460492 1473838 1491318 1512437 1536031 1560939 1586588 1613257 1641669 1672262 1704978 1739643
61510 1739643 1776216 1814723 1855335 1898493 1944500 1992884 2042533 2092576 2142758 2192800 2241828
$$ packed form
61604A627718m662m233m445n293o314p057p278o805n689m533m066m425n244o294
61590A551380p414p991p453o299n668n718n435m309l152k729k604j963p72N27
61576A490400J629K181J869J325J846L494M623M279L819M793O364O598N479M635
61562A543334M493L911K606J915K538L346L184K333J316l33k978n540o548o061
61548A547516n583o268p895r457j0247j0379j0484j0772j0562r140p013n548n314
61535A438854n569n568n455n362m611k532M69L389N683P247P938P915Q173R921
61521A460492J3346J7480K1119K3594K4908K5649K6669K8412L0593L2716L4665
61510A739643L6573L8507M0612M3158M6007M8384M9649N0043N0182N0042M9028
$$ plain form
61499 2241828 2288697 2332622 2373422 2411500 2447686 2482726 2516614 2548668 2578291 2605243 2629055
61488 2629055 2648866 2664323 2676238 2685721 2692889 2696891 2696996 2693116 2685443 2674337 2660743 2646215 2632058
61475 2632058 2618499 2604851 2590590 2576510 2564877 2558131 2557016 2560181 2565957 2574291 2586520 2603631
61463 2603631 2625589 2652254 2684028 2721403 2764880 2815803 2876391 2948151 3030813 3123598 3227053
61452 3227053 3342810 3471843 3613961 3768909 3937163 4119622 4317295 4531417 4763046
61443 4763046 5012295 5278402 5560491 5857523 6167399 6486727 6811271 7135414 7450836
61434 7450836 7746836 8012700 8239182 8417853 8541035 8604219 8608036 8556683 8455092 8309035
61424 8309035 8127260 7920968 7699962 7470038 7234709 6998616 6768552 6551444 6351745
$$ packed form
61499B241828M6869M3925M0800L8078L6186L5040L3888L2054K9623K6952K3812
61488B629055J9811J5457J1915R483P168M002J05l880p673j1106j3594j4528j4157
61475B632058j3559j3648j4261j4080j1633o746j115L165N776Q334J2229J7111
61463B603631K1958K6665L1774L7375M3477N0923O0588P1760Q2662R2785J03455
61452C227053J15757J29033J42118J54948J68254J82459J97673K14122K31629
61443D763046K49249K66107K82089K97032L09876L19328L24544L24143L15422
61434G450836K96000K65864K26482J78671J23182O3184L817n1353j01591j46057
61424H309035j81775k06292k21006k29924k35329k36093k30064k17108j99699
$$ plain form
61415 6351745 6170420 6006121 5857594 5725170 5610156 5513375 5434952 5374980 5333237 5308155
61405 5308155 5297198 5298656 5312347 5338297 5375742 5423861 5482370 5550300 5624786 5702232 5780682
61394 5780682 5860276 5941431 6023261 6103981 6182348 6258377 6332906 6406678 6479761 6551615 6621584
61383 6621584 6689378 6755330 6820287 6884933 6948882 7010687 7068976 7123283 7173382 7218405 7257512
61372 7257512 7290984 7319295 7341014 7353017 7353546 7344140 7327756 7305719 7277353 7242025 7200576 7154938
61360 7154938 7107229 7059315 7012566 6967758 6925284 6885575 6849396 6817856 6791982 6771938 6756868
61349 6756868 6745934 6739075 6735884 6734122 6730861 6725229 6718582 6711597 6702882 6691486 6679107 6668328 6659850
61336 6659850 6653191 6649303 6650703 6659537 6677371 6706737 6751045 6812743 6892953 6993117 7115543 7261940
$$ packed form
61415F351745j81325j64299j48527j32424j15014r6781p8423n9972m1743k5082
61405E308155j0957J458J3691K5950L7445M8119N8509O7930P4486P7446P8450
61394E780682P9594Q1155Q1830Q0720P8367P6029P4529P3772P3083P1854O9969
61383F621584O7794O5952O4957O4646O3949O1805N8289N4307N0099M5023L9107
61372G257512L3472K8311K1719J2003N29r406j6384k2037k8366l5328m1449m5638
61360G154938m7709m7914m6749m4808m2474l9709l6179l1540k5874k0044j5070
61349F756868j0934o859l191j762l261n632o647o985q715j1396j2379j0779q478
61336F659850o659l888J400Q834J7834K9366M4308O1698Q0210J00164J22426J46397
$$ plain form
61324 7261940 7432536 7626896 7844423 8083931 8344163 8625171 8927735 9250436 9588160
61315 9588160 9934027 10281641 10624430 10953583 11257867 11525480 11745887 11910856 12015194
61306 12015194 12057078 12037732 11960774 11831392 11654997 11436038 11178562 10888010 10571673 10236967
61296 10236967 9889915 9535548 9178746 8823893 8474434 8133565 7804780 7490937 7193319
61287 7193319 6912532 6649973 6407575 6186443 5986602 5807839 5649839 5511573 5391594
61278 5391594 5289150 5204363 5137161 5086720 5052087 5032613 5027391 5034823 5053253 5081693 5119513
61267 5119513 5165622 5218332 5275977 5337362 5401617 5467849 5535046 5602232 5668577 5733345 5795788
61256 5795788 5855117 5910469 5960799 6005006 6042436 6073265 6098098 6117155 6130069 6136492 6136573 6130733
$$ packed form
61324G261940J70596J94360K17527K39508K60232K81008L02564L22701L37724
61315I588160L45867L47614L42789L29153L04284K67613K20407J64969J04338
61306A2015194M1884j9346p6958j29382j76395k18959k57476k90552l16337l34706
61296A0236967l47052l54367l56802l54853l49459l40869l28785l13843k97618
61287G193319k80787k62559k42398k21132j99841j78763j58000j38266j19979
61278E391594j02444q4787o7202n0441l4633j9474n222P432J8430K8440L7820
61267E119513M6109N2710N7645O1385O4255O6232O7197O7186O6345O4768O2443
61256E795788N9329N5352N0330M4207L7430L0829K4833J9057J2914O423Q1n840
$$ plain form
61244 6130733 6119233 6101993 6078398 6047196 6007296 5959131 5904809 5846363 5784144 5717562 5647045
61233 5647045 5574287 5500491 5425330 5348239 5270176 5193418 5119870 5050267 4984925 4924507 4869674
61222 4869674 4820499 4776690 4738174 4704911 4676276 4651167 4628818 4608890 4590541 4572015 4551824
61211 4551824 4530081 4508096 4486783 4466025 4445487 4425401 4406447 4389481 4375653 4366291 4362308 4364006
61199 4364006 4371639 4385881 4407642 4437856 4477680 4528447 4591070 4665807 4752791 4852290 4964008
61188 4964008 5086586 5218314 5357910 5503827 5652875 5800087 5939767 6065880 6171558
61179 6171558 6249436 6293366 6299648 6266589 6193786 6082847 5938502 5767926 5578379 5375726
61169 5375726 5165096 4952094 4742511 4540856 4349444 4168858 3999053 3840229 3693140
$$ packed form
61244F130733j1500j7240k3595l1202l9900m8165n4322n8446o2219o6582p0517
61233E647045p2758p3796p5161p7091p8063p6758p3548o9603o5342o0418n4833
61222D869674m9175m3809l8516l3263k8635k5109k2349j9928j8349j8526k0191
61211D551824k1743k1985k1313k0758k0538k0086j8954j6966j3828r362l983J698
61199D364006P633J4242K1761L0214L9824N0767O2623P4737Q6984R9499J11718
61188D964008J22578J31728J39596J45917J49048J47212J39680J26113J05678
61179F171558P7878M3930O282l3059p2803j10939j44345j70576j89547k02653
61169E375726k10630k13002k09583k01655j91412j80586j69805j58824j47089
$$ plain form
61160 3693140 3558634 3436700 3326110 3225424 3134206 3052730 2980541 2916197 2858767 2808759
61150 2808759 2766799 2731949 2702236 2676730 2656291 2642331 2635548 2635843 2642576 2654509 2670000 2687674
61138 2687674 2706603 2725741 2743689 2759341 2772364 2782759 2790236 2794334 2794824 2791691 2784937 2774773
61126 2774773 2761881 2747169 2731056 2712955 2691446 2665296 2634718 2601616 2568106 2534766 2500747
61115 2500747 2465595 2430263 2395941 2362408 2328167 2292023 2254061 2215134 2175826 2136093 2095766
61104 2095766 2055224 2015458 1977282 1940520 1904093 1866989 1829168 1791681 1756101 1723563 1694017
61093 1694017 1666382 1639516 1612694 1584955 1554706 1520996 1484948 1448986 1414597 1381742 1350477
61082 1350477 1321823 1296527 1274061 1253686 1235674 1220554 1207807 1196402 1186295 1178387 1173053 1169693
$$ packed form
61160C693140j34506j21934j10590j00686r1218q1476p2189o4344n7430n0008
61150B808759m1960l4850k9713k5506k0439j3960o783K95O733J1933J5491J7674
61138B687674J8929J9138J7948J5652J3023J0395P477M098M90l133o754j0164
61126B774773j2892j4712j6113j8101k1509k6150l0578l3102l3510l3340l4019
61115B500747l5152l5332l4322l3533l4241l6144l7962l8927l9308l9733m0327
61104B095766m0542l9766l8176l6762l6427l7104l7821l7487l5580l2538k9546
61093A694017k7635k6866k6822k7739l0249l3710l6048l5962l4389l2855l1265
61082A350477k8654k5296k2466k0375j8012j5120j2747j1405j0107p908n334l360
$$ plain form
61070 1169693 1167815 1167847 1170574 1176193 1184075 1193180 1202703 1212594 1223439 1235631 1248854 1262548 1276513
61057 1276513 1290650 1304530 1317984 1331926 1347746 1365641 1384161 1401623 1417436 1431780 1444585
61046 1444585 1455450 1464292 1471314 1476234 1478087 1476228 1471298 1464771 1457629 1449944 1441714 1433473 1425673 1418015
61032 1418015 1409973 1401681 1393680 1386041 1378316 1370152 1361305 1351348 1340305 1329330 1319615 1310591 1300488
61019 1300488 1288886 1277327 1266865 1256632 1245858 1235929 1228693 1223535 1217919 1210685 1203208 1197147 1192519
61006 1192519 1188569 1185412 1183943 1184587 1186752 1189344 1191459 1192798 1193795 1195431 1198796 1204493 1212096 1220296
60992 1220296 1228153 1236275 1246143 1258085 1270739 1282904 1295012 1308035 1321825 1335569 1349274 1363545
60980 1363545 1378256 1392745 1407301 1423374 1442177 1463992 1488814 1516576 1546529 1577499 1609307
$$ packed form
61070A169693j878L2K727N619P882R105R523R891J0845J2192J3223J3694J3965
61057A276513J4137J3880J3454J3942J5820J7895J8520J7462J5813J4344J2805
61046A444585J0865Q842P022M920J853j859m930o527p142p685q230q241p800p658
61032A418015q042q292q001p639p725q164q847r957j1043j0975r715r024j0103
61019A300488j1602j1559j0462j0233j0774r929p236n158n616p234p477o061m628
61006A192519l950l157j469O44K165K592K115J339R97J636L365N697P603Q200
60992A220296P857Q122R868J1942J2654J2165J2108J3023J3790J3744J3705J4271
60980A363545J4711J4489J4556J6073J8803K1815K4822K7762K9953L0970L1808
$$ plain form
60969 1609307 1643178 1680288 1720443 1762491 1805450 1848886 1892862 1938207 1986659 2040212 2100002
60958 2100002 2165609 2235346 2307470 2381583 2458941 2541400 2630406 2726975 2831827 2944904 3065419
60947 3065419 3193292 3330151 3478048 3637463 3807425 3987254 4177334 4378700 4593240
60938 4593240 4824282 5075877 5351493 5654451 5989500 6362713 6779724 7245121 7763468
60929 7763468 8339554 8977770 9683077 10463441 11330508 12298172 13382317 14602319 15980702
60920 15980702 17540366 19303900 21296817 23549850 26095149 28954008 32110906 35470507
60912 35470507 38818103 41831671 44177884 45655340 46290247 46314837 46050986 45785711 45699016
60903 45699016 45834453 46080745 46176527 45782449 44621299 42608799 39883447 36721000 33407463
$$ packed form
60969A609307L3871L7110M0155M2048M2959M3436M3976M5345M8452N3553N9790
60958B100002O5607O9737P2124P4113P7358Q2459Q9006R6569J04852J13077J20515
60947C065419J27873J36859J47897J59415J69962J79829J90080K01366K14540
60938D593240K31042K51595K75616L02958L35049L73213M17011M65397N18347
60929G763468N76086O38216P05307P80364Q67067R67664J084145J220002J378383
60920A5980702J559664J763534J992917K253033K545299K858859L156898L359601
60912C5470507L347596L013568K346213J477456O34907K4590k63851k65275q6695
60903D5699016J35437K46292R5782l94078j161150k012500k725352l162447l313537
$$ plain form
60894 33407463 30155692 27090670 24272915 21724542 19446247 17427582 15652332 14100184
60886 14100184 12748174 11573585 10555819 9675395 8912309 8246617 7660580 7139973 6673787
60877 6673787 6253315 5871545 5522973 5203414 4909435 4637774 4385681 4152007 3937169
60868 3937169 3741144 3561548 3394204 3235484 3083641 2938142 2798560 2664498 2536320
60859 2536320 2415576 2304355 2203738 2112743 2029110 1951159 1878403 1810521 1746811 1687052 1631800
60848 1631800 1581043 1533415 1487648 1443995 1403262 1365221 1329247 1295883 1266336 1240599 1217312
60837 1217312 1195307 1174091 1153177 1132461 1113254 1097399 1085098 1074941 1066294 1060100 1056781 1054903
60825 1054903 1052955 1051352 1051532 1053840 1057333 1061191 1065341 1069970 1075166 1080836 1086509 1091454 1095345 1098432
$$ packed form
60894C3407463l251771l065022k817755k548373k278295k018665j775250j552148
60886A4100184j352010j174589j017766q80424p63086o65692n86037n20607m66186
60877F673787m20472l81770l48572l19559k93979k71661k52093k33674k14838
60868C937169j96025j79596j67344j58720j51843j45499j39582j34062j28178
60859B536320j20744j11221j00617r0995q3633p7951p2756o7882o3710n9759n5252
60848A631800n0757m7628m5767m3653m0733l8041l5974l3364k9547k5737k3287
60837A217312k2005k1216k0914k0716j9207j5855j2301j0157q647o194l319j878
60825A054903j948j603J80K308L493L858M150M629N196N670N673M945L891L087
$$ plain form
60811 1098432 1100763 1101877 1101678 1101010 1100696 1100567 1100061 1099247 1098444 1097241 1094837 1091237 1087210 1083059 1078261 1072589
60795 1072589 1066940 1062647 1060294 1059541 1059984 1061946 1066446 1074483 1086305 1101215 1117920 1135013 1151473
60782 1151473 1167172 1182811 1198873 1214581 1228425 1239888 1250073 1260423 1271405 1282774 1294325
60771 1294325 1305670 1315869 1324273 1331620 1339421 1348171 1356820 1364046 1369413 1373206 1375891 1378099 1380632
60758 1380632 1383962 1387901 1391976 1395876 1399341 1401916 1403208 1403266 1402439 1400866 1398293 1394288 1388554 1381056 1372023
60743 1372023 1361798 1350618 1338523 1325498 1311649 1297236 1282609 1268158 1254253 1241196 1229288
60732 1229288 1218930 1210494 1204066 1199369 1195966 1193439 1191409 1189706 1188768 1189674 1193373 1199770 1207719 1216037
60718 1216037 1224344 1232943 1242236 1252630 1264765 1279339 1296469 1315471 1335430 1355765 1376075 1395647
$$ packed form
60811A098432K331J114j99o68l14j29n06q14q03j203k404l600m027m151m798n672
60795A072589n649m293k353p53M43J962M500Q037J1822J4910J6705J7093J6460
60782A151473J5699J5639J6062J5708J3844J1463J0185J0350J0982J1369J1551
60771A294325J1345J0199Q404P347P801Q750Q649P226N367L793K685K208K533
60758A380632L330L939M075L900L465K575J292N8q27j573k573m005n734p498r033
60743A372023j0225j1180j2095j3025j3849j4413j4627j4451j3905j3057j1908
60732A229288j0358q436o428m697l403k527k030j703r38R06L699O397P949Q318
60718A216037Q307Q599R293J0394J2135J4574J7130J9002J9959K0335K0310J9572
$$ plain form
60706 1395647 1413457 1428699 1441288 1452000 1462155 1472776 1483654 1493481 1501334 1507853 1514390 1521077
60694 1521077 1526541 1529834 1532006 1535171 1540349 1546770 1553084 1558616 1563443 1567718 1571198 1573252 1573338 1571673
60680 1571673 1569340 1567381 1565775 1563586 1560054 1555134 1548997 1541629 1533268 1524799 1517158 1510394 1503623 1495905
60666 1495905 1487032 1477668 1468972 1461847 1456189 1450946 1445246 1439383 1434286 1430124 1426070 1421603 1417290 1413678
60652 1413678 1409783 1403591 1394240 1383221 1372998 1364664 1357167 1348702 1338536 1327481 1316830 1307136 1298116
60639 1298116 1289619 1282358 1277465 1275352 1275278 1276070 1277073 1278226 1279463 1280377 1280500 1279623 1277794 1275220 1272295
60624 1272295 1269362 1266138 1261567 1254658 1245463 1234839 1223258 1210337 1195739 1180009 1164155 1148855
60612 1148855 1134476 1121380 1109550 1098300 1087199 1077106 1069301 1063592 1058349 1052752 1048001 1045725
$$ packed form
60706A395647J7810J5242J2589J0712J0155J0621J0878R827P853O519O537O687
60694A521077N464L293K172L165N178O421O314N532M827M275L480K054Q6j665
60680A571673k333j959j606k189l532m920o137p368q361q469p641o764o771p718
60666A495905q873r364q696p125n658n243n700n863n097m162m054m467m313l612
60652A413678l895o192r351j1019j0223q334p497q465j0166j1055j0651r694r020
60639A298116q497p261m893k113p4P92J003J153J237R14J23q77j829k574k925
60624A272295k933l224m571o909r195j0624j1581j2921j4598j5730j5854j5300
60612A148855j4379j3096j1830j1250j1101j0093p805n709n243n597m751k276
$$ plain form
60600 1045725 1046053 1047901 1050364 1053028 1055629 1058405 1062293 1067676 1073237 1077105 1079008 1080340 1082277 1084849
60586 1084849 1087833 1091282 1094851 1097532 1098593 1098212 1097102 1096252 1097058 1100702 1106995 1114544 1122224 1129654 1136286
60571 1136286 1141450 1145907 1152064 1161730 1174479 1189026 1205198 1223543 1243855 1265331 1287756 1311348
60559 1311348 1335736 1360082 1384058 1407848 1431423 1454548 1477142 1498896 1518952 1536855 1553353
60548 1553353 1569229 1583702 1595071 1602629 1606807 1607648 1604448 1596921 1585513 1570561 1552313 1531884
60536 1531884 1510939 1490194 1469371 1448783 1429550 1411947 1395038 1378645 1364318 1353375 1345164
60525 1345164 1338312 1332677 1328860 1326594 1324936 1323552 1322555 1321379 1319004 1315199 1310603 1305710 1300742 1296371
60511 1296371 1293504 1292258 1292096 1293097 1296111 1301374 1307844 1314418 1321130 1328567 1336580 1344248 1351012 1357430
$$ packed form
60600A045725L28J848K463K664K601K776L888N383N561L868J903J332J937K572
60586A084849K984L449L569K681J061l81j110q50Q06L644O293P549P680P430O632
60571A136286N164M457O157R666J2749J4547J6172J8345K0312K1476K2425K3592
60559A311348K4388K4346K3976K3790K3575K3125K2594K1754K0056J7903J6498
60548A553353J5876J4473J1369P558M178Q41l200p527j1408j4952j8248k0429
60536A531884k0945k0745k0823k0588j9233j7603j6909j6393j4327j0943q211
60525A345164o852n635l817k266j658j384r97j176k375l805m596m893m968m371
60511A296371k867j246j62J001L014N263O470O574O712P437Q013P668O764O418
$$ plain form
60497 1357430 1364727 1373708 1383963 1394099 1402957 1410759 1418902 1428547 1439634 1451315 1463132 1475614
60485 1475614 1489984 1507478 1528738 1553548 1581176 1611244 1644348 1681651 1723621 1769127 1815814
60474 1815814 1861382 1904258 1942899 1974868 1997411 2009301 2011537 2005672 1991860 1969485 1939791 1906938
60462 1906938 1875823 1849299 1827972 1811981 1801816 1797471 1798162 1803596 1814674 1831941 1853801 1877531
60450 1877531 1902192 1929491 1961367 1997726 2037362 2080382 2128553 2183521 2245931 2316613 2397545
60439 2397545 2490884 2597555 2717553 2851399 3000616 3166841 3351038 3553698 3775146 4015196
60429 4015196 4272813 4546795 4837026 5144988 5472985 5822617 6193049 6579067 6969452
60420 6969452 7346886 7689789 7974852 8179171 8282777 8272514 8145699 7910787 7584787 7190044
$$ packed form
60497A357430P297Q981J0255J0136Q858P802Q143R645J1087J1681J1817J2482
60485A475614J4370J7494K1260K4810K7628L0068L3104L7303M1970M5506M6687
60474A815814M5568M2876L8641L1969K2543J1890K236n865j3812k2375k9694l2853
60462A906938l1115k6524k1327j5991j0165m345O91N434J1078J7267K1860K3730
60450A877531K4661K7299L1876L6359L9636M3020M8171N4968O2410P0682Q0932
60439B397545R3339J06671J19998J33846J49217J66225J84197K02660K21448K40050
60429D015196K57617K73982K90231L07962L27997L49632L70432L86018L90385
60420F969452L77434L42903K85063K04319J03606j0263j26815k34912l26000l94743
$$ plain form
60410 7190044 6751678 6294315 5837846 5395154 4973962 4580090 4218019 3889143 3591559
60401 3591559 3322567 3080740 2865318 2674654 2506258 2357882 2227643 2113043 2010757
60392 2010757 1917928 1833460 1757555 1689897 1628768 1572388 1520711 1474922 1434923 1398250 1362220
60381 1362220 1326590 1293211 1263453 1236954 1212686 1190079 1168785 1148327 1128615 1110282 1093962
60370 1093962 1079395 1065600 1051883 1038654 1027275 1018860 1013033 1008242 1003609 999816 997563 995999 993954
60357 993954 992231 992940 996392 1000240 1002360 1003297 1005089 1008688 1013398 1017977 1021536 1024069 1026811 1031412 1037995
60342 1037995 1044754 1050171 1054865 1060461 1067490 1075416 1083973 1093187 1102481 1110959 1118407 1125073 1130805 1135531
60328 1135531 1140252 1146204 1152942 1158587 1162339 1165671 1170459 1176727 1182804 1186990 1188434 1186885 1182683 1177265
$$ packed form
60410G190044m38366m57363m56469m42692m21192l93872l62071l28876k97584
60401C591559k68992k41827k15422j90664j68396j48376j30239j14600j02286
60392B010757r2829q4468p5905o7658o1129n6380n1677m5789l9999l6673l6030
60381A362220l5630l3379k9758k6499k4268k2607k1294k0458j9712j8333j6320
60370A093962j4567j3795j3717j3229j1379q415n827m791m633l793k253j564k045
60357I93954j723P09L452L848K120R37J792L599M710M579L559K533K742M601O583
60342A037995O759N417M694N596P029P926Q557R214R294Q478P448O666N732M726
60328A135531M721N952O738N645L752L332M788O268O077M186J444j549m202n418
$$ plain form
60314 1177265 1173046 1171940 1173636 1175674 1175800 1174171 1172691 1172338 1172204 1171455 1171028 1172364 1175349 1178775 1182436
60299 1182436 1187454 1194527 1202970 1211691 1220247 1228739 1237414 1246583 1256381 1266498 1276592 1286860 1297586
60286 1297586 1308334 1318364 1327794 1337529 1347920 1358225 1367400 1374720 1379580 1381670 1381673 1381179 1381540 1383083
60272 1383083 1385425 1388069 1390910 1394817 1401440 1411527 1423602 1435327 1445911 1455911 1464793 1470563 1472327
60259 1472327 1471563 1469789 1466345 1459706 1449939 1438529 1426537 1414257 1402225 1391222 1381475 1372804 1365298
60246 1365298 1358942 1352973 1346756 1341062 1337329 1335671 1334644 1333048 1331033 1329456 1329102 1330590 1334019 1338458
60232 1338458 1342756 1347111 1352897 1360493 1368272 1374317 1378384 1381501 1384380 1387034 1389534 1392309 1395976 1401464
60218 1401464 1409915 1421574 1434878 1447487 1458343 1468231 1478418 1489527 1501764 1515302 1529962 1545253
$$ packed form
60314A177265m219j106J696K038J26j629j480l53j34p49m27J336K985L426L661
60299A182436N018P073Q443Q721Q556Q492Q675R169R798J0117J0094J0268J0726
60286A297586J0748J0030R430R735J0391J0305R175P320M860K090Lm94L61J543
60272A383083K342K644K841L907O623J0087J2075J1725J0584J0000Q882N770J764
60259A472327p64j774l444o639r767j1410j1992j2280j2032j1003r747q671p506
60246A365298o356n969o217n694l733j658j027j596k015j577l54J488L429M439
60232A338458M298M355N786P596P779O045M067L117K879K654K500K775L667N488
60218A401464Q451J1659J3304J2609J0856R888J0187J1109J2237J3538J4660J5291
$$ plain form
60206 1545253 1561299 1579250 1600169 1623984 1650259 1679579 1713098 1750671 1790469 1830952 1872657
60195 1872657 1917685 1967996 2024639 2087880 2157249 2231741 2310790 2395039 2485661 2583203 2687823
60184 2687823 2800375 2922155 3053365 3192851 3339862 3495092 3659209 3830874 4007053
60175 4007053 4184866 4362349 4537723 4708958 4874077 5031007 5176885 5308351 5423014
60166 5423014 5520177 5599770 5661214 5704012 5729073 5738654 5734975 5719411 5693064 5657592 5615432 5569735
60154 5569735 5524281 5482811 5448010 5421501 5405187 5402023 5414719 5444002 5489052 5549591 5626527
60143 5626527 5720229 5829174 5951089 6084808 6230165 6386285 6550694 6719917 6890143 7057262
60133 7057262 7216939 7364891 7496881 7608747 7697221 7760916 7799896 7814175 7803311 7767711
$$ packed form
60206A545253J6046J7951K0919K3815K6275K9320L3519L7573L9798M0483M1705
60195A872657M5028N0311N6643O3241O9369P4492P9049Q4249R0622R7542J04620
60184B687823J12552J21780J31210J39486J47011J55230J64117J71665J76179
60175D007053J77813J77483J75374J71235J65119J56930J45878J31466J14663
60166E423014R7163P9593O1444M2798K5061R581l679j5564k6347l5472m2160m5697
60154E569735m5454m1470l4801k6509j6314l164J2696K9283M5050O0539P6936
60143E626527R3702J08945J21915J33719J45357J56120J64409J69223J70226J67119
60133G057262J59677J47952J31990J11866Q8474O3695L8980J4279j0864l5600
$$ plain form
60123 7767711 7709593 7632184 7538531 7431706 7315691 7195224 7074750 6957951 6848299 6749498
60113 6749498 6665121 6597810 6548896 6518832 6508161 6518040 6549415 6601594 6671972 6757355 6855105
60102 6855105 6962814 7077426 7195231 7312267 7424140 7525959 7613465 7684429 7738619 7776790
60092 7776790 7800523 7812644 7816320 7813311 7804238 7791298 7779711 7775459 7782307 7802166 7837801 7893458
60080 7893458 7972552 8076190 8204804 8360191 8544906 8760306 9006507 9284098 9594577 9938621
60070 9938621 10314950 10721796 11158860 11626676 12123733 12644887 13182818 13730464 14281414
60061 14281414 14828402 15362574 15874737 16356756 16801111 17199691 17544158 17827686 18045488
60052 18045488 18193359 18266928 18263445 18183841 18031890 17811514 17526118 17180888 16784840 16350185
$$ packed form
60123G767711n8118p7409r3653j06825j16015j20467j20474j16799j09652r8801
60113F749498q4377o7311m8914l0064j0671R879L1375N2179P0378Q5383R7750
60102F855105J07709J14612J17805J17036J11873J01819Q7506P0964N4190L8171
60092G776790K3733J2121L676l009r073j2940j1587m252O848J9859L5635N5657
60080G893458P9094J03638J28614J55387J84715K15400K46201K77591L10479L44044
60070I938621L76329M06846M37064M67816M97057N21154N37931N47646N50950
60061A4281414N46988N34172N12163M82019M44355L98580L44467K83528K17802
60052A8045488J47871P3569l483p9604j51951k20376k85396l45230l96048m34655
$$ plain form
60042 16350185 15890218 15417807 14944593 14480551 14034380 13614496 13228821 12883037 12579733
60033 12579733 12320121 12105970 11938982 11818728 11742391 11706473 11707700 11742123 11804216 11887254
60023 11887254 11984192 12088279 12193456 12294096 12383843 12455187 12501577 12520157 12511256 12474943 12409434
60012 12409434 12313678 12190081 12043111 11875666 11688189 11481161 11257007 11019166 10770490
60003 10770490 10513604 10252546 9993203 9741774 9502846 9278891 9071360 8882081 8713718
59994 8713718 8569195 8450845 8359831 8296003 8258370 8246010 8258661 8296334 8358675 8444963 8554326
59983 8554326 8685029 8833381 8993976 9161216 9330130 9495748 9652538 9794928 9917842
59974 9917842 10016493 10086504 10124878 10130443 10103038 10043014 9952056 9833552 9691146 9527452 9345209
$$ packed form
60042A6350185m59967m72411m73214m64042m46171m19884l85675l45784l03304
60033A2579733k59612k14151j66988j20254p6337l5918J227L4423O2093Q3038
60023A1887254R6938J04087J05177J00640Q9747P1344M6390J8580q901l6313o5509
60012A2409434r5756j23597j46970j67445j87477k07028k24154k37841k48676
60003A0770490k56886k61058k59343k51429k38928k23955k07531j89279j68363
59994H713718j44523j18350r1014o3828l7633j2360J2651L7673O2341Q6288J09363
59983H554326J30703J48352J60595J67240J68914J65618J56790J42390J22914
59974I917842R8651P0011L8374N565k7405o0024r0958j18504j42406j63694j82243
$$ plain form
59963 9345209 9149243 8946147 8742242 8542807 8352903 8177298 8019067 7879319 7758790
59954 7758790 7659011 7581737 7528256 7499728 7497283 7521118 7570287 7644025 7742677 7866625 8015118
59943 8015118 8186952 8381552 8597865 8832241 9078523 9330392 9582614 9829772 10064938
59934 10064938 10280604 10470590 10630550 10757139 10847648 10900532 10915613 10893344 10834143 10738849
59924 10738849 10609914 10451961 10271155 10074112 9867508 9658322 9453653 9259701 9081081
59915 9081081 8921514 8784929 8675092 8593919 8540854 8514481 8514471 8541434 8595179 8673842 8774815
59904 8774815 8895938 9035493 9191199 9359283 9534410 9710890 9884603 10053895 10218057
59895 10218057 10374938 10520811 10652865 10771005 10876617 10970402 11052569 11124912 11191473 11256849
$$ packed form
59963I345209j95966k03096k03905j99435j89904j75605j58231j39748j20529
59954G758790r9779p7274n3481k8528k445K3835M9169P3738R8652J23948J48493
59943H015118J71834J94600K16313K34376K46282K51869K52222K47158K35166
59934A0064938K15666J89986J59960J26589R0509N2884J5081k2269n9201r5294
59924A0738849j28935j57953j80806j97043k06604k09186k04669j93952j78620
59915I081081j59567j36585j09837q1173n3065k6373j0K6963N3745P8663J00973
59904H774815J21123J39555J55706J68084J75127J76480J73713J69292J64162
59895A0218057J56881J45873J32054J18140J05612R3785Q2167P2343O6561O5376
$$ plain form
59885 11256849 11324631 11397851 11480314 11576993 11693521 11835626 12008586 12216554 12462331 12747884
59875 12747884 13074747 13443510 13853149 14301252 14784792 15300008 15841032 16398518 16959534
59866 16959534 17508633 18029058 18503452 18914332 19244829 19479886 19607617 19620728 19517865
59857 19517865 19304307 18991195 18593502 18128057 17612483 17064539 16501174 15937704 15387651
59848 15387651 14862521 14370995 13918597 13508979 13145634 12831765 12568773 12355951 12192081
59839 12192081 12076532 12008346 11985153 12003754 12061241 12154655 12279797 12431237 12603319 12790177
59829 12790177 12984517 13177093 13357691 13516064 13641653 13723346 13750844 13716824 13617887 13454001
59819 13454001 13228038 12945882 12615782 12246511 11846280 11423837 10989788 10555281 10129034
$$ packed form
59885A1256849O7782P3220Q2463R6679J16528J42105J72960K07968K45777K85553
59875A2747884L26863L68763M09639M48103M83540N15216N41024N57486N61016
59866A6959534N49099N20425M74394M10880L30497K35057J27731J3111j02863
59857A9517865k13558l13112l97693m65445n15574n47944n63365n63470n50053
59848A5387651n25130m91526m52398m09618l63345l13869k62992k12822j63870
59839A2192081j15549o8186k3193J8601N7487R3414J25142J51440J72082J86858
59829A2790177J94340J92576J80598J58373J25589Q1693K7498l4020r8937j63886
59819A3454001k25963k82156l30100l69271m00231m22443m34049m34507m26247
$$ plain form
59810 10129034 9716461 9321688 8948901 8601006 8278435 7980823 7709125 7464702 7246905
59801 7246905 7053294 6882018 6732129 6601243 6484675 6377752 6277849 6183621 6093603 6006576
59791 6006576 5922336 5841152 5763265 5689679 5622365 5562590 5509765 5462844 5421822 5386506 5354597
59780 5354597 5322569 5287983 5249564 5205527 5153955 5095177 5032138 4967775 4903203 4839056 4777271
59769 4777271 4720494 4670405 4627635 4592917 4567435 4551925 4545837 4547418 4554688 4566659 4583871 4607658
59757 4607658 4638892 4677643 4723925 4778273 4841431 4913596 4993756 5079488 5167755 5256487 5345226
59746 5345226 5433769 5520563 5603203 5680088 5750512 5813358 5867229 5912354 5951228 5986750 6020590
59735 6020590 6053857 6088368 6126509 6170774 6224347 6291223 6374519 6475149 6593284 6730785 6890929
$$ packed form
59810A0129034m12573l94773l72787l47895l22571k97612k71698k44423k17797
59801G246905j93611j71276j49889j30886j16568j06923r9903r4228r0018q7027
59791F006576q4240q1184p7887p3586o7314n9775n2825m6921m1022l5316l1909
59780E354597l2028l4586l8419m4037n1572n8778o3039o4363o4572o4147o1785
59769D777271n6777n0089m2770l4718k5482j5510o088J581P270J1971J7212K3787
59757D607658L1234L8751M6282N4348O3158P2165Q0160Q5732Q8267Q8732Q8739
59746E345226Q8543Q6794Q2640P6885P0424O2846N3871M5125L8874L5522L3840
59735F020590L3267L4511L8141M4265N3573O6876Q3296J00630J18135J37501J60144
$$ plain form
59724 6890929 7075856 7285675 7520429 7781873 8072869 8395925 8752960 9145475 9573625
59715 9573625 10034786 10523122 11029737 11541770 12040516 12500730 12892947 13188528 13365803
59706 13365803 13415143 13340898 13159146 12892650 12566067 12203334 11826431 11453975 11099869 10773363
59696 10773363 10480441 10224917 10008571 9831458 9693039 9592999 9530766 9504658 9512128 9550886
59686 9550886 9619671 9718360 9847773 10009016 10202288 10426412 10680121 10963870 11279903 11630529
59676 11630529 12016807 12438927 12897414 13393953 13931432 14513116 15141256 15816541 16539452
59667 16539452 17311850 18136141 19012689 19939036 20911915 21928454 22983988 24069246 25170976
59658 25170976 26275294 27369614 28441997 29480893 30477340 31427731 32334332 33203600 34044297
$$ packed form
59724F890929J84927K09819K34754K61444K90996L23056L57035L92515M28150
59715I573625M61161M88336N06615N12033M98746M60214L92217K95581J77275
59706A3365803M9340p4245j81752k66496l26583l62733l76903l72456l54106l26506
59696A0773363k92922k55524k16346j77113j38419j00040o2233k6108P470L8758
59686I550886O8785R8689J29413J61243J93272K24124K53709K83749L16033L50626
59676A1630529L86278M22120M58487M96539N37479N81684O28140O75285P22911
59667A6539452P72398Q24291Q76548R26347R72879J016539J055534J085258J101730
59658B5170976J104318J094320J072383J038896R96447R50391R06601Q69268Q40697
$$ plain form
59649 34044297 34866506 35681012 36498144 37325927 38168042 39022647 39882709 40737278 41572319
59640 41572319 42370632 43112196 43776285 44344677 44803824 45145206 45365306 45466705 45459325 45359646
59630 45359646 45187854 44965450 44715133 44461430 44229414 44041574 43915643 43865302 43902412 44038172
59620 44038172 44282190 44640842 45116765 45709939 46419026 47241310 48171199 49198755 50309077
59611 50309077 51481631 52688700 53894220 55054598 56120909 57040625 57759403 58225431
59603 58225431 58396563 58246733 57768499 56972391 55885385 54548706 53013747 51336499 49572479
59594 49572479 47773117 45982880 44236965 42560430 40968809 39468577 38056421 36718478
59586 36718478 35431691 34167937 32899743 31605889 30275484 28909521 27519628 26124715
$$ packed form
59649C4044297Q22209Q14506Q17132Q27783Q42115Q54605Q60062Q54569Q35041
59640D1572319P98313P41564O64089N68392M59147L41382K20100J01399p380r9679
59630D5359646j71792k22404k50317k53703k32016j87840j25931n0341L7110J35760
59620D4038172K44018L58652M75923N93174P09087Q22284R29889J027556J110322
59611E0309077J172554J207069J205520J160378J066311R19716P18778M66028
59603E8225431J71132j49830m78234p96108j087006j336679j534959j677248j764020
59594D9572479j799362j790237j745915j676535j591621j500232j412156j337943
59586C6718478j286787j263754j268194j293854j330405j365963j389893j394913
$$ plain form
59578 26124715 24746700 23406289 22119670 20897271 19745100 18667229 17666801 16744777
59570 16744777 15898650 15123515 14414606 13768318 13180898 12647324 12162319 11722057 11323971
59561 11323971 10964933 10640458 10346111 10079280 9839102 9624633 9433232 9260642 9102377
59552 9102377 8954877 8815434 8681406 8549917 8418258 8284168 8145726 8001627 7851947
59543 7851947 7698190 7541992 7383986 7224402 7064530 6906896 6754059 6607914 6470299
59534 6470299 6343472 6229221 6127657 6037413 5957298 5887634 5829757 5784231 5749872 5724982 5709430
59523 5709430 5704850 5712455 5731151 5758244 5791529 5830126 5873834 5922682 5977009 6036991 6101808 6169993
59511 6169993 6240838 6314921 6393189 6476341 6565509 6662805 6770384 6889290 7019782 7162588
$$ packed form
59578B6124715j378015j340411j286619j222399j152171j077871j000428r22024
59570A6744777q46127p75135p08909o46288n87420n33574m85005m40262l98086
59561A1323971l59038l24475k94347k66831k40178k14469j91401j72590j58265
59552I102377j47500j39443j34028j31489j31659j34090j38442j44099j49680
59543G851947j53757j56198j58006j59584j59872j57634j52837j46145j37615
59534F470299j26827j14251j01564r0244q0115o9664n7877m5526l4359k4890j5552
59523E709430m580P605J8696K7093L3285L8597M3708M8848N4327N9982O4817O8185
59511F169993P0845P4083P8268Q3152Q9168R7296J07579J18906J30492J42806
$$ plain form
59501 7162588 7319330 7491731 7680896 7887446 8112092 8355966 8620439 8906560 9214493
59492 9214493 9543509 9892666 10261422 10649367 11055227 11476232 11908548 12348191 12791061
59483 12791061 13231983 13664390 14081840 14479997 14856643 15209857 15536869 15834556 16099920
59474 16099920 16329777 16521436 16674965 16794130 16884126 16949090 16992939 17021752 17043446 17065050
59464 17065050 17091784 17128744 17181576 17254598 17349326 17465322 17601080 17752673 17911881 18066365
59454 18066365 18201763 18303930 18360530 18361579 18298718 18164389 17952891 17662701 17297189 16863050
59444 16863050 16369092 15826650 15249553 14652231 14047911 13448425 12864252 12303675 11772640
59435 11772640 11276130 10818709 10402886 10027993 9691954 9393613 9132517 8907382 8716354
$$ packed form
59501G162588J56742J72401J89165K06550K24646K43874K64473K86121L07933
59492I214493L29016L49157L68756L87945M05860M21005M32316M39643M42870
59483A2791061M40922M32407M17450L98157L76646L53214L27012K97687K65364
59474A6099920K29857J91659J53529J19165Q9996O4964M3849K8813K1694K1604
59464A7065050K6734L6960N2832P3022R4728J15996J35758J51593J59208J54484
59454A8066365J35398J02167N6600J049o2861j34329k11498k90190l65512m34139
59444A6863050m93958n42442n77097n97322o04320n99486n84173n60577n31035
59435A1772640m96510m57421m15823l74893l36039k98341k61096k25135j91028
$$ plain form
59426 8716354 8558445 8433478 8340776 8279039 8247326 8245114 8271415 8324843 8404545 8510249 8641478
59415 8641478 8797503 8978066 9183259 9412608 9664744 9937674 10228626 10533761 10848701
59406 10848701 11168872 11488283 11798218 12088250 12348654 12571029 12746970 12867789 12926329
59397 12926329 12918535 12843322 12702051 12498549 12238715 11929505 11578739 11195815 10791293 10374805
59387 10374805 9953586 9533291 9119435 8717472 8331987 7966329 7622601 7301472 7002420
59378 7002420 6724843 6468886 6234942 6022642 5830710 5657651 5502224 5363411 5240255
59369 5240255 5131872 5037601 4957160 4890366 4836343 4793142 4758724 4732456 4715154 4707584 4709398
59358 4709398 4719717 4737967 4763579 4795346 4831924 4873175 4920568 4975804 5038664 5105887 5172327
$$ packed form
59426H716354j57909j24967r2702o1737l1713k212K6301N3428P9702J05704J31229
59415H641478J56025J80563K05193K29349K52136K72930K90952L05135L14940
59406A0848701L20171L19411L09935K90032K60404K22375J75941J20819N8540
59397A2926329p794p5213j41271k03502k59834l09210l50766l82924m04522m16488
59387A0374805m21219m20295m13856m01963l85485l65658l43728l21129k99052
59378G002420k77577k55957k33944k12300j91932j73059j55427j38813j23156
59369E240255j08383r4271q0441o6794n4023m3201l4418k6268j7302p570J814
59358D709398J0319J8250K5612L1767L6578M1251M7393N5236O2860O7223O6440
$$ plain form
59347 5172327 5233988 5290784 5346663 5407043 5476097 5556187 5649112 5757031 5881826 6023779 6181073
59336 6181073 6350601 6529341 6715563 6909785 7115405 7338118 7583762 7856168 8157193
59327 8157193 8488650 8853384 9254299 9693348 10172231 10693339 11258966 11870020 12526417
59318 12526417 13228259 13975055 14763377 15586061 16433737 17296029 18160941 19014516 19842510
59309 19842510 20632521 21374507 22060289 22683721 23241278 23731899 24156295 24516674 24816494
59300 24816494 25059259 25246895 25379183 25454423 25470066 25422720 25308375 25123530 24866501 24537860
59290 24537860 24140058 23677288 23156037 22585292 21975144 21334221 20668129 19980328 19274220
59281 19274220 18554293 17825753 17093954 16364435 15642995 14935240 14246085 13579874 12940830
$$ packed form
59347E172327O1661N6796N5879O0380O9054Q0090R2925J07919J24795J41953J57294
59336F181073J69528J78740J86222J94222K05620K22713K45644K72406L01025
59327H157193L31457L64734M00915M39049M78883N21108N65627O11054O56397
59318A2526417P01842P46796P88322Q22684Q47676Q62292Q64912Q53575Q27994
59309A9842510P90011P41986O85782O23432N57557M90621M24396L60379K99820
59300B4816494K42765J87636J32288P5240J5643m7346j14345j84845k57029l28641
59290B4537860l97802m62770n21251n70745o10148o40923o66092o87801p06108
59281A9274220p19927p28540p31799p29519p21440p07755o89155o66211o39044
$$ plain form
59272 12940830 12332971 11759365 11221569 10720082 10255427 9828412 9438925 9084835 8762919
59263 8762919 8471121 8209265 7977322 7773671 7595563 7440594 7307016 7193227 7097895 7020318
59253 7020318 6959775 6914769 6883868 6867097 6865377 6878471 6904562 6942121 6991141 7052036 7124276
59242 7124276 7206675 7298188 7397567 7502933 7612737 7726956 7846420 7970719 8097223 8222228
59232 8222228 8342899 8458370 8569451 8677194 8781343 8880249 8972810 9060614 9147722 9238115
59222 9238115 9333490 9433578 9538083 9647864 9764456 9889075 10022169 10163129 10309639 10457377
59212 10457377 10600940 10735158 10855133 10955196 11028798 11070193 11076229 11046632 10983349 10890027
59202 10890027 10771564 10633352 10480891 10320031 10156707 9995763 9840494 9693851 9559427
$$ packed form
59272A2940830o07859n73606n37796n01487m64655m27015l89487l54090l21916
59263H762919k91798k61856k31943k03651j78108j54969j33578j13789r5332p7577
59253G020318o0543m5006l0901j6771j720J3094K6091L7559M9020O0895P2240
59242G124276Q2399R1513R9379J05366J09804J14219J19464J24299J26504J25005
59232H222228J20671J15471J11081J07743J04149R8906R2561Q7804Q7108R0393
59222I238115R5375J00088J04505J09781J16592J24619J33094J40960J46510J47738
59212A0457377J43563J34218J19975J00063P3602M1395O036k9597o3283r3322
59202A0890027j18463j38212j52461j60860j63324j60944j55269j46643j34424
$$ plain form
59193 9559427 9440421 9338237 9253129 9185739 9136834 9105787 9090719 9090300 9104182 9131373 9169379
59182 9169379 9215530 9268345 9327159 9391277 9460211 9534219 9614127 9701089 9796945 9904413 10026493
59171 10026493 10165956 10325443 10507505 10714376 10948255 11211928 11508312 11838893 12202827
59162 12202827 12597363 13018087 13458277 13908693 14358260 14794169 15201139 15561913 15859774
59153 15859774 16080575 16212565 16245929 16174079 15995262 15712314 15331663 14863748 14323790 13730216
59143 13730216 13101221 12452676 11798505 11151469 10522682 9920729 9351587 8819048 8325015
59134 8325015 7869757 7452317 7070874 6722947 6405653 6116148 5852070 5611737 5393895
59125 5393895 5197089 5019262 4858249 4712655 4581914 4465385 4361690 4268918 4185109 4108565
$$ packed form
59193I559427j19006j02184q5108o7390m8905l1047j5068m19J3882K7191L8006
59182I169379M6151N2815N8814O4118O8934P4008P9908Q6962R5856J07468J22080
59171A0026493J39463J59487J82062K06871K33879K63673K96384L30581L63934
59162A2202827L94536M20724M40190M50416M49567M35909M06970L60774K97861
59153A5859774K20801J31990L3364p1850j78817k82948l80651m67915n39958n93574
59143A3730216o28995o48545o54171o47036o28787o01953n69142n32539m94033
59134H325015m55258m17440l81443l47927l17294k89505k64078k40333k17842
59125E393895j96806j77827j61013j45594j30741j16529j03695r2772q3809p6544
$$ plain form
59115 4108565 4038341 3974829 3919360 3872851 3834929 3804432 3780343 3762173 3749949 3744087 3744858 3751886
59103 3751886 3764701 3783715 3809736 3842314 3879750 3921391 3968906 4024305 4087440 4156514 4230366
59092 4230366 4309037 4392526 4480432 4572930 4670903 4774780 4884018 4997856 5115692 5236538
59082 5236538 5359005 5482282 5606330 5730523 5852595 5969474 6078932 6180162 6273107 6357669
59072 6357669 6433312 6499069 6554116 6598697 6634489 6663825 6688533 6709604 6727925 6745330 6765141
59061 6765141 6791758 6829308 6880137 6944407 7021293 7110709 7213905 7332583 7467846 7620176
59051 7620176 7790004 7977643 8182621 8403635 8639450 8889307 9151826 9423649 9699805
59042 9699805 9975421 10246529 10508878 10756146 10979409 11168354 11313496 11408160 11449058 11435427
$$ packed form
59115D108565p0224o3512n5469m6509l7922l0497k4089j8170j2224n862P71P028
59103C751886J2815J9014K6021L2578L7436M1641M7515N5399O3135O9074P3852
59092D230366P8671Q3489Q7906R2498R7973J03877J09238J13838J17836J20846
59082E236538J22467J23277J24048J24193J22072J16879J09458J01230R2945Q4562
59072F357669P5643O5757N5047M4581L5792K9336K4708K1071J8321J7405J9811
59061F765141K6617L7550N0829O4270P6886Q9416J03196J18678J35263J52330
59051G620176J69828J87639K04978K21014K35815K49857K62519K71823K76156
59042I699805K75616K71108K62349K47268K23263J88945J45142R4664M0898j3631
$$ plain form
59032 11435427 11368257 11250764 11088966 10890636 10663227 10413004 10145715 9866969 9581544
59023 9581544 9292960 9003981 8716879 8432991 8152665 7876029 7603266 7334011 7067399
59014 7067399 6803280 6542823 6287462 6037913 5794788 5559580 5334317 5120467 4918519
59005 4918519 4728111 4548033 4376614 4212812 4056785 3909149 3770135 3639765 3518147
58996 3518147 3404978 3299357 3200725 3109412 3025578 2948179 2875666 2807081 2741614 2677929 2615340
58985 2615340 2555298 2500128 2450071 2402829 2356404 2311255 2269066 2230476 2195000 2162535 2133660
58974 2133660 2108345 2085370 2063736 2044283 2029087 2019049 2012642 2007569 2003225 2000741 2000756 2002245 2003965
58961 2003965 2006108 2009736 2015014 2020686 2025063 2027124 2027081 2026431 2027071 2029779 2033721 2037884 2042570 2048838 2056794
$$ packed form
59032A1435427o7170j17493j61798j98330k27409k50223k67289k78746k85425
59023I581544k88584k88979k87102k83888k80326k76636k72763k69255k66612
59014G067399k64119k60457k55361k49549k43125k35208k25263k13850k01948
59005D918519j90408j80078j71419j63802j56027j47636j39014j30370j21618
58996C518147j13169j05621r8632r1313q3834p7399p2513o8585o5467o3685o2589
58985B615340o0042n5170n0057m7242m6425m5149m2189l8590l5476l2465k8875
58974B133660k5315k2975k1634j9453j5196j0038o407n073m344k484J5J489J720
58961B003965K143L628N278N672M377K061m3o50O40K708L942M163M686O268P956
$$ plain form
58946 2056794 2065179 2072709 2079312 2086049 2094148 2104006 2114867 2125552 2135721 2146140 2157597 2169998
58934 2169998 2182837 2196053 2209890 2224242 2238583 2252500 2266217 2280877 2298085 2318502 2340918
58923 2340918 2363721 2387281 2413477 2442510 2471884 2499575 2526684 2555423 2585835 2616399 2647094
58912 2647094 2679617 2714713 2751344 2788920 2828754 2872614 2920798 2972099 3024998 3078806 3134315
58901 3134315 3193382 3257145 3324636 3393702 3462986 3532476 3602889 3675680 3753004 3836140 3924079
58890 3924079 4014984 4108833 4207376 4311944 4423076 4542194 4671522 4811819 4961791 5120343
58880 5120343 5288053 5466012 5654888 5855833 6070756 6300709 6545251 6804302 7079578
58871 7079578 7373436 7687539 8023522 8383785 8770466 9184557 9627089 10100327 10606963
$$ packed form
58946B056794Q385P530O603O737Q099R858J0861J0685J0169J0419J1457J2401
58934B169998J2839J3216J3837J4352J4341J3917J3717J4660J7208K0417K2416
58923B340918K2803K3560K6196K9033K9374K7691K7109K8739L0412L0564L0695
58912B647094L2523L5096L6631L7576L9834M3860M8184N1301N2899N3808N5509
58901C134315N9067O3763O7491O9066O9284O9490P0413P2791P7324Q3136Q7939
58890C924079R0905R3849R8543J04568J11132J19118J29328J40297J49972J58552
58880E120343J67710J77959J88876K00945K14923K29953K44542K59051K75276
58871G079578K93858L14103L35983L60263L86681M14091M42532M73238N06636
$$ plain form
58862 10606963 11149083 11728951 12349706 13013825 13721541 14472100 15266025 16104617 16987315
58853 16987315 17910728 18870267 19861535 20879545 21916653 22960736 23994635 24997496
58845 24997496 25947183 26821259 27595722 28244520 28742588 29070432 29216266 29175308 28949085
58836 28949085 28545851 27980565 27273615 26449138 25533116 24550902 23525276 22476526 21423477
58827 21423477 20383004 19368394 18389209 17452921 16565519 15730144 14946594 14213497 13530408
58818 13530408 12896798 12309637 11763689 11254617 10780769 10341433 9934298 9555534 9201910
58809 9201910 8871864 8564646 8279267 8014417 7768771 7541224 7331299 7139267 6965074
58800 6965074 6807091 6662867 6531412 6413556 6309507 6217422 6135631 6065229 6008731 5966538
$$ packed form
58862A0606963N42120N79868O20755O64119P07716P50559P93925Q38592Q82698
58853A6987315R23413R59539R91268J018010J037108J044083J033899J002861
58845B4997496R49687Q74076P74463O48798M98068L27844J45834m0958k26223
58836B8949085m03234n65286p06950q24477r16022r82214j025626j048750j053049
58827B1423477j040473j014610r79185r36288q87402q35375p83550p33097o83089
58818A3530408o33610n87161n45948n09072m73848m39336m07135l78764l53624
58809I201910l30046l07218k85379k64850k45646k27547k09925j92032j74193
58800F965074j57983j44224j31455j17856j04049r2085q1791p0402n6498m2193
$$ plain form
58790 5966538 5936426 5916451 5906677 5907806 5919790 5942549 5976764 6023010 6080869 6149670 6229516 6321064
58778 6321064 6424925 6541770 6672348 6816852 6974941 7146927 7334422 7539333 7762797
58769 7762797 8005465 8268060 8551087 8854790 9180203 9529714 9905858 10309928 10742523
58760 10742523 11205155 11700753 12232861 12804786 13419039 14076919 14778753 15524881 16315939
58751 16315939 17151637 18029594 18945657 19894542 20869157 21859362 22851732 23829975 24774687
58742 24774687 25663061 26469989 27170137 27739336 28155378 28399719 28460130 28332560 28021181
58733 28021181 27537272 26897848 26124279 25240886 24273570 23248222 22188888 21116231 20046959
58724 20046959 18994282 17969014 16980477 16036341 15141393 14296947 13502378 12757382 12062197
$$ packed form
58790E966538l0112j9975r774J129J1984K2759L4215M6246N7859O8801P9846R1548
58778F321064J03861J16845J30578J44504J58089J71986J87495K04911K23464
58769G762797K42668K62595K83027L03703L25413L49511L76144M04070M32595
58760A0742523M62632M95598N32108N71925O14253O57880P01834P46128P91058
58751A6315939Q35698Q77957R16063R48885R74615R90205R92370R78243R44712
58742B4774687Q88374Q06928P00148N69199M16042K44341O0411j27570l11379
58733B8021181m83909o39424p73569q83393r67316j025348j059334j072657j069272
58724B0046959j052677j025268r88537r44136q94948q44446p94569p44996o95185
$$ plain form
58715 12062197 11415727 10814524 10254105 9730647 9241141 8782968 8354190 7953736 7580478
58706 7580478 7232299 6906550 6601232 6315446 6048996 5801755 5572936 5360673 5162704
58697 5162704 4977672 4805191 4644636 4494794 4355012 4225614 4106577 3996761 3895100
58688 3895100 3801516 3715701 3635953 3560419 3488744 3421328 3357590 3296433 3238032 3183649 3133634
58677 3133634 3086817 3041883 2998268 2955638 2913732 2872911 2833742 2795646 2756990 2716990 2676711
58666 2676711 2637540 2599278 2560371 2519654 2477337 2434380 2391310 2347700 2302819 2256784 2210821
58655 2210821 2166127 2122715 2079740 2036735 1994064 1952361 1912056 1873369 1836326 1800971 1767935
58644 1767935 1738352 1712461 1688561 1664341 1639214 1614524 1591438 1569678 1548479 1527677 1507297
$$ packed form
58715A2062197o46470o01203n60419n23458m89506m58173m28778m00454l73258
58706G580478l48179l25749l05318k85786k66450k47241k28819k12263j97969
58697E162704j85032j72481j60555j49842j39782j29398j19037j09816j01661
58688C895100r3584q5815p9748p5534p1675o7416o3738o1157n8401n4383n0015
58677C133634m6817m4934m3615m2630m1906m0821l9169l8096l8656m0000m0279
58666B676711l9171l8262l8907m0717m2317m2957m3070m3610m4881m6035m5963
58655B210821m4694m3412m2975m3005m2671m1703m0305l8687l7043l5355l3036
58644A767935k9583k5891k3900k4220k5127k4690k3086k1760k1199k0802k0380
$$ plain form
58633 1507297 1487019 1466906 1448071 1431695 1417659 1404794 1392262 1380033 1368248 1357042 1347079
58622 1347079 1339507 1334929 1332855 1332441 1333277 1335003 1336633 1337043 1336071 1334449 1332678 1330681 1328725 1327583 1327085
58607 1327085 1325318 1320514 1313529 1307425 1304425 1304109 1304596 1304502 1303465 1301807 1300459 1300675 1303104 1307336 1312689
58592 1312689 1319144 1327302 1337790 1350940 1366569 1383883 1402202 1422026 1444765 1471083 1500213 1531384
58580 1531384 1565130 1602513 1643673 1687934 1734848 1784327 1836252 1890914 1949598 2013784 2083784
58569 2083784 2159059 2239886 2327829 2424305 2529500 2643235 2766341 2900379 3046065 3202727
58559 3202727 3369805 3548555 3741512 3950130 4173720 4411174 4662847 4929598 5210219
58550 5210219 5500958 5797298 6094649 6386691 6664342 6917275 7135914 7311771 7437284
$$ packed form
58633A507297k0278k0113j8835j6376j4036j2865j2532j2229j1785j1206r963
58622A347079p572m578k074m14Q36J726J630M10r72j622j771j997j956j142m98
58607A327085j767m804o985o104l000l16M87r4j037j658j348K16K429M232N353
58592A312689O455Q158J0488J3150J5629J7314J8319J9824K2739K6318K9130L1171
58580A531384L3746L7383M1160M4261M6914M9479N1925N4662N8684O4186P0000
58569B083784P5275Q0827Q7943R6476J05195J13735J23106J34038J45686J56662
58559C202727J67078J78750J92957K08618K23590K37454K51673K66751K80621
58550E210219K90739K96340K97351K92042K77651K52933K18639J75857J25513
$$ plain form
58541 7437284 7506672 7516701 7466314 7356701 7192851 6984245 6742481 6477985 6199167 5913573
58531 5913573 5628145 5348282 5077696 4819405 4576142 4349734 4140734 3948848 3773471
58522 3773471 3613980 3469844 3340401 3224406 3120249 3026831 2943578 2869202 2801135 2736841
58512 2736841 2675228 2616206 2559450 2504291 2450347 2397555 2345918 2295719 2247478 2201224 2156373
58501 2156373 2112796 2071102 2031027 1990499 1947560 1902816 1858818 1817216 1777463 1738181 1698944
58490 1698944 1660780 1625491 1594244 1566280 1539388 1512164 1485265 1459955 1436330 1413940 1393316
58479 1393316 1375583 1360907 1348379 1337089 1326275 1314869 1302095 1288459 1275192 1262934 1251718
58468 1251718 1241808 1233478 1226207 1219125 1212135 1205725 1199960 1194368 1188476 1181610 1172737 1161462 1148758
$$ packed form
58541G437284O9388J0029n0387j09613j63850k08606k41764k64496k78818k85594
58531E913573k85428k79863k70586k58291k43263k26408k09000j91886j75377
58522C773471j59491j44136j29443j15995j04157r3418q3253p4376o8067o4294
58512B736841o1613n9022n6756n5159n3944n2792n1637n0199m8241m6254m4851
58501B156373m3577m1694m0075m0528m2939m4744m3998m1602l9753l9282l9237
58490A698944l8164l5289l1247k7964k6892k7224k6899k5310k3625k2390k0624
58479A393316j7733j4676j2528j1290j0814j1406j2774j3636j3267j2258j1216
58468A251718r910q330p271p082o990o410n765n592n892o866q873j1275j2704
$$ plain form
58455 1148758 1135734 1122292 1108040 1093834 1081009 1069521 1058285 1047174 1037285 1029361 1023070 1017676
58443 1017676 1012347 1006162 999039 992340 987311 983295 978812 973924 969936 967028 963944 960068 956225 953275
58429 953275 951285 950075 949132 947054 942744 937390 933678 932676 932874 932448 930971 928605 925278 921313 917641
58414 917641 914737 912325 910351 909115 908281 907036 905519 904824 905204 905590 905192 904374 903582 902748 902239 903086 905589
58397 905589 908689 911233 913038 914485 916133 918936 923573 929033 932947 933870 932488 930387 928499 926828
58383 926828 924622 920644 914316 906680 899268 892158 884428 876275 869023 862982 857062 850869 845523 841810
58369 841810 838984 836000 832686 829314 826339 824828 825677 828053 830039 831072 832199 833823 835225 836802
58355 836802 840524 847169 854979 862200 869260 877272 886082 895193 905127 916323 927783 938260 947964
$$ packed form
58455A148758j3024j3442j4252j4206j2825j1488j1236j1111r889p924o291n394
58443A017676n329o185p123o699n029m016m483m888l988k908l084l876l843k950
58429I53275j990j210r43k078m310n354l712j002J98m26j477k366l327l965l672
58414I17641k904k412j974j236q34j245j517o95L80L86l98q18p92q34n09Q47K503
58397I05589L100K544J805J447J648K803M637N460L914R23j382k101j888j671
58383I26828k206l978o328p636p412p110p730q153p252o041n920o193n346l713
58369H41810k826k984l314l372k975j511Q49K376J986J033J127J624J402J577
58355H36802L722O645P810P221P060Q012Q810R111R934J1196J1460J0477R704
$$ plain form
58342 947964 957926 968454 979292 990550 1002461 1014785 1027095 1038988 1049567 1057711 1063301 1067230
58330 1067230 1069879 1070936 1071078 1072136 1074663 1076861 1077047 1075936 1075390 1076040 1077243 1078355 1078946 1078601 1077552
58315 1077552 1076856 1077216 1078290 1079657 1081535 1084120 1087188 1090699 1094688 1098349 1100737 1102741 1106725 1113538
58301 1113538 1121484 1128880 1135859 1142900 1149513 1155511 1161791 1168510 1174119 1177670 1180608 1184851 1190363 1196056
58287 1196056 1201798 1208030 1214511 1221030 1228464 1237627 1247681 1256965 1264936 1272422 1280537 1290004 1300830
58274 1300830 1312103 1322943 1333947 1346626 1361315 1377089 1393834 1412360 1431906 1449797 1464754
58263 1464754 1478679 1494030 1511212 1529686 1549610 1570776 1591475 1610089 1626836 1642942 1659368
58252 1659368 1677108 1697173 1719280 1742005 1764789 1788088 1811203 1832444 1852304 1873909 1899088
$$ packed form
58342I47964R962J0528J0838J1258J1911J2324J2310J1893J0579Q144N590L929
58330A067230K649J057J42J058K527K198J86j111n46O50J203J112N91l45j049
58315A077552o96L60J074J367J878K585L068L511L989L661K388K004L984O813
58301A113538P946P396O979P041O613N998O280O719N609L551K938M243N512N693
58287A196056N742O232O481O519P434R163J0054R284P971P486Q115R467J0826
58274A300830J1273J0840J1004J2679J4689J5774J6745J8526J9546J7891J4957
58263A464754J3925J5351J7182J8474J9924K1166K0699J8614J6747J6106J6426
58252A659368J7740K0065K2107K2725K2784K3299K3115K1241J9860K1605K5179
$$ plain form
58241 1899088 1926525 1954951 1985315 2018095 2051324 2083433 2115683 2149690 2184882 2220480 2257540
58230 2257540 2296709 2336236 2374772 2414112 2456742 2502572 2550440 2600890 2655010 2712410 2772715
58219 2772715 2837097 2905970 2977092 3048463 3121234 3197366 3276341 3356808 3439695 3527144 3619930
58208 3619930 3718027 3821885 3930965 4043129 4157699 4277123 4403751 4537451 4678229 4827902
58198 4827902 4986598 5150992 5319108 5493685 5677606 5869423 6067001 6272137 6487421
58189 6487421 6711701 6943169 7184100 7438060 7705086 7984287 8278506 8591677 8924014
58180 8924014 9274634 9646355 10042634 10462089 10901588 11363248 11853529 12377333 12937922
58171 12937922 13540631 14191410 14893067 15647135 16456917 17324037 18245113 19217374 20244938
$$ packed form
58241A899088K7437K8426L0364L2780L3229L2109L2250L4007L5192L5598L7060
58230B257540L9169L9527L8536L9340M2630M5830M7868N0450N4120N7400O0305
58219B772715O4382O8873P1122P1371P2771P6132P8975Q0467Q2887Q7449R2786
58208C619930R8097J03858J09080J12164J14570J19424J26628J33700J40778J49673
58198D827902J58696J64394J68116J74577J83921J91817J97578K05136K15284
58189F487421K24280K31468K40931K53960K67026K79201K94219L13171L32337
58180H924014L50620L71721L96279M19455M39499M61660M90281N23804N60589
58171A2937922O02709O50779P01657P54068Q09782Q67120R21076R72261J027564
$$ plain form
58162 20244938 21334304 22487082 23703464 24989930 26357169 27813496 29367104 31031968
58154 31031968 32824580 34757464 36842489 39097626 41544682 44205743 47110934 50307580
58146 50307580 53856549 57825521 62291116 67335377 73025291 79401155 86497633 94373182
58138 94373182 103116473 112847297 123735657 136005570 149885900 165548451 183097299
58131 183097299 202601291 224147505 247962857 274564646 304619947 338181370 373566086
58124 373566086 406833499 432661324 446339097 445637571 431430479 406926524 376226641
58117 376226641 343050920 310075587 278865835 250148025 224148408 200844988 180111034
58110 180111034 161785856 145702776 131694163 119591005 109223753 100423590 93029142
$$ packed form
58162B0244938J089366J152778J216382J286466J367239J456327J553608J664864
58154C1031968J792612J932884K085025K255137K447056K661061K905191L196646
58146E0307580L548969L968972M465595N044261N689914O375864P096478P875549
58138I4373182Q743291R730824J0888360J2269913J3880330J5662551J7548848
58131A83097299J9503992K1546214K3815352K6601789L0055301L3561423L5384716
58124C73566086L3267413K5827825J3677773p01526j4207092k4503955l0699883
58117C76226641l3175721l2975333l1209752k8717810k5999617k3303420k0733954
58110A80111034j8325178j6083080j4008613j2103158j0367252q800163p394448
$$ plain form
58103 93029142 86900036 81921624 77990844 75001745 72849373 71440026 70694374 70553744
58095 70553744 70975849 71860057 72904151 73542864 73121797 71227084 67890828 63505222 58570340
58086 58570340 53507266 48611787 44068313 39961837 36300699 33056345 30190053 27656881
58078 27656881 25410715 23417110 21654054 20098607 18721877 17497664 16406163 15427373
58070 15427373 14539508 13725970 12976942 12282935 11633321 11022036 10448222 9909971 9402559
58061 9402559 8923045 8471205 8045683 7644095 7266636 6914683 6586302 6277797 5988471
58052 5988471 5718269 5461692 5210334 4961794 4720936 4492517 4277808 4078005 3894673
58043 3894673 3725760 3566515 3415608 3275872 3148263 3029701 2917726 2812648 2714047 2619711
$$ packed form
58103I3029142o129106m978412l930780k989099k152372j409347p45652j40630
58095G0553744M22105Q84208J044094O38713m21067j894713l336256m385606m934882
58086E8570340n063074m895479m543474m106476l661138l244354k866292k533172
58078B7656881k246166j993605j763056j555447j376730j224213j091501r78790
58070A5427373q87865q13538p49028o94007o49614o11285n73814n38251n07412
58061I402559m79514m51840m25522m01588l77459l51953l28381l08505k89326
58052E988471k70202k56577k51358k48540k40858k28419k14709j99803j83332
58043C894673j68913j59245j50907j39736j27609j18562j11975j05078r8601r4336
$$ plain form
58033 2619711 2529465 2445993 2370246 2299541 2231423 2166027 2103606 2043305 1985547 1932155 1882736
58022 1882736 1834128 1784748 1736344 1690112 1644312 1597438 1550929 1506899 1465565 1426696 1391394
58011 1391394 1360587 1333346 1308174 1284583 1262309 1240477 1218713 1197949 1179344 1163355 1149990
58000 1149990 1138594 1127277 1114301 1100377 1087971 1077978 1068604 1057732 1044849 1030571 1015998 1002665
57988 1002665 991335 980676 968832 956374 945946 938953 934489 931449 929491 927740 924931 921535 919690
57975 919690 920300 921926 923127 924122 925531 927088 928243 928661 927777 925306 922199 919431 915883 909499 900652
57960 900652 892011 884662 876806 867214 857635 850545 846283 843526 840890 837029 830924 823283 816217 810462
57946 810462 804382 796621 788112 780303 773031 765559 758351 752283 747140 742325 738229 735563 733923 732005
$$ packed form
58033B619711r0246q3472p5747p0705o8118o5396o2421o0301n7758n3392m9419
58022A882736m8608m9380m8404m6232m5800m6874m6509m4030m1334l8869l5302
58011A391394l0807k7241k5172k3591k2274k1832k1764k0764j8605j5989j3365
58000A149990j1396j1317j2976j3924j2406r993r374j0872j2883j4278j4573j3333
57988A002665j1330j0659j1844j2458j0428o993m464l040j958j751k809l396j845
57975I19690O10J626J201R95J409J557J155M18q84k471l107k768l548o384q847
57960I00652q641p349p856r592r579p090m262k757k636l861o105p641p066n755
57946H10462o080p761q509p809p272p472p208o068n143m815m096k666j640j918
$$ plain form
57932 732005 728798 723960 717869 711899 707648 705176 702998 700404 698532 698359 699055 699399 699516 699842 699558 697718
57916 697718 695175 693706 693581 693464 692385 690457 687743 683830 678812 673620 668936 664407 659231 653141 646592
57901 646592 640185 633980 627346 619667 611226 603045 595816 589433 583609 578295 573218 567759 561897 556897
57887 556897 554547 555742 559838 564982 569124 571404 572854 575243 579023 582863 585256 585838 584961 582805 579394
57872 579394 574868 569227 562308 554296 545800 537114 527915 517983 507843 498572 491391 487258 486038 486099
57858 486099 485698 484960 485464 487756 490512 492569 494367 496678 499234 501825 505652 512120 520755 529566 537198
57843 537198 543729 549707 555432 560961 565856 568986 569419 567469 564100 559551 553436 546098 538847 532643
57829 532643 527147 521237 513858 504473 493490 482498 473409 467013 462724 459757 457928 457135 456875 456797 457208
$$ packed form
57932G32005l207m838o091n970m251k472k178k594j872j73O96L44J17L26k84j840
57916F97718k543j469j25j17j079j928k714l913n018n192m684m529n176o090o549
57901F46592o407o205o634p679q441q181p229o383n824n314n077n459n862n000
57887E56897k350J195M096N144M142K280J450K389L780L840K393N82q77k156l411
57872E79394m526n641o919q012q496q686r199r932j0140r271p181m133j220O1
57858D86099m01p38N04K292K756K057J798K311K556K591L827O468Q635Q811P632
57843E37198O531N978N725N529M895L130M33j950l369m549o115p338p251o204
57829E32643n496n910p379r385j0983j0992r089o396m289k967j829p93k60p8M11
$$ plain form
57814 457208 458426 460024 461397 462930 465959 471477 479354 488840 499274 510080 520620 530395 539045
57801 539045 545859 549916 551367 552073 553857 556177 556575 553672 548639 543200 537312 529800 520526 510715 501453
57786 501453 492895 484836 477080 469207 460870 452530 445207 439371 434645 430534 426706 422501 417058 410369
57772 410369 403601 397958 393483 389166 383879 377221 369851 362953 356877 350352 341643 330509 318398 306849
57758 306849 296455 287344 279576 272716 266007 259555 254561 251738 250198 248619 246923 245918 245610 244946
57744 244946 243351 241792 241978 244839 249990 256429 263442 270928 279117 288165 297856 307385 315409 320733
57730 320733 323233 323887 323727 323090 322103 321356 321568 322934 325317 328660 332546 335730 336922 335898 333167 328833
57714 328833 322609 314693 305773 296395 287328 280209 276395 275007 273462 270417 267093 265265 265070 265493 266034
$$ packed form
57814D57208J218J598J373J533L029N518P877R486J0434J0806J0540R775Q650
57801E39045O814M057J451P06J784K320L98k903n033n439n888p512r274r811r262
57786E01453q558q059p756p873q337q340p323n836m726m111l828m205n443o689
57772D10369o768n643m475m317n287o658p370o898o076o525q709j1134j2111j1549
57758C06849j0394r111p768o860o709o452m994k823j540j579j696j005l08o64
57744B44946j595j559J86K861N151O439P013P486Q189R048R691R529Q024N324
57730C20733K500O54j60o37r87p47K12J366K383L343L886L184J192j024k731m334
57714C28833o224p916q920r378r067p119l814j388j545l045l324j828j95M23N41
$$ plain form
57699 266034 267048 268963 271795 275046 277876 280006 282540 287003 293349 299965 305925 311869 318046 323001
57685 323001 325605 327359 331127 337931 346204 354001 360875 367668 375364 384192 393271 401275 407953 414698
57671 414698 423065 433058 443488 453636 463876 474968 487418 501311 516147 531147 546205 562197
57659 562197 579857 598966 619346 641935 667722 695999 724872 753420 782350 812635 844599
57648 844599 878416 914355 952223 991522 1032555 1076556 1124232 1174850 1227340 1281951 1340456
57637 1340456 1405027 1477050 1556545 1642415 1733698 1831012 1936650 2053058 2181326 2321244
57627 2321244 2472452 2635341 2811058 3000890 3205482 3424320 3655818 3897900 4148577
57618 4148577 4405852 4666713 4925785 5175068 5405561 5609479 5781026 5915897 6011702 6069364
$$ packed form
57699B66034J014J915K832L251K830K130K534M463O346O616N960N944O177M955
57685C23001K604J754L768O804Q273P797O874O793P696Q828R079Q004O678O745
57671D14698Q367R993J0430J0148J0240J1092J2450J3893J4836J5000J5058J5992
57659E62197J7660J9109K0380K2589K5787K8277K8873K8548K8930L0285L1964
57648H44599L3817L5939L7868L9299M1033M4001M7676N0618N2490N4611N8505
57637A340456O4571P2023P9495Q5870R1283R7314J05638J16408J28268J39918
57627B321244J51208J62889J75717J89832K04592K18838K31498K42082K50677
57618D148577K57275K60861K59072K49283K30493K03918J71547J34871R5805N7662
$$ plain form
57608 6069364 6092607 6084286 6043142 5964770 5845307 5683670 5481668 5244570 4982252 4707931
57598 4707931 4433978 4168627 3916467 3680811 3464601 3269618 3095888 2942048 2806020
57589 2806020 2685737 2579934 2488423 2411429 2348663 2298952 2260413 2230837 2208396 2192529 2184083
57578 2184083 2184258 2193421 2211018 2236413 2269506 2310626 2360178 2418597 2486652 2565610 2656736 2760267
57566 2760267 2874985 2999224 3132448 3275558 3429608 3594556 3769314 3952317 4141313
57557 4141313 4332464 4519939 4696520 4854709 4987667 5089609 5155604 5181254 5163195 5100560
57547 5100560 4996183 4856120 4687738 4498026 4293159 4078827 3860302 3642206 3428492
57538 3428492 3222552 3026932 2842779 2669970 2508153 2357524 2218362 2090094 1971403
$$ packed form
57608F069364K3243q321m1144p8372j19463j61637k02002k37098k62318k74321
57598D707931k73953k65351k52160k35656k16210j94983j73730j53840j36028
57589B806020j20283j05803r1511p6994o2766m9711l8539k9576k2441j5867q446
57578B184083J75R163J7597K5395L3093M1120M9552N8419O8055P8958R1126J03531
57566B760267J14718J24239J33224J43110J54050J64948J74758J83003J88996
57557D141313J91151J87475J76581J58189J32958J01942O5995K5650j8059o2635
57547E100560j04377j40063j68382j89712k04867k14332k18525k18096k13714
57538C428492k05940j95620j84153j72809j61817j50629j39162j28268j18691
$$ plain form
57529 1971403 1861278 1759562 1666359 1581220 1503032 1430411 1362211 1298111 1238780 1185069 1136932
57518 1136932 1093568 1054629 1020487 990997 964819 940574 917994 897213 877692 858952 841950
57507 841950 828354 818394 810509 803386 797309 793146 791041 790846 793018 798124 805761 814780 824594 835758
57493 835758 849210 865252 883296 902520 922905 945706 972534 1003734 1038000 1073920 1111544
57482 1111544 1152004 1195875 1242768 1292634 1346802 1407227 1475008 1550088 1632257 1721912 1819600
57471 1819600 1925269 2038460 2159157 2287809 2424288 2567254 2714880 2865773 3018519
57462 3018519 3170464 3317531 3455163 3578642 3682315 3759497 3804286 3813886 3789217 3733565
57452 3733565 3650797 3544415 3417725 3274734 3120859 2962385 2804705 2650924 2502214 2359420
$$ packed form
57529A971403j10125j01716r3203q5139p8188p2621o8200o4100n9331n3711m8137
57518A136932m3364l8939l4142k9490k6178k4245k2580k0781j9521j8740j7002
57507H41950j3596r960p885p123o077m163k105j95K172N106P637R019R814J1164
57493H35758J3452J6042J8044J9224K0385K2801K6828L1200L4266L5920L7624
57482A111544M0460M3871M6893M9866N4168O0425O7781P5080Q2169Q9655R7688
57471A819600J05669J13191J20697J28652J36479J42966J47626J50893J52746
57462C018519J51945J47067J37632J23479J03673P7182M4789R600k4669n5652
57452C733565q2768j06382j26690j42991j53875j58474j57680j53781j48710j42794
$$ plain form
57442 2359420 2224122 2098296 1983186 1878568 1783190 1696044 1617214 1547307 1486196 1432832
57432 1432832 1386380 1346930 1314648 1288760 1268055 1252271 1242370 1239293 1242785 1251468 1263915 1279902
57420 1279902 1300935 1329321 1366155 1410284 1459728 1514041 1574727 1643374 1720212 1804716 1896774
57409 1896774 1996483 2103189 2215589 2332881 2455311 2583283 2716008 2851008 2984547 3112189
57399 3112189 3228904 3329005 3406691 3457169 3477401 3465767 3421418 3344534 3237290 3104230
57389 3104230 2951480 2785509 2612114 2435755 2259600 2086484 1919647 1761865 1613885
57380 1613885 1474662 1343560 1221621 1110319 1009897 919475 837862 763255 692966 625043
57370 625043 560147 500584 447256 398580 352676 309487 270113 234835 202632 172314 143521
$$ packed form
57442B359420j35298j25826j15110j04618r5378q7146p8830o9907o1111n3364
57432A432832m6452l9450l2282k5888k0705j5784r901l077L492Q683J2447J5987
57420A279902K1033K8386L6834M4129M9444N4313O0686O8647P6838Q4504R2058
57409A896774R9709J06706J12400J17292J22430J27972J32725J35000J33539J27642
57399C112189J16715J00101P7686N0478K0232j1634m4349p6884j07244j33060
57389C104230j52750j65971j73395j76359j76155j73116j66837j57782j47980
57380A613885j39223j31102j21939j11302j00422r0422q1613p4607p0289o7923
57370F25043o4896n9563n3328m8676m5904m3189l9374l5278l2203l0318k8793
$$ plain form
57359 143521 116713 92495 70898 51199 32514 14414 -3322 -21180 -39266 -56448 -71245 -83901
57347 -83901 -96433 -109971 -123100 -133803 -142266 -150506 -159644 -168848 -177031 -184429 -192013 -200061 -207843
57334 -207843 -214406 -219403 -223394 -227591 -233161 -240601 -249651 -259590 -269489 -278561 -286546 -293664 -299974 -305212
57320 -305212 -309545 -314007 -319551 -325978 -332391 -338486 -344755 -351634 -359171 -367275 -375452 -382349 -386568 -388161
57306 -388161 -388586 -389046 -389724 -390806 -393094 -396964 -401514 -405601 -409200 -412991 -417070 -420857 -424005 -426633 -428915
57291 -428915 -431173 -434182 -438503 -443492 -447794 -450900 -453448 -455854 -457636 -458553 -459463 -461254 -463637 -466033 -469150
57276 -469150 -474322 -481281 -487879 -492542 -495949 -499615 -503669 -506996 -508969 -510023 -510875 -512202 -514930 -519673
57262 -519673 -525705 -531325 -535389 -537757 -538372 -537142 -534973 -533578 -533507 -533376 -531833 -529287 -526686 -523543 -518571
$$ packed form
57359A43521k6808k4218k1597j9699j8685A4414c322j7858j8086j7182j4797j2656
57347h3901j2532j3538j3129j0703q463q240r138r204q183p398p584q048p782
57334b07843o563m997l991m197n570p440r050r939r899r072p985p118o310n238
57320c05212m333m462n544o427o413o095o269o879p537q104q177o897m219j593
57306c88161m25m60o78j082k288l870m550m087l599l791m079l787l148k628k282
57291d28915k258l009m321m989m302l106k548k406j782r17r10j791k383k396l117
57276d69150n172o959o598m663l407l666m054l327j973j054q52j327k728m743
57262e19673o032n620m064k368o15J230K169J395P1J31J543K546K601L143M972
$$ plain form
57247 -518571 -511783 -504610 -498078 -492150 -486737 -482052 -477629 -472177 -464980 -456703 -448368 -440092 -431180 -420934
57233 -420934 -409110 -396077 -382744 -369799 -356834 -342861 -327947 -313564 -300761 -288600 -275220
57222 -275220 -260205 -245120 -231742 -220483 -210822 -202674 -196702 -193532 -193451 -197067 -205560 -219579 -238248
57209 -238248 -259965 -284161 -311524 -342506 -376469 -412468 -449910 -488026 -525587 -561866 -597166
57198 -597166 -631748 -664945 -696079 -725448 -753462 -779444 -802407 -822507 -840607 -856774 -870473
57187 -870473 -882092 -893048 -904276 -915499 -926048 -935482 -943501 -950091 -955783 -961016 -965574 -969421 -973578
57174 -973578 -978903 -984394 -988121 -989690 -990300 -990472 -989429 -986832 -983204 -977998 -969037 -954995 -937159 -917713
57160 -917713 -897288 -875153 -850837 -824378 -795637 -764489 -731510 -697846 -664577 -632349 -600914
$$ packed form
57247e18571O788P173O532N928N413M685M423N452P197Q277Q335Q276Q912J0246
57233d20934J1824J3033J3333J2945J2965J3973J4914J4383J2803J2161J3380
57222b75220J5015J5085J3378J1259R661Q148N972L170Q1l616q493j4019j8669
57209b38248k1717k4196k7363l0982l3963l5999l7442l8116l7561l6279l5300
57198e97166l4582l3197l1134k9369k8014k5982k2963k0100j8100j6167j3699
57187h70473j1619j0956j1228j1223j0549r434q019o590n692n233m558l847m157
57174i73578n325n491l727j569o10j72J043K597L628N206Q961J4042J7836J9446
57160i17713K0425K2135K4316K6459K8741L1148L2979L3664L3269L2228L1435
$$ plain form
57149 -600914 -568708 -533728 -495435 -455230 -414787 -374754 -335382 -297171 -259955 -222252 -182620
57138 -182620 -141244 -99298 -57238 -14603 28785 72288 115069 156624 196611 234635 270373
57127 270373 303887 335862 367482 399791 433114 467136 501283 534737 566535 596237 624203
57116 624203 650673 675028 696709 716364 735069 752810 768819 782996 795704 806402 813945 818258
57104 818258 820409 820945 819318 814997 807854 797468 783223 765024 742665 714624 678825 634342 580899
57091 580899 517107 441136 353051 254604 146668 28599 -100150 -240061 -393241 -562973
57081 -562973 -751249 -958791 -1187461 -1440288 -1718890 -2023300 -2354563 -2714981 -3105497 -3525413
57071 -3525413 -3975123 -4456548 -4970662 -5517555 -6099526 -6721388 -7387478 -8101598 -8870331
$$ packed form
57149f00914L2206L4980L8293M0205M0443M0033L9372L8211L7216L7703L9632
57138a82620M1376M1946M2060a4603B8785M3503M2781M1555L9987L8024L5738
57127B70373L3514L1975L1620L2309L3323L4022L4147L3454L1798K9702K7966
57116F24203K6470K4355K1681J9655J8705J7741J6009J4177J2708J0698P543M313
57104H18258K151N36j627m321p143j0386j4245j8199k2359k8041l5799m4483n3443
57091E80899o3792p5971q8085r8447j07936B8599a00150j39911j53180j69732
57081e62973j88276k07542k28670k52827k78602l04410l31263l60418l90516m19916
57071c525413m49710m81425n14114n46893n81971o21862o66090p14120p68733
$$ plain form
57062 -8870331 -9703158 -10608938 -11595891 -12675330 -13861121 -15164437 -16593145 -18157385 -19871719
57053 -19871719 -21751511 -23812814 -26077817 -28575634 -31336469 -34390769 -37776358 -41541046
57045 -41541046 -45736548 -50416470 -55643711 -61495357 -68060834 -75445740 -83782693 -93230570
57037 -93230570 -103956870 -116124274 -129892664 -145419820 -162849721 -182299574 -203846103
57030 -203846103 -227496892 -253163501 -280672663 -309787910 -340163848 -371261006 -402390108
57023 -402390108 -432950266 -462621132 -491197929 -518124516 -542166770 -561570864 -574587535
57016 -574587535 -579977494 -577267528 -566777427 -549485869 -526754896 -499984004 -470348027
57009 -470348027 -438723834 -405771060 -372062479 -338186458 -304781537 -272490902 -241873333
$$ packed form
57062h870331q32827r05780r86953j079439j185791j303316j428708j564240j714334
57053a9871719j879792k061303k265003k497817k760835l054300l385589l764688
57045d1541046m195502m679922n227241n851646o565477p384906q336953r447877
57037i3230570j0726300j2167404j3768390j5527156j7429901j9449853k1546529
57030b03846103k3650789k5666609k7509162k9115247l0375938l1097158l1129102
57023d02390108l0560158k9670866k8576797k6926587k4042254j9404094j3016671
57016e74587535n389959K709966J0490101J7291558K2730973K6770892K9635977
57009d70348027L1624193L2952774L3708581L3876021L3404921L2290635L0617569
$$ plain form
57002 -241873333 -213341043 -187157306 -163461918 -142286916 -123567481 -107165519 -92897514
56995 -92897514 -80551642 -69900648 -60720870 -52808614 -45983007 -40083066 -34969745 -30527530
56987 -30527530 -26658406 -23275777 -20306299 -17692482 -15387836 -13350773 -11545111 -9941968
56979 -9941968 -8516504 -7244840 -6106946 -5089358 -4181415 -3370902 -2645834 -1997357 -1417538
56970 -1417538 -896802 -426747 -3161 376923 719146 1029923 1312686 1569005 1801668 2013727
56960 2013727 2205985 2378191 2531442 2666958 2783962 2881328 2960241 3023024 3070323 3101590
56950 3101590 3117259 3118346 3104506 3074011 3025219 2957866 2875104 2785540 2701244 2632207 2584221
56939 2584221 2561684 2566673 2590485 2608879 2592068 2521995 2400058 2240990 2062870 1881242 1706705
$$ packed form
57002b41873333K8532290K6183737K3695388K1175002J8719435J6401962J4268005
56995i2897514J2345872J0650994R179778P912256O825607N899941N113321M442215
56987c0527530L869124L382629K969478K613817K304646K037063J805662J603143
56979i941968J425464J271664J137894J017588R07943Q10513P25068O48477N79819
56970a417538N20736d26747c161C76923L42223L10777K82763K56319K32663K12059
56960B013727J92258J72206J53251J35516J17004R7366P8913O2783M7299L1267
56950C101590J5669J087j3840l0495m8792o7353q2762q9564q4296o9037m7986
56939B584221k2537M989K3812J8394j6811p0073j21937j59068j78120j81628j74537
$$ plain form
56928 1706705 1544327 1395507 1260700 1139988 1032243 935714 849233 771498 699953 632178
56918 632178 567915 508041 451960 397885 345546 296984 254566 219432 191677 170690 155318
56907 155318 144729 139077 138652 143010 151786 165492 184250 206455 230125 255066 282331 311904
56895 311904 342095 370659 395152 412820 421942 423507 420411 415018 408356 401158 394239 387888 382044
56882 382044 377204 374281 373755 375845 381182 390242 402211 415509 429546 445252 463950 486314 512015
56869 512015 539299 564723 584069 593922 592645 580618 560149 534604 506924 478983 452217 427748
56857 427748 405444 384142 363722 345995 332442 321976 312117 301774 291788 283411 277375 273799
56845 273799 271781 269612 266504 263659 262687 263716 266126 270227 276662 284780 293243 301888 311513 322103
$$ packed form
56928A706705j62378j48820j34807j20712j07745r6529q6481p7735p1545o7775
56918F32178o4263n9874n6081n4075n2339m8562m2418l5134k7755k0987j5372
56907A55318j0589n652m25M358Q776J3706J8758K2205K3670K4941K7265K9573
56895C11904L0191K8564K4493J7668R122J565l096n393o662p198o919o351n844
56882C82044m840k923n26K090N337R060J1969J3298J4037J5706J8698K2364K5701
56869E12015K7284K5424J9346R853j277j2027k0469k5545k7680k7941k6766k4469
56857D27748k2304k1302k0420j7727j3553j0466r859j0343r986q377o036l576
56845B73799k018k169l108k845r72J029K410M101O435Q118Q463Q645R625J0590
$$ plain form
56831 322103 332849 343713 355473 368177 381000 393595 406208 418357 428747 436652 442281 445754
56819 445754 447000 446690 446023 445401 444604 444370 446352 451136 457662 465251 475016 488480 505755 525853 548104
56804 548104 572541 599561 630002 665222 706172 751997 799470 843728 879887 904603 916668
56793 916668 916452 905346 885850 861394 835154 809147 784863 764208 748996 739866 736472 738461
56781 738461 745595 757467 774230 797371 828740 868890 917171 972925 1035173 1100915 1164759 1220316
56769 1220316 1261386 1282642 1281389 1259555 1222968 1178014 1129356 1080385 1034079 992445 956056
56758 956056 924972 899637 880519 867563 860529 859413 864312 875407 893283 918447 950215 986585
56746 986585 1025219 1063570 1097771 1122587 1133596 1129298 1110938 1081082 1042992 1000561 957490 916074
$$ packed form
56831C22103J0746J0864J1760J2704J2823J2595J2613J2149J0390P905N629L473
56819D45754J246l10o67o22p97k34J982M784O526P589R765J3464J7275K0098K2251
56804E48104K4437K7020L0441L5220M0950M5825M7473M4258L6159K4716J2065
56793I16668k16j1106j9496k4456k6240k6007k4284k0655j5212r130l394J989
56781G38461P134J1872J6763K3141L1369M0150M8281N5754O2248O5742O3844N5557
56769A220316M1070K1256j253k1834l6587m4954m8658m8971m6306m1634l6389
56758I56056l1084k5335j9118j2956p034j116M899J1095J7876K5164L1768L6370
56746I86585L8634L8351L4201K4816J1009m298j8360k9856l8090m2431m3071m1416
$$ plain form
56734 916074 877011 840398 806774 777312 753168 734644 721013 711374 705609 704334 708137 717181
56722 717181 731158 748856 767834 785342 799763 810637 817170 817517 809959 794315 771905 744580
56710 744580 714281 683152 653336 626281 602347 581262 562963 547682 535105 523947 513156
56699 513156 503399 496492 493166 492199 491896 491282 489492 485551 479919 475045 472874 472476 471570 469679 468196
56684 468196 467769 467380 465963 463368 459665 454921 449876 445675 442787 441061 440470 440552 439691 436651 432581 429649
56668 429649 427880 425370 421680 418651 417418 416924 416149 415545 415231 414033 411753 410350 411181 412804 413227 412717
56652 412717 412547 412543 412034 411903 413259 414906 414634 412675 411520 412374 413960 414994 415795 417047 418820 421354
56636 421354 425150 429512 432474 433102 432828 433610 435644 437629 438475 437905 436010 433265 430707 429188 428319 426797
$$ packed form
56734I16074l9063l6613l3624k9462k4144j8524j3631r639n765j275L803R044
56722G17181J3977J7698J8978J7508J4421J0874O533L47p558j5644k2410k7325
56710G44580l0299l1129k9816k7055k3934k1085j8299j5281j2577j1158j0791
56699E13156r757o907l326r67l03o14j790l941n632m874k171l98r06j891j483
56684D68196m27l89j417k595l703m744n045m201k888j726n91Q2q61l040m070k932
56668D29649j769k510l690l029j233m94p75o04l14j198k280j403Q31J623M23n10
56652D12717j70mn09j31J356J647k72j959j155Q54J586J034Q01J252J773K534
56636D21354L796M362K962O28k74P82K034J985Q46n70j895k745k558j519q69j522
$$ plain form
56620 426797 424030 421055 419458 419520 419908 419321 417918 416646 415684 414456 412923 411599 410077 406977 402158
56605 402158 397876 396602 398345 401056 403067 404069 404354 404340 404606 405284 405634 405212 405078 406622 409363 411214
56589 411214 411003 409570 408344 408097 409349 412651 417751 423305 428097 432050 435710 439328 442788 445894 448355
56574 448355 449762 449812 448344 445381 441482 437747 434776 432004 428912 426381 425570 425760 425042 423294 422622 424049
56558 424049 425596 424854 422092 419215 416778 413923 410766 408809 408708 409222 408904 407685 406091 403800 399884
56543 399884 394084 387223 380487 374645 369781 365360 360632 355387 350440 347201 346512 347792 349424 350168 350206
56528 350206 350601 351773 352920 353159 352898 353602 356313 360718 365614 369975 373575 376888 380535 384722 389237
56513 389237 393998 399334 405433 411706 417234 421915 426751 432775 439950 447350 454311 461114 468592 477148
$$ packed form
56620D26797k767k975j597O2L88n87j403j272r62j228j533j324j522l100m819
56605D02158m282j274J743K711K011J002K85j4K66O78L50m22j34J544K741J851
56589D11214k11j433j226k47J252L302N100N554M792L953L660L618L460L106K461
56574D48355J407N0j468k963l899l735k971k772l092k531q11J90p18j748o72J427
56558D24049J547p42k762k877k437k855l157j957j01N14l18j219j594k291l916
56543C99884n800o861o736n842m864m421m728n245m947l239o89J280J632P44L8
56528C50206L95J172J147K39k61P04K711M405M896M361L600L313L647M187M515
56513C89237M761N336O099O273N528M681M836O024P175P400O961O803P478Q556
$$ plain form
56499 477148 486225 494847 502779 510925 520159 529884 538446 545239 551713 559594 568493 576103 580643 582245
56485 582245 581943 580352 577849 575134 572647 569814 565705 560288 554257 547808 540372 531718 522553 513828
56471 513828 506036 499383 493981 489480 485142 480780 477167 474890 473121 470259 465822 461090 457645 455551
56457 455551 453317 449661 445082 441396 439658 438831 436853 432821 427658 422811 419032 416576 415666 416063 416578
56442 416578 415725 412994 409300 406304 405300 406295 407816 407973 406117 403337 401198 400371 400580 401267 401819 401689
56426 401689 400984 400676 401697 404062 407221 410863 414883 419105 423671 429135 435319 440553 443257 444151 445826
56411 445826 450075 456599 464215 472030 479119 484485 488248 492005 497064 502884 508109 512627 517681 524131
56397 524131 531559 539111 546421 553381 559604 564554 568039 570221 571223 570942 569340 566775 563813 560674
$$ packed form
56499D77148R077Q622P932Q146R234R725Q562O793O474P881Q899P610M540J602
56485E82245l02j591k503k715k487k833m109n417o031o449p436q654r165q725
56471E13828p792o653n402m501m338m362l613k277j769k862m437m732l445k094
56457D55551k234l656m579l686j738q27j978m032n163m847l779k456r10L97N15
56442D16578q53k731l694k996j004R95J521J57j856k780k139q27K09O87N52j30
56426D01689p05l08J021K365L159L642M020M222M566N464O184N234K704Q94J675
56411D45826M249O524P616P815P089N366L763L757N059N820N225M518N054O450
56397E24131P428P552P310O960O223M950L485K182J002k81j602k565k962l139
$$ plain form
56383 560674 557104 552984 548865 545512 542890 539955 535613 529716 523096 516829 511576 507336 503643 500014
56369 500014 496337 492822 489620 486576 483285 479355 474803 470381 467302 466205 466392 466395 465456 464202 463806 464611
56353 464611 465652 465458 463331 459883 456314 453279 450693 448473 446873 445904 445125 444475 444749 446520 448998
56338 448998 450754 451429 451987 453398 455818 459017 462845 467061 471207 474791 477269 478108 477437 476454 476438 477495
56322 477495 478967 480820 483576 486943 489625 490731 490460 489319 487781 486855 487644 489719 491157 491012 490750
56307 490750 492373 496010 500303 504309 507977 511335 514349 517226 520010 522251 523799 525378 527515 529549
56293 529549 530757 531959 534742 539354 544603 549682 554773 559671 563165 564444 564461 565368 568832 574837 581639
56278 581639 587029 590257 592618 595782 600050 605045 611250 619297 628101 635691 642219 650108 660413 670949
$$ packed form
56383E60674l570m120m119l353k622k935m342n897o620o267n253m240l693l629
56369E00014l677l515l202l044l291l930m552m422l079j097J87Lr39j254l96Q05
56353D64611J041j94k127l448l569l035k586k220j600r69p79o50K74J771K478
56338D48998J756O75N58J411K420L199L828M216M146L584K478Q39o71r83j6J057
56322D77495J472J853K756L367K682J106k71j141j538r26P89K075J438j45k62
56307D90750J623L637M293M006L668L358L014K877K784K241J548J579K137K034
56293E29549J208J202K783M612N249N079N091M898L494J279J7R07L464O005O802
56278E81639N390L228K361L164M268M995O205Q047Q804P590O528P889J0305J0536
$$ plain form
56264 670949 679494 687274 697222 709670 721936 732021 740623 749178 757840 766363 775527 786325 798535
56251 798535 811258 824351 838055 851373 862183 869407 874254 878836 884185 890128 896374 902723 908381
56238 908381 912162 914003 915803 920143 928076 938435 949308 959980 971357 984728 1000389 1017570
56226 1017570 1035524 1054440 1075303 1099094 1126145 1155966 1187545 1220164 1254253 1291230 1332130
56215 1332130 1376543 1423314 1472181 1524300 1581199 1643734 1712125 1786626 1867884 1956700 2053411
56204 2053411 2157502 2268363 2386845 2515512 2656526 2809596 2972915 3145827 3329307
56195 3329307 3523829 3728201 3940852 4160673 4385651 4611861 4835034 5052256 5261003
56186 5261003 5457258 5635873 5792369 5923328 6025685 6097191 6137595 6148269 6130822 6087191
$$ packed form
56264F70949Q545P780R948J2448J2266J0085Q602Q555Q662Q523R164J0798J2210
56251G98535J2723J3093J3704J3318J0810P224M847M582N349N943O246O349N658
56238I08381L781J841J800M340P933J0359J0873J0672J1377J3371J5661J7181
56226A017570J7954J8916K0863K3791K7051K9821L1579L2619L4089L6977M0900
56215A332130M4413M6771M8867N2119N6899O2535O8391P4501Q1258Q8816R6711
56204B053411J04091J10861J18482J28667J41014J53070J63319J72912J83480
56195C329307J94522K04372K12651K19821K24978K26210K23173K17222K08747
56186E261003J96255J78615J56496J30959J02357P1506M0404J0674j7447m3631
$$ plain form
56176 6087191 6020834 5936210 5836650 5723915 5600166 5469095 5334213 5196821 5056488 4913112
56166 4913112 4767805 4622002 4476295 4330208 4182886 4034018 3884112 3733914 3583871
56157 3583871 3434499 3286921 3142367 3001267 2863533 2729812 2601790 2481092 2368334
56148 2368334 2263397 2166031 2075943 1992638 1915493 1843923 1777573 1716534 1661177 1611479 1566715
56137 1566715 1526143 1489590 1456918 1427350 1399972 1374512 1350887 1328458 1306754 1286670 1269812
56126 1269812 1256626 1246177 1237764 1231641 1228025 1226449 1226423 1227839 1230572 1234643 1240901 1250445 1263068 1277346
56112 1277346 1292597 1309562 1328648 1348787 1368863 1389231 1410797 1433330 1455717 1477369 1498452
56101 1498452 1519028 1538759 1557280 1574332 1589722 1603595 1616511 1629138 1642307 1657501 1676432
$$ packed form
56176F087191o6357q4624r9560j12735j23749j31071j34882j37392j40333j43376
56166D913112j45307j45803j45707j46087j47322j48868j49906j50198j50043
56157C583871j49372j47578j44554j41100j37734j33721j28022j20698j12758
56148B368334j04937r7366r0088q3305p7145p1570o6350o1039n5357m9698m4764
56137A566715m0572l6553l2672k9568k7378k5460k3625k2429k1704k0084j6858
56126A269812j3186j0449q413o123l616j576k6J416K733M071O258R544J2623J4278
56112A277346J5251J6965J9086K0139K0076K0368K1566K2533K2387K1652K1083
56101A498452K0576J9731J8521J7052J5390J3873J2916J2627J3169J5194J8931
$$ plain form
56090 1676432 1699598 1725969 1754779 1787108 1825027 1869481 1919711 1974626 2034363 2100593 2175460
56079 2175460 2260130 2354463 2458499 2573935 2703286 2847475 3004810 3171940 3344469 3516494
56069 3516494 3681226 3833305 3970313 4092197 4200431 4297868 4387536 4469940 4541920 4598614
56059 4598614 4635839 4650632 4641548 4610096 4561062 4499869 4429597 4350623 4261789 4160888 4045270
56048 4045270 3913737 3767818 3610806 3446614 3280447 3119099 2968611 2831811 2709012
56039 2709012 2600221 2505322 2423003 2351369 2289475 2236896 2192089 2152560 2116598 2083695 2053486
56028 2053486 2025500 1999861 1977112 1957302 1940088 1925517 1913748 1904204 1895884 1888423 1882213 1877816
56016 1877816 1875861 1876846 1880284 1884714 1889455 1895674 1904862 1917045 1931381 1947417 1964528 1981286 1997070
$$ packed form
56090A676432K3166K6371K8810L2329L7919M4454N0230N4915N9737O6230P4867
56079B175460Q4670R4333J04036J15436J29351J44189J57335J67130J72529J72025
56069C516494J64732J52079J37008J21884J08234R7437Q9668Q2404P1980N6694
56059D598614L7225J4793r084l1452m9034o1193p0272p8974q8834j00901j15618
56048D045270j31533j45919j57012j64192j66167j61348j50488j36800j22799
56039B709012j08791r4899q2319p1634o1894n2579m4807l9529l5962l2903l0209
56028B053486k7986k5639k2749j9810j7214j4571j1769r544q320p461o210m397
56016A877816j955R85L438M430M741O219R188J2183J4336J6036J7111J6758J5784
$$ plain form
56003 1997070 2013519 2032708 2054478 2077264 2100813 2126205 2153572 2181738 2209959 2238432 2267317
55992 2267317 2296924 2328641 2363929 2402494 2442909 2484747 2528554 2574127 2620732 2668838 2719815
55981 2719815 2773935 2830340 2888867 2950163 3014143 3080131 3148532 3220582 3296455 3375335 3457348
55970 3457348 3543715 3635053 3731249 3832948 3941385 4056606 4177464 4303389 4434740 4571788
55960 4571788 4714972 4865726 5025235 5192775 5366945 5547794 5735737 5929437 6127347
55951 6127347 6330639 6541925 6761639 6988480 7222995 7467782 7724667 7994704 8280597
55942 8280597 8585711 8910777 9254625 9617742 10001798 10406415 10830617 11277459 11753097
55933 11753097 12261374 12803690 13384183 14009963 14685375 15410644 16186843 17017141 17902248
$$ packed form
56003A997070J6449J9189K1770K2786K3549K5392K7367K8166K8221K8473K8885
55992B267317K9607L1717L5288L8565M0415M1838M3807M5573M6605M8106N0977
55981B719815N4120N6405N8527O1296O3980O5988O8401P2050P5873P8880Q2013
55970C457348Q6367R1338R6196J01699J08437J15221J20858J25925J31351J37048
55960D571788J43184J50754J59509J67540J74170J80849J87943J93700J97910
55951F127347K03292K11286K19714K26841K34515K44787K56885K70037K85893
55942H280597L05114L25066L43848L63117L84056M04617M24202M46842M75638
55933A1753097N08277N42316N80493O25780O75412P25269P76199Q30298Q85107
$$ plain form
55924 17902248 18840137 19832056 20883780 21999245 23178264 24422875 25741275 27143766
55916 27143766 28640131 30243205 31969738 33835178 35852437 38037633 40411905 42996892
55908 42996892 45816670 48909034 52331202 56153810 60454780 65316159 70813181 77001363
55900 77001363 83924787 91643447 100247888 109852955 120599358 132670873 146295877 161726905
55892 161726905 179236120 199131015 221740544 247368587 276269212 308574621 343935891
55885 343935891 380823350 415980200 444774645 462629928 466765384 457142749 436131640
55878 436131640 407322169 374295479 339889603 306024104 273864157 244068993 216972955
55871 216972955 192680149 171125928 152140574 135505025 120984120 108344446 97364789
$$ packed form
55924A7902248R37889R91919J051724J115465J179019J244611J318400J402491
55916B7143766J496365J603074J726533J865440K017259K185196K374272K584987
55908D2996892K819778L092364L422168L822608M300970M861379N497022O188182
55900G7001363O923424P718660Q604441R605067J0746403J2071515J3625004J5431028
55892A61726905J7509215J9894895K2609529K5628043K8900625L2305409L5361270
55885C43935891L6887459L5156850K8794445J7855283M135456r622635k1011109
55878D36131640k8809471l3026690l4405876l3865499l2159947k9795164k7096038
55871B16972955k4292806k1554221j8985354j6635549j4520905j2639674j0979657
$$ plain form
55864 97364789 87836436 79557951 72338757 66011499 60437315 55500086 51102633 47168833
55856 47168833 43640487 40467223 37602527 35008907 32658815 30526840 28585739 26811861
55848 26811861 25188403 23700134 22329844 21063108 19891890 18809797 17807102 16873323
55840 16873323 16001494 15187073 14425391 13712653 13046734 12424461 11840075 11288218 10766398
55831 10766398 10273111 9805884 9362668 8943047 8546687 8172405 7819456 7487320 7173410
55822 7173410 6873419 6584677 6306861 6039105 5779473 5527960 5286730 5056291 4834495
55813 4834495 4620381 4415687 4221225 4035149 3856653 3688286 3532532 3388788 3255702
55804 3255702 3133771 3023374 2922629 2829550 2744500 2668591 2601432 2542014 2489640 2442342 2396492
$$ packed form
55864I7364789r528353q278485p219194o327258n574184m937229m397453l933800
55856D7168833l528346l173264k864696k593620k350092k131975j941101j773878
55848B6811861j623458j488269j370290j266736j171218j082093j002695r33779
55840A6873323q71829q14421p61682p12738o65919o22273n84386n51857n21820
55831A0766398m93287m67227m43216m19621l96360l74282l52949l32136l13910
55822G173410k99991k88742k77816k67756k59632k51513k41230k30439k21796
55813D834495k14114k04694j94462j86076j78496j68367j55754j43744j33086
55804C255702j21931j10397j00745r3079q5050p5909o7159n9418n2374m7298m5850
$$ plain form
55793 2396492 2349729 2302208 2253482 2200942 2143657 2085326 2030686 1980669 1933558 1889026 1848269
55782 1848269 1811448 1777793 1747437 1720796 1696779 1673714 1651470 1630938 1612052 1593834 1575623
55771 1575623 1556825 1536390 1513888 1490081 1465306 1438653 1410010 1381183 1353326 1325121 1295532
55760 1295532 1266588 1240853 1217563 1194091 1170249 1148156 1128303 1108703 1088102 1067517 1048128
55749 1048128 1029690 1011758 995044 981018 970994 965386 962893 960879 957817 954905 954061 954970 955618
55736 955618 955021 953554 950936 945861 937818 927658 916226 903827 891105 879132 868468 859104 851115
55723 851115 844181 836871 827917 818150 809787 803768 799045 794320 788954 782194 773065 761488 748257 733743
55709 733743 717865 701490 686454 673691 662535 652341 643637 636953 631450 625489 618025 608870 598033
$$ packed form
55793B396492m6763m7521m8726n2540n7285n8331n4640n0017m7111m4532m0757
55782A848269l6821l3655l0356k6641k4017k3065k2244k0532j8886j8218j8211
55771A575623j8798k0435k2502k3807k4775k6653k8643k8827k7857k8205k9589
55760A295532k8944k5735k3290k3472k3842k2093j9853j9600k0601k0585j9389
55749A048128j8438j7932j6714j4026j0024n608k493k014l062k912q44R09O48
55736I55618n97j467k618n075q043j0160j1432j2399j2722j1973j0664r364p989
55723H51115o934p310q954r767q363o019m723m725n366o760r129j1577j3231j4514
55709G33743j5878j6375j5036j2763j1156j0194q704o684n503n961p464r155j0837
$$ plain form
55696 598033 585454 571369 556733 543110 531722 522238 512893 502255 490507 478584 466814 455248
55684 455248 444666 436021 429084 422801 416820 411570 406835 401531 395222 388972 384300 381914 381606 382701
55670 382701 384293 385517 385866 385146 383338 380742 377763 374095 368670 361074 352467 344366 337068 330142 323720
55655 323720 318070 312542 306569 301512 299765 301816 305589 309136 312537 316650 321352 326014 330755 336118
55641 336118 341841 346746 349831 351115 351498 351935 352617 353000 352747 352412 352853 354341 356756 360229 364770 369612
55625 369612 373904 378001 383075 389398 395877 401401 405780 409227 411891 414199 416735 419245 420422 419213
55611 419213 415971 412044 408724 406831 406687 407954 409740 411265 412359 413309 414477 416136 418409 421240 424534
55596 424534 428187 431819 434702 436253 436407 435249 432712 429004 424928 421218 417944 415006 412668 410804
$$ packed form
55696E98033j2579j4085j4636j3623j1388r484r345j0638j1748j1923j1770j1566
55684D55248j0582q645o937o283n981n250m735n304o309o250m672k386l08J095
55670C82701J592J224L49p20j808k596k979l668n425p596q607q101p298o926o422
55655C23720n650n528n973n057j747K051L773L547L401M113M702M662M741N363
55641C36118N723M905L085J284L83M37O82L83k53l35M41J488K415L473M541M842
55625C69612M292M097N074O323O479N524M379L447K664K308K536K510J177j209
55611D19213l242l927l320j893j44J267J786J525J094R50J168J659K273K831L294
55596D24534L653L632K883J551J54j158k537l708m076l710l274k938k338j864
$$ plain form
55582 410804 408103 403046 395493 386458 376575 365768 354268 342829 331895 321491 312087 304488 298479
55569 298479 292373 284421 274273 262922 251763 241927 234020 228043 223504 219574 215257 210017 204547
55556 204547 200279 197725 195952 194193 192945 192648 192360 191017 189074 187424 185580 182797 180327 180287 182393
55541 182393 184060 183937 183147 182535 181015 177727 173905 171253 169875 169034 168672 168935 169279 169241 169310 170069 171253
55524 171253 172434 173590 174206 173036 169886 166556 164776 164149 163382 162535 162512 163121 163406 163507 164476 166337 167903
55507 167903 168605 169121 169900 170420 170379 170529 171615 173216 174355 174849 175415 176548 177763 178089 177065 175002 172291
55490 172291 168951 165298 162559 161924 163012 164263 164987 165979 167779 169529 170256 170223 170110 169935 169897 171297 175100
55473 175100 180207 184739 188628 193281 198736 203015 204740 204852 205013 205642 206501 208085 211034 214587 216917
$$ packed form
55582D10804k701n057p553r035r883j0807j1500j1439j0934j0404r404p599o009
55569B98479o106p952j0148j1351j1159r836p907n977m539l930m317n240n470
55556B04547m268k554j773j759j248k97k88j343j943j650j844k783k470m0K106
55541A82393J667j23p90o12j520l288l822k652j378q41l62K63L44l8O9P59J184
55524A71253J181J156O16j170l150l330j780o27p67q47k3O09K85J01R69J861J566
55507A67903P02N16P79N20m1J50J086J601J139M94N66J133J215L26j024k063k711
55490A72291l340l653k739o35J088J251P24R92J800J750P27l3j13j75l8J400L803
55473A75100N107M532L889M653N455M279J725J12J61O29Q59J584K949L553K330
$$ plain form
55458 216917 217121 216031 214893 213925 212454 209982 206513 201905 195420 186369 175265 164105 155168 149383
55444 149383 145803 142627 138705 134070 129217 124167 118588 112785 108015 105318 104256 103309 101449 98799
55430 98799 95836 92771 90025 88560 88992 90556 91503 90647 88308 85757 83939 82700 81238 79264 77641
55415 77641 77707 80046 84026 88230 91050 91365 89403 86805 85094 84140 82849 81169 80224 80228 79512 76438 71530
55398 71530 66883 63933 62413 61094 58974 56074 53589 52968 54367 56309 57174 56737 56008 56024 57130 58969
55382 58969 60756 61869 62372 62681 62782 62348 61603 61235 61358 61463 61494 61841 62171 61693 60946 61563 63509 64449
55364 64449 63231 62216 64151 68059 70505 70198 68986 68693 69346 70583 72517 74591 75441 74694 73615 73435
55348 73435 74262 75856 78039 79910 80236 79346 79219 80884 82976 83783 83551 83660 84527 85491 86058 86105 85343 83639
$$ packed form
55458B16917K04j090j138r68j471k472l469m608o485r051j1104j1160q937n785
55444A49383l580l176l922m635m853n050n579n803m770k697j062r47j860k650
55430I8799k963l065k746j465M32J564R47q56k339k551j818j239j462j974j623
55415G7641O6K339L980M204K820L15j962k598j711r54j291j680r45Mp16l074m908
55398G1530m647k950j520j319k120k900k485o21J399J942Q65m37p29J6J106J839
55382E8969J787J113N03L09J01m34p45l68J23J05L1L47L30m78p47O17J946R40
55364F4449j218j015J935L908K446l07j212k93O53J237J934K074Q50p47j079j80
55348G3435Q27J594K183J871L26q90j27J665K092Q07k32J09Q67R64N67M7p62j704
$$ plain form
55330 83639 81650 80306 79793 79593 79264 78692 78001 77663 78263 79634 80709 80795 80469 80630 81141 81180 80593 80114
55312 80114 80308 80782 80378 78002 73751 69493 67645 68781 71031 72427 73094 74269 75928 76667 75628 73226
55296 73226 70061 66414 63007 61065 61166 62889 65764 69484 72848 73932 72341 70289 70255 72059 73448
55281 73448 73196 72276 71933 71960 71487 70524 69825 69605 69160 67743 65370 62685 60289 58334 56610 54986 53671
55264 53671 52928 52576 52052 51012 49687 48614 48239 48738 49817 50644 50532 49917 50120 51710 53648 54608 54655
55247 54655 54843 55553 56247 56765 57666 58963 59504 58316 55995 54212 54269 56462 60182 63911 65656 64431
55231 64431 61405 58953 58422 59157 59720 59561 59254 59403 59786 59847 59876 61132 64298 68197 70801 71479 71312 71080
55213 71080 70132 67947 65652 64693 64643 63790 61826 60526 61389 63728 65671 66100 64972 62552 59514 57503
$$ packed form
55330H3639j989j344n13k00l29n72o91l38O00J371J075Q6l26J61N11L9n87m79
55312H0114J94M74m04k376m251m258j848J136K250J396O67J175J659P39j039k402
55296G3226l165l647l407j942J01J723K875L720L364J084j591k052l4J804J389
55281G3448k52r20l43K7m73r63o99k20m45j417k373k685k396j955j724j624j315
55264E3671p43l52n24j040j325j073l75M99J079Q27j12o15K03J590J938R60M7
55247E4655J88P10O94N18R01J297N41j188k321j783N7K193L720L729J745j225
55231F4431l026k452n31P35N63j59l07J49L83O1K9J256L166L899K604O78j67k32
55213G1080r48k185k295r59n0q53j964j300Q63K339J943M29j128k420l038k011
$$ plain form
55197 57503 58361 62223 66903 69818 70420 70329 71032 71955 71121 67402 61691 56048 52315 51388 52991 55714
55181 55714 57876 58888 59459 60219 60675 60049 58699 58027 59141 62034 65751 68852 70085 69328 67805 66784
55165 66784 66240 65271 63607 61980 61127 61156 61844 62909 64003 65073 66725 69438 72391 73924 73480 72373
55149 72373 72209 73189 74413 75269 75779 75889 75215 73660 71815 70494 70038 70245 70812 71525 72034 71878 71064 70307
55131 70307 70188 70268 69762 69013 69284 70814 72130 71972 70963 70389 70115 68993 66950 65347 65222 66238 67409
55114 67409 67950 67371 65779 64244 63857 64185 63635 61698 59843 59715 61327 63619 65960 68158 69597 69391
55098 69391 67468 64744 62095 59662 57405 55934 56244 58491 61452 63663 64907 65928 66776 66443 64543
55083 64543 62335 61239 61181 61371 61861 63020 64104 64034 63441 64204 66825 69763 71637 72613 73209 73369 73443 74570
$$ packed form
55197E7503Q58L862M680K915O02r1P03R23q34l719n711n643l733r27J603K723
55181E5714K162J012N71P60M56o26j350o72J114K893L717L101J233p57j523j021
55165F6784n44r69j664j627q53K9O88J065J094J070J652K713K953J533m44j107
55149G2373j64R80J224Q56N10J10o74j555j845j321m56K07N67P13N09j56q14p57
55131G0307j19Q0n06p49K71J530J316j58j009n74k74j122k043j603j25J016J171
55114F7409N41n79j592j535l87L28n50j937j855j28J612K292K341K198J439k06
55098F9391j923k724k649k433k257j471L10K247K961K211J244J021Q48l33j900
55083F4543k208j096n8J90M90J159J084p0n93P63K621K938J874R76N96J60P4J127
$$ plain form
55065 74570 76960 78903 78740 77075 76052 76987 79557 82692 85349 86943 87917 89589 92681 96192 98282
55050 98282 97989 95775 92877 90494 89117 88255 87332 87032 88877 93076 97752 100948 102431 102860 102363 101092
55034 101092 100220 100858 102437 103500 103873 104773 106868 109405 111366 112464 112829 112498 111554 110325 109430 109777
55018 109777 112038 115479 117886 117610 115442 113592 113093 113252 113514 114492 116714 119327 120791 120461 119048 117793
55002 117793 117419 117658 117590 116549 114786 113233 112706 113326 114365 114666 113741 112665 113178 115494 117671 117725 115728
54985 115728 113139 110819 108742 107096 106276 105868 104937 103671 103815 106877 112320 117799 121062 121705 121322 121818
54969 121818 123432 124855 125371 125922 127373 128695 128118 125512 122355 119688 117505 115987 115873 117313 119470
54954 119470 121466 122800 122922 121644 120150 120289 122409 124859 125982 125593 124362 123014 122568 123922 126441
$$ packed form
55065G4570K390J943j63j665j023R35K570L135K657J594R74J672L092L511K090
55050I8282k93k214k898k383j377q62r23l00J845M199M676L196J483M29m97j271
55034A01092q72O38J579J063L73R00K095K537J961J098L65l31r44j229q95L47
55018A09777K261L441K407k76k168j850m99J59K62R78K222K613J464l30j413j255
55002A17793l74K39o8j041j763j553n27O20J039L01r25j076N13K316K177N4j997
54985A15728k589k320k077j646q20m08r31j266J44L062N443N479L263O43l83M96
54969A21818J614J423N16N51J451J322n77k606l157k667k183j518j14J440K157
54954A19470J996J334J22j278j494J39K120K450J123l89j231j348m46J354K519
$$ plain form
54939 126441 128044 127641 126540 126626 127988 129276 129562 128816 127223 125204 123761 123642 124233 124109 122684 120718
54923 120718 119356 119233 120328 122007 123297 123735 123952 125078 127586 130947 134145 136264 137038 137287 138429
54908 138429 140972 143825 145663 146541 147375 148299 148735 149213 151816 158047 166815 175339 181907 187186 192900
54893 192900 199870 207635 215664 224311 234332 245748 257628 269077 280176 291773 304477 317834
54881 317834 330321 340026 345535 346323 342484 334374 322854 309527 296096 283270 270646 257755 244784
54868 244784 232189 220235 209157 199321 190779 183061 175859 169726 165705 164386 165462 167885 170179
54855 170179 171142 170841 170775 172525 176277 181068 186309 192494 200321 209721 219975 230416 240596 250036
54841 250036 258408 266144 274406 283953 293948 302226 306867 307249 303615 296275 285799 273525 261046 249010
$$ packed form
54939A26441J603m03j101Q6J362J288K86p46j593k019j443j19N91j24j425j966
54923A20718j362j23J095J679J290M38K17J126K508L361L198K119P74K49J142
54908A38429K543K853J838Q78Q34R24M36M78K603O231Q768Q524O568N279N714
54893A92900O970P765Q029Q647J0021J1416J1880J1449J1099J1597J2704J3357
54881C17834J2487R705N509P88l839q110j1520j3327j3431j2826j2624j2891j2971
54868B44784j2595j1954j1078r836q542p718p202o133m021j319J076K423K294
54855A70179R63l01o6J750L752M791N241O185P827R400J0254J0441J0180R440
54841B50036Q372P736Q262R547R995Q278M641L82l634p340j0476j2274j2479j2036
$$ plain form
54827 249010 236970 224467 211869 200146 190257 182603 176476 170194 162634 154692 148363 144223 140813
54814 140813 136858 132886 129955 127882 125884 124143 123429 123607 123925 124592 126544 129428 131227 130586 128573
54799 128573 127298 127421 127790 127039 124764 121358 117571 114332 112333 111442 110866 110069 109195 108376 107108 104898
54783 104898 102396 101100 101710 103319 104599 105221 105593 105794 105689 105747 106597 107712 107633 105792 103080 100327 97471
54766 97471 94852 93919 95412 97865 99352 99989 101105 102541 102818 102015 102336 105057 108672 111210 113115 116446
54750 116446 121980 128476 134404 139236 143225 146913 150868 155152 159078 162174 165247 169824 176667 185560
54736 185560 196315 208886 222362 234986 245924 256374 268237 282057 296781 311198 324795
54725 324795 337203 347423 354047 356169 354019 348702 341316 332362 322092 311206 300722 290985 281353
$$ packed form
54827B49010j2040j2503j2598j1723r889p654o127o282p560p942o329m140l410
54814A40813l955l972k931k073j998j741p14J78L18O67J952K884J799o41k013
54799A28573j275J23L69p51k275l406l787l239j999q91n76p97q74q19j268k210
54783A04898k502j296O10J609J280O22L72K01j05N8Q50J115p9j841k712k753k856
54766I7471k619r33J493K453J487O37J116J436K77q03L21K721L615K538J905L331
54750A16446N534O496N928M832L989L688L955M284L926L096L073M577O843Q893
54736A85560J0755J2571J3476J2624J0938J0450J1863J3820J4724J4417J3597
54725C24795J2408J0220O624K122k150n317p386q954j0270j0886j0484r737r632
$$ plain form
54712 281353 271306 261625 254002 249511 247689 247003 245932 243855 241353 239614 239214 239668 240474 242195 245764
54697 245764 250925 256384 261754 268421 277990 290503 304732 319579 334592 349686 365185 381798
54685 381798 399746 418027 435201 450763 465057 477942 488201 494275 495143 490690 481954 470786
54673 470786 458405 444191 426719 406062 384265 363486 344609 327808 313196 300189 287214
54662 287214 273184 258908 246353 236758 229910 224764 220141 215295 210466 206561 203742 200850 196926
54649 196926 192736 189762 188021 186028 182919 179441 176609 174399 172311 170485 169655 170363 172562 175646 178570
54634 178570 180400 181101 181498 182177 182758 182533 181401 179752 177773 175438 173174 171984 172647 174948 177861 180496
54618 180496 182741 184958 187120 188586 189002 189240 190929 194837 200023 204805 208380 211290 214519 218515 223096
$$ packed form
54712B81353j0047r681p623m491j822o86j071k077k502j739m00M54Q06J721L569
54697B45764N161N459N370O667R569J2513J4229J4847J5013J5094J5499J6613
54685C81798J7948J8281J7174J5562J4294J2885J0259O074Q68m453q736j1168
54673D70786j2381j4214j7472k0657k1797k0779j8877j6801j4612j3007j2975
54662B87214j4030j4276j2555r595o848n146m623m846m829l905k819k892l924
54649A96926m190k974j741j993l109l478k832k210k088j826q30P08K199L084K924
54634A78570J830P01L97O79N81k25j132j649j979k335k264j190O63K301K913K635
54618A80496K245K217K162J466M16K38J689L908N186M782L575K910L229L996M581
$$ plain form
54603 223096 227978 233126 238622 244315 249687 254045 256907 258379 259313 260984 264284 269165 274984 281310
54589 281310 288026 294662 300279 304429 307791 311382 315558 320447 326930 336135 347921 360813 373808
54576 373808 387404 402425 418707 435717 453789 473628 494632 514648 531594 544676 553824 558637
54564 558637 558398 552815 542281 527575 509707 489963 469707 449909 430933 412785 395465 379114
54552 379114 363987 350292 337943 326527 315723 305824 297593 291368 286465 281755 276807 272146 268333
54539 268333 265116 261697 257578 252803 247442 241204 233794 225593 217853 211961 208222 205405 201846 197142
54525 197142 192408 188641 185328 181252 176324 171797 168615 166373 164166 161808 159707 158017 156481 154920
54511 154920 153372 151918 150707 149946 149471 148543 146566 143874 141400 139698 138790 138723 139511 140482 140484 139120 137293
$$ packed form
54603B23096M882N148N496N693N372M358K862J472R34J671L300M881N819O326
54589B81310O716O636N617M150L362L591M176M889O483R205J1786J2892J2995
54576C73808J3596J5021J6282J7010J8072J9839K1004K0016J6946J3082R148M813
54564E58637k39n583j0534j4706j7868j9744k0256j9798j8976j8148j7320j6351
54552C79114j5127j3695j2349j1416j0804r899q231o225m903m710m948m661l813
54539B68333l217l419m119m775n361o238p410q201p740n892l739k817l559m704
54525A97142m734l767l313m076m928m527l182k242k207k358k101j690j536j561
54511A54920j548j454j211p61m75r28j977k692k474j702r08o7P88R71Kj364j827
$$ plain form
54494 137293 136229 136334 137175 138063 138438 138251 138275 139411 141425 143102 144140 145918 149544 154046 157699 160484
54478 160484 163660 167226 169688 170624 171750 174696 179151 184067 189406 195543 202060 208497 215544 224069
54464 224069 233461 242312 250461 259012 268459 277976 286532 293479 298065 299563 298152 294687 289499 282450
54450 282450 274116 265542 256620 246237 234621 224038 216180 209938 202930 194408 185616 177991 172176
54437 172176 168292 165981 164281 162408 160554 159278 158332 156916 154949 153296 152764 153456 155066 157249 159656
54422 159656 161974 163817 164544 163736 162220 161828 163345 165298 165715 164559 163366 162933 162741 162463 162520 162861 162643
54405 162643 161858 162112 164809 169145 172878 174713 175190 175325 175199 174138 171933 169500 168235 168719 170203 171393
54389 171393 171523 170512 168445 165340 161388 157113 153270 150643 149504 148977 147443 144179 140286 137428 136068
$$ packed form
54494A37293j064J05Q41Q88L75j87K4J136K014J677J038J778L626M502L653K785
54478A60484L176L566K462R36J126K946M455M916N339O137O517O437P047Q525
54464B24069R392Q851Q149Q551R447R517Q556O947M586J498j411l465n188p049
54450B82450q334q574q922j0383j1616j0583p858o242p008q522q792p625n815
54437A72176l884k311j700j873j854j276r46j416j967j653n32O92J610K183K407
54422A59656K318J843P27q08j516l92J517J953M17j156j193m33j92k78N7L41k18
54405A62643p85K54K697M336L733J835M77J35j26j061k205k433j265M84J484J190
54389A71393J30j011k067l105l952m275l843k627j139n27j534l264l893k858j360
$$ plain form
54374 136068 135626 135859 136973 138567 139690 140146 140662 141498 141904 141381 140538 140084 139782 139090 138261 138132 139137
54357 139137 141047 143387 145658 147400 148439 148995 149515 150609 152999 156869 161175 164315 165772 166570 168015
54342 168015 170642 174478 179373 184596 188999 192265 195366 199237 203659 207951 211980 215734 218666 220433
54328 220433 221748 223519 225527 226852 227218 226943 225817 223175 219087 214489 209980 205370 200565 196064 192190
54313 192190 188485 184240 179285 174042 169186 165431 163211 162307 161908 161190 159805 158010 156474 155694 155260
54298 155260 153999 151385 148532 147148 147606 148706 149306 149476 149964 151214 153214 155756 158430 160673 162151
54283 162151 163013 163799 165290 168324 173164 178888 183875 187185 189321 191494 194350 197491 199987 201333 202058
54268 202058 203300 205439 207288 207032 203975 198987 193314 187594 182104 177315 173719 171349 169699 168013
$$ packed form
54374A36068m42K33J114J594J123M56N16Q36M06n23q43m54l02o92q29j29J005
54357A39137J910K340K271J742J039N56N20J094K390L870M306L140J457P98J445
54342A68015K627L836M895N223M403L266L101L871M422M292M029L754K932J767
54328B20433J315J771K008J325L66k75j126k642m088m598m509m610m805m501l874
54313A92190l705m245m955n243m856l755k220r04l99p18j385j795j536p80m34
54298A55260j261k614k853j384M58J100O00J70M88J250K000K542K674K243J478
54283A62151Q62P86J491L034M840N724M987L310K136K173K856L141K496J346P25
54268B02058J242K139J849k56l057m988n673n720n490m789l596k370j650j686
$$ plain form
54254 168013 165677 162694 159783 157575 155637 152795 148627 144096 140419 137744 135329 132625 129726 127004
54240 127004 124682 122684 120624 118193 115770 114299 114239 114901 115284 115311 115684 116647 117520 117608 117007 116187 115172
54223 115172 113600 111466 109380 107948 107185 106842 107172 108888 112121 115729 118077 118495 117597 116237 114740
54208 114740 113334 112679 113302 114741 115943 116566 117368 119125 121650 124141 126042 127157 127250 126206 124628 123661
54192 123661 123902 124783 125284 124983 124168 123277 122761 123266 125217 128050 130414 131508 131851 132317 132701 131831 129114
54175 129114 125536 122852 121867 121760 121217 120122 119758 121085 123167 123907 122413 120055 118941 119796 121676 123274
54159 123274 124106 124731 126174 128915 132137 134211 134186 132457 129880 126951 124282 123012 123855 126201 128975
54144 128975 131828 134596 136234 135759 133983 132782 132553 131824 129736 127452 126480 126817 127440 127522 126472 124033
$$ packed form
54254A68013k336k983k911k208j938k842m168m531l677k675k415k704k899k722
54240A27004k322j998k060k431k423j471o0O62L83K7L73R63Q73Q8o01q20j015
54223A15172j572k134k086j432p63l43L30J716L233L608K348M18q98j360j497
54208A14740j406o55O23J439J202O23Q02J757K525K491J901J115R3j044j578r67
54192A23661K41Q81N01l01q15q91n16N05J951K833K364J094L43M66L84q70k717
54175A29114l578k684r85j07n43j095l64J327K082P40j494k358j114Q55J880J598
54159A23274Q32O25J443K741L222K074k5j729k577k929k669j270Q43K346K774
54144A28975K853K768J638m75j776j201k29p29k088k284r72L37O23Q2j050k439
$$ plain form
54128 124033 121325 120627 122780 125564 125968 123575 120504 118520 117604 117084 116694 116356 116153 116741 118785 121717
54112 121717 123958 124613 124091 122885 120773 117740 114866 113595 114445 116744 119209 120636 120552 119488 118196
54097 118196 116597 114174 111383 109605 109348 109540 109369 109825 112314 116315 119612 120670 119793 118093 116352
54082 116352 115050 114467 114240 113495 111936 110390 109796 109982 109858 108680 106761 105059 104327 104546 104893 104315 102384
54065 102384 99651 97027 94904 93096 91569 90847 91485 93354 95751 98080 100181 102108 103964 105965 108184
54050 108184 110052 110594 109602 108194 107668 108019 108183 107600 106799 106340 105984 105296 104511 104320 105096 106659 108435
54033 108435 109550 109225 107540 105554 104334 104236 105288 107479 109985 110893 108960 105426 102971 102763 103521 103558
54017 103558 102634 101490 100703 100671 101802 103859 105751 106825 107937 110393 114081 117443 119156 119214 118501 117998
$$ packed form
54128A24033k708o98K153K784M04k393l071j984r16n20l90l38k03N88K044K932
54112A21717K241O55n22j206k112l033k874j271Q50K299K465J427q4j064j292
54097A18196j599k423k791j778k57J92j71M56K489M001L297J058q77j700j741
54082A16352j302n83k27p45j559j546n94J86j24j178j919j702p32K19L47n78j931
54065A02384k733k624k123j808j527p22O38J869K397K329K101J927J856K001K219
54050A08184J868N42r92j408n26L51J64n83q01m59l56o88p85j91P76J563J776
54033A08435J115l25j685j986j220r8J052K191K506R08j933l534k455k08P58L7
54017A03558r24j144p87l2J131K057J892J074J112K456L688L362J713N8p13n03
$$ plain form
54001 117998 118339 119472 120798 122105 124151 127620 131674 134467 135190 134802 134531 134526 134338 133994 133983 134696 136371
53984 136371 139148 142661 146056 148947 151958 155731 159784 163068 165471 168026 171735 176864 183398 191375
53970 191375 200468 209828 218835 227730 237267 247814 258887 269365 278133 284838 290188 295375 301134
53957 301134 307424 313757 319389 323347 325012 324961 324764 325626 327527 329736 331584 332403 331475 328814 325625 323158
53941 323158 321132 317923 312415 305208 297898 291593 286198 280841 274957 269156 264811 262360 260347 256890
53927 256890 252046 247801 245576 244666 243554 241791 239744 237334 234155 230557 227417 224862 222145 219008
53913 219008 216299 214950 215059 216330 218579 221292 223317 223869 223556 223723 224798 225839 225679 224130 222010
53898 222010 220353 219623 219476 219296 219091 219599 221259 223407 225076 226352 228202 231005 234009 236550 238989
$$ packed form
54001A17998L41J133J326J307K046L469M054K793P23l88k71nj88l44j1P13J675
53984A36371K777L513L395K891L011L773M053L284K403K555L709N129O534P977
53970A91375R093R360R007Q895R537J0547J1073J0478Q768O705N350N187N759
53957C01134O290O333N632L958J665n1j97Q62J901K209J848Q19r28k661l189k467
53941C23158k026l209n508p207p310o305n395n357n884n801m345k451k013l457
53927B56890m844m245k225r10j112j763k047k410l179l598l140k555k717l137
53913B19008k709j349J09J271K249K713K025N52l13J67J075J041j60j549k120
53898B22010j657p30j47j80k05N08J660K148J669J276J850K803L004K541K439
$$ plain form
53883 238989 241953 245246 248314 251448 255644 261166 266953 271743 275378 278740 282760 287803 293734 300134
53869 300134 306479 312430 317993 323171 327497 330291 331519 332180 333439 335502 337616 339202 340641 342775
53855 342775 345921 349797 354318 359973 367171 375531 384201 392791 401564 410582 419119 426312 432258 437966
53841 437966 444121 450231 455160 458207 459466 459513 459069 458660 458100 456468 453085 448397 443316 437807 430936
53826 430936 422420 413268 404463 395865 387016 378267 370226 362674 355087 347880 341868 336506 329946 321324
53812 321324 311959 303696 296829 290380 283830 277636 272246 267308 262023 255922 249293 242960 237455 232316
53798 232316 226530 219885 213515 208785 205958 204265 202946 201789 200901 200423 200352 200272 199362 197027 193466 189435
53782 189435 185644 182575 180460 178974 177182 174360 170852 167785 166060 165861 166837 168261 169227 169303 168980 169043
$$ packed form
53883B38989K964L293L068L134M196N522N787M790L635L362M020N043N931O400
53869C00134O345N951N563N178M326K794J228O61J259K063K114J586J439K134
53855C42775L146L876M521N655P198Q360Q670Q590Q773R018Q537P193N946N708
53841D37966O155O110M929L047J259M7m44m09n60j632l383m688n081n509o871
53826D30936q516r152q805q598q849q749q041p552p587p207o012n362o560q622
53812C21324r365q263o867o449o550o194n390m938n285o101o629o333n505n139
53798B32316n786o645o370m730k827j693j319j157q88m78p1q0r10k335l561m031
53782A89435l791l069k115j486j792k822l508l067j725j99R76J424R66P6l23O3
$$ plain form
53766 169043 169466 169302 167702 164799 161764 160216 161336 165018 170035 175233 180218 184581 187243 187589 186779
53751 186779 186698 187682 188433 188321 188466 190131 193156 196634 200168 203703 206950 209822 212877 216543 220474 224477
53735 224477 229472 236431 244735 252716 259830 267223 275907 285143 293048 298360 301296 303081 304857 306871
53721 306871 308631 309868 311089 312940 315309 317473 318846 319072 317716 314662 310724 307108 304200 301553
53707 301553 299096 297535 297265 297529 296925 294261 288922 281314 273231 266887 262920 259994 256835 253863 252199
53692 252199 252045 252961 254811 256990 257454 254496 249624 246811 248149 251586 253705 253376 251635 249335 246701
53677 246701 244505 243782 244179 244008 242269 239506 236426 232997 229550 227504 227770 229106 229222 227450 225398
53662 225398 224897 226044 227364 227326 225515 222813 220731 220281 221245 222609 223617 224272 224965 226054 227745 229887
$$ packed form
53766A69043M23j64j600k903l035j548J120L682N017N198M985M363K662L46q10
53751A86779q1R84P51j12J45J665L025L478L534L535L247K872L055L666L931M003
53735B24477M995O959Q304P981P114P393Q684R236P905N312K936J785J776K014
53721C06871J760J237J221J851K369K164J373K26j356l054l938l616k908k647
53707C01553k457j561k70K64o04k664n339p608q083o344l967k926l159k972j664
53692B52199j54R16J850K179M64k958m872k813J338L437K119l29j741k300k634
53677B46701k196p23L97j71j739k763l080l429l447k046K66J336J16j772k052
53662B25398n01J147J320l8j811k702k082m50R64J364J008O55O93J089J691K142
$$ plain form
53646 229887 231696 232155 231093 229665 229394 230734 232811 234584 236016 237988 241237 245607 250290 254528 257956
53631 257956 260650 263332 267319 273449 280703 286531 289183 289486 289775 291336 293505 295022 295416 294913 293960
53616 293960 293403 294503 297904 302597 306516 308413 308892 309490 310959 312685 313737 314024 314029 313584 311681 307978
53600 307978 304016 302106 302949 304977 306211 306206 305800 305460 304562 302353 299195 296479 295288 295351 295559 295426 295551
53583 295551 296427 297426 297614 297174 297149 297868 298569 298786 299151 300294 301655 302084 301340 300456 300703 302488 305079 307251
53565 307251 308508 309770 312424 316569 320721 323460 324773 325616 326966 329722 334523 340736 346306 349717
53551 349717 351823 354726 359138 363925 368123 372223 377144 382945 389060 395117 401052 406895 412833 419077
53537 419077 425351 430883 435241 438899 442757 447398 452934 459242 465954 472424 477909 481816 483956 484866
$$ packed form
53646B29887J809M59j062j428k71J340K077J773J432J972L249M370M683M238L428
53631B57956K694K682L987O130P254N828K652L03K89J561K169J517L94n03r53
53616B93960n57J100L401M693L919J897M79N98J469J726J052K87Nm45j903l703
53600C07978l962j910Q43K028J234nm06l40q98k209l158k716j191O3K08j33J25
53583B95551Q76R99J88m40k5P19P01K17L65J143J361M29p44q84K47J785K591K172
53565C07251J257J262K654M145M152K739J313Q43J350K756M801O213N570L411
53551C49717K106K903M412M787M198M100M921N801O115O057N935N843N938O244
53537D19077O274N532M358L658L858M641N536O308O712O470N485L907K140R10
$$ plain form
53523 484866 485764 487669 490503 493506 496536 500309 505099 509812 512905 513958 514035 514685 516820 520158 523376
53508 523376 525071 525066 524760 525851 528693 532090 534578 535709 536141 536774 537872 538980 539573 539715 539996 540995 543018
53491 543018 546190 550323 554679 558384 561347 564408 568341 572969 577550 581701 585574 589379 593181 597035
53477 597035 600910 604585 607981 611583 616120 621769 627970 634136 640262 646720 653780 661583 670376 680378
53463 680378 691416 703020 715113 728353 743413 759993 776933 793445 809811 826551 843407
53452 843407 859719 875709 892724 912040 933741 956832 980062 1002713 1025149 1048738 1074695
53441 1074695 1102788 1131632 1160358 1189312 1218913 1248825 1279010 1310758 1345440 1382555 1420199
53430 1420199 1457433 1494989 1533311 1571131 1606809 1640353 1673169 1706184 1739093 1771388 1803261
$$ packed form
53523D84866Q98J905K834L003L030L773M790M713L093J053P7O50K135L338L218
53508E23376J695nl06J091K842L397K488J131M32O33J098J108N93J42K81R99K023
53491E43018L172M133M356L705K963L061L933M628M581M151L873L805L802L854
53477E97035L875L675L396L602M537N649O201O166O126O458P060P803Q793J0002
53463F80378J1038J1604J2093J3240J5060J6580J6940J6512J6366J6740J6856
53452H43407J6312J5990J7015J9316K1701K3091K3230K2651K2436K3589K5957
53441A074695K8093K8844K8726K8954K9601K9912L0185L1748L4682L7115L7644
53430A420199L7234L7556L8322L7820L5678L3544L2816L3015L2909L2295L1873
$$ plain form
53419 1803261 1835198 1867190 1898705 1929227 1958614 1987116 2015252 2043549 2072132 2100543 2128089
53408 2128089 2154389 2179561 2203888 2227406 2249805 2270596 2289260 2305339 2318605 2329209 2337436
53397 2337436 2343155 2345618 2344134 2339087 2332039 2324536 2316688 2307014 2293744 2276278 2255453 2232666 2209059
53384 2209059 2185509 2162932 2142034 2122599 2103295 2082444 2059043 2033080 2005182 1976242 1947303
53373 1947303 1919334 1892795 1867478 1842912 1818956 1795917 1774347 1754993 1738788 1726255 1716531
53362 1716531 1707529 1697849 1688511 1681942 1678994 1677757 1675931 1673625 1672812 1674468 1677634 1681482 1686934 1695427
53348 1695427 1706990 1720573 1735806 1753383 1773814 1796690 1821295 1847218 1874232 1902205 1931386
53337 1931386 1962359 1995558 2031205 2069637 2111092 2155040 2200473 2247234 2296483 2349319 2405477
$$ packed form
53419A803261L1937L1992L1515L0522K9387K8502K8136K8297K8583K8411K7546
53408B128089K6300K5172K4327K3518K2399K0791J8664J6079J3266J0604Q227
53397B337436N719K463j484n047p048p503p848r674j3270j7466k0825k2787k3607
53384B209059k3550k2577k0898j9435j9304k0851k3401k5963k7898k8940k8939
53373A947303k7969k6539k5317k4566k3956k3039k1570j9354j6205j2533r724
53362A716531r002r680r338o569k948j237j826k306q13J656L166L848N452Q493
53348A695427J1563J3583J5233J7577K0431K2876K4605K5923K7014K7973K9181
53337A931386L0973L3199L5647L8432M1455M3948M5433M6761M9249N2836N6158
$$ plain form
53326 2405477 2463885 2523979 2585724 2648651 2711916 2775512 2840626 2908294 2977947 3047559 3115100
53315 3115100 3179804 3242375 3304227 3366365 3428680 3490155 3549616 3606189 3659208 3708079 3752413
53304 3752413 3792147 3827411 3858169 3883855 3903398 3915992 3922130 3923449 3920998 3913846 3900114 3879220
53292 3879220 3852336 3820658 3784295 3743270 3698594 3651473 3602070 3549910 3495078 3438214 3379786
53281 3379786 3320319 3261066 3203336 3147082 3091225 3035523 2981179 2929294 2879678 2831572 2784542
53270 2784542 2737966 2690582 2641651 2592302 2544814 2500584 2459298 2419867 2381556 2344366 2308995
53259 2308995 2276414 2246957 2219789 2193781 2168894 2146138 2126008 2107451 2088680 2068810 2048428
53248 2048428 2028663 2009868 1991411 1972834 1954963 1939367 1926600 1915557 1904909 1894673 1885879
$$ packed form
53326B405477N8408O0094O1745O2927O3265O3596O5114O7668O9653O9612O7541
53315C115100O4704O2571O1852O2138O2315O1475N9461N6573N3019M8871M4334
53304C752413L9734L5264L0758K5686J9543J2594O138J319k451p152j3732k0894
53292C879220k6884l1678l6363m1025m4676m7121m9403n2160n4832n6864n8428
53281C379786n9467n9253n7730n6254n5857n5702n4344n1885m9616m8106m7030
53270B784542m6576m7384m8931m9349m7488m4230m1286l9431l8311l7190l5371
53259B308995l2581k9457k7168k6008k4887k2756k0130j8557j8771j9870k0382
53248B048428j9765j8795j8457j8577j7871j5596j2767j1043j0648j0236q794
$$ plain form
53237 1885879 1879240 1874888 1873049 1874040 1877554 1882748 1889120 1896684 1905305 1914677 1925136 1937685 1952854
53224 1952854 1970157 1989024 2009638 2032445 2057375 2084008 2111998 2140900 2170070 2199255 2228797
53213 2228797 2258632 2287491 2313815 2337242 2358521 2378141 2395789 2411081 2424055 2434674 2442445
53202 2442445 2446887 2447986 2446044 2441446 2434782 2426767 2417638 2406847 2393658 2377913 2359928 2339815 2317333
53189 2317333 2292448 2265755 2238136 2210200 2182139 2153920 2125226 2095270 2063214 2029278 1995253
53178 1995253 1963313 1934058 1906003 1877282 1847551 1817919 1789381 1761984 1735563 1710461 1686947
53167 1686947 1664343 1641492 1618143 1595234 1573606 1553038 1533039 1514063 1497049 1481770 1466546
53156 1466546 1450086 1433144 1417816 1405364 1395110 1385263 1374326 1361802 1347991 1333371 1318123
$$ packed form
53237A885879o639m352j839R91L514N194O372P564Q621R372J0459J2549J5169
53224A952854J7303J8867K0614K2807K4930K6633K7990K8902K9170K9185K9542
53213B228797K9835K8859K6324K3427K1279J9620J7648J5292J2974J0619P771
53202B442445M442J099j942m598o664q015r129j0791j3189j5745j7985k0113k2482
53189B317333k4885k6693k7619k7936k8061k8219k8694k9956l2056l3936l4025
53178A995253l1940k9255k8055k8721k9731k9632k8538k7397k6421k5102k3514
53167A686947k2604k2851k3349k2909k1628k0568j9999j8976j7014j5279j5224
53156A466546j6460j6942j5328j2452j0254r847j0937j2524j3811j4620j5248
$$ plain form
53145 1318123 1302254 1286018 1269775 1253303 1235804 1217020 1197832 1179033 1160011 1139698 1118670
53134 1118670 1099115 1082298 1067014 1051123 1033896 1016155 998722 981618 964544 947322 929740
53123 929740 911559 892927 874560 857313 841540 826776 812032 796592 780561 764507 748665
53112 748665 732844 717008 701349 685711 669740 653995 640168 629465 621076 612876 603403 592714
53100 592714 581755 571650 563311 556786 550830 543713 534695 524411 513917 503832 494306 485146 475897
53087 475897 466404 457536 450780 446792 444701 443068 441119 438714 435587 431344 426313 421859 419403 419041
53073 419041 419279 418248 415153 410500 405201 399933 395292 391902 389877 388584 387422 386482 385960 385279 383527
53058 383527 380630 377334 374056 370602 367161 364653 363579 363111 361929 359609 356745 354073 352033 350925
$$ packed form
53145A318123j5869j6236j6243j6472j7499j8784j9188j8799j9022k0313k1028
53134A118670j9555j6817j5284j5891j7227j7741j7433j7104j7074j7222j7582
53123I29740j8181j8632j8367j7247j5773j4764j4744j5440j6031j6054j5842
53112G48665j5821j5836j5659j5638j5971j5745j3827j0703q389q200r473j0689
53100E92714j0959j0105q339o525n956p117r018j0284j0494j0085r526r160r249
53087D75897r493q868o756l988k091j633j949k405l127m243n031m454k456l62
53073D19041K38j031l095m653n299n268m641l390k025j293j162r40n22o81j752
53058C83527k897l296l278l454l441k508j074m68j182k320k864k672k040j108
$$ plain form
53044 350925 350805 351237 351648 352119 353481 356458 360806 365347 368750 370345 370399 369669 368661 367327 365414 362808
53028 362808 359434 355171 350287 345692 342108 338989 334952 329539 323834 318802 313711 307304 300246 295062
53014 295062 293201 293169 292311 289634 286042 282478 279055 275749 272643 269390 265520 261545 258685 257179 255887
52999 255887 254078 252468 251636 250346 246691 240611 234361 230582 230413 232982 235996 237276 236569 235648 235961
52984 235961 236689 235939 233286 229876 226411 222650 219026 217108 217595 218948 218985 217268 215133 213780 213075 212181
52968 212181 210828 209759 209882 210976 211591 210646 208730 207171 206217 205198 204252 204444 205845 206880 206376 205154
52952 205154 204641 204813 204593 203694 202877 202588 202379 201663 200246 198122 195427 192783 191246 191799 194916 200223
52936 200223 206168 210540 212074 211543 210814 210999 211893 212841 213456 213629 213525 213533 213739 213539 212428 211054 210753 211897
$$ packed form
53044C50925j20M32M11M71J362K977M348M541L403J595N4p30j008j334j913k606
53028C62808l374m263m884m595l584l119m037n413n705n032n091o407p058n184
53014B95062j861l2q58k677l592l564l423l306l106l253l870l975k860j506j292
52999B55887j809j610q32j290l655o080o250l779j69K569L014J280p07r21L13
52984B35961P28p50k653l410l465l761l624j918M87J353L7j717k135j353p05q94
52968B12181j353j069J23J094O15r45j916j559r54j019r46J92J401J035n04j222
52952B05154n13J72k20q99q17k89k09p16j417k124k695k644j537N53L117N307
52936B00223N945M372J534n31p29J85Q94R48O15J73j04QK06k00j111j374l01J144
$$ plain form
52918 211897 213395 214125 214325 215181 217353 220336 223142 225315 227238 229541 232268 234821 236796 238636 241124
52903 241124 244379 247705 250444 252693 255194 258777 263883 270322 277344 284099 290073 295137 299477 303697
52889 303697 308648 314607 320533 324661 326119 325879 325964 327669 330500 332762 333204 332092 330581 329186 327297
52874 327297 324196 319979 315138 309854 304392 299828 297531 297753 299160 299913 298954 296452 293441 290959 289188
52859 289188 287469 285470 283977 283974 285175 286269 286575 286557 286663 286717 286934 288459 291807 295287 296129 293393 289053
52842 289053 286063 285854 287864 290783 293670 296102 297952 299350 300665 302229 304020 305711 307055 308075
52828 308075 308870 309351 309329 308889 308662 309630 312438 316653 320772 323306 323972 323688 323468 323652 324152 324776 325038 324239
52810 324239 322356 320515 319945 320537 320952 320085 318073 316066 315451 317010 320148 323027 324180 323999 324009 324797
$$ packed form
52918B11897J498P30K00Q56K172K983K806K173J923K303K727K553J975J840K488
52903B41124L255L326K739K249K501L583N106O439P022O755N974N064M340M220
52889C03697M951N959N926M128J458k40Q5J705K831K262M42j112j511j395j889
52874C27297l101m217m841n284n462m564k297K22J407P53r59k502l011k482j771
52859B89188j719j999j493lJ201J094L06j8J06N4K17J525L348L480Q42k736m340
52842B89053k990k09K010K919K887K432J850J398J315J564J791J691J344J020
52828C08075P95M81k2m40k27R68K808M215M119K534O66k84k20J84N00O24K62p99
52810C24239j883j841n70N92M15q67k012k007o15J559L138K879J153j81J0P88
$$ plain form
52794 324797 325519 325519 325336 325603 325927 325712 325428 326054 327587 329107 330291 332014 335222 339942 345652 351959 358353
52777 358353 363779 367191 368653 369432 370796 372916 375053 376596 377587 378278 378533 377962 376503 374629 372830
52762 372830 371044 368710 365472 361783 358661 356656 355129 352804 349200 345284 342501 341234 340325 338038
52748 338038 333500 327481 321887 318158 315863 313066 308335 302178 296344 292097 289485 287759 285880 282999
52734 282999 279167 275404 272372 269240 264815 259676 255955 254623 254043 251967 248231 244646 242664 241966 241239
52719 241239 239706 237746 236312 235822 235672 235004 233714 232184 230152 226809 222275 218005 215063 212834 210239
52704 210239 207498 205666 204873 204220 203222 202191 201199 199757 197765 195723 193605 190520 186162 181857 179281
52689 179281 178424 177533 175032 171088 167374 165614 166278 168301 170000 170445 169948 169194 168168 166176 162783 158364
$$ packed form
52794C24797P22%j83K67L24k15k84O26J533J520J184J723L208M720N710O307O394
52777C58353N426L412J462P79J364K120K137J543R91O91K55n71j459j874j799
52762C72830j786k334l238l689l122k005j527k325l604l916k783j267r09k287
52748C38038m538o019n594l729k295k797m731o157n834m247k612j726j879k881
52734B82999l832l763l032l132m425n139l721j332n80k076l736l585j982o98p27
52719B41239j533j960j434m90j50o68j290j530k032l343m534m270k942k229k595
52704B10239k741j832p93o53r98j031r92j442j992k042k118l085m358m305k576
52689A79281q57q91k501l944l714j760O64K023J699M45m97p54j026j992l393m419
$$ plain form
52673 158364 153773 149864 147416 147077 148783 151230 152489 151580 149325 147338 146378 146105 146118 146353 146342 145146
52657 145146 142639 140132 138832 138196 136828 134699 133308 133627 135082 136868 139141 142157 145061 146384 145436
52642 145436 142691 139246 136425 135405 136422 138462 140302 141745 143410 145712 148622 152194 156459 160806
52628 160806 164205 166259 167476 168292 168404 167414 165756 164594 164896 166815 169794 173121 176407 179601 182548
52613 182548 184742 185683 185287 183691 181005 177719 175037 173949 173857 172898 169922 165545 161025 156859 153030
52598 153030 149850 147616 145707 142942 138962 134766 131810 130962 132227 134900 137808 139824 140465 140085 139559
52583 139559 139778 140975 142208 141884 139330 135658 132626 130990 130566 131474 134184 138327 142516 145616 147354
52568 147354 147516 145818 143132 141581 142211 143377 142761 140501 138854 138820 138707 136608 133029 130134 129167 129616
$$ packed form
52673A58364m591l909k448l39J706K447J259r09k255j987r60k73J3K35j1j196
52657A45146k507k507j300o36j368k129j391L19J455J786K273L016K904J323r48
52642A45436k745l445k821j020J017K040J840J443J665K302K910L572M265M347
52628A60806L399K054J217Q16J12r90j658j162L02J919K979L327L286L194K947
52613A82548K194R41l96j596k686l286k682j088r2r59k976m377m520m166l829
52598A53030l180k234j909k765l980m196k956q48J265K673K908K016O41l80n26
52583A39559K19J197J233l24k554l672l032j636m24R08K710M143M189L100J738
52568A47354J62j698k686j551O30J166o16k260j647l4j13k099l579k895r67M49
$$ plain form
52552 129616 130569 131701 132774 133054 131959 130037 128747 129134 130962 133110 134498 134548 133308 131703 131292 132971
52536 132971 135811 137906 138581 139056 140616 143002 145195 147010 148978 151152 153079 154659 156082 157116 157526
52521 157526 158031 159690 162365 164994 167532 171074 175534 178650 178501 176049 174044 174122 176023 178958 182272
52506 182272 185011 186269 186204 185771 185391 184822 184410 185292 187914 191231 193981 196058 198107 200343 202439 204175
52490 204175 205538 206390 206619 206518 206518 206659 206830 207500 209706 214045 219963 226163 231479 235261 237321 237991 238217
52473 238217 239164 241372 244246 246484 247055 245902 243911 242330 242018 242950 244385 245613 246538 247474 248592 249857
52457 249857 251278 252758 253731 253639 253012 253463 256035 259839 262850 263966 263879 264027 265089 266429 266674 264923
52441 264923 261692 258586 256778 255951 255013 253535 251951 250689 249837 249585 250087 250672 250001 247521 244313 242099
$$ packed form
52552A29616R53J132J073K80j095j922j290L87J828K148J388N0j240j605m11J679
52536A32971K840K095O75M75J560K386K193J815J968K174J927J580J423J034M10
52521A57526N05J659K675K629K538L542M460L116j49k452k005P8J901K935L314
52506A82272K739J258o5m33l80n69m12Q82K622L317K750K077K049K236K096J736
52490B04175J363Q52K29j01%J41J71O70K206M339N918O200N316L782K060O70K26
52473B38217R47K208K874K238N71j153j991j581l12R32J435J228R25R36J118J265
52457B49857J421J480R73r2o27M51K572L804L011J116q7J48J062J340K45j751
52441B64923l231l106j808q27r38j478j584j262q52k52N02N85o71k480l208k214
$$ plain form
52425 242099 241762 243069 245334 247888 250253 252379 254535 256658 258059 258201 257520 257052 257342 258071 258570 258400
52409 258400 257688 257296 258388 261194 264309 265888 265622 264978 265404 266918 268769 270787 273354 276327 278658
52394 278658 279315 278252 276413 274935 274344 274324 274225 273903 274004 275201 277216 278892 279328 278679 277760 277217 277367
52377 277367 278453 280403 282349 283035 282098 280524 279504 279170 279013 279200 280590 283267 285844 286810 286198 285384
52361 285384 285429 286162 286854 287198 287361 287365 286778 285108 282551 280310 279933 281943 285100 287292 287315 285704 283972
52344 283972 283330 284124 285954 287976 289386 290051 290660 291989 294034 296080 297571 298657 299903 301693 303915
52329 303915 306004 307293 307547 307154 306552 305593 303914 301980 301111 302079 304075 305549 305779 305103 303944 302506
52313 302506 301436 301857 304168 307283 309651 310769 311330 312198 313847 316542 320305 324502 328036 330360 332082
$$ packed form
52425B42099l37J307K265K554K365K126K156K123J401J42o81m68K90P29M99j70
52409B58400p12l92J092K806L115J579k66o44M26J514J851K018K567K973K331
52394B78658O57j063j839j478n91k0r9l22J01J197K015J676M36o49r19n43J50
52377B77367J086J950J946O86r37j574j020l34j57J87J390K677K577R66o12q14
52361B85384M5P33O92L44J63Mn87j670k557k241l77K010L157K192K3j611j732
52344B83972o42P94J830K022J410O65O09J329K045K046J491J086J246J790K222
52329C03915K089J289K54l93o02r59j679j934q69R68J996J474K30o76j159j438
52313C02506j070M21K311L115K368J118N61Q68J649K695L763M197L534K324J722
$$ plain form
52298 332082 334232 337005 339460 340574 340565 341054 343665 348308 353116 356481 358934 362521 368340 375369 381933
52283 381933 387546 392678 397330 400888 403445 406262 410531 416160 422187 427885 432949 436993 439723 441583
52269 441583 443645 446659 450651 455572 461774 469385 477687 485768 493649 502105 511241 519889 526837 532364
52255 532364 538077 545230 553630 562328 571103 580872 592597 606136 620456 634866 649446 664234 678667
52242 678667 692566 707258 724639 744866 765865 785723 805000 825938 849734 875407 901295
52231 901295 926889 952899 979983 1007741 1034795 1059882 1083176 1106509 1131818 1159234 1187064
52220 1187064 1213736 1239251 1264432 1289269 1312671 1333742 1352773 1370827 1388711 1406486 1423768
52209 1423768 1440234 1455806 1470459 1483915 1495689 1505517 1513732 1521034 1527834 1533850 1538449 1541381 1543137
$$ packed form
52298C32082K150K773K455J114rM89K611M643M808L365K453L587N819P029O564
52283C81933N613N132M652L558K557K817M269N629O027N698N064M044K730J860
52269D41583K062L014L992M921O202P611Q302Q081P881Q456R136Q648O948N527
52255E32364N713P153Q400Q698Q775R769J1725J3539J4320J4410J4580J4788J4433
52242F78667J3899J4692J7381K0227K0999J9858J9277K0938K3796K5673K5888
52231I01295K5594K6010K7084K7758K7054K5087K3294K3333K5309K7416K7830
52220A187064K6672K5515K5181K4837K3402K1071J9031J8054J7884J7775J7282
52209A423768J6466J5572J4653J3456J1774R828Q215P302O800O016M599K932J756
$$ plain form
52196 1543137 1544586 1546335 1548453 1550608 1552206 1552600 1551647 1550241 1549964 1551926 1556095 1561866 1568822 1576719 1585286
52181 1585286 1594668 1605740 1619190 1634427 1650184 1666186 1683340 1702105 1721557 1740561 1759058
52170 1759058 1777479 1795529 1812415 1828041 1843086 1857908 1872035 1884823 1896052 1905732 1913821 1920309
52158 1920309 1925174 1928081 1928508 1926539 1923293 1920070 1917017 1912892 1906294 1897014 1886017 1874201 1861514
52145 1861514 1847403 1831817 1815407 1798840 1782244 1765239 1747214 1727770 1707487 1688139 1671441
52134 1671441 1657430 1644764 1632779 1622343 1614249 1607752 1601565 1595542 1590233 1585308 1579687 1573077 1566099
52121 1566099 1558913 1551045 1542902 1536092 1531471 1527842 1523468 1518077 1512499 1507092 1501719 1496873 1493350 1490585
52107 1490585 1486593 1480290 1473174 1467815 1464861 1462270 1457660 1450857 1443696 1437622 1432195 1426158 1419281 1412398
$$ packed form
52196A543137J449J749K118K155J598L94r53j406k77J962M169N771O956P897Q567
52181A585286R382J1072J3450J5237J5757J6002J7154J8765J9452J9004J8497
52170A759058J8421J8050J6886J5626J5045J4822J4127J2788J1229R680Q089O488
52158A920309M865K907M27j969l246l223l053m125o598r280j0997j1816j2687
52145A861514j4111j5586j6410j6567j6596j7005j8025j9444k0283j9348j6698
52134A671441j4011j2666j1985j0436q094o497o187o023n309m925n621o610o978
52121A566099p186p868q143o810m621l629m374n391n578n407n373m846l523k765
52107A490585l992o303p116n359k954k591m610o803p161o074n427o037o877o883
$$ plain form
52093 1412398 1405814 1398755 1390833 1383301 1377938 1374874 1372330 1368675 1364044 1359636 1355936 1352262 1347876 1342923
52079 1342923 1338110 1333814 1329779 1325413 1320142 1313806 1307204 1302065 1299672 1299241 1298231 1294754 1289338 1283991
52065 1283991 1280049 1277530 1275930 1274559 1272345 1268537 1263946 1260435 1258805 1258056 1257120 1256270 1256142 1256467 1256955
52050 1256955 1258688 1263104 1269808 1276771 1283012 1289987 1299920 1313541 1329887 1347614 1365909 1384565 1403811
52037 1403811 1424141 1446156 1470545 1497906 1528091 1559817 1591520 1622651 1653724 1685212 1717077
52026 1717077 1749328 1782103 1814982 1847112 1878364 1909431 1940270 1969459 1995917 2020375 2044026
52015 2044026 2066292 2085248 2099932 2111005 2119325 2125254 2129488 2133049 2135746 2135871 2132308 2126144 2119225
52002 2119225 2111754 2102457 2090846 2078210 2066209 2055345 2045089 2034848 2024345 2013421 2002001 1990325
$$ packed form
52093A412398o584p059p922p532n363l064k544l655m631m408l700l674m386m953
52079A342923m813m296m035m366n271o336o602n139k393m31j010l477n416n347
52065A283991l942k519j600j371k214l808m591l511j630p49r36q50j28L25M88
52050A256955J733M416O704O963O241O975R933J3621J6346J7727J8295J8656J9246
52037A403811K0330K2015K4389K7361L0185L1726L1703L1131L1073L1488L1865
52026A717077L2251L2775L2879L2130L1252L1067L0839K9189K6458K4458K3651
52015B044026K2266J8956J4684J1073Q320N929M234L561K697J25l563o164o919
52002B119225p471r297j1611j2636j2001j0864j0256j0241j0503j0924j1420j1676
$$ plain form
51990 1990325 1979014 1968799 1960109 1952934 1947194 1943200 1941562 1942524 1945646 1950173 1955334 1960175 1963812 1966505
51976 1966505 1970036 1976034 1983958 1991548 1997362 2002001 2006548 2010764 2013599 2014881 2015553 2016406 2017329 2017903 2018091
51961 2018091 2018157 2018180 2017705 2015563 2010242 2001040 1988968 1975970 1962969 1949098 1933143 1915209 1896331
51948 1896331 1876695 1855122 1830626 1803959 1776955 1750476 1723550 1694702 1663583 1630870 1596987
51937 1596987 1561784 1525489 1489145 1453574 1418350 1382365 1345146 1307169 1269164 1231730 1195399
51926 1195399 1160330 1125937 1091558 1057635 1025496 995585 966610 936972 906619 876868 848637
51915 848637 821458 794177 766223 738226 711749 688310 668246 650502 633788 617889 603474
51904 603474 590731 578831 567013 555763 546267 538732 531799 523963 515232 506784 499071 491040 481643
$$ packed form
51990A990325j1311j0215q690p175n740l994j638R62L122M527N161M841L637K693
51976A966505L531N998P924P590N814M639M547M216K835J282O72Q53R23N74J88
51961B018091O6K3m75k142n321r202j2072j2998j3001j3871j5955j7934j8878
51948A896331j9636k1573k4496k6667k7004k6479k6926k8848l1119l2713l3883
51937A596987l5203l6295l6344l5571l5224l5985l7219l7977l8005l7434l6331
51926A195399l5069l4393l4379l3923l2139k9911k8975k9638l0353k9751k8231
51915H48637k7179k7281k7954k7997k6477k3439k0064j7744j6714j5899j4415
51904F03474j2743j1900j1818j1250r496p535o933p836q731q448p713q031r397
$$ plain form
51891 481643 471557 462678 456203 451849 448643 445567 441559 436070 429842 424086 418582 411860 403870 396988
51877 396988 393197 391297 388488 383931 379058 374819 370616 366106 362201 359586 357661 355648 353610 351692
51863 351692 349433 346629 343977 342107 340870 340217 340690 342015 342284 339905 335776 332155 329754 327305 323755
51848 323755 319491 315273 311385 308221 306531 306301 306208 304903 302448 299873 297716 295556 292893 289934 287377
51833 287377 285627 284410 283208 281931 280884 280073 278926 276979 274516 272221 270441 269095 268021 267029 266028
51818 266028 265544 266674 269788 273529 275877 276107 275012 273433 271466 269094 266621 264225 261922 260236 260074
51803 260074 261606 263924 266187 268382 270591 272330 273211 273687 274463 275611 276882 278455 280686 283376 285938
51788 285938 288210 290563 293319 296419 299603 302580 305153 307440 309670 311520 312022 310650 308194 306008
$$ packed form
51891D81643j0086q879o475m354l206l076m008n489o228n756n504o722p990o882
51877C96988l791j900k809m557m873m239m203m510l905k615j925k013k038j918
51863C51692k259k804k652j870j237o53M73J325K69k379m129l621k401k449l550
51848C23755m264m218l888l164j690k30r3j305k455k575k157k160k663k959k557
51833B87377j750j217j202j277j047q11j147j947k463k295j780j346j074r92j001
51818B66028m84J130L114L741K348K30j095j579j967k372k473k396k303j686j62
51803B60074J532K318K263K195K209J739Q81M76P76J148J271J573K231K690K562
51788B85938K272K353K756L100L184K977K573K287K230J850N02j372k456k186
$$ plain form
51774 306008 304557 303246 301526 299531 297598 295803 294222 293193 292982 293448 294330 295736 298007 301048 303973
51759 303973 305703 306009 305810 306197 307241 308000 307702 306653 306055 307205 310683 315703 320202 322279 321880 320637
51743 320637 319812 319151 318140 317525 318517 320823 322561 322326 320612 318794 317256 315059 311474 307430 304949
51728 304949 305026 306472 307377 307477 308184 310266 312589 313735 313934 314491 315921 317579 318763 319334 319555 320099 321837
51711 321837 324800 327811 330035 332294 335590 338798 339646 338103 336967 338380 341209 342837 342397 341163 340653
51696 340653 341564 344034 347748 351891 355877 360074 365150 370868 376141 380239 383459 386670 390533 395000
51682 395000 399300 402756 405900 410266 416630 424085 431553 439552 449347 460643 471426 480306 487924 495574
51668 495574 503349 510363 516195 521289 526089 530337 533192 533795 531931 528514 525212 523102 521691 519668
$$ packed form
51774C06008j451j311j720j995j933j795j581j029k11M66Q82J406K271L041K925
51759C03973J730L06j99L87J044P59k98j049n98J150L478N020M499K077l99j243
51743C20637q25o61j011o15R92K306J738k35j714j818j538k197l585m044k481
51728C04949P7J446R05J00P07K082K323J146J99N57J430J658J184N71K21N44J738
51711C21837K963L011K224K259L296L208Q48j543j136J413K829J628m40j234n10
51696C40653R11K470L714M143L986M197N076N718N273M098L220L211L863M467
51682C95000M300L456L144M366O364P455P468P999R795J1296J0783Q880P618P650
51668D95574P775P014N832N094M800M248K855O03j864l417l302k110j411k023
$$ plain form
51654 519668 516675 513900 512776 513441 514724 515334 514651 512615 509454 505725 502127 498917 495699 492029 488063
51639 488063 484356 481265 478851 477092 475719 473991 471325 468299 466510 467106 469708 472956 475784 478017
51625 478017 480078 482409 485012 487334 488822 489681 490741 492265 493295 492650 490483 488283 487229 486812 485417
51610 485417 482154 477897 474371 472367 471215 470121 469605 471162 475649 482386 489660 495691 499409 501040
51596 501040 501981 503372 504779 505049 504400 504408 505459 505595 502877 497878 492506 487124 480455 472010 462893 453979
51580 453979 444891 435422 426685 419916 414924 410642 406572 402905 399757 397131 395267 394121 392761 390186
51566 390186 386607 383051 379730 375821 371181 367142 364858 363491 361012 356588 351418 347248 344794 343684
51552 343684 343225 342910 342634 342737 343431 344031 343387 341443 339670 339217 339245 338117 335920 334536 334965 335813 335146
$$ packed form
51654E19668k993k775j124O65J283O10o83k036l161l729l598l210l218l670l966
51639D88063l707l091k414j759j373j728k666l026j789N96K602L248K828K233
51625D78017K061K331K603K322J488Q59J060J524J030o45k167k200j054m17j395
51610D85417l263m257l526k004j152j094n16J557M487O737P274O031L718J631
51596E01040R41J391J407K70o49QJ051J36k718m999n372n382o669q445r117q914
51580D53979r088r469q737o769m992m282m070l667l148k626j864j146j360k575
51566C90186l579l556l321l909m640m039k284j367k479m424n170m170k454j110
51552C43684m59l15k76J03O94O00o44j944j773m53K8j128k197j384M29Q48o67
$$ plain form
51535 335146 332991 331139 330944 332231 334130 336139 338174 340271 342631 345755 350198 356029 362458 368163
51521 368163 372333 375491 378834 382668 386031 388262 390378 394209 400326 407452 413835 418697 422339 425364
51507 425364 427960 429588 429349 427010 423748 421514 421431 422878 424066 423335 420070 414872 409156 404375 401311
51492 401311 399853 399340 399152 399238 400153 402494 406260 410898 415846 420657 424766 427877 430742 434783 440474
51477 440474 446697 452206 457027 461653 465468 467130 466395 464720 463889 464614 466357 467913 468213 467189 465845
51462 465845 465069 464673 464139 463878 464758 466658 468521 469919 471531 474003 477163 480456 483222 484535 483906 482409
51446 482409 482017 483376 485162 485933 485423 483599 479887 474361 468588 464125 460937 458366 456722 456432 456235
51431 456235 454066 449841 445817 443708 442667 440807 437750 434714 432594 431028 429492 428563 429434 432294 435747
$$ packed form
51535C35146k155j852j95J287J899K009K035K097K360L124M443N831O429N705
51521C68163M170L158L343L834L363K231K116L831O117P126O383M862L642L025
51507D25364K596J628k39k339l262k234q3J447J188p31l265n198n716m781l064
51492D01311j458n13j88Q6R15K341L766M638M948M811M109L111K865M041N691
51477D40474O223N509M821M626L815J662p35j675q31P25J743J556L00j024j344
51462D65845p76l96n34k61Q80J900J863J398J612K472L160L293K766J313o29j497
51446D82409l92J359J786P71n10j824l712n526n773m463l188k571j644k90j97
51431D56235k169m225m024k109j041j860l057l036k120j566j536r29Q71K860L453
$$ plain form
51416 435747 438240 439761 441506 443911 445757 445659 443974 442858 444725 450772 460311 470958 479920 485872
51402 485872 489665 493112 497478 503347 510973 519866 528549 535808 542026 548333 554598 559316 561705 562908
51388 562908 564653 567387 570256 572440 573981 575450 577182 578812 579546 579051 578025 577621 578229 579063 579006 577753
51372 577753 576142 575495 576384 577879 578318 577099 575310 574137 573278 571787 569952 569022 569016 568126 564844 559671
51356 559671 554056 548532 542745 536656 530664 524847 519060 513727 509625 506693 503764 499760 494697 489233
51342 489233 483758 478422 473770 470668 469486 469695 470428 471132 471393 470498 467860 464019 460662 459087 458877 458533
51326 458533 457334 456074 455900 456854 457806 457573 455934 453660 451611 449639 446461 440920 433430 425867 419915
51311 419915 415671 411889 407201 401024 393720 386193 379120 372279 364822 356385 347733 340070 333849 328446
$$ packed form
51416D35747K493J521J745K405J846r8j685j116J867O047R539J0647Q962N952
51402D85872L793L447M366N869P626Q893Q683P259O218O307O265M718K389J203
51388E62908J745K734K869K184J541J469J732J630P34m95j026m04O08Q34n7j253
51372E77753j611o47Q89J495M39j219j789j173q59j491j835r30oq90l282n173
51356E59671n615n524n787o089n992n817n787n333m102k932k929m004n063n464
51342D89233n475n336m652l102j182K09P33P04K61q95k638l841l357j575k10l44
51326D58533j199j260j74R54R52k33j639k274k049j972l178n541p490p563n952
51311D19915m244l782m688o177p304p527p073o841p457q437q652p663o221n403
$$ plain form
51297 328446 322873 316565 309671 302950 297391 293586 291278 289503 287243 284025 280174 276641 274377 273564
51283 273564 273354 272537 270509 267549 264239 260914 257695 254852 252803 251779 251723 252587 254480 257301 260423
51268 260423 263073 264903 265829 265478 263480 260580 258685 259152 261409 263875 265822 267572 269264 270679 272413
51253 272413 275850 281254 286789 290413 292232 294021 296822 300098 303204 306577 310911 315835 320072 322758
51239 322758 324164 325122 325976 326140 324705 321511 317578 314326 312360 311097 309512 307073 304005 300851 297787
51224 297787 294280 289532 283469 277162 271871 267739 263798 259299 254572 250466 247470 245703 245242 245798 246314
51209 246314 245623 243637 241403 239741 238210 235689 231757 227284 223715 221865 221305 220875 219967 219296 220003 221944
51193 221944 223406 222898 220861 219066 218532 218606 218060 216547 214846 214069 214720 216235 217457 217920 218564 220691
$$ packed form
51297C28446n573o308o894o721n559l805k308j775k260l218l851l533k264q13
51283B73564k10q17k028k960l310l325l219k843k049j024n6Q64J893K821L122
51268B60423K650J830R26l51j998k900j895M67K257K466J947J750J692J415J734
51253B72413L437N404N535L624J819J789K801L276L106L373M334M924M237K686
51239C22758J406R58Q54J64j435l194l933l252j966j263j585k439l068l154l064
51224B97787l507m748o063o307n291m132l941m499m727m106k996j767m61N56N16
51209B46314o91j986k234j662j531k521l932m473l569j850n60m30r08o71P07J941
51193B21944J462n08k037j795n34P4n46j513j701p77O51J515J222M63O44K127
$$ plain form
51177 220691 224316 228212 231512 234284 236255 236246 233818 230693 229311 230186 231793 232847 233618 234825 236398
51162 236398 237810 238801 239148 238331 236155 233407 231355 230657 231061 231992 233113 234327 235471 236087 235721 234713
51146 234713 234453 236111 238976 240807 240243 238287 236942 237015 238010 239587 241931 244676 246532 246524 245025 243158
51130 243158 241653 240649 240178 240236 240532 240770 241182 242319 244082 245264 244433 241382 237574 234933 234049 233583
51114 233583 231609 227613 222953 219240 216644 214212 211678 210059 210167 211175 211420 210394 209250 209365 210999
51099 210999 213374 215307 215663 214048 211542 210075 210421 211268 210860 209032 206982 205576 204827 204710 205314 206176
51083 206176 206486 206146 205795 205626 205084 203998 202957 202139 200745 198404 196321 196067 197586 199177 199284 197799
51067 197799 195929 195296 196805 199734 202147 202761 202210 202114 203350 205747 208872 212167 214594 215261 214568 214049
$$ packed form
51177B20691L625L896L300K772J971rk428l125j382Q75J607J054P71J207J573
51162B36398J412R91L47q17k176k748k052o98M04R31J121J214J144O16l66j008
51146B34713k60J658K865J831n64j956j345P3R95J577K344K745J856qj499j867
51130B43158j505j004m71N8K96K38M12J137J763J182q31l051l808k641q84m66
51114B33583j974l996m660l713k596k432k534j619J08J008K45j026j144J15J634
51099B10999K375J933L56j615k506j467L46Q47m08j828k050j406p49j17O04Q62
51083B06176L10l40l51j69n42j086j041q18j394k341k083k54J519J591J07j485
51067A97799j870o33J509K929K413O14n51r6J236K397L125L295K427O67o93n19
$$ plain form
51051 214049 214863 216894 219216 220955 221799 222283 223424 225442 227127 227350 226962 227984 230765 233265 233714 232831
51035 232831 232539 233410 234557 235534 237043 239597 242431 244208 244411 243664 242812 241980 240765 239377 239111 241041
51019 241041 244274 246340 245689 243198 240879 239776 239816 240964 243407 246729 249896 252213 253627 254163 253813
51004 253813 253145 253114 253900 254636 254729 254800 255673 257055 258001 258443 259309 261062 262912 263809 263644 263092 262751 263002 264369
50985 264369 267270 271229 274881 277020 277496 276999 276417 276621 278408 281995 286621 291028 294350 296285 296745
50970 296745 296110 295814 297681 302143 307637 312339 315934 319030 321465 322391 321954 321651 322604 324416 326287 328294
$$ packed form
51051B14049Q14K031K322J739Q44M84J141K018J685K23l88J022K781K500M49q83
51035B32831k92Q71J147R77J509K554K834J777K03p47q52q32j215j388k66J930
51019B41041L233K066o51k491k319j103M0J148K443L322L167K317J414N36l50
51004B53813o68l1P86P36R3P1Q73J382R46M42Q66J753J850Q97j65n52l41K51J367
50985B64369K901L959L652K139M76m97n82K04J787L587M626M407L322J935M60
50970B96745o35k96J867M462N494M702L595L096K435R26m37l03R53J812J871K007
$$ [...]
##END NTUPLES=NMR SPECTRUM
##END=
