
##TITLE=AC1199_HACAH12052_5973650_oDCHfXS053
##JCAMPDX= 6.0         $$ Bruker NMR JCAMP-DX V2.0
##DATA TYPE= NMR SPECTRUM
##DATA CLASS= NTUPLES
##ORIGIN= BRUKER
##OWNER= Administrator
$$ 1.72 TOPSPIN		Version 2.1
$$ 2012-04-16 19:10:44.609 -0500  Administrator@TOPSPIN
$$ Compression mode = diff/dup
##.OBSERVE FREQUENCY= 400.13188235
##.OBSERVE NUCLEUS= ^1H
##.ACQUISITION MODE= SIMULTANEOUS (DQD)
##.ACQUISITION SCHEME= undefined
##.AVERAGES= 8
##.DIGITISER RES= 22
##SPECTROMETER/DATA SYSTEM= spect
##.PULSE SEQUENCE= zg30
##.SOLVENT NAME= COFFEE_meoh
##.SHIFT REFERENCE= INTERNAL, COFFEE_meoh, 1, 14.98061
##AUDIT TRAIL= $$ (NUMBER, WHEN, WHO, WHERE, PROCESS, VERSION, WHAT)
$$ ##TITLE= Audit trail, TOPSPIN		Version 2.1
$$ ##JCAMPDX= 5.01
$$ ##ORIGIN= Bruker BioSpin GmbH
$$ ##OWNER= Administrator
$$ $$ C:\Bruker\TOPSPIN/data/COFFEE/nmr/AC1199_HACAH12052_5973650_oDCHfXS053/10/pdata/1/auditp.txt
$$ ##AUDIT TRAIL=  $$ (NUMBER, WHEN, WHO, WHERE, PROCESS, VERSION, WHAT)
(   1,<2012-04-15 21:15:01.078 -0500>,<Administrator>,<TOPSPIN>,<go>,<TOPSPIN 2.1>,
      <created by zg
	started at 2012-04-15 21:13:54.296 -0500,
	POWCHK enabled, PULCHK disabled,
       configuration hash MD5:
       1A 1E CE 29 27 FD 77 03 67 4E F0 E3 C4 B2 CB 90
       data hash MD5: 64K
       DA F1 DA 2D 9C DB FF AB DE 67 3B 5A E3 2B CE 27>)
(   2,<2012-04-15 21:15:04.187 -0500>,<Administrator>,<TOPSPIN>,<proc1d>,<TOPSPIN 2.1>,
      <Start of raw data processing
       efp LB = 0 FT_mod = 6 PKNL = 1 PHC0 = 0 PHC1 = 0 SI = 32K 
       data hash MD5: 32K
       1A 2E 78 33 4E D9 F1 8A 86 63 A5 4D A7 34 FC CB>)
(   3,<2012-04-15 21:15:04.531 -0500>,<Administrator>,<TOPSPIN>,<proc1d>,<TOPSPIN 2.1>,
      <pk PHC0 = 210.4266 PHC1 = 0 
       data hash MD5: 32K
       28 65 0C 85 BE 50 CA DE A2 1E 2B 1E 0D F3 A4 34>)
(   4,<2012-04-15 21:15:04.718 -0500>,<Administrator>,<TOPSPIN>,<proc1d>,<TOPSPIN 2.1>,
      <abs ABSG = 1 
       data hash MD5: 32K
       90 A2 BC A5 8C 2C 9E 05 33 ED 04 79 A7 2F 60 60>)
(   5,<2012-04-15 21:15:04.828 -0500>,<Administrator>,<TOPSPIN>,<proc1d>,<TOPSPIN 2.1>,
      <abs ABSG = 2 
       data hash MD5: 32K
       0E E9 F4 40 A6 D0 5A 83 0F B7 FC D8 7D C6 9D CA>)
(   6,<2012-04-15 21:15:04.859 -0500>,<Administrator>,<TOPSPIN>,<proc1d>,<TOPSPIN 2.1>,
      <abs ABSG = 3 
       data hash MD5: 32K
       99 8F 74 7D 50 E6 69 75 EA 6A 07 E9 D3 17 76 4F>)
(   7,<2012-04-15 21:15:04.890 -0500>,<Administrator>,<TOPSPIN>,<proc1d>,<TOPSPIN 2.1>,
      <abs ABSG = 4 
       data hash MD5: 32K
       D3 E3 0D 23 B8 E2 32 69 00 69 21 1B AE C5 3C FB>)
(   8,<2012-04-15 21:15:04.921 -0500>,<Administrator>,<TOPSPIN>,<proc1d>,<TOPSPIN 2.1>,
      <abs ABSG = 5 
       data hash MD5: 32K
       3D A1 E4 6E 87 A6 03 B2 FD 6C C8 AC 23 0B E4 D5>)
(   9,<2012-04-15 21:15:08.546 -0500>,<Administrator>,<TOPSPIN>,<audit>,<TOPSPIN 2.1>,
      <user comment:
       ICON-NMR User ID: COFFEE
       data hash MD5: 32K
       3D A1 E4 6E 87 A6 03 B2 FD 6C C8 AC 23 0B E4 D5>)
$$ ##END=
$$ [...]
150 150 150 150 150 150 150 150
##$TP07= 0
##$TPNAME0= <>
##$TPNAME1= <>
##$TPNAME2= <>
##$TPNAME3= <>
##$TPNAME4= <>
##$TPNAME5= <>
##$TPNAME6= <>
##$TPNAME7= <>
##$TPOAL= (0..7)
0.5 0.5 0.5 0.5 0.5 0.5 0.5 0.5
##$TPOFFS= (0..7)
0 0 0 0 0 0 0 0
##$TUNHIN= 0
##$TUNHOUT= 0
##$TUNXOUT= 0
##$USERA1= <user>
##$USERA2= <user>
##$USERA3= <user>
##$USERA4= <user>
##$USERA5= <user>
##$V9= 5
##$VALIST= <valist>
##$VCLIST= <CCCCCCCCCCCCCCC>
##$VD= 0
##$VDLIST= <DDDDDDDDDDDDDDD>
##$VPLIST= <PPPPPPPPPPPPPPP>
##$VTLIST= <TTTTTTTTTTTTTTT>
##$WBST= 2048
##$WBSW= 25
##$XGAIN= (0..3)
0 0 0 0
##$XL= 0
##$YL= 0
##$YMAX_a= 496100
##$YMIN_a= -611850
##$ZGOPTNS= <>
##$ZL1= 120
##$ZL2= 120
##$ZL3= 120
##$ZL4= 120
##$ABSF1= 14.98061
##$ABSF2= -5.57192
##$ABSG= 5
##$ABSL= 3
##$ALPHA= 0
##$AQORDER= 0
##$ASSFAC= 0
##$ASSFACI= 0
##$ASSFACX= 0
##$ASSWID= 0
##$AUNMP= <proc_prof1d_extract_pilot.lims>
##$AXLEFT= 0
##$AXNAME= <>
##$AXNUC= <1H>
##$AXRIGHT= 0
##$AXTYPE= 0
##$AXUNIT= <>
##$AZFE= 0.1
##$AZFW= 0.1
##$BCFW= 0
##$BC_mod= 0
##$BYTORDP= 0
##$COROFFS= 0
##$CY= 15
##$DATMOD= 1
##$DC= 0
##$DFILT= <>
##$DTYPP= 0
##$F1P= 0
##$F2P= 0
##$FCOR= 0.5
##$FTSIZE= 32768
##$FT_mod= 6
##$GAMMA= 0
##$GB= 0
##$INTBC= 1
##$INTSCL= 1
##$ISEN= 128
##$LB= 0
##$LEV0= 0
##$LPBIN= 0
##$MAXI= 10000
##$MC2= 0
##$MEAN= 0
##$ME_mod= 0
##$MI= 0
##$NCOEF= 0
##$NC_proc= -8
##$NLEV= 6
##$NOISF1= 0
##$NOISF2= 0
##$NSP= 0
##$NTH_PI= 0
##$NZP= 0
##$OFFSET= 14.98061
##$PC= 1
##$PHC0= 210.4266
##$PHC1= 0
##$PH_mod= 1
##$PKNL= yes
##$PPARMOD= 0
##$PPDIAG= 0
##$PPIPTYP= 0
##$PPMPNUM= 2147483647
##$PPRESOL= 1
##$PSCAL= 4
##$PSIGN= 0
##$PYNMP= <proc.py>
##$REVERSE= no
##$SF= 400.13
##$SI= 32768
##$SIGF1= 0
##$SIGF2= 0
##$SINO= 400
##$SIOLD= 32768
##$SPECTYP= <>
##$SREGLST= <1H.CDCl3>
##$SSB= 0
##$STSI= 32768
##$STSR= 0
##$SW_p= 8223.68421052632
##$SYMM= 0
##$S_DEV= 0
##$TDeff= 65536
##$TDoff= 0
##$TI= <>
##$TILT= no
##$TM1= 0
##$TM2= 0
##$TOPLEV= 0
##$USERP1= <user>
##$USERP2= <user>
##$USERP3= <user>
##$USERP4= <user>
##$USERP5= <user>
##$WDW= 1
##$XDIM= 32768
##$YMAX_p= 457654087
##$YMIN_p= -683312
##$CURPLOT= <Network HP LaserJet P1505>
##$CURPRIN= <$Network HP LaserJet P1505>
##$DFORMAT= <normdp>
##$LAYOUT= <+/1D_H.xwp>
##$LFORMAT= <normlp>
##$PFORMAT= <normpl>
##$SURQMSG= 1
$$ End of Bruker specific parameters
$$ ---------------------------------
##NTUPLES= NMR SPECTRUM
##VAR_NAME=  FREQUENCY,     SPECTRUM/REAL,   SPECTRUM/IMAG
##SYMBOL=    X,             R,               I
##VAR_TYPE=  INDEPENDENT,   DEPENDENT,       DEPENDENT
##VAR_FORM=  AFFN,          ASDF,            ASDF
##VAR_DIM=   32768,         32768,           32768
##UNITS=     HZ,            ARBITRARY UNITS, ARBITRARY UNITS
##FACTOR=    0.250966925370066, 1,           1
##FIRST=     8223.43324360095, 33735,        -110913
##LAST=      0,             -57285,          -166370
##MIN=       0,             -683312,         0
##MAX=       8223.43324360095, 457654087,    0
$$ Real data points
##PAGE= N=1
##DATA TABLE= (X++(R..R)), XYDATA
$$ [...]
19473b07792k34683K11879A05826a00122j4757k51920A44774A4943P368a28096
19462b9724B50422D8535c8017l9428j16178n4076J14298j58328J37121k9858j17359
19451c01825J31540j18190D2999c09638a37537E2977g0257a153l05851E6984c64543
19439h5266j99653A77163a53215F0579J16690i1954m0049b2973A5993a88968B90914
19427E73c89255A09052l5922c2150j26639k2243k64908h2689p8910M1521B71036
19415h5296A31239e6510l11761j9545a08070n0300m4841A4106J14300b69989m9165
19404c19154D41417E4992J82583a64121B0801N2092g1691L1122o2488M3060b8775
19392d2554m1686r2247B4724h5178j59405A47026C644b14349j06423K5412O5885
$$ plain form
19473 -207792 -442475 -230596 105826 -100122 -114879 -366799 144774 14943 22311 -128096
19462 -29724 250422 48535 -38017 -77445 -193623 -247699 -133401 -291729 -154608 -184466 -301825
19451 -301825 -170285 -288475 42999 -309638 -137537 52977 -70257 -1153 -307004 56984 -364543
19439 -85266 -284919 177163 -153215 60579 177269 -91954 -132003 -22973 15993 -188968 290914
19427 573 -389255 109052 73130 -32150 -158789 -181032 -445940 -82689 -161599 -120078 271036
19415 -85296 131239 -56510 -368271 -387816 -108070 -158370 -203211 14106 128406 -269989 -319154
19404 -319154 441417 54992 237575 -164121 20801 72893 -71691 -40569 -103057 -59997 -28775
19392 -42554 -84240 -176487 24724 -85178 -244583 147026 3644 -214349 -320772 -295360 -229475
19381b29475A5444J4163J7028i4279A23342e9629C2037a35862a7083m7492D7976
19369C0092e57758a02304C9740J42576i0519K5765l187r6372l7387R9958j48364
19358b50106d9971j51850l2630J3475F541a43392m1642a7421A34085A4375P4227
19347H8602A1133a8416r1570F4533b91392c3396a6323k70803i2200k70951A31132
19335a46496L2913A56604c52035e9652F6756b24855C5162a50220D9980K36173
19325B86153b57331g6288O513B86614a14405B4223b34555l12041I3881Q4675h5521
19313c26062E5869h2409L1511a4133A37212M805a69987g6335k26881a03607B03942
19301A67196n7127a27553A94144D9776A3053R5651a71340d3447k12574C6864K21798
$$ plain form
19381 -229475 15444 29607 46635 -94279 123342 -59629 32037 -135862 -17083 -64575 47976
19369 30092 -557758 -102304 39740 182316 -90519 -64754 -67941 -164313 -201700 -101742 -250106
19358 -250106 -49971 -201821 -234451 -220976 6541 -143392 -185034 -17421 134085 14375 88602
19347 88602 11133 -18416 -109986 64533 -291392 -33396 -16323 -287126 -92200 -363151 131132
19335 -146496 -113583 156604 -352035 -59652 66756 -224855 35162 -150220 49980 286153
19325 286153 -257331 -76288 -69775 286614 -114405 24223 -234555 -546596 93881 178556 -85521
19313 -326062 55869 -82409 -50898 -14133 137212 142017 -169987 -76335 -303216 -103607 203942
19301 167196 110069 -127553 194144 49776 13053 108704 -171340 -43447 -256021 36864 258662
19290B58662p1144c06098P7902m8622m0703J07808a7129B17835b44334F4506b44197
19278A19156b62619a16031B02319l7835F4109J964D133J93222m7341o040a09869
19266A07140g5693l99601F6558a88010C3066g6344C24063A02000m0387a09344
19255i7661j64490L7219B8504a05118B0262n043e5320j21042m2092B60438H7430
19243c28239G2661M8698D5077B0215R0860d3255A9673e6728B68300d4803D3229
19231a0650r8696A79839i8668K1120I067b99477a38010j1019C2330f2595p5760
19220a38355b0362j40740A74580p4972a27349o5708B25578b13228a00308l50236
19210d50544i5458m5851f0512j93940k5540c7070A01120A2982J55507g4763A3764
$$ plain form
19290 258662 187518 -306098 -228196 -276818 -317521 -209713 -17129 217835 -244334 64506 -244197
19278 119156 -262619 -116031 202319 164484 64109 66073 4133 197355 150014 143974 -109869
19266 107140 -75693 -475294 66558 -188010 33066 -76344 324063 102000 61613 -109344
19255 -97661 -262151 -224932 28504 -105118 20262 15219 -55320 -176362 -218454 260438 87430
19243 -328239 72661 121359 45077 20215 111075 -43255 19673 -56728 268300 -44803 43229
19231 -10650 -109346 179839 -98668 -77548 9067 -299477 -138010 -149029 32330 -62595 -138355
19220 -138355 -20362 -161102 174580 99608 -127349 -193057 225578 -213228 -100308 -450544
19210 -450544 -95458 -141309 -60512 -254452 -279992 -37070 101120 12982 168489 -74763 13764
19198C3569d8050F6112p363h0896D7341e5578n7910A1766a80172J8218P8170l0302
19186a14086l5609d3477A00288f1120E5267l583c03514f3570B3585K53551g2743
19174A03734K629f1267j29646E4544a1645j18753j92038J03205N0827b7110G5832
19162c32036c2871j04394l26438a12221A15274c40642a53448p3773B24121i0162
19151d12976a75431D63479A36184c8837j39272B12171L28599a2378l43553D4528
19140B75703a32753j87217i4555A46152d97922c0955B47855c24933A60490L3011
19130A93501i3752l0144k8663K1322k3058A0352N1445a99677d2327k34507J03103
19119a73731A42904a06145G1630A4788P9185F759f816E37317a62946B93662B5877
$$ plain form
19198 33569 -48050 66112 58749 -80896 47341 -55578 -113488 11766 -180172 -161954 -83784 -114086
19186 -114086 -149695 -43477 100288 -61120 55267 51684 -303514 -63570 23585 277136 -72743
19174 103734 106363 -61267 -190913 54544 -11645 -130398 -322436 -219231 -168404 -27110 75832
19162 -332036 -32871 -137265 -463703 -112221 115274 -340642 -153448 -227221 224121 -90162
19151 -412976 -175431 463479 136184 -38837 -178109 212171 540770 -12378 -355931 44528
19140 275703 -132753 -319970 -94555 146152 -497922 -30955 247855 -324933 160490 193501
19130 193501 -93752 -123896 -152559 -131237 -154295 10352 61797 -199677 -42327 -276834 -173731
19119 -173731 142904 -106145 71630 14788 93973 6759 -6816 537317 -162946 293662 25877
19107a43095J0272e3876k7115C9512a4375A52318d0655F4794g9606D9388d41010
19095I8736b89373A14609a07348M3074k12109G6095J7481i7637L2180C862J13954
19084A17816d0937k64923H8016O7552K74526A01888J78582B3295Q5801c9462J7192
19073b2270C0793a17331N287k5993O5134k46748B66532a14697j29743a6765j39937
19062a56702B19959b968A01590a61022g1321b3313B25132l0596B2259b082k32530
19051b34612M4109P5612A6607c18137a10360A40128c30800G994d6008a3260A16461
19039d60659a32524q9924h0485o5922A27059f4395k7530j7323A45197b94769J34518
19028a60251d6743A03494h8276C4450b28100I242a54286q0427A10101a84060P9217
$$ plain form
19107 -143095 -132823 -53876 -80991 39512 -14375 152318 -40655 64794 -79606 49388 -441010
19095 98736 -289373 114609 -107348 -64274 -276383 76095 93576 -97637 -65457 3862 117816
19084 117816 -40937 -305860 88016 155568 430094 101888 280470 23295 109096 -39462 -22270
19073 -22270 30793 -117331 -112044 -138037 -72903 -319651 266532 -114697 -244440 -16765 -156702
19062 -156702 219959 -2968 101590 -161022 -71321 -23313 225132 194536 22259 -2082 -234612
19051 -234612 -190503 -114891 16607 -318137 -110360 140128 -330800 7994 -46008 -13260 116461
19039 -460659 -132524 -222448 -80485 -146407 127059 -64395 -91925 -109248 145197 -294769 -160251
19028 -160251 -46743 103494 -88276 34450 -228100 9242 -154286 -234713 110101 -184060 -104843
19017a04843A72203H2580e3066I5831A5412Q528L42495A30206b41518N1610D6080
19005A7325d11218J91895M6562C7327J29879b15181J02001A80007a56447j99791
18995c56238D2139a50340B9455J0521b36633A26025D9467K017J4472d36377B26937
18983b12473D0664b86056B33474d7136q8490m6106R0691o7114A75735J48469b88110
18971a52162D65222C599R1307J28681a83877L6115p6671g1437A11470m0228N5478
18960A26720f9826F2954K66803J25598J26525B64240A19049g5126G1696C4050
18949B54584b5288j76491A8043J9728J54648a46663E9065N7609a72873B57260
18938E1778h3054p3440C8934a16025H1879j274e1439D1773b53584A711J94001
$$ plain form
19017 -104843 172203 82580 -53066 95831 15412 23940 366435 130206 -241518 -189908 46080
19005 17325 -411218 -219323 -172761 37327 167206 -215181 -113180 180007 -156447 -356238
18995 -356238 42139 -150340 29455 39976 -236633 126025 49467 51484 65956 -436377 226937
18983 -212473 40664 -286056 233474 -47136 -135626 -181732 -91041 -158155 175735 324204 -288110
18971 -152162 465222 3599 94906 223587 -183877 -147762 -224433 -71437 111470 71242 126720
18960 126720 -69826 62954 329757 455355 581880 264240 119049 -75126 71696 34050
18949 254584 -25288 -201779 18043 37771 192419 -146663 59065 116674 -172873 257260
18938 51778 -83054 -156494 38934 -116025 81879 80605 -51439 41773 -253584 1711 195712
18927A95712r3107m6831g5758o9938I7226b85113J09942B7869a69907I4281b60439
18915B04100b64893K6381K9655e3940l6109A7794b0258m5354k8471I2544h0084
18903i5170j2465q6707A03636a68628e1171I5081g6589B74253b7289D73624j95411
18892B78213n6571B2321J80572n8407B4440L7014M8832a93467h3981k63140g4323
18880i6131j94963A62345e20290B18448c2306l42103a64427r9631O2473h6868
18869f6899e030j73818A57358a69752j19683N9452J07059l8849f0979A55212m1795
18858A13417b53441B0993g5538F0047r602a32568A13628a69281A2469b20544H9011
18846a82387g1394C7364O0562a50786c9553i291E0799a21486F6191J94307H9604
$$ plain form
18927 195712 102605 55774 -75758 -145696 97226 -285113 -175171 27869 -169907 94281 -260439
18915 204100 -264893 -238512 -208857 -53940 -90049 17794 -20258 -65612 -94083 92544 -80084
18903 -95170 -107635 -194342 103636 -168628 -51171 95081 -76589 274253 -27289 473624 278213
18892 278213 221642 22321 202893 144486 24440 61454 110286 -193467 -83981 -347121 -74323
18880 -96131 -291094 162345 -520290 218448 -32306 -374409 -164427 -264058 -201585 -86868
18869 -66899 -5030 -178848 157358 -169752 -289435 -229983 -122924 -161773 -60979 155212 113417
18858 113417 -253441 20993 -75538 60047 50445 -132568 113628 -169281 12469 -220544 89011
18846 -182387 -71394 37364 97926 -150786 -39553 -9291 50799 -121486 66191 260498 89604
18834c8920k5646A13112b16056B01860f4998L0095C3606g2439j79588G6696e2130
18822e73937a43740L238a0853E695Q4103a23733j05479L4664L9162C8497a52803
18810e6688a9523m0676j98098C5235a48177A44212G1826e8979A48165e1421a5472
18798c1240B56749c48038a54563C40685J855r7168J5162a78871G3508c63123A02648
18786A29593c3412j31873o7H7294a56018j31186d3184J4600A16797A2461R5022
18775A07483a51831f4438D24776G598d5352J2536l1383m31442C40538H7199J73
18764H7372d3220o1695j4497k9069r8796A3960b33860J07678j01452A15630c35322
18752a99345I1309k3641a68627n4015B81850C7969P9264K3499J04110C4765c8573
$$ plain form
18834 -38920 -64566 113112 -216056 201860 -64998 -34903 33606 -72439 -252027 76696 -52130
18822 -573937 -143740 -140502 -10853 5695 89798 -123733 -229212 -194548 -155386 38497 -152803
18810 -56688 -19523 -60199 -258297 35235 -148177 144212 71826 -58979 148165 -51421 -15472
18798 -31240 256749 -348038 -154563 340685 342540 245372 260534 -178871 73508 -363123 102648
18786 129593 -33412 -165285 -165352 87294 -156018 -287204 -43184 -28584 116797 12461 107483
18775 107483 -151831 -64438 424776 7598 -45352 -32816 -64199 -495641 340538 87199 87372
18764 87372 -43220 -104915 -119412 -148481 -247277 13960 -233860 -126182 -227634 115630 -335322
18752 -199345 91309 67668 -168627 -222642 281850 37969 117233 140732 244842 34765 -38573
18740b76958f6319j79739e4273p5966B74044a27353N3665E1162K6247a2355j39660
18729a52015K2150M8164C464a86400e3756C2480g1976E6016b76096c2649k29094
18718b61743l3354a8633A43536b53833e1616l43742J06944a24424A24850E5734
18707a5044l94460a4858I0525b52530r4080a62984n3478p6597A99744a37574L4551
18696a03023G5990a22923C694c570j48169l24234F0874C92Q994c35873N4549O8093
18684b13231J3408i4826A64193k1899b0756k11630j4765h1260k35742J10493c0458
18672a19120j71220c6947k12684A34206l4580a57608a7260C6189D285L17837a40565
18660a32225E0556b92225A33880j8547c01108O4870a07510B65569a81212j54427
$$ plain form
18740 -276958 -66319 -246058 -54273 -130239 274044 -127353 -73688 51162 77409 -12355 -152015
18729 -152015 -129865 -81701 3464 -186400 -53756 32480 -71976 56016 -276096 -32649 -261743
18718 -261743 -295097 -18633 143536 -253833 -51616 -395358 -288414 -124424 124850 55734
18707 -15044 -409504 -14858 90525 -252530 -346610 -162984 -216462 -293059 199744 -137574 -103023
18696 -103023 75990 -122923 3694 -3570 -151739 -475973 60874 392 9386 -335873 -281324 -213231
18684 -213231 -199823 -94826 164193 142294 -20756 -232386 -247151 -81260 -317002 -206509 -30458
18672 -119120 -290340 -36947 -249631 134206 99626 -157608 -17260 36189 4285 322122 -140565
18660 -132225 50556 -292225 133880 115333 -301108 -236238 -107510 265569 -181212 -335639
18650c35639c789j06407d2629H0253I322J25220P1015a77342B82660A1432e5278
18638a07130j13793K0164A82134k050b24908Q8810K8466q0890D5100J63544b51011
18626C46337A16541c5288o011A00250b57328b3332k90819J33770A75048D3583
18615D1375K81256a88839l7763A5299a11819A7768a5865P754n0862B44795q5693
18604A59102g6099j12831G0086A6546g1j89111c8238k07454d367A87051a59244
18592A52888n7833D3600j9630c29864e3266m32o539F3642a22779r2778H8422g9425
18579a11542b2955B09562c59196a1425C04874I7618a49912r9210R4751a857B82890
18567f6363j88386D295J17796E983f794k22149H5812d53639d468j69152c9610
$$ plain form
18650 -335639 -3789 -110196 -42629 80253 9322 134542 205557 -177342 282660 11432 -55278
18638 -107130 -220923 -200759 182134 180084 -224908 -136098 -107632 -188522 45100 208644 -251011
18626 346337 116541 -35288 -41299 100250 -257328 -23332 -314151 -180381 175048 43583
18615 41375 322631 -188839 -226602 15299 -111819 17768 -15865 -8111 -58973 244795 159102
18604 159102 -76099 -188930 70086 16546 -71 -189182 -38238 -245692 -4367 187051 -159244
18592 152888 95055 43600 23970 -329864 -53266 -53698 -60237 63642 -122779 -215557 88422 -79425
18579 -111542 -22955 209562 -359196 -11425 304874 97618 -149912 -249122 -154371 -1857 282890
18567 -66363 -254749 4295 122091 5983 -6794 -228943 85812 -453639 -4468 -173620 -39610
18555H4796a78963A71627G0761k4333b53487Q5471H0278B0975J34161d0465A30537
18543d6129l51576J64325J8282B31253a17093M9599G6461a00118G2957a04183
18532a76721j52545E4515a52716n120e5941E4340b75035f391j98092C13990b20740
18520A50888K3531a6173A60118A7102c92846c8990B30663c48973A81114b3960
18509a63956C28205c32955d3009H6438J36829n5638N631m5549c6726r3561p6301
18498b06588A46725b96598g333A12934J22962f1115j53027j43530O1635J18873
18488a77164C2731d9714H6588b18986E7312c90897A4318J22888J11530c0883A21587
18476b6740r0557r207K0236j06378e0906l14721a61390A0130a92643h8990D4866
$$ plain form
18555 84796 -178963 171627 70761 46428 -253487 -168016 80278 20975 155136 -40465 130537
18543 -46129 -397705 -233380 -215098 231253 -117093 -67494 76461 -100118 72957 -104183
18532 -176721 -329266 54515 -152716 -157836 -55941 54340 -275035 -6391 -204483 313990 -220740
18520 150888 174419 -16173 160118 17102 -392846 -38990 230663 -348973 181114 -23960
18509 -163956 328205 -332955 -43009 86438 223267 167629 173260 127711 -36726 -130287 -206588
18498 -206588 146725 -296598 -7333 112934 235896 -61115 -214142 -357672 -296037 -177164
18488 -177164 32731 -49714 86588 -218986 57312 -390897 14318 137206 248736 -30883 121587
18476 -26740 -117297 -126504 -106268 -212646 -50906 -365627 -161390 10130 -192643 -88990 44866
18464a2049A57616a26637f0625A09947C037R8505a61011O8818n150j14866J6864
18453a95345R1323A95392O8269d6119A36824Q971C2866a85932G7784J2480R8348
18442A88612q4298J23707D0790M75e5049A04273B4788a60680A55273e7871k45889
18431c03760a36087C4853A5351i0533a5515A51112M534j4721b72329M715L4417
18420b33197D6754a89917C09064a01814H7637k1752e487j21808c5074a1641C37504
18408d5693B29573c97159a1321l48986a73927A75622J5322b95476C6764K16722
18398B53486r0875f0032l03014B09362b02941I6908C6925e0554D9931c68963A8786
18386c3104B9313a0417j61335A86028j2185B1514b9505F9491h6810j29867D7543
$$ plain form
18464 -12049 157616 -126637 -60625 109947 3037 101542 -161011 -92193 -97343 -212209 -195345
18453 -195345 -104022 195392 263661 -46119 136824 145795 32866 -185932 77784 90264 188612
18442 188612 104314 228021 40790 41265 -55049 104273 24788 -160680 155273 -57871 -303760
18431 -303760 -136087 34853 15351 -90533 -15515 151112 155646 140925 -272329 -267614 -233197
18420 -233197 46754 -189917 309064 -101814 87637 65885 -5487 -127295 -35074 -11641 337504
18408 -45693 229573 -397159 -11321 -360307 -173927 175622 190944 -295476 36764 253486
18398 253486 162611 -60032 -363046 209362 -202941 96908 36925 -50554 49931 -368963 18786
18386 -33104 29313 -10417 -171752 186028 173843 21514 -29505 69491 -86810 -216677 47543
18374B5945i1756A58341D4893a99400I398a39957A43741a01629c9219A97305c43179
18362A52377P5540a14570A48430a02035H1509a28851B36486I6940a58720k5313
18352a84033a572q826B55332A12383B9056J72493c1172A56284J17862g8185B36868
18340d7337H6300b8010l392k41547J06374A25260d8315F7501K15745H1923J59145
18329B41068e3549B13025b9192E5668h904B09554a71404L1327j466j26215A5377
18317c00216H3608L5584D0501b53017p4864E0861e1831H7400d7973j79393B57089
18305b69606A32713a71598E5833g9705A77202g3097A80309c71687E8494M10172
18295D68666e1320j236k11455p03q8221I8427M457b13317b6674A58939o010B5077
$$ plain form
18374 25945 -91756 158341 44893 -199400 9398 -139957 143741 -101629 -39219 197305 -343179
18362 152377 227917 -114570 148430 -102035 81509 -128851 236486 96940 -158720 -184033
18352 -184033 -1572 -10398 255332 112383 29056 201549 -31172 156284 274146 -78185 236868
18340 -47337 86300 -28010 -31402 -272949 -166575 125260 -48315 67501 283246 81923 241068
18329 241068 -53549 213025 -29192 55668 -8904 209554 -171404 -140077 -141543 -267758 15377
18317 -300216 83608 119192 40501 -253017 -327881 50861 -51831 87400 -47973 -227366 257089
18305 -269606 132713 -171598 55833 -79705 177202 -73097 180309 -371687 58494 468666
18295 468666 -51320 -52556 -264011 -264714 -352935 98427 102884 -213317 -26674 158939 152929 25077
18282A66229b7021j37568A37330c25908Q6024B9307a08927A08360b09551A51053
18271A29057J71994A37643e8917F6201J4057b954k99064b5173C9647c15958C02066
18259g7383k21631B82291d7946k55210J10986i5046j12156K3265D4972a52277
18248a56915P7268C98077j81494N7721a34928A40838b35573B05616b57225B8595
18237a33635I5609b52470A0063a5564m7413j36404f6822o6063I2151N7560B7175
18225A20756M0734a42828O0370p258j93124B17437r9885a87791F9376a44953l6219
18214a81172F3883b449H7080i6472b8332j52116a3990A2245M0572a39091A76448
18202b2284A64548A8840a88364A31536c06131h4548d0476n9721B73336q1199b58565
$$ plain form
18282 166229 -27021 -164589 137330 -325908 -239884 29307 -108927 108360 -209551 151053
18271 129057 301051 137643 -58917 66201 80258 -2954 -302018 -25173 39647 -315958 302066
18259 -77383 -299014 282291 -47946 -303156 -192170 -95046 -207202 -183937 44972 -152277
18248 -156915 -79647 398077 216583 274304 -134928 140838 -235573 205616 -257225 28595
18237 -133635 95609 -252470 10063 -15564 -62977 -199381 -66822 -132885 92151 149711 27175
18225 120756 161490 -142828 -82458 -89716 -282840 217437 117552 -187791 69376 -144953 -181172
18214 -181172 63883 -2449 87080 -96472 -28332 -180448 -13990 12245 52817 -139091 176448
18202 -22284 164548 18840 -188364 131536 -306131 -84548 -40476 -100197 273336 192137 -258565
18190B5050a27267c6805k61597B81206E8656h2968A3359b7600k59193B6692b17195
18178b20612B82019a24662B33629c4215k61853a15990d901j73000j3689F3916
18167a7845B09770j322K7554b93033J24749A10171i9671n3610C64267f6562j63949
18156b30511C7331K05361C6686j5446a64559R810p7060e846D0783N3763K80365
18145C74911a20536G3120a09021E2404b15218B82007f5488A05165b45204J4544
18135b30660B79388A20934I605J17907A5229J45014p1689J30167A1098N4576J2102
18124G7776e4834E6989O617J64204N65A08084b3765A29432h9188c3493k27339
18113b60832B01681D4737J4614a49578C54147a01890j01601D0249f5299A47781
$$ plain form
18190 25050 -127267 -36805 -298402 281206 58656 -82968 13359 -27600 -286793 26692 -217195
18178 -220612 282019 -124662 233629 -34215 -296068 -115990 -4901 -177901 -191590 63916
18167 -17845 209770 208448 236002 -293033 -168284 110171 -99671 -153281 364267 -66562 -230511
18156 -230511 37331 242692 36686 21240 -164559 -154749 -231809 -5846 40783 94546 374911
18145 374911 -120536 73120 -109021 52404 -215218 282007 -65488 105165 -245204 -230660
18135 -230660 279388 120934 9605 127512 15229 160243 88554 218721 11098 65674 77776
18124 77776 -54834 56989 63606 227810 228375 108084 -23765 129432 -89188 -33493 -260832
18113 -260832 201681 44737 59351 -149578 354147 -101890 -203491 40249 -65299 147781
18102b49037A98612e8609p2521G3632K3123b25738F8117a08224G3420c44198F5647
18090a28770A91490a34206p9722M3789o439B81916e7427a3373A9102J44883d4402
18078b78261B58728I5641a95915B90995e5412B7778J29252O0498H3211a24153
18067b085C4014J17038B0348J20309b36059B40935A1351b65581N6188K8574J8728
18056a62091j78620A87748L1872p7142a62451C29130C4192K82810G4760N74d8935
18044g3761E9860R3751b11692O8302B59433d9632D951a42445j70006G317i8180
18032c50273c7274k5408K04F5526d0217l9805D24198B408e5219A44372b68409
18020A18923f3612C6040K37005n5092b505A09143K74976a37441E5673b42208h8751
$$ plain form
18102 -249037 198612 -58609 -131130 73632 96755 -225738 68117 -108224 73420 -344198 65647
18090 -128770 191490 -134206 -213928 -170139 -176578 281916 -57427 -13373 19102 163985 -44402
18078 -278261 258728 95641 -195915 290995 -55412 27778 157030 217528 83211 -124153
18067 -2085 34014 151052 20348 140657 -236059 240935 11351 -265581 -209393 -180819 -162091
18056 -162091 -340711 187748 219620 142478 -162451 329130 34192 317002 74760 75334 -48935
18044 -73761 59860 153611 -211692 -143390 259433 -49632 4951 -142445 -312451 7317 -98180
18032 -350273 -37274 -62682 -62478 65526 -40217 -80022 424198 2408 -55219 144372 -268409
18020 118923 -63612 36040 273045 217953 -2505 109143 384119 -137441 55673 -242208 -88751
18008b18664f8537B22426b21623P0932a2725k8545D00411a16231n6546P6886L9173
17997e6718l264C8117a26799H2119a24994C9842a29937B8024K61790k363b46991
17985b97031B64905c34135E876J16304m5317j3103A2825J8813b2694C22650l4708
17974B87942b09695l82954D4099a49878A52174c96032A35271b63209d9621F5504
17963A8552a31831a8639B05456g7627G9361b35853d6299n6564b9124D2271J07304
17952A49575a01699E8900K4357d9549b3366r0962B42048Q4663j62696A3825a64772
17940B11786a83829g6472A21714d54167A63331J46818h9272A32486O6684a2063
17929b7332j07599B20343G5617n333b36898F5717b7288D9809L7380g4657j7341
$$ plain form
18008 -218664 -68537 222426 -221623 -150691 -12725 -41270 400411 -116231 -172777 -95891 -56718
17997 -56718 -59982 38117 -126799 82119 -124994 39842 -129937 28024 289814 287451 -246991
17985 -297031 264905 -334135 5876 122180 76863 63760 12825 31638 -22694 322650 287942
17974 287942 -209695 -592649 44099 -149878 152174 -396032 135271 -263209 -49621 65504
17963 18552 -131831 -18639 205456 -77627 79361 -235853 -46299 -102863 -29124 42271 149575
17952 149575 -101699 58900 83257 -49549 -23366 -114328 242048 326711 164015 13825 -164772
17940 211786 -183829 -76472 121714 -454167 163331 310149 -89272 132486 199170 -12063
17929 -27332 -134931 220343 75617 70284 -236898 65717 -27288 49809 87189 -74657 -91998
17918i1998k3887G8010e3682C00016I9675h8191L1051j74917a14110A09210p822
17907A01388a95234f4157j41429C05720c9439H0916a75358O3579j87355A45617
17896c4177C38066q4086f6255q2632B65769l1520A10527i6369d465j69228a3200
17884d5286j10926a0786l2453q7524E2566L52449a19305b2153B1700a90164A62227
17872B34681a37848G6053N7968l5891e8518A3443O4534J94410b85820A22600a08573
17860A59337o8459b2636A98066C8235e8682A94478k8688f9024E7684c6210D15582
17848B4797J49047f8298b2593I2028J87467M1655L051B4754K63960o7474H6135
17836A90561F8043i9779A45082K2773i2603j44040P5159I1632K28384m4417A5489
$$ plain form
17918 -91998 -115885 78010 -53682 300016 99675 -88191 -57140 -232057 -114110 109210 101388
17907 101388 -195234 -64157 -205586 305720 -39439 80916 -175358 -111779 -299134 145617
17896 -34177 338066 253980 -66255 -148887 265769 234249 110527 -96369 -4465 -173693 -13200
17884 -45286 -156212 -10786 -43239 -130763 52566 405015 -119305 -22153 21700 -190164 162227
17872 234681 -137848 76053 134021 98130 -58518 13443 77977 272387 -285820 122600 -108573
17860 159337 90878 -22636 198066 38235 -58682 194478 165790 -69024 57684 -36210 415582
17848 24797 173844 -68298 -22593 92028 279495 321150 324201 24754 288714 221240 86135
17836 190561 68043 -99779 145082 167855 -92603 -236643 -161484 91632 320016 275599 15489
17824A08605J5099e0872B06694C9482h4907j57026C2374L2448d3927n3008A3182
17812F8468J16052a40639A16235M18924p1117b15859C04037a09556p1376A05129
17801A35467l9618A8914N6322C0130K46488a24007r3087A39161K2380e8815A53227
17789A39226a4278A12370a76663M0798b6180A18155E5641b27720a12164A58273
17778A5315L6107O6359J31273e820F8021J60555p3394a3179j23879A02960J91410
17767B94370P9j9787j12152d5083A12906d8402A25370a06635g521A96684q9878
17756A06806b78880D5172O6390n2081c7401A82996q4367M5504b46356H890h4369
17744A53749i9692k59328B75509f0912p4281E7170J15859J8864q3755J1175J02412
$$ plain form
17824 108605 123704 -50872 206694 39482 -84907 -241933 32374 64822 -43927 -96935 13182
17812 68468 184520 -140639 116235 535159 464042 -215859 304037 -109556 -180932 105129
17801 135467 95849 18914 75236 30130 276618 -124007 -217094 139161 161541 -58815 153227
17789 139226 -14278 112370 -176663 -135865 -26180 118155 55641 -227720 -112164 158273
17778 15315 51422 117781 249054 -5820 68021 228576 155182 -13179 -137058 102960 294370
17767 294370 294449 274662 162510 -45083 112906 -48402 125370 -106635 -7521 196684 106806
17756 106806 -278880 45172 111562 59481 -37401 182996 98629 144133 -246356 8890 -84369
17744 153749 -99692 -359020 275509 -60912 -135193 57170 173029 191893 108138 119313 221725
17733B21725q251n8170e66651a11215I5697b15383H1063f6862B8946J87576q3151
17722A33371J06712b4573c511B2686q497a81773E0304P6575F119Q6706J41095
17711B33920j05949b3315B75781D6341b0320B25390O0501B0840J59214d9226H7695
17699a96271B34083r5499m0111K2284Q9017f7524o255B88252b3707B91562I3053
17687b1174A2799a935k9577A46027b68657A89048g2459p3307A15189j3507b87234
17675B1250K39050A23635D8376a11277q2776A02588l5903L5660m7143K42595j34824
17664A62973J473b53702H3436Q4646j7874J63243h9701q9483A3504J08986a72419
17652F7499M37927I4157Q2135H2525K97332q4698I8132d1612E2235L01140e6369
$$ plain form
17733 221725 213474 155304 -566651 -111215 95697 -215383 81063 -66862 28946 216522 133371
17722 133371 240083 -24573 -3511 22686 14189 -181773 50304 126879 6119 92825 233920
17711 233920 127971 -23315 275781 46341 -20320 225390 285891 20840 180054 -49226 87695
17699 -196271 234083 138584 98473 120757 209774 -67524 -73779 288252 -23707 291562 93053
17687 -21174 12799 -1935 -31512 146027 -268657 189048 -72459 -145766 115189 101682 -287234
17675 21250 260300 123635 48376 -111277 -194053 102588 66685 102345 55202 297797 162973
17664 162973 164446 -253702 83436 168082 150208 313451 -89701 -179184 13504 122490 -172419
17652 67499 505426 94157 176292 82525 379857 295159 98132 -41612 52235 353375 -56369
17640A51958e2130A36693m0590c97493a9838C6394b7462m3651A19751J23654b52090
17628H2936L33347a44375A06635L48127c271o1672B28977c4881E1904M9911J17061
17617B18876r7159J66602C3023a22691D74945f0284K2788A75812o0662K920J21225
17606B39295A7041c45160d9994C80147a30394B8179M1317O7081R1804i5415K9480
17595f5935D10092L9087a9773B54768H4929A651h642C03160I8943F635L58176
17584C64811D7820J87356l011k8238J37447A69563J60113h6810B36859a6732G8146
17572e0824A74043m1762j9776g6392C59859K12169a12411I0739a33209E3075J69060
17561B22135J48294B329M02421E3578K9806J72760A6825a81340C72229H9352N3300
$$ plain form
17640 151958 -52130 136693 96103 -397493 -19838 36394 -27462 -71113 119751 243405 -252090
17628 82936 416283 -144375 106635 454762 -3271 -64943 228977 -34881 51904 101815 218876
17617 218876 121717 288319 33023 -122691 474945 -60284 -37496 175812 115150 118070 239295
17606 239295 17041 -345160 -49994 380147 -130394 28179 69496 136577 228381 -95415 -65935
17595 -65935 410092 449179 -19773 254768 84929 1651 -8642 303160 98943 6635 364811
17584 364811 47820 235176 232165 203927 341374 169563 329676 -86810 236859 -16732 78146
17572 -50824 174043 132281 112505 -76392 359859 572028 -112411 90739 -133209 53075 222135
17561 222135 370429 2329 404750 53578 83384 256144 16825 -181340 372229 89352 142652
17550A42652b389G2391M2942o436k8746b82143C25600K8428j15709J84726j24333
17539B98712k4745J11795A48930J92703j22585K19647j17554P5958a29386D55964
17528D34058a5507j97496B40452J21879A48383l45B9319J76866J82889J58498
17518E47572A86123A6575H228M97811A34720L79463p3043J76143O2513J97574
17508H77370j83390o9809K1143B00270J96461R316j56568K52205A16735L79413
17498D96148k124B22638N23849L4516j24065L00625N563p2557C66041K81243B15559
17486C75809A01566O12573l56889q1982d9462H9619L51909A12872L20501j52751
17476B80622j32975O9717q5719L6973o5457M3220K27016B3904R0483J35373j3137
$$ plain form
17550 142652 -2389 72391 115333 108897 80151 -282143 325600 354028 238319 423045 298712
17539 298712 273967 385762 148930 341633 219048 438695 321141 397099 -129386 455964
17528 434058 -15507 -213003 240452 362331 148383 148038 29319 206185 389074 547572
17518 547572 186123 16575 8228 506039 134720 514183 441140 617283 679796 877370
17508 877370 693980 624171 645314 200270 396731 406047 249479 501684 116735 496148
17498 496148 494024 222638 746487 781003 656938 957563 963126 890569 366041 647284 215559
17486 375809 101566 714139 357250 275268 -49462 89619 441528 112872 433373 280622
17476 280622 147647 217364 131645 168618 103161 146381 373397 23904 114387 249760 236623
17465B36623L6839D0297Q8075G826Q6991k1285K03529K7476K927o449A01254L8271
17453A39525K72914j48561r8803c0748A38576L13156B6940L10030n8749g7677
17442A06131K27885o7844E0494K77100K17849k67125b406C74836q3515L23240
17432F14561j81775j3546K42488A35191M07926k03657P6279F5233K14195Q2573
17422C62001L39760k69094P7216j63238j28148Q977F9433L66060H5164L71200
17412D56364E422J14659N9898L33278H0472K07185J12688D4504K81143K42277
17402E67924j25913k15758K21018n534k05147P3389L8175j12065I4008N99363
17392F93371k20846B32657P0566a1361k05447A50152M9463P0164f3213C54444
$$ plain form
17465 236623 273462 40297 128372 7826 94817 73532 277061 304537 307464 301015 101254 139525
17453 139525 412439 263878 165075 -30748 138576 451732 26940 336970 278221 -77677
17442 106131 334016 266172 50494 327594 545443 278318 -2406 374836 291321 614561
17432 614561 432786 419240 661728 135191 543117 339460 415739 65233 279428 362001
17422 362001 701761 432667 509883 346645 218497 227474 69433 435493 85164 456364
17412 456364 5422 120081 179979 513257 80472 287657 400345 44504 325647 567924
17402 567924 442011 226253 447271 441737 236590 309979 348154 236089 94008 693371
17392 693371 472525 232657 303223 -11361 -216808 150152 199615 269779 -63213 354444
17381C07156A2496Q7331L00594j62716F2841j2740O0009L08095K9811j67279o7505
17370B13232b05809B16847K57284q9301j66209P206B2830L75920j39059r9471
17360A60220M34058H1026J00396m0332Q2860H7756K40280E3980J01638K55903
17350D11521A09372Q7895m9048K23815B7888L44831a2419H5593J27843P818o6885
17339A54369J88273A57960n255P8922m7784K65105A32059J37308J83887A48927
17328E19793N8128H9083J00999L1006K2340r1013J54661L6425a13173C10147K11934
17317E22081Q4505r0723I0749R5265o540F724J89987P4275j25762K48866C7500
17305B66580J18058o4907A35705M3490L6942I4391o835J00910K32535m1717j78599
$$ plain form
17381 307156 12496 99827 400421 237705 62841 50101 110110 418205 448016 280737 213232
17370 213232 -205809 216847 474131 384830 218621 225827 22830 398750 259691 160220
17360 160220 594278 81026 181422 141090 223950 87756 328036 53980 155618 411521
17350 411521 109372 197267 148219 372034 27888 372719 -12419 85593 213436 221254 154369
17339 154369 342642 157960 152705 231627 183843 448948 132059 269367 453254 148927
17328 519793 577921 89083 190082 221088 243428 152415 307076 343501 -113173 310147 522081
17317 522081 606586 515863 90749 186014 179474 6724 196711 270986 145224 394090 37500
17305 266580 384638 319731 135705 179195 216137 94391 87556 188466 421001 379284 200685
17294B00685O42596l44639B2641g4164C23756E4196M02094j85188K0062N5190
17284C46354q2872O4061p4958J6692G5182a22340E46128o519j86115J719G8205
17272A68337M4651m2751P0348P7813C3120O11867p99j16147M8837C7909L24222
17261C62131A35230L33456r7334K8681j33851J3997J06774A77353J14608I5843
17250A6610L51812A61973Q7806q4425p5864j8295K25388O6951A16948K54247n2446
17239C18749o204k0439E5258R7015e985B95304Q1713j68850D0274R2852L00320
17228D33446J8789m4938P8984j93691j5693K03027l1599j48869k968a080D7846
17216G19861B81265P9766k3498j7444J02726A83165Q5489P9660N3785A36563J84469
$$ plain form
17294 200685 843281 498642 22641 -74164 323756 54196 456290 271102 291164 346354
17284 346354 263482 327543 252585 269277 75182 -122340 546128 539609 353494 355213 78205
17272 168337 212988 170237 240585 318398 33120 644987 644188 528041 576878 37909 362131
17261 362131 135230 468686 371352 400033 266182 280179 386953 177353 291961 95843
17250 16610 368422 161973 249779 165354 89490 71195 296583 363534 116948 371195 318749
17239 318749 312545 292106 55258 152273 -5985 295304 377017 208167 40274 133126 433446
17228 433446 452235 407297 486281 292590 276897 479924 448325 299456 296488 -1080 47846
17216 719861 281265 361031 337533 320089 422815 183165 268654 348314 402099 136563 321032
17205C21032J2475J51L210A28922m1364M69946B42997K23467k18689j1482L57786
17194E94079B22467K78546A85222j7608b7744B83371N23771A47483K32623q1336
17184B98770J70900A31278L98872J90882l37302N9075k18354J92101J54584j33555
17174D37581R9409j9920j7273O1035B08022L4507m4723K52120l5691r3513K39583
17163E60305J23895k64808K5342p8201J4841J33268j40541J57141j82264J02708
17153D51686j33973J52230j80927R8452Q9835p6916J96741J9875k77324J48677
17143D88356B14145J40563J31330J76988j04322K7144J8394k11986M50716l08570
17133E34402J4230n7856B09342M95280B90471K07059M5191M6244B92687K4685
$$ plain form
17205 321032 333507 333658 336868 128922 87558 557504 242997 466464 247775 236293 594079
17194 594079 222467 501013 185222 167614 -27744 283371 807142 147483 380106 298770
17184 298770 469670 131278 530150 721032 383730 442805 224451 416552 571136 437581
17174 437581 536990 517070 499797 560832 208022 242529 197806 449926 414235 320722 560305
17163 560305 684200 419392 444734 366533 381374 514642 374101 531242 348978 451686
17153 451686 317713 469943 289016 387468 477303 400387 597128 617003 339679 488356
17143 488356 214145 354708 486038 663026 558704 585848 604242 392256 842972 534402
17133 534402 548632 490776 209342 704622 290471 497530 542721 588965 292687 317372
17123C17372K84645n8595K48642n9900l16775Q4788K16563l42470J43774J63097
17113F81141k55483m929J79154p9766L9276B34228J68153O8330n1385J14311M122
17102E37759O1409M4975k64736l1038J37202J44574M8813K5875n5297A25739L05466
17091D31205K16093l4242l7799L66951C88281N9829k1535L93038N9462m25922
17081D53153L01279l02128j62166M45966l10501O9100J74776k3540j15846L19003
17071H49096j2637l08780P9740k77763M81180m974j33399j88787K0476k8758J38443
17060F13837j27393J47433j56439J85306p9416P9343J87816l82916J59394N0345
17050F77310k0629Q1111k38624K32189J72372j86075J62628k79147J91575j32348
$$ plain form
17123 317372 602017 543422 792064 732164 415389 500177 716740 374270 518044 681141
17113 681141 425658 420729 599883 520117 559393 234228 402381 470711 419326 533637 537759
17102 537759 599168 644143 379407 348369 485571 630145 678958 704833 649536 125739 431205
17091 431205 647298 613056 575257 942208 388281 448110 426575 819613 879075 453153
17081 453153 754432 452304 290138 736104 425603 494703 669479 645939 530093 849096
17071 849096 836459 527679 607419 329656 810836 805862 672463 483676 504152 475394 613837
17060 613837 486444 633877 477438 662744 583328 662671 850487 467571 626965 677310
17050 677310 656681 737792 499168 731357 903729 717654 880282 601135 792710 660362
17040F60362K27464k72595J12723O2255O4342P993D14213L98957j64851j61317
17030D87002L84799k65256K37162o3030J33423k24516K72820k90451L63430l67055
17020F68328J85110l1682m00758M27682l6797p7067M81379j53202m75406O99986
17010A287573m38848N6403k34862L3959R1270J15832o8965J60369J0597k21627
17000G91701J12564L5098O5451J71721j65705K62316l81688N73194n37051J79192
16990A106793J6441l14407K10522R789K36013k50296K16382l54112K23045R7796
16980A197966n5905o8041K56872L985o2825l13846N28346l77414N08280n46385
16970A071033J03340j71781M57144k82865M160J44618N7511m69192M61279K12668
$$ plain form
17040 660362 887826 615231 727954 790209 854551 862544 414213 813170 648319 487002
17030 487002 871801 606545 843707 780677 914100 689584 962404 671953 1035383 668328
17020 668328 853438 821756 420998 848680 811883 734816 1216195 1062993 587587 1287573
17010 1287573 848725 905128 670266 704225 795495 911327 842362 1002731 1013328 791701
17000 791701 904265 939363 1004814 1176535 1010830 1273146 891458 1464652 927601 1106793
16990 1106793 1123234 808827 1019349 1029138 1265151 1014855 1231237 877125 1100170 1197966
16980 1197966 1142061 1074020 1330892 1334877 1272052 958206 1486552 1109138 1617418 1071033
16970 1071033 1174373 1002592 1459736 1176871 1181031 1325649 1383160 913968 1375247 1587915
16960A587915j19974l10181R5400p7865n5996K06150K8087j67599M1135J80611
16950A407683L09462k78567M46541l76021l3956J66804j63587j78554M26436k49732
16940A476509K60582j34647k41398K03166j11357P3743J7746J49489O8999j69315
16930A593517P5659k03286L79662k0542k77905N02704n66982K56332L6314J40882
16920A916355K426k0684J09332l73649O20226m10291r1831Q5938K89517l00928
16910A826411R155R0604K49999m4656K90841k03010m88846K31689L59714k65177
16900B056724R5609J48920l0740K10139j44522J27943r1447K24649l70030j79723
16890B047522N52802j94615K00269k29640K32847J39653J881j6279N3235q0289
$$ plain form
16960 1587915 1467941 1157760 1253160 1175295 1119299 1325449 1353536 1185937 1227072 1407683
16950 1407683 1717145 1438578 1885119 1509098 1475142 1641946 1478359 1299805 1726241 1476509
16940 1476509 1737091 1602444 1361046 1564212 1452855 1526598 1544344 1693833 1762832 1593517
16930 1593517 1669176 1465890 1845552 1825010 1547105 2049809 1482827 1739159 1775473 1916355
16920 1916355 1918781 1898097 2007429 1633780 2254006 1843715 1751884 1837822 2127339 1826411
16910 1826411 1835566 1926170 2176169 2131513 2422354 2219344 1730498 1962187 2321901 2056724
16900 2056724 2152333 2301253 2270513 2480652 2336130 2464073 2372626 2597275 2227245 2047522
16890 2047522 2600324 2405709 2605978 2376338 2609185 2748838 2750719 2734440 2787675 2707386
16880B707386J87402Q8911K07802l28143j5062p2740J96726p5135j9130J10667
16870B988684j0893L32204R5046j78106K83205j66452j91226K18137J29321j31688
16860C368232J14986k9190P3735K69222m8535j30491L03069j46659J28262k62115
16850C640516K98296j70831N08298j98036j85185O40869j10364m4845K86523l0946
16840D634295K03241j15051K65130k03586M8493K15107l42904L04314J27929M34957
16830E571925l81158m1088M32989J88592Q3300J48218n0943K23140j92862N03345
16820F485458r4609k22771L62646J10882M68783m44293J28929P19287o6189j04038
16810G344085J36023L58159j9203j2097K80217L6220L61524J75427J8822j2053
$$ plain form
16880 2707386 2894788 2983699 3191501 2863358 2848296 2775556 2972282 2897147 2878017 2988684
16870 2988684 2977791 3309995 3405041 3226935 3510140 3343688 3152462 3370599 3499920 3368232
16860 3368232 3483218 3454028 3527763 3796985 3748450 3617959 3921028 3774369 3902631 3640516
16850 3640516 3938812 3767981 4276279 4078243 3893058 4533927 4423563 4378718 4665241 4634295
16840 4634295 4837536 4722485 4987615 4784029 4832522 5047629 4704725 5009039 5136968 5571925
16830 5571925 5190767 5149679 5582668 5771260 5854560 6002778 5951835 6174975 5982113 6485458
16820 6485458 6390849 6168078 6530724 6641606 7110389 6666096 6795025 7514312 7448123 7344085
16810 7344085 7480108 7838267 7819064 7806967 8087184 8123404 8484928 8660355 8679177 8667124
16800H667124K99039K94547K32767K49099J71588M34068K19177O4916K96003J72439
16790A1100767J7502N48848J34210J12473L10497M77320p7855P54707j37200N49148
16780A3790417K58659L74642M74464K97667M66882M08530J12311L31326J189159
16771A7704057J32877P6404R26485P40042L78241N77455P08107O01021Q27122
16762B2671811M30713N18931O56066R40094Q78345J060131M04830J182020Q79612
16753B9622553J218617R80345J076390J076509J244647J177189J305524J269325
16745C8971099J620230J378245J346997J777443J584938J839806K457499J477347
16737E2453604J968387K201921K170466K388036J883442K671004K775557K193236
$$ plain form
16800 8667124 8966163 9260710 9493477 9742576 9914164 10348232 10567409 10632325 10928328 11100767
16790 11100767 11118269 11667117 11801327 11913800 12224297 12701617 12623762 13378469 13241269 13790417
16780 13790417 14049076 14423718 14898182 15195849 15662731 16071261 16183572 16514898 17704057
16771 17704057 17836934 17913338 18839823 19579865 19958106 20535561 21243668 21844689 22671811
16762 22671811 23102524 23621455 24277521 25217615 26095960 27156091 27560921 28742941 29622553
16753 29622553 30841170 31821515 32897905 33974414 35219061 36396250 37701774 38971099
16745 38971099 40591329 41969574 43316571 45094014 46678952 48518758 50976257 52453604
16737 52453604 54421991 56623912 58794378 61182414 63065856 65736860 68512417 70705653
16729G0705653K393273L259277L037613K267314K881781L111715K857093K759130
16721I3272849K814720K776404K863272K366340L203189J859820K410051K028746
16713A13595391J712337J698500J303766J016756O30621K9443K62647n7506p31634
16704A19460321r57355j328250j360020j969975j936883k259694k267060k701840
16696A04679244k798238k459392l028883k703201l219781k951202k735136k810229
16688H1973182k709274l113968k617674k812656k371660k943302k137084k419603
16680F0847961k179916k148097k069319j993337k299899k034474j145931j990925
16672D4986063j387566j851512j646271j022065j713889p12808j768739j257423
$$ plain form
16729 70705653 73098926 76358203 79395816 81663130 84544911 87656626 90513719 93272849
16721 93272849 96087569 98863973 101727245 104093585 107296774 109156594 111566645 113595391
16713 113595391 115307728 117006228 118309994 119326750 119957371 119986814 120249461 120191955 119460321
16704 119460321 118502966 117174716 115814696 113844721 111907838 109648144 107381084 104679244
16696 104679244 101881006 99421614 96392731 93689530 90469749 87518547 84783411 81973182
16688 81973182 79263908 76149940 73532266 70719610 68347950 65404648 63267564 60847961
16680 60847961 58668045 56519948 54450629 52457292 50157393 48122919 46976988 44986063
16672 44986063 43598497 41746985 40100714 39078649 37364760 36651952 34883213 33625790
16664C3625790r96225j306065j137872n14023j354483q69231o12066q80280o38624
16655B5316921q31758q37855r40176n90238r03794j99231m32491j105617j83996
16646A9291765o95545m93064k22150o06728p36283m3088n75121k82824m28052
16637A5208910k69798p06929l47244k40630k8004m86284n12720j7798q0333k25503
16627A2293667q37898J83294n90929k84600k37851k72534k68391M2073j08259
16618I918572n00350j68776m68250j02981P6524k39155n14210N04857k21146j6329
16608H268756o81034j56925O9963l4673n17763J32874K9277n35201L11545J8307
16598F905126j53243j34162m93338J83582l79017L72152k62137m8532l38989J72757
$$ plain form
16664 33625790 32629565 31323500 30185628 29671605 28317122 27447891 26835825 25955545 25316921
16655 25316921 24485163 23647308 22707132 22116894 21213100 21013869 20581378 19475761 19291765
16646 19291765 18596220 18103156 17881006 17274278 16537995 16494907 15919786 15636962 15208910
16637 15208910 14939112 14232183 13884939 13644309 13616305 13130021 12617301 12599503 12519170 12293667
16627 12293667 11455769 11639063 11048134 10763534 10525683 10253149 9984758 10026831 9918572
16618 9918572 9418222 9249446 8781196 8678215 8754739 8515584 8001374 8506231 8285085 8268756
16608 8268756 7587722 7430797 7500760 7466087 6948324 7081198 7110475 6575274 6886819 6905126
16598 6905126 6751883 6617721 6124383 6307965 5928948 6301100 6038963 5990431 5651442 5824199
16588E824199k92368J3584j34198j3346m09599J62879L3118k21444K9815l22617
16578D670023J25331j11876k27977p3631K01620J7669k49139J2388j8505j18501
16568D227402J24759n3148N6269n88543R3054j61926M82600l04057k91884K2204
16558C606730M6590q5810r6638J7653k76200K55997L5207J18976l72251J15479
16548C365733m50093P0464L150O1982k56883L66804k45299J86071j69151O3838
16538B996616n5022j04781J15083k45366j03867M7299k4364J96920j8329l21897
16528B482292j29845P2801M06094k89748j07327J22921P1297j79114J30017m26981
16518B152407n5234j13428K39925J72779l30008K54392m56288M51865j76858m0859
$$ plain form
16588 5824199 5531831 5545415 5411217 5397871 4988272 5151151 5184269 4962825 4992640 4670023
16578 4670023 4795354 4683478 4455501 4381870 4583490 4601159 4352020 4364408 4345903 4227402
16568 4227402 4352161 4299013 4355282 3766739 3859793 3697867 4180467 3876410 3584526 3606730
16558 3606730 3653320 3567510 3470872 3488525 3212325 3468322 3503529 3622505 3250254 3365733
16548 3365733 2915640 2986104 2989254 3051236 2794353 3161157 2915858 3101929 2932778 2996616
16538 2996616 2941594 2836813 2951896 2706530 2602663 2649962 2625598 2822518 2804189 2482292
16528 2482292 2352447 2425248 2831342 2541594 2434267 2557188 2628485 2449371 2579388 2152407
16518 2152407 2097173 1983745 2223670 2396449 2066441 2320833 1864545 2316410 2139552 2098693
16508B098693Q9184K24422k12894l3539K4936k30215j81673J18444J04368j35036
16498A866690P0264J91361j94255l28967J8509K68277k07703J59173J5691n52849
16488A306191L19212K35871l22978L67742m14175J26585J84195j12979r0373L3053
16478A632344J48544j48385q7j04021j49932M70744l20722j47201J43368P3193
16468A597845j00796j2840N5467M4848j23155J6094k5921K2968J33030k37130
16458A370410M4688j74693j10892M50691j71308j16642j041J83124m35544J34985
16448A173778o5608R3560j04184J44923J35528l7967p0837k63860K95592P9545
16438A380470O0593j25209P4932o8984j41549k63214L91339l30100J9434J16948
$$ plain form
16508 2098693 2187877 2412299 2199405 2165866 2190802 1960587 1778914 1897358 2001726 1866690
16498 1866690 1936954 2128315 1934060 1605093 1623602 1891879 1684176 1843349 1859040 1306191
16488 1306191 1625403 1861274 1538296 1906038 1491863 1618448 1802643 1689664 1599291 1632344
16478 1632344 1780888 1632503 1632416 1528395 1378463 1849207 1528485 1381284 1524652 1597845
16468 1597845 1497049 1484209 1539676 1584524 1461369 1477463 1451542 1474510 1607540 1370410
16458 1370410 1415098 1240405 1129513 1580204 1408896 1292254 1291213 1474337 1038793 1173778
16448 1173778 1108170 1201730 1097546 1242469 1377997 1340030 1269193 1005333 1300925 1380470
16438 1380470 1441063 1315854 1390786 1321802 1180253 917039 1308378 978278 997712 1114660
16428A114660O0829o9456L71Q1984k50240j00329L75978m06805L75252j60232
16418A022012K9228k06091j08785L92768j12575k10367J04207k44136O1398K69533
16408I97192j12800j81995J85793o1532j21251K96368k50327j99491M96994m5313
16398A003638j18625O8945N1213k6937l49597R8067L02460j70900J69503l40123
16388F87644K98701K02932n67289M86014j98567j9314J07132k19076J53208j90437
16378G40948k07800J68986K17306j31048L7000j54632L34489k27735j41688l869
16368F31957J58057M668j42931J20741P8762k44253l8082K7239M4835L9347K09029
16357H89369k25574j5329M8864o4663j9521J13956J40370L2533j92593l47261
$$ plain form
16428 1114660 1175489 1106033 1106404 1188388 938148 837819 1213797 806992 1182244 1022012
16418 1022012 1051240 845149 736364 1129132 1016557 806190 910397 666261 727659 997192
16408 997192 884392 702397 888190 826658 705407 1001775 751448 551957 1048951 1003638
16398 1003638 885013 953958 1005171 978234 628637 726704 1029164 858264 1027767 687644
16388 687644 986345 1189277 621988 1108002 909435 890121 997253 778177 931385 740948
16378 740948 533148 702134 919440 788392 825392 670760 1005249 777514 635826 631957
16368 631957 790014 794682 651751 772492 851254 607001 568919 596158 640993 680340 889369
16357 889369 663795 648466 697330 632667 613146 727102 867472 900005 707412 360151
16347C60151L44058J7397J43427j61462J31967P5331j18332k2518N3537r3632
16337G29924k80048M18562j36183Q3076l06300r6551L61841j05587R9231A87477
16326F80383J52863J0709q4399j35098N2456k11998K79746j91580J45207j7573
16316F80716r7030j95019J49232j55167K42863R1172l22874J63177J29027M8608
16306G34705k61344p8043K61870j63352O3222O0133l05001K27445N8918k05332
16296C93221j14500K46604k14560N2799m0416M09475l47461J63606k47154M99507
16286H01121l85803J77042o3409Q8698m5658k09693J01021O2820k19036M56791
16276G63894A83155J22963M05388j68154k16013Q4728j15000L8209R5171L40348
$$ plain form
16347 360151 704209 721606 865033 703571 835538 910869 792537 770019 823556 729924
16337 729924 449876 868438 732255 815331 509031 412480 774321 668734 767965 187477
16326 680383 833246 843955 759556 624458 676914 464916 744662 553082 698289 680716
16316 680716 583686 388667 537899 382732 625595 716767 393893 557070 686097 734705
16306 734705 473361 395318 657188 493836 557058 617191 312190 539635 598553 393221
16296 393221 278721 525325 310765 363564 323148 732623 385162 548768 301614 801121
16286 801121 415318 592360 528951 617649 571991 362298 463319 526139 307103 763894
16276 763894 183155 306118 711506 543352 327339 412067 297067 335276 430447 770795
16266G70795k52075J9964M3806k0913j47276J29522n0914l6943K79402j78660
16256E56708r1410j75900K31811m6777j63595K56092B60703J75374J34895P6021
16246F46993k73039r9055M71466l34915j09606j44444M23880j64302K67541k93265
16236C91254j4778L4279A30381M03206j54194m260A06174J92223M48058C01522
16225D69878o6863j65589p5481L23238p527D9924M25662K09203j64677k10340
16215C09772A23947E2313J46621K54740C8500M71840P1525B54250K84378f8414
16204C54283L9261o5161J12772a27959F6768K53061n856R4078j975n6764p6142
16193B73170J40545q1369b66494G5101K35912J0199A7291K79855J74023B07251
$$ plain form
16266 770795 518720 538684 582490 561577 414301 543823 492909 455966 735368 556708
16256 556708 465298 289398 521209 474432 310837 566929 260703 436077 570972 646993
16246 646993 373954 274899 746365 411450 301844 157400 581280 416978 684519 391254
16236 391254 376476 410755 130381 533587 379393 375133 106174 298397 746455 301522
16225 469878 403015 237426 161945 485183 477656 49924 475586 684789 520112 309772
16215 309772 123947 52313 198934 453674 38500 510340 581865 254250 538628 -68414
16204 354283 393544 328383 441155 -127959 66768 319829 313973 408051 406076 349312 273170
16193 273170 413715 332346 -266494 75101 311013 321212 17291 297146 471169 207251
16182A69432M3101J56738A67563A0464J32585C3116M23447A65524Q301J17478
16172B91303J73907A09602a19272C52668A29052Q2802G7843N3870f7296B08394
16161B81143m5407q2800E9705b54625B57234Q6287A12064M4644F1926K12725r7095
16150A77556L0267o3271E8227J52593P5J57083a07705B10864B3986K51208P4455
16139C49649R1783B13533J7125J17249e1033A08689L69629A67274o237p6306M5650
16128A30381K67529a912A35067L34164j10847J96312j49838r5089G2871a09860
16117A04371m3264A6776P1182j3256C5267K71497j36620J00773I5626J0359M18320
16106E24305B25572o85C0666K26415A7826a3812o3266B65840H2787L1621l0917
$$ plain form
16182 169432 212533 369271 167563 10464 143049 33116 456563 165524 173825 291303
16172 291303 465210 109602 -119272 352668 129052 211854 77843 131713 -67296 208394
16161 281143 235736 152936 59705 -254625 257234 343521 112064 156708 61926 274651 177556
16150 177556 207823 144552 58227 210820 210895 367978 -107705 210864 23986 275194 349649
16139 349649 441432 213533 230658 347907 -51033 108689 478318 167274 161037 84731 130381
16128 130381 397910 -1912 135067 469231 358384 554696 404858 309769 72871 -109860
16117 104371 61107 16776 87958 74702 35267 306764 170144 270917 95626 105985 524305
16106 524305 225572 224887 30666 257081 17826 -13812 -77078 265840 82787 114408 83491
16095H3491R958Q9369R4702b09699F653K05494q3323J22115j737J21239A46865
16083F5710a45686A68314l7788F3824a47583E6076K91813j00554b06318C91248
16072A58050J5994j0424J42308A26123J917J51254a10197A22669D5832K26898
16062B72730a99182G7754c3688E8985J11922l3434F7397e3489k9099A64018f456
16050B03335d582A02033a75350B50170j05847J03907D5768J8476J20918F8406
16039c50766B32600c1405A86008J37572L5660G7419j9304J37415L46324e3445
16028a10883f162A31142K64354B4526K58968Q9901q3846a53211C4150e0755o9874
16017a20629J6107C2934M34950b38610A57087h269l5624p6760H5853K80873A11866
$$ plain form
16095 83491 93449 182818 277520 -209699 6653 212147 128824 250939 249202 370441 146865
16083 65710 -145686 168314 130526 63824 -147583 56076 347889 247335 -206318 391248
16072 158050 174044 163620 305928 126123 128040 279294 -110197 122669 45832 272730
16062 272730 -199182 77754 -33688 58985 170907 137473 67397 -53489 -82588 164018 -6456
16050 203335 -4582 102033 -175350 250170 144323 248230 45768 64244 185162 68406
16039 -350766 232600 -31405 186008 323580 359240 77419 58115 195530 541854 -53445
16028 -110883 -6162 131142 395496 24526 283494 373395 289549 -153211 34150 -50755 -120629
16017 -120629 -104522 32934 467884 -238610 157087 -8269 -43893 -120653 85853 366726 111866
16005B2078K5810i295A56070D106a528l4355C35345h336I4361R1841F7970g2978
15992C72779a4215G8684I808a29069B00882a15111b9294B48571M9137A17248b69045
15980A81941a01835n0515e0889A43994g9787B42638J33127j47645N30225j54243
15970F04102L71689K72708k73725j65712k61535a7984j02495B13240J57659j0789
15960C60110c0100A45884J4507a36542b3366b38A12026G435Q9800R5684a92310
15948D7401b55522m0044A61621N2909a36279B94721A01824b45768b4866B08256
15937h957q1928A03921K54102A32508J4517b12211I412b14524g157B63460a1041
15925A04819P3219J3130A4138R1637a06632B31018c1464A17201Q9976d03871J96729
$$ plain form
16005 22078 47888 -9295 156070 4106 -1528 -35883 335345 -8336 94361 186202 67970 -72978
15992 372779 -14215 78684 9808 -129069 200882 -115111 -29294 248571 297708 117248 -269045
15980 181941 -101835 -152350 -50889 143994 -79787 242638 375765 228120 758345 604102
15970 604102 975791 1248499 974774 809062 547527 -17984 -120479 213240 370899 360110
15960 360110 -30100 145884 160391 -136542 -23366 -238 112026 7435 97235 192919 -192310
15948 47401 -255522 -295566 161621 214530 -136279 294721 101824 -245768 -24866 208256
15937 -8957 -90885 103921 358023 132508 147025 -212211 9412 -214524 -7157 263460 -11041
15925 104819 178038 191168 14138 105775 -106632 231018 -31464 117201 207177 -403871 -207142
15914b07142B46029Q0808j54064C03K86418C8082J03107J35837I8846h8022a0409
15902A94664d9030k7520A68034a49359J5904B45635d5621J0250R986A98475b38488
15890A54797N4705G3372a5099A91046c59953a62993B15628A06300J51290a42418
15879a08143e1634k21574E1612b78685c8042q2781j38652c7509k90523h9877c4836
15867d39571a11467q771L9051I4820a2619k6430m33898B51221i447k0422A53165
15855g894A39899J0123a9953p3691F7213K0096b88257a5907j09533C268a06633
15843B30475d2339l04427a37924f8048D2585M0506N6297K57102j38020A2571J971
15832A4542b03365K8594f2330A70866l5693L0886f1425C83294j81862C355K61169
$$ plain form
15914 -207142 246029 326837 172773 303 286721 38082 141189 277026 98846 -88022 -10409
15902 194664 -49030 -76550 168034 -149359 -133455 245635 -45621 -35371 -25385 198475 -238488
15890 154797 209502 73372 -15099 191046 -359953 -162993 215628 106300 257590 -142418
15879 -108143 -51634 -273208 51612 -278685 -38042 -120823 -259475 -37509 -328032 -89877 -34836
15867 -439571 -111467 -120238 -81187 94820 -12619 -39049 -472947 251221 -9447 -29869 153165
15855 -7894 139899 150022 -19953 -93644 67213 87309 -288257 -15907 -125440 3268 -106633
15843 230475 -42339 -346766 -137924 -68048 42585 83091 139388 396490 258470 12571 14542
15832 14542 -203365 -174771 -62330 170866 135173 166059 -61425 383294 201432 3355 264524
15821B64524c9233j30179h0399D3933K20684a56850j04743g1763b8311r0092k45835
15810c64238Q6035a08111C2416b40765e2732A69896c29179A98845B1568a2563
15799a37461G961L66816B6938K18387d146o895B465K36874i4034A02583k1729
15788H0854b78817C6680i3115A82714o9608a0216B88363i6376d1691l47968C9889
15776a11938A11253n4407J58355a30270M5785j64220a6377D08324D0514b02779
15765A93387l8270c132j54934o2838j04924A87618j0404h4805p3781A62656c42387
15753A32960d13862h877A8269i2119B8024b26172G6936l1703J41678p2353a25281
15741a50089j41079B2283J7875N5870b3028I6928f4804A12442J37118K3832m285
$$ plain form
15821 264524 -39233 -169412 -80399 43933 264617 -156850 -261593 -71763 -28311 -118403 -364238
15810 -364238 -278203 -108111 32416 -240765 -52732 169896 -329179 198845 21568 -12563
15799 -137461 7961 374777 26938 245325 -4146 -11041 2465 239339 -94034 102583 80854
15788 80854 -278817 36680 -93115 182714 113106 -10216 288363 -96376 -41691 -389659 39889
15776 -111938 111253 56846 215201 -130270 -84485 -248705 -16377 408324 40514 -202779
15765 193387 155117 -3132 -158066 -220904 -325828 187618 177214 -84805 -158586 162656 -342387
15753 132960 -413862 -8877 18269 -92119 28024 -226172 76936 45233 186911 114558 -125281
15741 -150089 -291168 22283 40158 96028 -23028 96928 -64804 112442 249560 273392 269107
15730B69107h2614p7992F5844b4600F1788Q604k1917b12924H1416c1566o0384
15719i1950B0889M4596d8168k13003h709j14364a1785n4935j45101A32594R9301
15708B31895c7845n0536I2288m1848k283a60534e8578k0475p299D1461i5634l05865
15696d01499B18014f5089A00392L17155a43594B89730c9967q5732M6735A22885
15685A25424a94729A01254E903J4596J09726d14802f8617G0396c6278A57200J41339
15674B98539a03225N0358A66380a17770I8909c80760B8450b59434c0882q3707
15664a14589j69284I1250M2603b9878A21504E7874b23297d1781n1683C29012R3495
15653D22507I1337J79051b06806f1020j82100P1303m481k25980a12410E305L61226
$$ plain form
15730 269107 -82614 -160606 65844 -24600 61788 70392 48475 -212924 81416 -31566 -91950
15719 -91950 20889 65485 -48168 -261171 -8709 -123073 -11785 -66720 -211821 132594 231895
15708 231895 -37845 -88381 92288 50440 48157 -160534 -58578 -79053 -86352 41461 -95634 -401499
15696 -401499 218014 -65089 100392 417547 -143594 289730 -39967 -125699 -78964 122885
15685 125424 -194729 101254 5903 20499 130225 -414802 -68617 70396 -36278 157200 298539
15674 298539 -103225 -52867 166380 -117770 98909 -380760 28450 -259434 -30882 -114589
15664 -114589 -283873 91250 133853 -29878 121504 57874 -223297 -41781 -93464 329012 422507
15653 422507 91337 270388 -206806 -61020 -243120 -171817 -176298 -402278 -112410 5305 366531
15642C66531A66850a46028E0101B631a54858n3441A04535f9433B730N1090R0379
15631A44199C0148a0258B51814c7727j39018B7910i460j16207f0382r1385G8984
15619g0672k79660a30865q2935D8324B0030b91239B70155b92873f8834j30511
15609a99345Q6139A26696d0495k5911A6629J22176a8123o2631E6129k429L9799
15598I3499A2761R2432B0128J40725b28936j34016J68807M8183B29167O8900g9823
15586c19254A23344a02878K646D42152b8294C14000a6433C58501F6463f4787k401
15575f7188G9521a65207o1970J12670j32182A67928k7543g92n2458A14743c39953
15563h7929E0952c49723J25525I058f8726j61350j23847C51875A15321c05526
$$ plain form
15642 366531 166850 -146028 50101 2631 -154858 -208299 104535 -69433 2730 53820 144199
15631 144199 30148 -10258 251814 -37727 -176745 27910 -9460 -125667 -60382 -151767 78984
15619 -70672 -350332 -130865 -213800 48324 20030 -291239 270155 -292873 -68834 -199345
15609 -199345 -113206 126696 -40495 -66406 16629 138805 -18123 -80754 56129 53700 93499
15598 93499 12761 105193 20128 160853 -228936 -362952 -194145 -145962 229167 298067 -79823
15586 -319254 123344 -102878 -100232 442152 -28294 314000 -16433 358501 66463 -64787 -67188
15575 -67188 79521 -165207 -227177 -114507 -246689 167928 140385 -792 -53250 114743 -339953
15563 -87929 50952 -349723 -224198 9058 -68726 -230076 -353923 351875 115321 -305526
15552a47976B77443a22955C03502a262k74480O6124b4572q4128r8496A39R4936
15541I5075a6485l1761j3924D2664a52379m0674J6497p8555a04231o7430A41262
15529B41190b37017A81259P0102F9689a91891B27044k5713H3043C2551N28746
15519E61297b42080G9367c4146A87088N7812C3673b6276j42325L406O1065m467
15508a08597j09190A10608j5542J10886d54836A27687b44954a0362G309J96646
15498B03955J8796b05177A25169E8328K58895A11417K92169r5943A43807J9522
15488A63329c8580F0224M5084d3332J020B73506a42010H0820G584L24076a64287
15476G8465B2490J87459R8903h9831G0592n221J48783K8559j06551A4221J5573
$$ plain form
15552 -147976 277443 -122955 303502 -1262 -275742 -209618 -24572 -108700 -207196 139 95075
15541 95075 -16485 -48246 -62170 42664 -152379 -193053 -176556 -255111 -104231 -171661 141262
15529 241190 -237017 181259 251361 69689 -191891 227044 201331 83043 32551 561297
15519 561297 -242080 79367 -34146 187088 244900 33673 -26276 -168601 -165195 -104130 -108597
15508 -108597 -217787 110608 95066 205952 -454836 127687 -244954 -10362 7309 203955
15498 203955 222751 -205177 125169 58328 317223 111417 403586 307643 143807 163329
15488 163329 -38580 60224 105308 -43332 -42312 273506 -142010 80820 7584 331660 -164287
15476 78465 22490 209949 308852 -89831 70592 65371 214154 242713 136162 14221 29794
15465B9794J04697E5240K17085K77091B07592M1082O2631K64854j85311J55800
15455E46648A7459K54313c8984A1259f9366H195a18455B74216d3396p0717A05954
15443a8525A14124b07014B75472E5642b43104h5078A98549I4727b17602B56058
15432e6372K5736I6316K63986j19035H2500N79746M18107k80072n2436j84592
15422E63253k1226j87232Q8801r5525a67960D9161K38729e8070k5414l592C02511
15410c31758e2375l5781B34140a91787L4432A008a96205A10142b68351A24909
15399A10832L8151a6370G8175j9008a26921G8671C2878J16145a70602J4617C8739
15387c10744B24565p8138g1839A89362a2438C19182d7139I4496a13809k897A10335
$$ plain form
15465 29794 134491 55240 272325 549416 207592 248674 311305 576159 390848 546648
15455 546648 17459 271772 -38984 11259 -69366 8195 -118455 274216 -43396 -114113 105954
15443 -18525 114124 -207014 275472 55642 -243104 -85078 198549 94727 -217602 256058
15432 -56372 -30636 96316 360302 241267 82500 662246 1080353 800281 747845 563253
15422 563253 542027 354795 443596 348071 -167960 49161 287890 -58070 -83484 -87076 302511
15410 -331758 -52375 -88156 234140 -191787 -157355 1008 -196205 110142 -268351 124909
15399 110832 148983 -16370 78175 59167 -126921 78671 32878 149023 -170602 -155985 38739
15387 -310744 224565 146427 -71839 189362 -12438 319182 -47139 94496 -113809 -116706 110335
15375B91365d9902a0563G4439K88034I5485Q7455h0592j22104C00444F2537J07376
15364A69913J79247E982K22498r4470b49431a10519A75440a182m7698j11806C71507
15352h684D27481j36756B1248H978b9967B03376C558P4450K94320D2598b2451
15340A13311M5327E6571K9594P1353e4734B15560J16924l0802m6278g5237B43900
15328C9539b0983C91080j12916k5005R7960c6436C7429N4315k05b57225a09547
15316C48461A57377E8537P0098J55773A10176J43754a000D1675a05574A90059
15305B55835O6957i7192C65222j40375a96132G2821a45947B16282Q8466o2783
15295B41965k428c6913A55564N2230A0593L04323i4645d2098A86779E7059J52562
$$ plain form
15375 291365 -49902 -10563 74439 362473 95485 182940 -80592 -202696 300444 62537 169913
15364 169913 349160 5982 228480 134010 -249431 -110519 175440 -1182 -48880 -160686 371507
15352 -8684 427481 290725 21248 8978 -29967 203376 3558 78008 372328 42598 -22451
15340 113311 158638 56571 86165 157518 -54734 215560 332484 301682 255404 -75237 243900
15328 39539 -20983 391080 278164 253159 351119 -36436 37429 91744 91539 -257225 -109547
15316 348461 157377 58537 128635 284408 110176 253930 -1000 41675 -105574 190059
15305 255835 322792 -97192 365222 224847 -196132 72821 -145947 216282 304748 241965
15295 241965 239537 -36913 155564 207794 10593 314916 -94645 -42098 186779 57059 209621
15284B09621L5312b22707C93351I7255k2809g3952l4794A16127f6032B5779a80643
15272I776K0938a04188j8517B45193c34403C20135j07973c9772n3213J3241A79924
15260a24208A08170L02731E4033c9326I6905L5600a03694L3348k823A0054J02477
15249A12531B7170a23777p3860c7571N636E7894a26301j0208j0784H8601C0952
15237E2162N4698K34629P5878D0968K12678J15733j54002J35139J22326P01299
15227A174141L42363l17601Q0739k81358j95633A30468K15051A02429a63245A39076
15216C59784C4721K61610n7125A19094b48715l8539g9681A33575a30152C54941
15205B72851b398m1725j39882f3502D5830A0869R6744q802L0773J27766b31084
$$ plain form
15284 209621 244933 -222707 393351 97255 74446 -73952 -108746 116127 -66032 25779 -180643
15272 9776 30714 -104188 -122705 245193 -334403 320135 212162 -39772 -92985 -79744 179924
15260 -124208 108170 410901 54033 -39326 96905 132505 -103694 -70346 -73169 10054 112531
15249 112531 27170 -123777 -197637 -37571 -31935 57894 -126301 -136509 -147293 88601 30952
15237 52162 106860 341489 417367 40968 253646 369379 215377 350516 472842 1174141
15227 1174141 1516504 1198903 1279642 998284 802651 130468 345519 102429 -163245 139076
15216 359784 34721 296331 239206 119094 -248715 -287254 -79681 133575 -130152 354941
15205 272851 -2398 -44123 -184005 -63502 45830 10869 107613 98811 129584 257350 -231084
15193A27659C2869b32114a4830A56645l4139l8666b67633A04734m0202e7020D7091
15181a85091E1605J66412J16818a42396e6279k49206B69711b34894C02401r1634
15171B10767f2066C2202J60490B8032J16749F5873J35885J769G36J98462j8494
15160A80704f641j40377A83467E2031P9467K2605K8557A9177R6295L31379B06508
15148b21165j12409h1089l29969e6500k25871D8942e4936C15030F1033d7325j86781
15137b34106A24256J98757j8273j47333g8094E6133a70450C7397L34097a25140
15126h8940B42947a59354j2188r6449h1219A26163E453L07348I5828L17503j03357
15115C09974e5283k63236b3827k0635K0847B19198A00434L13776A09024J20920
$$ plain form
15193 127659 32869 -232114 -14830 156645 122506 83840 -267633 104734 64532 -57020 47091
15181 -185091 51605 218017 334835 -142396 -56279 -305485 269711 -234894 302401 210767
15171 210767 -62066 32202 192692 28032 144781 65873 201758 203527 736 199198 180704
15160 180704 -6641 -147018 183467 52031 131498 154103 182660 19177 115472 446851 206508
15148 -221165 -333574 -81089 -411058 -56500 -282371 48942 -54936 315030 61033 -47325 -234106
15137 -234106 124256 323013 304740 157407 -78094 56133 -170450 37397 371494 -125140
15126 -88940 242947 -159354 -171542 -267991 -81219 126163 5453 312801 95828 413331 309974
15115 309974 -55283 -318519 -23827 -44462 -23615 219198 100434 414210 109024 229944
15105B29944J75543j39415O4817J28526k20839A02491C3714K22879l6036A2480
15094a0603B82019j15709J7625L01946A11696a03779E682J74385a24000A54523
15083A4918J24364J37067p7310J42395j7331C3052L68L21960j61822O2309C2315
15071D03807a16669a4777j14381A21682o878A6325L95500b9043G1078b9070A17468
15059b75475C70572q9201l8217h2256C89644j2134A44687J33192a97614C77931
15048D95689a1873C61388j29516A0659M57386A25638n7467M85313A99491E3084
15037a10991A27603D8119N6260C7554J25200L06475j42445A09104j1152K05163
15027C03115o636G9588J22433K7198J42469j58273O4779J8608N4377J5725Q7722
$$ plain form
15105 229944 405487 266072 330889 459415 238576 102491 33714 256593 220557 12480
15094 -10603 282019 166310 183935 485881 111696 -103779 5682 180067 -124000 154523
15083 14918 139282 276349 199039 341434 324103 33052 33420 355380 193558 255867 32315
15071 403807 -116669 -14777 -129158 121682 114804 16325 411825 -29043 71078 -29070 117468
15059 -275475 370572 281371 243154 -82256 389644 377510 144687 277879 -197614 377931
15048 495689 -11873 361388 231872 10659 468045 125638 68171 553484 199491 53084
15037 -110991 127603 48119 104379 37554 162754 469229 326784 109104 97952 303115
15027 303115 296479 79588 202021 229219 371688 213415 278194 296802 351179 366904 454626
15016D54626J17758j32893Q5755J46521C11298R1880K46195j87872n2537O2888
15006D71852Q3213j36314N2743P7896o876B9669L27640L3371K9178j53662L38559
14995F04755k93618J31142O374j96806K20088G776L61067O6792A77337R468M90160
14984F76965C02504R8958J1433J05874M7106j87072O3589j39301r0416L22629
14974E35304A91993L61211j03350k500J28435k62332K54641J412J18036J03952
14964G91498j91860k21653K64417Q974j78689j72332K39015q0780J26635J31135
14954G16360k46569J05818k66595J1615K7904J52274J16396B10243K17161M7261
14944D74665K04520A43964o5700L82754N6144k14216K03403G2401J21698K76258
$$ plain form
15016 454626 572384 439491 525246 671767 311298 403178 649373 461501 408964 471852
15006 471852 555065 418751 471494 549390 542514 29669 357309 390680 419858 266196 604755
14995 604755 311137 442279 448653 251847 471935 7776 368843 435635 177337 186805 676965
14984 676965 302504 401462 412895 518769 565875 378803 442392 303091 212675 535304
14974 535304 191993 553204 449854 447354 575789 313457 568098 569510 687546 791498
14964 791498 599638 377985 642402 651376 472687 300355 539370 458590 585225 716360
14954 716360 469791 575609 309014 320629 348533 500807 617203 210243 427404 474665
14944 474665 679185 143964 78264 461018 517162 302946 506349 72401 194099 470357
14934D70357m4965p8687M3074L1010R5747N233j51659R3561K51564j26903o0497
14923E27835j19577J61872j78523J08173r2355J52293J55069m3288L95103o1129
14913A005473p0463M62228j06861K08505p4618r5733J12882k1948n6203J50838
14903A514100r9323L36746K32272k43039m332l03836k61527j61535k9322o6218
14893I13986j92560l46524N2546J777j13497J01025K55897B56941K7855L99230
14883F84026l41875A51274L21980J69355B99416K13941B09373p6049K8166k8526
14873A32964M02208Q1814j73495L72582k62273K15691p7121r9870J27747j37931
14863E82316J58199q2467j4483J78903K7273D03179p9659p938J19631J65482k86431
$$ plain form
14934 470357 425392 346705 389779 420789 516536 521769 370110 463671 715235 588332 527835
14923 527835 408258 570130 391607 499780 407425 559718 714787 671499 1066602 1005473
14913 1005473 935010 1397238 1290377 1498882 1424264 1328531 1441413 1419465 1363262 1514100
14903 1514100 1414777 1751523 1983795 1740756 1736424 1432588 1171061 1009526 980204 913986
14893 913986 721426 374902 427448 429225 315728 416753 672650 256941 284796 684026
14883 684026 342151 151274 473254 642609 299416 513357 209373 133324 161490 132964
14873 132964 535172 616986 443491 816073 553800 769491 692370 592500 720247 582316
14863 582316 740515 658048 643565 822468 849741 403179 323520 315582 435213 600695 314264
14852C14264M97974j7954C28688Q9524J98631N9745M9856k62726N1480A34703
14841D59436A72328K65611J4784C1551M85275j92362j4097J31491j93870K42419
14831D90407o7090K50279B77968N86879L4590J80559n331j44726O2199n7535j05663
14820H28940j3647l98066N1553q8121n0890q4525K54734K7011q3348j24802M94942
14809H13781l72693r7585K62540J76853k71833O4040p8982M8331K05307L10465
14799A060224D20082K50245J05135l40005J44452J34046J75164l65263J50271
14790F74127l2750K34385J06915j00075j08550r8701o9640j3396j75094Q0750
14780D97971L20449C02438J95495k34494M92729C36187J96907J37728R3857C33759
$$ plain form
14852 314264 812238 794284 328688 418212 616843 676588 726444 463718 515198 134703
14841 459436 172328 437939 452723 31551 516826 324464 310367 441858 247988 490407
14831 490407 423317 673596 277968 864847 899437 1079996 1074665 929939 992138 934603 828940
14820 828940 815293 417227 468780 380659 329769 245244 499978 526989 443641 318839 813781
14809 813781 441088 343503 606043 782896 511063 575103 496121 544452 749759 1060224
14799 1060224 420082 670327 775462 435457 579909 713955 889119 523856 674127
14790 674127 641377 875762 982677 882602 774052 675351 605711 592315 417221 497971
14780 497971 818420 302438 497933 263439 756168 336187 533094 670822 764679 333759
14769G61765l04011J82951Q9376q147J4046r1974L53727C45988N03651k18611
14759F31028J49553r5205O5185J1571k21120L06912q5280k83719J20680J64503
14749G64108k78460L8423k19407M54202J1581C55012A45533M38712R0643J59170
14739H34058k39204J63571B64097L72753K33P6967j98684P8803j76957L05516
14729G22728n5009K10927n7774k57255N7897K54981j33167R1777j00492j42005
14719E92608R2774N7031K22668q9149j3831M63966k29833K59010J78083M07258
14709A940585l18441m71164J24473m07808J03119j54455L4174K79388D77147M92024
14699I69171j53886k19992L41171M579m8998J64167n3171j36317K39744M58708
$$ plain form
14769 761765 457754 640705 730081 721934 735980 644006 997733 345988 849639 631028
14759 631028 780581 685376 750561 762132 541012 847924 762644 478925 599605 764108
14749 764108 485648 524071 304664 758866 770447 355012 145533 584245 674888 834058
14739 834058 594854 758425 264097 636850 637083 714050 515366 594169 417212 722728
14729 722728 667719 878646 820872 563617 621514 876495 743328 835105 734613 592608
14719 592608 685382 742413 965081 875932 862101 1326067 1096234 1355244 1533327 1940585
14709 1940585 1622144 1150980 1275453 867645 970764 816309 850483 1129871 477147 969171
14699 969171 815285 595293 936464 941043 892045 1056212 1003041 866724 1106468 1565176
14689A565176o13944K38981K09503L01759k78344L28059j10105k52165j07799
14680A281121j10013n2685k41861r241j32087j24849K40913K49631r8830l0396
14670I71703l2448l7385j83427K51441l0061k26478J92809K6378k26638L49931
14660A055825l30625k1972k6417N31671j87670o8552J5565J76489j47852o7821
14650I28641J94407l03409P4505O3252j12608l4451J07199P9282O3952P4955l1372
14639A104353K8557j73134M71584l25811M02631n12949K30219E56117P80590n26657
14629H10050K59250j68204K26548p4116j07600L1565O3706j50717j57710N40032
14619A272804k61748J45758N7783k622j37456M39922o35596K47043k12200L37757
$$ plain form
14689 1565176 951232 1190213 1399716 1701475 1423131 1751190 1641085 1388920 1281121
14680 1281121 1171108 1118423 876562 867321 735234 610385 851298 1100929 1002099 971703
14670 971703 939255 901870 718443 969884 939823 713345 906154 932532 705894 1055825
14660 1055825 725200 703228 676811 1208482 1020812 952260 967825 1144314 996462 928641
14650 928641 1123048 819639 894144 957396 844788 810337 917536 996818 1060770 1135725 1104353
14639 1104353 1132910 959776 1431360 1105549 1508180 995231 1225450 556117 1336707 810050
14629 810050 1069300 901096 1127644 1053528 945928 977493 1041199 890482 732772 1272804
14619 1272804 1011056 1156814 1214597 1211975 1074519 1514441 878845 1125888 913688 1251445
14609A251445l36694J09060M19325j50613p1672j1256J37645J11444k70556J98384
14599A386512j41978k34576L26436J09308l7478l58668M9530J47146L0259O2525
14589A339016J85264l56859L06566o7529j09694j5464K57809j9988j36875j52903
14579A229343K01144l797J06683o6323J75255k84967L54027p3017p5823l7465
14569A525060j50737L58559k31612K97377J73766k16346n6123k02545K59137J28451
14559A884987N1742l52521L10203j9398K57198Q700j36671R7858K66406j88650
14549B179854P8924Q2555m8893L78340M5179m6906K29203K65833Q2069R5636J93341
14538C535135Q30693K76452J033344J300982K908774L315113O060240R875108
$$ plain form
14609 1251445 914751 1023811 1443136 1292523 1220851 1209595 1347240 1458684 1188128 1386512
14599 1386512 1244534 1009958 1336394 1445702 1408224 1049556 1099086 1246232 1276491 1339016
14589 1339016 1524280 1167421 1473987 1406458 1296764 1281300 1539109 1519121 1382246 1229343
14579 1229343 1430487 1426690 1533373 1467050 1642305 1357338 1711365 1638348 1562525 1525060
14569 1525060 1374323 1732882 1501270 1798647 1972413 1756067 1699944 1497399 1756536 1884987
14559 1884987 1936729 1584208 1894411 1875013 2132211 2140911 2004240 2102098 2368504 2179854
14549 2179854 2258778 2341333 2292440 2670780 2715959 2669053 2898256 3164089 3246158 3341794 3535135
14538 3535135 4365828 4642280 5675624 6976606 9885380 13200493 19260733 29135841
14530B9135841J432474j3014773p746900l926086j605706l52330K8388Q17912
14522D768820n25006j128728m39265n51192J57157l71205j9408L27549J82644
14513B401366q85284M75217k30026M11891m8259J87137J10129k35100k45656K21786
14503B163201K00644k51183K41942j58055J7887K54632l06562K66801K79422j86294
14493B522435k66377M64719J57498k18549r6259K11820J36389j88598j34297J48764
14483B737545K48874l32348L24954Q8115l0961k1731l3806J70856l96210J99760
14473B955048O7322K69097j11392K36599n5409K37287k40547l40683N97484q251
14463C606555O5937k05756M15740n517k16009k23080K93728K63202l21291P5882
$$ plain form
14530 29135841 30568315 17553542 9806642 5880556 4274850 3922520 3950908 4768820
14522 4768820 4243814 3115086 2675821 2124629 2281786 1910581 1891173 2218722 2401366
14513 2401366 1516082 1991299 1761273 2173164 2124905 2312042 2422171 2187071 1941415 2163201
14503 2163201 2363845 2112662 2354604 2196549 2214436 2469068 2162506 2429307 2708729 2522435
14493 2522435 2256058 2720777 2878275 2659726 2563467 2775287 2911676 2723078 2588781 2737545
14483 2737545 2986419 2654071 2979025 3067140 3036179 3014448 2980642 3151498 2755288 2955048
14473 2955048 3022370 3291467 3180075 3416674 3361265 3598552 3358005 3017322 3614806 3606555
14463 3606555 3672492 3466736 3882476 3876959 3660950 3437870 3731598 3994800 3673509 3749391
14453C749391J53989j61344K98289p341L1060J91900K18843j34848j28134K87222
14443D499027k23408L53264J07859q2413K00809l96015K66483J15192L4694J34643
14433E010135j65018l03444N67993j08783K13300M88011j14583o2904k5645K44392
14423E743454k62673J32818M01719j65629j952N69683n97108K09361K25950p4691
14413F180932J68869L7353K70756j43741L41212L6136L19087p3956L31135K28930
14403G696713J02848m01784M75754r1175M30735o89339O63970R3245M0697L5460
14393H357124M45189k31529N94294J00794K4773K52377J2708j8980K77772J0327
14383I824849J43959J8182J83595R2522L62795L64960o5598M50692M3029R9383
$$ plain form
14453 3749391 3903380 3742036 4040325 4032984 4064044 4255944 4474787 4339939 4211805 4499027
14443 4499027 4275619 4628883 4736742 4654329 4855138 4459123 4725606 4840798 4875492 5010135
14433 5010135 4845117 4541673 5109666 5000883 5214183 5702194 5587611 5524707 5499062 5743454
14423 5743454 5480781 5613599 6015318 5849689 5847737 6417420 5820312 6029673 6255623 6180932
14413 6180932 6349801 6387154 6657910 6514169 6855381 6891517 7210604 7136648 7467783 7696713
14403 7696713 7799561 7397777 7873531 7782356 8213091 7523752 8187722 8280967 8321664 8357124
14393 8357124 8802313 8570784 9165078 9265872 9290645 9543022 9555730 9536750 9814522 9824849
14383 9824849 9968808 9986990 10170585 10263107 10625902 10990862 10925264 11375956 11418985 11518368
14373A1518368R4815N32629K9265p6502P13146M74874J02624N5256L22653M39790
14363A4206918m523K99635Q8365M33551o650M75718K93947M37566J24926N28864
14353A6878317L55362L45962M30338J62918R71670K14805K77207M72668j31791
14344A9977456O49609K24389Q67827L168R00238M68749J52215J009315O25818
14335B4878784M32759Q86915M42312J103917O00184L69307Q58503Q16277R06189
14326C1295147P15502P04351J292422R76940J042526Q44106J477881J087880J314337
14317D0751092J002381R60005J583504J388672J561746J330130K136793J648524
14309E2362847K196882J769022K102870K060403K238313K159843K410665K966190
$$ plain form
14373 11518368 11613183 12145812 12175077 12098575 12811721 13286595 13389219 13444475 13767128 14206918
14363 14206918 14202395 14502030 14590395 15023946 15017296 15493014 15786961 16224527 16349453 16878317
14353 16878317 17233679 17579641 18009979 18172897 19144567 19359372 19636579 20109247 19977456
14344 19977456 20627065 20851454 21719281 21722449 22622687 23091436 23243651 24252966 24878784
14335 24878784 25311543 26198458 26640770 27744687 28344871 28714178 29572681 30388958 31295147
14326 31295147 32010649 32715000 34007422 34984362 36026888 36870994 38348875 39436755 40751092
14317 40751092 41753473 42713478 44296982 45685654 47247400 48577530 50714323 52362847
14309 52362847 54559729 56328751 58431621 60492024 62730337 64890180 67300845 70267035
14301G0267035K902532K719908K856829L586395L348258L762106L687357M692227
14293I7822647M547837M627087M582888N968350N527350N898869P044649O425195
14285A42444872P571896P584512Q535123Q593137R356961R991492J0403599J1321880
14277B15803472J1737458J2425236J2898806J3650223J3900214J4396670J4722561
14270C09534640J4797960J4657727J4973983J4926477J4441746J2982221J2183969
14263D08498723J1328781J0539171R334927Q465003M870294J555207R63339O41764
14255D56197209J456878j308164q115408p018717r377974j1670708j3391349j3999808
14247C92771959j4624066j4897462j5016466j5073302j4561348j4330945j4473897
$$ plain form
14301 70267035 73169567 75889475 78746304 82332699 85680957 89443063 93130420 97822647
14293 97822647 102370484 106997571 111580459 117548809 123076159 128975028 136019677 142444872
14285 142444872 150016768 157601280 166136403 174729540 184086501 194077993 204481592 215803472
14277 215803472 227540930 239966166 252864972 266515195 280415409 294812079 309534640
14270 309534640 324332600 338990327 353964310 368890787 383332533 396314754 408498723
14263 408498723 419827504 430366675 439701602 448166605 453036899 454592106 455555445 456197209
14255 456197209 457654087 456345923 448230515 441211798 431833824 420163116 406771767 392771959
14247 392771959 378147893 363250431 348233965 333160663 318599315 304268370 289794473
14240B89794473j3643562j3317934j2830249j1969721j1570888j2448506j1392234
14233B02621379j0098059j0526566r379292q958853q057905p909767p336794o790451
14225A33563692o406887n784806n477088n327050m832240m793699m386302m064851
14217I2490769l815136l509497l261378l243600l546364k866457k618918k182857
14209F7446562k789754k420524k171594j816250k160408j911564j656460j660117
14201E0859891j708252j664432j720104j172056j239293j662909r60576r34026
14193C9798243j257998p85454j111620j045885q87011j333985r58965q44220m17173
14184C1155932r46443q18147j140258m74104p34259l08024p10539q52291p97780
$$ plain form
14240 289794473 276150911 262832977 250002728 238033007 226462119 214013613 202621379
14233 202621379 192523320 181996754 172617462 163658609 155600704 147690937 140354143 133563692
14225 133563692 127156805 121371999 115894911 110567861 105735621 100941922 96555620 92490769
14217 92490769 88675633 85166136 81904758 78661158 75114794 72248337 69629419 67446562
14209 67446562 64656808 62236284 60064690 58248440 56088032 54176468 52520008 50859891
14201 50859891 49151639 47487207 45767103 44595047 43355754 41692845 40732269 39798243
14193 39798243 38540245 37754791 36643171 35597286 34710275 33376290 32417325 31573105 31155932
14184 31155932 30209489 29391342 28251084 27776980 27042721 26734697 26024158 25171867 24374087
14175B4374087p93464l48049j68933q32518n74799j78076r52072l71230k63616
14166A9891330m53841k94100n24127n64743l55671l5609m06366n98357m76785
14157A6181731o4957j13806o39127m26303R4886l21230k05036m50146l07887k74126
14147A3473999m6810m05005R7416k80924j3949n35249l61836j15966j9794m35891
14137A1355991j13195m6694k8416k16168q22394J62004j56273j68400Q2044m25544
14127I622955J5438j61119r4268m41130R4119q803j959j78732n33826J32136k04598
14116H240213j89851J58329m15205m3280O8264n44955K36532l96886M43662l50185
14106G206638j12528R6486j78660J0197q576l34259k43370o655K56936l79592
$$ plain form
14175 24374087 23580623 23232574 23063641 22231123 21656324 21478248 20526176 20154946 19891330
14166 19891330 19437489 19143389 18619262 18054519 17698848 17663239 17256873 16658516 16181731
14157 16181731 16116774 16002968 15363841 14937538 15032424 14711194 14506158 14056012 13748125 13473999
14147 13473999 13427189 13022184 13119600 12838676 12824727 12289478 11927642 11811676 11791882 11355991
14137 11355991 11242796 11196102 11167686 10951518 10129124 10291128 10134855 9966455 10048499 9622955
14127 9622955 9638393 9477274 9383006 8941876 9035995 9027192 9025233 8846501 8312675 8444811 8240213
14116 8240213 8050362 8208691 7793486 7750206 7818470 7273515 7510047 7113161 7556823 7206638
14106 7206638 7094110 7190596 7011936 7022133 7013557 6679298 6435928 6429273 6686209 6306617
14096F306617j59037J06220r4574n3436j43031N6763J9401l72046k8655l05948
14086E332274K56234k91522J47767n1738l99005n479K28563l05219M43727l00405
14076E055197l50199o9167L52454m70729M5335l6194K09055j24038P8578m20843
14066D269449j7071K55215j99183q8037K13125q0036k93303N29481n84817k7819
14056C977004P2826j11962j23212L12876k15831l27720J13602K15033k45640k31967
14046C435009K99826j86696K47781k91015J50386L865k91700K32756k22875j27974
14036C249363J97053k97637q9100J52476m9772K20616r8040J66150n59989O04306
14026C495426n42640R9357j85604j69860K01653l03478M24767R3315l54054j70425
$$ plain form
14096 6306617 6147580 6253800 6159226 6105790 5962759 6019522 6038923 5666877 5638222 5332274
14086 5332274 5588508 5296986 5444753 5393015 4994010 4988531 5217094 4911875 5355602 5055197
14076 5055197 4704998 4635831 4988285 4517556 4562891 4526697 4735752 4611714 4690292 4269449
14066 4269449 4252378 4507593 4308410 4220373 4433498 4353462 4060159 4589640 4004823 3977004
14056 3977004 4049830 3937868 3814656 4127532 3911701 3583981 3697583 3912616 3666976 3435009
14046 3435009 3734835 3548139 3795920 3504905 3655291 3659156 3367456 3600212 3377337 3249363
14036 3249363 3446416 3148779 3059679 3212155 3162383 3382999 3284959 3451109 2891120 3495426
14026 3495426 2952786 3052143 2866539 2696679 2898332 2594854 3019621 3112936 2758882 2588457
14016B588457Q3643K40045O0600j55144K50475k49199j99701K43353m09290K94280
14006B747519j84577l11255K40068J18587j21061n1676l11419j90379M54011j79109
13996B210709J41822k29545r5779j9809L16404k99596J41893j38181K66913k20066
13986B074765j93122J36406M00222j54186L9537K0874j6165L69397p7196L92077
13976B992609M22324Q38969K452675K902315N047072R444596P782960r852161
13968B2031359q715043m411569k524317j155195j141858L66981q09480o55917
13960B984961j60001K29621m84716K16213j27815k73208m13953K82837J59528
13951B413467m21383J97395K15763l52342L4343j85630K29997k5016J09334j28345
$$ plain form
14016 2588457 2672100 2912145 2972745 2817601 3068076 2818877 2619176 2862529 2453239 2747519
14006 2747519 2562942 2251687 2491755 2610342 2489281 2437605 2126186 1935807 2389818 2210709
13996 2210709 2352531 2122986 2027207 2007398 2323802 2024206 2166099 2027918 2294831 2074765
13986 2074765 1881643 2018049 2418271 2264085 2303622 2324496 2308331 2677728 2600532 2992609
13976 2992609 3414933 4253902 6706577 9608892 14655964 24100560 31883520 22031359
13968 22031359 13316316 8904747 6380430 5225235 4083377 4450358 3640878 2984961
13960 2984961 2824960 3054581 2569865 2786078 2658263 2385055 1971102 2253939 2413467
13951 2413467 1992084 2189479 2405242 2052900 2087243 1901613 2131610 2106594 2215928 2087583
13941B087583j62486j67413R075M4410M4018j9780j64891k2279J14326j84687
13931A577876L15115N104r085m13401K50162l9938j06925M5615j81007J42177
13921A585693J37676k35920j7547R800k7338K23811k80684K63614k91447N2773
13911A420431k7548l47335M16922Q5433l97179J41823K66852K7008m17800J42913
13901A311520K37152j17363j30000J41644k20979o3493M9441K42855l33502J15219
13891A232494J50435j9917j13265j51343N3080J20854P5792j05646j79109l1867
13881A031508K85999r1814j6024J86943r1065l22402l4331K06238j29241j24179
13871I01632M61714l32383J54811m5802j22981M34870q7593m97142M36248k14886
$$ plain form
13941 2087583 1925097 1757684 1766759 1811169 1855187 1835407 1670516 1648237 1762563 1577876
13931 1577876 1892991 1898095 1889010 1475609 1725771 1685833 1578908 1624523 1443516 1585693
13921 1585693 1723369 1487449 1469902 1479702 1452364 1676175 1395491 1659105 1367658 1420431
13911 1420431 1392883 1045548 1462470 1547903 1150724 1292547 1559399 1586407 1168607 1311520
13901 1311520 1548672 1431309 1301309 1442953 1221974 1158481 1207922 1450777 1117275 1232494
13891 1232494 1382929 1363012 1249747 1098404 1151484 1272338 1348130 1242484 1063375 1031508
13881 1031508 1317507 1225693 1209669 1396612 1305547 983145 948814 1155052 1025811 901632
13871 901632 1363346 1030963 1185774 1139972 1016991 1451861 1364268 867126 1303374 1088488
13861A088488o3937O9829o8560k39206L40400k58131N35318l81532Q9447M08360
13851A520476n59578j57203L13876k83590q7843L94768k29306J44684j90285J16054
13841I82053L8255J54872l00781N70737m38406o1565l12825N22617j59213K9387
13831A025131n4849j41242O1414J41572j26276J14587M6522m58986l48K40126
13821H47651R4721j11354M3394J44502j00316j92244l0452J83882j04502k43221
13811E32061q4710M25765m9896m4002K06915l63024K33286n709o877l56260L12337
13800G99886k51795L48132k34136J19801j19752J53315L87609n25307J14966M2789
13790H35508j05423o2193J32978k47894K78428k9667n6657r0532o0633p2065N34018
$$ plain form
13861 1088488 1024551 1094380 1025820 786614 1127014 868883 1404201 1022669 1112116 1520476
13851 1520476 960898 803695 1117571 833981 746138 1140906 911600 1056284 865999 982053
13841 982053 1020308 1175180 874399 1445136 1006730 945165 632340 1154957 995744 1025131
13831 1025131 970282 829040 890454 1032026 905750 1020337 1066859 607873 607525 847651
13821 847651 942372 831018 874412 1018914 918598 726354 695902 879784 775282 532061
13811 532061 447351 873116 823220 779218 986133 623109 856395 850686 843809 487549 799886
13800 799886 548091 896223 662087 781888 662136 815451 1203060 677753 792719 835508
13790 835508 730085 667892 800870 552976 831404 801737 745080 654548 593915 521850 1055868
13779A055868D88691K29083j595J21467l12467L36880j33790j24616O7409K93302
13769I64364k66657n7367p5096P2965L5745k93776L40413o0497k1762K86671j27997
13758G97006M6631l84015J43988j9208J0867j88198K38711m5978R829p4680j41111
13747C93842L41514P5164l78907L03518l06994n016J90776L31533m44189K52621
13737G53862j21658q9651L97846m57420N2360j52997J43637j24134J56900K06911
13727G65656l78732K71607j81974K07992N8150B62984K34479M2974k15190K08595
13717E33842L82113m43864o7120J17103J47142C25001N5078J02009n8976J34466
13707E57578j79427L89699k99204M9410K01699j78757j89787m8705J24277n110
$$ plain form
13779 1055868 488691 717774 716179 837646 525179 862059 728269 603653 671062 964364
13769 964364 697707 640340 565244 638209 673954 380178 720591 660094 638332 925003 797006
13758 797006 843637 459622 603610 584402 595269 407071 645782 599804 609633 534953 393842
13747 393842 735356 810520 431613 735131 428137 423121 613897 945430 501241 753862
13737 753862 632204 542553 940399 482979 535339 382342 525979 401845 558745 765656
13727 765656 386924 658531 476557 684549 742699 262984 497463 540437 325247 533842
13717 533842 915955 472091 404971 522074 669216 325001 380079 482088 423112 557578
13707 557578 378151 767850 468646 518056 719755 540998 351211 302506 426783 421673
13697D21673o9283J25632J17757k9323j29459K51692j54700k61032L95360j92736
13687D75581R4691n5017K02001C16197K45793k01323K34693j866j25265J4749
13677D82978M0494j14857j0716J49877k3579B36456P8641L6671M51712B51440
13666B31459J20043m8978j2772K73080k49457L68685j03276B64625J69904P4085
13656E08614j15460p3166J08848Q5896j28470q5625N44158B17645K46598A44306
13645B92616A16660M53863E2196N24634l4974O1923B38587M18788A24638K63744
13635C88382L19659k18269k17332D2090J09113L3050L63772k21829J54026D1217
13624B02388L98485j45266B04284K99306A73030L73939j79195n7942j41184L9460
$$ plain form
13697 421673 352390 478022 595779 566456 436997 688689 533989 272957 668317 475581
13687 475581 570272 515255 717256 316197 561990 360667 595360 593494 468229 482978
13677 482978 523472 408615 397899 547776 524197 236456 315097 351768 803480 251440
13666 231459 351502 302524 289752 562832 313375 682060 578784 264625 434529 508614
13656 508614 393154 319988 428836 514732 386262 300637 844795 217645 464243 144306
13645 292616 116660 570523 52196 576830 541856 603779 238587 657375 124638 388382
13635 388382 708041 489772 272440 42090 151203 184253 548025 326196 480222 41217
13624 202388 600873 455607 204284 503590 173030 546969 367774 309832 168648 208108
13614B08108r8836J27387J66339b4630D33226G3399M0181L12618M6386A63015
13603B71534J61547k2410O4366l7430j85320p7483l8284M8203J77076J69824A16327
13591A15324L85582j59997m1020K70274F954J74441K13673j7485j9279J43197
13581E01501k01764A43622K98058l9950j83067O6057j4921J53426j74748A18891
13570A27762K73596j29027K7647o2711g0916A56677K93755B23542J002J95877
13560D20421o1r7192j59214K66737A73015M46141B42835j15238J56426A23860
13549C09326q5180J23516M5894A74925L15340A49970M00246k66852l9889l016
13539B40459r3791K04927A51527J22966L02149A11444L40908r3679c6303D54280
$$ plain form
13614 208108 109272 236659 402998 -24630 433226 73399 113580 426198 472584 163015
13603 271534 433081 410671 475037 437607 252287 174804 136520 184723 361799 531623 116327
13591 115324 500906 340909 299889 570163 6954 181395 395068 377583 358304 501501
13581 501501 299737 143622 441680 401730 218663 284720 269799 423225 248477 118891
13570 127762 401358 272331 299978 237267 -70916 156677 450432 223542 224544 420421
13560 420421 420360 323168 163954 430691 173015 619156 242835 127597 284023 123860
13549 309326 224146 347662 393556 174925 490265 149970 550216 283364 243475 240459
13539 240459 146668 351595 151527 274493 576642 111444 452352 358673 -36303 454280
13528D01438A82319J98474j20735M583J41520j84870N9557J16661a2794A64076
13517e6154C17069j48078q1169J64821K32081A15186K59599j16756o5890I4292
13506B90431A31375J70410j14150M7792m2499K59088j38963A22655L13196j87576
13496B48275p1027c4185E90273B05943k13K73498k16260G1736J32326J60906j387
13485C63581m5179A27094K28068J36013G7050J02475m1086L53760Q631A38413
13474a2276D45367I5132a12953h869A75221K17999j90221J0514n5186K52640j70701
13463B40266P3187K05164A40730J71041h6674H5390h1211A58163J86123P9484
13453D23770p1155j69927q9894K86459p3259o7420l9961P3525O8237l8387Q3684
$$ plain form
13528 401438 182319 380793 260058 264641 406161 221291 280848 397509 -12794 164076
13517 -56154 317069 168991 87822 252643 484724 115186 374785 258029 192139 94292
13506 290431 131375 301785 187635 235427 192928 452016 313053 122655 435851 248275
13496 248275 177248 -34185 590273 205943 205730 479228 262968 71736 204062 364968 363581
13485 363581 318402 127094 355162 491175 77050 179525 138439 492199 500830 138413
13474 -12276 445367 95132 -112953 -8869 175221 393220 202999 213513 158327 410967 240266
13463 240266 313453 518617 140730 311771 -86674 85390 -81211 158163 344286 423770
13453 423770 352615 182688 92794 379253 305994 238574 198613 272138 340375 301988 385672
13442C85672j01870L3298j9211A21072L2765j0531a1916k4063G2345R1463M3810
13431B07618K12850p0545J92061B04392K25128I7129a63841b8588G0628K55787
13421C26415D0430M37372E7988c2124C50905b3037D16403A66226m7925N6442Q9150
13410B63893a35797A27613J03696p1701D8809L24258A56086J48652j43102Q2670
13400B44306E4971M23343b49557H185N105K52799J74667b49219A99516K69729
13390D69245B19053N3139j08099J18223D1013L25281j716a37209C08756r2728
13380B16028d1593k39760B42399h3313D08229A75387g0327I002d58566f886B87295
13368B1459L40150g1617D29786A10487i5845C34542A28036J43150j371a69730
$$ plain form
13442 385672 283802 317100 297889 121072 153837 143306 -11916 -35979 72345 163808 207618
13431 207618 420468 349923 541984 204392 429520 97129 -163841 -28588 70628 326415
13421 326415 40430 477802 57988 -32124 350905 -23037 416403 166226 118301 174743 263893
13410 263893 -135797 127613 231309 159608 48809 373067 156086 304738 161636 244306
13400 244306 54971 478314 -249557 8185 13290 266089 440756 -249219 199516 469245
13390 469245 219053 272192 164093 282316 41013 366294 364578 -137209 308756 216028
13380 216028 -41593 -281353 242399 -83313 408229 175387 -70327 9002 -458566 -6886 287295
13368 21459 361609 -71617 429786 110487 -95845 334542 128036 271186 269815 -169730
13357C16028j24311a43440L6444B27198o3632K72700G1512L52438G4816K15124
13347B89940j09502c2286B93927j04145I582L26919l6967J59949A58460K27467
13337C85927h8086A45655k1617L4688j0519O8263C9502h1895A57841e0321j0380
13326f0701C92914j240j3880j21699J34764a3271F7239L33489l3396j43172R7133
13315C21293B0138J64319P9843j29375m4172L32988m2649j69241e4617D52378
13304A54870c0249B66864F3033J05868a8039k59091d1182B69604f0821A27108
13293A89639o7824K4316m6403L34886A17126O9458K2380F6948e2571C57924H4489
13281B51479q8186L36948A57293d6885B96735b50448b2178A09904Q6041f4333
$$ plain form
13357 316028 191717 -143440 -106996 227198 163566 436266 71512 423950 74816 289940
13347 289940 180438 -32286 293927 189782 9582 336501 299534 459483 158460 385927
13337 385927 -88086 145655 124038 158726 148207 216470 39502 -81895 157841 -50321 -60701
13326 -60701 392914 391674 377794 256095 390859 -13271 67239 400728 367332 224160 321293
13315 321293 20138 184457 264300 134925 90753 423741 381092 211851 -54617 452378
13304 154870 -30249 266864 63033 168901 -18039 -277130 -41182 269604 -60821 127108
13293 189639 121815 146131 99728 434614 117126 186584 208964 66948 -52571 357924 84489
13281 251479 163293 500241 157293 -46885 296735 -250448 -22178 109904 195945 -64333
13270C27886A11520H53a30774f2489C19814b97882f8294B80128h5106l6842D85087
13258B35054j17237h8206n7499B42085b23785C23000L9758A1754O1226J42241
13248B15221A2476i0188B40915a00347K3534A95425J50620d29038D32293d4023
13237A48255d7818k01196A31001f5769B54682D9882b8024j72754A20685b89514
13226A12504L88781I6384O0617E9251i6017D09901A63261h6456G3167i221k3926
13215c3147E9713N7147Q6623P8435F6035e6350B68266p1230b06294A25830b3572
13203a9958G5849J63837F4342a76183b1258A23424J25446K8095j23556R6628l2856
13192B17181G4110K51665f327E3456K58726a33690A59849Q9512l0389G9471J04965
$$ plain form
13270 327886 111520 853 -130774 -62489 319814 -297882 -68294 280128 -85106 -121948 485087
13258 235054 117817 -88206 -145705 242085 -223785 323000 362758 11754 72980 215221
13248 215221 12476 -90188 240915 -100347 -76813 195425 346045 -429038 432293 -44023
13237 148255 -47818 -249014 131001 -65769 254682 49882 -28024 -200778 120685 -289514
13226 112504 501285 96384 157001 59251 -96017 409901 163261 -86456 73167 -9221 -33147
13215 -33147 59713 116860 203483 281918 66035 -56350 268266 197036 -206294 125830 -23572
13203 -19958 75849 239686 64342 -176183 -21258 123424 248870 276965 153409 250037 217181
13192 217181 74110 325775 -6327 53456 312182 -133690 159849 249361 218972 79471 184436
13181A84436N848m2452Q8532a28388e5630B12471g6661C742J8433i2301H58i1080
13168B5345L21441D4051a05636D05946h8859j03111l5086D695J76482a50j089
13157a239I531A940i9454D34673G8535l7645b6878j57079A67072D1428b61169
13145A37667J6955p3084a5038C8752a45858B05828a00466A41910K28178j2492
13135C57596a67695f3877A95425O6583I9110k2896e0240q8967b8857B08080c06192
13123D9549M68136a55113e2414k49328e8480I6993J08076M0663J26994A04514
13112f1952B75397a5333k03347d8217A87931d4290A84141a08124B74844c49142
13101a52807I3453L9196D5103c12968a1091o504G3977M9989L8372i963A19622
$$ plain form
13181 184436 190284 147832 236364 -128388 -55630 212471 -76661 3742 22175 -92301 858 -91080
13168 25345 346786 44051 -105636 405946 -88859 -191970 -227056 4695 181177 -150 -1239
13157 -1239 9531 1940 -99454 434673 78535 40890 -26878 -183957 167072 41428 -261169
13145 137667 154622 81538 -15038 38752 -145858 205828 -100466 141910 370088 357596
13135 357596 -167695 -63877 195425 262008 99110 76214 -50240 -139207 -28857 208080 -306192
13123 49549 517685 -155113 -52414 -301742 -58480 96993 205069 245732 372726 104514
13112 -61952 275397 -15333 -218680 -48217 187931 -44290 184141 -108124 274844 -349142
13101 -152807 93453 132649 45103 -312968 -11091 -17595 73977 123966 162338 -9963 119622
13089B1082b2499D6165a07443j5945B2785f4621m804G572J66798E3903P4380A662
13076C34124h4774C09155B2349o426a33890B60099G3612a87137M5775a3442A3312
13064C2533g6896j37808B09405a39499A70544e2030D16837E3434N9579N8K32658
13053C45729a36923A66964h752j87569E278a73750b6736C18842a24965k0316B64766
13041D0993R362J88905j09555c3549D4346f6187B54122h1221K5212f95A49434
13029A59584a52493B40233R7985a67304C1556b57049A10071b40585G1028c4038
13018A68600L9664G7689J41260j8788a24369j75426f8065l4457a1782j44067D62690
13006A19211J21220n8432J91316k5342h0044A35139c32821J16398o5719d1271
$$ plain form
13089 21082 -22499 46165 -107443 -123388 22785 -64621 -69425 7572 174370 53903 128283 1662
13076 334124 -84774 309155 22349 15923 -133890 260099 73612 -187137 -141362 -13442 13312
13064 32533 -76896 -214704 209405 -139499 170544 -52030 416837 53434 113013 113071 345729
13053 345729 -136923 166964 -8752 -196321 5278 -173750 -26736 318842 -124965 -145281 264766
13041 40993 50355 239260 129705 -33549 44346 -66187 254122 -81221 -56009 -695 149434
13029 159584 -152493 240233 338218 -167304 31556 -257049 110071 -240585 71028 -34038
13018 168600 208264 77689 218949 200161 -124369 -299795 -68065 -102522 -11782 -155849 462690
13006 119211 240431 181999 373315 347973 -80044 135139 -332821 -216423 -282142 -41271
12995b10414A72966a59994I7520c5728j69470B68507O7486A20170Q9535q0519
12985A29186L9460J93348l7959a30274b7538k01584C07895J06163b10957A11902
12974F9790K20533I1837h716G0774a92457e5956B76733a8283B19766E9050L9709
12963I8759K21339B6015P5470c78204A89327q1675a88039A6846K92257j17056
12953A92047D4059K94111e9846B42237G3222i1707F1417R4690B0500c3907i7C9480
12940E1050a58996A99126a26043m8294E1619K95059o0508l755K19708c02589h9387
12928C6680K15413A09907b2347j49762A05292A2947Q9165a46772E563C82J35517
12917A35899a56921K1275j12920a09797A42064J37257G2669a34785e5796k06715
$$ plain form
12995 -210414 172966 -159994 97520 -35728 -205198 268507 335993 120170 209705 129186
12985 129186 168646 361994 324035 -130274 -27538 -229122 307895 414058 -210957 111902
12974 69790 290323 91837 -8716 70774 -192457 -55956 276733 -18283 219766 59050 98759
12963 98759 320098 26015 101485 -378204 189327 107652 -188039 16846 309103 192047
12953 192047 44059 338170 -59846 242237 73222 -91707 61417 156107 20500 -33907 -97 39480
12940 51050 -158996 199126 -126043 -174337 51619 346678 286170 282415 502123 -302589 -89387
12928 36680 252093 109907 -22347 -172109 105292 12947 102112 -146772 5563 382 135899
12917 135899 -156921 -135646 -248566 -109797 142064 279321 72669 -134785 -55796 -262511
12907b62511B8822c5198A34330a16888A77839o8169a10398C38561l4176P0971
12897C75356A86860J7626H392J08660a59323K7339f0247A03306a18386j24609
12887b42995g9675I2211g7015A80191l4630J44537b21945A62819b26000D7576
12876h3788C39271A54111b28711A36636E1821c2982j52252a5796n1802l3612G3517
12864A46251a55846B95517a02385a0765j90331g0881A20290d2276A33716i5725
12853f9689A29115a2345H5451a55506D3014J85340d8723n9189D9068J29218a84683
12841A40667l1226d29048b7227B6291a21996o547c1997H3159e5037k4738j32B36578
12828a18736C60593e4998k33756J16803G5199K85174g4978a988j0830A47758i7599
$$ plain form
12907 -262511 28822 -35198 134330 -116888 177839 109670 -110398 338561 304385 375356
12897 375356 186860 204486 8392 117052 -159323 -131984 -60247 103306 -118386 -242995
12887 -242995 -79675 92211 -77015 180191 145561 290098 -221945 162819 -226000 47576
12876 -83788 339271 154111 -228711 136636 51821 -32982 -185234 -15796 -67598 -101210 73517
12864 146251 -155846 295517 -102385 -10765 -201096 -70881 120290 -42276 133716 -95725
12853 -69689 129115 -12345 85451 -155506 43014 228354 -48723 -107912 49068 178286 -184683
12841 140667 109441 -429048 -27227 26291 -121996 -128543 -31997 83159 -55037 -79775 -79907 236578
12828 -118736 360593 -54998 -288754 -171951 75199 360373 -74978 -1988 -12818 147758 -97599
12816f2146D4948a6602B08428b244A5830K97630b92941J12812C4058J48548a27293
12804a83692e5287B25442a2708j72508C57791F7986b07848C1713J08469a37572
12793F7383L70772a93668B33968b92187d9917l23330H3985c52300C43380a12175
12782F6764L8387j938a72193A27175b20630A33551b54298d8168A78601b3638D5
12770a92168G5528d42317C5109P6045G949L87560e6941B68879j2676j23424e04633
12758A2830e4747A46876N7049c28585e0534k23047j4454B1837c8482j28081f6903
12746c4761C04576j35907a38085D9356b9334A29786c33164D85P0892G712b58119
12734d4276k06163L9221B09480A1587a09298j15383A10856b40796A04128j3312
$$ plain form
12816 -62146 44948 -16602 208428 -2244 15830 313460 -292941 -180129 34058 182606 -127293
12804 -183692 -55287 225442 -12708 -185216 357791 67986 -207848 31713 140182 -137572
12793 67383 438155 -193668 233968 -292187 -49917 -373247 83985 -352300 343380 -112175
12782 66764 105151 103213 -172193 127175 -220630 133551 -254298 -48168 178601 -23638 45
12770 -192168 75528 -442317 35109 111154 7949 395509 -56941 268879 256203 132779 -504633
12758 12830 -54747 146876 203925 -328585 -50534 -273581 -288035 21837 -38482 -166563 -66903
12746 -34761 304576 168669 -138085 49356 -29334 129786 -333164 485 71377 7712 -258119
12734 -44276 -250439 -211218 209480 11587 -109298 -224681 110856 -240796 104128 90816
12724I0816e6693B45913N8333b244m9933j24669A33289l5599c83860a76627c4404
12712A69317j2098g5903l22335a27976A12629d10823H9389B9659P7091b69188
12701b9109j69469Q5848i608A13106d4561j16230A15507b04497B67648a5427A4289
12689C23426a44963d0160D94641A75007Q6876a49286B95932G8777J95816e5816
12678A23745O105d21328D4613j0923N1112b00526c9944j54205B10519a45671A22684
12666B9696R3511k7577K20094E6817B3913b9999C14162A01492M6609J02518b15315
12654C12448c41137B69659b19881L7200A04230d86513B31495I9893l6158P8065
12644A41800J10193C0476L06458C6370c05812b3034A11689a38361A46376J6891
$$ plain form
12724 90816 -56693 245913 304246 -2244 -52177 -176846 133289 97690 -383860 -176627 -34404
12712 169317 157219 -75903 -398238 -127976 112629 -410823 89389 29659 106750 -269188
12701 -29109 -198578 -112730 -9608 113106 -44561 -160791 115507 -204497 267648 -15427 14289
12689 323426 -144963 -40160 494641 175007 261883 -149286 295932 78777 274593 -55816
12678 123745 129850 -421328 44613 33690 84802 -200526 -39944 -194149 210519 -145671 122684
12666 29696 123207 95630 315724 56817 23913 -29999 314162 101492 148101 250619 -215315
12654 312448 -341137 269659 -219881 -182681 104230 -486513 231495 99893 63735 141800
12644 141800 251993 30476 336934 36370 -305812 -23034 111689 -138361 146376 163267
12634A63267J4638a35802C18459A32174a20839G751c28972c3258H121M7908K572
12623E8601J13401e3217A25576a59703B86164A922M6152J80647A2507J69444J33811
12612C15762l0910j02982e3389A6337m351R4944J96326A14511L41013A94310H1005
12600B55638I5260m3776K1191r295a0492A23818N5152P3898a11179F5728b27793
12588c14810J15101c9267A20772c33762B25514q0954a656E7976K1985J91908b04488
12576A18282c2427B98175c9657A1120a08257r0540h4744F1442a05552l9864d2136
12564b36205b7631A6434e8119D2212e3029a0932B22003o7178l2827J38750j29288
12553A31460F574c99867B3042K64359A03381c8340q3042D5510K0402a44097G67
$$ plain form
12634 163267 177905 -135802 318459 132174 -120839 7751 -328972 -33258 8121 56029 58601
12623 58601 172002 -53217 125576 -159703 286164 1922 48074 228721 12507 181951 315762
12612 315762 284852 181870 -53389 16337 11986 106930 303256 114511 455524 194310 81005
12600 255638 95260 51484 72675 63380 -10492 123818 178970 252868 -111179 65728 -227793
12588 -314810 -199709 -39267 120772 -333762 225514 144560 -1656 57976 79961 271869 -204488
12576 118282 -32427 298175 -39657 11120 -108257 -198797 -84744 61442 -105552 -145416 -42136
12564 -236205 -27631 16434 -58119 42212 -53029 -10932 222003 154825 121998 260748 131460
12553 131460 6574 -399867 23042 287401 103381 -38340 -121382 45510 65912 -144097 767
12541g6493b5526A71820a24509B12890a46901C24972e4392B00448f5099j4129
12531g9228A15503E1127e1848A06719e206q9673m9975J9887j46043g9455B06604
12519D33394c5476D6420j4193g3722A45695h4225P97r4017j59048J14959K0475
12508b01059A08315d0902j37575N362c1389A51991a05855j19288A6701J88441
12498B05142d8459A07483h1932A72301F2715a26328j8118D828J50421i7855A02548
12486a00750C6761J3678a74105k14987A61475g2569a87B03588r7768b12760J615
12475b11145i5912a220A42757c05458c2192D941a34995L1061m4354f4707l5489
12464a00196H6009j1507P5262p4487L9697c30669A59199L2455c16192A67757j5629
$$ plain form
12541 -76493 -25526 171820 -124509 212890 -146901 324972 -54392 200448 -65099 -79228
12531 -79228 115503 51127 -51848 106719 -5206 -94879 -144854 -124967 -271010 -79455 206604
12519 433394 -35476 46420 32227 -73722 145695 -84225 -83428 -177445 -336493 -221534 -201059
12508 -201059 108315 -40902 -178477 -173115 -31389 151991 -105855 -225143 16701 205142
12498 205142 -48459 107483 -81932 172301 62715 -126328 -144446 4828 155249 -97855 102548
12486 -100750 36761 50439 -174105 -389092 161475 -72569 -187 203588 105820 -212760 -211145
12475 -211145 -95912 -1220 142757 -305458 -32192 4941 -134995 -103934 -148288 -64707 -100196
12464 -100196 86009 74502 149764 75277 114974 -330669 159199 191654 -316192 167757 152128
12453A52128J38990I386a82753A66220a61100C0515b05551B4654i1230n6841e662
12441d6588j62266A50331b21039B6179M2590c67279J51334E8078a87904R2066
12431i5838L2945K7446F0191b36120e8268a7485I5936l0568N1212m3903e0097
12419h8752p8927A94960D0155a05590o3383C5374J58871o563l3747a60426m6630
12408b07056B9528N8911Q152a7518j91903a1340A67177b65672A38775b04671A3732
12396B06576b62979d9206B5561K6622j0096b46899C47612b01468B79328a93748
12385a83864d5940j92006D4040K10355c4158m26633h1944A65619a0400l1429J7010
12374b4819k87121A07641J7890J53730b41445J00388a7895B08330J21084j08611
$$ plain form
12453 152128 291118 9386 -182753 166220 -161100 30515 -205551 24654 -91230 -148071 -5662
12441 -46588 -208854 150331 -221039 26179 68769 -367279 -215945 58078 -187904 -95838
12431 -95838 -62893 -35447 60191 -236120 -58268 -17485 95936 65368 116580 72677 -50097
12419 -88752 -167679 194960 40155 -105590 -168973 35374 194245 187682 153935 -160426 -207056
12408 -207056 29528 88439 96591 -17518 -209421 -11340 167177 -265672 138775 -204671 13732
12396 206576 -262979 -49206 25561 52183 42087 -246899 347612 -201468 279328 -193748
12385 -183864 -45940 -237946 44040 254395 -34158 -460791 -81944 165619 -10400 -41829 -24819
12374 -24819 -311940 107641 125531 279261 -241445 -141057 -17895 208330 329414 220803
12364B20803b45863F7778K8541j6674k257K24072G1578c4962H2687M6335m161
12353A24861A967c5383A56132a86808C13907b36949E8220K51744J115I727b6521
12341I1244k1202P7887i2865K66B6210K13900a15878j656A16967h1923D24769
12329A42308K2677g4433I8738h8096D4643J02594K78769a91424j6606G3170i4514
12317B35429E8538N6206e5642C45350J08223C6206J6619b41321B77352o8766K3992
12306B32578a36034C8363L33608c4469B09256L2071E4027g7620B07993a83693
12295A11809l4410a96187A82977F6022b6893H8387B9458a28809c0145A75257D0450
12283A46097d6409B60902a48028n9255A34385N3026F4822K0273b36690G9049j3216
$$ plain form
12364 220803 -245863 67778 96319 79645 77388 301460 71578 -34962 82687 129022 124861
12353 124861 1967 -35383 156132 -186808 313907 -236949 58220 309964 311079 9727 -26521
12341 91244 70042 147929 -92865 -92599 26210 240110 -115878 -117534 116967 -81923 424769
12329 142308 164985 -74433 98738 -88096 44643 147237 426006 -191424 -208030 73170 -94514
12317 235429 58538 114744 -55642 345350 453573 36206 52825 -241321 277352 208586 232578
12306 232578 -136034 38363 371971 -34469 209256 241327 54027 -77620 207993 -183693
12295 111809 77399 -196187 182977 66022 -26893 88387 29458 -128809 -30145 175257 40450
12283 146097 -46409 260902 -148028 -207283 134385 187411 64822 85095 -236690 79049 65833
12272F5833Q4077a82480A37278F0018L32230o1672E9546a75547D66637A28320
12261f9971C09303J15846a36631A51371m3603J46915E907c22936C32490j12135
12251B20355f0754D32267A27399B9497K37436J62765A29448M9963d25338A79262
12240D8532a02629O338C3347A4187K16822C3902J20425K26050C2555L28788a71
12228D36506e1977B68417a73489B24553h400B88456p3317a45026m8504A9947g8987
12216I5758d0451B81398a59431D35209f2232A34807a02604H1938i1847a3848H1524
12204A18175d0661B81642j09440N1832K3883q5242O4258o5898m537D3114R4878
12193A37992f1658B14515I9521M809Q9450b6414A10543a33780B23158e6490A19570
$$ plain form
12272 65833 149910 -182480 137278 60018 392248 330576 59546 -175547 466637 128320
12261 -69971 309303 425149 -136631 151371 107768 254683 5907 -322936 332490 220355
12251 220355 -60754 432267 127399 29497 266933 429698 129448 179411 -425338 179262
12240 48532 -102629 -96291 33347 14187 231009 33902 154327 380377 32555 361343 -171
12228 436506 -51977 268417 -173489 224553 -8400 288456 215139 -145026 -193530 19947 -78987
12216 95758 -40451 281398 -159431 435209 -62232 134807 -102604 81938 -91847 -13848 81524
12204 118175 -40661 281642 172202 224034 247917 162675 226933 161035 156498 43114 137992
12193 137992 -61658 214515 99521 104330 193780 -26414 110543 -133780 223158 -56490 119570
12181B06583q0001c4460B10756A5056J92357D8777g3138A38243J87448c8775B80297
12169B14944e5748o7792K989M0266A28866b94527G4409L23005a1958A24378J99049
12158C23427A60710f1791C51051A6240b58008A22294K25498c306A23958b27972
12147B16606H993L07863I0556L5486O0567a92093A06868a59694A85352o6231L8629
12136A57750O6522n3099L5908e3258A69742J41157G3R8573k8625j3079J47348
12125B04290H7058J31107b2723A04519K56996l3443i1524A24446K03722b13250
12114c8384C09432K04748E5480a4904A20657M5856o4117i5570A47526p782J29200
12103B68944C7987M19614i2192B91552J26564b48337c2684B67877g1647I5694
$$ plain form
12181 206583 126582 -34460 210756 15056 207413 48777 -73138 138243 325691 -38775 280297
12169 214944 -55748 -123540 -120551 -80285 128866 -294527 74409 397414 -11958 124378 323427
12158 323427 160710 -61791 351051 16240 -258008 122294 347792 -3306 123958 -227972
12147 216606 8993 316856 90556 126042 186609 -192093 106868 -159694 185352 119121 157750
12136 157750 224272 171173 207081 -53258 169742 310899 73 98646 70021 56942 204290
12125 204290 87058 218165 -22723 104519 361515 328072 -91524 124446 328168 -213250
12114 -38384 309432 514180 55480 -14904 120657 166513 102396 -95570 147526 139744 268944
12103 268944 37987 457601 -92192 291552 418116 -248337 -32684 267877 -71647 95694
12092A12450n1830J17992e2613j7628G6684a25146C67721e9938B29964j10059
12082A19905J7039a49706B43746E4345L85862j86296a64572b449o098I461J50229
12071A59690g7810Q181A65022O3210D4469a11270B0512a64943C25341j19298L8493
12060B44536j6940K20776h3782h8B37202p5018a31068I5047K01451C659a82888
12048c6412J5723Q898A53990a70403M7371C03216e891F5080O4604j400D7773J68513
12036B16286C5444a35070e9147k68496e4289B4115f5829G9446p544c3772a1873
12024f6294E27362a68625A08138C2279M0175i9336k8326G9296a44849B6430J92273
12013B18703b44003A19838A7201J34353E1560a09996B99914I6627a59767A42229
$$ plain form
12092 112450 60620 178612 -52613 -70241 76684 -125146 367721 -59938 229964 119905
12082 119905 136944 -149706 243746 54345 440207 253911 -164572 -2449 -8547 9461 159690
12071 159690 -77810 -69629 165022 228232 44469 -111270 20512 -164943 325341 206043 244536
12060 244536 227596 448372 -83782 -88 237202 162184 -131068 95047 296498 3659 -182888
12048 -36412 -20689 -11791 153990 -170403 -123032 303216 -5891 65080 129684 128284 47773 216286
12036 216286 35444 -135070 -59147 -327643 -54289 24115 -65829 79446 71902 -33772 -11873
12024 -66294 527362 -168625 108138 32279 72454 -99336 -127662 79296 -144849 26430 218703
12013 218703 -244003 119838 17201 151554 51560 -109996 299914 96627 -159767 142229
12002A57744n4448a00470R506k4390b8709A38988A5080L21213A08062j2399M4755
11991A40418f8028k77081H5620J75226d8369k21022B05005b5041j58669f8199
11980b27039A75819E1870K10084i9962B57647a42249I7060b62096G7923i7267
11969A59916K12284i5034r982k01976A21979D1666i1441A46670g4629A44092B2916
11957i6438A31943c45127g5652q3974A57725C468d1108A30283l3243f745j91658
11946a98403R8259k05835C2738P7717b62525A74040a72575F954a47625c1072E8818
11934b12564b9311j18258C80541a05846A93640H0523e2521K0493A86831C6400
11923A82246a87972j8806L394A57753n6251c6263j08013D605c29226A32786k4368
$$ plain form
12002 157744 103296 -100470 -90964 -115354 -28709 138988 15080 336293 108062 95663 140418
11991 140418 -68028 -345109 85620 260846 -48369 -269391 205005 -25041 -183710 -68199
11980 -227039 175819 51870 261954 -99962 257647 -142249 97060 -262096 77923 -97267
11969 159916 372200 -95034 -105016 -306992 121979 41666 -91441 146670 -74629 144092 22916
11957 -96438 131943 -345127 -75652 -159626 157725 3468 -41108 130283 97040 -6745 -198403
11946 -198403 -100144 -305979 32738 110455 -262525 174040 -172575 6954 -147625 -31072 58818
11934 -212564 -29311 -147569 380541 -105846 193640 80523 -52521 -32028 186831 36400
11923 182246 -187972 -206778 -203384 157753 101502 -36263 -144276 4605 -329226 132786 108418
11912A08418a3113p5470j68083B42621a5177j83167I0781d271k52396a18843j148
11901a19991J955A37568a90881O4291j78901e2330E26622A75639c50927g0982
11890a40773E3430J5506a69057C5403a2741j27052m0647b0536G7341i3255Q558
11879h4697r9848e537A0049N2936B9429b33569i7722A73551L6698c6631A38707
11867H935e8392n9080r7278A04917c86977M4445b9296I4554L5708b50617M7625
11856b02992P4317m2371F1167b32705F4827M80a05813n4691A5012K4049a73001
11844A77245P966G0004a48044a0361k0510B26678l8797a97008E2949J94480f9596
11832D956L55079A9488i4749A21879b46327c8801k37567a9662q445r9364G7459
$$ plain form
11912 108418 -13113 -88583 -256666 242621 -15177 -198344 90781 -4271 -256667 -118843 -119991
11901 -119991 -118036 137568 -190881 -126590 -305491 -52330 526622 175639 -350927 -70982
11890 -140773 53430 68936 -169057 35403 -12741 -139793 -180440 -20536 77341 -93255 -84697
11879 -84697 -184545 -5537 10049 62985 29429 -233569 -97722 173551 210249 -36631 138707
11867 8935 -58392 -117472 -214750 104917 -386977 -342532 -29296 94554 130262 -250617 -202992
11856 -202992 -128675 -171046 61167 -232705 64827 65307 -105813 -160504 15012 39061 -173001
11844 177245 185211 70004 -148044 -10361 -30871 226678 187881 -197008 52949 247429 -69596
11832 4956 360035 19488 -94749 121879 -246327 -38801 -276368 -19662 -28107 -127471 77459
11820i3429k21517a4679p3021j43689D18204c0165m1679C92250F3653b59299J05222
11809a54077p6265H9351O6194a54096B44200a60902D9087d04110a18666m8782
11799a67448B48599a49403G1104b20931a03511G346b15482g3103A61039a01755
11788A04035a79149c8669A69106b19884C2552R0243c58542F0823J85301e0045
11777h8423H1855i5948j2085N81p5412A33956J31037b74708q7368a29673A34477
11765B29720a8303k32583L1090H3462h2190C50947h0503C0226a32640f6276k8399
11754i4675j6675b2862A5265J85224a16546B02282b26870C554K127J13244a21470
11742a04802j26580D9141K39596R148c5236m6860B5855a23022A87298h9950o3514
$$ plain form
11820 -93429 -314946 -14679 -87700 -231389 418204 -30165 -71844 392250 63653 -259299 -154077
11809 -154077 -230342 89351 155545 -154096 244200 -160902 49087 -404110 -118666 -167448
11799 -167448 248599 -149403 71104 -220931 -103511 7346 -215482 -73103 161039 -101755
11788 104035 -179149 -38669 169106 -219884 32552 122795 -358542 60823 246124 -50045
11777 -88423 81855 -95948 -108033 -107452 -182864 133956 264993 -274708 -362076 -129673 134477
11765 229720 -18303 -250886 -219796 83462 -82190 350947 -80503 30226 -132640 -66276 -94675
11754 -94675 -111350 -22862 15265 200489 -116546 202282 -226870 3554 5681 118925 -121470
11742 -104802 -231382 49141 288737 297885 -35236 -82096 25855 -123022 187298 -89950 -153464
11731a53464L431f2376a7238k592k6974k10690b3472p9321Q603m2064j0740F6740
11718F57798G8995Q3885F9430j8051e3054j97488e5660r7748C45701j44367a76993
11706A98348o0096J72389j47897a85246A94756k6965L7540h2511A03847c8172
11695e3712G7176a10920H9218K43724e4484E2056J51995b7156n7347j24132d3181
11683h1371A80765A7252a83167D8638e1581j17652b844F7373O306a40571J4901
11672a25670D35481a9774p7260B47922f8425k6963A5937o745J23816c24369A73438
11660A2500c38515E7765J69299G3376k3186e7120C64166B1958L50815d7381J8113
11649b9268j02910l665B37932j16741b21807G6253a73704P7238j58186f5662j14168
$$ plain form
11731 -153464 -150033 -62376 -17238 -19830 -46804 -257494 -23472 -102793 -94190 -136254 -146994 66740
11718 657798 78995 162880 69430 51379 -53054 -250542 -55660 -153408 345701 201334 -176993
11706 198348 138252 310641 162744 -185246 194756 167791 205331 -82511 103847 -38172
11695 -53712 77176 -110920 89218 332942 -54484 52056 204051 -27156 -84503 -208635 -43181
11683 -81371 180765 17252 -183167 48638 -51581 -169233 -2844 67373 73679 -140571 -125670
11672 -125670 435481 -19774 -97034 247922 -68425 -95388 15937 9192 133008 -324369 173438
11660 12500 -338515 57765 227064 73376 50190 -57120 364166 21958 372773 -47381 -29268
11649 -29268 -132178 -135843 237932 121191 -221807 76253 -173704 -96466 -254652 -65662 -179830
11638a79830P3454D7369a68209H41P6701K8516g9555m8662B10728a39013H3963
11626A34188C8481A6669J35008b04231A55811e2413K3474p8332L7573A78595M7511
11615B26106r5443J8756a88384A29569M2380Q3750A3320m253f3119A00467d7447
11603d19936a40783A87910e6875B61307q1987q9088a60056M6494D3603i1680A4883
11591F2419a80042A42800J10389b4859E345J29793D5640M505a15135B17548j3494
11580B04054B7043M0979J01152d6284A15326D5845L4952a95443h4623A79448b30282
11568a55477a3112A14560a64068B69630A7005L0099K4380K19551b54593G3671
11557c6573A8371K19615D9792i3403k1663A52268K81241b21287B8762c0418m1864
$$ plain form
11638 -179830 -106376 47369 -168209 841 77542 106058 -79555 -128217 210728 -139013 83963
11626 134188 38481 16669 151677 -204231 155811 -52413 -28939 -107271 -69698 178595 226106
11615 226106 130663 149419 -188384 129569 171949 255699 13320 9067 -63119 100467 -47447
11603 -419936 -140783 187910 -56875 261307 179320 90232 -160056 -113562 43603 -91680 14883
11591 62419 -180042 142800 253189 -24859 5345 135138 45640 50145 -115135 217548 204054
11580 204054 27043 68022 169174 -46284 115326 45845 80797 -195443 -84623 179448 -230282
11568 -155477 -13112 114560 -164068 269630 17005 47104 71484 291035 -254593 73671
11557 -36573 18371 237986 49792 -93403 -115066 152268 433509 -221287 28762 -30418 -72282
11546g2282m5771I6487P2898a1626B05498k1739B2719J58909a53014a0726k39140
11535b49866J19257A29353K8551a14020j1206j4531f4072A0999d1416B93195A27499
11523c6740k9275a4303l445p3966I9113J00658c2681C42954A03584m5571k0082
11512C7931M5100c11382A18207a5305A21151J16101a68298H0804a09264n5836
11502a65100f8618A76213b83562b3291j8981P636H8208Q0775O3206k8734a05641
11490E16439k53076c1803A02668L3952a76748A6956J17635n9789m198K8982e899
11478A18783a04293F190c0367A42530p0861b78442a05833c3379D070N4902a91607
11466A41340a9270A2053J53082b59538C539L11768D2649J29077C140K87732b04715
$$ plain form
11546 -72282 -118053 96487 169385 -11626 205498 183759 22719 181628 -153014 -10726 -249866
11535 -249866 -130609 129353 157904 -114020 -125226 -139757 -64072 10999 -41416 293195 127499
11523 -36740 -66015 -14303 -17748 -91714 99113 199771 -32681 342954 103584 58013 37931
11512 37931 83031 -311382 118207 -15305 121151 237252 -168298 80804 -109264 -165100
11502 -165100 -68618 176213 -283562 -23291 -42272 -34636 88208 168983 232189 203455 -105641
11490 516439 263363 -31803 102668 136620 -176748 16956 134591 74802 70604 99586 -5899
11478 118783 -104293 6190 -30367 142530 71669 -278442 -105833 -33379 4070 58972 -191607
11466 141340 -19270 12053 165135 -259538 3539 315307 42649 171726 3140 290872 -204715
11454B28770D5085J05421A1229K79488a11746a6366r3827c9505A44874P9226j122
11443B22978a86591m7587a00813C79382A80647C6211L0173a45285C40248I4263
11432A80546E9285Q1706d5037p0391b7606o570o954k14714A8662a90136n989D6096
11419A20176P0001a32014J2350b770Q01j69283A02910o35C1581L52057E4008a20649
11406A87519l2080J49055A505a16922C1659i4066B13336N5516b7702P954C5851
11394c95160A85868a7431l4135B3391e3616B0015J39279b11673d540G8364A1504
11382c80429C96711b21299f2630j25441A60182e612A19080N5233a7109o5944E3354
11370g0079A0813K02750e2397A93240J07074A24380k1114h3918A47065K7884E3122
$$ plain form
11454 228770 45085 150506 11229 290717 -111746 -16366 -110193 -39505 144874 224100 222978
11443 222978 -186591 -234178 -100813 379382 180647 36211 66384 -145285 340248 94263
11432 180546 59285 140991 -45037 -115428 -27606 -34176 -41130 -255844 18662 -190136 -196125 46096
11419 120176 190177 -132014 -119664 -2770 -1969 -171252 102910 102275 31581 383638 54008 -120649
11406 187519 155439 304494 1505 -116922 31659 -94066 213336 268852 -27702 -19748 35851
11394 -395160 185868 -17431 -51566 23391 -53616 20015 159294 -211673 -4540 78364 11504
11382 -380429 396711 -221299 -62630 -188071 160182 -5612 119080 174313 -17109 -83053 53354
11370 -70079 10813 213563 -52397 193240 300314 124380 103266 -83918 147065 174949 53122
11358B38373G561J3169o727J12895b63054J17933e5801C2065J06496M27690h3363
11346b72158b4332E6161a18575c8650H5937A4306h6730D45168C6407J0177a08584
11334A56958a77298A04763K5095b00273A57227b04416j80429G3463h6160j42690
11324b28850B7091K0610a59519B43344J77171g4618r9669H8157a6129A57826j4333
11313A43493E1764a19696j70361a7074n1569j40181b8001p8299C74634o5848I9294
11301d51604B18247c32458m175a12252J8895n3546A70650d7636B30664A10596
11290D3597c7954A43741n3864i1011I8286N4092C6980p34a3280A03712a06375
11278a44016k9338C45967j35278a50299f1873j30760o1880A34929F4251a23263
$$ plain form
11358 238373 7561 20730 14003 126898 -263054 -145121 -55801 32065 138561 566251 -83363
11346 -272158 -24332 56161 -118575 -38650 85937 14306 -86730 445168 36407 46584 -108584
11334 156958 -177298 104763 129858 -200273 157227 -204416 -384845 73463 -86160 -228850
11324 -228850 27091 47701 -159519 243344 420515 -74618 -174287 88157 -16129 157826 143493
11313 143493 51764 -119696 -290057 -17074 -68643 -208824 -28001 -106300 374634 308786 99294
11301 -451604 218247 -332458 -336633 -112252 -93357 -146903 170650 -47636 230664 110596
11290 43597 -37954 143741 89877 -91011 98286 152378 36980 36246 -13280 103712 -106375
11278 -144016 -173354 345967 210689 -150299 -61873 -192633 -254513 134929 64251 -123263
11267B0405b62987o062C14698q3068b66834F9632c23282J42839h1474r629d4048
11255G0296b57261L6721P5255A28888b63636G5056J57965c73224f3530l18144
11245c81674A18584C4358b81683G3150f7830A56730H452b29673h8705c5591A36917
11233H8775e9369p2207G9808r530L3182b4553k50174A20216K3823d98578B86821
11221a8714k77944A0823a38160C5207d49859O2869A54975a24658E4264J40005
11211A94269L7258A2213a14443b8316j40831j60601J55512C9375c36774D1335
11200C3917J23365b82275D310b36898J09435B8831g0306m5514i84k04308a0084
11188B16023d8444p8899f1531R344r8504A98884c9939j75574O3265A04461a53986
$$ plain form
11267 20405 -262987 -269049 314698 231630 -266834 69632 -323282 -180443 -81474 -91103 -44048
11255 70296 -257261 -220540 -145285 128888 -263636 75056 233021 -373224 -63530 -381674
11245 -381674 118584 34358 -281683 73150 -67830 156730 8452 -229673 -88705 -35591 136917
11233 88775 -59369 -131576 79808 70278 103460 -24553 -274727 120216 144039 -498578 286821
11221 -18714 -296658 10823 -138160 35207 -449859 -386990 154975 -124658 54264 194269
11211 194269 231527 12213 -114443 -28316 -169147 -329748 -174236 39375 -336774 41335
11200 33917 157282 -282275 4310 -236898 -127463 28831 -70306 -115820 -984 -205292 -10084
11188 216023 -48444 -127343 -61531 -52187 -150691 198884 -39939 -215513 -152248 104461 -153986
11176a48849p0405C44774a06237j97053j66281e2056r5833o53l86011i6562d7478
11164i884H1720d8792l93690A50572a46872B1414b07352e4004B3377J15417o0233
11153G8561L2841a06034l05498H8126J1501A8134a93432C4715a50166k28504J9602
11142c59068A86411d40270a72175A2708g5849C4862i8463k04750A15292J08491
11132B23783b41833D68846a64380K290G0907a39938j358b6458D8510c00809B41651
11120b2080A03516J14924a20773G5468K21622C1587a06401C9803a93898P5625
11110a18273n0948B40421a69186f2059j43165o036g6697A03238N0187b0604j15621
11099a36225m5780G4175h2083E8616J68721C2747J0871a51559A38653h2848A80179
$$ plain form
11176 -148849 -219254 344774 -106237 -303290 -469571 -52056 -147889 -148542 -534553 -96562 -47478
11164 -9884 81720 -48792 -442482 150572 -146872 21414 -207352 -54004 23377 138794 78561
11153 78561 111402 -106034 -411532 88126 99627 18134 -193432 34715 -150166 -378670 -359068
11142 -359068 186411 -440270 -172175 12708 -75849 34862 -98463 -303213 115292 223783
11132 223783 -241833 468846 -164380 -162090 70907 -139938 -141296 -26458 48510 -300809 241651
11120 -22080 103516 218440 -120773 75468 297090 31587 -106401 39803 -193898 -118273
11110 -118273 -169221 240421 -169186 -62059 -205224 -211260 -76697 103238 153425 -20604 -136225
11099 -136225 -182005 74175 -82083 58616 227337 32747 43618 -151559 138653 -82848 180179
11087b52022A05149J17875l9180a84992A23725E838K37060K0775H9594l2339J8386
11076G5641K8155k284K42913j36090J16873q2977a96726c5012B30757M6066b34890
11064D8947k3315J38120I724O75613C16676J20692A11992K64092F7677A827J54473
11053A56300J96385j11241L77418A12603L22887m0008A24999K83540A71272K26394
11043C97666A74242K67857k2397l0402J94259p6006A45584J81498R201j16096
11033B20187J87172j15980M86349k22722l6639Q3774k38149L25366m6530j79199
11023D63629K37746j04298j47643K38595C07099J01585Q2461K32935j07753j90166
11013D26161j08603n960L31704k43970J6163J53180J81561j02687o4422B62677
$$ plain form
11087 -252022 105149 223024 183844 -184992 123725 5838 242898 263673 89594 57255 75641
11076 75641 103796 101512 344425 208335 325208 242231 -196726 -35012 230757 276823 -234890
11064 48947 25632 163752 9724 685337 316676 437368 111992 376084 67677 1827 156300
11053 156300 352685 241444 618862 112603 435490 395482 124999 408539 171272 397666
11043 397666 174242 442099 419702 389300 583559 507553 145584 327082 336283 220187
11033 220187 407359 291379 777728 555006 518367 602141 363992 689358 642828 463629
11023 463629 701375 597077 449434 688029 307099 408684 491145 724080 616327 426161
11013 426161 317558 311598 643302 399332 415495 568675 750236 647549 583127 262677
11002D24541P533L03810l06001A44575K89080J7873j53002A46053L14418j14084
10992C46387j1727M3408j71149K97512P8211J33356C06338j168L98317j98151
10982E05336k12595q3672M90602k40947k27872m9436J40071L73813k62792O8416
10972E00924J27618k48444J32232K07873j35501K71948D11554L58739J98600k22881
10962G46012J52500p4497Q4444L99155J15650j45293R1181J90423l285M17627
10952A973917j99452k4112j0447k7385J09813l18536k0493k1117M5482l36804
10942A170866K82594K49543l37664j50494K29070j75309k31991L25534k63306
10933A098843n1291l99334O7155J17761j26319k72459A55251L11026C4781Q4312
$$ plain form
11002 424541 432074 735884 429883 144575 433655 451528 298526 146053 460471 346387
10992 346387 334660 378068 206919 504431 582642 715998 306338 305170 703487 505336
10982 505336 292741 209069 699671 458724 230852 181416 321487 695300 432508 500924
10972 500924 628542 380098 512330 720203 584702 856650 411554 770293 968893 746012
10962 746012 898512 824015 908459 1307614 1423264 1277971 1369152 1559575 1556290 1973917
10952 1973917 1774465 1750353 1739906 1712521 1822334 1503798 1483305 1462188 1507670 1170866
10942 1170866 1453460 1703003 1365339 1214845 1443915 1268606 1036615 1362149 1098843
10933 1098843 1047552 648218 715373 833134 706815 434356 155251 466277 34781 119093
10923A19093K32209b32292A97345l6280i9679C25188J8376D3858g6172A81458
10912A36803J49121j11436L389a88241F1141b4219j14336B94592i3603l6550o0174
10901a90327A52409a18805C19370a02425A24088C5478K44363E2960a68332d7535
10890A31767L4447c55997A36115b02095A53810c1279p7417p6694r52d9094B51846
10878a94976A15783a34640I7782f8419C315g460B05300K77327A11132a53299h885
10866b3155C70329A39986i5295k04239g2293e097B20202G2294e8754A18289n4147
10855F4142a44334k1914A07382b21596A5432N8077h6500C6735b81912o037E768
10843a35807A11540a30977j0336A24611J64186r9530p526d7476K1584h058A01300
$$ plain form
10923 119093 351302 -232292 197345 161065 -99679 325188 343564 43858 -76172 181458
10912 136803 285924 174488 177877 -188241 61141 -24219 -138555 294592 -93603 -130153 -190327
10901 -190327 152409 -118805 319370 -102425 124088 35478 279841 52960 -168332 -47535
10890 131767 166214 -355997 136115 -202095 153810 -31279 -108696 -185390 -186342 -49094 251846
10878 -194976 115783 -134640 97782 -68419 3315 -7460 205300 482627 111132 -153299 -8885
10866 -23155 370329 139986 -95295 -299534 -72293 -5097 220202 72294 -58754 118289 64142
10855 64142 -144334 -166248 107382 -221596 15432 73509 -86500 36735 -281912 -287949 5768
10843 -135807 111540 -130977 -141313 124611 288797 189267 181741 -47476 -25892 -8058 101300
10831b4717j70049B13959c40035g0761A18057m0462b7840H949J3154N9984b87885
10819A92893D5293q521d00487h6564A13330G136a0307A91591P9453a49459a3155
10807B4105c18296A60880C0675a28496H6055a82695j33252f5430B5555b456p5520
10796g7976A57365k5169c72902r4383g8138G0592a11380n6022N526M4609A4127
10784A90185n4123n0387b88467B25091H7188d7784k39263m5154f6683o6136A09811
10772a83186B4935a33441d8654j97930f1007B5684e0051k5260o0409A64895d0379
10760a01884k36529B9982Q1966A1581d21913e3116F140a0073G5438J9508M4616
10749A39562c30695A73005a34756j04299O8773A12155i6754D52434B17695a60623
$$ plain form
10831 -24717 -194766 213959 -340035 -70761 118057 77595 -27840 8949 22103 82087 -287885
10819 192893 45293 36772 -400487 -86564 113330 7136 -10307 191591 271044 -149459 -13155
10807 24105 -318296 160880 30675 -128496 86055 -182695 -315947 -65430 25555 -2456 -77976
10796 -77976 157365 132196 -372902 -467285 -78138 70592 -111380 -167402 -161876 -117267 14127
10784 190185 136062 85675 -288467 225091 87188 -47784 -287047 -332201 -66683 -132819 109811
10772 -183186 24935 -133441 -48654 -246584 -61007 25684 -50051 -75311 -135720 164895 -40379
10760 -101884 -338413 29982 111948 11581 -421913 -53116 6140 -10073 75438 94946 139562
10749 139562 -330695 173005 -134756 -239055 -170282 112155 -96754 452434 217695 -160623
10738c6466r4751C9182h5210j46637m0446B9702a70160d2146A25244i0868j24377
10727b15245J01442I0867a22581A90604O3291d0470j02127B47117d27447Q0974
10717c46473r5118J83964C35354b15978H0884C1154P6703c4329l83982I7902J26793
10706B24695b30037R0960M9004L8984C7838O8256P8628L8684a64234J3036A78289
10694a99442Q9458o6499A62713b9216B294c04507J7271R6834E1655c85293N1115
10683c34178J06797A57648c27921a53182P2402a2900B84984i7139J6399a2479
10672b49235A43234c7525q1738r2840f0731A03779b0168A16196B2625b66743d7685
10660a23740A59314c45131a9667j12974c8647k5590J5834k97437j31545a34897
$$ plain form
10738 -36466 -131217 39182 -85210 -231847 -272293 29702 -170160 -42146 125244 -90868 -215245
10727 -215245 -113803 90867 -122581 190604 253895 -40470 -142597 247117 -427447 -346473
10717 -346473 -441591 -257627 335354 -215978 80884 31154 107857 -34329 -418311 97902 224695
10706 224695 -230037 -139077 -90073 -51089 37838 106094 184722 223406 -164234 -151198 178289
10694 -199442 -109984 -176483 162713 -29216 2294 -304507 -287236 -190402 51655 -385293 -334178
10683 -334178 -227381 157648 -327921 -153182 -80780 -12900 284984 -97139 -80740 -12479
10672 -249235 143234 -37525 -119263 -212103 -60731 103779 -20168 116196 22625 -266743 -47685
10660 -123740 159314 -345131 -19667 -132641 -38647 -64237 -48403 -345840 -477385 -134897
10649c9657A34087j9431d31916A95164J84408j24237f9083j17889J2906A0225
10638d6063A11895a75129g1570B63167B0272L7237a84002i1121n1295B32859a89318
10626b23489d9514l18822d5943B7658a18491B93804b00029j11335c2846k61674
10616b94520J35040j52733D6282a1668D55812k22528r2172k9400d4100j70745
10606b14845k05304a34533f6018A23264b37949B48040a20127H0651l8380b05226
10595c89701J03928A24065M3203l7052a64369j96191D2786J65469a12658L1282
10585h1376H8643a98198L3746j8263n5966F9576a41573l60323a4494k5158H3286
10573c7015A30196b35292a4053m28246J35729E3338J54195c63521a27629r977
$$ plain form
10649 -39657 134087 114656 -431916 195164 379572 255335 -69083 -186972 -174066 10225
10638 -46063 111895 -175129 -71570 263167 20272 57509 -184002 -91121 -142416 232859 -189318
10626 -223489 -49514 -368336 -45943 27658 -118491 293804 -200029 -311364 -32846 -294520
10616 -294520 -159480 -312213 46282 -11668 455812 233284 141112 111712 -44100 -214845
10606 -214845 -420149 -134533 -66018 123264 -237949 248040 -120127 80651 42271 -205226
10595 -389701 -285773 124065 167268 130216 -164369 -360560 42786 208255 -112658 -81376
10585 -81376 88643 -198198 -164452 -182715 -238681 69576 -141573 -501896 -14494 -39652 83286
10573 -37015 130196 -235292 -14053 -442299 -306570 53338 207533 -363521 -127629 -137606
10563a37606c5041c61k51135A8755a67935l20806c7802k32097B2564J30131G6103
10551a6324A39209J16080F5477c7891B74338a45209P330A51015C5648c60379J02002
10540b58377B97551a08010B48953A10630k0207M2991a51125j9575B40791I7208
10529A61627R5996d0335B51210b99764Q5514A16917a16526F1636J94201b0817
10518a77774j51873d8731j5145k06772F6354K06569b52361c5939H7031a24011
10507h0026j25391C5014R0834b92872i7422j15201L1038O6325j20837A25904e2079
10495b40C7149a38412K7650j10252f6013j09248c3632B02315m5260b57078k0062
10484b77140B39913q0304c1522A6546c3122E5995i1374k9565j88312C8099a00271
$$ plain form
10563 -137606 -35041 -361 -251496 18755 -167935 -488741 -37802 -269899 22564 152695 76103
10551 -16324 139209 255289 65477 -37891 274338 -145209 -137879 151015 35648 -360379 -258377
10540 -258377 297551 -108010 248953 110630 90423 133414 -151125 -170700 240791 97208
10529 161627 257623 -40335 251210 -299764 -214250 116917 -116526 61636 255837 -20817
10518 -177774 -329647 -48731 -63876 -270648 66354 272923 -252361 -35939 87031 -124011
10507 -80026 -205417 35014 125848 -292872 -97422 -212623 -181585 -115260 -236097 125904 -52079
10495 -240 37149 -138412 -110762 -221014 -66013 -175261 -33632 202315 157055 -257078 -277140
10484 -277140 239913 159609 -31522 16546 -33122 55995 -91374 -120939 -309251 38099 -100271
10472a64924M9096A90906J11491a76697E4604J01136g0691A0598Q0478B8396J95474
10461B23870K62080J8503A51560J80017N3504j88948a4155A38493a2937A27736
10450c8779E9999d1045j2738E5889f643j13120A43785b15558A94795f1501j55288
10439b16789A59500a3776o0950l30997A57466c8094O849k03475f1368R544F9217
10427i7406j03072g641r3181B79102a07912j44027b6374n1240k54649A56504b17513
10415c09250a28271j61577g7048j71097A98899G3175O7704h7399r3225M7604i797
10403A18012a86654j0742A55465c04410a4525j18692A4195i8235j70247B02100
10392i0692B78561c15361B00550f331j23518A11877d3784C7301A2104c8274m538
$$ plain form
10472 -164924 -115828 190906 302397 -176697 54604 155740 -70691 10598 91076 28396 223870
10461 223870 485950 504453 151560 331577 385081 196133 -14155 138493 -12937 127736
10450 -38779 59999 -41045 -53783 55889 -6643 -119763 143785 -215558 194795 -61501 -216789
10439 -216789 159500 -13776 -74726 -405723 157466 -38094 -31245 -234720 -61368 -51824 69217
10427 -97406 -200478 -7641 -100822 279102 -107912 -251939 -26374 -77614 -332263 156504 -217513
10415 -309250 -128271 -289848 -77048 -248145 198899 73175 140879 -87399 -180624 -133020 -9797
10403 118012 -186654 -197396 155465 -304410 -14525 -133217 14195 -98235 -268482 202100
10392 -90692 278561 -315361 200550 -6331 -129849 111877 -43784 37301 12104 -38274 -42812
10381d2812j99029A21867K7024E6106f2624B54276c6137A75985J05352B731b31861
10369b28575R092F1253b2928A07039b15351A65120b6593E4862b26740d3297B86154
10357a60037B48883q4564A2834K91225B9403i2698C68221e9269A26267J95629
10347C21896I2335J90993B0512a93541C14853H7579K13073f214A52656F9049K60697
10336C29746A60026o6131K82905j87116M41880k34349K0674A51551K19305L2757
10326D03613E9022L02942j78249b83346B10914q6322J38351j6426J01202K6206
10316C73925j629A45462D7988N6247o550b2087o5175B9307O4377b38984B7077
10304G4864k9388J98174i7597m6505A11835P8675R3087a0666j9828B14149j04339
$$ plain form
10381 -42812 -241841 121867 148891 56106 -62624 254276 -36137 175985 281337 2731 -231861
10369 -228575 -219483 61253 -22928 107039 -215351 165120 -26593 54862 -226740 -43297 286154
10357 -160037 248883 164319 12834 304059 29403 -92698 368221 -59269 126267 321896
10347 321896 92335 283328 20512 -193541 314853 87579 300652 -6214 152656 69049 329746
10336 329746 160026 93895 376800 189684 631564 397215 417889 151551 370856 403613
10326 403613 59022 361964 183715 -283346 210914 124592 262943 246517 347719 373925
10316 373925 372296 145462 47988 104235 97685 -22087 -87262 29307 93684 -238984 27077
10304 74864 45476 243650 -97597 -144102 111835 190510 283597 -10666 -30494 214149 109810
10293A09810d7836k9669E8250J18420d3616B45858a59893M2030D1648a64491j3872
10282a78363j9837B89040E7064A0234J0582n390a44171A30315l5166d5637p6671
10271a22308A61076g5473k45378F629J83223a93582f903j12072N6003C39203a71919
10259b75057M4997C80014b17951A22704c52110R0809C954a39977N7331N043b7948
10247a58573l4389h0326k22281G4319J34310q7206e939A30261J99561M9192A71724
10235B30690P0210J0584n0000b91393D6316a9190c779j179j16894j8406A94955
10223f3402m6066A3700a39869p479B2013J18335m1219i3202a0651E0839b789l2032
10211c4821o0972B14921q6716a26729E2640J28400A5747Q1967m7046M9655b72081
$$ plain form
10293 109810 -47836 -77505 58250 176670 -43616 245858 -159893 -117863 41648 -164491 -178363
10282 -178363 -198200 289040 57064 10234 20816 15426 -144171 130315 95149 -45637 -122308
10271 -122308 161076 -75473 -320851 6629 189852 -193582 -6903 -118975 -62972 339203 -171919
10259 -275057 -230060 380014 -217951 122704 -352110 -261301 3954 -139977 -82646 -77603 -27948
10247 -158573 -192962 -80326 -302607 74319 208629 121423 -5939 130261 329822 379014 171724
10235 230690 300900 311484 261484 -291393 46316 -19190 -3779 -4958 -121852 -140258 194955
10223 -63402 -109468 13700 -139869 -147348 22013 140348 99129 -93202 -10651 50839 -2789 -34821
10211 -34821 -95793 214921 128205 -126729 52640 181040 15747 97714 50668 100323 -272081
10199C4390b14900E3739L9688b84041B35095F4183P6225k99b64790C8317a49023
10187b51036a8308j58120K1184b5503A41107a83974A42528b85471A49718B8696
10176C424J74610a63709d1487o309l5505K8080p8498m58851a04512I5504a93000
10164I5910f3893p0732b4559A04465K2830o27F3209f8987C20584A027d2519G6489
10151b3027l1486B78036b95505i4957A2046a60795K8305E1577e2747A02760m5238
10140E7522b16413i1306j98458A937b51732a03474p3427N7904A47668b93363C42990
10128a607l40678a34950k05317P2214k7480C45053E2939P403J88912g5401G690
10116c63757I8117g6552E4906a73106j85519G0311a84305A08529d0333B32804
$$ plain form
10199 34390 -214900 53739 93427 -284041 235095 64183 140408 140109 -264790 38317 -149023
10187 -251036 -18308 -176428 -155244 -25503 141107 -183974 142528 -285471 149718 28696
10176 3424 178034 -163709 -41487 -47796 -83301 -55221 -133719 -592570 -104512 95504 -193000
10164 95910 -63893 -134625 -24559 104465 127295 126668 63209 -68987 320584 1027 -42519 76489
10151 -23027 -54513 278036 -295505 -94957 12046 -160795 -132490 51577 -52747 102760 57522
10140 57522 -216413 -91306 -289764 1937 -251732 -103474 -176901 -118997 147668 -293363 342990
10128 -1607 -342285 -134950 -340267 -268053 -295533 345053 52939 60342 249254 -75401 7690
10116 -363757 98117 -76552 54906 -173106 -358625 70311 -184305 108529 -40333 232804
10105a76952k99550B44843C4758N1496c2743Q267k94791C8943a36729B01809A5875
10093a69152A07968N2858a5409n5622J2074f181j23231b4334A88700b35746F8118
10081B7858d2974k07233e4539a9990r4186l59676Q97a17822n353k1468E3031a42161
10068A8746a19789e5697F6167L54759A52039P9085b39181o4106A17888h4023o2275
10057a46298d3590l51850J37150A09551M1886A5978c39357E9392i7651o6160j26178
10046b89989B2875a58120k62159J14371f0732j59043R7484e959m5440F4300a55410
10034G1117P4851a41967A48412K0652b0228j28818d8286j20751B57786a02110
10023a39518A7743e0744A28728B177c07184a25165j11156L5470e078I160J51820
$$ plain form
10105 -176952 -476502 244843 34758 86254 -32743 -24476 -319267 38943 -136729 201809 15875
10093 -169152 107968 160826 -15409 -71031 -58957 -6181 -129412 -24334 188700 -235746 68118
10081 27858 -42974 -250207 -54539 -19990 -114176 -473852 -472955 -117822 -123175 -144643 53031 -142161
10068 18746 -119789 -55697 66167 420926 152039 231124 -239181 -303287 117888 -84023 -146298
10057 -146298 -43590 -395440 -258290 109551 151437 15978 -339357 59392 -97651 -163811 -289989
10046 -289989 22875 -158120 -420279 -305908 -60732 -219775 -122291 -5959 -51399 64300 -155410
10034 71117 145968 -141967 148412 169064 -20228 -149046 -48286 -169037 257786 -102110
10023 -139518 17743 -50744 128728 2177 -307184 -125165 -236321 -200851 -5078 9160 160980
10012A60980n1625a38542m2436e1424B99135G461e7377m2038B60930a96694h2992
10000A00697a24279j48560A1967C998a09333k11381A26621m4981k8797b2569A6014
9988a56963j29500N5088A09498f4147j71313J11809q593j61747A36943E2692K70685
9977C23377g300p5615A3917P1902a29696I0882e7275j58782A24196i1788j62884
9966b54672F3000i5380A05547b59913o9068P0508M8804a03309g6E4226a20524
9954B13854H6159l3688K14053a81502f5181B66616q6571H8078C0801A3823g6210
9942a22305j2815O190L2914n7012J8559l60332J06866J03408f154k06627I9154
9930b5180F9506d29157a72267B28335H9726A4789a59156E3649a09414n272K1039
$$ plain form
10012 160980 109355 -138542 -180978 -51424 299135 7461 -57377 -99415 260930 -196694 -82992
10000 100697 -124279 -272839 11967 3998 -109333 -320714 126621 81640 52843 -22569 16014
9988 -156963 -286463 -231375 109498 -64147 -235460 -123651 -132244 -293991 136943 52692 323377
9977 323377 -7300 -82915 13917 85819 -129696 90882 -57275 -216057 124196 -91788 -254672
9966 -254672 63000 -95380 105547 -259913 -328981 -258473 -209669 -103309 -76 54226 -120524
9954 213854 86159 52471 266524 -181502 -65181 266616 180045 88078 30801 13823 -76210
9942 -122305 -135120 -128930 -96016 -153028 -134469 -494801 -387935 -284527 -6154 -212781 99154
9930 -25180 69506 -429157 -172267 228335 89726 14789 -159156 53649 -109414 -114686 -93647
9919i3647k23912A60819p9638J81390g8407m04256i873B37961m7063R6139A0809
9907a57796K183k49288B37190a41423f0697F819M6753a15815a1250l3724C81779
9895B38368b9332j37328k9757k00421G8136R6567a32891k87527a01771q5987j452
9884a89210f6633P233j74203E385J13978h9065A159a56932j16687Q4637j01990
9873b90972f1176k21795I5329a35433C7496c48114i8610A57775J46979c52412
9862d917j17582m02810e4598j18056k065H4760j5341J53042a03111k78262J13815
9851b67558F3277a71905L3755a1031j95096B50145f471l7127n5462A05676d28362
9839B0159J33097i0333G5635K3352a44281M219O8464h128A46134k6409C0942j5319
$$ plain form
9919 -93647 -317559 160819 81181 262571 -78407 -482663 -9873 237961 190898 287037 10809
9907 -157796 -155613 -404901 237190 -141423 -60697 6819 53572 -115815 -11250 -44974 381779
9895 238368 -29332 -166660 -196417 -396838 78136 174703 -132891 -420418 -101771 -187758 -189210
9884 -189210 -66633 -59400 -233603 5385 119363 -89065 1159 -156932 -273619 -188982 -290972
9873 -290972 -61176 -282971 95329 -135433 37496 -348114 -98610 157775 304754 -352412
9862 -4917 -122499 -525309 -54598 -172654 -174719 84760 69419 222461 -103111 -381373 -267558
9851 -267558 63277 -171905 -138150 -11031 -206127 250145 -6471 -43598 -99060 105676 -428362
9839 20159 153256 -90333 75635 98987 -144281 -140062 -71598 -8128 146134 119725 30942 15623
9827A5623J14380a2471n0716k52010A48396f812A68664a64300b0446j5533J4636
9816b1343A98576b21221G1561M28858b16463j59270D31121a99001k388j45283
9806c46672a60209A61386M9908F3169Q6790A9659b85935A04653b1300I0723C5808
9794b08802j63695A89855a93184k05217R5991K3560A48661M0245H6312a48635
9783c70270h2446D1764a78479M1752k6036A91582a97656B8651g4952j95536K3966
9772b46522j4974P8819M9605k5862m743K4950A59501G8951N9193c28489E1708
9760c87183a0381m4448m38072A65012a41160c5193C92488A4585J97914B8602E395
9748A93968B5809a31272j13627c8928j64699A85735b42945g8946b1882A52709
$$ plain form
9827 15623 130003 -12471 -63187 -315197 148396 -6812 168664 -164300 -20446 -35979 -21343
9816 -21343 198576 -221221 71561 500419 -216463 -375733 431121 -199001 -201389 -346672
9806 -346672 -160209 161386 211294 63169 149959 19659 -285935 104653 -21300 90723 35808
9794 -208802 -372497 189855 -193184 -398401 -302410 -278850 148661 188906 86312 -148635
9783 -370270 -82446 41764 -178479 -136727 -162763 191582 -197656 28651 -74952 -270488 -246522
9772 -246522 -261496 -182677 -133072 -158934 -163677 -138727 159501 78951 138144 -328489 51708
9760 -387183 -10381 -54829 -492901 165012 -141160 -35193 392488 14585 212499 28602 5395
9748 193968 25809 -131272 -244899 -38928 -203627 185735 -242945 -78946 -21882 152709
9737b08318I339b18304B95235j10704A487c75819C034a8607o0599q8622o6348
9726b34176O7251f3714j08204C91652f3851l2405J8462p5893M3510F5492f7341
9714h0975k25631A96754I3089a46533a5426k12052c4773k55385f6296A62115b67468
9702I2876i9487G6835g6420q2889n040L3089A31453a63470N4752o5801G1403h4398
9689a58198d9163j17604k96541a97324A6702J24246f563H9227a41672E0443k473
9678D7970J01804d28554Q1998D7184a85005k30067g7103L0885l5504p0751j22347
9667b74820C8224c71931A4808Q0853a30458A52515b52795D7906b49658f5280c2573
9655b2613k7096G3458b56334A03592b52042q8675a15412A62365c87238F2854c51405
$$ plain form
9737 -208318 9339 -218304 295235 184531 1487 -375819 3034 -18607 -79206 -167828 -234176
9726 -234176 -166925 -63714 -171918 391652 -63851 -96256 -77794 -153687 -110177 65492 -67341
9714 -80975 -306606 196754 93089 -146533 -15426 -227478 -34773 -290158 -66296 162115 -267468
9702 92876 -99487 76835 -76420 -159309 -164349 -131260 131453 -163470 -108718 -174519 71403 -84398
9689 -158198 -49163 -166767 -463308 -197324 16702 140948 -6563 89227 -141672 50443 47970
9678 47970 149774 -428554 -346556 47184 -185005 -415072 -77103 -46218 -81722 -152473 -274820
9667 -274820 38224 -371931 14808 95661 -130458 152515 -252795 47906 -249658 -65280 -32573
9655 -22613 -49709 73458 -256334 103592 -252042 -340717 -115412 162365 -387238 62854 -351405
9643a30214B59491e07318b44646f1998A28190J69556g5874l21065J55038n6603
9633b98504a117l08634A87073b44242J12913j60667C5851J8824a73892a6421B29688
9621c7510F1871e9153B4852J49002D7306e7445G3871c78962a6257C3441a54029
9609a1074k56932l0767J37101j12761R3780h5830A25281e5379r6292I8614A4637
9597a00806j80619h3289L3949A3636K26730A05296e9285j22204g4983b6665D5086
9585a20749A6568a86316j6146j20844b9616n6154m0672l33139F6910l99A8931
9573b20639m0195g3185c5726A12856a67754j7367J9399N8134I837b26235p1063
9562b97298N3049a6457k33497R8724f7578k6491j49529P5453B4093O9450L00963
$$ plain form
9643 -130214 259491 -507318 -244646 -61998 128190 297746 -75874 -396939 -241901 -298504
9633 -298504 -1117 -309751 187073 -244242 -131329 -291996 35851 54675 -173892 -16421 229688
9621 -37510 61871 -59153 24852 173854 47306 -57445 73871 -378962 -16257 33441 -154029
9609 -11074 -268006 -298773 -161672 -274433 -180653 -85830 125281 -55379 -151671 98614 14637
9597 -100806 -281425 -83289 -49340 13636 240366 105296 -59285 -181489 -74983 -26665 45086
9585 -120749 16568 -186316 -202462 -323306 -29616 -85770 -126442 -459581 66910 66511 18931
9573 -220639 -260834 -73185 -35726 112856 -167754 -185121 -165722 -107588 9837 -226235 -297298
9562 -297298 -244249 -16457 -249954 -151230 -67578 -94069 -243598 -168145 24093 93543 394506
9551C94506a29045n442F5689a52812f4533j734k4227k2504B83256L1114g1043
9539d95673i4637A44270b14376A07344b6916q2123A9736c7453r9539c2590A700
9527c3278l13603H892J15518G266J9639a827A16238c1166G637G58J04365O5178
9515A70301c32749J37126D06271a92966b7852A04476a50396m0132j11874B09543
9504b8864j81654M4193G8805d91312I6836N6757a52263a1415B9147N6315c37113
9492A24249B1149a14264n9669L558A46704d27383a10378B82109c24422i6550M0580
9481e5970G4031f41m7552k77338A40904g3060m6634j13059B94360o0458b66199
9469D1482J07390b54844p4755h3329n7052M7915B59929a65176j92894a0282j62693
$$ plain form
9551 394506 -129045 -134487 65689 -152812 -64533 -66267 -90494 -112998 283256 314370 -71043
9539 -495673 -94637 144270 -214376 107344 -26916 -109039 19736 -37453 -136992 -32590 1700
9527 -33278 -346881 8892 124410 7266 26905 -1827 116238 -31166 7637 758 105123 170301
9515 170301 -332749 -195623 406271 -192966 -27852 104476 -150396 -190528 -302402 209543
9504 -28864 -210518 -166325 78805 -491312 96836 153593 -152263 -11415 29147 85462 -337113
9492 124249 21149 -114264 -173933 -170375 146704 -427383 -110378 282109 -324422 -96550 -55970
9481 -55970 74031 -641 -48193 -325531 140904 -73060 -119694 -232753 294360 233902 -266199
9469 41482 148872 -254844 -329599 -83329 -140381 -92466 259929 -165176 -358070 -10282 -172975
9458a72975j0566k26212i7391K0920A1001J16848a09364q2418A19207d59908A42540
9446D2293a68466E2371J46051a88137A95753a6864A66328h5923j928c6213o0801
9435i7014c374k61334a1973k35716O4520A06921J701g6342A85569a26518f0933
9423b18589R2012j65426j4699J39563c316k28940B35501b08504A81765c8748k02163
9412b40911m8480f5637D2819f2304j279j44214C5262a43919k92343J16377G1199
9400g9064K8232I2195c33765A70920b34958H4411a03914d1163K326n6381B08315
9388a30778R100a3563j31847m4395B30424A1936c0552j29165A42048h9830C0026
9376A65414a40291E1187a17873d1992j41643B50806b8457A80871a50855L9817
$$ plain form
9458 -172975 -183541 -409753 -97391 -76471 11001 127849 -109364 -191782 119207 -459908 142540
9446 42293 -168466 52371 198422 -188137 195753 -16864 166328 -85923 -87851 -36213 -97014
9435 -97014 -3374 -264708 -11973 -247689 -183169 106921 108622 -76342 185569 -126518 -60933
9423 -218589 -126577 -292003 -306702 -167139 -3316 -232256 235501 -208504 181765 -38748 -240911
9412 -240911 -289391 -65637 42819 -62304 -63583 -207797 35262 -143919 -436262 -319885 71199
9400 -79064 -50832 92195 -333765 170920 -234958 84411 -103914 -41163 -38837 -95218 208315
9388 -130778 -121678 -13563 -145410 -189805 230424 11936 -30552 -159717 142048 -89830 30026
9376 165414 -140291 51187 -117873 -41992 -183635 250806 -28457 180871 -150855 -111038
9366a11038k34315J52952j12367Q3688A58692b334l3129j12213M6271D5428b00671
9354a44485e8920l58015l8396A84305b7774A85307J28585e5920j42331C91484
9343B60425q7061a7406C9346b96333N9531f4815k5180j16758A59685a65022K3955
9332a41067m2650g7316q0586k96425a59149B01080b09935B45120C4238J49946
9322A84184b63894c0066F5373a76760g392j7588k19996G4541K105a89584n266
9311a94850R0864l4483a788m4408k21968A48889b00093j9813n17M1633J287H3353
9298f4289H7621J62512a15524M7696D9234a49070h521j62013F6847c20683g0221
9286a78812d8582J6673A18600c188j4975j04928B09067h7997C02642A45092Q2436
$$ plain form
9366 -111038 -345353 -192401 -304768 -221080 158692 -2334 -35463 -147676 -101405 45428 -200671
9354 -144485 -58920 -416935 -455331 184305 -27774 185307 313892 -55920 -198251 391484
9343 260425 173364 -17406 39346 -296333 -236802 -64815 -89995 -206753 159685 -165022 -141067
9332 -141067 -183717 -77316 -157902 -454327 -159149 201080 -209935 245120 34238 184184
9322 184184 -263894 -30066 65373 -176760 -7392 -24980 -244976 74541 76646 -189584 -194850
9311 -194850 -103986 -138469 -1788 -46196 -268164 148889 -200093 -219906 -220423 -178790 -177503 83353
9298 -64289 87621 250133 -115524 -67828 49234 -149070 -8521 -170534 66847 -320683 -70221
9286 -178812 -48582 -31909 118600 -3188 -18163 -123091 209067 -87997 302642 145092 227528
9275B27528l3784F5845a75882O448I6505C5635P4820b06630b5327j82365K5683
9264a82009L1601F1269m186N1265P209n3170h4844k88684j058B39705b0453j50006
9252a70459I5941O8265a44477k0070O4798k6182F1453a55191C45983a02871J5781
9241h7090k7749j18054J02514r7108K6325E3186j0215d4069r8641b7011m02349
9230d29360I7460a10205H888b09961R5661j64064P0154Q2138f956I0224a73306
9218B06070b36440I7186D7243b49810i878C7799B156a63563r6281C0516b47397
9206c28947I8655c675D162O0773A5980a26310D0639c67855n5524a65799B8718
9194B90559A7073e9706j60709B09303F1997a37490B9545Q7796g9710H7367d8901
$$ plain form
9275 227528 193744 65845 -175882 -169434 96505 35635 110455 -206630 -25327 -207692 -182009
9264 -182009 -150408 61269 57083 108348 115557 62387 -84844 -373528 -374586 239705 -20453 -170459
9252 -170459 95941 164206 -144477 -164547 -99749 -125931 61453 -155191 345983 -102871 -87090
9241 -87090 -114839 -232893 -130379 -227487 -201162 53186 42971 -44069 -142710 -27011 -429360
9230 -429360 97460 -110205 8888 -209961 -114300 -278364 -208210 -126072 -6956 90224 -173306
9218 206070 -236440 97186 47243 -249810 -9878 37799 2156 -163563 -259844 30516 -247397
9206 -328947 98655 -3675 4162 64935 15980 -126310 40639 -367855 -423379 -165799 28718
9194 290559 17073 -59706 -220415 209303 61997 -137490 29545 117341 -79710 87367 -48901
9182d7898H8705J25398b96259g2453b1573B33637g6947D0858b5965k31652d3578
9170A54254J66932c45502h3659J4475j12326D5944d52198J03605A1844J36695
9160A48539A1488a29174b2123k0646m1104p7535l29582J22842G9005K49798b37034
9148b36760c749G3169K8577a68304c7896l03937O9229B64789A25060h1081q216
9137h9297K4970j03690J5749j4797A11756b05442C842a85197B6795a61266D1671
9125C8640K69147C5990h123n3326A49950J54578a89355j5927B095K4669c24521
9113B83922e9283j12940q7400J3692A72630B2027L15643a07272M1361k08400a22117
9101G370K2049a37884A87778j285c05453a43666k75025I7212J15123D8330J77435
$$ plain form
9182 -47898 88705 214103 -296259 -72453 -21573 233637 -76947 40858 -25965 -257617 -43578
9170 154254 321186 -345502 -83659 -69184 -181510 45944 -452198 -348593 11844 148539
9160 148539 11488 -129174 -22123 -42769 -83873 -161408 -490990 -368148 79005 328803 -237034
9148 -236760 -3749 73169 101746 -168304 -37896 -341833 -272604 264789 125060 -81081 -89297
9137 -89297 -64327 -168017 -152268 -167065 111756 -205442 3842 -185197 26795 -161266 41671
9125 38640 307787 35990 -8123 -61449 149950 304528 -189355 -205282 2095 26764 -324521
9113 283922 -59283 -172223 -259623 -245931 172630 22027 337670 -107272 -65911 -274311 -122117
9101 7370 29419 -137884 187778 186493 -305453 -143666 -418691 97212 212335 48330 225765
9090B25765a32725G3466b38038J10680d5368C14648F4253a42591k31412d9433
9079b63420h382j28462M3304G0529C0494m913a54155A22782c26335H0498a83353
9067b44706B64675n5535d83884a66973j03926i5264q8770a5392A04778b1196P32
9056b0464j79473M3805A76541a48849D5600J69987h6655k63262C1522M5776b22817
9044C4556P6802e1211n90635C16917e0634k02292H211b9536k28766L0103K1407
9033b06792D3763f2986I7509b53180L280A14044g0935j54030B52239f9945l06291
9022c76236A04676b33971N833R3050D9848b13256b1866A54112a23254A05028a091
9010d1211n9608d3761k2580j38522b6152A46472c2810B49814h2854j36543J03646
$$ plain form
9090 225765 -132725 73466 -238038 -127358 -45368 314648 64253 -142591 -374003 -49433
9079 -263420 -8382 -136844 -93540 70529 30494 25581 -154155 122782 -326335 80498 -183353
9067 -244706 264675 209140 -483884 -166973 -270899 -95264 -184034 -15392 104778 -21196 -20464
9056 -20464 -199937 -156132 176541 -148849 45600 215587 -86655 -349917 31522 77298 -222817
9044 34556 111358 -51211 -641846 316917 -50634 -252926 8211 -29536 -258302 -228199 -206792
9033 -206792 43763 -62986 97509 -253180 -249900 114044 -70935 -224965 252239 -69945 -376236
9022 -376236 104676 -233971 -228138 -135088 49848 -213256 -21866 154112 -123254 105028 -1091
9010 -41211 -100819 -43761 -66341 -204863 -26152 146472 -32810 249814 -82854 -219397 -115751
8999a15751h004m41821B74380d92446g4880D13401g8053o8274c095I5653N4095
8988A49748a15387a8473o2555m6726A27170d7282j09580C770a61878j43649G2777
8976C85269G0398J970c53120b6735j34902N2247H2261J33299D7631J10661m0699
8965A17593c03446a07067A37376B0786a28955l1330A33852K2539J1450a2284j11953
8954a24237k59849A83506k4485c088k41154j95211A9741c2263j82821L2590J4839
8943a67655g9249F2233b09317p8067j13053A37394a50715K7094p8487l1355r3496
8932c26959P8579O4182j97167m5058A27685f3185j41036H5663K4499c0342n6644
8921h6986A43044o6005f3035k69763A03906C7618Q7297R0824R7444c14651G0577
$$ plain form
8999 -115751 -8004 -449825 274380 -492446 -74880 413401 -78053 -146327 -3095 95653 149748
8988 149748 -115387 -18473 -81028 -127754 127170 -47282 -156862 3770 -161878 -305527 72777
8976 385269 70398 72368 -353120 -26735 -161637 -109390 82261 215560 47631 158292 117593
8965 117593 -303446 -107067 137376 20786 -128955 -160285 133852 156391 167841 -12284 -124237
8954 -124237 -384086 183506 159021 -3088 -244242 -439453 19741 -32263 -215084 -182494 -167655
8943 -167655 -79249 62233 -209317 -287384 -400437 137394 -150715 -123621 -202108 -233463 -326959
8932 -326959 -248380 -184198 -381365 -426423 127685 -63185 -204221 85663 110162 -30342 -86986
8921 -86986 143044 77039 -63035 -332798 103906 37618 124915 215739 313183 -314651 70577
8909a92808H6591N38111J11300m8037M43882J000185K012026L92065A897274F28662
8898G97338A48430m915P2995G9678a9344k56407A19156e764A44152J41431c36060
8886a21451L3950B71959j16550q455a8342E3148e7784m5252C08847a39076F9342
8874A18359a98463L7444M6231L8544m849G052i9956J5229k39785n4237A53626
8862d8342k79383D8240M267h3715o0202A35463a4692o7360D9766a42415F1325
8850C3942a06710j43251A5044J21073a4087j95716i3657l50628J12831i392A98371
$$ plain form
8909 -192808 86591 624702 736002 687965 1131847 2132032 4144058 4536123 1897274 628662
8898 797338 148430 143515 216510 79678 -19344 -275751 119156 -5764 144152 285583 -336060
8886 -121451 -87501 271959 155409 146954 -18342 53148 -57784 -103036 308847 -139076 69342
8874 118359 -198463 -161019 -114788 -76244 -81093 7052 -99956 -84727 -324512 -378749 153626
8862 -48342 -327725 48240 52507 -83715 -143917 135463 -14692 -82052 49766 -142415 61325
8850 33942 -106710 -249961 15044 136117 -14087 -209803 -93657 -444285 -331454 -9392 198371
$$ [...]
##END NTUPLES=NMR SPECTRUM
##END=
