
##TITLE=AC1199_HACAH12052_7165849_Av4UxNkm5f
##JCAMPDX= 6.0         $$ Bruker NMR JCAMP-DX V2.0
##DATA TYPE= NMR SPECTRUM
##DATA CLASS= NTUPLES
##ORIGIN= BRUKER
##OWNER= Administrator
$$ 1.72 TOPSPIN		Version 2.1
$$ 2012-12-01 23:04:11.904 -0500  Administrator@X
$$ Compression mode = diff/dup
##.OBSERVE FREQUENCY= 400.02188249412
##.OBSERVE NUCLEUS= ^1H
##.ACQUISITION MODE= SIMULTANEOUS (DQD)
##.ACQUISITION SCHEME= undefined
##.AVERAGES= 8
##.DIGITISER RES= 22
##SPECTROMETER/DATA SYSTEM= spect
##.PULSE SEQUENCE= zg30
##.SOLVENT NAME= COFFEE_meoh
##.SHIFT REFERENCE= INTERNAL, COFFEE_meoh, 1, 14.98509
##AUDIT TRAIL= $$ (NUMBER, WHEN, WHO, WHERE, PROCESS, VERSION, WHAT)
$$ ##TITLE= Audit trail, TOPSPIN		Version 2.1
$$ ##JCAMPDX= 5.01
$$ ##ORIGIN= Bruker BioSpin GmbH
$$ ##OWNER= Administrator
$$ $$ E:\/data/COFFEE/nmr/AC1199_HACAH12052_7165849_Av4UxNkm5f/10/pdata/1/auditp.txt
$$ ##AUDIT TRAIL=  $$ (NUMBER, WHEN, WHO, WHERE, PROCESS, VERSION, WHAT)
(   1,<2012-12-01 23:04:03.513 -0500>,<Administrator>,<X>,<go>,<TOPSPIN 2.1>,
      <created by zg
	started at 2012-12-01 23:02:56.982 -0500,
	POWCHK enabled, PULCHK disabled,
       configuration hash MD5:
       86 BA 57 50 F2 9D 5C 9B 26 00 A9 28 5F 66 2E 89
       data hash MD5: 64K
       CA 54 A3 DA 41 E0 7D 8E E4 EA C6 F4 0C 3E 55 ED>)
(   2,<2012-12-01 23:04:06.685 -0500>,<Administrator>,<X>,<proc1d>,<TOPSPIN 2.1>,
      <Start of raw data processing
       efp LB = 0 FT_mod = 6 PKNL = 1 PHC0 = 0 PHC1 = 0 SI = 32K 
       data hash MD5: 32K
       F4 AC 02 8E 54 2B 70 8B 9C 03 3F 95 1C F7 A7 76>)
(   3,<2012-12-01 23:04:07.170 -0500>,<Administrator>,<X>,<proc1d>,<TOPSPIN 2.1>,
      <pk PHC0 = 97.86072 PHC1 = 0 
       data hash MD5: 32K
       12 F7 7C 61 5C 68 1D 55 05 88 99 FB 24 1D 34 8D>)
(   4,<2012-12-01 23:04:07.404 -0500>,<Administrator>,<X>,<proc1d>,<TOPSPIN 2.1>,
      <abs ABSG = 1 
       data hash MD5: 32K
       81 23 22 DE 48 74 27 73 E1 5C 58 CC F5 38 00 A5>)
(   5,<2012-12-01 23:04:07.560 -0500>,<Administrator>,<X>,<proc1d>,<TOPSPIN 2.1>,
      <abs ABSG = 2 
       data hash MD5: 32K
       03 6A 27 7F 5A 4F 45 94 AF 45 C0 B2 C9 DA DE B9>)
(   6,<2012-12-01 23:04:07.701 -0500>,<Administrator>,<X>,<proc1d>,<TOPSPIN 2.1>,
      <abs ABSG = 3 
       data hash MD5: 32K
       3A 4B 2C 49 E1 EA 6C 52 DD DF F6 A4 A5 8D D4 03>)
(   7,<2012-12-01 23:04:07.841 -0500>,<Administrator>,<X>,<proc1d>,<TOPSPIN 2.1>,
      <abs ABSG = 4 
       data hash MD5: 32K
       20 B8 4A D7 D7 4A B3 B9 E3 C3 5B AB 6A 34 8A 29>)
(   8,<2012-12-01 23:04:08.029 -0500>,<Administrator>,<X>,<proc1d>,<TOPSPIN 2.1>,
      <abs ABSG = 5 
       data hash MD5: 32K
       DD C7 6A DD 08 C5 84 93 77 B7 AF D2 14 80 D4 B8>)
$$ ##END=
$$ 
$$ $$ hash MD5
$$ $$ 66 7F F5 AB BE 22 39 E9 4B 20 11 6C 4D 48 03 02
##$RELAX= 
##$RELAX= 
##$RELAX= 
##$RELAX= 
##$RELAX= 
##$RELAX= 
##$RELAX= 
$$ Bruker specific parameters
$$ --------------------------
##$DU= <E:\>
##$EXPNO= 10
##$NAME= <AC1199_HACAH12052_7165849_Av4UxNkm5f>
$$ [...]
##$TP= (0..7)
150 150 150 150 150 150 150 150
##$TP07= 0
##$TPNAME0= <>
##$TPNAME1= <>
##$TPNAME2= <>
##$TPNAME3= <>
##$TPNAME4= <>
##$TPNAME5= <>
##$TPNAME6= <>
##$TPNAME7= <>
##$TPOAL= (0..7)
0.5 0.5 0.5 0.5 0.5 0.5 0.5 0.5
##$TPOFFS= (0..7)
0 0 0 0 0 0 0 0
##$TUNHIN= 0
##$TUNHOUT= 0
##$TUNXOUT= 0
##$USERA1= <user>
##$USERA2= <user>
##$USERA3= <user>
##$USERA4= <user>
##$USERA5= <user>
##$V9= 5
##$VALIST= <valist>
##$VCLIST= <CCCCCCCCCCCCCCC>
##$VD= 0
##$VDLIST= <DDDDDDDDDDDDDDD>
##$VPLIST= <PPPPPPPPPPPPPPP>
##$VTLIST= <TTTTTTTTTTTTTTT>
##$WBST= 1024
##$WBSW= 4
##$XGAIN= (0..3)
0 0 0 0
##$XL= 0
##$YL= 0
##$YMAX_a= 616614
##$YMIN_a= -525612
##$ZGOPTNS= <>
##$ZL1= 120
##$ZL2= 120
##$ZL3= 120
##$ZL4= 120
##$ABSF1= 14.98509
##$ABSF2= -5.573092
##$ABSG= 5
##$ABSL= 3
##$ALPHA= 0
##$AQORDER= 0
##$ASSFAC= 0
##$ASSFACI= 0
##$ASSFACX= 0
##$ASSWID= 0
##$AUNMP= <proc_prof1d_extract_pilot.lims>
##$AXLEFT= 0
##$AXNAME= <>
##$AXNUC= <1H>
##$AXRIGHT= 0
##$AXTYPE= 0
##$AXUNIT= <>
##$AZFE= 0.1
##$AZFW= 0.1
##$BCFW= 0
##$BC_mod= 0
##$BYTORDP= 0
##$COROFFS= 0
##$CY= 15
##$DATMOD= 1
##$DC= 0
##$DFILT= <>
##$DTYPP= 0
##$F1P= 0
##$F2P= 0
##$FCOR= 0.5
##$FTSIZE= 32768
##$FT_mod= 6
##$GAMMA= 0
##$GB= 0
##$INTBC= 1
##$INTSCL= 1
##$ISEN= 128
##$LB= 0
##$LEV0= 0
##$LPBIN= 0
##$MAXI= 10000
##$MC2= 0
##$MEAN= 0
##$ME_mod= 0
##$MI= 0
##$NCOEF= 0
##$NC_proc= -8
##$NLEV= 6
##$NOISF1= 0
##$NOISF2= 0
##$NSP= 0
##$NTH_PI= 0
##$NZP= 0
##$OFFSET= 14.98509
##$PC= 1
##$PHC0= 97.86072
##$PHC1= 0
##$PH_mod= 1
##$PKNL= yes
##$PPARMOD= 0
##$PPDIAG= 0
##$PPIPTYP= 0
##$PPMPNUM= 2147483647
##$PPRESOL= 1
##$PSCAL= 4
##$PSIGN= 0
##$PYNMP= <proc.py>
##$REVERSE= no
##$SF= 400.02
##$SI= 32768
##$SIGF1= 0
##$SIGF2= 0
##$SINO= 400
##$SIOLD= 32768
##$SPECTYP= <>
##$SREGLST= <1H.CDCl3>
##$SSB= 0
##$STSI= 32768
##$STSR= 0
##$SW_p= 8223.68421052631
##$SYMM= 0
##$S_DEV= 0
##$TDeff= 65536
##$TDoff= 0
##$TI= <>
##$TILT= no
##$TM1= 0
##$TM2= 0
##$TOPLEV= 0
##$USERP1= <user>
##$USERP2= <user>
##$USERP3= <user>
##$USERP4= <user>
##$USERP5= <user>
##$WDW= 1
##$XDIM= 32768
##$YMAX_p= 465255868
##$YMIN_p= -732365
##$CURPLOT= <Network HP LaserJet P1505>
##$CURPRIN= <$Network HP LaserJet P1505>
##$DFORMAT= <normdp>
##$LAYOUT= <+/1D_H.xwp>
##$LFORMAT= <normlp>
##$PFORMAT= <normpl>
##$SURQMSG= 1
$$ End of Bruker specific parameters
$$ ---------------------------------
##NTUPLES= NMR SPECTRUM
##VAR_NAME=  FREQUENCY,     SPECTRUM/REAL,   SPECTRUM/IMAG
##SYMBOL=    X,             R,               I
##VAR_TYPE=  INDEPENDENT,   DEPENDENT,       DEPENDENT
##VAR_FORM=  AFFN,          ASDF,            ASDF
##VAR_DIM=   32768,         32768,           32768
##UNITS=     HZ,            ARBITRARY UNITS, ARBITRARY UNITS
##FACTOR=    0.250966925370066, 1,           1
##FIRST=     8223.43324360094, -161032,      45633
##LAST=      0,             -189079,         -116150
##MIN=       0,             -732365,         0
##MAX=       8223.43324360094, 465255868,    0
$$ Real data points
##PAGE= N=1
##DATA TABLE= (X++(R..R)), XYDATA
$$ [...]
$$ plain form
19551 -58351 77860 181520 111921 -214536 8458 336427 2813 224066 -142387 -28859 212123
19539 -32016 -18638 -143486 -90807 -184811 -282358 -102960 41263 -3583 -256831 -112529 38251
19527 -181176 236535 89787 -55591 -88957 -14072 183145 168097 79124 -229910 -250232 76918
19515 -134594 248503 115301 43333 308693 66163 -165940 -42505 -103653 -60000 -319917
19505 -319917 -212081 134359 -33800 -457978 -10854 9359 89155 -123598 102706 341652
19495 341652 -82747 212584 34537 22436 -63113 33719 -141549 -22250 214836 -465536 112360
19483 -253199 -236453 85081 107500 98868 155637 341933 -128683 -145583 -54775 -241231 -223571
19472 -223571 -73327 -90765 -103601 226553 -162356 160975 -332459 46753 121331 -170116
$$ packed form
19551e8351G7860J03660o9599b14536H458L27969B813K21253a42387b8859B12123
19539c2016J3378j24848N2679r4004r7547a02960D1263c583k53248a12529C8251
19527a81176B36535H9787e5591l3366a4072A83145j5048G9124b29910k0322G6918
19515a34594B48503A15301D3333K65360F6163a65940d2505o1148M3653k59917
19505c19917J07836A34359c3800m24178a0854I359P9796a23598A02706K38946
19495C41652h2747B12584C4537j2101f3113C3719a41549b2250B14836d65536A12360
19483b53199J6746H5081K2419q632N6769J86296a28683j6900e4775j86456J7660
19472b23571g3327j7438j2836B26553a62356A60975c32459D6753P4578a70116
$$ plain form
19461 -161543 281250 -71328 152507 -292929 51760 -47447 293055 -94483 137292 -218348
19450 -148400 168343 137795 -60807 22919 325220 -55868 57082 144075 -49482 -173990 -176498
19439 -176498 -331800 -226741 115421 -128176 -217405 -279128 -33779 -269261 -327345 -568986
19429 -568986 60977 -233774 -34002 29189 -242675 -302178 287705 33693 -483359 329056
19418 71146 -64550 -81607 -262961 53623 -230708 -270461 -435321 -166709 86837 -106095 -286112
19407 -286112 -17388 -85639 221806 -163958 -319352 -196244 -115415 82496 93139 -103589
19396 -170069 -234063 -24878 -145687 -215732 -20385 -34892 -382376 22034 233196 161755 -182208
19384 3761 -99406 113438 -127439 127109 53632 -132094 -62014 120122 -49020 71669 -394752
$$ packed form
19461a61543B81250g1328A52507b92929E1760d7447B93055i4483A37292b18348
19450a48400A68343l0548f0807B2919L02301e5868E7082Q6993d9482j24508k508
19439a76498j55302J05059A15421a28176q9229o1723c3779k35482n8084k41641
19429e68986F0977b33774c4002B9189b42675n9503B87705C3693d83359C29056
19418G1146f4550j7057j81354E3623b30708l9753j64860a66709H6837a06095j80017
19407b86112a7388o8251B21806a63958j55394J23108Q0829H2496J0643a03589
19396a70069o3994b4878j20809p0045b0385j4507l47484B2034K11162p1441a82208
19384C761i9406A13438a27439A27109E3632a32094f2014A20122d9020G1669c94752
$$ plain form
19372 -96224 -239496 -27091 -26644 -56053 -277502 194014 -251907 102816 -209685 303468 -161178
19360 320414 -582815 -235603 -210272 -268153 310924 -381292 51495 48072 -48952 365419 79238
19348 -72299 173137 3360 -75059 -44955 -125053 -51658 172634 145835 51977 106760 -56322
19336 -140077 219577 102560 117266 -120717 -61992 -348680 -81287 52850 -315044 -66230
19325 -24910 72467 149944 100432 -377342 -219034 -147501 314415 -155632 -206070 -77357 291862
19313 -167204 74604 18683 121234 36254 59544 -148810 -384060 -128921 -169598 -202743 210240
19301 -197104 -116701 176831 14762 -105724 244521 252722 -156545 44936 103162 294976 -12502
19289 -217378 -303799 -187634 -13489 192796 -82598 -70001 150904 329415 -14005 272398
$$ packed form
19372i6224j43272b7091M47k9409k21449A94014b51907A02816b09685C03468a61178
19360C20414e82815b35603K5331n7881C10924c81292E1495l423d8952C65419G9238
19348g2299A73137C360g5059L0104q0098e1658A72634k6799E1977N4783e6322
19336a40077B19577A02560J4706a20717N8725k86688h1287E2850c15044f6230
19325b4910G2467P7477m9512c77342J58308P1533C14415a55632n0438g7357B91862
19313a67204G4604A8683J02551C6254K3290a48810k35250a28921m0677l3145B10240
19301a97104Q0403A76831A4762a05724B44521Q201a56545D4936N8226J91814a2502
19289b17378q6421J16165a3489A92796h2598J2597A50904J78511a4005B72398
$$ plain form
19278 -258654 19518 16101 -18089 -165893 305167 -80679 -57618 31407 -458345 -117962 -70851
19267 -70851 76741 -49323 162499 319466 48984 100474 -24085 -169618 274567 -145900 -101831
19256 -101831 -175933 134784 33061 -94091 -79548 -249472 23111 -155399 49563 -1624 -180672
19245 -180672 -237413 -50163 -56389 -213161 -7035 -71899 -293326 -178672 -236608 -251330 -236735
19234 -236735 129700 -39973 -103547 -112241 -105022 172876 -339547 331065 -288345 -305389 -120140
19222 -243327 -313371 -153889 35517 -34804 105480 186862 53013 76300 -5813 -223712 -291921
19211 -291921 25289 224592 -301344 36518 108019 -278670 -181068 20902 -276758 61862 -212677
19199 -101776 -188299 -191603 -134346 -255170 24316 -4286 188558 -459219 -345428 45172 41624
$$ packed form
19278b58654A9518l417a8089j47804C05167h0679K3061C1407d58345a17962M7111
19267g0851G6741d9323A62499J56967D8984N1490b4085j45533B74567a45900M4069
19256a01831p4102A34784C3061i4091J4543j69924B3111a55399D9563a624j79048
19245a80672n6741e0163o226j56772g035o4864k21427J14654n7936j4722J4595
19234b36735A29700c9973o3574q694P219A72876c39547C31065b88345j7044a20140
19222b43327p0044a53889C5517c4804A05480Q1382E3013K3287e813k17899o8209
19211b91921B5289J99303c01344C6518P1501b78670R7602B0902b76758F1862b12677
19199a01776q6523l304N7257j20824B4316d286A88558d59219J13791D5172l548
$$ plain form
19188 41624 221229 -182205 -87951 95144 -86799 -440035 -254999 -106319 -339946 110224
19177 63313 -29378 -208914 -25681 -108177 -148238 439068 -196131 -117305 -163374 185019 416273
19166 416273 -131093 -204261 -185271 -181277 178377 -40513 -105474 -161783 -247590 -9572 49494
19154 -268655 169883 21774 8698 -103479 121416 -127395 97577 -187685 -47581 -446052
19144 -446052 -222956 104413 -223282 274620 101517 -71015 -419598 -233138 -243294 -120257
19133 -93424 -132063 -151205 -32328 -4145 39078 -242867 -284785 -509177 -376273 -300024 -41877
19121 74579 39997 99807 193259 342261 55926 -130649 -342572 -190474 -31100 -324303 -140143
19109 138080 -353328 -159540 -71465 247435 91236 113799 21597 -314348 -85524 -8072 -127153
$$ packed form
19188D1624J79605a82205h7951I5144h6799l53236J85036a06319k33627A10224
19177F3313b9378j79536b5681q2496m0061D39068a96131P8826m6069A85019K31254
19166D16273a31093p3168J8990L994A78377d0513o4961n6309q5807i572D9494
19154b68655A69883B1774H698a03479A21416a27395I7577a87685d7581l98471
19144d46052b22956A04413b23282B74620A01517g1015l48583J86460j0156a20257
19133i3424l8639j9142c2328d145C9078b42867m1918k24392J32904P6249d1877
19121G4579l4582N9810R3452J49002E5926a30649k11923J52098c1100k93203a40143
19109A38080c53328a59540g1465B47435I1236K2563B1597c14348h5524h072j19081
$$ plain form
19098 -127153 13547 -2809 -47710 -228801 -208234 -67119 141497 251791 107276 -185701 336148
19086 -161885 -250325 296255 -13271 -547368 41622 136314 72611 -250931 -127304 -49369 -233040
19075 -233040 -186950 -109808 203086 -280710 51609 16949 -134132 110733 -399772 -2536 98483
19063 -122758 -224148 6614 195443 -36004 246452 114162 259270 -216022 82993 -268811
19052 192552 -66828 15931 218856 -22807 -30151 -88826 -34931 51391 -38628 90097 172749
19041 172749 275363 -125169 -492623 82452 -134886 -39098 18683 -192734 -103306 20169
19030 45177 -134434 146755 222662 307583 244829 -268195 53053 -104130 31199 46752 74126
19019 74126 176030 133217 32209 -398333 -413743 -38145 170507 -180499 24784 275293 -22064
$$ packed form
19098a27153A3547b809m4901j81091K0567f7119A41497J10294A07276a85701C36148
19086a61885q8440B96255a3271n34097D1622R4692o3703b50931J23627d9369j83671
19075b33040M6090P7142B03086b80710E1609A6949a34132A10733c99772b536I8483
19063a22758j01390F614J88829c6004B46452A14162J45108b16022H2993b68811
19052A92552f6828A5931K02925b2807p344n8675c4931E1391c8628I0097Q2652
19041A72749J02614a25169l67454H2452a34886c9098A8683a92734Q9428B0169
19030D5177a34434A46755P5907Q4921o2754b68195E3053a04130C1199J5553K7374
19019G4126J01904m2813C2209c98333j5410c8145A70507a80499B4784K50509b2064
$$ plain form
19007 80380 237647 93219 13671 -160315 -246950 105120 -149190 -172695 295310 -137753
18996 -109030 -508511 90370 -56517 -38230 -231637 86342 -247071 -50851 -219988 234334
18985 -275510 -101685 -273596 -179681 216478 -220284 17916 -340518 -93345 -192085 -147581
18975 -147581 110805 -96792 82498 118674 -160934 64638 -130505 6583 -57380 305753 351966
18964 351966 -139837 -171413 -80521 -210149 92767 271422 399150 165651 204189 -146863
18953 -70102 -213518 167648 7588 277133 12996 -26992 -119353 -348121 -368432 -66503 -46615
18942 -46615 188959 165826 116350 -80624 -245072 -12173 -95606 -187484 20168 61210 -138183
18930 126900 -46378 -20053 -124700 -302220 -61792 108132 43144 -182641 103262 -128779
$$ packed form
19007H0380J57267I3219A3671a60315q6635A05120a49190k3505B95310a37753
18996a09030l99481I0370e6517J8287j93407H6342b47071e0851j69137B34334
18985b75510a01685j71911R3915B16478b20284A7916c40518i3345r8740M4504
18975a47581A10805i6792H2498L6176a60934F4638a30505F583e7380C05753M6213
18964C51966a39837l1576h0521j29628I2767J78655J27728A65651L8538a46863
18953g0102j43416A67648G588K69545A2996b6992r2361k28768k0311f6503J9888
18942d6615A88959k3133m9476h0624j64448a2173q3433r1878B0168M1042a38183
18930A26900d6378b0053j04647j77520f1792A08132D3144a82641A03262a28779
$$ plain form
18919 70232 -65983 -271682 -223822 -95919 412375 -143513 -8748 80835 -115026 -232232 -142150
18908 -142150 -270063 -479308 177690 -105418 -260059 -46537 -217773 -75170 -272325 229906
18897 -1096 -354407 -98637 -81786 -22599 -157399 -159331 -159810 -293250 128221 16465 -16074 -33124
18885 -33124 -232994 -343858 -31565 56488 178050 44535 -174078 -110018 -51708 102743 29160
18873 -331674 293819 -117777 -15716 -117238 -66564 98659 7408 -35878 6900 160551 -79023
18861 -238254 132079 27053 -36324 83589 -60631 -118854 -319538 -285676 -309321 97014 143869
18850 143869 -30674 -159099 161326 -140839 -260297 251450 -92370 -186053 -563775 -82546
18839 -185856 -2844 -270294 186973 -28629 -18169 6547 -171336 72114 -18818 3367 -197560
$$ packed form
18919G0232f5983k05699M7860i5919D12375a43513h748H0835a15026j17206R0082
18908a42150j27913k09245A77690a05418j54641d6537j71236g5170j97155B29906
18897a096l53311i8637J6851b2599j34800j932m79j33440A28221A6465a6074j7050
18885c3124j99870j10864c1565E6488J21562D4535a74078O4060e1708A02743B9160
18873c31674B93819a17777a5716j01522N0674I8659G408c5878F900J53651g9023
18861b38254A32079B7053c6324H3589f0631n8223k00684L3862k3645I7014M6855
18850A43869c0674j28425A61326a40839j19458B51450i2370r3683l77722h2546
18839a85856b844k67450A86973b8629J0460F547a71336G2114a8818C367a97560
$$ plain form
18827 -328498 47211 -56764 -221129 -161170 44990 -122771 81359 330582 37714 18401 216351
18816 216351 -248749 275550 341870 -12680 22982 145898 59474 186205 52059 -176180
18805 -163717 16267 -55077 -168661 92829 -135733 176290 -166133 -45359 -268931 -167635
18795 -167635 -40870 25908 -77960 -89804 -43941 17644 76498 -449690 -1996 -51034 -320477
18784 -320477 72398 122802 -112945 -128377 342269 -47871 -37131 62294 -103892 -343577 172885
18772 272510 -53235 94004 -409833 -276996 -181801 -222726 -46658 -34726 80346 77593 -388751
18760 -174774 -200243 -86419 92601 110853 -196352 100441 144861 -208480 -295315 30825 -32952
18748 -51282 5143 -157290 -35655 -168303 51505 6657 -23718 -5322 228812 35228 76325 148986
$$ packed form
18827c28498D7211e6764j64365N9959D4990a22771H1359K49223C7714A8401J97950
18816B16351b48749B75550O6320a2680B2982J22916E9474J26731E2059a76180
18805a63717A6267e5077j13584I2829a35733A76290a66133d5359k23572J01296
18795a67635d0870B5908g7960j1844d3941A7644N8854d49690a996m9038k69443
18784c20477G2398N0404a12945j5432C42269d7871J0740F2294a03892k39685A72885
18772B72510e3235I4004d09833J32837R5195m0925d6658J1932H0346k753c88751
18760a74774k5469h6419I2601J8252a96352A00441M4420b08480q6835C0825c2952
18748e1282E143a57290c5655j32648E1505F657b3718e322B28812C5228M1097P2661
$$ plain form
18736 148986 4480 -28416 -148353 -261996 158555 40604 -34921 -66856 -207226 -258319 -97941
18724 80161 15724 120159 -130254 -265597 -217299 8238 -170167 -179243 93252 3014 -9706 -29294
18712 -29294 170231 -164622 -88251 -204283 -4117 -85642 161786 -154085 65310 -291037 -145842
18701 -145842 99591 -266853 -137100 -282306 67011 5910 43536 -509640 -252416 49261 -162596
18689 -7988 37375 178556 -91338 -88475 119551 46767 -212914 178320 104073 -63583 218026
18677 -151316 -142067 75977 71049 -100820 23011 -246748 -18544 -61494 170389 242179 37817
18665 -275220 -143877 -102046 -140781 304899 -313624 -82439 -220517 236136 60231 -93235
18654 5543 -104243 173108 -246883 -45769 180433 -194180 -31540 -177513 69262 -52405 -37576
$$ packed form
18736A48986D480b8416j19937j13643A58555D0604c4921l1935j40370n1093i7941
18724H0161A5724J04435a30254j35343M8298H238a70167r076I3252C014i706j9588
18712b9294A70231a64622P6371j16032d117q1525A61786a54085F5310b91037J45195
18701a45842I9591b66853J29753j45206F7011E910L7626e09640b52416D9261a62596
18689g988C7375J41181i1338K863A19551D6767b12914A78320p4247f3583B18026
18677a51316R249G5977m928a00820B3011b46748a8544m2950A70389P1790C7817
18665b75220J31343M1831l8735C04899c13624h2439j38078B36136F0231i3235
18654E543a04243A73108b46883d5769A80433a94180c1540j45973F9262e2405J4829
$$ plain form
18643 -37576 -164728 73971 -201139 -152974 -927 -103955 -279452 185725 1965 -129195 -151087
18632 -151087 78383 164905 -308701 92526 18823 -103446 -44384 37227 -129140 -51271 -464986
18621 -464986 178850 -396141 -59535 238134 -92733 -209455 -327580 64826 -166933 131719
18610 -102360 -253605 -32606 305320 -119263 157624 -364554 -87790 19966 222845 -331174
18599 2096 -263223 218180 144609 94915 -112557 -107416 97110 136147 -110369 9945 -258573
18587 264623 107441 84918 -97117 75670 -211971 240297 -56037 -167238 215719 -341716
18576 -45166 72953 -86984 219356 2330 -246767 -245037 -40593 31808 136157 16706 10759 -99689
18563 226907 -369217 -127687 181722 -176511 -34820 40921 160211 172845 -60991 -106443
$$ packed form
18643c7576j27152G3971b01139M8165i27j03028j75497A85725A965a29195k1892
18632a51087G8383Q6522c08701I2526A8823a03446d4384C7227a29140e1271m13715
18621d64986A78850c96141e9535B38134i2733j16722j18125F4826a66933A31719
18610a02360j51245c2606C05320a19263A57624c64554h7790A9966K02879c31174
18599B096b63223B18180p3571m9694a12557N141I7110L9037a10369I945b58573
18587B64623A07441k2523i7117G5670b11971B40297e6037j11201B15719c41716
18576d5166G2953h6984B19356B330b46767J730d0593C1808J04349A6706n947i9689
18563B26907c69217a27687A81722a76511c4820D0921J19290J2634f0991m5452
$$ plain form
18553 -106443 -137408 -273119 296312 -267712 110082 64197 49154 -127693 134815 -161310
18542 -132481 -137909 123714 176396 145721 -1957 -71299 -195729 -155877 -170914 53209 124097
18531 124097 65977 -210603 -370693 -111436 -84263 -272920 296931 -160189 -42468 -142145
18521 -142145 307 116756 248659 -195327 29278 -121 147438 -249653 -450530 -222408 -253381
18510 -253381 -4791 160066 -146946 -402837 -17703 149641 319838 -22796 9105 -39974 103297
18498 -149740 293491 -9668 -183933 -263428 222806 -145070 229211 -99212 -118986 14538 -33851
18486 38502 -81451 118204 -80587 30718 -160917 35728 14497 50509 86500 -59858 -140388
18475 -140388 -387617 -119462 -184804 -138989 45290 74266 -267999 30332 -265234 -86396 23664
$$ packed form
18553a06443l0965j35711B96312b67712A10082m5885j5043a27693A34815a61310
18542a32481n428A23714N2682l0675a957o9342j24430L9852j5037E3209P0888
18531A24097n8120b10603j60090a11436K7173j88657B96931a60189d2468r9677
18521a42145C07J16449J31903a95327B9278a21A47438b49653k00877b22408l0973
18510b53381d791A60066a46946k55891a7703A49641J70197b2796I105c9974A03297
18498a49740B93491i668j74265p9495B22806a45070B29211i9212j9774A4538c3851
18486C8502h1451A18204h0587C0718a60917C5728A4497L6012L5991e9858q0530
18475a40388k47229a19462o5342M5815D5290K8976b67999C0332b65234h6396B3664
$$ plain form
18463 -238204 97152 -43144 -244040 -58056 -201522 1114 -206849 282746 -114624 -167337 -232001
18452 -232001 -176442 244763 -12221 38521 -180180 188719 -180001 38713 80307 119159 -291341
18440 241547 -143184 -165972 -114387 -101748 106791 -53311 180631 -138573 115127 -198572
18429 18101 -244051 -161701 -152837 27472 113729 9697 403351 -21786 -244316 -139242 30747
18417 -62726 124711 -161072 148829 190088 78355 -170283 41763 -88918 22026 -113810 50054
18405 188179 -28072 294244 -100610 -212250 45335 -191371 68652 215095 80587 -49352
18394 59468 -201492 273252 8254 -332915 -136213 3490 208926 -137182 34065 -148578 87587
18382 -13035 -173194 68242 177317 188124 -29265 13668 -316153 6448 147537 -234388 -372434
$$ packed form
18463b38204I7152d3144k00896e8056j43466A114b06849B82746a14624n2713o4664
18452b32001N5559B44763a2221C8521a80180A88719a80001C8713M1594L8852b91341
18440B41547a43184k2788N1585J2639A06791e3311A80631a38573A15127a98572
18429A8101b44051Q2350Q864B7472Q6257I697L93654b1786k22530J05074C0747
18417f2726A24711a61072A48829M1259G8355a70283D1763h8918B2026a13810E0054
18405A88179b8072B94244a00610j11640D5335a91371F8652J46443H0587d9352
18394E9468b01492B73252H254c32915a36213C490K05436a37182C4065a48578H7587
18382a3035j60159F8242J09075J0807b9265A3668c16153F448J41089b34388j38046
$$ plain form
18371 -372434 -231747 -214851 -105582 122582 -90076 105686 -47456 -57069 -46994 -38700 -312742
18360 -312742 240078 12896 -89912 130719 239412 -94951 -116754 -128148 -90576 -374827 -132223
18348 -19640 -86996 -197434 -135154 -172682 -89077 -92471 -364563 25480 24018 -111496 -135739
18337 -135739 85859 -4336 197371 -248347 -304511 47416 -184549 22371 -559426 85611 -89239
18325 199208 -1663 -260426 42677 65305 179532 -310255 -350909 -127086 -210867 50674 -2530
18313 -29942 200905 195754 -205472 128515 109714 -80888 -187498 81815 162268 77581 116825
18302 116825 219018 -162605 -21218 -29288 155454 -364553 98352 -123307 140846 92250
18292 92250 50205 314693 -269428 -67716 -164869 51082 -117843 300806 -46308 25371 -281372
$$ packed form
18371c72434J40687J6896a05582A22582i0076A05686d7456r613J0075Q294k74042
18360c12742B40078A2896h9912A30719J08693i4951k1803j1394L7572k84251a32223
18348a9640o7356j10438O2280l7528Q3605l394k72092B5480j462a11496k4243
18337a35739H5859d336A97371b48347n6164D7416a84549B2371e59426H5611h9239
18325A99208a663k58763D2677K2628J14227c10255m0654a27086q3781E0674b530
18313b9942B00905n151b05472A28515j8801h0888j06610H1815Q0453G7581L9244
18302A16825J02193a62605b1218q070A55454c64553I8352a23307A40846m8596
18292I2250m2045K64488b69428f7716r7153E1082a17843C00806d6308B5371b81372
$$ plain form
18280 69630 -177031 -84817 -66789 89163 128541 128409 -242670 -414878 -269903 -254496 79994
18268 -103805 -190558 52315 74466 14353 53693 -35550 63133 -20323 76474 -251012 -56406
18256 72399 -44776 -142693 -111427 14449 -125371 283876 -175460 183924 -321802 -156661
18245 11451 24534 -49947 -266068 49481 79693 -21918 -5173 -483757 275903 -34330 -103103
18234 -103103 -185956 -188983 26830 -122142 -72413 72180 -91790 -2632 -3455 -20730 -284440 -247950
18222 -247950 -146559 351411 -66110 -70949 -138505 -530119 -158023 163461 -107144 156299
18211 18265 -342481 53597 -145521 -10959 215364 -200130 -288635 152573 115037 174075 117085
18200 117085 -105966 -213107 24749 38242 -245872 100254 163666 -373337 200330 -15445
$$ packed form
18280F9630a77031h4817J8028H9163L9378j32b42670j72208J44975J5407G9994
18268a03805q6753E2315K2151A4353L9340c5550F3133b0323G6474b51012e6406
18256G2399d4776r7917L1266A4449a25371B83876a75460A83924c21802a56661
18245A1451J3083d9947k16121D9481L0212b1918e173m78584B75903c4330o8773
18234a03103q2853l027B6830a22142M9729G2180i1790b632q23j7275k63710L6490
18222b47950J01391C51411f6110m839o7556l91614a58023A63461a07144A56299
18211A8265c42481E3597a45521a0959B15364b00130q8505A52573l7536N9038n6990
18200A17085a05966j07141B4749J3493b45872A00254O3412c73337B00330a5445
$$ plain form
18189 8929 -342934 98272 360900 84353 269558 143597 11421 -104346 132778 249759
18179 249759 427264 31097 -67487 180707 -37732 -173100 -274302 61630 -62711 102008
18168 -139980 357812 130385 -137288 -137378 -189143 -256877 -172813 -76543 -156384 -342388 -73404
18156 266845 84534 126488 173022 -36837 129353 -151183 152803 29900 100464 -71624 -130510
18145 -130510 -155826 112714 -317807 -337720 -41177 19382 -150367 -157563 -144904 -233853 48410
18133 -190378 -170379 -4887 88324 -60086 144170 -174583 -129384 250139 -109802 -123534 131869
18121 -171610 370586 -192614 209171 -75656 92607 15788 -64657 201757 -86498 -149022 229357
18109 179218 -7750 -76765 -144230 -36446 146888 -167257 -356115 -128883 -345631 17000 314137
$$ packed form
18189H929c42934I8272K62628H4353J85205j25961A1421a04346A32778J16981
18179B49759J77505C1097f7487A80707c7732j35368j01202F1630f2711A02008
18168a39980C57812A30385a37288r0n1765o7734Q4064g6543p9841j86004g3404
18156B66845H4534M1954M6534c6837A29353a51183A52803B9900P0564g1624n8886
18145a30510k5316A12714c17807j9913d1177A9382a50367p196J2659q8949D8410
18133a90378J9999d887H8324f0086A44170a74583M5199B50139a09802j3732A31869
18121a71610C70586a92614B09171g5656I2607A5788f4657B01757h6498o2524B29357
18109A79218g750o9015o7465c6446A46888a67257j88858a28883k16748A7000K97137
$$ plain form
18098 314137 -29022 -32903 258761 -160226 -255822 -150963 240180 -96862 -60596 -245852 49572
18086 -160313 238247 -424760 -130292 54379 19479 37397 -53887 -179034 265177 -22944
18075 115143 -379871 85562 977 -154267 -197282 -87711 42375 140222 -26226 91363 57330
18064 57330 -260949 -160 154428 -19138 156642 -303803 157857 -115116 -4901 -122552 -87620
18053 -87620 71321 67590 -170017 -242853 -32600 65721 -50686 72733 -337326 -105144 275649
18041 194506 354341 53203 -60760 234299 -241508 -91623 -171713 82240 13317 -265370 -266429
18030 -266429 -141380 -81298 -13983 8518 -137504 -17246 50810 -104677 100600 -45794 -241587
18019 -241587 -136149 -129979 -151427 106869 249508 -293576 -123831 -147504 -59359 -357442
$$ packed form
18098C14137b9022l881B58761a60226r5596J04859B40180i6862L6266j85256D9572
18086a60313B38247d24760a30292E4379A9479J7918e3887j25147B65177b2944
18075A15143c79871H5562I77a54267m3015h7711D2375R7847b6226I1363l4033
18064E7330b60949a60A54428a9138A56642c03803A57857a15116d901j17651L4932
18053h7620G1321l731a70017p2836c2600F5721e0686G2733c37326a05144B75649
18041A94506J59835E3203f0760B34299b41508i1623q0090H2240A3317b65370j059
18030b66429J25049O0082a3983H518a37504a7246E0810a04677A00600d5794j95793
18019b41587J05438O170k1448A06869J42639b93576a23831k3673e9359k98083
$$ plain form
18009 -357442 -28218 184324 6747 -86825 -263827 -20035 -199075 -116143 -247624 -140146 -57725
17997 183719 -188169 24920 95414 210 74609 109 -60423 -135509 177669 173306 -29690 65797
17984 -42145 2574 -198566 -371050 -317641 -43066 -247450 -420753 -227073 -39033 19103 -13674
17972 -131443 -460486 188262 -360690 199230 -59550 -51638 -259212 122692 237361 88459
17961 -482097 21513 -66974 -172407 -103498 -253215 -13383 62363 -110880 225108 -123730
17950 -18474 396338 -128249 77106 -190725 73119 -149124 57183 -400722 113144 -119888
17939 14833 -306919 -353207 -132710 13495 -148896 87384 -242568 91329 96387 196858 73460
17927 102657 -59774 139119 82725 -58118 53888 99252 -203028 52502 -139366 214585 -146618
$$ packed form
18009c57442b8218A84324F747h6825j77002b0035j79040Q2932j31481J07478e7725
17997A83719a88169B4920P0494B10P4399A09f0423p5086A77669m363b9690F5797
17984d2145B574a98566j72484N3409d3066k04384j73303J93680c9033A9103a3674
17972a31443l29043A88262c60690A99230e9550P912k07574A22692J14669H8459
17961d82097B1513f6974j05433O8909j49717a3383F2363a10880B25108a23730
17950a8474C96338a28249G7106a90725G3119a49124E7183d00722A13144a19888
17939A4833c06919m6288a32710A3495a48896H7384b42568I1329N058J00471G3460
17927A02657e9774A39119n6394e8118E3888M5364b03028E2502a39366B14585a46618
$$ plain form
17915 -293255 -127341 -135352 -450148 122412 -89409 315381 16955 128709 -94115 -76153 424283
17903 27349 -116118 41005 -202431 182697 45386 -10829 -145076 -31596 -111147 223266 288692
17892 288692 -104990 185485 -113747 7844 230558 150611 56084 -179011 -54528 26865 -212745
17880 -61447 -31813 -152947 -62176 236840 71870 1215 -75222 -35346 -64244 -13291 95419
17868 -123386 -142500 -317920 412694 -380 -366646 -315731 -205208 -200232 68257 -274501 -146397
17857 -146397 -335861 -146333 307495 -39978 82370 -52668 -245720 29528 -11563 328062
17846 -272768 -315845 34191 142991 -10068 -228832 8882 -32056 5173 -138349 324911 24780
17834 -103762 -111105 -234796 204324 -91171 -306954 260901 171697 -12206 -98347 91474 206655
$$ packed form
17915b93255a27341q011l14796A22412h9409C15381A6955J11754i4115J7962D24283
17903B7349a16118D1005b02431A82697D5386a0829j34247c1596p9551B23266O5426
17892B88692a04990A85485a13747G844K22714p9947E6084a79011e4528B6865b12745
17880f1447K9634j21134f2176B36840G1870A215g5222c5346k8898a3291I5419
17868a23386j9114j75420D12694c80l66266N0915J10523M976F8257b74501J28104
17857a46397j89464a46333C07495c9978H2370e2668j93052B9528a1563C28062
17846b72768m3077C4191J08800a0068k18764H882c2056E173a38349C24911B4780
17834a03762p343j23691B04324i1171k15783B60901q9204a2206q6141I1474J15181
$$ plain form
17823 206655 -61565 -542218 -8502 85118 -214176 -374356 126452 -76462 104954 326358
17813 326358 -78280 -134757 115584 172799 -20145 -98979 -243362 157474 -147298 -414061
17803 -414061 59535 103076 -310570 -197830 104219 -150608 -108376 -216813 401513 118801
17792 161128 -112024 195110 -109010 68842 90745 139779 215330 -371351 -191454 86491
17781 20447 -22721 118691 -112884 1778 54235 140231 400182 74111 -98769 -56418 -119867
17770 -119867 198550 -202659 234171 -226331 -535169 204884 -111473 169763 -287703 -93486
17759 112544 -238557 -77138 -40422 203036 -109680 110733 -411778 203398 -77419 8688
17748 154176 186052 141693 6309 112625 -113834 -110826 -109204 52730 -24676 -75233 384851
$$ packed form
17823B06655f1565m80653h502H5118b14176j60180A26452g6462A04954K21404
17813C26358g8280n6477A15584N7215b0145p8834j44383A57474a47298k66763
17803d14061E9535M3541c10570J12740A04219a50608M2232j08437D01513A18801
17792A61128a12024A95110a09010F8842K1903M9034P5551c71351J79897H6491
17781B0447b2721A18691a12884A778N2457Q5996K59951G4111i8769M2351o3449
17770a19867A98550b02659B34171b26331l08838B04884a11473A69763b87703i3486
17759A12544b38557g7138L6716B03036a09680A10733d11778B03398g7419H688
17748A54176L1876m4359F309J06316a13834L008J622E2730b4676n0557C84851
$$ plain form
17736 -68542 -96857 -116722 -164454 -480788 166407 -72591 26543 -212066 -153829 -29085 -314634
17725 -314634 -50363 -188408 38211 269073 -412463 -108082 -31348 253706 22409 181751
17715 181751 -381441 217898 -14149 73289 -67093 92432 -129041 -20903 207219 -23777 -115908
17704 -115908 -56412 390948 370179 338330 245694 -35641 -145877 36056 111423 -73223 86216
17692 -96318 35719 187141 164889 -12900 71159 -249204 313825 204998 -18844 226471 -263747
17680 -40344 -50008 12957 42387 211563 73352 87920 63599 -413613 89042 264641 53214
17668 -77159 -122898 -163745 -10160 -78928 90691 -294674 177064 -288738 226266 -371202 15591
17656 -31379 -94968 163409 154591 57853 156629 -88377 -21250 14074 -66103 -152901 61526 44323
$$ packed form
17736f8542k8315j9865m7732l16334A66407g2591B6543b12066N8237b9085k85549
17725c14634e0363j38045C8211K30862d12463a08082c1348B53706B2409J59342
17715A81751c81441B17898a4149G3289f7093I2432a29041b0903B07219b3777r2131
17704a15908e6412C90948k0769l1849r2636c5641j10236C6056P5367g3223H6216
17692i6318C5719J51422k2252a2900G1159b49204C13825j08827a8844B26471b63747
17680d0344r664A2957K9430J69176G3352J4568k4321d13613H9042J75599E3214
17668g7159m5739m0847a0160o8768I0691b94674A77064b88738B26266c71202A5591
17656c1379o3589A63409q818E7853R8776h8377b1250A4074f6103q6798F1526j7203
$$ plain form
17644 44323 -172126 -229454 -44585 43257 -129175 -106080 69079 56459 1506 205488 207599
17633 207599 204786 -341874 178794 30731 24886 -19902 118876 -76099 278328 -16084 87041
17621 1884 -249284 98185 2585 50995 -63541 107505 47759 397022 29323 107417 320202
17610 320202 178508 237998 274977 -267725 -79288 286366 -106076 162359 -184037 -25702
17599 343825 130730 -41549 -437697 -34575 -336551 -125277 245641 -144516 -88629 74999
17588 60888 -12008 -27405 -2354 7062 87499 -190276 -66837 -116054 -148226 151364 130267 105616
17576 105616 -120161 -37838 -115659 -92247 46694 124439 249659 -2815 269521 210135 -51518
17564 20762 32877 -154539 17820 92998 146330 112713 -279235 119088 -106088 86625 -213307
$$ packed form
17644D4323a72126n7328d4585D3257a29175K3095F9079j2620A506K03982K111
17633B07599k813c41874A78794C0731n845a9902A18876g6099B78328a6084H7041
17621A884b49284I8185B585M8410f3541A07505D7759L49263B9323P8094K12785
17610C20202j41694N9490L6979b67725g9288B86366a06076A62359a84037b5702
17599C43825A30730d1549l96148c4575l01976a25277B45641a44516N5887G4999
17588F0888a2008j5397b354G062Q0437a90276f6837m9217l2172A51364k1097k4651
17576A05616a20161c7838p7821K3412D6694P7745J25220b815B69521n9386e1518
17564B0762J2115a54539A7820P5178N3332l3617b79235A19088a06088H6625b13307
$$ plain form
17552 -4818 362492 -251604 306859 -178505 260940 72569 166353 15497 -298984 122292
17541 71017 6193 -358150 95264 -7072 52396 174698 322755 -47380 -128053 -237459 -125370
17530 -125370 -201275 91174 196285 -132346 55983 -326163 17422 -4349 232638 262686 237345
17519 237345 -170492 41575 -57835 17113 48639 205637 -166483 395666 100798 -386096
17508 51778 313973 -82961 -315571 -73953 -60767 -62961 505314 128923 115344 -230909 257274
17496 201999 -41915 -201962 31353 -152968 83926 295329 126741 98631 122830 177046 189613
17485 189613 -250377 164653 93816 -158575 -143333 220391 222024 -345102 52868 3733 200681
17474 200681 243993 51140 -134613 135208 -84481 -18415 72275 11166 -24325 -61901 253622
$$ packed form
17552d818C62492b51604C06859a78505B60940G2569R3784A5497b98984A22292
17541G1017F193c58150I5264g072E2396J22302J48057d7380q0673j09406J12089
17530a25370p5905I1174J05111a32346E5983c26163A7422d349B32638L0048k5341
17519B37345a70492D1575e7835A7113L1526J56998a66483C95666A00798c86096
17508E1778K62195h2961k32610g3953J3186k194E05314A28923j3579b30909B57274
17496B01999d1915j60047C1353a52968H3926K11403A26741k8110K4199N4216J2567
17485A89613b50377A64653p0837a58575J5242B20391J633c45102E2868C733J96948
17474B00681M3312E1140a34613A35208h4481a8415G2275A1166b4325l7576B53622
$$ plain form
17462 179582 162521 66229 325876 40387 262574 -152020 371161 421446 219315 634136
17452 634136 -34505 104281 246104 395972 344694 41621 256631 135372 298468 120283
17441 406986 -34993 250977 21550 84113 559095 236139 -33753 91272 169368 320292 351377
17430 351377 304272 255894 222523 1426 -30239 241544 402619 344995 -148615 191675 131803
17419 131803 178735 388906 234985 314906 245715 66948 373364 394576 45467 287414 255375
17408 255375 181084 -214943 306671 47261 88883 -163168 4732 162072 -64497 -183391 252497
17396 101019 51095 169682 161958 352133 118913 -107352 33307 173368 84379 346715
17386 346715 260678 33715 121628 -56821 15027 188464 153209 417513 -222721 -22399 433879
$$ packed form
17462A79582j7061F6229K59647D0387K22187a52020C71161N0285k02131M14821
17452F34136c4505A04281J41823J49868n1278D1621K15010j21259J63096A20283
17441D06986c4993B50977B1550O2563M74982B36139c3753I1272P8096J50924L1085
17430C51377m7105m8378l3371A426c0239B41544J61075n7624a48615A91675n9872
17419A31803M6932K10171j53921P9921o9191F6948L06416K1212D5467K41947l2039
17408B55375p4291b14943C06671D7261M1622a63168D732J57340f4497j18894B52497
17396A01019m9924J18587p724J90175A18913a07352C3307J40061H4379K62336
17386C46715q6037C3715Q7913e6821A5027J73437l5255K64304b22721b2399D33879
$$ plain form
17374 -106013 311754 -109028 76999 20493 -30366 262969 69506 194896 70658 92358 131288
17363 131288 25753 175571 49072 192879 29807 62416 -77944 -122176 226034 163837 137946
17352 137946 58261 97710 387945 8703 356561 -163052 -135840 15366 221352 181483 395211
17341 395211 32514 -95416 311225 132123 535230 202084 160217 215797 357915 46387
17330 -179875 162441 276107 -207310 56519 355268 109646 189420 431386 263223 169499
17320 169499 390378 307251 -165674 442103 -38475 174095 234296 427810 41460 -54420
17309 283557 289075 -413 87971 -168362 48044 -179030 353201 388560 -43518 253287 243277
17298 243277 -35387 6151 393443 72165 423408 -47348 124822 -104435 270569 267278 490786
$$ packed form
17374a06013C11754a09028G6999B0493c0366B62969F9506J25390G0658K1700L8930
17363A31288B5753J49818D9072J43807B9807L2609g7944m4232B26034o2197k5891
17352A37946E8261L9449K90235H703L47858a63052K7212A5366K05986l9869K13728
17341C95211C2514i5416C11225A32123M03107B02084m1867N5580J42118D6387
17330a79875A62441J13666b07310E6519K98749A09646P9774K41966j68163r3724
17320A69499K20879q3127a65674D42103c8475A74095O0201J93514D1460e4420
17309B83557N518d13H7971a68362D8044a79030C53201L5359d3518B53287j0010
17298B43277c5387F151L87292G2165L51243d7348A24822a04435B70569l291K23508
$$ plain form
17287 490786 113447 -8266 100453 319998 58042 271339 147006 191 422185 -65237 -9907
17275 74251 182634 -65589 191096 29576 318285 155077 483417 53793 403468 -86344
17264 1169 91752 55770 285236 252012 440451 182601 118563 -111760 -81663 215278 10988
17252 -8050 407293 -188063 242899 -42850 60622 218142 418857 496244 201080 52810 100270
17241 100270 227441 379506 273350 171921 -110681 102822 328589 -96648 222836 281447
17231 281447 144348 212649 106677 -70207 185760 248693 118610 -358 443788 278875 322536
17220 322536 83786 85807 201869 6660 -14104 569431 -180937 185087 280900 4444 162563
17209 162563 350746 -169445 329522 311045 -15967 186588 331582 219151 14488 295283
$$ packed form
17287D90786A13447h266A00453K19545E8042K13297j24333A91M21994f5237i907
17275G4251J08383f5589A91096B9576K88709A55077L28340E3793L49675h6344
17264A169R0583l5982K29466l3224J88439A82601o4038a11760L0097B15278A0988
17252h050D07293a88063B42899d2850F0622J57520K00715P7387B01080E2810M7460
17241A00270J27171J52065j06156j01429a10681A02822K25767i6648B22836N8611
17231B81447j37099O8301j05972g0207A85760O2933A18610c58D43788j64913M3661
17220C22536H3786K021J16062F660a4104E69431a80937A85087R5813D444J58119
17209A62563J88183a69445C29522j8477a5967A86588J44994j12431A4488K80795
$$ plain form
17199 295283 438257 44975 261603 232117 41138 236202 7568 283806 49561 122994 336259
17188 336259 158905 490608 -26186 391820 -29586 445895 258359 261407 327905 389501 285369
17177 285369 274667 -37258 376696 398370 151954 17380 -21608 394244 409487 126498 393211
17166 393211 426417 334091 397659 72839 258478 377399 244888 373806 205944 209785 151639
17155 151639 227484 265905 -49121 426544 448648 -84459 288007 503495 72608 338078 251631
17144 251631 199964 117788 469378 155235 210308 414932 322814 179870 209941 240801 108760
17132 259818 175132 147467 375868 -16366 419679 265961 405440 298927 839393 166213
17121 363963 352865 102150 117728 475110 257931 228428 197016 460877 430840 405497 -102380
$$ packed form
17199B95283J42974D4975K16628k9486D1138J95064G568K76238D9561P3433K13265
17188C36259A58905L31703b6186C91820b9586D45895j87536L048O6498O1596j04132
17177B85369j0702c7258C76696K1674A51954A7380b1608C94244J5243A26498K66713
17166C93211L3206r2326O3568G2839J85639J18921j32511J28918j67862L841n8146
17155A51639P5845L8421d9121D26544K2104h4459B88007K15488G2608K65470q6447
17144B51631n1667q2176L51590A55235N5073K04624r2118j42944L0071L0860A08760
17132B59818q4686k7665K28401a6366D19679j53718J39479j06513N40466A66213
17121C63963j1098A02150J5578L57382k17179k9503l1412K63861l0037k5343a02380
$$ plain form
17109 367214 226060 78171 345449 316785 530625 210392 420182 147701 322725 332735
17099 332735 319785 613683 324737 479067 210188 283403 499361 336671 186378 350912
17089 350912 220910 249616 346782 219888 246335 619658 94444 252585 272929 451624
17079 451624 619639 346915 332720 546153 330453 81980 518940 370810 287547 130454
17068 93920 293306 89272 320304 314435 298584 374059 145132 374250 436750 196930 773542
17057 773542 455890 536661 220772 483554 650842 399631 210871 345029 490558 463359
17047 463359 250903 629036 383266 546823 544107 102354 526472 631426 406825 748837
17037 748837 346749 271233 459206 588456 497488 476093 526134 410221 468464 454489 536633
$$ packed form
17109C67214j41154G8171K67278k8664K13840B10392K09790A47701J75024J0010
17099C32735j2950K93898k88946J54330B10188P3215K15958j62690j50293J64534
17089C50912j30002K8706R7166j26894K6447L73323I4444J58141K0344J78695
17079D51624J68015k72724j4195K13433k15700H1980M36960j48130q3263A30454
17068I3920J99386H9272K31032n869j5851P5475A45132K29118O2500A96930N76612
17057G73542l17652Q0771B20772K62782J67288k51211j88760J34158J45529k7199
17047D63359k12456L78133k45770J63557k716A02354M24118J04954k24601L42012
17037G48837C46749p5516J87973J29250r0968k1395N0041j15913N8243j3975Q2144
$$ plain form
17026 536633 505630 632524 650368 639919 703384 486286 447766 887820 473646 350586
17016 350586 702763 762690 394906 781909 537092 742764 662352 256385 406601 835558
17006 835558 567313 508009 535274 630037 755027 855838 687837 599809 920689 632217
16996 632217 908873 422173 873542 347164 718124 950628 753039 938731 662483 803147
16986 803147 765113 585103 658533 886543 733840 900446 854629 679237 648897 546186
16976 546186 802913 652171 852090 994679 972630 525196 1014366 926352 878270 802162
16966 802162 1208335 756496 861161 1034044 1037592 804375 799511 732212 989164 926891 1205300
16955 1205300 958640 1074717 956939 1089695 956624 1326251 775775 1034079 880387
$$ packed form
17026E36633l1003J26894J7844j0449O3465k17098l8520M40054m14174j23060
17016C50586L52177N9927l67784L87003k44817K05672q0412B56385J50216M28957
17006H35558k68245n9304K7265R4763J24990J00811j68001q8028L20880k88472
16996F32217K76656D22173M51369C47164L70960K32504j97589J85692k76248J40664
16986H03147l8034j80010P3430K28010j52703J66606m5817j75392l0340j02711
16976E46186K56727j50742J99919J42589k2049m47434M89170q8014m8082p6108
16966H02162M06173m51839J04665J72883L548k33217m864o7299K56952o2273K78409
16955A205300k46660J16077j17778J32756j33071L69627n50476K58304j53692
$$ plain form
16946 880387 970598 1063317 1148562 769800 1083881 1243423 1365930 965562 1486335 1362795
16936 1362795 1137770 1113031 1199969 1067479 1106253 1046651 1306895 1289423 1417988 1248011
16926 1248011 1381853 1281075 1238907 1431036 1240060 1459192 1624674 1292401 1438442 1099816
16916 1099816 1470790 1235282 1409142 1612547 1356050 1260009 1478866 1127694 1607364 1272134
16906 1272134 1361517 1623056 1540139 1481049 1381680 1537136 1600174 1460259 1588578 1593942 1728345
16895 1728345 1950925 1841724 1935704 1600096 1472745 1988227 1797792 1944808 1899585 2231080
16885 2231080 2026622 1700644 1892795 1827486 1952656 1960551 2172037 2101819 1978613 1960306
16875 1960306 2173614 2495310 2408874 2231049 1855053 2479618 2509578 2357845 2142506 2399183
$$ packed form
16946H80387R0211R2719Q5245l78762L14081J59542J22507m00368N20773j23540
16936A362795k25025k4739Q6938j32490L8774n9602K60244j7472J28565j69977
16926A248011J33842j00778m2168J92129j90976K19132J65482l32273J46041l38626
16916A099816L70974k35508J73860K03405k56497r6041K18857l51172M79670l35230
16906A272134Q9383K61539q2917n9090r9369J55456O3038j39915J28319N364J34403
16895A728345K22580j09201R3980l35608j27351N15482j90435J47016m5223L31495
16885B231080k04458l25978J92151o5309J25170P895K11486p0218j23206j8307
16875A960306K13308L21696q6436j77825l75996O24565K9960j51733k15339K56677
$$ plain form
16865 2399183 2675548 2459564 2372400 2316710 2391060 2508984 2929369 2465598 2681809 2871052
16855 2871052 3119742 2878214 2843698 3081337 3151058 3042883 3276481 2840286 3468069 3104153
16845 3104153 3330752 3341382 3382261 3168230 3455069 3716523 3487976 3642571 3636841 3988991
16835 3988991 3908040 4071994 4044453 3960113 4145806 4143547 4253226 4410109 4457589 4303321
16825 4303321 4533446 4856982 4735052 4819648 4706760 5131380 4951699 5217800 5395457 5551783
16815 5551783 5200062 5570716 5924942 5882022 6061044 6071739 6309036 6229930 6843067 7031918
16805 7031918 6822413 6850121 7178142 7002648 7530257 7535666 7986306 7783480 8021437 8497429
16795 8497429 8742748 8438903 9120657 9485728 9841392 9636967 9766496 10147582 10670783
$$ packed form
16865B399183K76365k15984q7164n5690P4350J17924M20385m63771K16211J89243
16855B871052K48690k41528l4516K37639O9721j08175K33598m36195O27783l63916
16845C104153K26599J0630M0879k14031K86839K61454k28547J54595n730L52150
16835C988991q0951J63954k7541q4340J85693k259J09679J56883M7480j54268
16825D303321K30125L23536j21930Q4596j12888M24620j79681K66101J77657J56326
16815E551783l51721L70654L54226m2920J79022J0695K37297p9106O13137J88851
16805G031918k09505K7708L28021j75494N27609N409M50640k02826K37957M75992
16795H497429K45319l03845O81754L65071L55664k04425J29529L81086N23201
$$ plain form
16786 10670783 11046819 11156049 11484443 11688860 12166862 12566023 12988029 13221303 13351101
16777 13351101 14333805 14562302 15026449 15651684 16013481 16256134 17240122 17751964 18263475
16768 18263475 18941720 19451645 20625984 21258598 21437036 22524599 23388844 24662268 25563739
16759 25563739 26397893 27598170 29150703 30084294 31354811 32940664 34272183 35754305
16751 35754305 37827224 39278880 41519118 43404846 45746814 48129947 50631506 53555506
16743 53555506 56133121 59154929 62389677 65951561 69579425 73679126 77622311 82344229
16735 82344229 87205671 92400311 97751563 103208834 109225835 115008856 121756242 128177943
16727 128177943 134770593 141232901 147799331 153928197 159528623 165208143 169435458 173298453
$$ packed form
16786A0670783L76036J09230L28394K04417M78002L99161M22006K33274J29798
16777A3351101R82704K28497M64147O25235L61797K42653R83988N11842N11511
16768A8263475O78245N09925J174339O32614J78438J087563Q64245J273424R01471
16759B5563739Q34154J200277J552533R33591J270517J585853J331519J482122
16751C5754305K072919J451656K240238J885728K341968K383133K501559K924000
16743E3555506K577615L021808L234748L561884L627864M099701L943185M721918
16735H2344229M861442N194640N351252N457271O017001N783021O747386O421701
16727A28177943O592650O462308O566430O128866N600426N679520M227315L862995
$$ plain form
16719 173298453 176198535 177876835 178656973 178021208 176798642 174124602 170513980 166105442
16711 166105442 160887382 155330010 148977136 142884180 136222604 129725737 122722011 116390967
16703 116390967 110022186 103695364 98276081 92701629 87421561 82485215 78069058 73704795
16695 73704795 69547793 65886407 62060501 59010425 55613372 52875796 49617229 47593816
16687 47593816 45421160 42911717 40925371 38553374 37038379 35477863 33744694 32294784
16679 32294784 31049695 29642204 28081384 27405745 25835611 25020176 23863862 22874408
16671 22874408 22142537 21442683 20357825 19765712 18980429 18509129 17931094 17048226 16521578
16662 16521578 16146998 15350436 15069727 14386872 13779440 13919828 13007918 12810516 12226792
$$ packed form
16719A73298453K900082J678300P80138o35765j222566k674040l610622m408538
16711A66105442n218060n557372o352874o092956o661576o496867p003726o331044
16703A16390967o368781o326822n419283n574452n280068m936346m416157m364263
16695G3704795m157002l661386l825906l050076l397053k737576l258567k023413
16687D7593816k172656k509443j986346k371997j514995j560516j733169j449910
16679C2294784j245089j407491j560820o75639j570134q15435j156314r89454
16671B2874408p31871o99854j084858n92113p85283m71300n78035q82868n26648
16662A6521578l74580p96562k80709o82855o07432J40388r11910j97402n83724
$$ plain form
16653 12226792 12321346 11865109 11241967 11054617 11164324 10334829 10190696 9966279 9430902
16644 9430902 9214137 9276183 8957211 8812593 8216978 8085580 8004155 7608136 7483830 7602721
16634 7602721 7671992 7395556 7063657 6939262 6707267 6718632 6197077 6100206 5987811 5991898
16624 5991898 5463100 5699728 5514036 5351807 5081082 5235867 4849105 4815956 4969180 4874610
16614 4874610 4587331 4943521 4728797 4693312 4868851 4010606 4308520 4116588 3937557 3800180
16604 3800180 4065361 3765806 3916409 3278577 3566801 3731144 3366247 3399116 3696654 3462309
16594 3462309 3182506 3207270 3222010 3046691 2880022 3018854 3104386 3035588 2953713 2957202 2663032
16583 2663032 2498080 2405650 2865069 2460421 2626305 2542618 2286319 2470766 2711051 2453129
$$ packed form
16653A2226792R4554m56237o23142j87350J09707q29495j44133k24417n35377
16644I430902k16765O2046l18972j44618n95615j31398q1425l96019j24306J18891
16634G602721O9271k76436l31899j24395k31995J1365n21555r6871j12395M087
16624E991898n28798K36628j85692j62229k70725J54785l86762l3149J53224r4570
16614D874610k87279L56190k14724l5485J75539q58245K97914j91932j79031j37377
16604C800180K65181k99555J50603o37832K88224J64343l64897L2869K97538k34345
16594C462309k79803K4764J4740j75319j66669J38832Q5532o8798q1875L489k94170
16583B663032j64952r2430M59419m04648J65884q3687k56299J84447K40285k57922
$$ plain form
16573 2453129 2106155 2173551 2336959 1888354 2564506 2358399 2257676 2062042 2301893 1902089
16563 1902089 2141641 2096907 1925875 1651887 1989695 1756014 1694689 1631157 1838118 1871590
16553 1871590 1509129 1784331 1826232 2070590 1801628 1455640 2246103 1635658 1795425 1301583
16543 1301583 1577092 1782809 1509827 1530055 1487348 1406877 1656045 1299920 1148381 1644502
16533 1644502 1588713 1449711 944897 1338562 1522826 1049046 1272563 1203724 1100989 1446898
16523 1446898 982028 1083265 1360968 1577771 1058878 1171014 1560560 1578966 1177190 1375773
16513 1375773 977879 1196903 1094766 971748 952097 1106318 1148306 1100941 861204 736195
16503 736195 1041749 853498 992905 1291940 639801 1069025 1129508 680357 1016493 651615
$$ packed form
16573B453129l46974O7396J63408m48605O76152k06107j00723j95634K39851l99804
16563A902089K39552m4734j71032k73988L37808k33681o1325o3532K06961L3472
16553A871590l62461K75202M1901K44358k68962l45988P90463o10445J59767m93842
16543A301583K75509K05717k72982K0228m2707q0471K49168l56125j51539M96121
16533A644502n5789j39002n04814L93665J84264m73780K23517o8839j02735L45909
16523A446898m64870J01237K77703K16803n18893J12136L89546J8406m01776J98583
16513A375773l97894K19024j02137j23018j9651J54221M1988m7365k39737j25009
16503G36195L05554j88251J39407K99035F39801M29224O0483m49151L36136l64878
$$ plain form
16493 651615 966952 1182503 923852 876648 981302 1078543 1045867 953592 879138 917887 957934
16482 957934 802344 805500 821693 1215387 786931 742657 869724 489374 803249 713039
16472 713039 878658 583140 754482 510614 753314 496979 577298 625362 756169 910737
16462 910737 945345 582284 799114 561835 684092 484733 447559 471889 443179 771596
16452 771596 658533 287430 712134 617458 582964 630122 609216 325691 517721 403694
16442 403694 477148 542355 441914 326051 407721 1134662 785787 306694 497230 733732
16432 733732 402081 523368 450270 742250 406666 345678 936639 257093 551824 199949
16421 332953 641531 983032 666157 419232 569243 219830 448588 379667 906794 473698
$$ packed form
16493F51615L15337K15551k58651m7204J04654R7241l2676r2275p4454L8749M0047
16482I57934j55590L156J6193L93694m28456m4274J27067l80350L13875r0210
16472G13039J65619k95518J71342k43868K42700k56335Q0319M8064J30807J54568
16462I10737L4608l63061K16830k37279J22257j99359l7174K4330k8710L28417
16452G71596j13063B87430M24704r4676l4494M7158k0906k83525J92030j14027
16442D03694P3454O5207j00441j15863Q1670P26941l48875C06694J90536K36502
16432G33732l31651J21287p3098K91980l35584o0988N90961B57093K94731A99949
16421C32953L08578L41501l16875k46925J50011B19830K28758o8921N27127m33096
$$ plain form
16411 473698 704201 474435 361602 190502 662002 499857 793225 328938 395076 391659
16401 391659 669273 433608 698662 346463 107584 340075 369376 86352 323273 327707
16391 327707 597321 282292 536704 193067 237755 325379 167991 515519 297047 415863
16381 415863 214808 266842 198906 608593 329430 252034 473178 518276 515003 445268 489891
16370 489891 -88580 375193 191385 801443 212774 56776 354140 523916 170504 28719
16359 317333 55380 391755 -8560 127249 210998 379682 540883 91426 47823 413203 307505
16348 307505 378275 391467 532513 160883 92214 -61285 320854 1584 55158 223735 374638
16337 374638 426602 394232 193657 380205 262456 62270 162699 201434 208778 347139 79232
$$ packed form
16411D73698K30503k29766j12833j71100M71500j62145K93368C28938O6138l417
16401C91659K77614k35665K65054C46463A07584K32491K9301H6352K36921M434
16391C27707K69614B82292K54412A93067M4688Q7624j57388L47528k18472J18816
16381D15863k01055N2034o7936M09687k79163p7396K21144M5098l273o9735M4623
16370D89891h8580C75193j83808O10058B12774E6776K97364J69776A70504B8719
16359C17333E5380L36375h560A27249Q3749J68684J61201I1426m3603L65380j05698
16348C07505P0770J3192J41046A60883o8669f1285C20854A584N3574J68577J50903
16337C74638N1964l2370A93657J86548j17749F2270J00429L8735P344J38361G9232
$$ plain form
16325 200315 23055 176079 -8360 439152 409709 203152 271272 288829 237766 670685 371
16313 297843 179464 175045 125577 140254 80713 180588 262977 247152 -126191 175371 154932
16302 154932 412753 324420 95738 161573 94505 195609 160431 229832 432575 179265 73397
16290 103660 326265 121002 232350 662184 351787 -13272 539083 401253 230367 163936
16280 163936 92074 -294597 108262 109912 -208973 425329 210492 144421 293842 417799
16270 417799 366981 14427 18120 260980 114656 26285 28444 -93958 61228 101191 138628
16259 138628 70566 91702 172336 122705 437656 39277 388032 300669 -20914 -296947 -177489
16248 -177489 202506 -107229 210343 116046 84105 76678 81847 334033 -139352 -214850 -207590
$$ packed form
16325B00315B3055J53024h360D39152k9443B03152O8120J7557n1063M32919C71
16313B97843j18379m419m9468J4677n9541R9875Q2389j5825a26191A75371k0439
16302A54932K57821q8333I5738O5835o7068J01104l5178O9401K02743A79265G3397
16290A03660K22605A21002J11348M29834l10397a3272E39083j37830j70886o6431
16280A63936p1862b94597A08262J650b08973D25329B10492o6071J49421J23957
16270D17799n0818A4427L693K42860A14656B6285K159i3958F1228L9963L7437
16259A38628o8062K1136Q0634m9631L14951C9277L48755q7363b0914k76033J19458
16248a77489B02506a07229B10343r4297l1941p427N169K52186a39352p5498P260
$$ plain form
16237 -207590 230573 -152813 81004 13533 -12380 166298 71185 -39222 59165 245605 457660
16226 457660 -200711 -130107 5085 20585 104717 -68796 62681 146595 69168 512568 169 -355129
16213 -121734 38024 68972 204747 64060 -39329 88008 -69109 -48207 -225686 183293 128307
16202 128307 68812 192556 -147570 68525 202639 24212 48703 55071 309999 -194372 456050
16190 -196313 34976 70358 136941 233983 -9368 -185378 95194 121218 -74568 121688 -239800
16178 228195 279466 240274 92092 34322 1793 -190999 -258398 106688 81669 -13049 -156748
16167 -156748 135212 112142 -35345 -286972 17629 210530 -34707 -226848 312886 14934
16156 -94764 201038 27900 -263462 82941 168686 -33794 164611 -245374 170428 17961 285767
$$ packed form
16237b07590B30573a52813H1004A3533a2380A66298G1185c9222E9165J86440K12055
16226D57660b00711P0604E085J5500Q4132f8796F2681Q3914F9168M43400A69c55129
16213a21734C8024L0948J35775F4060c9329H8008f9109K0902j77479A83293n4986
16202A28307n9495J23744a47570F8525J34114B4212K4491O368K54928a94372D56050
16190a96313C4976L5382O6583R7042i368j76010I5194K6024g4568A21688b39800
16178B28195N1271l9192I2092C4322A793a90999o7399A06688k5019a3049j43699
16167a56748A35212k3070c5345k51627A7629J92901c4707j92141C12886A4934
16156i4764B01038B7900b63462H2941Q5745c3794A64611b45374A70428A7961K67806
$$ plain form
16145 285767 -9085 57315 279352 29822 -222251 -141763 23803 95983 -179508 -77958 -40191
16134 -40191 -9067 -140662 -79834 217160 -76473 164701 306251 24775 163161 -329886 235003
16122 231890 100353 -109158 271072 91543 -129012 98357 -95031 136880 102709 -224112
16111 -172213 -72184 -246015 -149599 -259427 -196952 63268 -29570 -107311 184749 300450 253436
16100 253436 296870 218110 -159401 81488 153778 574832 19540 135892 -31702 41723 -52852
16088 -134687 -81261 22362 -25225 147413 -167767 -157534 1666 -5223 -116906 117233 209276
16077 209276 76780 -45001 6145 -168587 73977 -23622 -106348 147854 241977 -124872 58785
16065 172356 -23225 -140631 158157 254297 113240 -81721 204607 -77919 51296 190031
$$ packed form
16145B85767i085E7315K22037B9822b22251Q0488B3803P2180a79508g7958L7767
16134d0191i067j31595O0828B17160g6473A64701J41550B4775J38386c29886B35003
16122B31890A00353a09158B71072I1543a29012I8357i5031A36880l4171b24112
16111a72213g2184j73831R6416j09828O2475F3268b9570p7741A84749J15701m7014
16100B53436M3434p8760a59401H1488P2290M21054A9540J16352c1702D1723e2852
16088a34687N3426B2362b5225A47413a67767J0233A666e223j11683A17233R2043
16077B09276G6780d5001F145a68587G3977b3622q2726A47854R4123a24872E8785
16065A72356b3225j17406A58157R6140A13240h1721B04607g7919E1296J38735
$$ plain form
16055 190031 -85440 -251333 198143 -246849 -121156 -16556 206573 150915 44798 -209473
16044 78508 106483 190413 -36745 62507 -186923 -112393 148881 -112560 -166350 157028 -216439
16032 -273369 41024 -178254 5716 -67151 84560 28840 129334 -16622 -170142 153828 -97449
16020 146294 149417 324638 496559 -193503 357063 71226 54621 240181 176033 209264 227687
16009 227687 188233 -332038 327538 64825 -173254 68541 -70171 2593 -105610 284555 -3310
15997 182418 15130 -62454 232178 23397 177599 83397 -85492 -280216 100956 286482
15987 286482 -124331 -74988 410858 -183947 149644 585677 340854 14238 218919 -126881
15976 -202602 -197597 -148653 -256420 -186953 -4585 -53934 134687 -83908 324387 74042 26827
$$ packed form
16055A90031h5440j65893A98143b46849a21156a6556B06573n5658D4798b09473
16044G8508K7975Q3930c6745F2507a86923P4530A48881a12560n3790A57028b16439
16032b73369D1024a78254E716f7151H4560B8840J00494a6622j53520A53828i7449
16020A46294L123J75221J71921a93503C57063G1226j6605J85560o4148L3231J8423
16009B27687l9454c32038C27538F4825a73254F8541g0171B593a05610B84555c310
15997A82418A5130f2454B32178B3397J54202H3397h5492j94724A00956J85526
15987B86482a24331M9343D10858a83947A49644M36033k44823A4238K04681a26881
15976b02602N005M8944j07767O9467d585m9349A34687h3908C24387G4042B6827
$$ plain form
15964 -167731 -188773 -212386 107060 -222671 199649 22277 273314 183854 -143202 -473650
15954 -473650 -128452 -181927 22673 39438 30330 50806 -437847 292896 137007 -7875 113511
15942 77018 -7017 -94852 48764 -85783 161836 133491 -37661 -2492 -273997 288126 -57232
15930 -152561 -142441 25319 -64458 -81254 18365 -106861 33506 -279155 143861 -287125 88512
15918 -22136 -94080 -136043 30167 182061 -80511 -238387 41459 147794 -136786 186191 -218406
15906 76418 -262020 -124947 -294381 37638 -35524 -174022 -523464 82069 11222 -132401
15895 170075 -126092 -189559 -17942 106198 -109081 -136356 -49807 70531 -110181 -211146
15885 -211146 191659 -62666 -90228 89917 -194656 -169108 23760 -50996 131257 192238 -143027
$$ packed form
15964a67731k1042k3613A07060b22671A99649B2277K51037q9460a43202l30448
15954d73650a28452n3475B2673J6765r108K0476d37847B92896A37007g875A13511
15942G7018g017q7835D8764h5783A61836k8345c7661b492k71505B88126e7232
15930a52561J0120B5319f4458j6796A8365a06861C3506b79155A43861b87125H8512
15918b2136p1944m1963C0167J51894h0511j57876D1459J06335a36786A86191b18406
15906G6418b62020a24947j69434C7638c5524j38498l49442H2069A1222a32401
15895A70075a26092o3467a7942A06198a09081k7275d9807G0531a10181j00965
15885b11146A91659f2666k7562H9917a94656K5548B3760e0996A31257O0981a43027
$$ plain form
15873 -249578 -244348 -43278 -60779 -16364 67051 -125475 173302 -132223 10827 74286 -186970
15861 2630 -101159 33229 106219 264961 94934 -56447 -3075 -87086 211805 -40708 16296
15849 282806 -176018 -74265 -269514 -195839 43933 50692 -81927 142801 -187964 -19943 23219
15837 100446 -276678 150224 108885 -231508 260297 328757 -296589 -212396 -213907 -188287 -147033
15826 -147033 32980 -217690 -99417 214340 -90903 190653 30781 -125089 20422 66982 179259
15815 179259 -330326 -9411 -237555 178042 -107382 147613 3905 73344 -32397 -35075 16726
15803 -34542 287558 -164130 -4845 84876 132646 -66679 -73573 -215291 41546 135624 -109561
15791 215819 -343232 5797 -147211 -251318 -140481 12621 -183375 -356852 -21760 50305
$$ packed form
15873b49578N230d3278j7501a6364F7051a25475A73302a32223A0827O3459a86970
15861B630a01159C3229P2990J58742I4934e6447c075q4011B11805d0708A6296
15849B82806a76018g4265j95249P3675D3933O759h1927A42801a87964a9943B3219
15837A00446b76678A50224m1339b31508B60297O8460b96589Q4193j511K5620M1254
15826a47033C2980b17690i9417B14340i0903A90653C0781a25089B0422M6560J12277
15815A79259c30326i411k28144A78042a07382A47613C905O9439c2397k678A6726
15803c4542B87558a64130d845H4876M7770f6679o894j41718D1546R4078a09561
15791B15819c43232E797a47211j04107J10837A2621a83375j73477b1760E0305
$$ plain form
15780 -92612 -139988 61567 -192567 -128962 -317367 91654 -518595 -152015 80988 29236 -95918
15768 -423905 131010 -328097 368061 110062 -24202 194460 -190733 230300 378444 -66933
15757 50539 79353 124666 163185 31765 20166 18927 -257151 139720 -84804 151756 -340187
15745 235726 66274 123184 304483 59531 -30870 -275134 58079 -192915 204743 3603 240202
15734 240202 -339915 30084 281144 -118377 533879 -52093 -104016 -126333 274139 -290894
15723 38443 113657 -168215 -282236 93997 -92438 -120879 -167194 -231372 70342 -289396 -73327
15711 -39236 118194 -174124 60598 -80276 -219204 48585 85975 148973 -41630 71981 -90621
15699 58823 -175214 -252784 -102068 -340041 82517 107826 116006 272119 337012 107613 50749
$$ packed form
15780i2612m7376F1567a92567O3605j88405I1654e18595a52015H0988B9236i5918
15768d23905A31010c28097C68061A10062b4202A94460a90733B30300J48144f6933
15757E0539K8814M5313L8519C1765j1599j239b57151A39720h4804A51756c40187
15745B35726F6274N6910J81299E9531c0870k44264E8079a92915B04743C603K36599
15734B40202c39915C0084K51060a18377E33879e2093n1923k2317B74139b90894
15723C8443P5214a68215j14021I3997i2438k8441m6315o4178G0342b89396g3327
15711c9236A18194a74124F0598h0276j38928D8585L7390O2998d1630G1981i0621
15699E8823a75214p7570a02068k37973H2517K5309Q180J56113O4893A07613E0749
$$ plain form
15687 -48206 67409 -107695 -98567 -357252 54246 108228 -55067 28841 30013 -218715 -263853
15676 -263853 -66036 -67231 18998 -146825 233066 80011 -27078 -299379 -117565 -113020 -22790
15664 146429 -332458 62390 -261032 149702 -211462 -36144 -318412 90112 -170036 -73992
15653 -306233 -15922 -111098 -476802 -198353 73498 -352863 -106025 11433 -221304 15932
15642 223127 -222087 48512 -190795 -113872 371568 116589 -59710 24297 -362806 105634
15631 -238853 -18991 -10628 -120236 117868 126990 -381864 224024 90812 -64759 -309393 307345
15619 -14918 45707 -117907 -153721 81271 43029 -103898 322705 -246660 13155 57296 65843
15608 65843 -38233 -19354 227610 -350 -378939 -254726 21405 -40959 82453 32321 274448
$$ packed form
15687d8206F7409a07695R128k58685E4246N3982e5067B8841J172b18715m5138
15676b63853f6036j195A8998a46825B33066H0011b7078k72301a17565M545b2790
15664A46429c32458F2390b61032A49702b11462c6144k82268I0112a70036g3992
15653c06233a5922r5176l65704a98353G3498c52863a06025A1433b21304A5932
15642B23127b22087D8512a90795P6923C71568A16589e9710B4297c62806A05634
15631b38853a8991Q363j09608A17868R122c81864B24024I0812f4759k44634C07345
15619a4918D5707a17907l5814H1271l8242a03898C22705b46660A3155M4141Q547
15608F5843c8233J8879B27610c50l78589J24213B1405d0959H2453C2321K42127
$$ plain form
15597 274448 91933 -41076 -135950 123892 -8313 -187517 -85755 -368993 165710 -194889 -859
15585 -21740 271468 -237169 -158800 111816 -1423 -186130 -9097 21346 -140727 -5375 -28157
15574 -28157 -239472 -39043 227053 -109998 56817 -69460 -236929 125281 67822 -80620 217814
15562 -2141 96221 -169158 86947 165054 -124697 -79774 -88718 279307 224483 170488 -210679
15550 -146838 -21806 11746 -123076 -297279 507941 -147863 -303443 -244248 -244792 85228 -9449
15538 113888 -117606 -113972 -30223 182776 35920 -273514 -118200 -136738 -317130 42627 96660
15527 96660 311944 -64340 36772 166546 189076 55285 -168316 -141532 -408715 362734 -14558
15515 -19446 -141551 -241104 93070 61961 191735 67248 39532 351385 80827 -44300 59032
$$ packed form
15597B74448I1933d1076r4874A23892h313j79204h5755k83238A65710a94889h59
15585b1740B71468b37169P8369A11816a423j84707i097B1346a40727e375k2782
15574b8157k11315c9043B27053a09998E6817f9460j67469A25281n7459h0620B17814
15562b141I6221a69158H6947P8107a24697M4923q944B79307n4824n3995b10679
15550a46838b1806A1746a23076j74203E07941a47863j55580N9195n44H5228i449
15538A13888a17606L634c0223A82776C5920b73514a18200j8538j80392D2627N4033
15527I6660K15284f4340C6772J29774K2530E5285a68316K6784k67183C62734a4558
15515a9446j22105r9553I3070l1109J29774F7248k7716L11853H0827d4300E9032
$$ plain form
15503 -88351 -251222 203403 -202664 107157 70801 131324 -142886 -17389 -230277 147158
15492 -88517 118160 -60009 104007 -83997 26640 50633 -63152 -52407 -216847 -233771 12309
15480 -35690 -345816 -135413 -8246 -169459 62744 46872 -210298 87534 62043 -71424 84813
15468 -23161 210920 -50917 -109496 78770 -95549 52487 -28564 135366 -228630 -66753 -162061
15457 -162061 -160648 -78165 36508 -182703 -194625 -94553 -157881 45855 -71944 -122886 7198 -108669
15444 -314382 -102208 69249 38267 260144 -144023 40602 -251440 54412 335741 -28825
15433 84008 -70812 36331 84152 -207647 80792 38561 -310712 -167646 -45094 -86660 76317
15421 134445 -214276 -28787 56416 -204955 205543 -14857 60487 61953 -105412 121197 -90636
$$ packed form
15503h8351j62871B03403b02664A07157l6356O0523a42886a7389k12888A47158
15492h8517A18160f0009A04007h3997B6640K3993f3152J0745j64440j6924A2309
15480c5690l10126a35413h246j61213F2744j5872b10298H7534k5491g1424H4813
15468b3161B10920e0917n8579G8770i5549E2487b8564A35366b28630f6753r5308
15457a62061J413g8165C6508a82703j1922i4553o3328D5855g1944n0942G198a08669
15444c14382a02208F9249l0982K21877a44023D0602b51440E4412K81329b8825
15433H4008g0812C6331M7821b07647H0792C8561c10712J43066d5094m1566G6317
15421A34445b14276b8787E6416b04955B05543a4857F0487J466a05412A21197i0636
$$ plain form
15409 23857 -134947 -12598 27952 -185508 -100651 -115876 -126886 -229055 176820 3015 117689
15398 117689 -92475 -324820 -3794 -116897 -262342 220810 -75852 -119112 -138974 -14163 -141368
15387 -141368 -120067 -32755 41407 -183437 -42103 -59365 40101 53049 230156 43262 -267204
15375 57871 -79154 304660 -24979 175759 -167708 -202476 121353 124591 189851 -223705 -266497
15364 -266497 309733 69587 -66105 17276 -35722 5345 -79181 48903 -140296 62218 76921
15353 76921 -143665 256329 -85789 9084 -139715 -128798 -34569 110402 -410955 -236665 40355
15341 -58636 -257834 -41361 314105 65174 175888 515854 38226 -91491 -46063 -82216 284203
15329 84088 175634 -171030 -17869 235178 -303246 -180534 72599 334643 -142870 126315
$$ packed form
15409B3857a34947a2598B7952a85508Q4857j5225j1010j02169A76820C015J14674
15398A17689i2475k32345c794j13103j45445B20810g5852m3260j9862a4163j27205
15387a41368K1301c2755D1407a83437d2103j7262D0101J2948J77107D3262b67204
15375E7871g9154C04660b4979A75759a67708l4768A21353L238O5260b23705m2792
15364b66497C09733F9587f6105A7276c5722E345g9181D8903a40296F2218J4703
15353G6921a43665B56329h5789I084a39715J0917c4569A10402d10955J74290D0355
15341e8636j99198d1361C14105F5174J10714L39966C8226i1491M5428l6153B84203
15329H4088R1546a71030a7869B35178c03246J22712G2599K62044a42870A26315
$$ plain form
15318 117555 -27071 -197215 151176 -32530 -260958 327412 58116 -214348 -105230 -78784
15308 -78784 206152 144406 289352 -257066 50600 72769 101314 -182944 147131 49506 -99252
15296 69741 97351 121934 -22933 -125664 56525 126712 180494 -293724 160667 -15112 63338
15284 32069 69646 65691 360385 -169999 34772 30079 61828 -32922 145853 67508 221195
15273 221195 218382 41769 90778 297713 -180749 -5281 -170196 -176513 212525 5157 305806
15262 305806 -48939 48386 97270 -203803 3826 -141525 288092 -47372 230974 -107149 81324
15250 471131 399258 906591 1660651 1179955 1372960 746900 299829 -25816 275422 114108
15239 197002 -179413 107608 -443952 -33699 -104175 -65094 156063 -138793 65050 -7833 -92678
$$ packed form
15318A17555b7071j70144A51176c2530k28428C27412E8116b14348a05230K6446
15308g8784B06152o1746J44946b57066E0600K2169K8545a82944A47131D9506i9252
15296F9741K7610K4583b2933j02731E6525P0187N3782b93724A60667a5112F3338
15284C2069L7577l955K94694a69999C4772m693L1749c2922A45853F7508J53687
15273B21195k813D1769M9009K06935a80749e281j64915o317B12525E157L00649
15262C05806d8939D8386M8884b03803C826a41525B88092d7372B30974a07149H1324
15250D71131p1873N07333P54060m80696J93005o26060B99829b5816B75422A14108
15239A97002a79413A07608d43952c3699p0476L9081A56063a38793F5050g833q4845
$$ plain form
15228 -92678 58194 444997 166532 -96655 67627 125550 85255 -448439 34672 -19482 67248
15216 74374 -153707 -257338 -41055 124927 207287 82563 49700 -121382 -45420 -87298 -183998
15205 -183998 109675 182968 134672 242498 -132911 -39131 127562 47881 126413 -257081
15194 -144394 -81281 -41248 -204286 100461 418102 -31779 -72214 -1461 60300 253252 -216090
15182 71690 155857 -43814 97258 -57900 141443 118105 -255563 -151141 284808 -242259 382490
15170 -231388 -72666 136997 133204 193054 123282 106428 -131035 -167213 69571 106437 -59819
15158 -103407 133868 239857 -256805 79993 -98046 73395 -243049 236655 315796 194844
15148 194844 186697 -119436 55614 -51777 106684 -122238 325335 216800 -175609 358814
$$ packed form
15228i2678E8194L86803A66532i6655F7627N7923m0295d48439C4672a9482F7248
15216G4374a53707j03631d1055A24927Q2360H2563l2863a21382d5420m1878r6700
15205a83998A09675P3293m8296J07826a32911c9131A27562D7881P8532b57081
15194a44394O3113M0033j63038A00461L17641c1779m0435a461F0300J92952b16090
15182G1690Q4167d3814I7258e7900A41443k3338b55563J04422B84808b42259C82490
15170b31388g2666A36997l793N9850o9772j6854a31035l6178F9571L6866e9819
15158a03407A33868J05989b56805G9993i8046G3395b43049B36655P9141j20952
15148A94844q147a19436E5614e1777A06684a22238C25335j08535a75609C58814
$$ plain form
15137 462230 51108 337613 -55873 -61816 -92848 20097 267587 113056 -112943 -303722 350639
15125 -99922 -331087 170079 135505 -121785 94260 161015 400609 164880 265185 170620
15115 170620 -150675 -30066 80445 -157559 123420 10741 -141787 -270103 153313 313848
15105 313848 103556 35668 115571 -77236 202192 59675 235453 -11414 -170321 -385004
15095 -385004 -14618 116755 -10259 66133 265047 175172 90287 32271 157069 49089 291257
15084 291257 313015 132878 437116 -198011 -78472 349215 51076 -5790 419316 -10551 148483
15072 -20576 -141490 80789 339068 -128103 152899 210559 95758 -518336 63357 491023
15062 491023 189224 204521 193894 -93300 168245 262988 64114 -29719 -57305 45527 85170
$$ packed form
15137D62230E1108K86505e5873n943l1032B0097K47490A13056a12943j90779C50639
15125i9922k31165A70079l4574a21785I4260O6755K39594A64880J00305r4565
15115A70620a50675c0066H0445a57559A23420A0741a41787j28316A53313J60535
15105C13848A03556C5668P9903g7236B02192E9675J75778a1414j58907k14683
15095c85004a4618A16755a0259F6133J98914q9875q4885C2271J24798D9089K42168
15084B91257K1758A32878L04238a98011g8472C49215E1076e790D19316a0551A48483
15072b0576j20914H0789K58279a28103A52899N7660I5758e18336F3357M27666
15062D91023A89224J5297j0627i3300A68245R4743F4114b9719k7586D5527L9643
$$ plain form
15051 85170 147992 298744 149761 14109 194866 -112866 -19974 458537 444279 211391
15040 391688 5328 417397 -48714 594476 441890 117642 138103 93985 237251 194856 132001
15029 132001 -34585 77420 237296 148324 469 250182 221337 -3511 330067 44182 188772
15018 188772 149603 531539 334153 -94559 28718 347525 407498 487493 308250 356402 139668
15006 83258 300217 83600 385573 -82278 -230669 50262 447566 180103 -69176 141564
14995 119614 243117 121076 -245862 282612 27084 286074 193647 -102341 362077 237789
14985 237789 337246 216841 101233 134678 -20778 287718 329475 91024 385467 24846 130497
14974 130497 130261 169493 324547 92612 278110 53407 242944 284061 406533 173455 370431
$$ packed form
15051H5170O2822J50752j48983A4109J80757a12866a9974D58537j4258B11391
15040C91688E328M12069d8714E94476j52586A17642K0461m4118J43266m2395o2855
15029A32001c4585G7420J59876q8972D69K49713k8845c511C30067D4182J44590
15018A88772l9169L81936j97386i4559B8718L18807N9973P9995j79243M8152A39668
15006H3258K16959H3600L01973h2278j48391E0262L97304A80103f9176A41564
14995A19614J23503A21076b45862B82612B7084K58990r2427a02341C62077j24288
14985B37789R9457j20405A01233L3445b0778B87718M1757I1024K94443B4846J05651
14974A30497k36L9232J55054I2612J85498E3407J89537M1117J22472A73455J96976
$$ plain form
14963 370431 -89061 -145374 -31979 451036 205039 316619 273292 206745 317288 33066 23399
14952 23399 158400 87553 44101 183753 355328 370046 161353 112628 247629 152327 312320
14941 312320 225211 131311 -103352 259788 362597 299016 720508 204828 298956 217975
14931 217975 88167 41816 295820 218309 408152 343160 18396 75582 125812 110382 346911
14920 346911 34353 307299 236588 -116590 378343 237621 192145 226227 134125 124872 112580
14909 112580 661316 302394 76473 232529 340326 358800 263101 225573 295124 401741
14899 401741 720762 139602 150704 213844 353219 188522 218242 87706 64531 262982
14889 262982 361447 336822 534986 117637 550300 234660 91419 504579 459365 147840
$$ packed form
14963C70431h9061n6313c1979D51036B05039J11580m3327o6547J10543C3066r667
14952B3399J35001p0847m3452J39652J71575J4718A61353m8725J35001r5302J59993
14941C12320q7109r3900a03352B59788J02809o3581M21492B04828R4128q0981
14931B17975H8167D1816K54004p7511J89843o4992A8396N7186N0230j5430K36529
14920C46911C4353K72946p0711a16590C78343j40722m5476L4082r2102r253j2292
14909A12580N48736C02394G6473J56056J07797J8474r5699l7528O9551J06617
14899D01741L19021A39602J1102O3140J39375j64697K9720H7706k3175J98451
14889B62982R8465k4625J98164A17637M32663B34660I1419M13160m5214A47840
$$ plain form
14878 267618 444560 437956 434227 423 313581 69051 351791 414448 429697 42135 404676
14867 404676 458603 578308 611647 316804 67594 507106 100898 553981 436886 328861
14857 328861 667106 467275 356376 170601 362692 231021 402973 205111 624014 156827
14846 476978 252373 242602 35437 662425 388243 51609 433681 189894 198990 340761 802941
14835 802941 568767 596849 502934 248022 389417 314294 382869 28613 493111 253344
14825 253344 580584 869781 517295 467051 287074 453938 619531 257783 441781 166187
14814 551322 662373 416838 614214 592260 615156 228421 232656 627144 320044 231166
14804 231166 109518 301313 202460 164354 406959 357415 390643 474482 607669 523164 642419
$$ packed form
14878B67618J76942o604l729D23L13158F9051K82740O2657J5249D2135L62541
14867D04676N3927J19705L3339k94843F7594M39512A00898M53083j17095j08025
14857C28861L38245j99831j10899A70601J92091j31671J71952j97862M18903A56827
14846D76978k24605r771C5437O26988k74182E1609L82072A89894R096J41771M62180
14835H02941k34174K8082r3915B48022J41395p5123O8575B8613M64498k39767
14825B53344L27240K89197l52486n0244j79977J66864J65593B57783J83998A66187
14814E51322J11051k45535J97376k1954K2896B28421M235L94488l07100q8878
14804B31166A09518J91795r8853l8106K42605m9544L3228Q3839J33187q4505J19255
$$ plain form
14793 642419 198867 789792 373484 495397 310441 233856 229765 389262 428780 659150
14783 659150 521746 488034 436314 409274 446627 786637 497883 603058 521164 389087
14773 389087 149584 521149 587457 19502 448040 259286 617717 513847 164816 -49947
14762 752700 690901 596837 589473 790339 847572 637181 487474 531731 656810 608352 576985
14751 576985 659109 793765 649498 384144 302356 806362 689986 770200 533561 658424
14741 658424 840496 384063 466670 461158 730026 529907 680851 713039 389593 384445 563785
14730 563785 893453 548823 387384 635635 639977 519385 804230 486736 931932 666279
14720 666279 527863 814501 680761 437859 411453 600938 804974 647622 906902 602258
$$ packed form
14793F42419A98867N90925C73484J21913j84956p6585m091J59497L9518K30370
14783F59150j37404l3712n1720k7040L7353L40010k88754J05175q1894j32077
14773C89087A49584L71565O6308A9502M28538j88754L58431j03870A64816d9947
14762G52700o1799r4064p364K00866N7233k10391j49707M4257J25079m8458l1367
14751E76985Q2124J34656j44267k65354q1788N04006j16376Q0214k36639J24863
14741F58424J82072C84063Q2607n512K68868k00119J50944L2188l23446n148J79340
14730E63785L29668l44630j61439K48251M342j20592K84845l17494M45196k65653
14720F66279j38416K86638j33740k42902k6406J89485K04036j57352K59280l04644
$$ plain form
14710 602258 726858 1161374 519874 781564 703970 638647 694504 581091 469851 1242678
14700 1242678 765759 581010 706811 1074277 512406 917863 635882 690557 698261 330498
14689 594304 620316 879646 864902 768182 896712 699925 860316 861542 767187 870166 909792
14678 909792 701276 905701 793831 586386 482524 789131 727624 1084433 902136 918337
14668 918337 628371 510660 539876 994576 515079 836986 737159 832912 692651 655747
14658 655747 1094001 884854 1026054 701952 819106 1146353 806554 1039634 951927 865302
14648 865302 963512 807167 1025236 764161 740577 933973 1004467 1018668 1254269 1176692
14638 1176692 929005 1153546 1065485 1223248 1287899 1209111 1242101 990181 1057598 1197049
$$ packed form
14710F02258J24600M34516E19874K61690p7594o5323N5857j13413j11240P72827
14700A242678m76919j84749J25801L67466E12406M05457k81981N4675P704C30498
14689E94304K6012K59330j4744r6720J28530j96787J60391J226r4355J02979L9626
14678I09792k08516K04425j11870k07445j03862L06607o1507L56809j82297J6201
14668I18337k89966j17711K9216M54700m79497L21907r9827R5753j40261l6904
14658F55747M38254k09147J41200l24102J17154L27247l39799K33080q7707q6625
14648H65302R8210j56345K18069k61075k3584J93396P0494J4201K35601p7577
14638A176692k47687K24541q8061J57763O4651p8788L2990k51920O7417J39451
$$ plain form
14628 1197049 1196452 1595141 1461263 1437121 1277131 999962 1254483 1204007 1166950 1500195
14618 1500195 1089518 1415361 1402166 1275417 1011753 1215602 1196653 1123489 1616895 1307565
14608 1307565 1249907 1361801 1338150 1331129 1458822 1067445 1175575 1134534 1421982 1470078
14598 1470078 1516819 1471392 1413085 1768706 1641077 1483241 1439864 1635218 1493181 1418563
14588 1418563 1734413 1761217 1487530 1569734 1579754 1528849 1658650 1690800 1639831 1951214
14578 1951214 1647987 1540893 1691818 1884950 1664799 1752755 1922253 1851948 1684681 1597625
14568 1597625 1804696 2162999 1985888 2168464 2065981 2085777 2408695 2298175 2522328 2251226
14558 2251226 2590956 2558877 2455522 2973206 2935096 3300125 3524479 3977350 4784007 6253838
$$ packed form
14628A197049n97L98689j33878k4142j59990k77169K54521n0476l7057L33245
14618A500195m10677L25843j3195j26749k63664K03849j8949p3164M93406l09330
14608A307565n7658J11894k3651p021J27693l91377J08130m1041K87448M8096
14598A470078M6741m5427n8307L55621j27629j57836m3377J95354j42037p4618
14588A418563L15850K6804k73687Q2204J0020n0905J29801L2150n0969L11383
14578A951214l03227j07094J50925J93132k20151Q7956J69498p0305j67267q7056
14568A597625K07071L58303j77111J82576j02483J9796L22918j10520K24153k71102
14558B251226L39730l2079j03355N17684l8110L65029K24354M52871Q06657J469831
$$ plain form
14548 6253838 9439758 17619696 36437561 48240153 22117032 8329845 4019618 2823013
14540 2823013 2278013 2153896 2220905 1693870 1747763 1699492 1605802 1694264 1876599 1696388
14530 1696388 1902872 2177981 1908464 1993045 1906096 2192707 2053765 1867690 2388845 2203790
14520 2203790 1978428 2139494 2500773 2114317 2533838 2366512 2719066 2565703 2389814
14511 2389814 2550688 2525291 2309448 2364635 2507660 2263008 2721520 2625675 2740170 2950247
14501 2950247 2588856 2558932 2705515 2973057 2795869 2565338 3301604 2803909 2785293 2984159
14491 2984159 2772346 2932794 3132846 2956349 3060923 3248008 3381413 3212099 3247374 3027673
14481 3027673 3535030 3191720 3439358 3253396 3712812 3625329 3589895 3382639 3654734 3818594
$$ packed form
14548F253838L185920Q179938J8817865J1802592B2117032H329845D019618j196605
14540B823013n45000j24117O7009n27035N3893m8271r3690Q8462J82335j80211
14530A696388K06484K75109k69517Q4581q6949K86611j38942j86075N21155j85055
14520B203790k25362J61066L61279l86456M19521j67326L52554j53363j75889
14511B389814J60874k5397k15843N5187J43025k44652M58512r5845J14495K10077
14501B950247l61391k9924J46583K67542j77188k30531P36266m97695j8616J98866
14491B984159k11813J60448K00052j76497J04574J87085J33405j69314L5275k19701
14481C027673N07357l43310K47638j85962M59416q7483l5434k07256K72095J63860
$$ plain form
14471 3818594 3997705 3830509 3923363 3983427 3848659 4115982 3698702 4052262 3785688 3974184
14461 3974184 3942106 4059885 4823335 4640154 4577884 4498444 4643732 4758489 4613541 4745741
14451 4745741 4621713 4362850 4609098 4737180 4580819 5151615 4950606 5101599 5134808 5300709
14441 5300709 5338843 5307703 5093268 5638476 5541653 5340304 5280942 5611011 5875327 5801481
14431 5801481 6111707 6029409 6096192 6343147 6286088 6373228 6340880 6335432 6442012 6447163 6538740
14420 6538740 6809271 6980777 7061061 7309866 7433115 7854396 7527024 7392953 7534749 7486336
14410 7486336 7972752 8337060 8230737 8062534 8099204 8590688 8385191 8827035 9107709 8997484
14400 8997484 9331452 9366291 9672720 9350507 9834208 10041845 10274824 10190360 10258321 10340314
$$ packed form
14471C818594J79111j67196R2854O0064j34768K67323m17280L53560k66574J88496
14461C974184l2078J17779P63450j83181o2270p9440J45288J14757j44948J32200
14451D745741j24028k58863K46248J28082j56361N70796k01009J50993L3209J65901
14441E300709L8134l1140k14435N45208r6823k01349n9362L30069K64316p3846
14431E801481L10226q2298O6783K46955n7059Q7140l2348n448J06580N151R1577
14420F538740K70531J71506Q0284K48805J23249M21281l27372j34071J41796m8413
14410G486336M86416L64308j06323j68203L6670M91484k05497M41844K80674j10225
14400H997484L33968L4839L06429l22213M83701K07637K32979q4464O7961Q1993
$$ plain form
14390 10340314 10832309 11220146 11239858 11506022 12065754 12048941 12211232 12261246 12684009 12790925
14380 12790925 13025506 12965759 13621538 13685147 13975252 14400022 14420713 14690132 14935669 15495557
14370 15495557 15644649 16029737 16199084 17032263 17052222 17409879 17985479 18006377 18483865 18970316
14360 18970316 19081870 19890313 20234968 20747560 21196543 21846401 22345661 22325792 23290491
14351 23290491 24071074 24586415 24940806 25587578 25978871 27052858 27053039 28319874 29028648
14342 29028648 29695661 30351406 31245015 32392382 33107417 34219598 35422426 36236199 37127210
14333 37127210 38144205 39507664 40645153 41852872 43518892 44472556 46082802 47613835
14325 47613835 49304439 51047637 52730563 54714582 56599264 58693180 60740110 62731616
$$ packed form
14390A0340314M91995L87837J9712K66164N59732j6813J62291N0014M22763J06916
14380A2790925K34581n9747O55779O3609K90105M24770K0691K69419K45537N59888
14370A5495557J49092L85088J69347Q33179J9959L57657N75600K0898M77488M86451
14360A8970316J11554Q08443L44655N12592M48983O49858M99260j9869R64699
14351B3290491P80583N15341L54391O46772L91293J073987J81J266835P08774
14342B9028648O67013O55745Q93609J147367P15035J112181J202828Q13773Q91011
14333C7127210J016995J363459J137489J207719J666020R53664J610246J531033
14325D7613835J690604J743198J682926J984019J884682K093916K046930J991506
$$ plain form
14317 62731616 65458119 67812453 70787797 73489939 76714002 79618933 82957939 86405465
14309 86405465 90339444 94390913 98208796 102809919 107315487 112491705 117899598 123192486
14301 123192486 129555411 135956380 142694987 149946181 157438366 165595910 174119593 183474281
14293 183474281 192957493 203485322 214670515 225998521 238326086 251570672 264947826
14286 264947826 278995578 293889277 308990528 324637425 340549636 356826098 372806765
14279 372806765 388524377 404105368 418471923 432110432 444331563 454219117 461227632
14272 461227632 464856480 465255868 463015309 461840244 459710780 454791600 447498839 437355122
14264 437355122 425515544 411641250 397603985 382618973 366492685 349914576 333499928
$$ packed form
14317F2731616K726503K354334K975344K702142L224063K904931L339006L447526
14309H6405465L933979M051469L817883M601123M505568N176218N407893N292888
14301A23192486O362925O400969O738607P251194P492185Q157544Q523683R354688
14293A83474281R483212J0527829J1185193J1328006J2327565J3244586J3377154
14286B64947826J4047752J4893699J5101251J5646897J5912211J6276462J5980667
14279C72806765J5717612J5580991J4366555J3638509J2221131R887554P008515
14272D61227632L628848L99388k240559j175065k129464m919180p292761j0143717
14264D37355122j1839578j3874294j4037265j4985012j6126288j6578109j6414648
$$ plain form
14257 333499928 317515158 301687623 287395155 272418223 258281341 245049501 232160514
14250 232160514 220062254 208625397 197813517 187848487 178245436 169091573 160951026
14243 160951026 153558779 145954157 138849915 132092373 125880512 120343441 115196545 109877366
14235 109877366 105044310 100356990 95881419 91867710 88474206 85410310 81867036 78457867
14227 78457867 75241216 72220181 69606308 66959928 64643016 62186761 60378371 58192158
14219 58192158 56435107 54234644 52627121 50640127 49087831 47858094 46719693 45163178
14211 45163178 43400030 41880259 40635671 39904866 39264222 38244943 36873839 35597526
14203 35597526 34474864 33617093 32782281 32345749 31318693 30422522 29326193 28791504 28068951
$$ packed form
14257C33499928j5984770j5827535j4292468j4976932j4136882j3231840j2888987
14250B32160514j2098260j1436857j0811880r965030r603051r153863q140547
14243A60951026p392247p604622p104242o757542o211861n537071n146896n319179
14235A09877366m833056m687320m475571m013709l393504l063896l543274l409169
14227G8457867l216651l021035k613873k646380k316912k456255j808390k186213
14219E8192158j757051k200463j607523j986994j552296j229737j138401j556515
14211D5163178j763148j519771j244588p30805o40644j019279j371104j276313
14203C5597526j122662q57771q34812m36532j027056q96171j096329n34689p22553
$$ plain form
14194 28068951 27537858 26968291 25759961 25704332 24850176 23932895 23619254 22994690 22317037
14185 22317037 21807514 21439991 20977644 20916014 19963877 19532769 19241153 18984752 18679514
14176 18679514 18251635 17771527 17508489 16767127 16956029 16484390 16412457 15427364 15619392
14167 15619392 14987193 14728116 14384903 14390217 13960308 13890319 13532851 13082714 13155999 13071914
14157 13071914 12652164 12397942 12291612 12040229 11759513 11857716 11414446 11258323 11149757
14148 11149757 11017845 10811657 10258432 10432529 10292571 10334684 9657704 9603320 9730337 9406302
14138 9406302 9477559 9192221 9224021 8869425 8443700 8778855 8766525 8568956 8444180 8199065
14128 8199065 8270165 8002683 7880607 7971387 7755689 7482497 7413094 7452799 7503796 7153751
$$ packed form
14194B8068951n31093n69567j208330n5629q54156r17281l13641o24564o77653
14185B2317037n09523l67523m62347o1630r52137m31108k91616k56401l05238
14176A8679514m27879m80108k63038p41362J88902m71639p1933r85093J92028
14167A5619392o32199k59077l43213N314m29909o9989l57468m50137P3285q4085
14157A3071914m19750k54222j06330k51383k80716R8203m43270j56123j08566
14148A1149757j31912k06188n53225J74097j39958M2113o76980n4384J27017l24035
14138I406302P1257k85338L1800l54596m25725L35155j2330j97569j24776k45115
14128H199065P1100k67482j22076R0780k15698k73192o9403L9705N0997l50045
$$ plain form
14118 7153751 6921816 7011869 6921674 6867185 6723505 6862006 6546078 6629910 6405900 5978192
14108 5978192 6380969 6454940 6395798 5648420 5519812 5729578 5819907 5907333 5727956 5670068
14098 5670068 5587669 5618522 5562348 5307447 5129305 5415587 5467058 5006274 5046073 4775840
14088 4775840 4891875 4778731 4791408 5036193 4780452 4739821 4551935 4683657 4430776 4314952
14078 4314952 4645894 4343012 4253518 4351876 4245507 4393978 4380298 4270313 4110814 3793984
14068 3793984 4272229 3839170 3959377 3908729 3576623 3801824 3760794 3980565 4115307 3481316
14058 3481316 3498343 3668542 3800920 3578004 3735823 3519593 3185268 3572064 3522086 3404562
14048 3404562 3087825 2983606 3323377 3332412 3177580 3266252 2759213 3171210 2860727 3034945
$$ packed form
14118G153751k31935R0053r0195n4489j43680J38501l15928Q3832k24010m27708
14108E978192M02777P3971n9142p47378j28608K09766R0329Q7426j79377n7888
14098E670068q2399L0853n6174k54901j78142K86282N1471m60784L9799k70233
14088D775840J16035j13144J2677K44785k55741m0631j87886J31722k52881j15824
14078D314952L30942l02882q9494R8358j06369J48471j3680j09985j59499l16830
14068C793984M78245m33059J20207n0648l32106K25201m1030K19771J34742o33991
14058C481316J7027J70199J32378k22916J57819k16230l34325L86796m9978j17524
14048C404562l16737j04219L39771R035j54832Q8672n07039M11997l10483J74218
$$ plain form
14038 3034945 3109550 3347458 3367879 3108786 3279628 2732751 3017641 2902012 2777252 2731623
14028 2731623 2333359 2714208 2531983 2730627 2469352 2446132 2690081 2407478 2538953 2542082
14018 2542082 2390169 1998800 2146168 2221968 2231490 2419380 2278563 2191967 2599233 2120598
14008 2120598 2303316 2187630 2122982 1947968 2254874 2258528 2105648 2023993 1933204 2297418
13998 2297418 1813628 2084058 2110303 1975343 2175287 1947583 1949349 1955133 2288437 3059026
13988 3059026 4970305 10875274 28385276 47673996 27715872 13436506 7857739 5790149
13980 5790149 4232577 3924972 3705250 3483718 3429243 3239433 2690314 2566098 2303767
13971 2303767 2495551 2161336 2095697 2179818 2371647 2362652 2286229 2111451 2147610 1866148
$$ packed form
14038C034945P4605K37908K0421k59093J70842n46877K84890j15629j24760m5629
14028B731623l98264L80849j82225J98644k61275k3220K43949k82603J31475L129
14018B542082j51913l91369J47368P5800R522J87890j40817q6596M07266m78635
14008B120598J82718j15686o4648j75014L06906L654j52880q1655r0789L64214
13998B297418m83790K70430K6245j34960J99944k27704J766N784L33304P70589
13988C059026J911279N904969J7510002J9288720j9958124A3436506n578767k067590
13980E790149j557572l07605k19722k21532n4475j89810n49119j24216k62331
13971B303767J91784l34215o5639Q4121J91829q995p6423j74778L6159k81462
$$ plain form
13961 1866148 1730023 1905177 1993166 2377192 2113995 1966705 1558829 1879631 2042891 1616489
13951 1616489 1885495 1695392 1649888 1727994 1941047 1895100 1780835 1842695 1496053 1397977
13941 1397977 1603443 1822120 1721499 1744086 1710407 1990745 1768621 1798992 1470540 1761835
13931 1761835 1527485 1333644 1635200 1693859 1487323 1418592 1506249 1551080 1403490 1690631
13921 1690631 1628630 1400618 1164383 1511138 1424150 1397083 1423734 1096540 1424179 1427548
13911 1427548 1114538 1187741 1062248 1380740 1295891 1524049 1479070 1073485 1142793 1254956
13901 1254956 1241814 1296463 1501196 1158072 1509333 1121548 1402287 1182592 1323743 1083078
13891 1083078 1094181 1340566 1248892 1413334 1162494 864406 1231690 1359065 886658 1202746
$$ packed form
13961A866148j36125J75154Q7989L84026k63197j47290m07876L20802J63260m26402
13951A616489K69006j90103m5504P8106K13053m5947j14265O1860l46642r8076
13941A397977K05466K18677j00621K2587l3679K80338k22124L0371l28452K91295
13931A761835k34350j93841L01556N8659k06536o8731Q7657M4831j47590K87141
13921A690631o2001k28012k36235L46755q6988k7067K6651l27194L27639L369
13911A427548l13010P3203j25493L18492q4849K28158m4979m05585O9308J12163
13901A254956j3142N4649K04733l43124L51261l87785K80739k19695J41151k40665
13891A083078J1103K46385r1674J64442k50840k98088L67284J27375m72407L16088
$$ plain form
13881 1202746 1253957 1033031 1125074 848028 1023015 695194 1048832 1156351 1071814 904593
13871 904593 880870 737391 1076410 961460 1328829 1177822 1245169 1138294 993528 870890
13861 870890 1563804 960272 944764 1360190 1630052 1068663 892930 1128295 1209807 639459
13851 639459 984981 1062142 1228093 1121958 853984 1118041 940090 1200795 859892 756318
13841 756318 1126713 898200 773422 1307743 839657 995794 820625 531776 1029603 1021104
13831 1021104 790525 392991 713522 1023472 1037729 865258 1204415 581256 1025984 860082
13821 860082 972224 835818 732169 878905 926281 1025806 793428 568764 748254 864419
13811 864419 884984 543216 804245 643087 651732 785745 658794 1085945 578725 923276
$$ packed form
13881A202746N1211k20926R2043k77046J74987l27821L53638J07519q4537j67221
13871I04593k3723j43479L39019j14950L67369j51007O7347j06875j44766j22638
13861H70890O92914o03532j5508M15426K69862n61389j75733K35365Q1512n70348
13851F39459L45522P7161J65951j06135k67974K64057j77951K60705l40903j03574
13841G56318L70395k28513j24778N34321m68086J56137j75169k88849M97827q499
13831A021104k30579C92991L20531L09950J4257j72471L39157E81256M44728j65902
13821H60082J12142j36406j03649J46736M7376R9525k32378k24664J79490J16165
13811H64419K0565l41768K61029j61158Q645J34013j26951M27151n07220L44551
$$ plain form
13801 923276 587921 878907 1057054 712098 537564 398923 394733 585010 688826 561431
13791 561431 915927 859309 756062 539619 483157 770667 516453 525238 1071274 549389
13781 549389 393003 612611 785467 720749 556528 577280 616396 1038473 778781 586867
13771 586867 819437 760006 1196362 741227 480890 614819 545480 719422 815996 606605
13761 606605 682621 682677 784330 706789 816860 889515 998567 922933 526481 755955 371320
13749 524296 720299 774020 559468 984252 587644 485380 536606 462616 578261 339554
13739 339554 491528 293828 935434 606077 505070 564377 690759 576243 824708 393626
13728 515757 560593 600237 548325 762252 325010 573697 646481 418545 957516 526375
$$ packed form
13801I23276l35355K90986J78147l44956j74534j38641m190J90277J03816j27395
13791E61431L54496n6618j03247k16443n6462K87510k54214Q785N46036n21885
13781E49389j56386K19608J72856o4718j64221K0752L9116M22077k59692j91914
13771E86867K32570n9431M36356m55135k60337J33929o9339J73942R6574k09391
13761F06605P6016N6J01653p7541J10071P2655J09052p5634l96452K29474C71320
13749E24296J96003N3721k14552M24784l96608j02264N1226p3990J15645k38707
13739C39554J51974j97700O41606l29357j01007N9307J26382j14516K48465C93626
13728E15757M4836L9644n1912K13927C25010K48687P2784k27936N38971m31141
$$ plain form
13718 526375 522514 465510 355982 583585 574579 455006 624526 725968 695776 866211 431355
13706 429454 389101 661339 498142 418710 470650 465708 479449 747246 740828 728920 651494
13695 651494 692895 423277 528475 524396 563002 406579 225496 482344 581086 511849 838629
13684 838629 468831 860567 604263 985977 295077 459432 576617 383917 463364 230575
13673 620097 166560 298240 364314 675175 500469 543035 431500 718879 512627 380670
13663 380670 586463 340337 360362 494575 642412 699170 -27711 614989 511174 245923
13652 551115 401871 716340 636132 466867 613066 301675 464147 515028 294480 470996
13642 470996 460835 388143 122445 344983 918519 504740 292229 430032 212700 512493
$$ packed form
13718E26375l861n7004j09528K27603r006j19573J69520J01442l0192J70435D31355
13706D29454m0353K72238j63197p9432N1940m942J3741K67797o418j1908p7426
13695F51494M1401k69618J05198m079L8606j56423j81083K56848R8742o9237L26780
13684H38629l69798L91736k56304L81714B95077J64355J17185j92700P9447B30575
13673F20097A66560J31680O6074L10861j74706M2566j11535K87379k06252j31957
13663C80670K05793k46126K0025J34213J47837N6758b7711F14989j03815B45923
13652E51115j49244L14469q0208j69265J46199C01675J62472N0881k20548J76516
13642D70996j0161p2692A22445K22538N73536m13779k12511J37803B12700K99793
$$ plain form
13632 512493 496712 412877 456184 605016 453381 235683 599997 423330 319356 353361
13622 353361 790800 353667 347370 375583 367122 634603 349545 345320 319780 589930 391466
13611 391466 375440 204602 314870 240271 342306 286256 352090 394923 430399 548727 113176
13599 517519 502940 312434 253501 105264 69686 361171 307299 456007 15521 401783
13589 401783 279412 403350 353921 399260 504404 211384 464045 344070 355583 553498
13579 553498 383207 507351 396932 183406 684586 246217 258773 441057 226987 408109
13569 408109 615634 758698 341656 135415 375615 702251 450172 46938 552139 479666
13559 479666 246341 336937 -21921 279296 393060 328791 582815 445352 206174 159960
$$ packed form
13632E12493j5781q3835M3307J48832j51635k17698L64314j76667j03974L4005
13622C53361M37439C53667o297K8213q461K67481k85058m225k5540K70150j98464
13611C91466j6026j70838J10268p4599J02035n6050O5834M2833L5476J18328A13176
13599E17519j4579j90506n8933A05264l5578K91485n3872J48708A5521L86262
13589D01783j22371J23938m9429M5339J05144B11384K52661j19975J1513J97915
13579E53498j70291J24144j10419A83406N01180B46217J2556J82284k14070J81122
13569D08109K07525J43064C41656A35415K40200L26636k52079D6938N05201p2473
13559D79666k33325R0596b1921B79296J13764o4269K54024j37463B06174m6214
$$ plain form
13549 159960 18594 335387 36494 132690 119189 183861 150092 188506 303583 429495 240522
13538 240522 304324 585992 188767 350116 543354 372078 138521 333058 70679 300182
13528 300182 311902 222936 -30323 392836 131440 102652 235653 375160 447297 -169991
13517 351787 544658 277113 434658 393159 304536 -4592 445824 163085 153970 32074 429033
13506 429033 640796 308021 158767 260254 242139 472467 300837 342397 174311 113054
13496 113054 157769 240638 19830 193938 373896 177403 138501 356002 335459 -58793 153876
13484 67263 364319 347037 485487 331874 197295 258684 265428 267275 203791 -58338 308531
13472 576047 254294 -14756 196682 430737 56521 225009 239546 531767 183968 267376
$$ packed form
13549A59960A8594L16793C6494R6196j3501O4672l3769L8414J15077J25912j88973
13538B40522O3802K81668A88767J61349J93238j71276A38521J94537G0679K29503
13528C00182J1720q8966c0323C92836A31440k8788J33001J39507P2137a69991
13517C51787J92871k67545J57545m1499q8623d592D45824A63085r115C2074L96959
13506D29033K11763C08021j49254J01487j8115K30328j71630M1560j68086o1257
13496A13054M4715Q2869A9830J74108J79958A77403l8902K17501k0543e8793A53876
13484F7263K97056j7282J38450j53613j34579O1389O744J847o3484e8338C08531
13472E76047B54294a4756A96682K34055E6521J68488J4537K92221A83968Q3408
$$ plain form
13462 267376 515844 26353 86971 109752 295442 112961 132248 116368 96131 184259 -256476
13450 187646 279260 -78458 29010 454750 -131611 272560 412133 -49877 63409 334029
13440 334029 200058 67542 -8039 222907 7197 94775 285200 377191 122325 284637 -20767
13428 130795 178325 400321 179787 571892 326965 22447 332713 382117 229263 177488
13418 177488 179325 382029 193385 209767 253727 165564 199143 -27656 217066 294576 91842
13406 205767 232702 179875 231277 551461 -151433 -35008 463251 205635 252335 362113
13396 362113 416064 133748 367723 416770 -26601 -101394 377426 309751 184988 211691 241143
13385 241143 470560 -360 212738 169399 114784 168721 -19182 74646 237782 221204 17787
$$ packed form
13462B67376K48468B6353O0618K2781J85690A12961J9287j5880k0237Q8128b56476
13450A87646R1614g8458B9010M25740a31611B72560J39573d9877F3409K70620
13440C34029j33971F7542h039B22907G197Q7578J90425R1991A22325J62312b0767
13428A30795M7530K21996A79787L92105k44927B2447L10266M9404j52854n1775
13418A77488J837K02704j88644J6382M3960q8163L3579b7656B17066P7510I1842
13406B05767K6935n2827N1402L20184a51433c5008D63251B05635M6700J09778
13396C62113N3951A33748K33975M9047b6601p4793C77426o7675j24763K6703K9452
13385B41143K29417c60B12738m3339n4615N3937a9182G4646J63136j6578A7787
$$ plain form
13373 156410 208635 35866 211548 88946 436961 15963 162317 728993 297209 354031
13363 354031 199985 249645 236576 175419 101768 -17768 -8215 174601 -82793 140502 13483
13351 36318 226161 358944 188208 169699 20493 117160 263276 -119145 412382 137023
13340 411811 378572 227201 94432 348628 330846 540337 462623 360938 -162 218491 476947
13329 476947 -36100 -32788 135778 386027 350022 255800 340497 172770 312983 380117 475177
13318 475177 307472 171561 304603 288104 433576 -87565 285202 403882 294375 136150
13307 475961 -202956 309678 134926 87409 154342 250058 182182 253770 106530 301873
13297 301873 66854 -126456 -37384 327725 147793 318845 159542 551028 -222868 261829
$$ packed form
13373A56410N2225C5866J75682H8946L48015A5963J46354N66676B97209N6822
13363C54031j54046M9660j3069o1157p3651a7768h215A74601h2793A40502A3483
13351C6318J89843J32783j70736j8509B0493R6667J46116a19145D12382A37023
13340D11811l3239j51371I4432K54196j7782K09491p7714j01685a62B18491K58456
13329D76947c6100L312A35778K50249l6005r4222Q4697j67727J40213O7134R5060
13318D75177j67705j35911J33042j6499J45472h7565B85202J18680j09507A36150
13307D75961b02956C09678A34926m7517O6933R5716o7876P1588A06530J95343
13297C01873F6854a26456c7384C27725A47793J71052j59303L91486b22868B61829
$$ plain form
13286 295382 199212 45074 97086 50563 180494 131934 137378 182219 -3291 332398 -29341
13274 -37026 427590 270538 494803 180719 551340 320268 400598 117326 87476 -208178
13263 -167541 24937 -256041 200371 92552 80474 -28405 238439 61547 72177 427784 -115030
13251 190693 -109357 156284 231371 368081 120117 150188 190341 -107325 332837 100544
13240 231829 -67379 -215687 188536 -25301 -68679 -28673 219056 378110 40930 36412 151848
13229 151848 -33146 -131562 -178743 346461 346753 282824 244406 169939 324245 -71184 192121
13217 164518 123239 180529 290889 277908 -103748 -33618 394317 -113228 -60056 70665 -86816
13205 178113 398812 -54719 234994 89146 79467 251842 27367 -120462 179725 136916 51598
$$ packed form
13286B95382r6170D5074N2012m6523J29931m8560N444M4841c291C32398b9341
13274c7026D27590j57052K24265A80719L70621k31072Q0330A17326k9850b08178
13263a67541B4937b56041B00371I2552j2078b8405B38439F1547J0630L55607a15030
13251A90693a09357A56284P5087J36710A20117L0071M0153a07325C32837A00544
13240B31829f7379j48308A88536b5301m3378b8673B19056J59054D0930m518J15436
13229A51848c3146r8416m7181C46461K92o3929l8418p4467J54306g1184A92121
13217A64518m1279N7290J10360j2981a03748c3618C94317a13228N3172G0665h6816
13205A78113K20699e4719B34994H9146r679J72375B7367a20462A79725m2809E1598
$$ plain form
13193 -249463 160640 -66983 94403 -31458 132242 66596 226438 238858 -132139 32394 -1414
13181 219629 120533 377101 466765 -109067 -24600 -18537 132226 124316 -91979 76243 141717
13170 141717 -130871 164577 -93729 183291 -23449 -93973 158677 345789 111745 151317
13160 151317 99248 134784 246452 322912 -398195 111214 522076 -163355 99817 56290
13150 56290 -217026 53503 79207 -97510 2162 59037 23487 129040 183193 261205 75688
13138 52662 -176945 134701 -60784 226734 110459 -22700 -124395 85183 -5461 -137811 7956
13126 -18009 33088 56430 164933 260425 -54090 205715 -39101 30377 131879 -81896 96600
13114 396016 186787 11584 80394 126061 11759 88482 124533 245300 42389 26304 221654
$$ packed form
13193b49463A60640f6983I4403c1458A32242o5646J59842J2420a32139C2394a414
13181B19629r9096K56568Q9664a09067b4600O063A32226p910i1979G6243O5474
13170A41717a30871A64577i3729A83291b3449p0524A58677J87112A11745L9572
13160A51317n2069L5536J11668P6460c98195A11214M10862a63355I9817m3527
13150E6290b17026E3503K5704i7510B162N6875B3487J05553N4153P8012G5688
13138E2662a76945A34701f0784B26734A10459b2700j01695H5183e461j32350G956
13126a8009C3088K3342J08503R5492e4090B05715c9101C0377J01502h1896I6600
13114C96016A86787A1584O8810M5667A1759P6723L6051J20767D2389j6085J95350
$$ plain form
13103 221654 731 158398 -310968 168222 -296620 5528 -41226 34011 -57629 368624 -90513
13091 -90052 193723 -23539 91346 -94465 -364464 221941 324622 7175 -185074 -29996 70608
13079 -239397 74478 16621 -94928 -104433 49341 4628 189965 212188 -4899 307930 -10138 101340
13066 -402422 297001 -58941 53700 101013 209338 36186 484503 33812 -620 -108693 -145307
13055 -145307 30348 78522 55719 -48315 232929 69743 -5519 103031 90014 113294 -101398
13043 228722 139015 120895 179712 398154 39662 418865 29596 -9034 119696 50454 -119284
13031 76898 -43709 236630 288969 -152500 409681 2875 175454 27505 374170 215804 -131487
13019 149992 144434 52266 284225 350851 -80851 46459 376364 158696 -33177 329164 37795
$$ packed form
13103B21654G31J57667c10968A68222b96620E528d1226C4011e7629C68624i0513
13091i0052A93723b3539I1346i4465k69999B21941J02681G175a85074b9996G0608
13079b39397G4478A6621i4928r505D9341D628J85337K2223d899C07930a0138A01340
13066d02422B97001e8941E3700M7313J08325C6186M48317C3812f20j08073l6614
13055a45307C0348M8174k2803d8315B32929F9743e519A03031j3017K3280a01398
13043B28722q9707j8120N8817K18442C9662L79203B9596i034A19696E0454a19284
13031G6898d3709B36630N2339a52500D09681B875J72579B7505L46665j58366a31487
13019A49992n558E2266K31959O6626h0851D6459L29905A58696c3177C29164C7795
$$ plain form
13007 148894 -394122 478267 106198 197355 -275 127374 268906 262710 -394926 -98386 173081
12995 14492 -61696 21161 308879 -16026 23268 330409 163412 379552 89689 80994 153522
12984 153522 -42024 15024 193876 48921 247040 -96780 -35168 286639 -103138 430978
12973 479734 190835 255506 -182785 37615 40232 203557 -142057 -92899 302740 -61866 210393
12961 26169 153783 299718 -40332 -18884 372081 420544 208840 37566 156631 221992 -109724
12949 410942 85874 258493 42233 -90737 227547 82778 312126 -302596 -121999 66718
12938 -179748 365504 -79213 37196 112733 130262 -83130 -21741 -119388 183550 -73670 154206
12926 178231 190817 413088 -34932 -48808 -195609 267247 155318 -8993 -68409 115514 -129775
$$ packed form
13007A48894c94122D78267A06198R1157b75A27374J41532o196c94926i8386A73081
12995A4492f1696B1161K87718a6026B3268L07141A63412K16140H9689q695P2528
12984A53522d2024A5024J78852D8921J98119i6780c5168B86639a03138D30978
12973D79734A90835O4671a82785C7615K617J63325a42057M9158C02740f1866B10393
12961B6169J27614J45935d0332a8884C72081M8463B08840C7566J19065O5361a09724
12949D10942H5874J72619D2233i0737B27547H2778K29348c02596a21999F6718
12938a79748C65504g9213C7196P5537J7529h3130b1741r7647A83550g3670A54206
12926A78231J2586K22271c4932j3876j46801B67247j11929h993n9416A15514a29775
$$ plain form
12914 -38671 93737 -61651 276525 141305 -52014 -66974 131559 -40042 37911 -89721 112732
12902 -320391 136085 -203113 213000 5998 34556 -44609 -129898 16112 164569 164602 -91269
12890 171027 -75344 -29460 -155288 296108 36430 -198713 338665 -287669 103567 333011
12880 333011 210558 2556 -291309 -1689 -57035 228962 -181371 26220 -99239 -16251 -36379
12869 -36379 206177 36255 94996 -23460 45233 -285 246156 92943 110537 -217239 162188
12857 269380 196518 151839 42864 -47685 125086 -49825 -178882 34458 -298302 221191 -353586
12845 11118 -242670 102662 351904 161067 158086 279396 -41947 -63187 -17988 36590 184130
12834 184130 239278 -71748 129528 115021 -142244 62215 -238118 -22444 -285306 -83626 -209059
$$ packed form
12914c8671I3737f1651B76525j35220e2014j4960A31559d0042C7911h9721A12732
12902c20391A36085b03113B13000E998K8558d4609q5289A6112J48457L3i1269
12890A71027g5344b9460j25828B96108C6430a98713C38665b87669A03567K29444
12880C33011j22453B556b91309a689n5346B28962a81371B6220i9239a6251k0128
12869c6379B06177C6255N8741b3460D5233b85B46156I2943J7594b17239A62188
12857B69380p2862m4679D2864d7685A25086d9825j29057C4458b98302B21191c53586
12845A1118b42670A02662K49242A61067k981J21310d1947k1240a7988C6590J47540
12834A84130N5148g1748A29528j4507a42244F2215b38118b2444k62862h3626j25433
$$ plain form
12823 -209059 -55304 -204862 -130199 73593 19435 -7037 48494 -100658 138212 256806 140871
12812 140871 -111961 85189 -316645 -115069 171451 141048 362750 179487 101903 150917
12802 150917 -65038 41801 162756 116326 124421 -303257 35209 -122904 4826 306719 -112650
12790 166010 439401 238125 49745 17130 -48709 -88829 227943 -229773 78666 19584 15304
12779 15304 121128 307483 16289 140261 -52869 217017 28410 211468 -413842 13552
12768 9149 104868 -64697 81742 183766 56155 120353 -15592 221771 310926 -308051 11934
12756 202385 321825 -142242 252856 -443438 45667 32530 140766 -41713 -122302 -255862
12746 -255862 224097 61254 -188898 8801 -307222 -328135 -45806 18751 -156501 6099 175869
$$ packed form
12823b09059e5304j49558P4663G3593A9435g037D8494a00658A38212J18594j15935
12812A40871a11961H5189c16645a15069A71451l0403K21702A79487p7584M9014
12802A50917f5038D1801J20955m6430Q095c03257C5209a22904D826L01893a12650
12790A66010K73391k01276D9745A7130d8709m0120B27943b29773G8666A9584m280
12779A5304J05824J86355A6289J23972e2869B17017B8410J83058d13842A3552
12768I149R5719f4697H1742J02024E6155O4198a5592B21771Q9155c08051A1934
12756B02385J19440a42242B52856d43438D5667j3137J08236d1713q0589j33560
12746b55862B24097F1254a88898H801c07222k0913d5806A8751a56501F099J69770
$$ plain form
12735 175869 62400 8290 82182 325891 96415 -22281 -68787 -184143 65762 147685 -249839
12723 87188 -95367 39249 -201443 -201116 -1008 -50349 155338 48537 39397 -67442 -42318 26863
12710 -5394 -18404 125804 -91465 224147 279235 561210 57028 278095 104876 -72205 -40620
12699 -40620 176811 14069 -340434 105295 199161 -177342 85925 22576 15021 278634 136760
12687 20042 252550 243735 -33882 31613 103937 39940 17383 267819 46943 236730 83769
12675 -306 164559 16501 221852 -177317 132943 239296 -55893 292413 56268 386492 -2226
12663 229712 -28437 -66515 191094 84661 162495 390635 202293 1396 83634 72899 -20674
12651 101771 373721 298194 161813 176541 159733 261124 113139 -136335 165577 -339926
$$ packed form
12735A75869F2400H290P3892K43709I6415b2281m6506j15356F5762Q1923b49839
12723H7188i5367C9249b01443L27a008m9341A55338D8537r140f7442K5124B6863
12710e394j3010A25804i1465B24147N5088K81975E7028K21067A04876g2205L1585
12699d0620A76811A4069c40434A05295R3866a77342H5925B2576p555K63613A36760
12687B0042K32508q815c3882C1613P2324C9940A7383K50436D6943J89787H3769
12675c06A64559A6501K05351a77317A32943J06353e5893B92413E6268L30224b226
12663B29712b8437l8078A91094H4661P7834K28140j88342A396Q2238j0735b0674
12651A01771K71950p5527j36381J4728j6808J01391A13139a36335A65577c39926
$$ plain form
12640 168501 -8273 201534 -47805 -110800 204403 -41818 103477 -2029 559720 259906 193361
12629 193361 213414 353133 238004 -95619 183759 172072 -107574 312018 210286 251853
12619 251853 284258 459616 -329908 215082 -50632 -49164 -432008 -97545 33918 309367 -57299
12607 176135 88624 -109610 94855 284736 484825 -227690 60083 387631 -45189 229997
12596 73487 -121370 -45705 65041 -77706 46215 45036 68380 100678 -40078 110477 -68021
12584 156235 4456 7140 -84304 -260595 17799 48579 255003 20768 193930 159650 -138836
12572 -178381 -118372 -213699 22448 228929 -77970 317277 -178720 260936 -24736 128071
12561 -167545 99329 26539 120118 -277148 -98254 201471 -443803 -76973 227832 121901
$$ packed form
12640A68501h273B01534d7805o2995B04403d1818A03477b029E59720B59906o6545
12629A93361K0053J39719j15129i5619A83759j1687a07574C12018j01732M1567
12619B51853L2405J75358c29908B15082e0632J468l82844i7545C3918K75449e7299
12607A76135q7511a09610I4855J89881K00089b27690F0083L27548d5189B29997
12596G3487a21370d5705F5041g7706D6215j179K3344L2298d0078A10477f8021
12584A56235D456K684h4304j76291A7799L0780K06424B0768J73162l4280a38836
12572a78381O0009r5327B2448K06481g7970C17277a78720B60936b4736A28071
12561a67545I9329B6539R3579b77148i8254B01471d43803g6973B27832j05931
$$ plain form
12551 121901 -203677 -194177 -148133 74056 66322 151647 -270040 -99969 12415 133450 -56292
12539 52067 25206 55340 -144090 77970 -72813 -67088 268609 99889 -159951 38325 -324559
12527 -96488 59993 50006 181460 51085 -78651 -120564 51725 57157 286733 -108486 97811
12515 128852 323906 -70183 -296756 -164244 6473 32329 -139364 -36590 58734 8634 228387
12504 228387 437595 327951 -88937 279434 12269 238036 -167041 -166389 538504 116937
12493 76033 228765 48714 -11270 -96416 16283 149427 22258 -8022 -74620 -30433 -123475
12482 -123475 74996 70801 170325 -1813 -289757 -187017 86987 173006 -169685 340274 198114
12471 198114 173026 8969 -110246 -217490 -53451 -40940 -87884 30821 -132007 97548 -3153
$$ packed form
12551A21901b03677R500M6044G4056p734Q5325b70040i9969A2415J21035e6292
12539E2067B5206L0134a44090G7970g2813N725B68609I9889a59951C8325c24559
12527i6488E9993r987J31454E1085g8651m1913E1725N432K29576a08486I7811
12515A28852J95054g0183k26573J32512F473K5856a39364c6590E8734H634K19753
12504B28387K09208j09644h8937B79434A2269K25767a67041O52E38504A16937
12493G6033J52732D8714a1270q5146A6283J33144B2258h022o6598c0433r3042
12482a23475G4996m195R9524a813k87944J02740H6987Q6019a69685C40274j42160
12471A98114k5088H969a10246j07244e3451J2511m6944C0821a32007I7548c153
$$ plain form
12459 -128564 59118 -60589 307406 216717 143000 356408 -120516 -113043 247814 -116933 167526
12447 178877 80627 540011 286445 69571 175350 181823 192641 199132 -102569 102761 247180
12436 247180 242317 -69147 28903 -2335 -190722 55605 36365 -286346 -154478 -68318 154724
12424 -93629 169454 86059 40912 -507463 -147296 -151230 66085 139896 -26374 281015 189925
12413 189925 171614 -43135 -30069 4927 -147449 -117312 -245211 -136463 -32617 3293 -293853
12401 -107147 196395 -52097 -219166 174454 66563 -282814 47963 -34413 222371 -29649
12390 -13918 151157 165125 20587 -101250 -122944 145756 525689 -151432 115192 177689
12380 177689 57144 342559 -267374 -247626 -202429 124964 37596 -97123 20726 -10731 -20000
$$ packed form
12459a28564E9118f0589C07406r0689p3717K13408a20516P473B47814a16933A67526
12447A78877H0627M59384k53566F9571J05779O473J0818O491a02569A02761J44419
12436B47180m863f9147B8903b335j88387E5605j9240b86346J31868f8318A54724
12424i3629A69454q3395D0912e07463a47296l934F6085P3811b6374B81015r1090
12413A89925j8311d3135J3066D927a47449L0137j27899J08748c2617C293b93853
12401a07147A96395e2097j67069A74454F6563b82814D7963c4413B22371b9649
12390a3918A51157J3968B0587a01250k1694A45756L79933a51432A15192O2497
12380A77689E7144K85415b67374J9748M5197A24964C7596i7123B0726a0731r269
$$ plain form
12369 -20000 24480 -89696 1560 -3625 -43841 51485 118708 57084 314578 -341750 -20621 139428
12356 272866 22151 -13736 135079 -96827 -21292 119371 199517 -235522 117337 111185 323066
12345 323066 1216 171724 119058 -125349 213761 -142534 -180849 15795 -44081 76767 -49723
12333 -102126 179340 303657 -19024 -323247 212578 -217054 357245 257314 174136 -21648
12322 265655 166512 71421 -36338 -93975 -230457 1768 324751 239941 -397445 58512 -266667
12310 -288150 274792 204734 -198851 -243973 -41161 300138 252748 58061 339669 37218 315688
12299 315688 -87466 -93101 156004 -17625 -49641 16747 43684 -6456 -171675 92862 501397
12288 501397 117746 -207057 -77632 124220 108345 383430 -117981 52245 -231797 313259
$$ packed form
12369b0000B4480h9696A560c625m0216E1485O7223E7084K57494c41750b0621A39428
12356B72866B2151a3736A35079i6827b1292A19371Q0146b35522A17337o152K11881
12345C23066A216J70508n2666a25349B13761a42534l8315A5795d4081G6767d9723
12333a02126A79340J24317a9024l04223B12578b17054C57245r9931q3178b1648
12322B65655r9143G1421c6338n7637j36482A768L22983q4810c97445E8512b66667
12310b88150B74792p0058a98851m5122d1161C00138m7390E8061K81608C7218K78470
12299C15688h7466n635A56004a7625l2016A6747K6937f456j65219I2862M08535
12288E01397A17746b07057g7632A24220j5875K75085a17981E2245b31797C13259
$$ plain form
12277 60289 -220035 252753 108108 420645 -9511 149417 145663 86098 50956 17694 283410
12266 283410 -50084 233760 -97465 -122393 326718 768 183781 161861 92117 277150 -209955
12254 126193 -39136 109002 144684 -80308 -177390 315993 184694 174074 27684 -3393 218218
12242 150854 140827 -37407 226958 222537 49766 167973 231048 29949 354692 133002 -277048
12230 -94313 7881 128164 146532 484259 289618 303857 13664 259791 -127028 201361 66821
12218 122029 169469 176883 206898 78590 -85760 161242 190516 184037 -25675 110065 -276643
12206 13786 -203824 -36920 289514 179606 110251 61952 30255 -40444 65132 -118327 170157
12194 216940 -66273 355520 391052 -71762 41490 490495 84771 253270 55796 503817 67918
$$ packed form
12277F0289b20035B52753A08108L12537i511A49417l754n9565l5142A7694K65716
12266B83410e0084B33760i7465k4928C26718G68J83013k1920o9744J85033b09955
12254A26193c9136A09002L5682h0308r7082C15993j31299j0620B7684c393B18218
12242A50854j0027c7407B26958m421D9766J18207O3075B9949L24743A33002b77048
12230i4313G881J20283J8368L37727j94641J4239A3664K46127a27028B01361F6821
12218A22029M7440P414L0015G8590h5760A61242K9274o479b5675A10065b76643
12206A3786b03824c6920B89514j09908o9355m8299C0255d0444F5132a18327A70157
12194B16940f6273C55520L5532g1762D1490M49005H4771J68499E5796M48021F7918
$$ plain form
12182 193499 891 -97955 313989 -45838 75079 166188 -50885 -90680 394685 162347 167812
12171 167812 248312 -124132 -247402 185711 -107488 158222 92383 232488 -27824 282793
12160 39695 -72795 305043 30824 -40098 236766 102974 51156 -170195 -105939 148410 -80857
12148 -10415 60160 222461 45260 250096 40337 -323902 -79232 -3357 101137 -36886 -91274
12137 -91274 -203540 94276 -51573 296421 -148763 -102356 -104658 -252302 426715 58550 76283
12126 76283 39833 149599 207479 -50491 175620 118124 -4859 -78212 16008 79165 -115923
12114 -33211 216670 294137 196781 -191246 10112 1447 347450 67543 109752 311512 -116181
12102 84146 172370 -138089 121921 -58093 -75745 -7085 85962 -58650 46172 145734 38235
$$ packed form
12182A93499H91i7955C13989d5838G5079R1109e0885l9795C94685A62347N465
12171A67812Q0500a24132j23270A85711a07488A58222o5839J40105b7824B82793
12160C9695g2795C05043C0824d0098B36766A02974E1156a70195O4256A48410h0857
12148a0415F0160J62301D5260K04836D0337c23902g9232c357A01137c6886n4388
12137i1274j12266I4276e1573B96421a48763M6407k302j47644D26715E8550J7733
12126G6283l6450J09766N7880e0491A75620n7496d859p3353A6008O3157a15923
12114c3211B16670P7467r7356a91246A0112A447L46003F7543M2209K01760a16181
12102H4146Q8224a38089A21921e8093j7652g085H5962e8650D6172R9562C8235
$$ plain form
12090 81350 72629 354158 -90720 127273 252290 -171706 -119363 218910 -104054 275702
12079 39934 -23201 144247 303725 1053850 1973314 906102 85776 181466 -6220 -126608 -118993
12068 -118993 -73301 -39142 -278379 488333 326527 48624 6410 134739 -105089 123859
12057 142918 282667 -19886 11228 50333 154513 18051 -218107 6112 227805 146751 -32546
12045 81164 262286 205992 -209320 -63710 57188 -227326 -180973 -296815 -224452 45109 -62107
12033 420234 -79391 -148800 -31417 -9251 84294 132439 -223640 71181 -15382 -313761 17671
12021 452385 -52828 -275101 123965 115514 88487 25432 59965 -138138 204354 180005 194302
12010 194302 200289 50578 79608 187041 56818 -35493 161712 -290253 9735 39844 -415709
$$ packed form
12090H1350q721K81529i0720A27273J25017a71706N2343B18910a04054B75702
12079C9934b3201A44247J59478P50125R19464I06102H5776R5690f220j20388P615
12068a18993M5692L4159k39237D88333j61806D8624F410J28329a05089A23859
12057A42918J39749a9886A1228L9105J04180A8051b18107F112K21693q1054c2546
12045H1164J81122n6294b09320f3710E7188b27326M6353j15842P2363D5109f2107
12033D20234g9391o9409c1417i251H4294M8145b23640G1181a5382k98379A7671
12021D52385e2828k22273A23965q451k7027B5432L4533a38138B04354k4349J4297
12010A94302N987E0578K9030J07433E6818c5493A61712b90253I735L0109d15709
$$ plain form
11998 -164045 -294455 9450 161670 -16890 -70673 249722 -270066 -98860 29932 -105033 -327335
11987 -327335 -59203 -240476 -212923 -266671 66261 -379953 62351 -221969 81459 38008 82769
11976 82769 -117268 -21333 61249 -153146 -138995 100164 -155438 272663 79522 -190901
11965 -11013 125909 -349346 -184670 -120317 116102 -42781 136095 87626 306654 -34411
11954 443147 41794 306184 -18966 -172255 -136936 2004 -255612 -202359 88995 107110 -229300
11942 -148046 360234 -194606 69609 -50021 -47467 80426 -78862 83987 -61714 -2224 -12522
11931 -12522 -339867 -243296 -357366 -239070 165823 -94229 -288270 -14987 -101769 -112709 32533
11919 -44608 -42352 -2069 106297 -56942 169967 -81147 -245195 200125 55887 -14655 -83450
$$ packed form
11998a64045j30410I450J52220a6890n3783B49722b70066i8860B9932a05033k22302
11987c27335e9203j81273K7553n3748F6261c79953F2351b21969H1459C8008M4761
11976H2769a17268b1333F1249a53146J4151A00164a55438B72663G9522a90901
11965a1013A25909c49346J64676O4353A16102d2781A36095m8469K19028c4411
11954D43147D1794K64390a8966j53289L5319B004b55612N3253H8995J8115b29300
11942a48046C60234a94606F9609e0021K554H0426g8862H3987f1714b224j0298
11931a2522l27345R6571j14070J18296A65823i4229j94041a4987q6782j0940C2533
11919d4608K256b069A06297e6942A69967h1147j64048B00125E5887a4655o8795
$$ plain form
11908 -83450 -81724 -186266 -242355 126657 278105 47391 79706 422604 -272502 64827 199493
11897 199493 139326 -4360 39220 207774 -262911 101981 1614 -26537 -109324 201602 -47092
11885 22349 -57663 -250167 90758 133784 -28214 -340123 -148515 -145759 -107488 -40849 58595
11873 -48514 -293821 -297034 -115851 -46659 115848 -196572 -42200 -77891 109112 94420 13788
11861 -34947 -140050 -89139 -77124 -128475 269020 -166573 7696 -124547 -57190 -152479 228882
11849 -27752 3908 216083 -118991 -39123 46586 109516 28718 18225 -176769 -51072 146162
11837 -55877 91949 -19836 16980 -80212 422032 81802 7378 222987 -239727 113369 171525
11826 171525 -344950 -230855 264413 -378094 -29789 39602 -112211 173155 -6471 -87892
$$ packed form
11908h3450J726j04542n6089A26657J51448D7391L2315L42898b72502F4827J34666
11897A99493o0167d360C9220J68554b62911A01981A614b6537q2787B01602d7092
11885B2349e7663j92504I0758M3026b8214l11909a48515K756L8271d0849E8595
11873d8514k45307l213a15851d6659A15848a96572d2200l5691A09112j4692A3788
11861c4947j05103N0911J2015n1351B69020a66573G696a24547e7190r5289B28882
11849b7752C908K12175a18991c9123D6586O2930B8718j0493a76769e1072A46162
11837e5877I1949a9836A6980h0212D22032H1802G378K15609b39727A13369N8156
11826A71525c44950J14095B64413c78094b9789C9602a12211A73155f471q1421
$$ plain form
11816 -87892 15694 72211 -99491 39632 -112492 17962 -7114 -211950 -111484 104030 138167
11805 138167 -176631 69209 183179 -90281 -166206 277743 73105 -293185 383232 -302640
11794 131723 44406 -25920 89372 178645 -260747 245117 195902 -241808 -231435 -115050 65840
11782 -91384 -20677 101130 -177448 -79252 -31409 23777 -260185 229207 73311 -99089 -128467
11771 -128467 88871 -83339 -121502 -34160 -29452 200944 -98404 71095 -145509 -165480 -235589
11760 -235589 134914 -69811 -90475 39327 55265 101794 -130741 44624 95528 -17451 -119396
11749 -119396 -94307 189910 160640 -172381 14741 36949 -376 -78516 284868 -176773 -88046
11737 14803 574524 -60293 -93010 -357025 287942 7760 -64243 304594 -60732 35778 64545
$$ packed form
11816h7892A5694N6517i9491C9632a12492A7962g114k04836J00466A04030L4137
11805A38167a76631F9209J13970i0281p5925B77743G3105b93185C83232c02640
11794A31723D4406b5920H9372Q9273b60747B45117m9215b41808J0373a15050F5840
11782i1384b0677A01130a77448g9252c1409B3777b60185B29207G3311i9089k9378
11771a28467H8871h3339l8163c4160M708B00944i8404G1095a45509j9971p0109
11760b35589A34914f9811k0664C9327J5938M6529a30741D4624N0904a7451j01945
11749a19396K5089A89910k9270a72381A4741K2208c76p8140B84868a76773h8046
11737A4803N59721f0293l2717k64015B87942G760f4243C04594f0732C5778K8767
$$ plain form
11726 64545 -28259 16405 226526 5064 99427 216276 223783 -123901 88750 -175082 -208793
11715 -208793 87889 178763 -4902 75670 105313 -17085 215646 -156420 224863 156827 -1151
11703 22284 -77204 -20650 40072 -162340 68099 -139200 -136790 159505 51638 785 125586
11692 125586 143921 215136 330887 -147225 30959 -195167 -76921 -80912 267678 -179009 173221
11680 68918 33643 102963 -113850 -76485 159483 55643 -176654 99139 -36105 111457 45780
11668 -109387 -130044 45147 -112644 -160449 -44233 -61308 -89451 90932 10431 47214 98023
11657 98023 52867 237115 54846 186193 -227605 -59810 61596 166459 -14412 97768 52435
11646 52435 51037 31053 264363 -3827 -1743 293699 -41206 73336 51661 -78273 -149466 109235
$$ packed form
11726F4545b8259A6405K10121E064R4363J16849P507a23901H8750a75082l3711
11715b08793H7889R0874d902G5670K9643a7085B15646a56420B24863o8036a151
11703B2284g7204b0650D0072a62340F8099a39200K410A59505E1638G85J24801
11692A25586J8335P1215J15751a47225C0959a95167g6921l991B67678a79009A73221
11680F8918C3643O9320a13850L7365A59483E5643a76654I9139c6105A11457D5780
11668a09387k0657D5147a12644m7805d4233j7075k8143I0932A0431L6783N0809
11657I8023m5156J84248E4846J31347b27605e9810F1596J04863a4412I7768m5333
11646E2435j398j9984K33310c827a743B93699d1206G3336k1675g8273p1193A09235
$$ plain form
11633 184141 206239 -27312 33491 117512 -191909 321578 -241980 42053 457299 299308
11623 299308 -3857 -34638 38775 251856 42237 -213383 269975 -128064 68664 233065 159769
11612 159769 222483 -50965 -56028 -1269 -301119 -119671 -83100 150261 142212 150249 -291988
11600 -55313 -109308 -92044 105161 -249554 179648 145536 -141849 -13575 -168628 50926 -231472
11588 60555 321023 32170 80931 70482 -1626 124109 90560 438678 -231138 -6824 59921
11576 -32846 -229215 -106699 19032 -33582 -66082 -224299 -20454 21544 102766 277068 -39437
11564 -104754 28428 106647 -91802 191984 92407 189188 -25096 254902 189559 153678 39343
11552 -164022 -21450 223915 283310 -77059 176784 -200138 199760 -316859 235155 -79093
$$ packed form
11633A84141K2098b7312C3491Q4021a91909C21578b41980D2053M15246j57991
11623B99308c857l0781C8775K13081D2237b13383B69975a28064F8664J64401p3296
11612A59769O2714e0965n063a269k99850a19671L6571A50261q049Q037b91988
11600e5313n3995J7264A05161b49554A79648l4112a41849a3575j55053E0926b31472
11588F0555K60468C2170M8761j0449a626A24109l3549L48118b31138f824E9921
11576c2846j96369a06699A9032c3582l2500j58217b0454B1544Q1222J74302c9437
11564a04754B8428P8219i1802A91984I2407R6781b5096B54902o5343l5881C9343
11552a64022b1450B23915N9395g7059A76784b00138A99760c16859B35155g9093
$$ plain form
11541 97042 -16425 90230 243007 -190000 64580 224399 131071 -662 638861 33972 -203691
11529 -64934 -241773 94193 63259 124939 92742 178511 157913 123785 109218 -46118 -35379
11518 -35379 147549 138861 32997 -40885 79021 338651 -112823 223848 140601 95591 225746
11507 225746 -64044 234284 505716 197100 18340 55154 440456 -69264 68217 -101234
11496 172684 68413 192788 210528 116621 -188761 166939 175557 123729 198536 112540 348774
11485 348774 359038 -164904 276425 289903 57176 18165 36621 -85933 -23410 -78371 -135074
11474 -135074 152781 375651 203011 50187 23254 176833 -181991 -110006 140848 290532
11464 290532 267928 -209645 105105 520250 186807 156532 -88652 -197038 -15909 76001
$$ packed form
11541I7042a6425I0230J52777a90000F4580J59819r3328f62F38861C3972b03691
11529f4934j76839I4193l0934O1680l2197Q5769k0598l4128j4567d6118J0739
11518c5379A47549q688C2997d0885G9021K59630a12823B23848q3247m5010J30155
11507B25746f4044B34284K71432A97100A8340L6814L85302f9264F8217a01234
11496A72684F8413J24375J7740r3907a88761A66939Q618n1828P4807q5996K36234
11485C48774J0264a64904B76425J3478E7176A8165J8456h5933b3410n4961n6703
11474a35074A52781K22870j72640E0187B3254J53579a81991P1985A40848J49684
11464B90532k2604b09645A05105M15145A86807l0275h8652j08386a5909G6001
$$ plain form
11453 386763 8969 -218829 -53282 34460 -32937 21379 81617 -59950 -115640 -60133 119127
11441 384075 -91010 -34956 7132 -16364 123145 -55203 -124882 15126 283774 -29652 208597
11429 -24873 -43157 -205598 66443 -9815 -115342 73569 74396 176616 -11499 -185358 -257052
11418 -257052 139116 -279805 359378 -65347 -25590 -16586 86759 -118317 345544 143886
11407 88600 -36623 -281148 107878 251761 -164473 -142069 130814 -30639 -45287 -37312 -81295
11396 -81295 -248336 16727 136200 -103704 341716 -179680 -148418 97820 -94349 109197
11385 91404 30890 303628 -4803 336483 -134471 241010 -142205 185039 162918 -223080
11374 141316 138093 -94313 -225102 24493 84219 -119165 -277121 19492 112145 37149 -24522
$$ packed form
11453C86763H969b18829e3282C4460c2937B1379O0238e9950n5690N5507A19127
11441C84075i1010c4956G132a6364A23145e5203o9679A5126K68648b9652B08597
11429b4873j8284j62441F6443i815j05527G3569Q27J02220a1499j73859p1694
11418b57052A39116b79805C59378f5347b5590R004H6759a18317C45544A43886
11407H8600c6623k44525A07878J43883a64473K2404A30814c0639j4648P975m3983
11396h1295j67041A6727J19473a03704C41716a79680L1262I7820i4349A09197
11385I1404C0890K72738d803C36483a34471B41010a42205A85039k2121b23080
11374A41316l223i4313j30789B4493N9726a19165j57956A9492R2653C7149b4522
$$ plain form
11362 -222655 -95918 371938 -115456 -231947 69319 199611 22341 -50132 203583 142886
11352 142886 -196780 -103392 265920 -168126 166434 -57916 11762 334389 97735 67129
11342 67129 -16908 104408 64286 82681 350916 -119467 -71008 -12149 -358078 -22077 13575
11330 -187130 76485 292602 77345 -89140 -61773 -7080 190839 124373 92768 -95532 310784
11318 190303 179259 -29054 -39593 229412 67582 -45983 -132541 -214001 -46631 -329849 -211979
11307 -211979 -425981 244885 -13898 -163867 -279597 218134 8430 -269033 -288415 -45299
11296 -49668 -68710 147979 -238197 -163272 31279 -8942 -34415 86912 -198377 -336811 -258324
11285 -258324 -48031 96779 -6557 -375629 179911 -149713 -29903 20509 33977 -59037 179763
$$ packed form
11362b22655i5918C71938a15456j16491F9319J30292B2341e0132B03583o0697
11352A42886a96780R3388B65920a68126A66434e7916A1762L22627I7735l0606
11342F7129a6908A04408m0122J8395K68235a19467M8459a2149l45929b2077A3575
11330a87130G6485K16117G7345h9140K7367g080A90839o6466l1605i5532C10784
11318A90303j1044b9054j0539B29412F7582d5983q6558q1460d6631k83218J17870
11307b11979k14002B44885a3898j49969j15730B18134H430b69033j9382d5299
11296d9668j9042A47979b38197P4925C1279h942k5473H6912a98377j38434P8487
11285b58324d8031I6779f557l69072A79911a49713b9903B0509J3468e9037A79763
$$ plain form
11273 98164 -104469 -19528 -282620 -494946 -78863 11966 285782 -170386 141379 -138258
11262 270100 149462 -57485 139065 -200060 316855 -65333 220105 40 243198 212557 -218122
11250 -181958 51739 242591 184663 181704 -458398 269983 156161 -31448 -7792 2757 -13841
11238 202257 -77504 -147452 -141532 6500 -25515 164510 17672 136859 -85423 165781 -31850
11226 -675262 -87409 83847 -343944 -25032 -236499 121764 137926 -301701 -321603 -61038 -55131
11215 -55131 33016 166298 -378584 110554 66795 -271943 -225756 -107345 -277733 -42235
11204 147149 -18198 30195 180556 -27453 -118375 -269648 -15617 -258934 -108810 -31208 -137525
11193 -137525 -109743 16440 -35744 -64306 142740 -50572 232102 429937 -275364 54251 -32354
$$ packed form
11273I8164a04469a9528k63092k12326g8863A1966K73816a70386A41379a38258
11262B70100j20638e7485A39065b00060C16855f5333B20105D0K43158l0641b18122
11250a81958E1739J90852n7928k959d58398B69983j13822c1448g792B757a3841
11238B02257g7504o9948N920F500b5515A64510A7672J19187h5423A65781c1850
11226f75262h7409H3847c43944b5032k11467A21764J6162c01701j9902f1038N907
11215e5131C3016J33282c78584A10554m3759b71943M6187a07345j70388d2235
11204A47149a8198C0195J50361b7453r0922j51273a5617k43317a08810c1208j06317
11193a37525K7782A6440c5744k8562A42740e0572B32102J97835b75364E4251c2354
$$ plain form
11181 277811 -268807 72323 46738 157083 95681 130444 -284949 141590 -31796 139778
11170 -125215 62311 160910 -292940 -18234 43272 -102582 392496 -94108 -180161 100228 -79088
11158 172739 -67199 -158544 60129 85268 -177582 99835 66843 -253580 -96882 -13165 -169374
11147 -169374 111502 72997 -21063 349260 157133 74318 -74566 341687 -136743 -133589 135478
11135 134991 -88735 181286 -279983 138502 -77172 -163297 -213435 -60862 -61027 171089 -205667
11123 119680 72791 -12852 -2689 200013 -115184 -231070 114912 -409882 -342851 615609
11112 -187153 -86526 -161535 253170 370299 -69784 42883 -42532 287844 325419 48068 12973
11100 37117 185623 -13532 22691 76011 -13327 -25188 316324 99646 39625 235280 136500
$$ packed form
11181B77811b68807G2323k5585J10345o1402L4763b84949A41590c1796A39778
11170a25215F2311R8599b92940a8234D3272a02582C92496i4108q6053A00228g9088
11158A72739f7199r1345F0129K5139a77582I9835l2992b53580i6882a3165j56209
11147a69374A11502l8505b1063C49260A57133G4318g4566C41687a36743L154A35478
11135A34991h8735A81286b79983A38502g7172q6125n0138f0862j65A71089b05667
11123A19680m6889a2852b689B00013a15184j15886A14912d09882O7031F15609
11112a87153h6526p5009B53170J17129f9784D2883d2532B87844L7575D8068A2973
11100C7117J48506a3532B2691N3320a3327j1861C16324I9646C9625J95655r8780
$$ plain form
11089 136500 -110100 16342 441443 51264 -302314 241482 32766 548673 36669 390117
11079 390117 290093 122659 340861 212733 358326 478570 84154 221635 292948 231567
11069 231567 264742 411425 315745 385096 98467 331322 719453 675183 364034 644372
11059 644372 210452 895354 323850 268558 280456 589483 483919 472493 809220 550861
11049 550861 801639 556567 569197 642849 493142 696505 739053 364719 628241 767812
11039 767812 920240 409703 633685 583692 625431 580302 480483 638215 604462 283835
11028 420445 831023 878273 480403 713477 852414 632750 632220 465845 748264 688345
11018 688345 569431 433821 570960 686534 741127 562560 551517 483896 554020 597404
$$ packed form
11089A36500a10100A6342M25101E1264c02314B41482C2766N15907C6669L53448
11079C90117j00024A22659K18202j28128J45593J20244H4154J37481P1313o1381
11069B31567L3175J46683r5680O9351I8467K32855L88131m4270l11149K80338
11059F44372B10452O84902C23850n5292J1898L09027j05564j1426L36727k58359
11049E50861K50778k45072J2630P3652j49707K03363M2548C64719K63522J39571
11039G67812J52428D09703K23982m9993M1739m5129r9819J57732l3753B83835
11028D20445M10578M7250l97870K33074J38937k19664n30j66375K82419n9919
11018F88345j18914j35610J37139J15574N4593j78567j1043o7621P0124M3384
$$ plain form
11008 597404 751376 589770 660467 906285 528292 568687 613080 776953 546431 370431
10998 370431 496490 493007 693985 409281 386042 223269 525674 430232 619563 871570
10988 871570 460763 789763 1004091 1001680 1023476 882229 940301 789464 966713 1219066
10978 1219066 1260523 1276676 1248808 1691921 1979255 2091858 2303571 2377972 2614308 2516568
10968 2516568 2612387 2120364 2135102 1718406 1510589 1446873 1803901 1798756 1705586 1360364
10958 1360364 1585036 1446802 1715419 1586552 1358061 1113408 1059458 1188413 954318 520974
10948 520974 444377 576071 251705 310565 366908 349818 58389 226301 159126 176120 415785
10937 415785 101396 240305 424804 10580 278795 275939 -85537 87365 227117 339427
$$ packed form
11008E97404J53972j61606P0697K45818l77993M0395M4393J63873k30522j76000
10998C70431J26059l483K00978k84704k3239j62773L02405r5442J89331K52007
10988H71570m10807L29000K14328k411K1796j41247N8072j50837J77249K52353
10978A219066M1457J6153k7868M43113K87334J12603K11713P4401K36336r7740
10968B516568R5819m92023J4738m16696k07817o3716L57028n145r3170l45222
10958A360364K24672j38234K68617j28867k28491k44653n3950J28955k34095m33344
10948E20974p6597J31694B51705N8860N6343j7090E8389J67912o7175J6994K39665
10937D15785A01396J38909J84499A0580K68215k856h5537H7365J39752J12310
$$ plain form
10927 339427 104869 -59798 -74033 359689 176027 -7272 319130 156796 -190443 240036
10916 250435 -53221 42717 167531 -13435 124879 41020 59884 -40327 41500 78124 -88069
10904 168837 255314 -150765 248598 206301 284764 -50679 -44513 128600 227831 -8988 -24758
10893 -24758 -52104 -25436 -139098 -324629 61441 167210 191495 107040 -26168 -119628 -155866
10882 -155866 -336720 104692 112726 171365 87511 -15101 -9683 52412 -79055 -112328 169182
10870 110500 297610 -88612 -30675 -155740 175606 68332 61996 -87047 -96333 16921 82959
10859 82959 235865 -200086 -77444 129715 -132879 -221617 -46529 -56575 45598 211712 288312
10848 288312 83265 161539 -119055 -30509 186573 121802 -439809 -207189 26060 87144 -120119
$$ packed form
10927C39427A04869e9798j4235C59689A76027g272C19130A56796a90443B40036
10916B50435e3221D2717J24814a3435A24879D1020J8864d0327D1500L6624h8069
10904A68837Q6477a50765B48598m2297P8463e0679O166A28600R9231h988j5770
10893b4758k7346b5436j13662j85531F1441J05769K4285q4455b6168r3460l6238
10882a55866j80854A04692Q034N8639q3854a5101N418E2412g9055l3273A69182
10870A10500J87110h8612c0675j25065A75606F8332o336h7047r286A6921O6038
10859H2959J52906b00086g7444A29715a32879q8738d6529j0046D5598J66114P6600
10848B88312H3265P8274a19055c0509A86573o4771d39809b07189B6060O1084a20119
$$ plain form
10836 -264652 205922 164709 -310104 218440 57488 -74109 22001 -78574 65187 -10817 -127974
10825 -127974 -141656 -212153 143921 -124738 -281919 -163023 -65225 -127364 249899 67358
10814 26522 -42435 -405596 16581 -214305 205067 -179664 -266218 -272156 -140199 -48845 -1549
10802 -263704 74261 219976 -7853 -57507 105065 -59208 105098 -290117 -2423 -346496 -4670
10790 98315 48095 -60480 77463 92053 259416 72447 -16242 280645 -29963 -144074 55435
10778 87145 -341424 -375162 -406500 -134271 -63624 -129091 -24716 201338 -120540 218665 -199970
10766 38529 89054 -277478 20234 35131 -268922 52460 48116 -227822 487141 207199 -353749
10754 -210367 70429 -77699 -30794 296181 222664 -145042 -283563 -66164 -89779 -146222 312665
$$ packed form
10836b64652B05922m1213c10104B18440E7488g4109B2001g8574F5187a0817j17157
10825a27974j3682p0497A43921a24738j57181J18896f5225o2139B49899F7358
10814B6522d2435l63161A6581b14305B05067a79664q6554n938J31957d8845a549
10802b63704G4261J45715g853m9654A05065e9208A05098b90117b423l44073d670
10790I8315D8095f0480G7463J4590J67363G2447a6242B80645b9963j14111E5435
10778H7145c41424l3738l1338a34271f3624o5467b4716B01338a20540B18665a99970
10766C8529N0525b77478B0234J4897b68922E2460m344b27822D87141B07199c53749
10754b10367G0429g7699c0794B96181p3517a45042j38521f6164k3615n6443C12665
$$ plain form
10742 201745 83140 130300 131857 7619 -139001 135857 65998 -234798 -132473 263235 -143174
10730 -180977 360605 -35733 -183042 -149953 6195 16006 -136919 163411 104586 -196645 -287400
10719 -287400 182708 104957 31219 164388 -152563 -96729 -331607 231 -47161 -18556 157971
10707 -49659 261367 134372 -370544 -186665 -163982 -84143 154403 -151413 151080 -80961
10696 69900 -268321 -40568 -238670 -292634 187093 -53242 252724 -270608 -570614 110830
10685 -250650 16089 -410617 -49186 -31214 165357 115362 -220716 -83407 42956 -15722 -309932
10674 -309932 160613 125459 83864 -240225 66014 77073 -16681 -164208 -60363 -53577 125868
10662 -165789 133650 -95047 -36040 -25201 122138 -152125 57198 118517 151980 63011 128352
$$ packed form
10742B01745H3140M7160J557G619a39001A35857F5998b34798J02325B63235a43174
10730a80977C60605c5733j47309L3089F195R811a36919A63411n8825a96645r0755
10719b87400A82708p7751C1219J33169a52563N5834k34878B31d7161a8556A57971
10707d9659B61367j26995c70544J83879K2683P9839A54403a51413A51080h0961
10696F9900b68321d0568j98102n3964A87093e3242B52724b70608l00006A10830
10685b50650A6089d10617d9186J7972A65357m9995b20716h3407D2956a5722k94210
10674c09932A60613l5154m1595b40225F6014J1059a6681j47527f0363O786A25868
10662a65789A33650i5047c6040J0839A22138a52125E7198O1319L3463F3011O5341
$$ plain form
10651 128352 40010 -346143 -115726 -34998 104282 94757 57965 123415 -302919 -276658 -36377
10639 -92780 -4284 -4995 -179051 -154028 -37936 -218991 -65371 -258862 39359 34426 -158664 57520
10626 -73555 -201674 -24226 -15606 -202468 -461941 -267672 -17068 -91477 -202597 -262895 -299509
10615 -299509 -14252 60764 35643 42084 55247 -157040 83495 48871 72235 -54162 137397
10603 -39637 88365 -318832 -161925 518 -261254 83804 -166458 82092 -111895 47430 -209148
10591 -235550 -67848 -553 -139276 -59787 -9485 156356 201512 42756 24344 -38168 -186163
10580 -186163 -238300 -136776 -402703 88304 107943 -1737 184003 -35705 240810 423531 -28816
10568 -93222 -12392 -13698 11215 -17316 -324537 -180123 -52419 112505 -161072 111922 -265807
$$ packed form
10651A28352D0010c46143a15726c4998A04282r525l6792O5450c02919K6261c6377
10639i2780d284p11j74056K5023c7936j81055f5371j93491C9359m933a58664E7520
10626g3555j28119b4226Q620j86862k59473J94269a7068p4409j11120o0298l6614
10615b99509a4252F0764k5121O441J3163a57040H3495l4624K3364e4162A37397
10603c9637H8365c18832J56907E18b61254H3804a66458H2092a11895D7430b09148
10591b35550f7848e53j38723e9787i485A56356M5156D2756j8412c8168j47995
10580a86163n2137J01524k65927H8304J9639a737A84003c5705B40810J82721b8816
10568i3222a2392j306A1215a7316l07221J44414e2419A12505a61072A11922b65807
$$ plain form
10556 36940 -61875 278172 157828 -114108 5478 -25766 -184862 -6803 79714 -326835 -94603
10544 -38640 129459 -37514 -13756 -39140 159519 -72539 -313884 29429 -78482 -166618 -219980
10533 -219980 -110995 -334059 -349614 -11993 -120955 -21152 95146 137635 48252 -177697 168933
10521 -175109 -101028 -127307 -136998 284338 161404 496794 485724 -237777 2621 65798 -99259
10509 27728 -279132 136252 -171383 -182873 287736 314340 -207311 105086 -107768 -65468
10499 -65468 -68108 -182041 -154917 101289 47478 -295544 -184501 210383 -122729 -264996
10489 -264996 118685 83855 -27412 209518 83477 123191 388756 192264 272462 509575
10479 509575 40579 65609 111872 541322 -39473 138880 -159182 77530 -127823 201659
$$ packed form
10556C6940f1875B78172j20344a14108E478b5766j59096f803G9714c26835i4603
10544c8640A29459c7514a3756k5384A59519g2539k41345B9429g8482q8136n3362
10533b19980J08985k23064j5555a1993j08962b1152I5146M2489D8252a77697A68933
10521a75109P4081k6279r691B84338j22934L35390j1070b37777B621O3177i9259
10509B7728b79132A36252a71383j1490B87736K6604b07311A05086a07768M2300
10499f5468k640j13933K7124A01289D7478b95544J11043B10383a22729j42267
10489b64996A18685l4830b7412B09518H3477L9714K65565A92264Q0198K37113
10479E09575D0579K5030M6263M29450c9473A38880a59182G7530a27823B01659
$$ plain form
10468 -232995 -279932 -192192 164765 251347 -124748 75482 -55331 5157 -104312 145457 -108433
10456 -126896 60553 -48274 104184 -239423 -33059 17743 885 -104540 318194 -207590 -85488
10444 -81691 171023 9616 163682 -112511 432649 -8937 -85427 -62793 28163 173942 193752
10433 193752 69971 58082 101929 -173003 -174646 -286473 369655 -238336 -59480 231868 81203
10421 19512 253438 208388 -163364 -94126 -77441 148569 -37305 86815 -347724 -139709 -31860
10409 134812 -252479 -25539 35709 272987 -72683 57077 72797 -110556 -124121 -221560 -59091
10397 132108 309278 -43481 -86837 -85120 395153 104091 -166180 139471 180664 -56273 94682
10385 42938 231404 100557 -84877 175132 117987 56380 -24043 98189 177944 -19424 208265
$$ packed form
10468b32995m6937Q7740A64765Q6582a24748G5482e5331E157a04312A45457a08433
10456a26896F0553d8274A04184b39423c3059A7743H85a04540C18194b07590h5488
10444h1691A71023I616J54066a12511D32649h937p6490K2634B8163J45779J9810
10433A93752F9971j1889M3847a73003j643j11827C69655b38336e9480B31868H1203
10421A9512K33926m5050a63364O9238J6685A48569c7305H6815c47724a39709c1860
10409A34812b52479b5539C5709K37278g2683E7077J5720a10556j3565r7439e9091
10397A32108J77170d3481m3356J717C95153A04091a66180A39471M1193e6273I4682
10385D2938J88466A00557h4877A75132n7145E6380b4043I8189P9755a9424B08265
$$ plain form
10373 -103053 34447 -664 236975 52215 158476 314038 577514 319993 24885 80262 149853
10362 149853 281279 326197 196907 80481 249309 -212738 266981 354609 -100249 -6788
10351 24799 353251 432818 428261 320716 185934 489919 125470 211442 421781 147275
10340 191702 253237 149172 60177 13718 -104206 35674 242603 -285332 407062 165522
10329 113337 326750 205134 19834 14549 -300137 274597 182450 7625 357056 183441 64142
10317 153418 225223 82191 7519 103800 287663 308379 289746 -176031 -220791 -93294 -9314
10305 -123159 195654 -100009 -24754 -326059 -138642 76078 51158 -175291 212920 -138272
10294 279060 2388 44433 207194 -15517 -485145 256316 -261369 -134970 62784 290658
$$ packed form
10373a03053C4447f64B36975E2215J06261J55562K63476k57521B4885N5377O9591
10362A49853J31426M4918j29290H0481J68828b12738B66981Q7628a00249f788
10351B4799L28452P9567m557j07545j34782L03985A25470Q5972K10339A47275
10340A91702O1535j04065F0177A3718a04206C5674K06929b85332D07062A65522
10329A13337K13413j21616A9834n285c00137B74597r2147G625L49431j73615F4142
10317A53418P1805H2191G519R6281J83863K0716j8633a76031m4760i3294i314
10305a23159A95654a00009b4754l01305a38642G6078k4920a75291B12920a38272
10294B79060B388M2045J62761a5517m69628B56316b61369J26399F2784K27874
$$ plain form
10284 290658 -15074 -176347 115655 90495 120905 269439 -33353 295838 -457065 48744
10273 94233 -301130 -20497 158926 5089 -351402 40120 -136227 12233 -91002 -313918 35052
10261 188287 582540 40070 260398 163763 2724 161884 222929 -65210 -86236 -373 -9787 52828
10248 -200933 58872 50461 53458 -188199 -109398 172224 -99522 -251773 129760 114766 -1935
10236 99332 -10327 41088 57890 -388801 -36743 -310194 268006 75102 -298480 -91177 -137061
10225 -137061 -176663 279388 205970 353824 -65323 86532 152095 -282103 -43751 -200560 149000
10213 -39401 87815 -163698 185175 -136463 245419 71428 64686 -57331 -270810 -484509 -127638
10201 -129310 165506 355862 176591 95256 -128326 -92160 -29651 108283 -9455 -44945 -191743
$$ packed form
10284B90658a5074j61273A15655k5160L0410J48534c3353B95838d57065D8744
10273I4233c01130b0497A58926E089c51402D0120a36227A2233i1002k22916C5052
10261A88287L94253D0070K20328r6635B724J59160O1045f5210k1026c73r414E2828
10248b00933E8872q411K997a88199P8801A72224i9522j52251A29760j4994a935
10236I9332a0327D1088J6802c88801c6743k73451B68006G5102b98480i1177m5884
10225a37061l9602B79388p3418J47854f5323H6532O5563b82103d3751j56809A49000
10213c9401H7815a63698A85175a36463B45419G1428o742e7331k13479k13699a27638
10201a29310A65506J90356A76591q1335a28326L6166b9651A08283i455l5490j46798
$$ plain form
10190 -191743 -452456 -26177 111298 234027 -126173 2113 5949 250752 342146 -267156 -218255
10179 -218255 -151350 -255318 -140877 56503 -77423 -117390 -214488 -234901 -432972 -237300 -209450
10168 -209450 -47053 -303273 231575 37288 -207841 -289236 -442108 131679 113318 388859
10158 388859 -223614 35705 59647 -44517 -129075 -23790 -213973 -220849 47200 -137773 -203437
10147 -203437 -181238 -143458 -55746 60745 -478052 102275 139778 70862 -130218 36238 -330474
10135 225035 -66372 169787 -345031 -43750 57313 74212 -8884 51624 -390859 115629 -205583
10123 -164030 156888 127837 31222 -279376 39119 -10323 110534 -124518 31588 135149
10113 135149 322342 -2570 21916 59750 -191961 34363 59976 -42406 -355371 -137868 -58577
$$ packed form
10190a91743k60713b6177A11298J22729a26173B113L836K44803R1394b67156M8901
10179b18255O6905j03968J14441E6503g7423l9967r7098k0413j98071J95672K7850
10168b09450d7053k56220B31575C7288b07841q1395j52872A31679j8361K75541
10158C88859b23614C5705K3942d4517q4558b3790j90183o876D7200a37773o5664
10147b03437K2199L7780e5746F0745d78052A02275L7503o8916a30218C6238c30474
10135B25035f6372A69787c45031d3750E7313J6899h884E1624c90859A15629b05583
10123a64030A56888k9051C1222b79376C9119a0323A10534a24518C1588J03561
10113A35149J87193b570B1916L7834a91961C4363K5613d2406l12965a37868e8577
$$ plain form
10101 -71296 -39544 -536869 -438762 -15464 337839 -126910 -296794 153274 -251203 -159899
10091 -159899 -187764 -58954 130260 40463 176431 -93263 -69393 333942 -112536 -20495 125666
10079 -92633 -83923 -159166 -387367 -130995 351540 -232114 -209115 -47145 94503 35768 -340
10067 435295 364852 -237945 -90421 -2316 -213429 -57287 -241193 151537 -51486 80120 312243
10056 312243 -187714 109412 -1633 159689 -279756 33765 -74335 -186297 -209467 -304218 -257827
10045 -257827 -107391 -151859 -87635 -204624 210510 66725 -267564 -253740 -312869 -41207 35320
10033 171975 -31883 -156247 -139316 108822 -58668 -258765 -418986 61784 -66115 -187564
10023 -187564 29439 228690 169946 83742 -5759 52866 -183239 -317236 -12668 -16917 -59382
$$ packed form
10101g1296L1752m97325R8107a5464C37839a26910j69884A53274b51203R1304
10091a59899k7865e8954A30260D0463J35968i3263K3870C33942a12536b0495A25666
10079i2633Q710p5243k28201a30995C51540b32114K2999d7145I4503C5768c40
10067D35295p0443b37945i0421b316k11113e7287j83906A51537e1486H0120K32123
10056C12243a87714A09412a633A59689b79756C3765g4335j11962k3170r4751M6391
10045b57827a07391m4468O4224j16989B10510F6725b67564J3824n9129d1207C5320
10033A71975c1883j24364J6931A08822e8668k00097j60221F1784f6115j21449
10023a87564B9439J99251n8744H3742e759E2866a83239j33997a2668m249m2465
$$ plain form
10012 -59382 -423388 -344781 -332352 157665 -263813 -248404 66550 -98637 106169 -15933 327360
10000 -87393 -338311 237363 48418 113180 -194406 172265 229254 -257611 -356475 -46874 69737
9988 -6185 -261612 -184287 -27786 -232337 -229501 -87035 16096 235750 169366 -94053 102243
9976 -62745 -85726 -330868 -229344 -285280 -97051 -357938 -79071 -255181 30283 18771 -14018
9964 7645 161234 -199783 -190013 -8344 -133403 -149204 115474 -151879 -148811 -1537 49860 55025
9952 55025 -44038 171002 -203344 -52938 -17632 36275 -228027 -44868 -164700 -69354 70314
9940 -62602 21554 -138974 107845 -91405 -114586 -283407 107540 173748 133540 -64971 -198833
9929 -198833 213990 -244555 75198 -99577 6028 -378973 134626 54082 -2852 218301 -193156
$$ packed form
10012e9382l64006P8607J2429A57665b63813J5409F6550i8637A06169a5933C27360
10000h7393k50918B37363D8418O4762a94406A72265N6989b57611r8864d6874F9737
9988f185k55427P7325b7786k04551K836h7035A6096K19654o6384i4053A02243
9976f2745k2981k45142J01524n5936i7051k60887g9071j76110C0283j1512a4018
9964G645J53589a99783R770h344j25059j5801A15474a51879L068a537D9860N165
9952E5025d4038A71002b03344e2938a7632C6275b28027d4868j19832f9354G0314
9940f2602B1554a38974A07845i1405k3181j68821A07540O6208m0208f4971j33862
9929a98833B13990b44555G5198i9577F028c78973A34626E4082b852B18301a93156
$$ plain form
9917 253808 -196216 93318 91286 129870 -17025 193120 -97193 53407 -175101 -55496 -132900
9906 -132900 103055 -241329 -485362 15198 296645 272489 -235540 -82199 116021 251715
9896 251715 13681 91301 173172 -175599 -135250 -344755 -123901 -10190 -105897 19929 -301263
9884 -260904 40081 -57092 176880 -116622 -66144 45757 -60482 103030 -331420 168917 -362089
9872 64363 19306 13470 -61862 -99358 -39840 -332553 -410938 117498 -236734 -11422 -369860
9861 -369860 -269995 -10998 911 -254459 405890 140326 -262984 35571 -218987 -142247 -7760
9849 20307 27385 -328341 -209244 -97310 -134457 -151488 -85303 11695 263261 87605 -98826
9837 84376 15514 -131115 -300165 -57174 54979 116577 191109 -82368 -276471 19294 225486
$$ packed form
9917B53808a96216I3318k032L8584a7025A93120i7193E3407a75101e5496p7404
9906a32900A03055b41329k44033A5198K81447k4156b35540h2199A16021J35694
9896B51715A3681P7620Q1871a75599M0349k09505a23901a0190r5707A9929c01263
9884b60904D0081e7092A76880a16622N0478D5757f0482A03030c31420A68917c62089
9872F4363A9306n836f1862l7496c9840k92713p8385A17498b36734a1422l58438
9861c69860R9865a0998I11b54459D05890A40326b62984C5571b18987P6740g760
9849B0307P078c28341J19097i7310l7147j7031O6185A1695K51566H7605i8826
9837H4376A5514a31115j69050e7174E4979O1598P4532h2368j94103A9294K06192
$$ plain form
9826 225486 119320 -288661 144938 -27601 -165459 -56140 -260955 -98331 52906 55888 -37737
9814 27967 120799 -54832 -227498 -168271 -138042 -64374 -96183 -269795 -49771 -296626 -241278
9803 -241278 1301 13502 -303230 -150390 236912 5145 -82756 -73123 75891 179995 -86979
9791 -24696 -28269 -204997 -113287 -254280 69076 95233 -202180 -44525 7894 -130263 -190427
9780 -190427 -53650 -247466 -66420 -82070 158648 30875 38633 26078 -315016 102317 -217405
9768 2730 80783 -144304 -59191 15903 -256800 -438574 186555 70870 -4461 -37428 -191818
9757 -191818 16710 43281 -101042 -176618 -5454 343782 -22718 -24724 113603 274657 -550570
9745 34285 -89559 100774 -134355 190478 -148451 37491 191808 4812 -102280 -367554 114520
$$ packed form
9826B25486j06166b88661A44938b7601j37858e6140k04815i8331E2906K982c7737
9814B7967R2832e4832j72666N9227L0229f4374l1809j73612d9771k46855N5348
9803b41278A301J2201c03230a50390B36912E145h2756R633G5891J04104h6979
9791b4696l573j76728R1710j40993F9076K6157b02180d4525G894a30263o0164
9780a90427e3650j93816f6420j5650A58648C0875P758j2555c15016A02317b17405
9768B730P8053a44304e9191A5903b56800j81774A86555G0870d461l2967j54390
9757a91818A6710K6571a01042p5576e454C43782b2718k006A13603J61054e50570
9745C4285h9559A00774a34355A90478a48451C7491J54317D812a02280k65274A14520
$$ plain form
9733 -396437 121800 85337 76056 -171207 -123743 -216091 19059 136667 -110772 12100 -433595
9721 -107403 -129016 -184503 -115320 -110599 4983 -304179 -491552 22075 -42293 -140878 111116
9709 -25630 -72004 -3726 61435 173648 -45617 -72003 -347882 -297187 -149553 13120 101243
9698 101243 -471324 -153040 170624 -315619 203732 119090 -184612 -196339 -79193 -94530
9688 -94530 -114837 -146085 29176 -111953 227573 -144474 3968 183633 124149 -129250 -172446
9677 -172446 -66058 -14627 11463 -96602 89402 -320877 19 -4381 -63613 180298 166609 -85540
9664 -275948 -305567 -378648 -4663 -131531 -31302 66905 -261763 -131459 28726 -14860 31073
9652 -266299 -214916 -76285 69897 -265166 -34917 -357448 -51374 6231 -116607 -279103 -19045
$$ packed form
9733c96437A21800l6463r281a71207M7464r2348A9059J17608a10772A2100d33595
9721a07403k1613n5487O9183M721D983c04179j87373B2075d2293r8585A11116
9709b5630m6374c726F1435J12213d5617k6386k75879N0695J47634A3120Q8123
9698A01243d71324a53040A70624c15619B03732q4642a84612j1727g9193j5337
9688i4530k0307l1248B9176a11953B27573a44474C968J79665n9484a29250m3196
9677a72446f6058a4627A1463i6602H9402c20877A9d381n9232A80298j3689h5540
9664b75948k9619p3081d663j26868c1302F6905b61763J30304B8726a4860C1073
9652b66299N1383g6285F9897b65166c4917l22531e1374F231a16607j62496a9045
$$ plain form
9640 -100502 15462 -204476 -217533 -146300 134435 31960 -241832 207620 -169685 -18188 17295
9628 -331600 -150302 335209 -105208 52437 -45062 10906 -267374 18315 -16379 271862 -109639
9616 -38209 -143589 255829 87102 141581 -361 85683 122297 -54233 -92084 -46482 -240703 -32842
9603 -43577 14244 176696 28956 -225754 -175904 -68602 -119419 -85435 -104272 131799 16006
9591 17770 316159 -6298 -39185 -18717 229332 43289 -25362 -92952 -20824 243674 61596
9579 53360 -21484 -227078 -302383 105719 -67625 -305765 93240 -367531 -351938 377371 70294
9567 -175790 100272 72223 263486 -51585 48291 -194822 245320 -137360 -1667 -197834 -139129
9556 -139129 314612 -56508 285962 -23212 -110387 132441 -64255 94754 -373776 181319 -257526
$$ packed form
9640a00502A5462b04476j3057P1233A34435C1960b41832B07620a69685a8188A7295
9628c31600a50302C35209a05208E2437d5062A0906b67374A8315a6379B71862a09639
9616c8209j05380B55829H7102N4479c61H5683L6614e4233l7851M5602j94221c2842
9603d3577A4244J62452B8956b25754M9850f8602n0817L3984j8837A31799A6006
9591A7770K98389f298l2887a8717B29332D3289b5362o7590b0824B43674F1596
9579E3360b1484k05594p5305A05719f7625k38140I3240c67531J5593C77371G0294
9567a75790A00272k8049J91263e1585D8291a94822B45320a37360a667j96167N8705
9556a39129C14612e6508B85962b3212q7175A32441f4255I4754c73776A81319b57526
$$ plain form
9544 131299 -20891 382749 -103564 -248034 196193 -210201 -211416 241209 -354996 -124579
9533 -167027 61454 -105580 41993 127829 -108158 43723 7553 114847 -140125 -191295 69913
9521 -221245 -316830 -116546 -564 237462 261421 86114 -54780 -456409 -25819 -107643 64434
9509 56737 -40294 46334 80303 51785 -200258 -489973 -64288 71208 197270 24484 -79985
9497 -307229 -34259 9657 -40431 271032 -121879 137908 -352453 122029 -26414 -292544 -262723
9486 -262723 -231493 2238 -154614 -82289 144485 172433 -2623 -226467 -150951 -213573 -425277
9475 -425277 184723 -133201 297844 65712 -271965 83540 277534 -127364 -125430 69040 -88439
9463 -11493 -152890 -64193 -75116 80211 -98686 -36586 71344 -280448 77044 -74790 307183
$$ packed form
9544A31299b0891C82749a03564j44470A96193b10201j215B41209c54996a24579
9533a67027F1454a05580D1993Q5836a08158D3723G553J07294a40125n1170F9913
9521b21245r5585a16546e64B37462K3959H6114e4780m01629b5819q1824F4434
9509E6737d0294D6334L3969k8518b00258k89715f4288G1208J26062B4484g9985
9497c07229c4259I657d0431B71032a21879A37908c52453A22029b6414k66130K9821
9486b62723L1230B238a54614P2325A44485K7948b623k23844P5516o2622k11704
9475d25277A84723a33201B97844F5712b71965H3540J93994a27364J934F9040h8439
9463a1493j41397f4193j0923H0211i8686c6586G1344b80448G7044g4790C07183
$$ plain form
9451 -82876 -33240 -217789 165976 -112961 90387 -81675 106714 235598 -331777 223897
9440 75928 136380 120549 -174213 -72467 37416 89391 -115744 -39738 340601 228251 -60051
9428 379851 -36916 228135 -156106 -71253 -90364 53534 -178346 37928 -22769 248336 -48395
9416 -44574 -284049 -82586 -335534 201588 -17881 -22156 208600 57402 -28773 -78205 -43576
9405 -43576 -121373 203082 -159418 -195963 -51839 -160513 497134 131565 242230 -196425
9394 -195054 19412 -196602 -320950 -85350 -13224 -114553 -235154 -243571 -242308 140147 -373827
9382 39545 -201791 55580 -186007 -4728 28081 -41833 -71984 52554 98244 154752 32367 -311719
9369 -188631 -108497 69236 -131355 -104285 -26841 275699 129948 17437 -175998 -499652 -48604
$$ packed form
9451h2876c3240j84549A65976a12961I0387h1675A06714J28884c31777B23897
9440G5928O0452j5831a74213g2467C7416N1975a15744c9738C40601j12350f0051
9428C79851c6916B28135a56106g1253j9111E3534a78346C7928b2769B48336d8395
9416d4574k39475h2586k52948B01588a7881m275B08600E7402b8773m9432L4629
9405d3576p7797B03082a59418l6545e1839j08674D97134A31565J10665a96425
9394a95054A9412a96602j24348h5350a3224j01329j20601q417J263A40147c73827
9382C9545b01791E5580a86007d728B8081d1833l0151E2554M5690N6508C2367c11719
9369a88631Q0134F9236a31355K7070b6841B75699A29948A7437a75998l23654d8604
$$ plain form
9357 -152771 -3414 -315116 -143746 -72504 -43170 -306686 105005 -8251 -145610 -228259 -275764
9346 -275764 134505 -236703 -440108 200073 79368 -84662 -135035 -67343 191143 -183378
9335 -22058 -330308 -392194 79893 -114973 -180015 9453 -318612 -43773 -321948 -54238 27906
9323 -34967 -40849 -113855 -306011 -47812 -189776 7430 -44394 -129047 -184454 -145461 116596 -400821
9310 130148 37393 -215684 -164392 -70690 337120 59151 -393456 32680 -310553 10272 33304
9299 33304 -149400 -192413 60388 56792 -140484 -124084 222130 -62719 -199531 13970 -209073
9287 -183711 -12153 -93481 96954 -51027 -54554 57030 310635 -204498 -272990 97504 -81165
9275 67562 130663 -83047 -25063 75553 -46534 -63570 28325 -52649 59432 69648 -245284 -49229
$$ packed form
9357a52771c414l11702a43746P1242K9334k63516A05005h251j37359q2649m7505
9346b75764A34505b36703k03405B00073G9368h4662n0373f7343A91143a83378
9335b2058l08250o1886G9893a14973o5042I453c18612d3773k78175e4238B7906
9323c4967n882p3006j92156d7812j41964G430d4394q4653n5407L8993A16596d00821
9310A30148C7393b15684N1292g0690C37120E9151c93456C2680c10553A0272K3032
9299C3304a49400m3013F0388l596a40484J6400B22130f2719j36812A3970b09073
9287a83711a2153q1328I6954e1027l527E7030K53605b04498o8492I7504h1165
9275F7562O3101h3047b5063G5553d6534j7036B8325e2649E9432J0216b45284d9229
$$ plain form
9262 -131580 185902 26778 48040 -112844 -246445 -99213 -140374 -25208 -172170 -189332 95043
9250 -190736 -376299 -111619 170366 -243883 79609 5449 37307 -395132 -9675 -20365 -35332
9239 -35332 -150127 253419 -22554 -167954 -233043 -241502 -132786 212317 -271845 15503 -254230
9227 -114623 -175583 303665 3709 -228171 -147290 -154099 -6109 135192 -89814 -219922 -157372
9216 -157372 -11710 -338111 -126181 172965 -216213 -1882 -154588 92941 -105846 -195402 -154048
9205 -154048 -67931 -145663 -113182 -27684 -13075 214679 -135564 -369664 98897 -548012 -209709
9193 161851 -87157 89980 97790 -139783 -46179 141790 -235647 -66484 -76875 -207612 -199550
9182 -199550 158115 -90746 -5465 -291088 -137975 61445 100181 -323512 -49851 -238619 320887
$$ packed form
9262a31580A85902B6778K1262a12844j33601i9213m1161b5208j46962j7162I5043
9250a90736j85563a11619A70366b43883G9609E449L1858c95132i675j0690j4967
9239c5332j14795B53419b2554j45400o5089q459J08716B12317b71845A5503b54230
9227a14623o0960C03665C709b28171Q0881o809f109A35192h9814j30108O2550
9216a57372a1710l26401a26181A72965b16213a882j52706I2941a05846q9556M1354
9205a54048f7931p7732L2481b7684a3075B14679a35564k34100I8897e48012b09709
9193A61851h7157H9980P810a39783d6179A41790b35647f6484j0391j30737Q062
9182a99550A58115i0746e465k85623a37975F1445L8736c23512d9851j88768C20887
$$ plain form
9170 -343623 -199147 109386 109041 -150521 -263938 101556 253264 59146 -57602 152534 421220
9159 421220 -212882 -279842 -79918 181099 134249 257931 -331610 -72759 737 -280735 216749
9147 189293 -79967 -47545 -146923 47311 120665 -82704 -49851 378266 -34242 56728 104138
9136 104138 -187004 -393577 -125908 -137160 -355474 -281787 -111537 61523 -63410 -69113 -103967
9125 -103967 -176168 -26026 285944 125082 213016 -17485 -21005 315 -128846 -42117 -82509 72408
9112 288801 268702 -142561 -83148 89131 69980 -377702 61526 -207350 -128026 -91167 -461665
9101 -461665 -336460 270715 -368103 53326 -344082 -225206 -64888 -214764 251404 15548
9090 49586 65878 1147 -11694 -20473 9356 -123841 -222260 12734 283565 18884 -195935 -215727
$$ packed form
9170c43623J44476A09386l45a50521j13417A01556J51708E9146e7602A52534K68686
9159D21220b12882o6960g9918A81099m6850J23682c31610g2759G37b80735B16749
9147A89293g9967L2422r9378D7311P3354h2704L2853C78266c4242E6728M7410
9136A04138a87004k06573a25908j1252k18314P3687a11537F1523f3410n703l4854
9125a03967p2201b6026B85944A25082Q7934a7485l520C15a28846d2117m0392G2408
9112B88801k0099a42561N9413H9131j9151c77702F1526b07350P9324L6859l70498
9101d61665J25205B70715c68103E3326c44082J18876f4888j49876B51404A5548
9090D9586J6292A147a1694q779I356a23841r8419A2734K70831A8884a95935j9792
$$ plain form
9078 -215727 25322 -55921 -167017 99382 -72478 34663 17069 54511 -104283 -85029 108048
9066 153016 91127 -47647 -124656 -92144 -373422 -111375 18009 -143079 -290758 34376 -98986
9054 -351425 -21082 -189988 -199354 104226 -14247 -241421 209598 -142169 -174568 -79194 -285238
9043 -285238 -88143 166689 -196382 93206 -60661 -97153 -321645 -116318 -59586 232356 -46682
9031 132540 4261 -216961 -284258 43927 -16535 -39942 7015 -341103 132427 56899 8193 69490
9019 69490 -388921 264158 -3111 54775 -376667 -141636 225677 -237707 -594348 -202325
9008 -35596 164213 73233 29577 -323258 -118526 -102356 -343980 -188199 -70649 -181126 69681
8996 251039 9335 11900 124999 40182 141967 -327354 -175389 -249776 18647 135668 -79807
$$ packed form
9078b15727B5322e5921j11096I9382g2478C4663A7069L7442a04283J9254A08048
9066A53016o1889d7647p7009L2512k81278a11375A8009a43079j47679C4376i8986
9054c51425b1082j68906r366A04226a4247k27174B09598a42169l2399g9194k06044
9043b85238h8143A66689a96382I3206f0661l6492k24492a16318N6732B32356d6682
9031A32540D261b16961o7297D3927a6535k3407G015c41103A32427E6899H193O1297
9019F9490c88921B64158c111E4775c76667a41636B25677b37707l56641b02325
9008c5596A64213G3233B9577c23258a18526J6170k41624J55781g0649j10477F9681
8996B51039I335K565J13099D0182J01785c27354J51965p4387A8647J17021g9807
$$ plain form
8984 -233456 202407 -290990 -149439 4242 -244147 -163848 55012 -37779 17292 -62466 43985
8972 121059 -18849 -143341 69472 -277195 175500 -95155 -14136 -115623 124948 121226 -355469
8960 407698 -126366 -78763 -49891 66003 -198093 67291 179308 59612 -104478 71089 -59126
8948 -412039 28604 -39903 -74449 128305 -329913 -160479 -106121 -119197 -150110 106039 -38209
8936 -122143 123230 78669 292110 159698 -31389 202679 -31535 -333281 -120056 -11381
8925 -171448 182643 537079 1740307 6925336 11853003 2911116 754335 389849 317135
8916 317135 189171 136781 -126299 -313662 -74392 -103425 -57638 -140141 461544 29905 4043
8904 -83102 17773 -197356 76542 -85937 27943 21475 -71649 211462 -90525 266663 65023
$$ packed form
8984b33456B02407b90990J41551D242b44147Q0299E5012c7779A7292f2466D3985
8972A21059a8849j24492F9472b77195A75500i5155a4136j01487A24948l722c55469
8960D07698a26366M7603K8872F6003a98093F7291J12017E9612a04478G1089e9126
8948d12039B8604c9903l4546A28305c29913a60479N4358j3076l0913A06039c8209
8936a22143A23230m4561K13441j32412c1389B02679c1535l01746a20056a1381
8925a71448A82643L54436J203228N185029M927667B911116G54335l64486p2714
8916C17135j27964n2390a26299j87363g4392k9033M5787q2503D61544B9905D043
8904h3102A7773a97356G6542h5937B7943o468g1649B11462i0525B66663F5023
$$ plain form
8892 -104740 200686 -39299 -160022 -24037 -5780 90075 -52141 298331 -57449 -73482 107570
8880 29901 39006 59920 61996 265698 -327938 184345 10354 -304919 52173 420682 -315142
8868 39220 62203 -156886 -70766 -103087 -304398 161788 -245264 100154 -170135 -282511
8858 -282511 -21424 -125205 4872 76563 -19498 -49361 -37799 -41774 -83992 -108491 16752 107975
8846 107975 -257817 60177 -138859 -50566 -11044 -11474 28808 194700 -183276 21616 -399806
$$ packed form
8892a04740B00686c9299j20723b4037e780I0075e2141B98331e7449j6033A07570
8880B9901R105K0914K076K03702c27938A84345A0354c04919E2173L68509c15142
8868C9220K2983a56886g0766l2321k01311A61788b45264A00154a70135j12376
8858b82511b1424j03781D872P1691a9498k9863J1562l975m2218k4499A6752R1223
8846A07975b57817F0177a38859e0566a1044m30B8808J65892a83276B1616c99806
$$ [...]
##END NTUPLES=NMR SPECTRUM
##END=
