
##TITLE=AC1199_HACAH12052_7165119_fidUH8b1TT
##JCAMPDX= 6.0         $$ Bruker NMR JCAMP-DX V2.0
##DATA TYPE= NMR SPECTRUM
##DATA CLASS= NTUPLES
##ORIGIN= BRUKER
##OWNER= Administrator
$$ 1.72 TOPSPIN		Version 2.1
$$ 2012-12-01 19:17:08.849 -0500  Administrator@X
$$ Compression mode = diff/dup
##.OBSERVE FREQUENCY= 400.02188249412
##.OBSERVE NUCLEUS= ^1H
##.ACQUISITION MODE= SIMULTANEOUS (DQD)
##.ACQUISITION SCHEME= undefined
##.AVERAGES= 8
##.DIGITISER RES= 22
##SPECTROMETER/DATA SYSTEM= spect
##.PULSE SEQUENCE= zg30
##.SOLVENT NAME= COFFEE_meoh
##.SHIFT REFERENCE= INTERNAL, COFFEE_meoh, 1, 14.98509
##AUDIT TRAIL= $$ (NUMBER, WHEN, WHO, WHERE, PROCESS, VERSION, WHAT)
$$ ##TITLE= Audit trail, TOPSPIN		Version 2.1
$$ ##JCAMPDX= 5.01
$$ ##ORIGIN= Bruker BioSpin GmbH
$$ ##OWNER= Administrator
$$ $$ E:\/data/COFFEE/nmr/AC1199_HACAH12052_7165119_fidUH8b1TT/10/pdata/1/auditp.txt
$$ ##AUDIT TRAIL=  $$ (NUMBER, WHEN, WHO, WHERE, PROCESS, VERSION, WHAT)
(   1,<2012-12-01 19:16:59.753 -0500>,<Administrator>,<X>,<go>,<TOPSPIN 2.1>,
      <created by zg
	started at 2012-12-01 19:15:40.967 -0500,
	POWCHK enabled, PULCHK disabled,
       configuration hash MD5:
       86 BA 57 50 F2 9D 5C 9B 26 00 A9 28 5F 66 2E 89
       data hash MD5: 64K
       6C 5D 16 B1 4F 73 CF 37 8E 31 15 AD 41 EF 5F D5>)
(   2,<2012-12-01 19:17:03.004 -0500>,<Administrator>,<X>,<proc1d>,<TOPSPIN 2.1>,
      <Start of raw data processing
       efp LB = 0 FT_mod = 6 PKNL = 1 PHC0 = 0 PHC1 = 0 SI = 32K 
       data hash MD5: 32K
       29 27 B2 55 46 98 C2 15 FB 64 30 4C 9A D4 B2 E9>)
(   3,<2012-12-01 19:17:03.532 -0500>,<Administrator>,<X>,<proc1d>,<TOPSPIN 2.1>,
      <pk PHC0 = 97.67395 PHC1 = 0 
       data hash MD5: 32K
       85 CD 2E 7A 7D F1 5D D0 3B 3D 29 A5 ED D6 83 55>)
(   4,<2012-12-01 19:17:03.804 -0500>,<Administrator>,<X>,<proc1d>,<TOPSPIN 2.1>,
      <abs ABSG = 1 
       data hash MD5: 32K
       BC 3B F4 2B DE 4E 56 9A A1 94 D0 1D DA 9B 8D 7E>)
(   5,<2012-12-01 19:17:03.965 -0500>,<Administrator>,<X>,<proc1d>,<TOPSPIN 2.1>,
      <abs ABSG = 2 
       data hash MD5: 32K
       14 D4 3A D6 C8 83 B3 B4 9E 2E 78 F6 C2 DE 11 38>)
(   6,<2012-12-01 19:17:04.125 -0500>,<Administrator>,<X>,<proc1d>,<TOPSPIN 2.1>,
      <abs ABSG = 3 
       data hash MD5: 32K
       DC 2E F9 F9 F0 09 3A C8 E6 77 F0 7C 2C 53 24 27>)
(   7,<2012-12-01 19:17:04.301 -0500>,<Administrator>,<X>,<proc1d>,<TOPSPIN 2.1>,
      <abs ABSG = 4 
       data hash MD5: 32K
       38 4B 15 75 8E 8F 07 DC 56 FC A6 D4 6D B1 ED FB>)
(   8,<2012-12-01 19:17:04.477 -0500>,<Administrator>,<X>,<proc1d>,<TOPSPIN 2.1>,
      <abs ABSG = 5 
       data hash MD5: 32K
       16 AC A7 40 A1 C5 57 E4 49 C0 15 F3 6C E4 07 A4>)
$$ ##END=
$$ 
$$ $$ hash MD5
$$ $$ 02 02 96 4E 93 C1 00 DC DD FF A2 BC B3 3F 79 E6
##$RELAX= 
##$RELAX= 
##$RELAX= 
##$RELAX= 
##$RELAX= 
##$RELAX= 
##$RELAX= 
$$ Bruker specific parameters
$$ --------------------------
##$DU= <E:\>
##$EXPNO= 10
##$NAME= <AC1199_HACAH12052_7165119_fidUH8b1TT>
$$ [...]
150 150 150 150 150 150 150 150
##$TP07= 0
##$TPNAME0= <>
##$TPNAME1= <>
##$TPNAME2= <>
##$TPNAME3= <>
##$TPNAME4= <>
##$TPNAME5= <>
##$TPNAME6= <>
##$TPNAME7= <>
##$TPOAL= (0..7)
0.5 0.5 0.5 0.5 0.5 0.5 0.5 0.5
##$TPOFFS= (0..7)
0 0 0 0 0 0 0 0
##$TUNHIN= 0
##$TUNHOUT= 0
##$TUNXOUT= 0
##$USERA1= <user>
##$USERA2= <user>
##$USERA3= <user>
##$USERA4= <user>
##$USERA5= <user>
##$V9= 5
##$VALIST= <valist>
##$VCLIST= <CCCCCCCCCCCCCCC>
##$VD= 0
##$VDLIST= <DDDDDDDDDDDDDDD>
##$VPLIST= <PPPPPPPPPPPPPPP>
##$VTLIST= <TTTTTTTTTTTTTTT>
##$WBST= 1024
##$WBSW= 4
##$XGAIN= (0..3)
0 0 0 0
##$XL= 0
##$YL= 0
##$YMAX_a= 667884
##$YMIN_a= -562934
##$ZGOPTNS= <>
##$ZL1= 120
##$ZL2= 120
##$ZL3= 120
##$ZL4= 120
##$ABSF1= 14.98509
##$ABSF2= -5.573092
##$ABSG= 5
##$ABSL= 3
##$ALPHA= 0
##$AQORDER= 0
##$ASSFAC= 0
##$ASSFACI= 0
##$ASSFACX= 0
##$ASSWID= 0
##$AUNMP= <proc_prof1d_extract_pilot.lims>
##$AXLEFT= 0
##$AXNAME= <>
##$AXNUC= <1H>
##$AXRIGHT= 0
##$AXTYPE= 0
##$AXUNIT= <>
##$AZFE= 0.1
##$AZFW= 0.1
##$BCFW= 0
##$BC_mod= 0
##$BYTORDP= 0
##$COROFFS= 0
##$CY= 15
##$DATMOD= 1
##$DC= 0
##$DFILT= <>
##$DTYPP= 0
##$F1P= 0
##$F2P= 0
##$FCOR= 0.5
##$FTSIZE= 32768
##$FT_mod= 6
##$GAMMA= 0
##$GB= 0
##$INTBC= 1
##$INTSCL= 1
##$ISEN= 128
##$LB= 0
##$LEV0= 0
##$LPBIN= 0
##$MAXI= 10000
##$MC2= 0
##$MEAN= 0
##$ME_mod= 0
##$MI= 0
##$NCOEF= 0
##$NC_proc= -8
##$NLEV= 6
##$NOISF1= 0
##$NOISF2= 0
##$NSP= 0
##$NTH_PI= 0
##$NZP= 0
##$OFFSET= 14.98509
##$PC= 1
##$PHC0= 97.67395
##$PHC1= 0
##$PH_mod= 1
##$PKNL= yes
##$PPARMOD= 0
##$PPDIAG= 0
##$PPIPTYP= 0
##$PPMPNUM= 2147483647
##$PPRESOL= 1
##$PSCAL= 4
##$PSIGN= 0
##$PYNMP= <proc.py>
##$REVERSE= no
##$SF= 400.02
##$SI= 32768
##$SIGF1= 0
##$SIGF2= 0
##$SINO= 400
##$SIOLD= 32768
##$SPECTYP= <>
##$SREGLST= <1H.CDCl3>
##$SSB= 0
##$STSI= 32768
##$STSR= 0
##$SW_p= 8223.68421052631
##$SYMM= 0
##$S_DEV= 0
##$TDeff= 65536
##$TDoff= 0
##$TI= <>
##$TILT= no
##$TM1= 0
##$TM2= 0
##$TOPLEV= 0
##$USERP1= <user>
##$USERP2= <user>
##$USERP3= <user>
##$USERP4= <user>
##$USERP5= <user>
##$WDW= 1
##$XDIM= 32768
##$YMAX_p= 473309047
##$YMIN_p= -777520
##$CURPLOT= <Network HP LaserJet P1505>
##$CURPRIN= <$Network HP LaserJet P1505>
##$DFORMAT= <normdp>
##$LAYOUT= <+/1D_H.xwp>
##$LFORMAT= <normlp>
##$PFORMAT= <normpl>
##$SURQMSG= 1
$$ End of Bruker specific parameters
$$ ---------------------------------
##NTUPLES= NMR SPECTRUM
##VAR_NAME=  FREQUENCY,     SPECTRUM/REAL,   SPECTRUM/IMAG
##SYMBOL=    X,             R,               I
##VAR_TYPE=  INDEPENDENT,   DEPENDENT,       DEPENDENT
##VAR_FORM=  AFFN,          ASDF,            ASDF
##VAR_DIM=   32768,         32768,           32768
##UNITS=     HZ,            ARBITRARY UNITS, ARBITRARY UNITS
##FACTOR=    0.250966925370066, 1,           1
##FIRST=     8223.43324360094, -231662,      -151332
##LAST=      0,             -65380,          -124866
##MIN=       0,             -777520,         0
##MAX=       8223.43324360094, 473309047,    0
$$ Real data points
##PAGE= N=1
##DATA TABLE= (X++(R..R)), XYDATA
$$ [...]
$$ plain form
19496 -114737 -185916 322028 -62002 -17466 -2069 275979 -36839 -120572 166624 -132874 -50451
19484 107240 293689 23818 -237222 8959 -209445 -280253 37169 128578 8775 -166407 -264824
19473 -264824 11955 83197 -60781 -51399 -16404 115644 27259 368801 -347746 -261468 -597919
19462 -597919 156995 131296 -187125 -314957 82427 -190173 -79327 -557 -119747 -23188 -231371
19451 -231371 11241 -1491 63379 14806 83236 -127330 -162307 249791 87450 -69009 -59175
19440 -59175 -172838 -183373 -153195 119437 -151943 61541 88889 -165751 -14753 -161409 -166510
19429 -166510 126525 162030 -187456 -216634 -146829 -85356 -111766 -295954 -188114 -228124 57476
19417 -238433 87164 -18374 -112461 248240 40215 -22209 -137589 21444 96738 -243150 44728
$$ packed form
19496a14737p1179C22028f2002a7466b069B75979c6839q3733A66624a32874e0451
19484A07240J86449B3818b37222H959b09445p0808C7169R1409H775a66407r8417
19473b64824A1955P1242f0781R382a6404A15644B7259L41542c47746Q6278l36451
19462e97919A56995k5699a87125j27832H2427a90173g9327e57j19190b3188k08183
19451b31371A1241a491F3379A4806O8430a27330l4977B49791H7450f9009R834
19440e9175j13663j0535L0178A19437a51943F1541K7348a65751a4753j46656n101
19429a66510A26525L5505a87456k9178O9805O1473k6410j84188J07840m0010E7476
19417b38433H7164a8374r4087B48240D0215b2209j15380B1444P5294b43150D4728
$$ plain form
19405 -298334 -153175 -113554 -119474 -168505 -154553 138186 -165506 -294773 -28894 84634 -342228
19393 68393 -178804 40597 -235889 -300100 -305550 -114897 51023 -188778 180539 -82439 -181599
19382 -181599 -111740 158057 -42217 -92544 178928 192957 109890 173305 7150 -5094 -129505
19371 -129505 -216633 79893 102393 -24301 147234 -192434 55187 -95638 142339 -452164 265010
19359 -310667 282034 -399531 -44587 8483 -37717 45939 -321529 -324195 163344 -246146 -129377
19348 -129377 216814 -147891 -257524 45466 -264054 226274 -39971 -16040 -286298 7600
19337 173451 -62907 -333926 -85355 -151507 -178501 240229 44195 -240434 -241633 -6887 -113740
19326 -113740 -23969 -34550 -179374 -213042 48593 -187168 -295408 -500342 -313836 -70931
$$ packed form
19405b98334J45159L9621n920m9031J3952A38186a65506j29267b8894H4634c42228
19393F8393a78804D0597b35889o4211n450a14897E1023a88778A80539h2439r9160
19382a81599O9859A58057d2217n0327A78928J4029q3067O3415G150e094j24411
19371a29505q7128G9893K2500b4301A47234a92434E5187i5638A42339d52164B65010
19359c10667B82034c99531d4587H483c7717D5939c21529k666A63344b46146J16769
19348a29377B16814a47891j09633D5466b64054B26274c9971a6040k70258G600
19337A73451f2907k71019h5355o6152k6994B40229D4195b40434j199f887j06853
19326a13740b3969j0581j44824l3668D8593a87168j08240k04934J86506g0931
$$ plain form
19315 222986 340105 81453 -422602 -360261 -146941 -112956 -132730 75940 -364076 -179103
19304 -205179 -427377 184738 -353874 -91144 -547300 -83658 191416 -259292 -420760 -79902
19293 -198140 -120833 -26352 -130443 47186 -7546 45255 87102 71468 -266683 -24358 -332899
19282 -332899 -220541 144869 43563 93046 -72924 84471 -20802 -207902 -343284 -70620 -157577
19271 -157577 -91012 -295821 187906 152988 174313 -4749 -85641 173896 6339 -924 85216 82719
19259 82719 -143701 -232775 -21728 -230444 -46243 -95434 -15572 12829 55382 -63327 43051
19247 -117696 99041 18911 -85544 315603 -37126 -39128 97180 -58034 -75985 -296199 -152839
19236 -152839 52072 -124871 -166842 108360 -164039 78241 -339014 -228527 -1017 -55594 -19619
$$ packed form
19315B22986J17119H1453d22602O2341a46941L3985j9774G5940c64076a79103
19304b05179k22198A84738c53874i1144m56156h3658A91416b59292j61468g9902
19293a98140P7307b6352j04091D7186g546D5255M1847j5634b66683b4358l08541
19282c32899J12358A44869D3563M9483g2924H4471b0802j87100j35382g0620q6957
19271a57577O6565k04809A87906l4918K1325d749q0892A73896F339i24H5216k497
19259H2719a43701q9074b1728k08716d6243m9191a5572A2829M2553f3327D3051
19247a17696I9041A8911h5544C15603c7126k002I7180e8034j7951k20214J43360
19236a52839E2072a24871m1971A08360a64039G8241c39014J10487a017n4577a9619
$$ plain form
19224 -328140 53931 -254618 85644 -267999 -41962 -105372 -21340 -64186 7135 255847 -199428
19212 100802 -217386 -438813 -255316 -241264 -156882 -596056 56225 82595 42313 43088 264823
19201 264823 -340351 -191321 -131540 -415690 56928 127994 20234 250213 11331 -88361 181004
19189 -183464 -149740 325613 107271 32765 -16716 -344857 -235101 27279 -43188 8213 -171374
19177 32894 -236019 -59631 -146440 -40255 -24681 -174390 -147991 3505 22081 120411 150957
19166 150957 35634 -136937 -226541 95646 130313 55921 72731 -202689 -102461 -254959 -27728
19154 -79126 -129117 12519 99791 -185688 1237 -484972 -369127 31830 -267136 -34265 -37231
19143 -37231 -302174 426950 40011 -141058 -277567 -192537 -331634 185115 320566 -256841
$$ packed form
19224c28140E3931b54618H5644b67999d1962o3410b1340m2846G135K48712a99428
19212A00802b17386k21427J83497J4052Q4382m39174E6225K6370m0282P75K21735
19201B64823c40351J49030N9781k84150E6928P1066B0234K29979A1331h8361A81004
19189a83464L3724C25613A07271C2765a6716l28141J09756B7279d3188H213a71374
19177C2894b36019e9631q6809d0255J5574j49709K6399C505J8576R8330L0546
19166A50957C5634a36937q9604I5646L4667E5921J6810b02689J00228j52498b7728
19154g9126m9991A2519Q7272a85688A237d84972J15845C1830b67136c4265k966
19143c7231k64943D26950D0011a41058j36509Q5030j39097A85115J35451b56841
$$ plain form
19132 -143621 127365 -17848 -255682 -207293 272745 -113404 -138319 114556 -68763 -183887
19122 -183887 -86893 -208986 98772 -310458 115868 -93334 -142822 22333 68698 138283 -19357
19110 142835 -60039 164143 47079 -145344 -271778 26929 35515 -219081 -101837 -77517 -221501
19099 -221501 124433 -307018 -88529 -57259 317895 -168166 226120 312164 -57136 119750
19088 53648 153091 -33072 -431890 -291920 -321166 10154 -13517 -243845 -231294 -298673 -159298
19077 -159298 -356854 -190114 -50792 -43315 -92379 -124960 -104957 67853 -179622 73772 -150790
19065 234934 230138 -217176 84198 35224 -103589 -72517 -351312 -133956 -52573 126593 -205000
19053 204593 337285 121086 35240 -93060 19924 154912 -598768 -86719 29640 17110 139440
$$ packed form
19132a43621A27365a7848k37834M8389B72745a13404k4915A14556f8763j15124
19122a83887h6893j22093I8772c10458A15868i3334m9488B2333M6365O9585a9357
19110A42835f0039A64143D7079a45344j26434B6929Q586b19081a01837K4320j43984
19099b21501A24433c07018h8529L1270C17895a68166B26120Q6044e7136A19750
19088E3648R9443c3072l98818J39970k9246A0154a3517k30328J2551o7379J39375
19077a59298j97556J66740e0792P477m9064l2581K0003F7853a79622G3772a50790
19065B34934m796b17176H4198C5224a03589L1072k78795a33956e2573A26593b05000
19053B04593J32692A21086C5240i3060A9924J34988e98768h6719B9640j2530J22330
$$ plain form
19042 139440 -180044 -189558 -143687 74908 -261721 135096 237085 -228832 -224823 -34880 119840
19030 -49068 121109 102473 182883 284551 248207 39598 -70297 71164 -72775 -142883 120968
19018 -26003 -19722 60246 -239855 20886 -524552 -4452 -129981 -27692 217551 -257360 14323
19006 -83373 126532 -217215 140989 -195087 19950 323038 177209 95685 -278848 114113
18995 22124 -175115 63419 -52422 -58854 -44916 65811 -91302 160485 -314124 25233 -72032
18983 -183135 -394359 229993 -186992 232134 -332944 126155 -82483 953 -241854 20586
18972 21017 240374 378361 357268 526219 847801 316060 284812 -11643 152035 -160236
18961 -126071 -314507 139005 57051 -257991 87189 263792 79376 -25030 -16117 21231 11096
$$ packed form
19042A39440a80044r514M5871G4908b61721A35096J01989b28832M009c4880A19840
19030d9068A21109j8636Q0410J01668l6344C9598g0297G1164g2775p0108A20968
19018b6003O281F0246b39855B0886e24552d452j25529b7692B17551b57360A4323
19006h3373A26532b17215A40989a95087A9950L03088j45829q1524b78848A14113
18995B2124a75115F3419e2422o432J3938F5811i1302A60485c14124B5233g2032
18983a83135k11224B29993a86992B32134c32944A26155h2483I53b41854B0586
18972B1017K19357J37987k1093J68951L21582C16060l1248a1643A52035a60236
18961a26071j88436A39005E7051b57991H7189J76603G9376b5030Q913B1231j0135
$$ plain form
18950 11096 -141938 -131107 -167787 -90439 -229451 29817 -222495 36831 72461 -142365 -236380
18939 -236380 6027 197228 154021 -31595 141423 -236787 50253 -189153 58596 14210 114495
18928 114495 297247 -106081 -104723 -141785 16225 8143 182509 -78370 108260 147329 -31501
18916 -114073 11986 -195806 -76254 6046 -39416 14037 149615 -58733 264006 683025 278971
18904 72950 471014 -82430 -87935 31679 -42116 -178094 -71735 24641 -49195 30561 92638
18893 92638 -314252 -86242 -76247 -53128 -31960 -81435 238963 -67964 -208309 59021 -59596
18881 -80635 43299 10301 -289589 -17524 79770 -200350 234007 -290461 -28401 -203579 -272111
18870 -272111 -200480 6898 -236366 116957 75306 -82246 -232255 -89609 -68828 -134788 74342
$$ packed form
18950A1096a41938J0831l6680P7348j39012B9817b22495C6831L5630a42365r4015
18939b36380F027J91201m3207c1595A41423b36787E0253a89153E8596A4210J00285
18928A14495J82752a06081J358l7062A6225q082J74366g8370A08260L9069c1501
18916a14073A1986a95806g6254F046c9416A4037J35578e8733B64006M19019B78971
18904G2950L98064h2430n505C1679d2116j35978g1735B4641d9195C0561O2077
18893I2638c14252h6242R995K3119K1168m9475B38963f7964j40345E9021e9596
18881h0635D3299A0301b89589a7524G9770b00350B34007b90461b8401j75178o8532
18870b72111P1631F898b36366A16957m1651h2246j50009h9609K0781o5960G4342
$$ plain form
18858 -72847 -66110 34541 210780 -103828 -186167 -310849 -157174 -95772 190889 -65768 162697
18846 -30794 -211911 -218908 174018 -198227 94800 -46078 -48141 20583 -10951 -177979 -311665
18835 -311665 -111924 -187394 -273878 -144611 -111139 -105720 7489 70914 -65730 -89543 -371158
18824 -371158 -43501 -356696 209901 101414 -220765 57961 73138 198528 -138752 -172215
18814 -172215 -195305 260833 -191367 -120390 -6357 153800 175064 -13650 99636 -56531 -38227
18803 -38227 363738 160238 101390 -125344 -224128 -212163 -34497 -132516 -17511 -101138 69166
18791 58732 148610 39478 257484 -264028 99577 -57246 41420 -164346 35975 -253429 -190330
18780 -190330 -317194 -52544 112950 -81132 150553 -108833 -185365 -105540 -379638 6447 -355403
$$ packed form
18858g2847O737C4541J76239a03828q2339j24682J53675O1402A90889f5768A62697
18846c0794j81117o997A74018a98227I4800d6078k063B0583a0951j67028j33686
18835c11665a11924p5470q6484J29267L3472N419G489O3425f5730k3813k81615
18824c71158d3501l13195B09901A01414b20765E7961J5177J25390a38752l3463
18814a72215k3090B60833a91367P0977f357A53800K1264a3650I9636e6531J8304
18803c8227C63738A60238n8848a25344r8784J1965c4497r8019a7511q3627F9166
18791E8732Q9878C9478K18006b64028I9577e7246D1420a64346C5975b53429O3099
18780a90330j26864e2544A12950h1132A50553a08833p6532P9825k74098F447c55403
$$ plain form
18768 192070 208704 -104934 38426 -56700 136626 360927 -141986 -63870 76269 -59436 84443
18756 -92165 61673 -254463 -68734 94596 -111707 434243 -55796 -79685 -272426 -276436 180128
18744 -229815 222419 -46196 -102804 221744 79042 -137104 221732 213895 -139619 -42530 -81350
18733 -81350 3175 -211072 101567 -92634 -35099 53606 -145247 -218548 -111531 -164031 -156912
18722 -156912 97165 -162683 -70843 -2704 294942 206397 6817 -301996 -8390 174450 159989
18711 159989 44106 302012 -209741 -99887 -105041 136665 117967 -113731 -416838 -833 107980
18699 -105112 8569 -86681 187016 -78470 -254696 184524 95626 -19522 84632 -355813 -185296
18688 -185296 -238571 11034 -258981 82455 7810 248322 76988 -74160 48421 -41910 -213964
$$ packed form
18768A92070J6634a04934C8426e6700A36626K24301a41986f3870G6269e9436H4443
18756i2165F1673b54463f8734I4596a11707D34243e5796k3889j92741m010A80128
18744b29815B22419d6196n6608B21744G9042a37104B21732p837a39619d2530l8820
18733h1350C175b11072A01567i2634c5099E3606a45247p3301J07017n2500P119
18722a56912I7165a62683g0843b704B94942q8545F817c01996h390A74450j4461
18711A59989D4106K57906b09741i9887n154A36665j8698a13731l03107h33A07980
18699a05112H569h6681A87016g8470j76226A84524q8898a9522H4632c55813J70517
18688a85296n3275A1034b58981H2455G810K40512G6988g4160D8421d1910j72054
$$ plain form
18677 -213964 -406021 -271220 -185627 -101312 -296769 34505 224913 -289543 359291 -122911
18666 -169237 222145 -7559 177349 108749 -292622 22702 -320098 245528 -138715 -110001
18656 -110001 -433473 76656 -253675 -91164 -109594 122878 -60489 -222210 -43070 -67613 -40180
18645 -40180 -297562 -80631 -328660 90848 -327038 69601 -63528 251582 261223 256841 -104354
18633 -87409 -255805 -262367 261652 -52140 -67279 77133 -268630 67321 -99110 929 64548 86047
18621 86047 15471 -213051 281610 -91128 -71756 273907 227177 55628 90504 -77458 -44063
18610 -44063 9028 -167139 -64524 -227895 -10917 -326210 -4026 -284880 -213838 281376 -56798
18598 -92937 98714 -179318 -366400 -177641 -183210 -69884 -51479 -99826 -269366 -90152 -97621
$$ packed form
18677b13964j92057J34801Q5593Q4315j95457C4505J90408b89543C59291a22911
18666a69237B22145g559A77349o8600b92622B2702c20098B45528a38715K8714
18656a10001l23472G6656b53675i1164j8430A22878f0489j61721d3070k4543K7433
18645d0180k57382h0631k48029I0848c27038F9601f3528B51582R641m382a04354
18633h7409j68396o562B61652e2140j5139G7133b68630F7321i9110I29O3619K1499
18621H6047A5471b13051B81610i1128J9372B73907m6730E5628L4876g7458L3395
18610d4063I028a67139f4524j63371a0917l15293d026k80854P1042B81376e6798
18598i2937I8714a79318j87082a77641n569f9884J8405m8347j69540i0152p469
$$ plain form
18587 -97621 -40996 -263126 16720 92841 67839 -423895 -140906 335361 -82036 122882 290301
18576 290301 -146866 -57028 185903 -47968 -44397 171919 -12743 -14093 -109365 173636 117520
18565 117520 -314226 70197 -220274 -235433 43537 314161 186654 33731 -207337 2508 -211827
18553 -46766 149319 -343609 -114808 -124233 -41415 80652 24196 -390769 -358641 368446 -500855
18541 -119115 -173105 95379 -286579 -72368 74630 41386 -46863 -47637 86242 -60949 -51428 -288359
18529 -288359 -161535 -122127 -270022 11467 12857 390579 139981 77303 238835 81050 -50588
18517 -27885 126108 -8743 -70786 -201281 -313796 225427 -88319 236044 -128106 22699 -63915
18505 262307 170014 -155772 -171624 -254590 -24847 -20243 -113362 -198961 79434 -226224 -62345
$$ packed form
18587i7621d0996k22130A6720P6121k5002d23895a40906C35361h2036A22882J67419
18576B90301a46866e7028A85903d7968L571A71919a2743j350r5272A73636n6116
18565A17520c14226G0197b20274j5159D3537K70624j27507C3731b07337B508b11827
18553d6766A49319c43609a14808r425d1415H0652B4196c90769L2128C68446e00855
18541a19115n3990I5379b86579g2368G4630l3244d6863p74H6242f0949R521k36931
18529b88359J26824L9408j47895A1467J390L77722A39981o2678J61532H1050e0588
18517b7885A26108h743o2043j30495j12515B25427h8319B36044a28106B2699f3915
18505B62307r2293a55772j5852q2966b4847M604r3119q5599G9434b26224f2345
$$ plain form
18493 53901 -140588 -284868 8065 -142130 -70621 -91755 153220 -55944 -143419 92897 -253065
18481 62369 -175816 27488 -310748 -330595 -205735 -107740 84714 123715 -96187 279077 50256
18469 -151903 -249794 -12452 -166408 -150729 -30771 -142914 39559 193079 -198966 128295
18458 -104079 183590 -126037 -13971 136932 -171335 -118195 -113114 -30648 -551247 211544
18447 -109583 -44950 -54189 184456 -193292 216733 -95189 -257231 -70411 -91234 53031 -253649
18435 -182747 207564 337163 -105401 -44981 -93490 -34203 -69341 95474 164306 -39286 -81457
18424 -81457 -3567 174751 27443 203922 -201694 75272 -137719 -225972 113317 147463 279813
18413 279813 -5266 -55471 -155289 -42196 -48634 -60759 -26592 -144909 -163408 -3022 41073 84945
$$ packed form
18493E3901a40588j44280H065a42130g0621k1134A53220e5944q7475I2897b53065
18481F2369a75816B7488c10748j9847J24860R7995H4714L9001i6187B79077E0256
18469a51903r7891a2452j53956J5679c0771j12143C9559J53520a98966A28295
18458a04079A83590a26037a3971A36932a71335N3140N081c0648n20599B11544
18447a09583d4950r239A84456a93292B16733i5189j62042g0411k0823E3031b53649
18435a82747B07564J29599a05401d4981m8509c4203l5138I5474O8832c9286m2171
18424h1457c567A74751B7443J76479b01694G5272a37719q8253A13317L4146J32350
18413B79813e266n0205r9818d2196o438j2125b6592j18317j8499c022D1073M3872
$$ plain form
18401 84945 44098 24666 139711 89920 -114763 -235579 43999 64353 -261142 14685 56239
18390 56239 154535 -147957 -205226 -50982 -59093 -140109 237658 133895 -73925 -71391 -15220
18378 -257531 77278 -29428 -22123 -297884 14557 114003 171716 -67244 -242544 -29461 -134501
18367 -134501 -148147 -210517 -339975 -263389 74475 -38069 69534 -105358 194592 -50362 67976
18355 154682 -15209 181388 -70084 -60574 -114903 -334302 153357 65180 -82320 -13075 31505
18343 -173801 208568 -57276 149021 33616 141427 -214360 259565 -63249 -171124 -269689
18333 -269689 79383 -146125 179537 314838 32876 -332348 -115916 52459 110102 -32367
18322 73655 -163997 56046 -225450 -59744 234910 -141852 -65161 151902 -241832 -265204
$$ packed form
18401H4945m0847j9432J15045m9791a14763j20816D3999K0354b61142A4685M1554
18390E6239R8296a47957n7269e0982q111q1016B37658j03763g3925K534a5220
18378b57531G7278b9428P305k75761A4557R9446N7713f7244j75300b9461j05040
18367a34501j3646o2370j29458P6586G4475c8069F9534a05358A94592e0362F7976
18355A54682a5209A81388g0084R510n4329k19399A53357F5180h2320a3075C1505
18343a73801B08568e7276A49021C3616J07811b14360B59565f3249j07875r8565
18333b69689G9383a46125A79537J35301C2876c32348a15916E2459N7643c2367
18322G3655a63997E6046b25450e9744B34910a41852f5161A51902b41832k3372
$$ plain form
18312 -265204 132004 2727 -137868 -213850 -224900 137353 -218656 46680 61082 166322 -137733
18300 -278470 -157393 -134807 50605 -8098 -23218 -271203 249007 -310860 -35886 -200098 160602
18288 -224857 46474 -101058 12249 -52337 -74923 -63462 33651 2206 -20716 -95983 201697
18276 -253968 -14359 377724 -46820 276671 58749 -36877 294266 -209433 -38349 -198094
18266 -198094 237512 109784 353108 -62866 -62973 8404 110655 -289193 222086 -16402 -21492
18255 -21492 -168003 -223612 -145246 108415 -360263 -178170 -217843 -242506 195349 -37951 -153555
18244 -153555 -37073 -71184 153477 -162808 -58671 -92584 -235617 -64556 95002 -63865 163645
18232 52182 -168097 102149 -324493 7748 47222 -225873 144126 138652 -112413 -12412 -7821
$$ packed form
18312b65204A32004B727a37868p5982j1050A37353b18656D6680J4402J05240a37733
18300b78470J21077K2586E0605h098j5120k47985B49007c10860c5886j64212A60602
18288b24857D6474a01058A2249e2337k2586J1461C3651B206b0716p5267B01697
18276b53968a4359C77724d6820B76671E8749c6877B94266b09433c8349j59745
18266a98094B37512A09784K43324f2866j07H404J02251b89193B22086a6402n090
18255b1492j46511n5609P8366A08415c60263a78170l9673k4663A95349c7951j15604
18244a53555c7073l4111A53477a62808e8671l3913j43033f4556I5002f3865A63645
18232E2182a68097A02149c24493G748L9474b25873A44126n474a12413a2412M591
$$ plain form
18221 -7821 -121729 209593 184296 144583 -176232 210395 113186 311323 230797 8252 -210847
18209 -106518 -100663 213290 -61600 -135189 -49611 -212547 -240130 -429248 149753 -146254 -237067
18198 -237067 217575 -18491 -115362 -45568 -19179 123517 -46178 -161034 139195 -337569
18187 -98167 46124 5261 -6148 133634 -172826 -97493 254629 -25265 98761 -80958 313446
18175 201489 -323799 -308269 -282696 -93698 173773 -85065 -135139 -158266 -103733 -38659 -184349
18164 -184349 253914 122772 -262425 67494 -25434 35754 345753 -113084 -6862 -102099 68770
18152 -469688 -120047 -167250 -41977 -202380 -55404 -342505 34871 -135074 51536 -114595
18141 47393 112426 233 -104535 -117293 -99870 4473 5204 -239605 -122177 -370384 -351326 183291
$$ packed form
18221g821j13908B09593k5297l9713a76232B10395r7209J98137q0526H252b10847
18209a06518N855B13290f1600p3589d9611j62936k7583j89118A49753a46254r0813
18198b37067B17575a8491r6871d5568a9179A23517d6178j14856A39195c37569
18187i8167D6124E261f148A33634a72826P5333B54629b5265I8761h0958C13446
18175B01489c23799J5530K5573i3698A73773h5065n0074k3127N4533c8659j45690
18164a84349B53914A22772b62425F7494b5434C5754L09999a13084f862r5237F8770
18152d69688a20047m7203d1977j60403e5404k87101C4871a35074E1536a14595
18141D7393O5033B33a04535j2758J7423D473P31b39605J17428k48207J9058A83291
$$ plain form
18128 160507 273250 -154684 45775 -286272 -81360 111289 -239175 -45207 -71413 -162244
18118 -162244 -256468 130092 -51003 -224511 -22040 21584 10314 -168755 260430 -29639 304777
18106 -272279 -171812 -251297 -242105 15607 -228455 -358063 204518 -126583 243816 -202534
18095 174937 -8966 -231599 24712 -59447 51833 -22705 -19788 274202 128305 402259 110235
18083 -19867 -304965 -60348 91581 137808 169031 108009 5881 201001 74607 47281 -1662 -124054
18071 -124054 194349 -220188 -120633 219162 -418715 234889 -121874 189281 185274 -11782
18060 184626 241935 -165785 -256506 -274783 141107 -138677 101568 -151064 39165 -178370
18049 -72985 -32496 -554036 -226490 -5435 -414061 -161487 217735 70377 -53943 -133436 -145651
$$ packed form
18128A60507J12743a54684D5775b86272h1360A11289b39175d5207k6206r0831
18118a62244r4224A30092e1003j73508b2040B1584A0314a68755B60430b9639C04777
18106b72279J00467p9485R192A5607b28455j29608B04518a26583B43816b02534
18095A74937h966k22633B4712e9447E1833b2705K917B74202A28305K73954A10235
18083a9867k85098f0348I1581M6227L1223o1022E881J95120G4607k7326a662j22392
18071a24054A94349b20188R9555B19162d18715B34889a21874A89281m007a1782
18060A84626N7309a65785r0721j8277A41107a38677A01568a51064C9165a78370
18049g2985c2496n21540b26490e435m08626a61487B17735G0377e3943p9493j2215
$$ plain form
18038 -145651 437745 43316 11740 55948 75683 -137451 -208067 402873 -175162 349626
18027 -285580 -166368 30000 -78416 -219845 -253852 98382 -110095 256417 105327 -91361
18016 263269 74473 -83395 132065 31432 -6258 86468 -52358 -73857 -26735 92870 111801
18005 111801 -284508 2598 -291578 -16729 1820 73581 204156 -65709 73387 152497 -30027
17993 13001 -222184 179688 125588 170499 123623 -16367 140652 455473 101235 360571
17983 360571 19454 -332406 -127099 70621 50299 158337 -240625 360681 115249 -179394
17972 89930 -162824 -53796 41246 255013 7738 316369 41617 -14332 419289 -186933 -114073
17961 -114073 128836 -119266 -75634 -354058 130938 -379061 -53763 113201 48745 293067
$$ packed form
18038a45651D37745D3316A1740M4208J9735a37451p0616D02873a75162C49626
18027b85580J19212C0000g8416j41429l4007I8382a10095B56417A05327i1361
18016B63269G4473h3395A32065C1432f258H6468e2358k1499b6735I2870J8931
18005A11801b84508B598b91578a6729A820P1761J30575f5709G3387P9110c0027
17993A3001b22184A79688n4100M4911m6876a6367A40652L14821A01235K59336
17983C60571A9454c32406a27099G0621k0322J08038b40625C60681A15249a79394
17972H9930a62824e3796D1246K13767G738L08631D1617a4332D19289a86933P2860
17961a14073A28836a19266M3632k78424A30938c79061e3763A13201D8745K44322
$$ plain form
17951 293067 -2534 79024 6073 147585 -45152 166212 85221 249553 186296 130013 76845
17940 76845 -102613 30997 43262 18262 -64065 387395 -3957 -31794 -264835 -155506 313582
17928 377503 -24897 46245 98319 -308148 411480 -1495 39045 26666 -138713 -331285 -151480
17916 12341 -136411 -843 101296 364013 -57886 -64937 62498 106736 217732 -103136 -519723
17905 -519723 -73027 207324 11033 -168938 -78883 6544 31791 508283 -130022 -144489 80669
17893 339015 -336736 123000 -215537 -44368 -51699 120208 185940 -216287 276795 100580
17882 124242 -71248 81762 225737 -194271 -235135 -94580 -161003 188700 -106150 19584 -44289
17870 141124 119317 40948 -129704 -184565 361543 105593 80847 177859 -30919 326844 -29281
$$ packed form
17951B93067b534G9024F073J41512d5152A66212q0991J64332o3257n6283n3168
17940G6845a02613C0997J2265A8262f4065C87395c957k7837k33041J09329C13582
17928C77503b4897D6245N2074c08148D11480a495C9045j2379a38713j92572a51480
17916A2341a36411h43A01296K62717e7886p051F2498M4238J10996a03136m16587
17905e19723g3027B07324A1033a68938g8883F544K5247M76492a30022j4467H0669
17893C39015c36736A23000b15537d4368p331A20208O5732b16287B76795A00580
17882A24242g1248H1762J43975a94271m0864i4580o6423A88700a06150A9584d4289
17870A41124k1807D0948a29704n4861C61543A05593k4746R7012c0919C26844b9281
$$ plain form
17858 -253263 -153611 82288 -191927 -10799 148355 -194245 -16018 -3821 -136599 -224591 43281
17846 -53726 -287596 -229928 -75684 128257 -94721 -30506 -13174 3312 100076 -131604 188329
17834 285575 -138321 -67744 -111948 136127 338911 99112 3618 -178703 -182361 -84772 2230
17822 -181861 -72928 149675 -85456 -8932 -35742 140208 -53405 167548 -226064 -16971 -91605
17811 -91605 32672 200197 47412 308619 268545 239741 -77040 -147216 109127 188961 -92493
17799 -85443 110968 -33906 192844 -104673 33091 -55225 79173 150081 85619 146804 -123880
17787 159721 -333433 -196616 105483 -69133 -25440 173898 106372 39600 42829 -96482 -126814
17776 -126814 148381 222259 112055 157503 -18921 377666 68556 185825 115718 -60152 246997
$$ packed form
17858b53263R9652H2288a91927a0799A48355a94245a6018c821j32778q7992D3281
17846e3726k33870N7668g5684A28257i4721c0506a3174C312R6764a31604A88329
17834B85575a38321f7744m4204A36127K02784I9112C618a78703l658h4772B230
17822a81861g2928A49675h5456h932k6810A40208e3405A67548b26064a6971p4634
17811i1605C2672J67525D7412K61207m0074k8804g7040p0176A09127P9834i2493
17799h5443A10968c3906A92844a04673C3091e5225G9173P0908o4462O1185a23880
17787A59721c33433J36817A05483f9133b5440A73898o7526C9600L229i6482l0332
17776a26814A48381P3878j10204M5448a8921C77666F8556J17269p0107f0152B46997
$$ plain form
17764 317237 -94027 167665 165797 -26608 -164892 -241836 -26359 143893 -213450 83819 239807
17753 239807 -86525 -147300 428451 303886 -86911 79289 -54140 323856 220744 234115 -157448
17741 77356 -75090 -199648 -320754 2804 -363329 156475 -110832 48045 183592 227331 106047
17729 240777 43437 43171 147749 44807 265525 122949 35774 -82102 -40837 463616 132566
17717 80069 42446 137292 -47220 266047 -25807 -182564 127256 142148 -271269 87940 154138
17706 154138 135426 87850 -98791 128193 13142 178752 225384 35134 22215 142401 -146030
17694 171091 217401 -17626 -254677 -94011 196307 5285 308055 -295495 75947 -240954 81301
17682 372781 37947 79639 -162416 -76004 195231 -211141 34530 92562 234695 76217 177424
$$ packed form
17764C17237i4027A67665j868b6608j38284p6944b6359A43893b13450H3819J55988
17753B39807h6525o0775D28451j24565h6911G9289e4140C23856j03112J3371a57448
17741G7356g5090j24558j21106B804c63329A56475a10832D8045J35547M3739A06047
17729B40777D3437k66J04578D4807K20718A22949C5774h2102d0837D63616A32566
17717H0069l7623R4846d7220B66047b5807j56757A27256J4892b71269H7940O6198
17706A54138j8712m7576i8791A28193A3142J65610M6632C5134j2919J20186a46030
17694A71091M6310a7626k37051i4011A96307E285L02770b95495G5947b40954H1301
17682C72781C7947M1692a62416g6004A95231b11141C4530N8032J42133G6217J01207
$$ plain form
17671 177424 126477 32712 -131176 190134 134707 5563 70028 229975 158637 156310 147042
17660 147042 47766 -302205 49277 132568 64437 -8333 -63710 460842 121948 179298 98075
17649 98075 52071 104198 60047 187011 244670 191558 -32766 196056 -137487 124780 110655
17638 110655 121484 65018 269621 242894 -114534 150632 217451 127444 177365 -252748 469748
17626 -161044 72379 158552 22689 131575 74492 -99166 -139606 216453 225107 -144753 -182906
17615 -182906 195917 223625 56578 95787 110084 355952 96565 47493 -16624 136592 -72259
17603 32263 -82798 7682 -10039 120687 195991 426174 225896 85173 394513 29857 -21960
17591 -57964 184423 -75432 263499 191925 52115 60919 412358 9869 -99149 179487 207117
$$ packed form
17671A77424n0947C2712a31176A90134n5427E563O4465J59947p1338k327r268
17660A47042D7766c02205D9277Q3291F4437h333n5377D60842A21948N7350q1223
17649I8075m6004N2127m4151J26964N7659n3112c2766A96056a37487A24780j4125
17638A10655J0829n6466K04603k6727a14534A50632O6819r0007M9921b52748D69748
17626a61044G2379Q6173B2689J08886n7083i9166m0440B16453Q654a44753l8153
17615a82906A95917K7708E6578L9209J4297K45868I6565D7493a6624A36592g2259
17603C2263h2798G682a0039A20687P5304K30183k00278H5173L09340B9857b1960
17591e7964A84423g5432B63499p1574E2115Q804L51439I869i9149A79487K7630
$$ plain form
17580 207117 397773 4823 387195 116536 100634 83173 -41569 312421 -11624 88514 90943
17569 90943 189631 519630 -164743 -49044 200523 306852 81594 453059 222600 64884
17558 36134 188270 -9158 121525 44572 271434 -37065 350314 148030 347964 207788
17548 207788 578644 309802 128124 209077 96500 422160 -34550 -39338 347404 39187 482397
17537 482397 189824 430170 404528 267139 31925 307188 583458 231431 451879 232125
17527 232125 546107 671805 746306 1182194 982383 1070147 1214601 606387 633532 286794
17516 -103845 550394 465670 505650 343593 149219 660380 739409 1095508 1112402 1155976
17506 1155976 962389 886045 569282 216215 195354 300330 167621 619344 273978 472454
$$ packed form
17580B07117J90656D823L82372A16536j5902j7461d1569C12421a1624H8514K429
17569I0943R8688L29999a64743d9044B00523J06329H1594L71465B22600F4884
17558C6134J52136i158A21525D4572K26862c7065C50314A48030J99934j40176
17548B07788L70856k68842A28124Q0953I6500L25660c4550m788C47404C9187M43210
17537D82397A89824K40346k5642j37389C1925K75263K76270B31431K20448k19754
17527B32125L13982J25698P4501M35888j99811Q7764J44454F06387K7145B86794
17516a03845E50394q4724L9980j62057A49219N11161P9029L56099J6894M3574
17506A155976j93587p6344l16763B16215k0861J04976j32709M51723B73978J98476
$$ plain form
17496 472454 153452 188006 35299 136733 -17639 372500 273116 277760 237453 137224 423105
17485 423105 185137 229194 129930 405580 -210009 167385 482424 425556 502572 195838
17474 -83723 128544 382004 315691 286600 620290 322501 335659 212969 398663 235998
17464 235998 175643 383263 273330 268476 40267 228625 271833 351837 119896 304742 388120
17453 388120 253874 233582 540691 552037 420678 205988 213575 748158 525334 318234
17443 318234 275113 464575 251382 295252 458446 262293 531974 547946 530217 575394
17433 575394 309880 382240 485001 335430 453863 521936 -101038 141901 226255 346708
17423 346708 483229 26103 299906 252670 -21973 312531 400552 464586 439968 594817 588065
$$ packed form
17496D72454A53452L4554C5299J01434a7639C72500r9384M644m0307j00229K85881
17485D23105A85137M4057r9264K75650b10009A67385L15039n6868P7016A95838
17474h3723A28544K53460o6313k9091L33690k97789J3158j22690J85694j62665
17464B35998o0355K07620j09933m854D0267J88358M3208Q0004A19896J84846Q3378
17453C88120j34246k0292L07109J1346j31359B05988P587N34583k22824k07100
17443C18234m3121J89462k13193M3870J63194j96153K69681J5972j7729M5177
17433E75394k65514P2360J02761j49571J18433O8073a01038A41901Q4354J20453
17423C46708J36521B6103K73803m7236b1973C12531Q8021O4034k4618J54849o752
$$ plain form
17412 588065 386580 578770 382105 512738 482846 286108 362546 261584 399236 76805
17401 238826 119822 335452 363645 140358 290055 407510 308974 438251 251042 73754
17390 352878 200540 351437 77990 361898 297513 349784 389404 486279 173860 52991 506272
17379 506272 113685 232385 42347 266434 6570 282588 399284 464674 247879 170337
17369 170337 374209 359892 329669 333173 285916 -212331 -91754 348680 521719 194119 119636
17358 119636 191550 255111 303184 380695 437315 221204 205575 524381 189458 295841 2357
17346 567624 216183 136363 360223 199575 310299 485310 35756 140263 112918 -40905
17335 19980 65396 139701 302035 -105436 207269 -53552 -63051 56678 110090 150461 -61660
$$ packed form
17412E88065k01485J92190j96665J30633k9892j96738P6438j00962J37652G6805
17401B38826j19004K15630K8193A40358J49697J17455r8536J29277j87209G3754
17390C52878j52338J50897G7990K83908o4385N2271L9620R6875A73860E2991M53281
17379E06272A13685J18700D2347K24087F570K76018J16696O5390k16795p7542
17369A70337K03872j4317l0223L504m7257b12331i1754C48680J73039A94119p4483
17358A19636P1914O3561M8073P7511N6620k16111j5629L18806A89458J06383B357
17346E67624B16183p9820K23860j60648J10724J75011C5756J04507k7345d0905
17335A9980M5416P4305J62334a05436B07269e3552r499E6678N3412M0371f1660
$$ plain form
17323 478626 103788 390284 216148 180025 434413 520364 48524 422831 426703 235401
17313 235401 114096 285439 398577 159800 271694 346376 280470 127422 476831 622054
17303 622054 230848 456436 226812 60032 -141954 193471 234841 -187453 299395 237054
17293 237054 292718 275844 295066 519622 303245 323901 274372 -52321 58966 17957 277848
17282 277848 320665 47690 681931 23012 150636 125721 313114 209432 298740 388840 14558
17270 256864 209422 464199 269417 137832 423419 244979 -82492 159546 520051 538757
17260 538757 105701 407028 425563 312061 423155 341232 420253 596701 163089 468170
17250 468170 308774 438502 586969 176944 136146 298570 800998 377305 46398 343966
$$ packed form
17323D78626A03788K86496j74136l6123K54388Q5951D8524L74307L872j91302
17313B35401A14096J71343J13138A59800J11894P4682o5906A27422L49409J45223
17303F22054B30848K25588B26812F0032a41954A93471M1370a87453B99395o2341
17293B37054N5664j6874J9222K24556k16377K0656m9529e2321E8966A7957K59891
17282B77848M2817D7690O34241B3012J27624k4915J87393j03682Q9308R0100A4558
17270B56864m7442K54777j94782j31585K85587j78440h2492A59546L60505J8706
17260E38757A05701L01327J8535j13502J11094q1923P9021J76448A63089L05081
17250D68170j59396J29728J48467A76944m0798J62424N02428C77305D6398K97568
$$ plain form
17240 343966 61033 474542 190554 362635 494304 342309 481430 262683 240309 440930
17230 440930 441978 165989 572228 591805 707636 437807 364586 682460 506520 341657
17220 341657 389034 411053 499797 343904 258938 278536 453017 535878 361520 275384 569611
17209 569611 363764 464806 374848 369116 550758 573722 378774 165633 343381 375370
17199 375370 423503 114949 534137 493573 542367 529615 314186 478192 483039 235121 569362
17188 569362 692171 502413 676557 476538 249273 207994 -64393 6707 410606 550975
17178 550975 444762 839313 114097 403300 696818 382625 514983 660571 393375 321821
17168 321821 208169 504162 471751 426542 684928 150920 280139 509009 549473 425661
$$ packed form
17240C43966F1033M13509A90554J72081J31669j51995J39121k18747k2374K00621
17230D40930J048A65989M06239J9577J15831k69829p3221L17874j75940j64863
17220C41657M7377K2019Q8744j55893q4966J9598J74481Q2861j74358q6136K94227
17209E69611k05847J01042q9958n732J81642K2964j94948A65633J77748L1989
17199C75370M8133A14949M19188m0564M8794j2752k15429J64006M847B35121L34241
17188E69362J22809j89758J74144k00019k27265m1279f4393F707M03899J40369
17178E50975j06213L94551A14097K89203K93518l14193J32358J45588k67196p1554
17168C21821j13652K95993l2411m5209K58386A50920J29219K28870M0464j23812
$$ plain form
17158 425661 609408 568999 649322 126777 603633 362699 238665 382585 610284 305308
17148 305308 456260 557133 296142 331632 376235 806237 463970 592006 637961 619654
17138 619654 675077 361365 485265 295269 592831 375392 694882 663825 671562 465421
17128 465421 344742 508131 627186 458008 401399 483209 926315 643810 562771 621464
17118 621464 1030154 511596 280088 451827 187314 846408 349661 703600 358006 503832
17108 503832 807424 609697 647857 603385 627632 1130295 372095 710589 477546 749692
17098 749692 610581 629821 687016 826030 478603 611656 894990 525152 876737 737842
17088 737842 596350 683462 782690 719183 533942 725444 647297 746690 688575 787003 822966
$$ packed form
17158D25661J83747m0409Q0323A26777M76856k40934j24034J43920K27699l04976
17148C05308J50952J00873k60991L5490M4603M30002l42267J28036M5955j8307
17138F19654N5423l13712J23900j89996K97562k17439L19490l1057P737k06141
17128D65421j20679J63389J19055j69178n6609Q1810M43106k82505q1039N8693
17118F21464M08690E11596k31508J71739A87314O59094C49661L53939l45594J45826
17108E03832L03592j97727L8160m4472K4247N02663C72095L38494k33043K72146
17098G49692j39111J9240N7195J39014l47427J33053K83334l69838L51585j38895
17088G37842j41492Q7112R9228o3507j85241J91502p8147R9393n8115R8428L5963
$$ plain form
17077 822966 567365 744716 789503 950649 807373 574469 780483 487178 841475 572810
17067 572810 469115 582664 751227 734821 793969 626965 628710 807167 1053726 606834
17057 606834 823774 792376 515388 890345 936782 623715 913707 1142029 754741 952178
17047 952178 887463 957265 689303 902416 984959 985782 868221 1036175 1013453 512728 876166
17036 876166 1068963 1169036 1105291 987424 1211645 947249 1170441 864017 947150 1128129
17026 1128129 931300 972756 924482 805624 1071760 938396 1144993 1394360 1289991 916629
17016 916629 892700 1335313 1269253 803705 1347356 1181979 799221 1012650 1168010 922736
17006 922736 1239898 1155947 1312168 931805 1261997 1357602 1074545 1083886 1709794 1066768
$$ packed form
17077H22966k55601J77351M4787J61146j43276k32904K06014k93305L54297k68665
17067E72810j03695J13549J68563j6406N9148j67004J745J78457K46559m46892
17057F06834K16940l1398k76988L74957M6437l13067K89992K28322l87288J97437
17047I52178o4715O9802k67962K13113Q2543Q23j17561J67954k2722n00725L63438
17036H76166J92797J00073o3745j17867K24221k64396K23192l06424Q3133J80979
17026A128129j96829M1456m8274j18858K66136j33364K06597K49367j04369l73362
17016I16629k3929M42613o6060m65548N43651j65377l82758K13429J55360k45274
17006I22736L17162q3951J56221l80363L30192R5605k83057R341O25908o43026
$$ plain form
16996 1066768 1391267 1060753 1121771 1558841 1293330 1200039 1413761 1342482 1314174 1053545
16986 1053545 1336892 1255247 1094434 1607427 1430627 1512248 1543031 1455182 1354372 1516377
16976 1516377 1967759 1356486 1436642 1542133 1466622 1571243 1507685 1261215 1235539 1481976
16966 1481976 1380854 1467114 1606557 1613825 1401347 1719818 1397989 1548842 1601638 1409928
16956 1409928 1632966 1783231 1677559 1871924 1655497 1589670 1916851 1623259 1802231 1941701
16946 1941701 1905041 1890711 1975489 2330719 1709136 1759380 2060351 1772133 1873578 2035278
16936 2035278 1545896 1700365 2110636 2318256 1989342 2137412 1824819 2161655 2001337
16927 2001337 1966122 1929719 2265143 1711686 2371559 2281515 2278915 2543513 1960780 2262141
$$ packed form
16996A066768L24499l30514O1018M37070k65511r3291K13722p1279k8308k60629
16986A053545K83347q1645j60813N12993j76800Q1621L0783q7849j00810J62005
16976A516377M51382o11273Q0156J05491p5511J04621o3558k46470k5676K46437
16966A481976j01122Q6260J39443P268k12478L18471l21829J50853N2796j91710
16956A409928K23038J50265j05672J94365k16427o5827L27181k93592J78972J39470
16946A941701l6660j4330Q4778L55230o21583N0244L00971k88218J01445J61700
16936B035278m89382J54469M10271K07620l28914J48070l12593L36836j60318
16927B001337l5215l6403L35424n53457O59873r0044k600K64598n82733L01361
$$ plain form
16917 2262141 2314363 2182372 2717576 2262779 2484821 2487850 2440973 2525771 2473977 2687766
16907 2687766 2536216 2612637 2684477 2397980 3113832 3228523 3210823 2764955 2690485 2990489
16897 2990489 2751267 3054808 3017538 3203195 3055431 3034521 3157740 3117493 3327822 3100422
16887 3100422 3312274 3199165 3486615 3601806 3383430 3657238 3434899 3409105 3456296 3807962
16877 3807962 3877366 3738102 3844413 3744741 4199942 4087184 3783587 4238478 4164330 3943283
16867 3943283 4182492 4379511 4191586 4740972 4221947 4396004 4795955 4331311 5022380
16858 5022380 4953217 4963343 4597936 5184973 5116029 4975737 4945879 5214066 5513326 5343803
16848 5343803 5631636 5705013 5749011 5892541 5731274 5659235 6224616 6369442 6316500 6581311
$$ packed form
16917B262141N2222j31991N35204m54797K22042L029m6877Q4798n1794K13789
16907B687766j51550P6421P1840k86497P15852J14691j7700m45868p4470L00004
16897B990489k39222L03541l7270J85657j47764k0910J23219m0247K10329k27400
16887C100422K11852j13109K87450J15191k18376K73808k22339k5794M7191L51666
16877C807962O9404j39264J06311r9672M55201j12758l03597M54891p4148k21047
16867C943283K39209J97019j87925N49386n19025J74057L99951m64644O91069
16858E022380o9163J0126l65407N87037o8944j40292k9858K68187K99260j69523
16848E343803K87833P3377M3998J43530j61267p2039N65381J44826n2942K64811
$$ plain form
16838 6581311 6565849 6587032 6827616 6913177 7078835 6861217 7273563 7483181 7512684 7284467
16828 7284467 7895037 7770941 7759150 7978992 8390421 8222927 8866683 8544717 8845227 9010536
16818 9010536 9271311 9352396 9772632 9562614 10189348 10216020 10729137 10305279 10618443 10930770
16808 10930770 11175882 11280414 11469310 11890635 12380952 12443308 12594062 13345437 13312579 13795980
16798 13795980 14267350 14178136 14449022 14739951 15633920 15983099 16431590 16621566 17061405
16789 17061405 17461759 17792228 18570516 18899535 19544123 19797452 20356588 21323002 21682439
16780 21682439 22295425 23083597 23641204 24110532 25190640 25908198 26448780 27238033 28099660
16771 28099660 29038602 29859918 31125445 32087797 32944814 33964302 35477375 36752973 37723370
$$ packed form
16838F581311j5462K1183K40584Q5561J65658k17618M12346K09618K9503k28217
16828G284467O10570j24096j1791K19842M11429j67494O43756l21966L00510J65309
16818I010536K60775Q1085M20236k10018O26734K6672N13117m23858L13164L12327
16808A0930770K45112J04532J88896M21325M90317O2356J50754P51375l2858M83401
16798A3795980M71370q9214K70886K90929Q93969L49179M48491J89976M39839
16789A7061405M00354L30469P78288L29019O44588K53329N59136R66414L59437
16780B1682439O12986P88172N57607M69328J080108P17558N40582P89253Q61627
16771B8099660R38942Q21316J265527R62352Q57017J019488J513073J275598R70397
$$ plain form
16762 37723370 39099816 40751335 41977688 43541193 45141135 46486613 48487843 50157996
16754 50157996 52109521 54091094 56593933 58846135 60470324 62850530 65521230 67935476
16746 67935476 70505067 72869847 75911301 78590198 81496929 84739997 87628352 91137144
16738 91137144 93930607 96949336 100408253 103326803 106515996 109610521 112027520 114654459
16730 114654459 117530750 120158009 121953566 123835730 125354107 126877420 127980710 128592848
16722 128592848 128566632 128573858 128156168 127122402 126060367 124541499 122848049 121176547 118140462
16713 118140462 115837989 113378153 110506216 107354701 104383892 101023604 98060422 94771486
16705 94771486 91618942 88282702 85429267 82216351 79423267 76418822 73600920 70681929
$$ packed form
16762C7723370J376446J651519J226353J563505J599942J345478K001230J670153
16754E0157996J951525J981573K502839K252202J624189K380206K670700K414246
16746F7935476K569591K364780L041454K678897K906731L243068K888355L508792
16738I1137144K793463L018729L458917K918550L189193L094525K416999K626939
16730A14654459K876291K627259J795557J882164J518377J523313J103290O12138
16722A28592848k6216P226m17690j033766j062035j518868j693450j671502l036085
16713A18140462k302473k459836k871937l151515k970809l360288k963182l288936
16705I4771486l152544l336240k853435l212916k793084l004445k817902k918991
$$ plain form
16697 70681929 67947780 65491505 63260318 60855854 58352394 56345059 53776743 52129739
16689 52129739 49973740 48005043 46466444 44844844 43562640 41535147 39965210 38769447
16681 38769447 37536092 36261310 34790376 33893910 32578218 31766941 30625820 29396899
16673 29396899 28743666 27928338 26898103 26088053 25358390 24473614 23670944 22945753 22613134
16664 22613134 21831503 20967588 20494403 19892379 19233281 18658196 18278129 18131739 17189746
16655 17189746 16983239 16744917 16058200 15648258 15351571 14859266 14254271 13867059 13956145
16646 13956145 13104900 13027399 12952043 12488137 12102117 11845747 12047947 11348257 11310361 10831680
16636 10831680 10824503 10735845 10270925 9884391 9432666 9589351 9354225 9338261 8909563 8834650
$$ packed form
16697G0681929k734149k456275k231187k404464k503460k007335k568316j647004
16689E2129739k155999j968697j538599j621600j282204k027493j569937j195763
16681C8769447j233355j274782j470934q96466j315692q11277j141121j228921
16673B9396899o53233q15328j030235q10050p29663q84776q02670p25191l32619
16664B2613134p81631q63915m73185o02024o59098n75085l80067j46390r41993
16655A7189746k06507k38322o86717m09942k96687m92305o04995l87212Q9086
16646A3956145q51245p7501p5356m63906l86020k56370K02200o99690l7896m78681
16636A0831680p177q8658m64920l86534m51725J56685k35126j5964m28698p4913
$$ plain form
16626 8834650 8835929 8447742 8299814 8254948 7846918 7604972 7535849 7522179 7544128 7179417
16616 7179417 6728555 6709192 6886904 6851158 6410175 6836304 6504331 6253078 5841495 6003787
16606 6003787 5997438 5924456 5834127 5653490 5765081 5607285 5456890 5441830 5300734 5423470
16596 5423470 5176491 5029424 4577949 5320032 4522171 4746821 4958344 4561721 4580127 4534467
16586 4534467 4580288 4421932 4431224 4203813 4224410 3966530 4216575 3945485 4053453 3607206
16576 3607206 3995600 3839357 3745486 3724491 3915450 3730886 3599049 3625260 3448869 3152885
16566 3152885 3617928 3302851 3503904 2859685 3096273 3311908 2976002 3153507 3340041
16557 3340041 3285540 2926616 3095923 3124303 2566729 2987993 2989847 2707386 2795829 2778402
$$ packed form
16626H834650J279l88187j47928m4866m08030k41946o9123j3670K1949l64711
16616G179417m50862j9363J77712l5746m40983M26129l31973k51253m11583J62292
16606F003787o349p2982r0329j80637J11591j57796j50395j5060j41096J22736
16596E423470k46979j47067m51475P42083p97861K24650K11523l96623J8406m5660
16586D534467M5821j58356R292k27411K0597k57880K50045k71090J07968m46247
16576C607206L88394j56243r3871k0995J90959j84564j31837K6211j76391k95984
16566C152885M65043l15077K01053o44219K36588K15635l35906J77505J86534
16557C340041n4501l58924J69307K8380n57574M21264J854k82461Q8443j7427
$$ plain form
16547 2778402 2908816 2672978 2663039 2626228 2464003 2223117 2765483 2433189 2341319 2570738
16537 2570738 2214182 2554966 2360111 2278070 2345068 2483116 2253423 2265673 2231777 1986284
16527 1986284 2322882 1985926 2076701 2177565 2088240 1727959 1810422 1933108 2131204 2036807
16517 2036807 1889681 1891947 1882427 1785650 1703988 1755123 1631079 2049390 1600238 1917572 2154248
16506 2154248 1588240 1964180 1822097 1487819 1918489 1665172 1574663 1697025 1443906 1615112
16496 1615112 1498334 1391794 1805046 1575501 1720723 1347906 1623701 1593470 1223171 1519625
16486 1519625 1513552 1174174 1492414 1610751 1162483 1411194 1429043 1762242 1353402 1239187
16476 1239187 1198449 1499688 1262888 1290999 1392610 1139376 1390890 925419 884690 1175812
$$ packed form
16547B778402J30414k35838r939l6811j62225k40886N42366l32294r1870K29419
16537B570738l56556L40784j94855q2041O6998J38048k29693J2250l3896k45493
16527A986284L36598l36956R0775J00864q9325l60281Q2463J22686J98096r4397
16517B036807j47126K266r520r6777q1662N1135j24044M18311m49152L17334K36676
16506B154248n66008L75940j42083l34278M30670k53317r0509J22362k53119J71206
16496A615112j16778j06540M13252k29545J45222l72817K75795l0231l70299K96454
16486A519625o073l39378L18240J18337m48268K48711J7849L33199m08840j14215
16476A239187m0738L01239k36800K8111J01611k53234K51514m65471m0729K91122
$$ plain form
16466 1175812 1514758 1218187 1154491 1114228 1084834 1178925 1273521 1100102 1161643 1034997
16456 1034997 1440121 1492995 1232550 957722 1120773 990534 1257169 912464 942887 1032759
16446 1032759 1279171 712022 845297 839342 981377 1046635 776159 804463 823666 1175383
16436 1175383 915122 911117 859936 952266 1060481 1096391 875619 981829 914085 752356
16426 752356 709811 565164 583883 991437 1028945 757476 1021972 771197 879745 815701
16416 815701 586753 850889 762750 1142380 1099483 738592 840957 764148 1025980 478902
16405 495344 784609 608504 707399 624066 796632 813373 487919 662947 529118 420579
16395 420579 931414 726141 396212 670780 628638 595364 719948 707791 688396 718429
$$ packed form
16466A175812L38946k96571o3696m0263k9394R4091R4596j73419O1541j26646
16456A034997M05124N2874k60445k74828J63051j30239K66635l44705L0423Q9872
16446A032759K46412n67149J33275n955J42035O5258k70476K8304J9203L51717
16436A175383k60261m005n1181R2330J08215L5910k20772J06210o7744j61729
16426G52356m2545j44647J8719M07554L7508k71469K64496k50775J08548o4044
16416H15701k28948K64136q8139L79630m2897l60891J02365p6809K61832D78902
16405D95344K89265j76105R8895q3333J72566J6741l25454J75028j33829j08539
16395D20579N10835k05273l29929K74568m2142l3274J24584j2157j9395L0033
$$ plain form
16385 718429 698932 772329 589768 847503 1136391 872158 500924 661881 745715 682614
16375 682614 657795 673725 494248 789638 587582 659545 458523 710965 382158 727822
16365 727822 586900 525599 513005 670073 433709 540358 339534 774849 575084 739079
16355 739079 704156 354959 325356 278190 345135 453341 621989 729424 444707 713813
16345 713813 505313 633216 200713 192874 513051 486207 471844 275847 704054 670506
16335 670506 517654 323043 391481 443220 602096 434222 446487 538278 397577 -53735
16324 159995 381140 403456 359504 314935 532552 348457 465574 425125 207749 416371
16314 416371 421360 554771 218242 526795 404777 288651 573843 253591 387272 435096
$$ packed form
16385G18429j9497P3397j82561K57735K88888k64233l71234J60957Q3834o3101
16375F82614k4819J5930j79477K95390k02056P1963k01022K52442l28807L45664
16365G27822j40922o1301j2594J57068k36364J06649k00824M35315j99765J63995
16355G39079l4923l49197k9603m7166O6945J08206J68648J07435k84717K69106
16345G13813k08500J27903B00713p839L20177k6844j4363j95997M28207l3548
16335F70506j52852j94611O8438N1739J58876j67874J2265R1791j40701e3735
16324A59995K21145K2316m3952m4569K17617j84095J17117m0449B07749K08622
16314D16371M989J33411B18242L08553j22018j16126K85192B53591J33681M7824
$$ plain form
16304 435096 431439 251823 386566 432289 353571 554857 842192 449949 458513 308256 327654
16293 327654 186651 507810 332359 850967 407660 363653 422214 150147 364863 318765
16283 318765 354008 276533 307484 507640 586842 -14030 251818 476105 271193 446617
16273 446617 197091 228234 477233 360500 857019 349652 292342 179218 -34919 190317
16262 356060 99158 274799 158331 361993 319968 116371 475219 411803 23721 728519
16252 728519 83311 163254 330250 418201 274832 321117 280192 741325 154861 40827 378497
16241 378497 5647 412508 424033 60052 263716 -2730 683836 305792 455260 379536 653700
16230 653700 211422 -71963 393152 459557 375914 153743 285938 525909 41398 190425
$$ packed form
16304D35096l657j79616J34743M5723p8718K01286K87335l92243Q564j50257J9398
16293C27654j41003L21159j75451N18608D07660m4007N8561A50147K14716m6098
16283C18765L5243p7475L0951K00156P9202a4030B51818K24287k04912J75424
16273D46617A97091L1143K48999j16733M96519C49652n7310j13124c4919A90317
16262C56060I9158J75641j16468K03662m2025A16371L58848o3416B3721P04798
16252G28519H3311P9943J66996Q7951j43369M6285m0925M61133A54861D0827L37670
16241C78497E647M06861J1525F0052K03664b730F83836C05792J49468p5724K74164
16230F53700B11422g1963C93152O6405q3643A53743J32195K39971D1398J49027
$$ plain form
16220 190425 164998 234721 333890 120075 408785 217130 262627 204231 408060 123836
16209 347905 -37005 174521 -66432 102947 -82720 148737 284952 35209 237303 187874
16199 187874 -93825 213989 408252 59096 141140 129715 55010 53448 24151 248094 -97413
16187 -44920 147802 87809 77263 191190 397530 159065 346170 -3225 -85251 149111 62495
16175 123816 207534 333148 29751 257371 305071 360020 105229 69715 227026 280196 -34558
16163 136450 80929 214140 64486 -54701 177907 567726 72752 -91366 350869 74325 -97273
16151 -43177 189269 143090 -25621 64367 254361 14205 -15436 298291 16499 -193251 29274
16139 129408 337624 150496 -145428 -46488 180635 191251 89427 -58199 112716 263451
$$ packed form
16220A90425k5427O9723R9169A20075K88710j91655M5497n8396K03829A23836
16209C47905c7005A74521f6432A02947h2720A48737J36215C5209K02094m9429
16199A87874i3825B13989J94263E9096Q2044j1425E5010j562B4151K23943i7413
16187d4920A47802n9993j0546J13927K06340A59065J87105c225q2026A49111F2495
16175A23816Q3718J25614B9751K27620M7700N4949A05229l5514J57311N3170c4558
16163A36450n5521J33211F4486e4701A77907L89819G2752i1366C50869G4325i7273
16151d3177A89269m6179b5621F4367J89994A4205a5436B98291A6499a93251B9274
16139A29408K08216A50496a45428d6488A80635J0616H9427e8199A12716J50735
$$ plain form
16129 263451 255211 72070 183610 126442 -100483 211116 492810 3260 59140 317455 228369
16118 228369 -34482 -91387 -102487 84232 403800 299829 110455 49380 -128409 205466
16107 188138 -13007 162415 178927 282952 -214233 187180 -67159 77291 311167 113542
16096 155998 -166631 618937 -147249 51130 208474 309011 -7128 486 205142 399654 50695
16084 -83190 234276 -255273 166118 365656 -7081 32604 -121340 436428 -157500 214604
16073 4595 -17968 -201221 -269246 221719 -139521 -106237 72369 113658 -187903 -73305 151566
16061 291053 156908 -232308 -160432 100648 -257362 -193299 341370 53734 -154224 75532
16050 243200 282970 -194331 -111717 -140806 70641 -336232 152981 420330 43801 -43203 317345
$$ packed form
16129B63451q240G2070J11540n7168a00483B11116K81694C260N5880K58315q9086
16118B28369c4482n6905j1100H4232L19568j03971A10455D9380a28409B05466
16107A88138a3007A62415J6512J04025b14233A87180f7159G7291K33876A13542
16096A55998a66631F18937a47249E1130J57344J00537g128D86K04656J94512E0695
16084h3190B34276b55273A66118J99538g081C2604a21340D36428a57500B14604
16073D595a7968j83253o8025B21719a39521L3284G2369M1289a87903g3305A51566
16061B91053j34145b32308P1876A00648b57362O4063C41370E3734a54224G5532
16050B43200L9770a94331Q2614k9089G0641c36232A52981K67349D3801d3203C17345
$$ plain form
16038 -2817 72345 -21617 348611 -19210 -95090 235086 380060 150784 91295 66780 -153579
16026 353185 -21512 246685 -163016 -16796 -195558 -50598 -37415 -29788 257196 362466 5168
16014 17937 234329 321916 -175591 215823 -175479 242468 108384 -93737 403702 -151797
16003 86194 225188 33712 -312672 -71635 -30292 330070 -129425 39284 -62765 -263264 -111667
15991 214400 384257 218972 404613 98386 777363 991148 1011661 1177885 1258902 756170
15981 756170 345816 242908 393583 563133 -186357 103601 -65327 242719 -39770 -86157
15971 -86157 -118020 -63668 -145849 -184829 -30133 58482 57565 -87775 77869 -47685 -154306 -315159
15959 -315159 -103603 74202 -156435 -41571 -36898 146042 185749 169205 112798 93645 -78233
$$ packed form
16038b817G2345b1617C48611a9210p5880B35086J44974A50784n9489k4515a53579
16026C53185b1512B46685a63016a6796j78762e0598J3183P627B57196J05270E168
16014A7937K16392Q7587a75591B15823a75479B42468A08384i3737D03702a51797
16003H6194J38994C3712c12672g1635c0292C30070a29425C9284f2765k00499a11667
15991B14400J69857j65285J85641I8386O78977K13785K0513J66224Q1017n02732
15981G56170C45816j02908J50675J69550a86357A03601f5327B42719c9770m6387
15971h6157l1863N4352q2181l8980c0133E8482r17h7775G7869d7685j06621j60853
15959c15159a03603G4202a56435d1571M673A46042L9707j6544n6407j9153g8233
$$ plain form
15947 -445145 149398 -81223 -221528 -6193 42745 184593 -53079 -120706 -113350 12350 169107
15936 169107 49658 18466 -3120 -29388 215015 -166468 219423 -73254 -127275 -269463 -226730
15925 -226730 18622 115476 1253 -410621 65207 15236 -135155 -56801 -31665 237616 -15295
15913 -926 309718 -80058 105852 182915 13753 -149751 -244105 227133 84107 -377736 174382
15901 -134053 47994 -265141 -371880 68972 -338449 -103587 296019 32072 280477 142068
15891 142068 80545 117513 180519 141157 261253 -321203 -270889 280143 -38585 -235865 -161372
15880 -161372 264603 12114 56110 -16136 -79029 -279855 159433 -123038 -206979 -28668 129038
15868 -43568 -115248 74637 86960 -273431 -19030 192680 22171 56931 -198784 130320 -38502
$$ packed form
15947d45145A49398h1223j40305f193D2745J41848e3079o7627P356A2350J56757
15936A69107D9658A8466c120k6268B15015a66468B19423g3254n4021j42188M2733
15925b26730A8622R6854A253d10621F5207A5236a35155e6801K5136B37616a5295
15913i26C09718h0058A05852P7063A3753a49751r4354B27133H4107c77736A74382
15901a34053D7994b65141j06739F8972c38449a03587B96019C2072K48405j38409
15891A42068o1523L6968O3006l9362J20096c21203N0314B80143c8585j97280P4493
15880a61372B64603A2114M3996a6136o2893k00826A59433a23038q3941b8668A29038
15868d3568p1680G4637J2323b73431a9030A92680B2171L4760a98784A30320c8502
$$ plain form
15856 -288020 247768 195633 72239 -24611 -6244 -158160 -222757 96881 65553 138067 -141153
15844 119981 8514 184497 -52511 110822 152292 -189554 -112869 -150799 49299 -293690 -233983
15833 -233983 9512 7161 -190982 -381055 129976 -123473 -399339 -94783 -245264 -261613 110275
15821 40733 292716 -148085 70361 381408 -127194 13718 -74692 -171034 -111226 -81530 -42909
15810 -42909 -202431 -125670 -136781 -25669 324641 138931 -29987 120125 66253 111431 -135082
15798 -89618 -298813 142855 160529 49171 44738 -29226 13302 52575 24719 292904 228426
15787 228426 -236943 109166 54854 58355 2080 167859 -21412 44541 -12871 200253 -94257
15775 367877 -78043 -17130 -131719 69473 70291 -180290 290915 8073 -144380 39774 -25138
$$ packed form
15856b88020B47768n2135G2239b4611f244j51916o4597I6881l1328P2514a41153
15844A19981H514J75983e2511A10822M1470a89554P6685l7930D9299b93690N9707
15833b33983I512k351a90982j90073A29976a23473k75866i4783j50481j6349A10275
15821D0733K51983a48085G0361L11047a27194A3718g4692r6342N9808K9696L8621
15810d2909j59522P6761j1111b5669C24641A38931b9987A20125n3872M5178a35082
15798h9618k09195A42855J7674D9171m433b9226A3302L9273B4719K68185o4478
15787B28426b36943A09166n4312L501B080J65779b1412D4541a2871B00253i4257
15775C67877g8043a7130j14589F9473Q18a80290B90915H073a44380C9774b5138
$$ plain form
15763 -75289 -70985 167645 271837 63698 -262898 173159 165324 -19025 66736 16172 -66251
15751 -193168 128427 -150632 -31964 -97175 28588 -10945 -94360 241270 -132122 -148154 271730
15739 -42164 -370637 -41400 148502 150620 105126 -192855 -69835 -504667 307576 198988 -73374
15727 -83458 184314 -113610 -215593 -126576 118792 -243314 132416 -16681 -276797 -53519
15716 -52150 -296550 -427289 -190349 -260075 -124386 -180686 84522 218273 75390 -362699
15705 92388 -130622 -139255 -115402 -68152 -156243 -122437 -444187 -25256 -214195 -304388 -294394
15694 -294394 250258 40807 -112552 97372 128898 -126795 -295973 254611 356989 -44651
15683 217404 159644 -60337 -274198 -336490 84991 -34289 -116829 162872 -18427 -26266 -278088
$$ packed form
15763g5289M304A67645J04192F3698b62898A73159p835a9025F6736A6172f6251
15751a93168A28427a50632c1964o5211B8588a0945q3415B41270a32122j6032B71730
15739d2164l28473d1400A48502K118m5494a92855f9835m34832C07576j08588g3374
15727h3458A84314a13610j01983Q9017A18792b43314A32416a6681k60116e3519
15716e2150k44400j30739a90349o9726a24386n6300H4522J33751G5390c62699
15705I2388a30622q633K3853M7250q8091L3806l21750b5256j88939r0193R994
15694b94394B50258D0807a12552I7372L1526a26795j69178B54611J02378d4651
15683B17404n7760f0337k13861o2292H4991c4289q2540A62872a8427p839k51822
$$ plain form
15672 -278088 -72361 154766 342431 -348408 320191 289442 67434 -38440 140549 -208488
15661 -86950 4718 -208308 -233896 56136 -89306 159483 101720 -6551 -120619 150589 -5337
15649 32467 -21163 -286196 32680 -156724 351419 -141496 49123 408623 -181475 90431
15638 259149 -200358 -169488 -266220 -126034 53679 1231 59992 -63104 146358 28508 26239
15627 26239 61422 -188719 43542 97294 -31044 174144 -211181 -114616 -35720 -54509 181909
15615 -16718 189576 65154 -84920 -44486 -217136 -90012 8377 -206869 28562 147965 4018
15603 -197348 51056 -77554 -206657 -194193 138969 45629 -54674 51052 91424 102867 -103089
15591 158324 -38197 -40348 157725 342072 -3524 244305 -207787 -110270 199280 -22445 224832
$$ packed form
15672b78088g2361A54766J87665c48408C20191l0749F7434c8440A40549b08488
15661h6950D718b08308k5588E6136h9306A59483n7763f551j14068A50589e337
15649C2467b1163k65033C2680a56724C51419a41496D9123L59500a81475I0431
15638B59149b00358L0870r6732a26034E3679A231N8761f3104A46358B8508k269
15627B6239L5183a88719D3542N3752c1044A74144b11181R6565c5720j8789A81909
15615a6718A89576F5154h4920M0434j72650i0012H377b06869B8562J19403D018
15603a97348E1056g7554j29103J2464A38969D5629e4674E1052M0372J1443a03089
15591A58324c8197k151A57725J84347c524B44305b07787R7517A99280b2445B24832
$$ plain form
15579 203337 -85152 -368423 81762 197077 -65798 -256633 70616 -226112 -201536 62426 -215211
15567 -415271 21602 -79867 -127427 125712 -18975 253504 7646 -72008 -37665 -30542 192489
15555 342105 -105700 -265776 -114404 92016 -27988 -87421 -191822 -280452 86268 21501 259021
15544 259021 131244 5444 -14930 -141905 -90747 169825 56671 -13069 96661 98319 -20762
15532 165394 64060 -235082 -122218 -95709 -79708 230070 48088 215559 36077 -81807 192939
15520 24746 65635 108303 255275 120986 374208 -47610 162222 311916 257316 203022 52505
15508 -90795 94638 426768 -172067 -19956 252514 -82856 -192846 53403 -15698 272044 3694
15496 -109453 540070 87268 -144708 163899 270869 142482 78901 28388 304659 233729
$$ packed form
15579B03337h5152k83271H1762J15315f5798j90835G0616b26112K4576F2426b15211
15567d15271B1602g9867m7560A25712a8975B53504G646g2008L4343P123A92489
15555C42105a05700j60076a14404I2016b7988n9433j04401q8630H6268B1501K37520
15544B59021j27777E444a4930j26975N1158A69825E6671a3069I6661J658b0762
15532A65394F4060b35082J12864K6509J6001B30070D8088J67471C6077h1807A92939
15520B4746M0889M2668J46972A20986K53222d7610A62222J49694n4600n4294E2505
15508i0795I4638L32130a72067a9956B52514h2856j09990E3403a5698B72044C694
15496a09453E40070H7268a44708A63899J06970j28387o3581B8388K76271p0930
$$ plain form
15486 233729 -55870 151081 42397 80368 228059 32136 -112032 -40136 -32184 113763 157287
15475 157287 395222 518797 764247 995775 479331 329906 -47418 83451 437050 145469
15464 202838 -340315 -25406 201851 20996 381956 -607 152557 91719 -513026 166382 27576
15452 446176 -237082 -89241 -10728 -318032 -113921 174720 15632 -21428 257524 259166 540068
15441 540068 893532 1405612 913368 780402 342988 110459 -85890 186322 -3291 -67516
15431 -67516 435573 367481 76469 -88293 -156652 -63630 247766 -86661 -21888 -77246 65556
15419 50929 7928 333523 -137294 15998 -70923 198771 -81264 -206302 30373 -59276 207880
15407 -177708 -113418 79051 1368 120131 153790 -58491 109052 108962 98173 -164217 31893 -428398
$$ packed form
15486B33729e5870A51081D2397L7971J47691C2136a12032d0136P952A13763M3524
15475A57287K37935J23575K45450K31528D79331j49425d7418H3451L53599A45469
15464B02838c40315b5406B01851B0996L60960f07A52557o0838e13026A66382B7576
15452D46176b37082h9241a0728l07304a13921A74720A5632b1428B57524J642K80902
15441E40068L53464N12080m92244j32966C42988A10459h5890A86322c291o4225
15431f7516D35573o8092G6469h8293o8359f3630B47766h6661b1888n5358F5556
15419E0929G928L25595a37294A5998g0923A98771h1264j25038C0373e9276B07880
15407a77708O4290G9051A368J18763L3659e8491A09052r0j0789a64217C1893d28398
$$ plain form
15394 193428 -95513 36634 -69718 21947 17272 93297 -294626 207323 -159916 314715 -144938
15382 224550 -47672 -211412 -27841 144734 190657 223589 31735 362724 73013 372131 245619
15371 245619 226345 268795 -47571 234495 -76673 219535 177869 390251 185146 225765 79858
15359 305129 583647 -36349 478906 228838 197097 391008 200213 181603 472679 99039
15348 238648 296047 -171450 307096 90957 229729 149976 598230 588793 158436 315784
15338 315784 320489 207390 -27735 215247 25749 338514 83734 228625 -35591 298383 40665
15326 -13302 318869 -37879 -44220 364498 -78938 -4513 145178 70387 126372 -8365 98144 -240679
15313 56588 73842 53762 -5828 72379 519159 276117 -99012 190310 264640 26760 234559
$$ packed form
15394A93428i5513C6634f9718B1947m675P6025b94626B07323a59916C14715a44938
15382B24550d7672j63740b7841A44734M5923L2932C1735L30989G3013K99118j26512
15371B45619j9274M2450d7571B34495g6673B19535m1666K12382A85146M0619G9858
15359C05129K78518c6349D78906B28838l1741J93911j90795j8610K91076I9039
15348B38648N7399a71450C07096I0957J38772p9753M48254r437A58436J57348
15338C15784M705j13099b7735B15247B5749L12765H3734J44891c5591B98383D0665
15326a3302C18869c7879o341C64498g8938d513A45178G0387N5985h365I8144b40679
15313E6588J7254k0080e828G2379M46780k43042i9012A90310P4330B6760K07799
$$ plain form
15302 234559 255874 -339574 -166511 246758 112424 -84155 27749 93044 119320 254144
15292 254144 177318 11669 -139219 -185987 222071 -96863 -218038 260902 184850 -70805 53866
15280 -47910 124064 155399 73804 -44657 36286 -14850 -242971 132553 194285 194726 168849
15269 168849 -91493 373084 84253 -98225 -179346 121197 -82721 60091 -64375 205498 -183941
15257 193765 -45918 2601 -371288 133514 -92684 -83676 -28217 -64952 215813 -13567 -86449
15246 -86449 154502 285965 340448 1188859 2343981 1323978 1799987 1712467 501179 197312
15235 318720 181542 -63468 45484 -71738 -351289 277157 -297830 181313 -163082 -64530
15224 30328 10376 72282 -124826 -115054 161020 25090 -262595 163444 -63043 187722 -22012
$$ packed form
15302B34559K1315c39574a66511B46758A12424h4155B7749O5295K6276J34824
15292B54144p6826A1669a39219m6768B22071i6863j21175B60902p6052g0805E3866
15280d7910A24064L1335G3804d4657C6286a4850k28121A32553O1732M41k5877
15269A68849i1493C73084H4253i8225q1121A21197h2721F0091f4375B05498a83941
15257A93765d5918B601c71288A33514i2684R008b8217l6735B15813a3567p2882
15246h6449A54502J31463N4483Q48411J155122j020003M76009q7520E01179A97312
15235C18720j37178f3468D5484g1738k79551B77157b97830A81313a63082f4530
15224C0328A0376O1906a24826R772A61020B5090b62595A63444f3043A87722b2012
$$ plain form
15212 73699 -219975 121711 -241182 135728 47797 61500 165593 248596 173879 93127 -54559
15200 -94363 223040 102514 -162540 -19803 -200007 207071 -8029 -121199 45478 -16187 -37377
15189 -37377 -182874 335645 69029 98725 -178363 505257 4799 -168261 283064 235694 243067
15178 243067 -50150 164302 -108199 289611 260493 163121 184395 203744 186530 27469 396621
15167 396621 -100981 -314771 12619 35892 -99180 286805 239781 -222243 176830 316345
15157 316345 347938 124237 41589 -77494 10110 169196 59725 203863 394210 -70258 -229851
15146 -229851 -70643 -150897 495632 -38807 165862 68766 -10867 42809 219429 127578 278685
15135 278685 33120 223267 -123002 119395 116927 61608 -39571 251616 -12956 -332785 -159004
$$ packed form
15212G3699b19975A21711b41182A35728D7797J3703J04093Q3003p4717q0752e4559
15200i4363B23040A02514a62540a9803j80204B07071h029j13170D5478a6187k1190
15189c7377j45497C35645F9029K9696a78363E05257D799a68261B83064m7370P373
15178B43067e0150A64302a08199B89611k9118r7372K1274J9349j7214B7469L69152
15167C96621a00981k13790A2619K3273i9180B86805m7024b22243A76830J39515
15157C16345L1593A24237D1589g7494A0110J59086E9725J44138J90347g0258j59593
15146b29851g0643q0254D95632c8807A65862F8766a0867D2809J76620r1851J51107
15135B78685C3120J90147a23002A19395k468n5319c9571B51616a2956l19829a59004
$$ plain form
15123 46415 104262 614082 123195 -1244 474321 750446 411511 231240 308162 66700 263649
15112 263649 19951 54309 337663 40129 -86771 403699 -149180 28657 80529 278069 57022
15100 31242 426455 -170392 -395781 -178479 423496 354908 283871 15729 310776 137656
15089 277244 176561 -2898 15669 -81253 47124 74514 293100 -83956 2393 96769 -41579
15077 13824 340867 -6068 8166 286740 128735 208106 118764 290486 99504 135410 77659
15066 77659 96009 237561 119134 52195 56519 212836 -8269 271040 182144 299599 213424
15055 213424 203311 471924 272884 55335 106630 550166 195351 428797 295803 449912
15045 449912 392138 359122 329317 111291 161695 125445 85199 694914 482303 679499 155151
$$ packed form
15123D6415N7847N09820A23195a244D74321K76125l38935j80271P6922F6700J96949
15112B63649A9951L4358K83354D0129h6771D03699a49180B8657N1872J97540E7022
15100C1242L95213a70392k25389a78479D23496o8588p1037A5729K95047A37656
15089B77244j00683b898A5669h1253D7124K7390K18586h3956B393R4376d1579
15077A3824L27043f068H166K78574A28735P9371q9342J71722I9504L5906n7751
15066G7659J8350J41552j18427E2195M324J56317h269B71040q8896J17455q6175
15055B13424j0113K68613j99040E5335N1295M43536A95351K33446j32994J54109
15045D49912n7774l3016k9805A11291N0404l6250m0246O09715k12611J97196A55151
$$ plain form
15033 42144 576749 638994 405157 717164 855067 883644 705145 844216 652867 753731
15023 753731 647871 270462 319202 600271 170115 400125 710279 312934 601884 272856
15012 398276 310090 441495 381448 523833 544198 915017 635046 407646 128549 33171
15001 420594 401726 249500 572860 206157 505567 628974 362651 261898 -86653 187322
14990 411405 235375 449915 307193 734052 497685 323835 295974 570403 584263 995545
14980 995545 894458 1182124 765096 205864 429704 472111 141698 470297 375146 666925
14970 666925 854273 525960 730980 737986 346213 417325 419372 535723 271019 278657 264425
14959 264425 281839 17936 301077 55513 132966 437109 128036 496749 503548 90613 434524
$$ packed form
15033D2144N34605O2245k33837L12007J37903K8577j78499J39071j91349J00864
15023G53731j05860B70462M8740K81069A70115K30010L10154C12934K88950B72856
15012C98276q8186J31405o0047J42385K0365L70819k79971k27400A28549C3171
15001D20594j8868j52226L23360B06157K99410J23407k66323j00753h6653A87322
14990D11405j76030K14540j42722M26859k36367j73850k7861K74429J3860M11282
14980I95545j01087K87666m17028B05864K23840M2407A41698L28599r5151K91779
14970F66925J87348l28313K05020P006C46213P1112K047J16351k64704P638j4232
14959B64425J7414A7936K83141E5513P7453L04143A28036L68713O799I0613L43911
$$ plain form
14948 434524 319579 154039 526840 512797 602094 726620 581168 659939 446444 202283
14937 257284 281265 553885 507996 243283 470677 333770 876774 811071 962435 1313553
14927 1313553 986628 1469355 1534574 1553589 1786502 1658015 1516890 1412352 1487746 1583313
14917 1583313 1773245 2251607 2257512 1701426 1621584 1697302 1089379 1041174 1098133 765433
14907 765433 560360 793809 497477 352201 867952 473455 349306 286166 250216 324603
14897 324603 409005 455733 359450 349195 461410 450558 454445 685650 565939 417701 605806
14886 605806 902591 771570 831179 653001 1073273 502846 990568 1061798 636824 957037
14876 957037 939068 693521 547713 440274 789789 482627 555217 330838 242409 355455
$$ packed form
14948D34524j14945A54039L72801j4043Q9297J24526j45452P8771k13495B02283
14937B57284K3981K72620m5889B43283K27394j36907N43004o5703J51364L51118
14927A313553l26925M82727O5219J9015K32913j28487j41125j04538P5394R5567
14917A583313J89932M78362N905n56086p9842P5718o07923m8205N6959l32700
14907G65433k05073K33449k96332j45276N15751l94497j24149o3140l5950P4387
14897C24603Q4402M6728r6283j0255J12215j0852L887K31205j19711j48238J88105
14886F05806K96785j31021N9609j78178M20272E02846M87722P1230m24974L20213
14876I57037j7969k45547j45808j07439L49515l07162P2590k24379q8429J13046
$$ plain form
14866 355455 761348 625892 889545 1180379 453647 769287 771575 184202 116727 756607
14856 756607 749268 419524 407841 120239 435763 739282 724984 549544 447424 344433
14846 344433 403925 560118 830131 767217 1069619 1200869 1209044 1423942 1070561 1089379
14836 1089379 1045977 778611 708515 807926 828201 772443 455791 512563 735286 812869 738704
14825 738704 478005 605834 690231 638197 744708 548763 610923 823419 577286 646680
14815 646680 721513 485727 660677 846016 491789 679192 563615 864143 828329 863296
14805 863296 758651 1127959 923452 899975 861806 967208 623394 731129 519570 535150
14795 535150 275889 598284 485502 692651 748178 587232 619998 738391 498448 608786
$$ packed form
14866C55455M05893j35456K63653K90834D53647L15640K288A84202o7475O39880
14856G56607p339l29744j1683A20239L15524L03519j4298j75440j02120j02991
14846C44433N9492J56193K70013o2914L02402J31250Q175K14898l53381J8818
14836A089379m3402k67366p0096R9411K0275n5758l16652N6772K22723P7583p4165
14825G38704k60699J27829Q4397n2034J06511j95945O2160K12496k46133O9394
14815F46680P4833k35786J74950J85339l54227J87403j15577L00528l5814L4967
14805H63296j04645L69308k04507k3477l8169J05402l43814J07735k11559J5580
14795E35150k59261L22395j12782K07149N5527j60946L2766J18393k39943J10338
$$ plain form
14785 608786 667023 961759 543139 412368 538807 781556 570218 576757 726874 842142
14775 842142 534800 1103247 1001826 673447 903669 961137 591742 859463 478812 553733
14765 553733 505499 757054 678164 636111 582311 907776 604314 519125 839857 859166 705735
14754 705735 612173 934649 580341 698705 648672 390438 199572 258478 935774 466803
14743 857409 641991 753605 564452 458410 860772 570532 444732 668978 540745 690838
14733 690838 900771 454284 1045360 1150582 1213549 1498021 1604081 1780123 2205330 1913538
14723 1913538 1202727 1174057 1042615 839511 1242111 893871 929032 1211529 623373 727936
14713 727936 803548 508142 800498 724387 1090814 563917 781674 995190 1092094 1219711
$$ packed form
14785F08786N8237K94736m18620j30771J26439K42749k11338O539J50117J15268
14775H42142l07342N68447j01421l28379K30222N7468l69395K67721l80651P4921
14765E53733m8234K51555p8890m2053n3800L25465l03462q5189L20732J9309j53431
14754G05735r3562L22476l54308J18364n0033k58234j90866N8906O77296D66803
14743H57409k15418J11614j89153j06042M02362k90240j25800K24246j28233J50093
14733F90838K09933m46487N91076J05222O2967K84472J06060J76042M25207k91792
14723A913538p10811k8670j31442k03104M02600l48240L5161K82497n88156J04563
14713G27936P5612k95406K92356p6111L66427n26897K17757K13516R6904J27617
$$ plain form
14703 1219711 1047136 1204523 1388309 1748779 2083377 2030772 1404032 1385372 1492233 1078291
14693 1078291 1012537 1137801 678480 882810 952710 1032263 921240 785887 871181 948542
14683 948542 852239 880640 887306 1154288 1006123 1167939 764728 1004781 966552 900216 1023043
14672 1023043 948257 858289 954121 1049939 805493 785172 1110349 916296 950684 535807
14662 535807 1000804 928302 1222663 1054781 1129635 1099644 1462112 1118317 1174061 1087477
14652 1087477 1442850 1508389 1309671 1416496 1360296 938322 1355849 1341051 1270667 1324998
14642 1324998 1008195 1295725 999080 1184531 1487230 1323804 1332227 1022954 1217621 1384198
14632 1384198 971866 1112048 1303837 1529726 1456467 1425251 1406832 1243070 1249363 1457282
$$ packed form
14703A219711j72575J57387J83786L60470L34598n2605o26740j8660J06861m13942
14693A078291o5754J25264m59321K04330O9900P9553j11023j35353Q5294P7361
14683I48542r6303K8401O666K66982j48165J61816m03211K40053l8229o6336J22827
14672A023043p4786q9968R5832R5818k44446k0321L25177j94053L4388m14877
14662E35807M64997p2502K94361j67882P4854k9991L62468l43795N5744q6584
14652A087477L55373O5539j98718J06825n6200m21974M17527j4798p0384N4331
14642A324998l16803K87530k96645J85451L02699j63426Q423l09273J94667J66577
14632A384198m12332J40182J91789K25889p3259l1216j8419j63762O293K07919
$$ plain form
14622 1457282 1334543 1443991 1500288 1288535 1304507 1651362 1426375 1483691 1260714 1348772
14612 1348772 1513541 1325568 1584391 1424603 1341943 1390976 1436387 1340205 1623285 1431239
14602 1431239 1536425 1808276 1921500 1540951 1343725 1786380 1325410 1587133 1745579
14593 1745579 1544835 1945291 1436998 1601306 1676511 1662379 1934739 2015313 1776797 1937735
14583 1937735 1608714 1875909 2202464 1729838 2047102 2158839 2193181 1998384 2273624 2060200
14573 2060200 1879046 1994069 2123194 2262065 2101269 2283181 2494454 2308660 2388616 2582932
14563 2582932 2193640 2504777 2559429 2309717 2698794 2845824 2840983 3299415 3073338 3305705
14553 3305705 3830862 4039216 4756393 5408090 7101569 11142735 21321083 43521344
$$ packed form
14622A457282j22739J09448N6297k11753J5972L46855k24987N7316k22977Q8058
14612A348772J64769j87973K58823j59788q2660M9033M5411r6182K83080j92046
14602A431239J05186K71851J13224l80549j97226M42655m60970K61723J58446
14593A745579k00744M00456n08293J64308P5205j4132K72360Q0574k38516J60938
14583A937735l29021K67195L26555m72626L17264J11737L4342j94797K75240k13424
14573B060200j81154J15023J29125J38871j60796J81912K11273j85794P9956J94316
14563B582932l89292L11137N4652k49712L89077J47030m841M58432k26077K32367
14553C305705N25157K08354P17177O51697J693479M041166J0178348K2200261
$$ plain form
14545 43521344 45894297 17676915 7793915 4345733 3234475 2917471 3120393 4782167
14537 4782167 5788349 3224434 2264008 2321672 2272898 2073930 2019914 1694555 2077403 2040194
14527 2040194 1979612 2019089 1987314 2167983 2427913 2268169 2242099 2335204 2554990 2229345
14517 2229345 2748520 2376147 2772400 2463062 2621454 2951130 2587075 2987305 3061048 2812197
14507 2812197 2779301 2845237 2707928 3072656 3076522 3447920 2961088 3232329 2867847 3022597
14497 3022597 3081119 3536633 3378029 3287827 3212135 2925891 3513890 3337479 3660841 3471864
14487 3471864 3579542 3426438 3657835 3364057 3795731 3533204 3357618 3587580 3945536
14478 3945536 3875962 3970547 4088996 3914484 4067653 4105738 3883870 4362717 4016930 3915739
$$ packed form
14545D3521344K372953A7676915G793915l448182j111258l17004K02922J661774
14537D782167J006182k563915r60426N7664m8774j98968n4016l25359L82848l7209
14527B040194o0582L9477l1775J80669K59930j59744k6070R3105K19786l25645
14517B229345N19175l72373L96253l09338J58392L29676l64055M00230P3743k48851
14507B812197l2896O5936j37309L64728L866L71398m86832K71241l64482J54750
14497C022597N8522M55514j58604r0202p5692k86244N87999j76411L23362j88977
14487C471864J07678j53104K31397k93778M31674k62527j75586K29962L57956
14478C945536o9574R4585J18449j74512J53169L8085k21868M78847l45787j01191
$$ plain form
14468 3915739 4354403 4549097 4457242 4381142 4261519 4506426 4663582 4902624 4356569 5111180
14458 5111180 4742556 4798911 4918927 4975908 5664361 5289640 5091082 5334218 5264932 5522949
14448 5522949 5462559 5469856 5715778 5800843 5956201 6160620 6017103 6069548 5987066 6334814
14438 6334814 6432784 6505472 6257360 6441630 6786875 6920446 6907632 6760388 7146120 6986109
14428 6986109 7271102 7227055 7447888 7496894 7641106 7811003 7785510 7787940 8449011 8399123
14418 8399123 8508709 8740477 8937568 8690586 8906641 8442482 8737978 9397400 8954180
14409 8954180 9432944 9294558 9556915 9967742 10101870 10466062 10882358 10564273 10693750
14400 10693750 10502727 10728706 10678263 11315919 11142869 11748422 11960601 11910743 12172688 12379271
$$ packed form
14468C915739M38664J94694r1855p6100j19623K44907J57156K39042n46055P54611
14458E111180l68624N6355J20016N6981O88453l74721j98558K43136o9286K58017
14448E522949o0390P297K45922Q5065J55358K04419j43517N2445q2482L47748
14438F334814R7970P2688k48112J84270L45245J33571j2814j47244L85732j60011
14428F986109K84993m4047K20833M9006J44212J69897k5493K430O61071m9888
14418H399123J09586K31768J97091k46982K16055m64159K95496O59422m43220
14409H954180M78764j38386K62357M10827J34128L64192M16296l18085J29477
14400A0693750j91023K25979n0443O37656j73050O05553K12179m9858K61945K06583
$$ plain form
14390 12379271 12511118 12336074 12823804 13291753 13570319 13873295 14124572 14308299 14410209
14381 14410209 15202951 15171449 15547554 15777869 15933668 15964691 16377316 16475334 17064757 17157422
14371 17157422 18047809 18187066 18715937 18740027 19292814 19711325 19977615 20804109 21101595
14362 21101595 21800033 21723377 22233817 22504004 23070559 23941732 24001346 24751084 25427084 26051028
14352 26051028 26344812 27158565 27845495 28444894 29259900 29847223 30692441 31539250 32254581
14343 32254581 33192134 34280658 35155298 36137054 36980057 38203416 39218022 40009548 41680786
14334 41680786 43015268 43870206 45296873 46646918 47993273 50124262 51235279 53052390
14326 53052390 54912928 56919108 58728569 60609546 62683646 64690257 67078543 69960302
$$ packed form
14390A2379271J31847j75044M87730M67949K78566L02976K51277J83727J01910
14381A4410209P92742l1502L76105K30315J55799L1023M12625R8018N89423R2665
14371A7157422Q90387J39257N28871K4090N52787M18511K66290Q26494K97486
14362B1101595O98438p6656N10440K70187N66555Q71173N9614P49738O76000O23944
14352B6051028K93784Q13753O86930N99399Q15006N87323Q45218Q46809P15331
14343C2254581R37553J088524Q74640R81756Q43003J223359J014606P91526J671238
14334D1680786J334482Q54938J426667J350045J346355K130989J111017J817111
14326E3052390J860538K006180J809461J880977K074100K006611K388286K881759
$$ plain form
14318 69960302 71882625 74850622 77454584 80293226 83513942 86870959 90135924 93714404
14310 93714404 97706597 101865557 106148476 111037003 115765703 120899032 126360867 132063462
14302 132063462 138468648 144945053 152004041 159384562 167294409 175617255 184444274 193533804
14294 193533804 203776531 213972438 224954364 236468411 248444233 261470135 274890707
14287 274890707 288677647 302962872 317812474 333039179 348176057 363568232 378961912
14280 378961912 394203967 408685596 422538214 435309038 446809258 456664567 464932440
14273 464932440 470692237 473309047 472097544 470299589 468174686 463651806 458130053 450575947
14265 450575947 441429366 430579136 417710458 404227774 389482787 374165661 358358197
$$ packed form
14318F9960302J922323K967997K603962K838642L220716L357017L264965L578480
14310I3714404L992193M158960M282919M888527M728700N133329N461835N702595
14302A32063462O405186O476405P058988P380521P909847Q322846Q827019R089530
14294A93533804J0242727J0195907J0981926J1514047J1975822J3025902J3420572
14287B74890707J3786940J4285225J4849602J5226705J5136878J5392175J5393680
14280C78961912J5242055J4481629J3852618J2770824J1500220R855309Q267873
14273D64932440N759797K616810j211503j797955k124903m522880n521753p554106
14265D50575947r146581j0850230j2868678j3482684j4744987j5317126j5807464
$$ plain form
14258 358358197 342625045 326735548 311302631 296326768 281868132 267900204 254732042
14251 254732042 241776621 229413406 218125398 209408124 198989088 188792460 179769229
14244 179769229 171701745 163581798 155881567 148625589 141905033 135329170 129519146 124035608
14236 124035608 118856324 113530088 108708354 104186733 100121062 96622635 92680603 88663015
14228 88663015 85389111 81997572 78930338 76126456 73200332 70860025 68043085 66191792
14220 66191792 64013126 61876545 59737737 57489852 55747534 53983059 52647599 50979673
14212 50979673 49572527 48004122 46328677 44994522 43940266 43303952 41962365 40393561
14204 40393561 39133231 38249272 36942386 36290912 35847196 34561458 33539040 32520230
$$ packed form
14258C58358197j5733152j5889497j5432917j4975863j4458636j3967928j3168162
14251B54732042j2955421j2363215j1288008q717274j0419036j0196628r023231
14244A79769229q067484q119947p700231p255978o720556o575863n810024n483538
14236A24035608n179284n326236m821734m521621m065671l498427l942032m017588
14228H8663015l273904l391539l067234k803882k926124k340307k816940j851293
14220F6191792k178666k136581k138808k247885j742318j764475j335460j667926
14212E0979673j407146j568405j675445j334155j054256o36314j341587j568804
14204D0393561j260330q83959j306886o51474m43716j285738j022418j018810
$$ plain form
14196 32520230 31745243 30918987 30357023 29618022 28634374 28207566 27517146 26638153 25903509
14187 25903509 25670611 24992444 24527100 24165570 23539418 22792612 22254918 21717779 21428243
14178 21428243 21139798 20708422 20019972 19860751 19148612 18787458 18810837 18326778 17845354
14169 17845354 17426294 17068185 16753063 16682641 16368476 15909302 15752327 15467211 15127898
14160 15127898 15115536 14607337 14269337 13761516 14208382 13658493 13749470 13400374 13027819 12447768
14150 12447768 12718757 12344242 12079253 12209677 11654868 11749990 11440358 11200016 10843484
14141 10843484 10933709 10924253 10520734 10353387 10358256 10126750 9762936 9930330 9882711 9819236
14131 9819236 9220226 9500311 9002902 9142152 8999053 8762745 8707249 8871715 8431091 8144738
$$ packed form
14196C2520230p74987q26256n61964p39001r83648m26808o90420q78993p34644
14187B5903509k32898o78167m65344l61530o26152p46806n37694n37139k89536
14178B1428243k88445m31376o88450j59221p12139l61154K3379m84059m81424
14169A7845354m19060l58109l15122p0422l14165m59174j56975k85116l39313
14160A5127898j2362n08199l38000n07821M46866n49889R0977l49096l72555n80051
14150A2447768K70989l74515k64989J30424n54809R5122l09632k40342l56532
14141A0843484R0225r456m03519j67347M869k31506l63814J67394m7619o3475
14131I819236n99010K80085m97409J39250j43099k36308n5496J64466m40624k86353
$$ plain form
14121 8144738 7776049 8328316 7992604 8033831 7888206 7832979 7700045 7573180 7453577 7204502
14111 7204502 7201667 7058755 7245873 6968020 7003261 6829573 6681147 6812263 6427611 6456492
14101 6456492 6543024 6138173 6195042 5989689 6227129 5700849 5864662 6012225 5690812 5800610
14091 5800610 5652882 5704764 5496088 5432440 5422527 5290466 5113849 5227891 5098872 4975223
14081 4975223 5322546 5147852 4735081 4802794 4654073 5059244 4714518 4680710 4628819 4685421
14071 4685421 4471336 4337174 4872402 4543850 4562548 4041679 4222198 4461569 4519985 4695271
14061 4695271 4384624 4488139 4528056 4469734 4219699 4248426 4152510 4201478 4076655 3957071
14051 3957071 3991945 3795296 4011604 4143263 3664233 3859086 3638516 3172246 3466673 3636429
$$ packed form
14121H144738l68689N52267l35712M1227j45625n5227j32934j26865j19603k49075
14111G204502k835j42912J87118k77853L5241j73688j48426J31116l84652K8881
14101F456492Q6532m04851N6869k05353K37440n26280J63813J47563l21413J09798
14091E800610j47728N1882k08676o3648r913j32061j76617J14042j29019j23649
14081D975223L47323j74694m12771O7713j48721M05171l44726l3808n1891N6602
14071D685421k14085j34162N35228l28552J8698n20869J80519K39371N8416J75286
14061D695271l10647J03515L9917n8322k50035K8727r5916M8968j24823j19584
14051C957071L4874j96649K16308J31659m79030J94853k20570m66270K94427J69756
$$ plain form
14041 3636429 3672829 3372547 3417070 3578407 3376555 3405294 3049769 3576917 3099316 2876505
14031 2876505 3318215 3351639 3349973 2864301 3101605 3412967 3034325 2982786 2743536 2734741
14021 2734741 3012619 2522279 2950078 2768687 2861952 2615067 2591217 2360202 2442737 2324186
14011 2324186 2555916 2509438 2479653 2327036 2268723 2393242 2216620 2361089 2108354 2579592
14001 2579592 2527020 2119135 2398074 2498452 1926764 2008684 2042301 2325239 2317317 2250154
13991 2250154 2355075 2606515 3404525 5735033 13351333 33824544 50962924 25961964
13983 25961964 13046563 8737193 6240893 4642752 4376759 3765546 3652104 2937886
13975 2937886 3112158 2920813 2829804 2744232 2693166 2801965 2666144 2402405 2155867 2366861
$$ packed form
14041C636429L6400l00282M4523J61337k01852K8739l55525N27148m77601k22811
14031B876505M41710L3424j666m85672K37304L11362l78642n1539k39250q795
14021B734741K77878m90340M27799j81391R3265k46885k3850k31015Q2535j18551
14011B324186K31730m6478k9785j52617n8313J24519j76622J44469k52735M71238
14001B579592n2572m07885K78939J00378n71688Q1920L3617K82938p922o7163
13991B250154J04921K51440P98010K330508P616300K0473211J7138380k5000960
13983B5961964j2915401m309370k496300j598141k65993o11213j13442p14218
13975B937886J74272j91345r1009q5572n1066J08799j35821k63739k46538K10994
$$ plain form
13965 2366861 2123869 2583380 2270545 2457328 2482367 2208926 2195706 2240392 2445162 2291504
13955 2291504 2166860 2370900 2341094 2319020 2036705 2017479 1778236 1712862 2105372 1963817
13945 1963817 2207396 1995333 1930340 1865646 1524322 1663092 1546722 2022677 1990202 1786538
13935 1786538 1892856 1945473 2029344 1746005 1727613 1787083 1552570 1692359 1476925 1563284
13925 1563284 1863756 1553579 1412842 1892818 1670581 1494876 1484502 1735773 1644654 1686059
13915 1686059 1835330 1640022 1640437 1305906 1610358 1552631 1710150 1578941 1419060 1683102
13905 1683102 1359475 1568463 1456271 1518192 1222297 1343601 1400425 1433165 1786823 1433281
13895 1433281 1375560 1363132 1051815 1595089 1289605 1334747 1235692 1235565 1220437 1389552 1218563
$$ packed form
13965B366861k42992M59511l12835J86783K5039k73441j3220M4686K04770j53658
13955B291504j24644K04040k9806k2074k82315j9226k39243o5374L92510j41555
13945A963817K43579k12063o4993o4694l41324J38770j16370M75955l2475k03664
13935A786538J06318N2617Q3871k83339j8392N9470k34513J39789k15434Q6359
13925A563284L00472l10177j40737M79976k22237j75705j0374K51271r1119M1405
13915A686059J49271j95308M15l34531L04452n7727J57519j31209j59881K64042
13905A683102l23627K08988j12192O1921k95895J21304N6824L2740L53658l53542
13895A433281n7721j2428l11317N43274l05484M5142r9055j27j5128J69115j70989
$$ plain form
13884 1218563 1290058 1521128 1243921 1308677 1280830 1271957 1222364 1259686 982696 1247277 1255764
13873 1255764 1142242 1376145 1540325 1321886 1256617 877842 1266211 1167304 1119721 1285312
13863 1285312 1024829 1238288 1033421 981912 1233884 982389 1071919 1347072 1106461 1141591
13853 1141591 903400 1276874 877208 818298 1254054 1086665 651861 1034958 1041045 1229835
13843 1229835 809434 796124 1278524 1137538 879446 1109412 1172536 851672 859850 766590
13833 766590 1093440 994599 951655 1250335 1159793 1106914 744562 967489 1080377 1140892
13823 1140892 1209044 1028640 813446 1003662 866225 911935 981665 1064348 790944 1058195
13813 1058195 900208 955178 1439050 882975 783705 906008 690839 815618 870317 788187
$$ packed form
13884A218563P1495K31070k77207O4756k7847q873m9593L7322k76990K64581Q487
13873A255764j13522K33903J64180k18439o5269l78775L88369r8907m7583J65591
13863A285312k60483K13459k04867n1509K51972k51495Q9530K75153k40611L5130
13853A141591k38191L73474l99666n8910M35756j67389m34804L83097O087J88790
13843A229835m20401j3310M82400j40986k58092K29966O3124l20864Q178r3260
13833G66590L26850r8841m2944K98680r0542n2879l62352K22927J12888O0515
13823A140892O8152j80404k15194J90216j37437M5710O9730Q2683k73404K67251
13813A058195j57987N4970M83872n56075r9270J22303k15169J24779N4699q2130
$$ plain form
13803 788187 605342 868963 708547 1041995 1069362 949544 717555 991542 887112 1017652
13793 1017652 562440 795146 858653 1062004 656812 664092 729133 1036770 741808 751335
13783 751335 917324 762668 732805 754714 1047297 694052 766170 694790 652776 453905
13773 453905 1072649 903263 1086432 615464 912548 860761 551415 718825 836948 1078719
13763 1078719 993440 784958 715781 846904 780900 835615 821575 835545 678716 496148
13753 496148 855171 936178 416246 709386 556667 731038 348973 592104 744346 960050
13743 960050 526134 766509 809623 801314 894540 971119 627698 368849 647588 568977 615620
13732 615620 561534 585165 569577 455337 379515 645130 643160 506611 767897 492741 444728
$$ packed form
13803G88187j82845K63621j60416L33448K7367j19818k31989K73987j04430J30540
13793A017652m55212K32706O3507K03351m05192P280O5041L07637k94962R527
13783G51335J65989j54656k9863K1909K92583l53245P2118p1380m2014j98871
13773D53905O18744j69386J83169m70968K97084n1787l09346J67410J18123K41771
13763A078719q5279k08482o9177J31123o6004N4715j4040J3970j56829j82568
13753D96148L59023Q1007D16246K93140j52719J74371C48973K43131J52242K15704
13743I60050m33916K40375M3114q309R3226P6579l43421k58849K78739p8611M6643
13732F15620n4086K3631j5588j14240p5822K65615j970j36549K61286k75156m8013
$$ plain form
13721 444728 738943 660905 658108 578282 683835 647877 350376 849042 404156 536223
13711 536223 642866 795300 749730 855929 506513 855895 656140 322630 704752 702028
13701 702028 746434 388383 819646 615533 356857 379562 644973 509974 655380 614541
13691 614541 279273 210802 481842 481827 634848 860573 289177 695616 578817 406413
13681 406413 702217 631144 398658 415528 538014 370335 560798 557252 376309 492569
13671 492569 124690 530471 386571 689621 680404 619162 417603 493734 568161 605223 387505
13660 387505 791752 656144 141043 823222 409900 592222 553617 723620 288874 363758
13650 363758 174815 655073 555607 557817 274040 437879 700705 460969 572355 489563
$$ packed form
13721D44728K94215p8038k797p9826J05553l5958k97501M98666D04156J32067
13711E36223J06643J52434m5570J06199l49416L49382j99755C22630L82122k724
13701G02028M4406l58051M31263k04113k58676K2705K65411j34999J45406m0839
13691F14541B79273o8471K71040j5J53021K25725B89177M06439j16799j72404
13681D06413K95804p1073k32486J6870J22486j67679J90463l546j80943J16260
13671D92569A24690M05781j43900L03050r217o1242k01559P6131P4427L7062k17718
13660C87505M04247j35608A41043O82179D09900J82322l8605J70003B88874P4884
13650C63758A74815M80258r9466K210B74040J63839K62826k39736J11386q2792
$$ plain form
13640 489563 345043 441977 578368 426146 628628 397492 734069 275743 18218 302268
13630 302268 516419 629073 425649 639728 217556 347774 207125 519151 527550 389125
13620 389125 497494 400369 -21162 200839 419648 603428 456550 409951 -89394 566441
13609 361558 687844 407357 339350 411077 69417 484921 551278 422484 369219 448049 118016
13597 460665 31531 169554 176215 599173 115817 345725 126367 467656 541054 586655
13587 586655 454809 185012 412029 734065 206385 498964 383825 129814 209475 531795
13577 531795 638445 371108 358992 289537 264910 444610 212367 453426 496049 235368
13566 209394 173786 470842 390138 411979 505885 140086 100296 297382 207414 384943 31214
$$ packed form
13640D89563j44520R6934J36391j52222K02482k31136L36577B75743A8218K84050
13630C02268K14151J12654k03424K14079B17556J30218j40649L12026Q399j38425
13620C89125J08369r7125b1162B00839K18809J83780j46878m6599h9394E66441
13609C61558L26286k80487o8007P1727F9417M15504O6357j28794n3265P8830A18016
13597D60665C1531J38023O661M22958A15817K29908A26367L41289P3398M5601
13587E86655j31846A85012K27017L22036B06385K92579j15139A29814P9661L22320
13577E31795J06650k67337j2116o9455k4627J79700B12367K41059M2623B35368
13566B09394l5608K97056q0704K1841R3906A40086l9790J97086q9968J77529C1214
$$ plain form
13554 506506 187580 120863 294518 72297 402431 222358 220274 313951 221253 705542 225473
13542 245574 278181 392606 241731 76582 -58622 657234 469049 374423 124505 126751 443021
13531 443021 102879 559716 506369 334490 169748 346889 252170 309587 386306 297601
13521 297601 618154 470953 268812 361193 189978 337299 305358 -178896 371214 265481
13511 265481 435845 306714 510322 395390 478665 254125 214434 510915 -81766 325217
13500 490976 172233 649742 94195 166124 536786 465876 349361 368206 399990 310865 139207
13488 164296 140380 435886 153037 441272 173914 313586 70256 -60265 209203 103772
13477 270243 332609 356310 460785 235378 180323 229277 162957 232997 123556 128736 162026
$$ packed form
13554E06506A87580o6717J73655G2297L30134j80073k084R3677r2698M84289B25473
13542B45574L2607J14425j50875G6582e8622F57234j88185r4626A24505K246L16270
13531D43021A02879M56837n3347j71879j64742J77141r4719N7417P6719q8705
13521B97601L20553j47201k02141R2381j71215J47321l1941a78896C71214j05733
13511B65481J70364j29131K03608j14932Q3275k24540l9691K96481h1766C25217
13500D90976A72233M77509I4195P1929L70662p0910j16515J8845L1784q9125A39207
13488A64296k3916K95506A53037K88235A73914J39672G0256f0265B09203A03772
13477B70243O2366K3701J04475k25407n5055M8954o6320P0040j09441N180L3290
$$ plain form
13466 162026 153382 92775 307593 276120 315070 323088 313466 485567 511941 410767 421606
13455 421606 188635 382943 176282 236142 35009 500033 209393 -147752 37381 90430
13445 90430 59290 95664 115890 110555 213664 304563 91210 150555 329603 147336 -45606
13433 326445 542142 275857 476893 567470 30504 -83833 270641 234998 -82176 257599
13422 389254 142177 202547 98798 210045 168734 358467 99034 399196 330983 391922 609464
13411 609464 229901 344894 308332 325619 387607 166901 185714 -61685 329570 276189 138825
13400 138825 427795 205034 415100 468879 365741 430880 87600 511512 -151727 65050
13389 272019 370671 546955 259962 382666 208016 276763 -21492 601375 349245 -36247
$$ packed form
13466A62026q644o0607K14818l1473L8950Q018r622J72101K6374j01174J0839
13455D21606A88635J94308A76282N9860C5009M65024B09393a47752C7381N3049
13445I0430l1140L6374K0226n335J03109R0899I1210N9345J79048A47336d5606
13433C26445K15697k66285K01036R0577C0504h3833B70641l5643h2176B57599
13422C89254A42177O0370I8798J11247m1311J89733I9034L00162o8213O0939K17542
13411F09464B29901J14993l6562J7287O1988A66901J8813f1685C29570n3381j37364
13400A38825K88970B05034K10066N3779j03138O5139H7600M23912a51727F5050
13389B72019R8652J76284B59962J22704j74650O8747b1492F01375k52130c6247
$$ plain form
13378 118482 -10335 407744 367883 329801 40269 99428 248306 133964 293095 251906 142436
13367 142436 100525 63324 297409 460869 133287 464493 487668 156428 319971 574637
13357 574637 292307 648409 161082 102724 466914 438981 423335 263680 469723 -274 245235
13345 116731 22087 640816 -10007 215853 394858 473352 236570 275354 415961 317135
13335 317135 284280 279770 344910 104967 494610 231147 -50523 83831 294183 248308 -287980
13323 292544 40064 101082 251341 639011 357662 -47606 207304 74725 725676 325878
13312 354545 51020 209830 77868 523480 357879 135407 319641 266194 75240 54665
13302 54665 310832 303484 48610 187341 -113429 437291 52301 16835 263349 267717 74580
$$ packed form
13378A18482a0335D07744l9861l8082D0269N9159J48878j14342J59131m1189j09470
13367A42436m1911l7201K34085J63460A33287L31206K3175A56428J63543K54666
13357E74637k82330L56102A61082n8358L64190k7933j5646j59655K06043b74B45235
13345A16731B2087O18729a0007B15853J79005P8494B36570L8784J40607r8826
13335C17135l2855m510O5140A04967L89643B31147e0523H3831K10352m5875b87980
13323B92544D0064O1018J50259L87670k81349d7606B07304G4725O50951C25878
13312C54545E1020J58810G7868M45612j65601A35407J84234n3447G5240k0575
13302E4665K56167p348D8610J38731a13429D37291E2301A6835K46514M368G4580
$$ plain form
13290 171171 47207 127733 373862 -79662 -316936 -35751 -94605 -16733 601985 216971 207232
13279 207232 -133779 465025 44467 53892 -7382 262584 237305 306922 383850 -57166 -75283
13268 -75283 142339 89472 293974 273310 -95134 -90181 191037 51092 68373 -61677 68888
13256 363207 -88069 122861 -84925 256537 220347 35251 242479 59825 56906 150340 125646
13245 125646 280901 -16538 636061 126896 171485 349843 124282 -10171 91081 -229571
13234 18004 -14669 164467 367752 38368 244415 322170 523871 -115090 302241 231741
13224 231741 40774 -12298 -74583 4518 -264533 127893 184296 311092 -58772 323794 101469
13212 204913 204861 205661 202067 61477 28479 322234 205720 -186829 126982 147622 118742 256326
$$ packed form
13290A71171D7207Q0526K46129g9662k37274c5751n8854a6733F01985B16971r739
13279B07232a33779D65025D4467R425g382B62584k5279O9617P6928e7166j8117
13268g5283A42339n2867K04502k0664i5134M953A91037E1092J7281f1677F8888
13256C63207h8069A22861h4925B56537l6190C5251K07228E9825k919R3434k4694
13245A25646J55255a6538F36061A26896M4589J78358A24282a0171I1081b29571
13234A8004a4669A64467K03285C8368K06047P7755K01701a15090C02241p0500
13224B31741D0774a2298o2285D518b64533A27893N6403J26796e8772C23794A01469
13212B04913n2Q00l594F1477B8479K93755j16514a86829A26982K0640k8880J37584
$$ plain form
13200 256326 116652 342705 -23263 220207 -235909 281263 169836 -48425 36223 263422
13190 263422 -208532 247600 145360 4874 -22485 -67669 42769 110959 244719 97614 324749
13179 324749 -12938 265123 200829 -148233 211125 285445 61019 212343 -19025 -133667
13169 -133667 248102 229913 270159 223527 85782 139207 -69194 -207967 232458 223067 -111841
13157 8261 159952 73768 -115914 285566 -68151 98793 15974 -142200 172818 49269 188174
13146 188174 95776 -90269 -76893 -307056 -85239 161609 -16706 85119 81638 40940 43902
13135 43902 7538 -171994 51634 153564 25206 -141534 -90644 102554 -46398 240152 146269
13124 146269 255873 -111352 -127578 445748 -152596 27705 225219 375107 214394 69914
$$ packed form
13200B56326A16652K26053b3263B20207b35909B81263j11427d8425C6223K27199
13190B63422b08532B47600j02240D874b2485m5184D2769O8190J33760I7614K27135
13179C24749a2938B65123o4294a48233B11125P4320F1019J51324a9025j14642
13169a33667B48102j8189M0246m6632H5782N3425f9194j38773B32458r391a11841
13157H261J51691G3768a15914B85566f8151I8793A5974a42200A72818D9269J38905
13146A88174r2398i0269J3376k30163h5239A61609a6706H5119l481m0698K962
13135D3902G538a71994E1634J01930B5206a41534N0890A02554d6398B40152r3883
13124A46269J09604a11352j6226D45748a52596B7705J97514J49888j60713F9914
$$ plain form
13113 -110867 89676 -104327 253431 81327 -110372 264938 -361952 81304 83627 89498 58739
13102 58739 56772 -26720 77651 113265 -157691 -248363 -36247 402361 146221 97357 325398
13091 325398 -88073 -119626 -114960 181300 113234 36120 404261 254962 141944 -60219 275855
13079 89955 95127 138840 -230177 43020 190564 91098 114825 -100695 -11247 170694 -42227
13067 -82247 239685 76560 444877 -51735 -193132 272497 212555 186266 148663 -120275 379482
13055 78843 -34559 -193606 190012 -102689 2127 -105676 180155 15864 204669 42032 -55526
13043 -181603 444329 124292 452996 -120676 205970 55942 197862 -55010 47975 96879
13033 96879 -74122 239064 64453 473228 188162 56123 144163 199585 208980 145197 372316
$$ packed form
13113a10867H9676a04327B53431H1327a10372B64938c61952H1304K323N871l0759
13102E8739j967b6720G7651L5614a57691r0672c6247D02361A46221m8864K28041
13091C25398h8073l1553M666A81300o8066C6120L68141j49299j13018f0219B75855
13079H9955N172M3713b30177D3020J47544I1098K3727a00695a1247A70694d2227
13067h2247B39685G6560L68317e1735j41397B72497n9942k6289l7603a20275C79482
13055G8843c4559j59047A90012a02689B127a05676A80155A5864J88805D2032e5526
13043a81603D44329A24292L28704a20676B05970E5942J41920e5010D7975M8904
13033I6879g4122B39064F4453M08775A88162E6123Q8040N5422R395o3783K27119
$$ plain form
13022 372316 -24499 46685 -66264 124820 222708 309990 311119 -119544 418159 116523 -372629
13010 80763 -199758 -38358 134372 45287 287446 187159 -107890 273079 365257 81404
12999 -42177 113919 183786 -83028 -81826 229752 186337 -96779 -157350 186397 66664 122534
12988 122534 -29225 50140 -36046 65386 12749 272812 288856 -73637 124134 -10900 -79406
12977 -79406 -81570 1080 207190 26536 -114986 -25365 120232 164969 54442 -2515 -188474
12966 -188474 -158466 101500 -118487 117472 243120 238700 -168232 132400 -11282 11438
12955 25050 40802 -225705 -158117 149841 -328696 -189742 3415 -12676 168536 -186761 337067
12943 16212 507496 -201005 -101988 -27862 -201847 225902 164531 103310 43113 -12108 17851
$$ packed form
13022C72316b4499D6685f6264A24820R7888Q7282J129a19544D18159A16523c72629
13010H0763a99758c8358A34372D5287K42159j00287a07890B73079R2178H1404
12999d2177A13919O9867h3028J202B29752m3415i6779o0571A86397F6664N5870
12988A22534b9225E0140c6046F5386A2749K60063J6044g3637A24134a0900o8506
12977g9406k164A080K06110B6536a14986b5365A20232M4737E4442b515j85959
12966a88474L0008A01500a18487A17472J25648m420a68232A32400a1282A1438
12955B5050J5752b25705O7588A49841c28696J38954C415a2676A68536a86761C37067
12943A6212M91284b01005R9017b7862j73985B25902o1371o1221D3113a2108A7851
$$ plain form
12931 415476 3656 -52968 -28108 -135258 240170 1186 17857 -103899 298156 -72083 148247
12919 75612 46773 7741 -26420 77710 -74164 95260 165211 68628 -97537 117778 15753 60400
12907 60400 504830 62970 -62412 17140 161144 57541 -47165 -167284 -65495 -48274 165950
12895 241940 -44747 -236032 61627 194783 203906 80182 172566 250242 247413 187381 -2087 -164391
12883 -164391 252699 -225975 60503 83076 27996 131039 148331 90493 76974 266292 -97798
12871 -71450 297720 -11630 132669 -151804 87770 91213 344056 -81308 76333 -111561 -152210
12860 -152210 -144302 -56361 -77351 30477 107265 5815 -135411 -189931 17889 -73534 207237
12848 56380 244826 161672 34808 -144619 -286422 -199534 -125827 -42071 38391 -404095 192951
$$ packed form
12931D15476C656e2968K4860j07150B40170A186J6671a03899B98156g2083A48247
12919G5612k8839G741b6420G7710g4164I5260O9951F8628i7537A17778A5753M4647
12907F0400M44430F2970f2412A7140J44004E7541d7165j20119f5495J7221A65950
12895B41940d4747j91285F1627J33156R123H0182R2384P7676k829o0032b087j62304
12883a64391B52699b25975F0503K2573B7996J03043J7292n7838j3519J89318i7798
12871g1450B97720a1630A32669a51804H7770L443K52843h1308G6333a11561m0649
12860a52210P908e6361k0990C0477P6788E815a35411n4520A7889g3534B07237
12848E6380J88446q3154C4808a44619j41803Q6888P3707d2071C8391d04095A92951
$$ plain form
12836 -26166 -96186 -162563 180849 -156586 -112085 308347 73718 -273624 49168 189791 -201336
12824 235760 -74735 -115384 -63824 178468 -141682 -118713 58650 -235679 -10005 114926 124569
12813 124569 165827 -9836 -36034 190179 -212335 -118031 -33770 -6949 189205 -8483 -275317
12802 -275317 -2399 168359 -136566 125563 -173443 178362 -239006 -115696 199581 -49056
12791 92827 -99341 289655 -26089 6877 -21713 51611 240163 149801 -103812 -96209 -7508 -105109
12779 -105109 -11471 -40003 169201 13574 -15759 83528 107382 -91746 -279097 -61429 -201278
12768 -201278 -4250 -118300 423135 98109 24997 13609 91216 -26150 44928 228479 -222945
12756 52910 -302373 -294353 -79732 -177380 228719 -97985 -338137 121427 -77532 -248940 32226
$$ packed form
12836b6166p0020o6377A80849a56586M4501C08347G3718b73624D9168J40623b01336
12824B35760g4735m0649N1560A78468a41682K2969E8650b35679a0005A14926R643
12813A24569M1258i836k6198A90179b12335R4304c3770f949A89205h483k66834
12802b75317b399A68359a36566A25563a73443A78362b39006a15696A99581d9056
12791I2827i9341B89655b6089F877b1713E1611J88552r0362a03812P603g508r7601
12779a05109a1471k8532A69201A3574a5759H3528K3854i1746j87351f1429j39849
12768b01278d250j14050D23135I8109B4997j1388P7607b6150D4928J83551b22945
12756E2910c02373Q020g9732r7648B28719i7985k40152A21427g7532j71408C2226
$$ plain form
12744 -92850 -225011 5967 35641 170080 -60884 -44166 385845 304406 83924 219718 137004
12733 137004 307828 -47548 213065 140545 54959 35878 -89160 -24721 262223 66799 220832
12722 220832 170207 152799 -452911 -4565 268337 -22978 -46603 88966 54650 -107518 -51296
12710 -133163 363034 226346 230086 135193 406323 212863 145627 252961 185922 341969
12700 341969 374040 -68033 -173382 208417 108653 554585 44858 361241 -149250 -166459
12690 -166459 -41104 174143 89305 -124749 323126 143103 82962 83150 119602 48208 65359
12679 65359 92256 100017 -133851 83056 263688 230320 204691 361378 -214589 65507 -94684
12667 169860 322383 -167724 6115 356009 274133 154214 2783 386154 -127602 100277
$$ packed form
12744i2850j32161E967K9674J34439f0884J6718C85845q1439H3924J35794q2714
12733A37004J70824d7548B13065p2520E4959j9081h9160b4721B62223F6799J54033
12722B20832n0625j7408d52911d565B68337b2978k3625H8966l4316a07518e1296
12710a33163C63034j36688L740r4893K71130j93460o7236J07334o7039J56047
12700C41969L2071f8033j05349B08417r9764M45932D4858L16383a49250j7209
12690a66459d1104A74143q4838a24749C23126A43103o0141J88L6452D8208J7151
12679F5359K6897P761a33851H3056J80632l3368k5629J56687b14589F5507i4684
12667A69860J52523a67724F115L49894q1876j19919B783L83371a27602A00277
$$ plain form
12656 82025 450413 -127796 -221638 410178 362949 -27951 3160 101836 128046 -92397 218437
12644 18193 -46420 -129625 -101174 -44574 149732 65253 267346 157765 334530 323146 -93628
12632 248536 -165519 162769 -179668 32758 21478 301338 80839 83269 243987 -180109
12621 7511 89544 -10929 236814 48745 -231775 332554 -143126 -243142 74982 32884 -184761
12609 340312 -158793 293781 147475 171487 81412 72743 506004 72301 106597 49940 126348
12598 126348 -257670 202853 -215826 -119381 39228 69040 60131 -216823 168073 147749 18319
12586 60145 164995 90055 163526 53879 -180945 84703 39452 258334 -68035 -290492 53027
12574 160449 276036 45047 33807 67122 -211167 102959 99518 138834 33626 8461 -496738
$$ packed form
12656H2025L68388a27796r3842D10178m7229b7951C160R8676K6210i2397B18437
12644A8193d6420q3205K8451d4574A49732F5253K02093j09581J76765j1384i3628
12632B48536a65519A62769a79668C2758j1280K79860H0839K430J60718a80109
12621G511Q2033a0929B36814D8745b31775C32554a43126j00016G4982C2884a84761
12609C40312a58793B93781j46306K4012H1412q669M33261G2301L4296D9940P6408
12598A26348b57670B02853b15826R6445C9228K9812q909b16823A68073k0324A8319
12586F0145J04850p4940P3471E3879a80945H4703C9452K18882f8035k22457E3027
12574A60449J15587D5047j1240L3315b11167A02959l441L9316C3626H461d96738
$$ plain form
12562 66646 -94181 195609 45997 43315 -188822 -146268 -51631 -99392 698 24665 -237036 89232
12549 279073 -379255 -167263 -82068 -26912 102304 392459 253481 -140297 273020 -292370
12538 131141 -64874 34933 -55535 -78393 -60757 -200084 -141427 17202 33495 -73246 -343832
12527 -343832 145031 363 -27464 499496 -55232 132063 -787 180266 467432 100649 -293980
12515 -276764 262582 -133569 -306654 105882 115144 -96808 57059 251934 57060 28698 52080
12504 52080 -84863 -246135 1429 31969 -87900 405507 450987 80974 -4684 217344 96532
12492 161534 -101160 50195 -78870 270640 -310394 -40526 -66389 143285 -328 84067 -5614
12480 146946 86771 417054 292785 351504 -89717 176562 -219880 148470 29914 -79931
$$ packed form
12562F6646i4181A95609D5997k682a88822M2554e1631m7761F98K3967b37036H9232
12549B79073c79255a67263h2068b6912A02304K90155j38978a40297B73020b92370
12538A31141f4874C4933e5535k2858J7636j39327N8657A7202J6293g3246k70586
12527c43832A45031C63b7464D99496e5232A32063g87A80266K87166A00649b93980
12515b76764B62582a33569j73085A05882R262i6808E7059J94875E7060k8362K3382
12504E2080h4863j61272A429L0540h7900D05507M5480H0974d684B17344I6532
12492A61534a01160E0195g8870B70640c10394d0526k5863A43285c28H4067e614
12480A46946o0175L30283j24269N8719h9717A76562b19880A48470B9914g9931
$$ plain form
12469 44662 -303290 -94009 151323 437138 236043 170571 -9812 -31723 121530 54781 -105435
12457 -210919 -96279 -60899 159875 -120102 161284 -60059 326514 273528 244485 -35551 -14965
12445 -71632 -164328 -228739 -80263 -67680 -133767 109361 -221173 -24712 -62601 329 11247 241025
12433 241025 -297547 10717 -29698 89010 -29960 -200554 -202617 -15809 -164991 3974 148297
12422 148297 76451 182275 202656 -73312 89826 -30 175478 -115153 -68950 -207033 -268056
12411 -268056 -85312 426557 -167410 318969 191062 -199416 114634 173119 -124201 20861
12400 5075 55369 76694 24428 186042 -248201 1399 -129713 -23306 207664 -38465 78493
12388 145574 350329 170220 159472 -100287 82217 278676 143743 159170 -119930 -254442
$$ packed form
12469D4662c03290i4009A51323K85815k01095o5472i812k1911A21530E4781a05435
12457b10919i6279L5380A59875a20102A61284f0059C26514n2986k9043c5551a4965
12445g1632r2696o4411h0263J2583o6087A09361b21173b4712l7889C29J0918K29778
12433B41025b97547A0717b9698H9010b9960j70594k063a5809j49182C974J44323
12422A48297p1846J05824K0381g3312H9826c0A75478a15153M6203j38083o1023
12411b68056h5312D26557a67410C18969j27907a99416A14634N8485a24201B0861
12400E075N0294K1325B4428J61614b48201A399a29713b3306B07664c8465G8493
12388A45574K04755A70220j0748a00287H2217J96459j34933J5427a19930j34512
$$ plain form
12378 -254442 208376 37853 -65263 -137954 132354 64641 -52298 46734 60761 154815 -15099
12366 -223342 -70977 -4684 -107535 176093 -353052 -81201 387221 384233 -140021 337332 11783
12354 -169713 -62345 -98045 268899 -56506 33020 56019 -25171 -37624 196255 -202200 -67148
12342 93660 238033 68407 -124744 26297 -66224 -26067 316704 -70559 136653 -100882 -85
12330 254536 53883 47432 138028 153564 -150881 120222 131051 273033 196218 88750 382019
12319 382019 316864 226272 119579 81564 -2890 -30677 125801 55763 5541 38324 298893
12308 298893 251399 257897 52855 -73917 -17457 361218 -25497 -72416 -132874 47126 121404
12297 121404 159654 -284615 227786 -245805 79583 26717 282657 -34730 113773 -23041
$$ packed form
12378b54442B08376C7853f5263p2691A32354F4641e2298D6734J4027R4054a5099
12366b23342g0977d684j02851A76093c53052h1201C87221k988a40021C37332A1783
12354a69713f2345l5700B68899e6506C3020K2999b5171j2453A96255b02200f7148
12342I3660J44373F8407a24744B6297f6224b6067C16704g0559A36653a00882h5
12330B54536E3883o451R0596J5536a50881A20222J0829J41982p6815H8750K93269
12319C82019o5155r0592j06693l8015b890k7787A25801E5763E541L2783K60569
12308B98893m7494O498E2855g3917a7457C61218b5497m6919o0458D7126P4278
12297A21404L8250b84615B27786b45805G9583B6717K55940c4730A13773b3041
$$ plain form
12286 293105 164558 24359 -162150 -893 471333 -105178 262997 430245 47285 392689
12276 392689 28608 169470 -46162 421463 7929 2313 -22818 372308 197053 511349 226083
12264 11443 120457 154218 -24820 317461 545046 -59499 154612 91405 267344 208905 13492
12252 206918 230151 181630 143652 344445 389145 179442 43658 390774 226017 264424 310656
12241 310656 -88377 -18899 -86578 -260973 233051 -31468 431513 181398 381675 218250
12231 218250 -14969 237110 -94148 248345 364894 423151 -108109 171610 30487 42750
12221 42750 341831 54219 710641 501218 237048 149484 162299 157443 325012 -56465 211816
12209 141889 360313 390343 338172 33628 39104 -43438 -29704 145182 256677 209228 551450
$$ packed form
12286B93105j28547B4359a62150h93D71333a05178B62997J67248D7285L45404
12276C92689B8608J40862d6162D21463G929B313b2818C72308j75255L14296B26083
12264A1443J09014L3761b4820C17461K27585e9499A54612o3207J75939n8439A3492
12252B06918K3233m8521l7978K00793M4700A79442D3658L47116j64757L8407M6232
12241C10656h8377a8899o7679j74395B33051c1468D31513A81398K00277j63425
12231B18250a4969B37110i4148B48345J16549N8257a08109A71610C0487J2263
12221D2750K99081E4219O56422k09423B37048q7564J2815m856J67569e6465B11816
12209A41889K18424L0030n2171C3628N476d3438J3734A45182J11495m7449L42222
$$ plain form
12198 551450 152535 174349 134017 187387 362622 218590 157235 516141 305321 74602
12187 29484 464210 410479 -197026 250980 308200 213417 232734 275805 162085 222704 102719
12175 287685 119675 259690 247159 286219 417228 -111299 482123 290563 421743 115078
12164 286629 373424 235108 456418 319479 418467 34357 318165 92049 87934 77841 125250
12153 125250 94403 511373 134597 163133 -1426 63450 166063 -177891 91502 -62841 298006
12141 108103 -135293 50295 -232019 53183 5696 408951 127178 137 173945 -128609 -157784
12130 -157784 80791 71454 212428 147903 236734 247135 422608 133472 -201262 92537 118586
12119 118586 -9027 -46467 433832 47396 161746 226744 41722 178087 212388 143744 163871
$$ packed form
12198E51450A52535K1814m0332N3370J75235j44032o1355L58906k10820G4602
12187B9484M34726n3731a97026B50980N7220r4783J9317M3071j13720O0619A02719
12175B87685A19675J40015j2531L9060J31009a11299D82123j91560J31180A15078
12164B86629Q6795j38316K21310j36939R8988C4357K83808I2049m115j0093M7409
12153A25250l0847M16970A34597K8536a426F3450J02613a77891I1502f2841B98006
12141A08103a35293E0295b32019E3183E696M03255A27178A37J73808a28609k9175
12130a57784H0791r337J40974o4525Q8831J0401J75473A33472b01262I2537K6049
12119A18586i027l7440D33832D7396J14350O4998D1722J36365L4301o8644K0127
$$ plain form
12108 163871 76178 202651 164808 -84676 -71660 287447 80686 -213575 131846 -168214
12097 -43422 212924 1646 69143 50145 603644 656741 -230218 156842 185981 -139915 67380
12085 101775 17258 -77209 44459 249799 70401 -138065 432858 -116049 245064 116090
12074 145009 333799 -136876 188224 -12784 244966 301361 3571 95840 -83741 132755 65523
12062 160278 357903 -65805 160775 -50628 97737 5299 52508 -141324 -29137 7016 -309950
12050 -856 4187 36958 280782 180979 158265 -43784 -43839 -92283 30471 -62151 38029 177883
12038 177883 -282577 78214 -208793 -52645 63850 -129301 -59226 -272515 -48685 437340
12027 77560 196830 -40858 2024 -106865 500410 558462 157794 204050 93700 149631 166682
$$ packed form
12108A63871G6178J26473l7843h4676J3016B87447H0686b13575A31846a68214
12097d3422B12924A646O7497j8998N53499N3097b30218A56842K9139a39915F7380
12085A01775A7258g7209D4459K05340G0401a38065D32858a16049B45064A16090
12074A45009J88790a36876A88224a2784B44966N6395C571R2269h3741A32755F5523
12062A60278J97625f5805A60775e0628I7737E299M7209a41324b9137G016c09950
12050h56D187L2771K43824r9803k2714d3784n5m8444C0471f2151C8029J39854
12038A77883b82577G8214b08793e2645F3850a29301e9226k13289d8685D37340
12027G7560J19270d0858B024a06865E00410N8052A57794M6256I3700N5931J7051
$$ plain form
12016 166682 166489 -206548 361593 -161938 104537 -111492 8595 38108 -95528 60754 -24678
12004 125025 16104 -127572 -120687 121215 54215 159374 -41067 19109 -268998 2363 130899
11993 130899 11215 -5983 -182658 -366866 127154 110594 -215708 -367626 446848 100123
11982 19792 -71004 -38749 -207155 11498 50042 -194657 110669 356871 267790 -5272 -171826
11971 -171826 195549 -115816 63809 256685 -143327 123971 -83724 -139965 -57764 -158563
11961 -158563 -430359 15284 -161460 -67867 284679 -301783 -154195 14411 -87581 294417
11950 -243100 14153 74468 -91934 142404 148840 227431 59603 1975 166066 385966 96642
11938 85568 -175582 199192 -235911 -50064 134316 -34314 83019 349546 -100576 342119
$$ packed form
12016A66682j93b06548C61593a61938A04537a11492H595K9513i5528F0754b4678
12004A25025A6104a27572O885A21215E4215J05159d1067A9109b68998B363J28536
11993A30899A1215e983j76675j84208A27154j6560b15708j51918D46848A00123
11982A9792g1004L2255j68406A1498L8544a94657A10669K46202q9081e272j66554
11971a71826A95549a15816F3809J92876a43327A23971h3724n6241e7764j00799
11961a58563k71796A5284a61460f7867B84679c01783J47588A4411h7581B94417
11950b43100A4153O0315i1934A42404O436P8591E9603A975J64091K19900I6642
11938H5568a75582A99192b35911e0064A34316c4314H3019K66527a00576C42119
$$ plain form
11927 242929 161609 194800 -81876 -70107 110434 81141 -67125 -58668 83298 336352 -23415
11915 -133363 -158296 -207925 22908 181450 -268854 250163 -108937 44343 58359 -166787
11904 -147931 -213670 -116312 82479 215400 -246860 -122622 66541 210381 -370673 -134618
11893 -131268 34343 -19654 13325 48251 -125438 -167983 97482 75751 50974 89359 -60921
11881 53576 -225709 -7330 -153608 -22642 -155041 54589 -141473 -290160 102981 269419
11871 269419 -149092 -326115 -199427 314632 -231086 -257019 -45046 -89935 108890 -270415
11860 -192412 -173851 349918 -332862 -83726 183639 82824 267718 -315571 73908 33855
11849 -134560 30465 33847 -365184 -116762 49070 -14848 -12852 155414 106012 -183779 -178267
$$ packed form
11927B42929q1320L3191h1876J1769A10434k9293f7125Q457H3298K53054b3415
11915a33363k4933m9629B2908J58542b68854B50163a08937D4343J4016a66787
11904a47931o5739R7358H2479J32921b46860a22622F6541J43840c70673a34618
11893a31268C4343a9654A3325L4926a25438m2545I7482k1731k4777L8385f0921
11881E3576b25709g330j46278b2642j32399E4589a41473j48687A02981J66438
11871B69419a49092j77023J26688C14632b31086k5933d5046m4889A08890b70415
11860a92412J8561C49918c32862h3726A83639H2824J84894c15571G3908C3855
11849a34560C0465L382c65184a16762D9070a4848J996A55414m9402a83779N512
$$ plain form
11838 -178267 -217369 46701 -6662 -16124 176740 -182552 22887 -375146 153909 102390 145046
11827 145046 33075 -272986 211414 15501 -323356 -495935 149025 184993 -44979 9138 -26362
11815 -187730 -243724 -173536 -279420 -65363 -53508 -101795 30034 47623 36079 -71412 268115
11803 -76327 264295 32969 -120438 77031 -418100 -157746 148761 -163211 -103419 -136221
11793 -136221 41398 -52175 112116 237103 45593 -107297 -61014 -79857 202717 35203 -507261
11781 -151722 198686 277505 60527 34605 124305 -215658 -173702 57802 145261 -172088 -113667
11770 -113667 129630 -57517 -37104 92344 -68258 50500 -151864 105154 258563 -107681
11759 -184230 317612 -89153 329856 30844 210716 -121192 21821 76822 -177094 249865
$$ packed form
11838a78267l9102D6701f662r462A76740a82552B2887c75146A53909n1519M2656
11827A45046C3075b72986B11414A5501c23356j72579A49025L5968d4979I138b6362
11815a87730n5994P0188j05884f5363J1855m8287C0034J7589j1544g1412B68115
11803g6327B64295C2969a20438G7031d18100a57746A48761a63211N9792l2802
11793a36221D1398e2175A12116J24987D5593a07297M6283j8843B02717C5203e07261
11781a51722A98686P8819F0527k5922Q9700b15658M1956E7802Q7459a72088N8421
11770a13667A29630e7517K0413I2344f8258E0500a51864A05154J53409a07681
11759a84230C17612h9153C29856C0844J79872a21192B1821N5001a77094B49865
$$ plain form
11748 134383 -289065 -38435 -253324 -41682 27637 -99680 -172176 417426 -188571 -58160 86025
11736 -313644 -423032 -57526 -46745 -169506 253419 201095 62910 -48717 -137907 235830 -45221
11724 227280 70768 -85022 71943 -57882 -339505 -138115 444909 -168654 119614 298360
11714 298360 211631 -164335 -310237 -117115 -240345 333729 -39977 -20905 42644 31522
11704 31522 -40602 47653 190962 30235 184147 54447 96919 -163195 307907 19491 -43245
11692 -114104 -274725 114568 255446 134917 125598 -36510 -258804 302945 -326369 -55588
11681 -239076 -23059 148990 -3226 286554 66169 430383 3010 183330 135589 146892 191987
11670 191987 27598 35419 145738 112971 235781 -31431 -6753 -110062 -32491 113785 129201
$$ packed form
11748A34383b89065c8435k14889d1682B7637i9680p2496D17426a88571e8160H6025
11736c13644j09388e7526J0781j22761B53419n2324F2910d8717q9190B35830d5221
11724B27280G0768h5022G1943e7882k81623a38115D44909a68654A19614J78746
11714B98360q6729a64335j45902a17115j23230C33729c9977J9072D2644j1122
11704C1522d0602D7653J43309C0235J53912E4447M2472a63195C07907A9491d3245
11692a14104j60621A14568J40878j20529r319c6510k22294C02945c26369e5588
11681b39076b3059A48990c226B86554F6169L64214C010J80320m7741J1303M5095
11670A91987B7598P821J10319l2767J22810c1431f753j03309c2491A13785J5416
$$ plain form
11659 129201 -246216 -54542 -155338 45072 -2874 167207 81222 -44983 42239 533140 267519
11648 267519 -72740 21226 -184515 -27403 -167414 -99889 306659 82068 -257165 -35233 -316973
11637 -316973 -168800 -54501 260417 -62956 52884 451639 -157807 100468 -124983 -104619
11627 -104619 -2100 -7488 137409 10590 -84986 -15734 -172253 74282 -90782 208123 -175591
11615 -246950 2367 107318 -326699 88195 164990 372261 316288 -90363 -331543 -6841 -9348
11604 -9348 81260 -261272 -70515 -49984 189689 220333 173317 182849 63472 305384 196446
11593 196446 25897 -52263 189718 145354 156301 123679 26801 -25293 -306673 78185 109684
11582 109684 93170 155054 109102 -47499 115988 51677 -175332 -403381 155378 -1566 175148
$$ packed form
11659A29201b46216e4542j00796D5072b874A67207H1222d4983D2239M90901k65621
11648B67519g2740B1226a84515b7403j40011O7525C06659H2068b57165c5233k81740
11637c16973J48173e4501B60417f2956E2884L98755a57807A00468a24983K0364
11627a04619b100n388A37409A0590h4986a5734j56519G4282i0782B08123a75591
11615b46950B367J04951c26699H8195P6795K07271n5973i0363k41180f841k507
11604i348H1260b61272g0515K0531A89689L0644m7016R532F3472K41912j08938
11593A96446B5897e2263A89718m4364J0947l2622B6801b5293k81380G8185L1499
11582A09684j6514O1884m5952d7499A15988E1677a75332k28049A55378a566A75148
$$ plain form
11570 243226 33041 18567 -7830 212339 132951 278435 -80074 331155 33822 -77023 -129921
11559 -129921 259204 -116220 -118615 -295988 -112887 -42590 -470488 161375 -107651 277178
11548 -129813 -91483 -35234 49192 69597 122440 39310 -60931 -163224 -116597 133864 -29242
11536 101644 -170657 3588 53147 105508 -192978 236365 54145 31771 104796 -4535 12610
11524 -201499 570967 172114 107240 188664 -152650 16803 -20553 231037 -109191 366650
11513 71035 261393 427880 568604 -63914 -113149 411579 51562 294587 243642 62201 109637
11502 109637 141912 385028 -80995 190467 192922 103173 134968 224591 147453 63708 214738
11491 214738 -92927 -71933 -28894 17246 266165 287166 254641 101101 314006 111149 255366
$$ packed form
11570B43226C3041j4474g830B12339p9388J45484h0074C31155C3822g7023n2898
11559a29921B59204a16220k395j77373a12887d2590m27898A61375a07651B77178
11548a29813L8330c5234D9192K0405N2843C9310f0931j02293M6627A33864b9242
11536A01644a70657C588M9559N2361a92978B36365E4145k2374P3025d535A2610
11524b01499E70967A72114o4874Q1424a52650A6803b0553B31037a09191C66650
11513G1035J90358J66487J40724f3914m9235D11579E1562K43025n0945F2201M7436
11502A09637L2275K43116h0995A90467K455q9749L1795Q9623p7138F3708J51030
11491B14738i2927K0994b8894A7246K48919K1001l2525A01101K12905A11149J44217
$$ plain form
11480 255366 174408 -145884 -211610 279834 3501 -126119 249665 157334 64141 371512 475218
11469 475218 169903 261387 197649 -92688 236601 298646 165383 565736 39682 66417 70081
11458 70081 555513 -24869 48311 64825 -83267 -58659 16797 169221 11127 152447 220803
11447 220803 147815 101248 -76230 -53712 57857 171142 66646 273769 195182 34123 -149085
11435 47807 246498 139790 207930 -234126 -76423 158739 21040 67270 47623 -20221 83517
11423 158169 149086 -18713 -171069 222672 -52851 299330 -5834 269529 3646 18963 40397
11412 40397 -5199 -114486 354812 -223903 -180933 328338 -56483 287819 139934 150381 -92036
11400 105170 -175866 148801 89046 166922 -109779 115313 -165078 203636 287963 -152987
$$ packed form
11480B55366q0958a45884o5726B79834C501a26119B49665r2331F4141L07371J03706
11469D75218A69903R1484o3738i2688B36601O2045j33263M00353C9682K6735L664
11458G0081M85432b4869D8311J6514h3267K4608A6797J52424A1127J41320O8356
11447B20803p2988m6567g6230K2518E7857J13285F6646K07123p8587C4123a49085
11435D7807J98691j06708O8140b34126g6423A58739B1040M6230j9647b0221H3517
11423A58169r083a8713j52356B22672e2851B99330e834B69529C646J5317K1434
11412D0397e199j09287C54812b23903M2970C28338e6483B87819A39934J0447i2036
11400A05170a75866A48801n9755P7876a09779A15313a65078B03636Q4327a52987
$$ plain form
11389 -129668 13376 82368 23700 -36084 13973 -138692 -122802 83003 11693 -148038 -60580
11377 48098 -9944 59694 229880 -292931 -211155 -10984 -427214 145029 155410 -43938 -2933
11365 66822 196165 30950 -222843 -184059 -303364 -150589 73596 -136301 -132678 72294 -92989
11353 -25862 -153023 5494 -88896 -87158 -250183 394696 -328131 131070 -176860 31135 -289952
11341 -233277 126029 224252 -230546 282752 -175889 199663 -344262 10716 -41014 -34962
11331 -34962 -132396 65905 39372 -77013 -395659 230454 149352 -97931 -52684 -85007 86497
11319 -121168 -62828 21722 32314 147175 -328148 -41959 -60400 -157472 -292627 84873 -3259
11307 -308532 52118 -83370 140773 32023 -123558 -136186 -28598 303507 -121666 116684
$$ packed form
11389a29668A3376O8992B3700c6084A3973a38692J5890H3003A1693a48038f0580
11377D8098i944E9694J70186b92931Q1776a0984m16230A45029J0381d3938b933
11365F6822J29343C0950b22843L8784j19305a50589G3596a36301L623G2294i2989
11353b5862j27161E494h8896J738j63025C94696c28131A31070a76860C1135b89952
11341b33277A26029R8223b30546B82752a75889A99663c44262A0716d1014O052
11331c4962r7434F5905k6533g7013l18646B30454q1102i7931M5247l2323H6497
11319a21168N8340B1722J0592J14861c28148d1959j8441r7072j35155H4873c259
11307c08532E2118h3370A40773C2023a23558j2628b8598C03507a21666A16684
$$ plain form
11296 105819 3072 33890 -394558 -1840 -40906 30780 46113 19543 -229328 151498 83416
11285 83416 -68972 -296720 106072 252491 -6571 -44 -290463 -203963 49079 -72461 198336
11273 -60794 -343707 208280 77516 -259553 7763 -138409 -53194 -160290 156430 -75522 -67196
11262 -67196 -25285 -39039 83553 116082 -59577 83774 -111584 72614 -291271 77005 91255
11251 91255 82189 100529 287946 129686 -32715 72522 105424 -42153 -146950 50038 21100
11239 -214833 -17623 549556 82273 79114 -6851 -165790 -41296 10586 139695 59840 72404
11228 72404 -46188 -63672 -319959 193543 -385041 -314141 -177052 -14401 -43746 234242 125634
11217 125634 -382877 81874 -323347 -185607 286512 -16393 51308 -91736 -317953 -76790
$$ packed form
11296A05819C072L0818c94558a840l9066C0780J5333A9543b29328A51498o8082
11285H3416f8972k27748A06072J46419f571d4k90419Q6500D9079g2461A98336
11273f0794k82913B08280G7516b59553G763a38409e3194j07096A56430g5522Q326
11262f7196b5285j3754H3553L2529e9577H3774a11584G2614b91271G7005J4250
11251I1255r066J8340J87417A29686c2715G2522L2902d2153j04797E0038B1100
11239b14833a7623E49556H2273l159f851j58939d1296A0586J29109E9840J2564
11228G2404d6188j7484k56287A93543c85041P0900J37089a4401k9345B34242j08608
11217A25634c82877H1874c23347J37740B86512a6393E1308i1736k26217g6790
$$ plain form
11206 -396463 -23123 183728 296 250098 122979 146389 69620 -484458 -51406 133083 -234517
11194 -4872 -338082 105023 60743 -202235 40645 -216022 64612 -140146 -432142 -332306 -56810
11182 21434 -167537 12500 -265037 -243991 -65768 4963 -93131 76445 -268065 -279752 -294644
11171 -294644 76919 162182 -240342 182279 -12190 -185255 -228746 57821 -395601 -390249 19067
11159 -209561 -10402 47747 -1020 -80372 -253103 57702 90965 173135 216198 17133 85244
11148 85244 197139 -143734 90128 -295598 7061 -73660 57578 233094 -192694 -57592 -193752
11137 -193752 96454 113277 -114249 83431 -30313 -132056 38991 183133 93331 -198841 86572
11125 24598 125531 41901 146554 331588 -25561 153869 347179 -165847 191739 -115727
$$ packed form
11206c96463b3123A83728B96K49802A22979K3410F9620d84458e1406A33083b34517
11194d872l33210A05023m4280b02235D0645b16022F4612a40146k91996R9836e6810
11182B1434a67537A2500b65037K1046f5768D963i3131G6445b68065j1687j4892
11171b94644G6919Q5263b40342A82279a2190j73065m3491E7821c95601N352A9067
11159b09561a0402D7747a020p9352j72731E7702L3263Q2170M3063A7133O8111
11148H5244J11895a43734I0128b95598G061g3660E7578J75516a92694e7592j36160
11137a93752I6454J6823a14249H3431c0313j01743C8991J44142q9802a98841H6572
11125B4598J00933D1901J04653J85034b5561A53869J93310a65847A91739a15727
$$ plain form
11114 -40569 240513 -3421 91862 -393527 -26146 71643 -291556 -125799 -74212 271949 167693
11103 167693 -137408 106654 -101683 174933 -24172 71074 169012 284442 157362 212089
11093 212089 104275 285273 420885 372405 122123 160428 -162233 348643 212646 151809
11083 151809 141293 187467 35461 160514 296227 104623 585557 350532 279644 275700 87371
11071 238593 250113 521388 70035 475126 370050 451687 281649 348476 523793 348252
11061 348252 525271 699734 572467 577089 669495 834545 490874 695665 939264 593690
11051 593690 734931 596718 932871 872963 912278 916247 899126 957155 1250629 947795 1438525
11040 1438525 1279595 807821 939596 1064119 1009570 1177366 928036 934934 1024057 803937
$$ packed form
11114d0569B40513c421I1862c93527b6146G1643b91556a25799N1587B71949j04256
11103A67693a37408A06654a01683A74933b4172G1074R7938J15430j27080N4727
11093B12089A04275J80998J35612m8480A22123L8305a62233C48643j35997o0837
11083A51809j0516M6174C5461J25053J35713A04623M80934k35025p0888l944H7371
11071B38593J1520K71275G0035M05091j05076Q1637j70038O6827J75317j75541
11061C48252J77019J74463j27267M622R2406J65050l43671K04791K43599l45574
11051E93690J41241j38213L36153n9908L9315L969j7121N8029K93474l02834M90730
11040A438525j58930m71774J31775J24523n4549J67796k49330O898Q9123k20120
$$ plain form
11030 803937 673813 706017 560172 1094501 535991 996295 860628 758082 704284 819032
11020 819032 1040000 1050141 997786 892737 524920 724914 475833 932960 797056 751616
11010 751616 706481 584624 386069 697721 788013 913821 870093 888088 692883 761839
11000 761839 625781 913922 922989 1068099 667275 1060478 704788 763555 781913 804785
10990 804785 871421 348444 1169110 1170905 972126 896586 1087668 899989 1236634 1263830
10980 1263830 1498716 1428814 1351793 1428124 1563649 1881150 1608458 1914774 1999557 2517237
10970 2517237 2619008 3046584 3477244 3538382 3825341 3537185 3499470 3156280 2977178 2650235
10960 2650235 2323524 1853948 2018668 1823586 1839100 1828765 1893092 1750780 1860834 1811968
$$ packed form
11030H03937j30124L2204j45845N34329E35991M60304j35667j02546n3798J14748
11020H19032K20968J0141n2355j05049l67817J99994k49081M57127j35904m5440
11010G51616m5135j21857j98555L11652R0292J25808m3728J7995j95205O8956
11000G61839j36058K88141R067J45110m00824L93203l55690N8767J8358K2872
10990H04785O6636C48444Q20666J795j98779p5540J91082j87679L36645K7196
10980A263830K34886o9902p7021P6331J35525L17501k72692L06316Q4783N17680
10970B517237J01771M27576M30660O1138K86959k88156l7715l43190j79102l26943
10960B650235l26711m69576J64720j95082J5514j0335O4327j42312J10054m8866
$$ plain form
10950 1811968 1729689 1239506 1265026 1276266 680937 542734 410250 357610 228435 331607
10940 331607 173544 46267 348427 456829 251399 319593 61671 130991 42510 2305 97738
10929 97738 -244399 1973 -39506 -9493 272319 90782 -8503 316744 -36211 262128 30100
10917 251358 -38172 -26616 1288 -110607 -138834 1397 -14861 142644 -288652 88471 38135
10905 151168 -66106 134451 -125704 -226591 92454 64887 -132427 -179659 -144968 14007 -281165
10893 87808 -240508 146192 -230185 54861 -8031 -283160 64984 -56310 89595 127526 212997
10882 212997 25552 -391147 -98408 -13627 353684 53950 -271030 -531071 -41499 -216550
10872 -216550 -69374 -10696 308617 -20216 -133101 150545 -31786 -84280 15437 -66863 107423
$$ packed form
10950A811968q2279m90183K5520J1240n95329j38203j32484n2640j29175J03172
10940C31607j58063D6267L02160J08402k05430O8194F1671O9320D2510B305R5433
10929I7738b44399A973c9506i493B72319I0782h503C16744c6211B62128C0100
10917B51358c8172J1556A288a10607k8227A397a4861A42644b88652H8471C8135
10905A51168f6106A34451a25704j00887I2454k7567a32427m7232L4691A4007b81165
10893H7808b40508A46192b30185E4861h031k75129F4984e6310H9595L7931Q5471
10882B12997B5552c91147i8408a3627C53684E3950b71030k60041d1499j75051
10872b16550f9374a0696C08617b0216j12885A50545c1786n2494A5437f6863A07423
$$ plain form
10860 -125385 -233303 27808 125471 -335403 323313 13693 18574 12270 -96839 118324 -85743
10848 62417 60942 110534 -2926 -263321 173704 32765 -100971 30864 14293 -130908 14042
10836 119480 -207083 123533 23346 259194 -180705 -76003 -270796 -5684 -63181 -1714 65102
10824 47257 66608 83670 -7780 -216473 -228405 -185440 -348675 -81170 140647 133350 -73202
10812 -105482 107880 68959 48786 180969 317732 -252230 -228826 -44727 202352 65822
10801 17725 -107730 92374 32719 -285603 -184812 -409006 -422547 -64110 27874 -147666 -37025
10789 -307791 98694 -171035 -122340 15273 125307 -306086 -222183 -76031 71352 126129 -28825
10777 -362847 -22361 -228453 -56954 -45399 -67896 192046 99957 -146579 49636 114700 -407148
$$ packed form
10860a25385j07918B7808R7663c35403C23313A3693M881o304i6839A18324h5743
10848F2417j475M9592b926k60395A73704C2765a00971C0864A4293a30908A4042
10836A19480b07083A23533B3346K35848a80705g6003j94793e684n7497a714F5102
10824D7257J9351J7062g780k08693j1932M2965j63235h1170A40647p297g3202
10812a05482A07880l8921k0173J32183J36763b52230K3404d4727B02352F5822
10801A7725a07730I2374C2719b85603J00791k24194j3541f4110B7874a47666c7025
10789c07791I8694a71035M8695A5273J10034c06086Q3903g6031G1352N4777b8825
10777c62847b2361k06092e6954J1555k2497A92046r2089a46579D9636O5064d07148
$$ plain form
10765 -72175 -212690 112674 -348089 247983 -150506 22241 -7400 176586 41947 -51188 34859
10753 -134465 -140912 -85472 24295 2499 100463 99308 375499 32835 -461021 16305 149647
10742 149647 -146117 -221672 9497 -70889 -170934 -14907 154184 -260374 -134779 -65947 -209251
10731 -209251 117349 -143376 -189865 -164506 -228046 -278165 50379 23535 -5202 261877 30076
10719 -100292 -106822 -166290 69531 -363559 39466 13221 -401655 41059 -119262 130122 -54768
10707 258031 -206487 -200937 -99093 -98699 -271465 157517 155328 -3486 -43879 65073 234374 -61584
10694 -143962 112740 -121211 -2316 -326091 -216208 -30260 221683 -90292 -28216 81008 334354
10683 334354 118039 -186050 -182967 -13992 -36864 -235868 95922 -273033 -91880 -95040 12846
$$ packed form
10765g2175j40515A12674c48089B47983a50506B2241g400A76586D1947e1188C4859
10753a34465o447N5440B4295B499R7964j155K76191C2835d61021A6305J33342
10742A49647a46117p5555I497g0889j00045a4907A54184b60374J25595f5947j43304
10731b09251A17349a43376m6489K5359o3540n0119E0379B3535e202B61877C0076
10719a00292o530n9468F9531c63559C9466A3221d01655D1059a19262A30122e4768
10707B58031b06487N550i9093L94j72766A57517k189c486m0393F5073J69301f1584
10694a43962A12740a21211b316l23775J09883c0260B21683i0292b8216H1008K53346
10683C34354A18039a86050L083a3992k2872j99004I5922b73033i1880l160A2846
$$ plain form
10671 -180219 -226782 -115198 -189266 -220978 -542553 21818 64198 -288097 231678 -198284
10660 136513 -59902 -172482 -12913 -226554 223475 174535 -17878 44140 373032 130802
10649 -10030 -85704 -101562 12034 -237263 -4843 -363075 10143 79965 26740 -230507 -217514
10638 -217514 94686 -16490 -200367 -35056 -105177 -89049 -80367 -178377 -415151 -120945 -193375
10627 -193375 858 -114395 -19277 102000 -149568 -200058 218164 -53402 1393 168870 -267933
10615 -331428 192934 6391 -278054 -79248 -160212 221269 -156722 -424192 5763 -168551 -97493
10604 -97493 -65202 81141 273421 11430 -170927 -156691 -312357 -86518 -257665 -222703 213740
10592 56732 -121575 -40558 81726 -111834 -209186 -194336 172741 151264 -37409 6001 115444
$$ packed form
10671a80219m6563J11584p4068l1712l21575B1818M2380b88097B31678a98284
10660A36513e9902j12580a2913k13641B23475m8940a7878D4140L28892A30802
10649a0030p5674j5858A2034b37263d843l58232A0143O9822B6740b30507J2993
10638b17514I4686a6490j83877c5056p0121J6128Q682r8010k36774a20945p2430
10627a93375H58a14395a9277A02000a49568n0490B18164e3402A393J67477b67933
10615c31428A92934F391b78054g9248q0964B21269a56722k67470E763a68551P1058
10604i7493L2291H1141J92280A1430a70927J4236j55666h6518j71147L4962B13740
10592E6732a21575d0558H1726a11834r7352J4850A72741k1477c7409F001J09443
$$ plain form
10581 115444 360305 191044 -10593 -132582 228299 -379516 -449663 159492 -76993 110577
10570 -108620 -178979 -324360 169136 -224183 -315840 -176169 -60424 -225310 -185875 -77243
10559 -70232 229809 269062 46925 -57065 -77636 308964 326872 -209366 -73495 -87530 -64150
10548 -64150 -1416 235378 229780 88855 84965 -118219 -98645 27646 39848 -134233 -8719 -61104
10536 -61104 -139937 17781 209888 130317 -357405 100697 114346 -262151 203859 39392 54628
10525 54628 54476 -134449 232295 -88051 151302 18530 -189216 206254 -6925 1640 522598
10514 522598 -23780 59269 -242507 -257116 139075 66515 109702 72830 -513230 -266177 186159
10502 -73740 18976 -201985 -4280 264062 -138327 5146 -19898 137723 39411 -112877 35486
$$ packed form
10581A15444K44861j69261a0593j21989B28299c79516p0147A59492g6993A10577
10570a08620p0359j45381A69136b24183r1657J39671f0424j64886L9435g7243
10559g0232B29809L9253D6925e7065k0571C08964J7908b09366g3495j4035K3380
10548f4150a416B35378n598H8855l890a18219J9574B7646J2202a34233h719n2385
10536f1104p8833A7781J92107p9571c57405A00697J3649b62151B03859C9392J5236
10525E4628j52a34449B32295h8051A51302A8530a89216B06254f925A640N20958
10514E22598b3780E9269b42507j4609A39075F6515M3187l6872e13230K47053A86159
10502g3740A8976b01985d280B64062a38327E146a9898A37723C9411a12877C5486
$$ plain form
10490 -168368 -125906 -261499 -54087 282626 -191207 121959 -173214 -12919 -38742 156737
10479 9892 -252971 -56573 364762 167326 1236 489061 473287 449079 473375 -45751 377858
10467 284085 51830 -197050 222910 27108 88442 -122779 104408 128490 -71594 -96851 -90693
10456 -90693 -200515 -141295 -281215 -190496 160411 127696 215083 -149104 -84655 2081 106763
10445 106763 -227403 47508 18058 -156792 132494 69570 -264257 127765 -162739 -24664
10434 29888 -492877 154702 -120600 -248910 185450 -135420 52779 96457 -35666 10102
10423 407549 -187265 -119140 275313 -138314 -148273 -359500 37008 -70357 -79189 152694 -249507
10411 149197 -165248 -270226 70165 37455 -34895 -120863 16582 139433 -65533 5289 -166011
$$ packed form
10490a68368M2462j35593e4087B82626a91207A21959a73214a2919k5823A56737
10479I892b52971e6573C64762A67326A236M87825j5774k4208K4296d5751C77858
10467B84085E1830a97050B22910B7108O1334a22779A04408K4082g1594k5257O158
10456i0693j09822N9220j39920R0719A60411l2715Q7387a49104O4449B081J04682
10445A06763b27403D7508A8058a56792A32494o2924b64257A27765a62739b4664
10434B9888d92877A54702a20600j28310A85450a35420E2779M3678c5666A0102
10423D07549a87265O8125B75313a38314r959k11227C7008g0357q832A52694b49507
10411A49197a65248j04978G0165l2710c4895q5968A6582J22851f5533E289a66011
$$ plain form
10399 281939 84405 79598 39060 -62671 148666 -131819 133530 95517 109843 63289 -85028
10387 619829 -1994 59144 369426 144311 249408 -66478 -271804 92098 400396 -309040
10376 374331 157780 -60781 5799 132391 277836 188217 200136 351961 205324 325011
10366 325011 371544 684418 451914 351739 769053 260509 500725 611541 341870 109540
10355 274427 3660 291811 -49692 -55423 20861 701332 745426 750898 491925 442281 519039
10344 519039 478365 236743 24351 197238 384730 304006 181399 156018 376266 208349
10334 208349 347362 -4692 200887 100404 130906 -13642 -10543 113534 75036 -88297 205300
10322 123917 114600 -24059 126487 -18189 395223 449076 396704 -107714 223743 159367 -337128
$$ packed form
10399B81939H4405m807C9060f2671A48666a31819A33530l8013J4326m6554h5028
10387F19829a994E9144L10282A44311J05097f6478k05326I2098L08298c09040
10376C74331A57780f0781E799J26592J45445q9619J1919J51825j46637J19687
10366C25011M6533L12874k32504j00175M17314B60509K40216J10816k69671A09540
10355B74427C660K88151d9692n731B0861O80471M4094N472k58973m9644P6758
10344E19039m0674B36743B4351J72887J87492q0724j22607k5381K20248j67917
10334B08349J39013d692B00887A00404L0502a3642L099A13534l8498h8297B05300
10322A23917r317b4059A26487a8189C95223N3853n2372a07714B23743o4376c37128
$$ plain form
10310 -182923 166514 74635 125104 -225164 -401 -26535 -304449 -149868 19390 16227 156043
10299 156043 -22831 -184475 -123662 64838 -25314 416909 -145763 64641 78861 190853 -31040
10287 144565 16069 93950 -199321 6788 -48323 -26291 147163 41009 -171527 -120066 -130575
10276 -130575 521 -303919 -460779 45908 -115981 -152141 -220821 143650 13891 115694 -122276
10264 74525 -23584 168652 3300 216100 -120990 304945 -34311 103664 76549 341773 243917
10253 243917 332385 209758 373970 410608 239927 -111815 -72242 275303 -153823 131755
10242 -249305 130215 -270263 -40870 72068 210705 283200 -157060 407667 -3519 -341360
10232 -341360 -177835 83481 -53737 -304610 -62986 253558 -237848 -90965 -30418 -129062 208318
$$ packed form
10310a82923A66514G4635N0469b25164d01k6134k77914a49868A9390l163J39816
10299A56043b2831j61644O0813F4838b5314D16909a45763F4641J4220J11992c1040
10287A44565A6069P7881a99321F788d8323K2032A47163D1009a71527N1461j0509
10276a30575E21c03919j56860D5908a15981l6160o8680A43650A3891J01803a22276
10264G4525b3584A68652C300K12800a20990C04945c4311A03664k7115K65224r7856
10253B43917Q8468j22627J64212L6638j70681a11815L9573B75303a53823A31755
10242b49305A30215b70263d0870G2068J38637P2495a57060D07667c519l37841
10232c41360J63525H3481e3737k50873f2986B53558b37848i0965c0418r8644B08318
$$ plain form
10220 242312 -202447 -144376 -156315 10367 108617 109900 225163 -148499 217936 294116 -381734
10208 -153307 -140166 -9175 49966 -264597 -336833 -267126 -28896 -66516 -97070 -89156 -84168 100829
10195 117071 15260 -357315 63815 -218408 -38295 -254812 131938 -86707 -285052 -11991
10184 -24201 -6463 -225146 2995 -250496 80172 222544 76953 147778 -292576 -247501 50346
10172 237579 -337702 195670 -102228 -212881 -85475 145270 103481 -104636 16108 -411670
10161 -23982 -100193 162959 -272585 140630 -231853 -84105 -325398 49368 -101417 -58099
10151 -58099 -253383 20250 148934 -163178 213430 -42058 -426355 60498 -16570 118688
10140 -172465 -195541 -35753 -179664 51357 112322 -100621 -19653 -429140 37935 -201183 -360430
$$ packed form
10220B42312b02447N8071j1939A0367R8250J283J15263a48499B17936P6180c81734
10208a53307J3141i175D9966b64597p2236O9707b8896l7620l0554P914M988A00829
10195A17071A5260c57315F3815b18408c8295k16517A31938h6707j98345a1991
10184b4201f463k18683B995b50496H0172J42372G6953P0825b92576M5075E0346
10172B37579c37702A95670a02228j10653h5475A45270m1789a04636A6108d11670
10161b3982p6211A62959b72585A40630b31853h4105k41293D9368a01417M3318
10151e8099j95284B0250J28684a63178B13430d2058l84297F0498a6570A18688
10140a72465k3076c5753j43911E1357O0965a00621a9653m09487C7935b01183j59247
$$ plain form
10129 -360430 113085 105499 -215335 -49052 13506 -258438 -126212 -293752 227077 -180605
10118 -213313 84206 254171 -54896 -311672 -276487 32636 -139202 -46366 -280882 62088 -8329
10106 -284436 -105809 -146370 -82564 167979 162466 -145555 -184793 152116 -176764 -110300 123891
10094 -131354 304742 -15992 410471 -49834 -108472 -419074 -309984 59586 -150866 285232
10083 98925 -84865 -14594 -153636 172428 -229101 -172111 -197147 63703 -42196 17468 -280770
10071 10960 170783 76376 -115205 -367725 -49254 -341564 27626 -123917 -204409 34823 -93558
10059 -72004 -183655 -251207 32806 284980 -288843 -72219 -395101 -20548 -131981 36370 207376
10048 207376 40792 -41657 -193217 -210071 -150428 233774 -139702 13782 -40236 -341523 -26630
$$ packed form
10129c60430A13085p586b15335d9052A3506b58438a26212j67540B27077a80605
10118b13313H4206J69965e4896k56776L5185C2636a39202d6366k34516F2088h329
10106b84436a05809m0561O3806A67979n513a45555l9238A52116a76764O6464A23891
10094a31354C04742a5992D10471d9834n8638l10602J09090E9586a50866B85232
10083I8925h4865a4594j39042A72428b29101N6990k5036F3703d2196A7468b80770
10071A0960J59823G6376a15205k52520d9254k92310B7626a23917q0492C4823i3558
10059g2004j11651o7552C2806K52174b88843g2219l22882b0548j11433C6370J71006
10048B07376D0792d1657j51560j6854N9643B33774a39702A3782d0236l01287b6630
$$ plain form
10036 870 137061 126183 -147299 94007 -42652 51137 -411853 107935 -59804 -285662 219217
10024 314260 -286964 -174163 -244077 19942 -150259 -44235 -328199 -326869 -61347 118945 123785
10013 123785 30662 -140520 112504 -270290 18373 -195530 -55556 -346797 -4137 1702 -192719
10001 -238149 -262697 59821 29172 228574 6454 199458 58892 -104633 -18919 -276287 93139
9989 -224548 -69528 -90150 -78266 80194 -311525 -159923 -47853 -39933 -445837 8766 -366732
9977 234728 -123161 -53875 -4861 -351549 31328 -39904 38877 -176740 35613 -97253 -136785
9966 -136785 38130 357157 -249335 -23601 -74339 -202154 -56067 -295397 -523538 -94754 -86748
9955 -86748 -231020 -55868 -11267 -137897 15845 -6873 -114138 138534 47725 -335799 -77915
$$ packed form
10036H70J36191j0878a47299I4007d2652E1137d11853A07935e9804k25858B19217
10024C14260b86964J12801o9914A9942a50259d4235k83964J330f1347A18945M840
10013A23785C0662a40520A12504b70290A8373a95530e5556k91241d137A702a92719
10001b38149k4548E9821B9172J99402F454J93004E8892a04633a8919k57368I3139
9989b24548f9528k0622J1884H0194c11525J51602d7853P920m05904H766c66732
9977B34728a23161e3875d861l46688C1328c9904C8877a76740C5613i7253l9532
9966a36785C8130L19027b49335b3601n0738j27815e6067k39330k28141i4754Q006
9955h6748j44272e5868a1267j26630A5845f873j07265A38534D7725c35799g7915
$$ plain form
9943 197035 -113160 68062 30969 -56433 -25332 11370 -287179 -14883 83270 180857 -147307
9931 77296 284764 -205743 113070 -583632 89453 -355991 -203982 -93701 -448060 250966
9920 126061 -161550 -7840 313625 18109 -173531 146607 -63004 144329 130856 -305220 115447
9908 -62230 -233619 -320870 1451 -287225 -56049 2474 140642 -99822 27667 -298318 -141616
9896 72609 26534 159968 -115689 -76967 8180 -16085 -31186 -12516 106434 -233640 -53977
9884 31826 -76525 180476 48281 7849 -212075 -95037 -315331 -64101 112436 -47243 -110973
9873 -110973 152726 -70149 276430 -323425 205142 87847 -100705 287991 -40581 115063
9862 97536 -248621 333940 -70260 -182966 143384 -89058 -56057 -109903 81376 156666 -45683
$$ packed form
9943A97035a13160F8062C0969e6433b5332A1370b87179a4883H3270R7587a47307
9931G7296K07468b05743A13070e83632H9453c55991J52009i3701l54359B50966
9920A26061a61550g840C13625A8109a73531A46607f3004A44329j3473c05220A15447
9908f2230j71389q7251A451b87225e6049B474J38168i9822B7667b98318a41616
9896G2609B6534J33434a15689L8722H180a6085j5101a2516A06434b33640e3977
9884C1826g6525A80476D8281G849b12075i5037k20294f4101A12436d7243o3730
9873a10973A52726g0149B76430c23425B05142H7847a00705B87991d0581A15063
9862I7536b48621C33940g0260j12706A43384h9058L3001n3846H1376P5290d5683
$$ plain form
9850 -163020 -160764 308788 30500 -251765 59795 34839 -431353 18835 -49880 -303747 95880
9838 -162512 -164832 -325675 146266 -206042 -169912 -73011 138930 90 -446565 -84163 -234578
9827 -234578 -10198 -44644 147508 346277 -59898 -304977 -27590 -55631 -224830 -156219 187322
9815 -148953 -243504 58803 -297456 -165122 -204803 -279957 21406 -132119 -28814 -90310 269956
9803 -132857 -230290 -38868 -234205 5870 -110774 -57498 59053 -198149 91176 -180021 -67554
9791 -122244 -43520 144222 -429188 -107957 31142 -12690 -332172 29417 55022 -307998 126385
9779 54561 -280619 -135333 -330471 45609 -196597 207282 -39086 -67605 73078 2556 241460
9768 241460 -49281 14860 -271275 -86497 298396 -97084 14574 -290538 269312 -200732 -158974
$$ packed form
9850a63020K256C08788C0500b51765E9795k4956d31353A8835d9880k53867I5880
9838a62512k320j60843A46266b06042L6130g3011A38930I0d46565h4163j50415
9827b34578a0198l4446A47508J98769e9898k45079b7590k8041j69199O8611A87322
9815a48953r4551E8803b97456J32334l9681p5154B1406a32119b8814o1496B69956
9803a32857r7433c8868j95337E870a10774N3276E9053a98149I1176a80021f7554
9791a22244d3520A44222d29188a07957C1142a2690l19482B9417K5605c07998A26385
9779E4561b80619a35333j95138D5609a96597B07282c9086k8519G3078B556K38904
9768B41460d9281A4860b71275h6497B98396i7084A4574b90538B69312b00732M1758
$$ plain form
9757 -158974 -31776 -114955 -472802 37173 -218970 -23046 56344 69314 -68018 6848 -241573
9745 -80448 -50560 155580 -18574 17397 437 -34774 105722 -306985 198310 184327 -255170
9733 -416048 -401370 22105 21249 429413 -122638 -73645 -52101 -22216 181147 -138253 -263077
9722 -263077 -2882 -218582 -185943 -96563 2134 -178171 -124633 139764 -257961 73488 -302292
9710 -234886 257645 374603 -242072 -143877 -163259 -42128 -157312 -119361 58469 -79010 70358
9698 65064 96329 -101367 -196928 -167881 56480 -115434 -54005 249149 206136 82992 -14429
9686 -184929 3202 158925 82472 122793 78902 -198531 -62785 -227173 -246786 -361327 -199005
9675 -199005 -115283 -318133 -101834 -61457 123810 -185232 -9612 -71383 -286517 -73247 -40594
$$ packed form
9757a58974c1776q3179l57847C7173b18970b3046E6344J2970f8018F848b41573
9745h0448K9888A55580a8574A7397D37c4774A05722c06985A98310j3983b55170
9733d16048J4678B2105q56M08164a22638M8993K1544b2216A81147a38253j24824
9722b63077b882k15700L2639Q9380B134a78171N3538A39764b57961G3488c02292
9710b34886B57645J16958b42072R8195j9382d2128j15184L7951E8469g9010G0358
9698F5064L1265a01367r5561K9047E6480a15434e4005B49149m3013H2992a4429
9686a84929C202J55723p6453M0321m3891a98531f2785j64388j9613j14541J62322
9675a99005Q3722k02850a01834M0377A23810a85232i612o1771k15134g3247L2653
$$ plain form
9664 -40594 388111 -380069 145220 -229159 529404 12239 189454 -45904 101051 -132815
9653 -281265 161572 94850 77940 180183 -412241 -210719 -138722 -171245 -62550 -79621 -317070
9642 -317070 -407079 -128337 -119258 -284889 -73355 -73569 107161 -214429 -73623 -137833 -78807
9631 -78807 -1500 272221 -491675 -94651 -452029 -307329 -6129 33747 -74026 -195120 -184135
9620 -184135 -64896 -310386 -203159 151485 -158947 -41231 24475 10392 -126680 51238 -109540
9608 -370792 -335105 -280048 301120 154965 -65134 77991 5969 12695 1649 15459 -309855 -75276
9595 -203758 109598 182137 -83096 143457 -221633 127744 115318 112617 171820 -304745 -26903
9583 -440942 -226241 167438 -83826 -245102 -127978 65983 -141681 103535 -236291 -2638
$$ packed form
9664d0594C88111c80069A45220b29159E29404A2239J77215d5904A01051a32815
9653b81265A61572o6722j6910J02243d12241K01522P1997l2523f2550j7071k37449
9642c17070r0009a28337R079j65631g3355k14A07161b14429g3623o4210N9026
9631g8807a500B72221d91675i4651l57378J44700f129C3747g4026j21094J0985
9620a84135f4896k45490J07227A51485a58947d1231B4475A0392a26680E1238a09540
9608c70792L5687N5057C01120j46155f5134G7991E969O726A649J3810c09855g5276
9595b03758A09598P2539h3096A43457b21633A27744j2426k701N9203c04745b6903
9583d40942K14701A67438h3826j61276J17124F5983a41681A03535b36291b638
$$ plain form
9572 113221 6650 -340376 63418 -35861 -88589 -421001 -288986 -313655 -224218 -222992 -132864
9561 -132864 -163690 -244941 -200418 154848 -9347 -250643 -67591 -309787 26667 -144895 -80981
9550 -80981 -77201 -151818 137830 -175597 272405 321749 -6760 22349 -91275 -33942 -182254
9539 -182254 -39141 173829 107889 -170922 -224372 -36044 -247269 -114130 -98320 69162 57936
9528 57936 -283911 -274922 -7500 68664 -172741 -168902 30189 138269 50554 67883 12217 -320251
9515 139759 -348958 43213 99462 -83710 -93049 378925 138016 -72013 -91825 -310737 -16813
9503 -86234 122061 338161 -133577 185512 -40760 288201 -366110 4828 -308820 -31161 35081
9491 -5036 -124012 -183359 -82907 -134076 199290 145906 -338715 288393 11747 139993 -248485
$$ packed form
9572A13221F650c40376F3418c5861n2728l32412J32015k4669Q9437J226R0128
9561a32864l0826q1251M4523A54848i347k41296f7591k42196B6667a44895O3914
9550h0981L780p4617A37830a75597B72405M9344f760B2349i1275c3942j48312
9539a82254c9141A73829o5940a70922n3450c6044k11225a14130J5810F9162j1226
9528E7936b83911Q989g500F8664a72741L839C0189J08080E0554J7329A2217c20251
9515A39759c48958D3213N6249h3710r339C78925A38016g2013j9812k18912a6813
9503h6234A22061K16100a33577A85512d0760B88201c66110D828c08820c1161C5081
9491e036j18976n9347h2907n1169A99290n3384c38715B88393A1747J28246b48485
$$ plain form
9479 105342 -40022 214516 411585 62483 -28784 4981 -8758 -10672 -126122 -178250 -172121 -234082
9467 -234082 50856 -152897 -119928 -305295 60095 -41537 -60416 224782 -275415 -16287 -271945
9456 -271945 287213 170119 30779 -19628 49244 -370281 -10195 -13299 -212416 -408148 -191431
9444 -37442 -114607 107245 -23256 -7685 120000 -143546 223680 -263198 185009 -285026 -190508
9433 -190508 -197988 -211386 -339019 -147575 -101261 -187742 -80657 -187652 -307509 -50030 98240
9421 -79203 -231612 136182 65806 -96926 4630 -1734 25755 52233 -263023 102891 -147080
9409 49297 251931 -303732 107519 254971 -175372 12541 108791 -79344 -40312 -88795 -280053
9398 -280053 -18465 -417739 38433 -191043 51025 22756 -204278 140209 -206323 95780 -88191
$$ packed form
9479A05342d0022B14516J97069F2483b8784D981h758j914j15450n2128O129o1961
9467b34082E0856a52897L2969j85367F0095d1537j8879B24782b75415a6287k55658
9456b71945B87213j17094C0779a9628D9244c70281a0195l104j99117j95732a91431
9444c7442p7165A07245b3256g685A20000a43546B23680b63198A85009b85026R4518
9433a90508p480j3398j27633a47575M6314q6481h0657j06995j19857e0030I8240
9421g9203j52409A36182F5806i6926D630a734B5755K6478b63023A02891a47080
9409D9297K02634c03732A07519J47452a75372A2541R6250g9344L9032m8483j91258
9398b80053a8465l99274C8433a91043E1025B2756b04278A40209b06323I5780h8191
$$ plain form
9386 208843 39905 -331981 -89478 60180 61152 62194 71512 281109 61429 -268917 -221566 -123484
9374 -123484 311820 23586 171459 -238843 128660 -341823 -332782 34661 44106 -70863 -20803
9362 -79912 -591089 -72878 128747 -126943 -254543 -27597 136739 79501 70007 20607 211444
9351 211444 -196856 -59062 -158110 -234273 55293 -167098 158887 45610 -245470 -89207 -390973
9340 -390973 -130793 -355556 55083 -70813 181573 -99983 21911 16582 -115325 -6763 21766
9328 -153648 -186040 218855 -209781 -340527 84048 -66429 282512 -117002 -37349 -20166 -33964
9317 -33964 195661 -151582 -207170 -165027 180325 -32796 -494594 -330854 -235986 -48179 -139518
9306 -139518 51 -200886 -276630 14690 -211963 106993 -169260 -39128 -177614 -80378 -136677
$$ packed form
9386B08843C9905c31981h9478F0180R72J042R318K09597F1429b68917M7351R8082
9374a23484C11820B3586J47873b38843A28660c41823R041C4661R445g0863b0803
9362g9912n11177g2878A28747a26943j27600b7597A36739n7238r494B0607J90837
9351B11444a96856e9062r9048p6163E5293a67098A58887D5610b45470h9207l01766
9340c90973a30793k24763E5083g0813A81573i9983B1911n329a15325f763B1766
9328a53648l2392B18855b09781j30746H4048f6429B82512a17002c7349J7183j3798
9317c3964A95661a51582n5588M2143A80325c2796m61798J63740R4868d8179r1339
9306a39518E1b00886p5744A4690b11963A06993a69260c9128j38486h0378n6299
$$ plain form
9295 -136677 -69040 -121777 42770 -205296 -120539 31937 -232468 -140173 -144727 -98341 142850
9283 -161292 -84983 55384 72595 293807 137624 29736 -14996 -288514 -172540 -110432 295259
9271 -184243 -117657 -193012 160504 -22249 -229613 1089 -141813 -170895 -179661 239531 -152441
9259 -178799 231348 23479 -399239 -35994 -278393 -3750 129786 -197112 -97370 -250275 -172326
9248 -172326 -61265 -132347 -208286 -125409 -45925 -173760 -93804 -405225 200829 -176193 99723
9236 -163334 -146112 41693 182212 -194055 -288447 -220842 38131 -143116 7179 24062 -189456
9224 -129704 -43662 -317958 309648 71700 12294 99279 -106452 -129894 -127768 -193046 -8624
9212 35311 -168551 -8692 -243132 12135 330776 195980 188032 188810 -7810 -71308 -89685 139629
$$ packed form
9295a36677O7637n2737D2770b05296Q4757C1937b32468R2295m554M6386A42850
9283a61292P6309E5384J7211K21212A37624B9736a4996k73518J15974O2108B95259
9271a84243O6586p5355A60504b2249k07364A089a41813k9082q766B39531a52441
9259a78799B31348B3479c99239c5994k42399c750A29786a97112i7370j52905P7949
9248a72326f1265p1082p5939Q2877d5925j27835P9956l11421B00829a76193I9723
9236a63334J7222D1693J40519a94055r4392O7605C8131a43116G179J6883a89456
9224a29704d3662k74296C09648G1700A2294Q6985a06452k3442K126o5278h624
9212C5311a68551h692k34440A2135L18641j34796p948P78g810o3498j8377A39629
$$ plain form
9199 24054 323764 -142380 260220 -322355 98238 -122098 -43881 -207555 -145342 135894
9188 -315031 57089 68980 99123 432604 156937 189461 -13629 -393273 -65913 86441 -464871
9176 52021 -156044 -223078 -163677 38994 -26993 2186 -143783 -67304 145020 -100409 -373462
9165 -373462 52330 109383 -137060 -191499 -143733 93721 40302 -149827 54407 22925 37462
9154 37462 -120289 39009 -133538 227843 -87365 -366961 111937 -238043 -81835 -192491
9144 -192491 -87403 -11884 163349 91758 -217681 -111648 167977 68216 -96304 -90215 -21878
9132 -516717 94089 -43650 146058 -11122 -87193 -18117 -94998 91811 -99513 24356 -67810
9120 138661 394744 -89290 -298984 109853 209835 66039 -9962 -149805 -92603 9660 -44340
$$ packed form
9199B4054K99710a42380B60220c22355I8238a22098d3881j63674O2213A35894
9188c15031E7089J1891L0143L33481A56937L2524a3629l79644f5913H6441d64871
9176E2021a56044o7034N9401C8994b6993B186a43783f7304A45020a00409k73053
9165c73462E2330N7053a37060n4439M7766I3721D0302a49827E4407B2925J4537
9154C7462a20289C9009a33538B27843h7365k79596A11937b38043h1835j10656
9144a92491h7403a1884A63349p1591b17681J06033A67977F8216i6304O089b1878
9132e16717I4089d3650A46058a1122p6071a8117p6881I1811i9513B4356f7810
9120A38661K56083h9290k09694A09853R9982F6039i962j39843N7202I660d4340
$$ plain form
9108 -14014 -113929 -192657 79152 -902 -342559 229764 183563 -250589 -356184 -362514 -180390
9096 220520 -182395 -99010 39847 -98711 -67268 -380283 48710 38299 -44580 76356 -170435
9084 -94431 -298803 143289 -131103 -271213 -153882 -18732 -130069 59641 -58340 97818 -165440
9072 -192942 104611 -51765 -84085 -137562 -57286 20498 -216559 203743 -35805 140348 -70294
9060 -91679 -44385 -170397 -81148 -44358 -223959 -29880 160383 -210526 84948 -87243 174607
9048 -276934 145557 -294443 13824 45969 17381 224 83181 -443107 -294757 -389248 14808
9036 129616 -129971 -403215 -291739 200977 40783 9564 -230030 71243 122856 58878 -298491
9024 -274049 7533 -42622 -300279 -99933 -200989 -192203 144298 13449 -363809 -21157 147322
$$ packed form
9108a4014r9915p8728G9152i02l41657B29764m6201b50589j05595o330a80390
9096B20520a82395Q3385C9847i8711L1443l13015D8710j0411d4580G6356a70435
9084i4431k04372A43289a31103j40110J17331a8732j11337E9641e8340I7818a65440
9072a92942A04611e1765l2320n3477e7286B0498b16559B03743c5805A40348g0294
9060i1679d4385j26012h1148L6790j79601b9880A60383b10526H4948h7243A74607
9048b76934A45557b94443A3824L2145A7381B24Q2957d43107J48350r4491A4808
9036A29616a29971k73244J11476B00977D0783I564b30030G1243N1613E8878b98491
9024b74049G533d2622k57657i9933j01056Q786A44298A3449c63809b1157A47322
$$ plain form
9012 -82893 -89462 -118536 259365 -77469 85966 -244960 -101427 336995 -150173 2358 -274406
9000 195678 24490 -88219 -41341 -339714 -122123 -89006 -122434 -72872 -63623 -222601 -143086
8989 -143086 -195551 91476 65598 -152887 -376373 36953 5739 44715 -443543 73059 -29049
8977 -16705 -142871 -249814 -8673 4496 248684 8301 46983 -10307 -4960 -36141 43375 142678
8965 142678 188106 -186945 -488164 -235967 31141 -23409 142525 -142849 184308 -83314
8954 -73264 -209785 -113371 124618 236320 -230760 -236355 -106037 -277380 -6038 -226647 46375
8942 68966 29549 -57873 82328 102088 17629 -48483 -34029 -190667 -164260 -93853 248021
8930 87939 -118267 -136951 499579 -149797 -114895 25525 -139045 312179 386750 1906796
$$ packed form
9012h2893o569k9074B59365g7469H5966b44960a01427C36995a50173B358b74406
9000A95678B4490h8219d1341k98373a22123L3117l3428M9562R249j58978P9515
8989a43086n2465I1476k5878a52887k23486C6953E739L8976d43543G3059b9049
8977a6705j26166j06943h673D496K44188H301L8682a0307d960l1181D3375R9303
8965A42678M5428a86945l01219b35967C1141b3409A42525a42849A84308h3314
8954g3264j36521R6414A24618J11702b30760n595a06037j71343f038k20609D6375
8942F8966B9549e7873H2328J9760A7629d8483J4454j56638K6407P0407B48021
8930H7939a18267j8684D99579a49797L4902B5525a39045C12179P4571J520046
$$ plain form
8920 1906796 5908920 12370766 2998887 1134742 565179 511323 -41034 159498 -69289
8910 301192 3180 -148197 8795 300989 149228 214360 -111585 85017 -198563 -34510 -335266
8899 -335266 148777 -26415 -220207 -19812 44587 324960 -165556 -429996 35564 29869 144589
8888 144589 -327903 -51092 -145623 81176 202692 -47308 -51588 -186333 134444 -176948 13183
8876 -142528 -172639 16005 -172301 -48372 -73995 -183772 29423 54572 105876 86201 -167471
$$ packed form
8920A906796M002124O461846B998887A134742E65179n3856d1034A59498f9289
8910C01192C180a48197H795K92194A49228O5132a11585H5017a98563c4510l00756
8899c35266A48777b6415j93792a9812D4587K80373a65556k64440C5564n695J14720
8888A44589c27903e1092r4531H1176J21516d7308m280j34745A34444a76948A3183
8876a42528l0111A6005a72301d8372k5623j09777B9423K5149N1304j9675a67471
$$ [...]
##END NTUPLES=NMR SPECTRUM
##END=
