
##TITLE=AC1200_HiSAH12054_6666883_yLKwQD6Ayq
##JCAMPDX= 6.0         $$ Bruker NMR JCAMP-DX V2.0
##DATA TYPE= NMR SPECTRUM
##DATA CLASS= NTUPLES
##ORIGIN= BRUKER
##OWNER= Administrator
$$ 1.72 TOPSPIN		Version 2.1
$$ 2012-12-12 00:12:17.911 -0500  Administrator@X
$$ Compression mode = diff/dup
##.OBSERVE FREQUENCY= 400.02188249412
##.OBSERVE NUCLEUS= ^1H
##.ACQUISITION MODE= SIMULTANEOUS (DQD)
##.ACQUISITION SCHEME= undefined
##.AVERAGES= 64
##.DIGITISER RES= 22
##SPECTROMETER/DATA SYSTEM= spect
##.PULSE SEQUENCE= noesygpps1d.comp
##.SOLVENT NAME= COFFEE_meoh
##.SHIFT REFERENCE= INTERNAL, COFFEE_meoh, 1, 14.96101
##AUDIT TRAIL= $$ (NUMBER, WHEN, WHO, WHERE, PROCESS, VERSION, WHAT)
$$ ##TITLE= Audit trail, TOPSPIN		Version 2.1
$$ ##JCAMPDX= 5.01
$$ ##ORIGIN= Bruker BioSpin GmbH
$$ ##OWNER= Administrator
$$ $$ E:\/data/COFFEE/nmr/AC1200_HiSAH12054_6666883_yLKwQD6Ayq/22/pdata/1/auditp.txt
$$ ##AUDIT TRAIL=  $$ (NUMBER, WHEN, WHO, WHERE, PROCESS, VERSION, WHAT)
(   1,<2012-12-12 00:12:11.661 -0500>,<Administrator>,<X>,<go>,<TOPSPIN 2.1>,
      <created by zg
	started at 2012-12-12 00:00:41.943 -0500,
	POWCHK enabled, PULCHK disabled,
       configuration hash MD5:
       86 BA 57 50 F2 9D 5C 9B 26 00 A9 28 5F 66 2E 89
       data hash MD5: 64K
       68 0B 19 2C 54 C5 B2 05 A9 CF 94 F9 F9 60 70 46>)
(   2,<2012-12-12 00:12:14.849 -0500>,<Administrator>,<X>,<proc1d>,<TOPSPIN 2.1>,
      <Start of raw data processing
       efp LB = 0.3 FT_mod = 6 PKNL = 1 PHC0 = 0 PHC1 = 0 SI = 128K 
       data hash MD5: 128K
       17 A7 C5 79 7F E4 64 82 4A E0 9C 87 16 69 5F BE>)
(   3,<2012-12-12 00:12:16.036 -0500>,<Administrator>,<X>,<proc1d>,<TOPSPIN 2.1>,
      <pk PHC0 = -80.88684 PHC1 = 0 
       data hash MD5: 128K
       C6 FA 10 D5 0B D8 92 2B 3C EF 4C 23 74 D4 89 FA>)
(   4,<2012-12-12 00:12:16.818 -0500>,<Administrator>,<X>,<proc1d>,<TOPSPIN 2.1>,
      <abs ABSG = 1 
       data hash MD5: 128K
       51 FE A2 C6 F9 CE 58 56 22 87 EF C9 3D CE BA CD>)
(   5,<2012-12-12 00:12:16.990 -0500>,<Administrator>,<X>,<proc1d>,<TOPSPIN 2.1>,
      <abs ABSG = 2 
       data hash MD5: 128K
       B8 A3 6C 5A 93 AA DD 59 02 83 2F E2 D0 59 12 36>)
(   6,<2012-12-12 00:12:17.208 -0500>,<Administrator>,<X>,<proc1d>,<TOPSPIN 2.1>,
      <abs ABSG = 3 
       data hash MD5: 128K
       99 2C 6F C7 F2 4E 59 9C A6 B1 34 C9 8C B7 EC 60>)
(   7,<2012-12-12 00:12:17.380 -0500>,<Administrator>,<X>,<proc1d>,<TOPSPIN 2.1>,
      <abs ABSG = 4 
       data hash MD5: 128K
       DF 5D 23 91 34 34 03 10 E4 EA FB B4 A4 8B 92 E5>)
(   8,<2012-12-12 00:12:17.552 -0500>,<Administrator>,<X>,<proc1d>,<TOPSPIN 2.1>,
      <abs ABSG = 5 
       data hash MD5: 128K
       6A 12 DA EC 4E A7 BC C2 FF 1C F2 2B 51 4B 5E 10>)
$$ ##END=
$$ 
$$ $$ hash MD5
$$ $$ 34 55 97 2A 40 9B 9E 12 2B 00 E6 3D 20 76 F3 31
##$RELAX= 
##$RELAX= 
##$RELAX= 
##$RELAX= 
##$RELAX= 
##$RELAX= 
##$RELAX= 
##$RELAX= 
##$RELAX= 
$$ Bruker specific parameters
$$ --------------------------
##$DU= <E:\>
##$EXPNO= 22
$$ [...]
##$TP07= 0
##$TPNAME0= <>
##$TPNAME1= <>
##$TPNAME2= <>
##$TPNAME3= <>
##$TPNAME4= <>
##$TPNAME5= <>
##$TPNAME6= <>
##$TPNAME7= <>
##$TPOAL= (0..7)
0.5 0.5 0.5 0.5 0.5 0.5 0.5 0.5
##$TPOFFS= (0..7)
0 0 0 0 0 0 0 0
##$TUNHIN= 0
##$TUNHOUT= 0
##$TUNXOUT= 0
##$USERA1= <user>
##$USERA2= <user>
##$USERA3= <user>
##$USERA4= <user>
##$USERA5= <user>
##$V9= 5
##$VALIST= <valist>
##$VCLIST= <CCCCCCCCCCCCCCC>
##$VD= 0
##$VDLIST= <DDDDDDDDDDDDDDD>
##$VPLIST= <PPPPPPPPPPPPPPP>
##$VTLIST= <TTTTTTTTTTTTTTT>
##$WBST= 2048
##$WBSW= 25
##$XGAIN= (0..3)
0 0 0 0
##$XL= 0
##$YL= 0
##$YMAX_a= 5881368
##$YMIN_a= -12071534
##$ZGOPTNS= <>
##$ZL1= 120
##$ZL2= 120
##$ZL3= 120
##$ZL4= 120
##$ABSF1= 14.96101
##$ABSF2= -5.597172
##$ABSG= 5
##$ABSL= 3
##$ALPHA= 0
##$AQORDER= 0
##$ASSFAC= 0
##$ASSFACI= 0
##$ASSFACX= 0
##$ASSWID= 0
##$AUNMP= <proc_prof1d_extract.lims>
##$AXLEFT= 0
##$AXNAME= <>
##$AXNUC= <1H>
##$AXRIGHT= 0
##$AXTYPE= 0
##$AXUNIT= <>
##$AZFE= 0.1
##$AZFW= 0.1
##$BCFW= 0
##$BC_mod= 0
##$BYTORDP= 0
##$COROFFS= 0
##$CY= 15
##$DATMOD= 1
##$DC= 0
##$DFILT= <>
##$DTYPP= 0
##$F1P= 0
##$F2P= 0
##$FCOR= 0.5
##$FTSIZE= 131072
##$FT_mod= 6
##$GAMMA= 0
##$GB= 0
##$INTBC= 1
##$INTSCL= 1
##$ISEN= 128
##$LB= 0.3
##$LEV0= 0
##$LPBIN= 0
##$MAXI= 10000
##$MC2= 0
##$MEAN= 0
##$ME_mod= 0
##$MI= 0
##$NCOEF= 0
##$NC_proc= -2
##$NLEV= 6
##$NOISF1= 0
##$NOISF2= 0
##$NSP= 0
##$NTH_PI= 0
##$NZP= 0
##$OFFSET= 14.96101
##$PC= 1
##$PHC0= -80.88684
##$PHC1= 0
##$PH_mod= 1
##$PKNL= yes
##$PPARMOD= 0
##$PPDIAG= 0
##$PPIPTYP= 0
##$PPMPNUM= 2147483647
##$PPRESOL= 1
##$PSCAL= 4
##$PSIGN= 0
##$PYNMP= <proc.py>
##$REVERSE= no
##$SF= 400.020009633303
##$SI= 131072
##$SIGF1= 0
##$SIGF2= 0
##$SINO= 400
##$SIOLD= 131072
##$SPECTYP= <>
##$SREGLST= <1H.CDCl3>
##$SSB= 0
##$STSI= 131072
##$STSR= 0
##$SW_p= 8223.68421052631
##$SYMM= 0
##$S_DEV= 0
##$TDeff= 65536
##$TDoff= 0
##$TI= <>
##$TILT= no
##$TM1= 0
##$TM2= 0
##$TOPLEV= 0
##$USERP1= <user>
##$USERP2= <user>
##$USERP3= <user>
##$USERP4= <user>
##$USERP5= <user>
##$WDW= 1
##$XDIM= 131072
##$YMAX_p= 430466576
##$YMIN_p= -13438
##$CURPLOT= <Network HP LaserJet P1505>
##$CURPRIN= <$Network HP LaserJet P1505>
##$DFORMAT= <normdp>
##$LAYOUT= <+/1D_H.xwp>
##$LFORMAT= <normlp>
##$PFORMAT= <normpl>
##$SURQMSG= 1
$$ End of Bruker specific parameters
$$ ---------------------------------
##NTUPLES= NMR SPECTRUM
##VAR_NAME=  FREQUENCY,     SPECTRUM/REAL,   SPECTRUM/IMAG
##SYMBOL=    X,             R,               I
##VAR_TYPE=  INDEPENDENT,   DEPENDENT,       DEPENDENT
##VAR_FORM=  AFFN,          ASDF,            ASDF
##VAR_DIM=   131072,        131072,          131072
##UNITS=     HZ,            ARBITRARY UNITS, ARBITRARY UNITS
##FACTOR=    0.0627417313425164, 1,          1
##FIRST=     8223.62146879497, 2435,         -55207
##LAST=      0,             4735,            -55693
##MIN=       0,             -13438,          0
##MAX=       8223.62146879497, 430466576,    0
$$ Real data points
##PAGE= N=1
##DATA TABLE= (X++(R..R)), XYDATA
$$ [...]
63906A807575j37770j22818j09235r6124q3296p1588o1799n3796m6874m0699l5445
$$ 1807575 1669805 1546987 1437752 1341628 1258332 1186744 1124945 1071149 1024275 983576 948131
63895I48131l1188k7688k4893k3128k2480k2326k1952k1290k0589j9553j7591
$$ 948131 916943 889255 864362 841234 818754 796428 774476 753186 732597 713044 695453
63884F95453j4899j2565j1227j0208q407n669k746k57J841L936O343R098J1766
$$ 695453 680554 667989 656762 646554 638147 632478 629732 629475 631316 635252 641595 650693 662459
63871F62459J3644J4598J5521J7436K0139K2359K3298K3470K3787K4379K4719
$$ 662459 676103 690701 706222 723658 743797 766156 789454 812924 836711 861090 885809
63860H85809K4532K3997K3222K1966J9978J7256J3924J0177O386K991Ml122o846
$$ 885809 910341 934338 957560 979526 999504 1016760 1030684 1040861 1047247 1050238 1050242 1047120 1040274
63847A040274j0819j4212j6749j9096k1972k5204k8002k9867l0932l1505l1755
$$ 1040274 1029455 1015243 998494 979398 957426 932222 904220 874353 843421 811916 780161
63836G80161l1826l1765l1275l0011k8236k6754k5943k5298k4182k2627k1032
$$ 780161 748335 716570 685295 655284 627048 600294 574351 549053 524871 502244 481212
63825D81212j9421j7537j5406j3392j1744j0453r500q892q541q317q150p886p221
$$ 481212 461791 444254 428848 415456 403712 393259 383759 374867 366326 358009 349859 341973 334752
63812C34752o107m939m082l414k712k220k265k528k303j488p46o12j004j652k465
$$ 334752 328645 323706 319624 316210 313498 311278 309013 306485 304182 302694 301948 301336 300332 298680 296215
63797B96215l232l564l459l525m192m956m884l785k477j832j869j991j870j773
$$ 296215 292983 289419 285960 282435 278243 273287 268403 264618 262141 260309 258440 256449 254579 252806
63783B52806j999k265k015j145j22O27J028J072O35j82r96j605k098k305j734
$$ 252806 250807 248542 246527 245382 245260 245887 246915 247987 248622 248440 247444 245839 243741 241436 239702
63768B39702n03L51J15n31m96J43M50J35k37m50r08j556j673j040m14l26l08K01
$$ 239702 239199 239550 239665 239134 238638 238781 239231 239366 239129 238679 237771 236215 234542 233502 233088 232762 232454 232655
63750B32655Q96J132Q67M53L6k95j92M99J324J792K082K613L259L533L364L055
$$ 232655 233551 234683 235550 236003 236039 235744 235552 236051 237375 239167 241249 243862 247121 250654 254018 257073
63734B57073K655J930J019N59R39J817K516K754K815L140L836M636N295N784N980
$$ 257073 259728 261658 262677 263236 264175 265992 268508 271262 274077 277217 281053 285689 290984 296768 302748
63719C02748N477M117K579J822J916J985J395L71p41k010l283l707k734j195n67
$$ 302748 308225 312342 314921 316743 318659 320644 322039 322410 321669 319659 316376 312669 309935 308740 308173
63704C08173j198k004j923j110m66l85l83J69J236K231K871L540M549N381N222
$$ 308173 306975 304971 303048 301938 301472 301087 300704 300873 302109 304340 307211 310751 315300 320681 325903
63689C25903M144L093K572K128J356N99K40p9p95j552j630j036m52l54o83j180
$$ 325903 330047 333140 335712 337840 339196 339795 340035 339956 339161 337609 335979 334943 334491 334137 333454 332274
63673C32274j431r34L28J532J817J343R90J147J394J265P27r3j060j870k220k233
$$ 332274 330843 329909 330237 331769 333586 334929 335919 337066 338460 339725 340452 340359 339299 337429 335209 332976
63657C32976k326k638k954l166l381l588l647l597l584l578l430l150k752k008
$$ 332976 330650 328012 325058 321892 318511 314923 311276 307679 304095 300517 297087 293937 291185 289177
63643B89177q51J22K32k64l26N97J954K917L290L421L652M087M613N003N184N414
$$ 289177 288326 288448 288680 288416 288090 288687 290641 293558 296848 300269 303921 308008 312621 317624 322808 328222
63627C28222N961O721P421Q046Q702R306R877J0845J2453J4069J4923J5387J6594
$$ 328222 334183 340904 348325 356371 365073 374379 384256 395101 407554 421623 436546 451933 468527
63614D68527J8780K0964K2531K4043K6014K7884K8901K9277K9588K9663K8776
$$ 468527 487307 508271 530802 554845 580859 608743 637644 666921 696509 726172 754948
63603G54948K6586K3099J8221J2108N760M07l563o484q435r195r008q587q342
$$ 754948 781534 804633 822854 834962 840722 841129 837566 831082 822647 813452 804444 795857 787515
63590G87515q307q915j0930j4412j8405k1888k4455k5891k5833k4341k2128j9732
$$ 787515 779208 770293 759363 744951 726546 704658 680203 654312 628479 604138 582010 562278
63578E62278j6988j3875j1241r872r176p792n374k899j147K03J646K932L649M068
$$ 562278 545290 531415 520174 510302 501126 493334 487960 485061 483914 484117 485763 488695 492344 496412
63564D96412M749N624O191O427O833P630Q480R110R698J0592J1985J4031J6795
$$ 496412 501161 506785 512976 519403 526236 533866 542346 551456 561154 571746 583731 597762 614557
63551F14557J9985K3067K5897K8917L2561L6643M0409M2795M2390L7784K8632
$$ 614557 634542 657609 683506 712423 744984 781627 822036 864831 907221 945005 973637
63540I73637J6509M272n674j2521j6650j8456j7836j4871j0712p299n985o639
$$ 973637 990146 994418 988744 976223 959573 941117 923281 908410 897698 890399 884414 877775
63528H77775q341j0625j3608j7243k1103k4899k8488l1298l2507l2100l1035l0007
$$ 877775 869434 858809 845201 827958 806855 781956 753468 722170 689663 657563 626528 596521
63516E96521k8714k6749k4478k2376k0118j7220j4156j1958j0840j0080r114p966
$$ 596521 567807 541058 516580 494204 474086 456866 442710 430752 419912 409832 400718 392752
63504C92752o705n337m321m351n271n892n280l775k388j634j320j131r86q80p22
$$ 392752 386047 380710 376389 372038 366767 360875 355595 351820 349432 347798 346478 345347 344361 343481 342759
63489C42759l49L34J198J887K083J759J101L27j99P0J380L212M642N186N042M608
$$ 342759 342410 342744 343942 345829 347912 349671 350772 351099 350900 350970 352350 355562 360204 365390 370432 375040
63473C75040M062L393K480J141n84k240l368l990m357m421l997l381l162l412
$$ 375040 379102 382495 384975 386116 385532 383292 379924 375934 371577 367156 363159 359778 356616 353204
63459C53204l583l277k621j803q38R6O70J006J740L068M248M503M104M080N012
$$ 353204 349621 346344 343723 341920 341082 341178 341848 342854 344594 347662 351910 356413 360517 364597 369609
63444C69609O540Q035R362J0842J2625J4365J5662J6814J8874K2626K7576L2133
$$ 369609 376149 384184 393546 404388 417013 431378 447040 463854 482728 505354 532930 565063
63432E65063L4688L4337L0878K4814J7479J0642N616K781J963K927N410Q986J3160
$$ 565063 599751 634088 664966 689780 707259 717901 723517 726298 728261 731188 736598 745584 758744
63419G58744J7591K2150K6778L1149L4452L5751L4794L2115K8152K2692J5694
$$ 758744 776335 798485 825263 856412 890864 926615 961409 993524 1021676 1044368 1060062
63408A060062Q100J237m390q904j2039j3259j2867j2021j1576j1717j2816j5583
$$ 1060062 1068162 1069399 1065009 1056105 1044066 1030807 1017940 1005919 994343 982626 969810 954227
63396I54227j9947k4711k8757l1970l4532l6070l6084l4664l2284k9349k6324
$$ 954227 934280 909569 880812 848842 814310 778240 742156 707492 675208 645859 619535
63385F19535k3700k1418j8826j5628j2371r618p246m995l073j625k12J602L589
$$ 619535 595835 574417 555591 539963 527592 517974 510728 505733 502660 501035 500823 502425 506014
63372E06014N415P299R444J1276J2039J1963J2112J3245J5277J7673J9873K1610
$$ 506014 511429 518728 528172 539448 551487 563450 575562 588807 604084 621757 641630 663240
63360F63240K3257K5522K8474L1270L3254L4694L5867L6032L4259L0647K5859
$$ 663240 686497 712019 740493 771763 805017 839711 875578 911610 945869 976516 1002375
63349A002375J9894J2558M795j688o232r528j1991j3029j2379j1119j0704j1567
$$ 1002375 1022269 1034827 1039622 1037934 1031702 1022174 1010183 997154 984775 973656 962952 951385
63337I51385j3311j5700j8864k2740k6784l0216l2405l3219l3049l2190l0296
$$ 951385 938074 922374 903510 880770 853986 823770 791365 758146 725097 692907 662611
63326F62611k6867k2362j8122j4880j1842p818l029O91J566n74m465q825j3261
$$ 662611 635744 613382 595260 580380 568538 560720 557691 558382 559948 559374 554909 546084 532823
63313E32823j7647k1068k2086k0349j7270j4638j2836j0995q632o310m732l899
$$ 532823 515176 494108 472022 451673 434403 419765 406929 395934 387302 380992 376260 372361
63301C72361l383k954k652k580k734k861k496j550p14q19j809k851l466l851m068
$$ 372361 368978 366024 363372 360792 358058 355197 352701 351151 350437 349618 347809 344958 341492 337641 333573
63286C33573l674k585j596j504k042k261j758j004n62l89n3O06J132Q99k3o33
$$ 333573 329899 327314 325718 324214 322172 319911 318153 317149 316587 316198 316145 316751 317883 318782 318759 318126
63270C18126o7J177J655P87l53m87K80Q82R47J149J960K896L311L290L308L376
$$ 318126 318059 319236 320891 321678 321325 320838 321118 322000 322947 324096 326056 328952 332263 335553 338861 342237
63254C42237L121K530K103K171K516K872L387M293N374O134O375O346O349O568
$$ 342237 345358 347888 349991 352162 354678 357550 360937 365230 370604 376738 383113 389459 395808 402376
63240D02376P150Q114R165J0029J0956J2436J4334J5962J7106J8306J9748K0637
$$ 402376 409526 417640 426805 436834 447790 460226 474560 490522 507628 525934 545682 566319
63228E66319K0347J9613J9659K0425K0630J9614J8225J7614J7860J8174J7980
$$ 566319 586666 606279 625938 646363 666993 686607 704832 722446 740306 758480 776460
63217G76460J7460J7196J7600J8440J8935J8358J6598J3950J0570O502K101k135
$$ 776460 793920 811116 828716 847156 866091 884449 901047 914997 925567 932069 934170 932035
63205I32035o153j0259j4365j7839k0295k2006k3317k4079k3993k3128k1734j9721
$$ 932035 925882 915623 901258 883419 863124 841118 817801 793722 769729 746601 724867 705146
63193G05146j6731j2782q615n295l330k061j39L164P130J0457J2721J4608J6719
$$ 705146 688415 675633 667018 661723 658393 656332 656193 659357 666487 676944 689665 704273 720992
63180G20992J8775K0165K0743K0800K0564K0080J9356J8429J7433J6688J6486
$$ 720992 739767 759932 780675 801475 822039 842119 861475 879904 897337 914025 930511
63169I30511J6649J6533J5643J4087J2271J0325P934M585N0n359j0999j6491k1823
$$ 930511 947160 963693 979336 993423 1005694 1016019 1023953 1028538 1028588 1023229 1012230 995739 973916
63156I73916k6671l0109l1625l2028l2571l3254l2909l1006k8397k5989k3641
$$ 973916 947245 917136 885511 853483 820912 787658 754749 723743 695346 669357 645716
63145F45716k0900j7986j5388j3112j1086r689r185r000q315p105n936n009m095
$$ 645716 624816 606830 591442 578330 567244 557555 548370 539370 531055 523950 518014 513005 508910
63132E08910l135k217j133K98J624K150J998K004K564L274L841M556N548O221
$$ 508910 505775 503558 502425 502723 504347 506497 508495 510499 513063 516337 520178 524734 530282 536503
63118E36503O002N243M798M867M814M157L303K989L215L156K259J086N99P67N25
$$ 536503 542505 547748 552546 557413 562227 566384 569687 572676 575891 579047 581306 582392 582991 583758 584283
63103E84283p08k145k669k277j824j669j425r36o70r25j341j497j490j504j310
$$ 584283 583575 581430 578761 576484 574660 572991 571566 570630 569960 569035 567694 566197 564707 563203 561893
63088E61893o46J59M76K46J50P45J710K164J715J020J079K058L142L636L843M494
$$ 561893 561247 561406 561882 562128 562278 563023 564733 566897 568612 569632 570711 572769 575911 579547 583390 587884
63072E87884N662O771P523Q150Q736Q955Q773Q800R548J0790J2052J3416J5352
$$ 587884 593546 600317 607840 615990 624726 633681 642454 651254 660802 671592 683644 697060 712412
63059G12412J7940K0743K3287K5388K7078K8616L0466L2942L5859L8728M1164
$$ 712412 730352 751095 774382 799770 826848 855464 885930 918872 954731 993459 1034623
63048A034623M2929M3872M4234M4734M5843M7084M7556M7085M6239M5285M3896
$$ 1034623 1077552 1121424 1165658 1210392 1256235 1303319 1350875 1397960 1444199 1489484 1533380
63037A533380M2047M0484L9777L9527L9019L8240L7534L6582L4406L0407K4798
$$ 1533380 1575427 1615911 1655688 1695215 1734234 1772474 1810008 1846590 1880996 1911403 1936201
63026A936201J7970R952O88r465j9762k9457l8168m5845n2346n7048n9246n9096
$$ 1936201 1954171 1964123 1964811 1955346 1935584 1906127 1867959 1822114 1769768 1712720 1653474 1594378
63014A594378n7672n5672n2514m7350m0658l3953k7988k2101j5529q511j829M112
$$ 1594378 1536706 1481034 1428520 1381170 1340512 1306559 1278571 1256470 1240941 1232430 1230601 1234713
63002A234713R354J4178J8999K3974K8388L1224L2578L3715L5263L6261L5788
$$ 1234713 1244067 1258245 1277244 1301218 1329606 1360830 1393408 1427123 1462386 1498647 1534435
62991A534435L4629L4213L4553L4483L3608L2554L1336K8904K4755J9817J5056
$$ 1534435 1569064 1603277 1637830 1672313 1705921 1738475 1769811 1798715 1823470 1843287 1858343
62980A858343J0020L566m572j3639k2873l1920m0400m7734n3533n7795o0625o2016
$$ 1858343 1868363 1871929 1867357 1853718 1830845 1798925 1758525 1710791 1657258 1599463 1538838 1476822
62968A476822o1956o0673n8619n6164n3291m9783m5814m2093l9137l6582l3698
$$ 1476822 1414866 1354193 1295574 1239410 1186119 1136336 1090522 1048429 1009292 972710 939012
62957I39012l0488k7750k5960k4676k3262k1765k0691k0134j9545j8415j6936
$$ 939012 908524 880774 854814 830138 806876 785111 764420 744286 724741 706326 689390
62946F89390j5794j5302j4910j3890j2435j1524j1525j1514j0534r008q051p770
$$ 689390 673596 658294 643384 629494 617059 605535 594010 582496 571962 562954 554903 547133
62934E47133p231o027m831m141l514k482j432r62r81j072j219j562j860j770j507
$$ 547133 539902 533875 529044 524903 521389 518907 517475 516513 515532 514460 513241 511679 509819 508049 506542
62919E06542j605k156k703k813k497k100j985k170k262j952j595j839k601k993
$$ 506542 504937 502781 500078 497265 494768 492668 490683 488513 486251 484299 482704 480865 478264 475271
62905D75271k518j792j669k081k276j837r58PP85J167J215J326J739K086J798
$$ 475271 472753 470961 469292 467211 464935 463098 462140 462147 462932 464099 465314 466640 468379 470465 472263
62890D72263Q45k11q41r87r25q78p10r2Q64J348P56k74m64L64J019O41j90n37
$$ 472263 473108 472897 472056 471069 470144 469266 468556 468464 469328 470676 471432 471158 470694 471058 472077 472718 472528 471991
62872D71991m04l10l47m11p63j491j972j690j132r91j032o56r3O6J35Q43J849
$$ 471991 471587 471277 470930 470519 469756 468265 466293 464603 463471 462480 461448 460792 460699 460765 460900 461743 463592
62855D63592K044J369R90J488K052J892J370J218J513J907K146J963J159J49l02
$$ 463592 465636 467005 467995 469483 471535 473427 474797 476015 477528 479435 481581 483544 484703 484852 484550
62840D84550j61j78n63n87J00O85M56p0m9L73N40M51M72L76k18q57o98J24O43
$$ 484550 484389 484211 483648 483061 483161 483846 484302 484232 484183 484556 485096 485547 486019 486395 486177 485320 484622 484746 485389
62821D85389N55N87J183J833K035K097K478K988L236L378L755M094L732K656J747
$$ 485389 485944 486531 487714 489547 491582 493679 496157 499145 502381 505759 509514 513608 517340 519996 521743
62806E21743J851K915M187M963N061M798M782N461O631P514P602P354P682Q788
$$ 521743 523594 526509 530696 535659 540720 545518 550300 555761 562392 569906 577508 584862 592544 601332
62792F01332J0050J1119J2542J4904J7892K0854K3889K7594L1836L5711L8878
$$ 601332 611382 622501 635043 649947 667839 688693 712582 740176 772012 807723 846601
62781H46601M2158M6331N1039N5390N9176O2856O6595O9879P1981P2403P1006
$$ 846601 888759 935090 986129 1041519 1100695 1163551 1230146 1300025 1372006 1444409 1515415
62770A515415O8077O4114N9129N2388M3265L2194K0216P811n184j8472l0948m1692
$$ 1515415 1583492 1647606 1706735 1759123 1802388 1834582 1854798 1862609 1857425 1838953 1808005 1766313
62758A766313n0709n8277o4160o7972o9944p0666p0376o9012o6777o4018o0615
$$ 1766313 1715604 1657327 1593167 1525195 1455251 1384585 1314209 1245197 1178420 1114402 1053787
62747A053787n6232n1289m6906m3541m0382l6532l2340k8848k6319k4026k1401
$$ 1053787 997555 946266 899360 855819 815437 778905 746565 717717 691398 667372 645971
62736F45971j8593j5910j3403j1267r883r103q091o332m448l430l383l486l024
$$ 645971 627378 611468 598065 586798 576915 567812 559721 553389 548941 545511 542128 538642 535618
62723E35618j840m6K111M016M959M906M662N011O016P318Q813J0734J3130J5536
$$ 535618 533778 533732 535843 539859 544818 549724 554386 559397 565413 572731 581544 592278 605408 620944
62709F20944J7325J8402J9470K1408K4358K7674L0930L4509L8845M3420M7279
$$ 620944 638269 656671 676141 697549 721907 749581 780511 815020 853865 897285 944564
62698I44564N0351N3559N7453O1476O4863O7603O9934P1510P1717P0498O8034
$$ 944564 994915 1048474 1105927 1167403 1232266 1299869 1369803 1441313 1513030 1583528 1651562
62687A651562O3757N6545M6139L3677K0431O621p979k2730l6190m7495n6948o5022
$$ 1651562 1715319 1771864 1818003 1851680 1872111 1878732 1870753 1848023 1811833 1764338 1707390 1642368
62675A642368p1422p5498p7235p7158p5470p1966o6971o1734n7440n4040n0485
$$ 1642368 1570946 1495448 1418213 1341055 1265585 1193619 1126648 1064914 1007474 953434 902949
62664I02949m6008m0929l6282l2900l0679k8611k5635k1777j8281j6247j5320
$$ 902949 856941 816012 779730 746830 716151 687540 661905 640128 621847 605600 590280
62653E90280j4183j2334j0681j0153j0330j0101r199q287p591o453m621l109l001
$$ 590280 576097 563763 553082 542929 532599 522498 513299 505012 497421 490968 486347 483238 480237
62640D80237l775l810k459o59O05J415K038J928N87j262k404k766l179l706l456
$$ 480237 476462 472652 470193 469534 470139 471554 473592 475520 476107 474845 472441 469675 466496 462790 459334
62625D59334k253j215j174j562j487r90m23M99K038L420L706L340L658M915N893
$$ 459334 457081 455866 454692 453130 451643 450653 450230 450729 452767 456187 459893 463233 466891 471806 477699
62610D77699N687M887M593M974N402N593N987P040Q537R747J0318J0881J2544
$$ 477699 483386 488273 492866 497840 503242 508835 514822 521862 530399 540146 550464 561345 573889
62597E73889J5682J9520K3027K5866K8263L0353L2145L3732L5031L5595L5136
$$ 573889 589571 609091 632118 657984 686247 716600 748745 782477 817508 853103 888239
62586H88239L3943L2256K9541K5067J8951J2050N023j875q334j4126j9483k4554
$$ 888239 922182 954438 983979 1009046 1027997 1040047 1045070 1043195 1034861 1020735 1001252 976698
62574I76698k8653l0975l1922l2683l3500l3448l2165l0627k9662k8713k6796
$$ 976698 948045 917070 885148 852465 818965 785517 753352 722725 693063 664350 637554
62563F37554k3965k1106j8775j6903j5245j3541j1511r210p198o044n811o153
$$ 637554 613589 592483 573708 556805 541560 528019 516508 507298 500100 494056 488245 482092
62551D82092o505o172m803l034k010j998k098j676j263j434j576o60J158K585
$$ 482092 475587 469415 464612 461578 459568 457570 455472 453796 452533 451099 449523 448863 450021 452606
62537D52606K706J775N86k80n88l91O7O16J367K478L854N299O704P918Q759R398
$$ 452606 455312 457087 457673 457393 456805 456414 456481 457097 458464 460942 464796 470095 476799 484717 493476 502874
62521E02874J0465J2431J5142J8172K1221K4002K6257K8275L0896L4422L7990
$$ 502874 513339 525770 540912 559084 580305 604307 630564 658839 689735 724157 762147
62510G62147M0571M2209M3601M4783M5053M4026M1925L8823L4376K8538K1925
$$ 762147 802718 844927 888528 933311 978364 1022390 1064315 1103138 1137514 1166052 1187977
62499A187977J5179Q320J116o220j2882j7882k0499k0542j8379j4734j0325n633
$$ 1187977 1203156 1211476 1212592 1206372 1193490 1175608 1155109 1134567 1116188 1101454 1091129 1085496
62487A085496q17M148R215J4103J8490K2327K5748K8726L0958L1920L0796K6730
$$ 1085496 1084679 1088827 1098042 1112145 1130635 1152962 1178710 1207436 1238394 1270314 1301110 1327840
62475A327840J9847J1871M800j184p657j5697k4617l3295m1460m8831n4099n6139
$$ 1327840 1347687 1359558 1364358 1363174 1355517 1339820 1315203 1281908 1240448 1191617 1137518 1081379
62463A081379n5736n4737n3788n2021m8925m5148m1299l7053l2052k6884k2579
$$ 1081379 1025643 970906 917118 865097 816172 771024 729725 692672 660620 633736 611157
62452F11157j9462j6938j4147j0735p165m377k889k294j872j343o63N06K351M182
$$ 611157 591695 574757 560610 549875 542710 538333 535444 533150 531278 529935 529272 529778 532129 536311
62438E36311M978M724M411M580M611L741K044Q8j788l447m646n258n545n950o677
$$ 536311 541289 546013 550424 555004 559615 563356 565400 565488 563700 560253 555607 550349 544804 538854 532177
62423E32177p629q539r071r054q627q031p309o424n472m466l188j714p98j099
$$ 532177 524548 516009 506938 497884 489257 481226 473917 467493 462021 457555 454367 452653 451855 450756
62409D50756k172k953l079k976k770k124j208p61q33n14O06J608J627J204J407
$$ 450756 448584 445631 442552 439576 436806 434682 433474 432713 431880 431366 431972 433580 435207 436411 437818
62394D37818K231K788K706K411K244K181K355L032M033M784N062N180N378N619
$$ 437818 440049 442837 445543 447954 450198 452379 454734 457766 461799 466583 471645 476825 482203 487822
62380D87822N988O785P895Q640Q573Q113Q046Q542R061R150Q988R094R760J1050
$$ 487822 493810 500595 508490 517130 525703 533816 541862 550404 559465 568615 577603 586697 596457 607507
62366F07507J3076J5871J8942K1459K3247K5212K8325L2444L6695M0811M5263
$$ 607507 620583 636454 655396 676855 700102 725314 753639 786083 822778 863589 908852
62355I08852N0001N3955N6159N6696N5979N3737M9331M2727L4484K5132J5280
$$ 908852 958853 1012808 1068967 1125663 1181642 1235379 1284710 1327437 1361921 1387053 1402333
62344A402333N999j699p870j3426j8937k4203k9009l3480l7459m0258m1417m1264
$$ 1402333 1408332 1406633 1398763 1385337 1366400 1342197 1313188 1279708 1242249 1201991 1160574 1119310
62332A119310m0318l8618l6104l3211l0501k7961k5256k2552k0498j9362j8709
$$ 1119310 1078992 1040374 1004270 971059 940558 912597 887341 864789 844291 824929 806220
62321H06220j8148j7946j8591k0013k1447k2027k1365j9716j7735j5969j4491
$$ 806220 788072 770126 751535 731522 710075 688048 666683 646967 629232 613263 598772
62310E98772j3072j1672j0499r539q354o680m989m060m050m296m086l268k126
$$ 598772 585700 574028 563529 553990 545636 538956 533967 529907 525857 521561 517475 514207 512081
62297E12081j002j42L58P22J356K415L597M578N382O153O763P007P050P291P806
$$ 512081 511079 510937 511295 512017 513373 515788 519385 523963 529345 535498 542261 549268 556318 563609 571415
62282E71415Q244Q376Q472Q910R645J0300J0694J0984J1326J1622J1762J1864
$$ 571415 579659 588035 596507 605417 615062 625362 636056 647040 658366 669988 681750 693614
62270F93614J2108J2393J2484J2448J2664J3353J4360J5513J6952J8961K1693
$$ 693614 705722 718115 730599 743047 755711 769064 783424 798937 815889 834850 856543
62259H56543K5189K9341L3697L7725M1528M5751N0295N3720N4642N3330N0844
$$ 856543 881732 911073 944770 982495 1024023 1069774 1120069 1173789 1228431 1281761 1332605
62248A332605M7009M0505L1100K0512J0548J525o892j4439k0867k6943l3683m0867
$$ 1332605 1379614 1420119 1451219 1471731 1482279 1483804 1476912 1462473 1441606 1414663 1380980 1340113
62236A340113m7265n2021n5058n6404n6055n4381n1881m8595m4416l9802l5472
$$ 1340113 1292848 1240827 1185769 1129365 1073310 1018929 967048 918453 874037 834235 798763
62225G98763l1508k7478k3401j9817j6938j4465j2273j0573r363q397p711p503
$$ 798763 767255 739777 716376 696559 679621 665156 652883 642310 632947 624550 616839 609336
62213F09336p427o764n442m225l674l509l209k660k007j306n68K37J282K619L823
$$ 609336 601909 595145 589703 585478 581804 578295 575086 572426 570419 569113 568545 568782 570064 572683 576506
62198E76506M450M727N214N874O211O275O640P308P636P534P760Q619R372R482
$$ 576506 580956 585683 590897 596771 602982 609257 615897 623205 630841 638375 646135 654754 664126 673608
62184F73608R516J0133J0983J1347J1196J0820R985Q420O697N701N508N564N833
$$ 673608 683124 693257 704240 715587 726783 737603 747588 756008 762705 768406 773914 779478 785311
62171G85311O942R271J2561J6403K0548K4759K8885L3066L7311M0926M2871M2726
$$ 785311 792253 801524 814085 830488 851036 875795 904680 937746 975057 1015983 1058854 1101580
62159A101580M0857L7652L3017K6798J9340J1523M374j458o084j0155j4122j7887
$$ 1101580 1142437 1180089 1213106 1239904 1259244 1270767 1275141 1273683 1267599 1257444 1243322 1225435
62147A225435k1382k5056k9275l3441l6248l6903l5709l3489l0780k7680k4159
$$ 1225435 1204053 1178997 1149722 1116281 1080033 1043130 1007421 973932 943152 915472 891313
62136H91313k0411j6951j4291j2428j0832r165p731o984o816o748o574o391o069
$$ 891313 870902 853951 839660 827232 816400 807235 799504 792520 785704 778956 772382 765991 759922
62123G59922n240l796k066m35R30K059L195M762O926R121J0378J0154Q558N833
$$ 759922 754682 750886 748820 748385 749315 751374 754569 759331 766257 775378 785756 795910 804468 810301
62109H10301K175j815n025o571o513n608m559l776l633m471o175p996r115r306
$$ 810301 812476 810661 805636 799065 792552 786944 782385 778609 774976 770505 764330 756334 747219 737913
62095G37913q895q103o746m671k169K54K331L905M685M635M516N371P311R355
$$ 737913 729018 720915 714169 709498 707329 707583 709914 713819 718504 723139 727655 733026 740337 749692
62081G49692J0644J1287J1795J2322J2951J4121J6112J8432K0328K1733K3041
$$ 749692 760336 771623 783418 795740 808691 822812 838924 857356 877684 899417 922458
62070I22458K4178K4610K4302K3986K4281K5044K5849K6632K7603K8724K9495
$$ 922458 946636 971246 995548 1019534 1043815 1068859 1094708 1121340 1148943 1177667 1207162
62059A207162K9112K6812K2397J6545J0387M637p09n743j0123j3494j6243j9345
$$ 1207162 1236274 1263086 1285483 1302028 1312415 1317052 1316343 1310600 1300477 1286983 1270740 1251395
62047A251395k3341k7754l1665l4710l7205l9374m0891m1334m0849l9959l8836
$$ 1251395 1228054 1200300 1168635 1133925 1096720 1057346 1016455 975121 934272 894313 855477
62036H55477l7128l4553l1341k8028k5043k2561k0480j8512j6493j4656j3311
$$ 855477 818349 783796 752455 724427 699384 676823 656343 637831 621338 606682 593371
62025E93371j2237j0802q782o793n708n833o694p384p164o111n202n252n851n830
$$ 593371 581134 570332 561550 554757 549049 543216 536522 529138 521974 515863 510661 505409 499558 493728
62011D93728m766l270j784n1J794K745K314J633K201L954N581O321O514O529O222
$$ 493728 488962 485692 483908 483857 485651 488396 490710 492343 494544 498498 504079 510400 516914 523443 529665
61996E29665N462M389L086J678O92N44O43j42j998l944n289o383p598q414q245
$$ 529665 535127 539516 542602 544280 544972 545516 546159 546017 544019 540075 534786 528403 520805 512391 504146
61981E04146p527p219p475p558o947n934n043m342l614k860k321k080j950j898
$$ 504146 496619 489400 481925 474367 467420 461486 456443 452101 448487 445627 443306 441226 439276 437378
61967D37378k276l237m071l682j966j77M46jn91q86j051r38j05J227K104K151
$$ 437378 435102 431865 427794 424112 422146 421969 422415 422414 421823 420937 419886 418948 418843 420070 422174 424325
61951D24325K169K916L932M279M063M411N918P896R399J0423J1630J3218J4672
$$ 424325 426494 429410 433342 437621 441684 446095 452013 459909 469308 479731 491361 504579 519251
61938E19251J5680J6609J7778J8675J8531J7448J6326J5640J4981J3943J2793
$$ 519251 534931 551540 569318 587993 606524 623972 640298 655938 670919 684862 697655
61927F97655J1829J0646Q654N979L330J184m57j749k896m143n356n878n294m101
$$ 697655 709484 720130 728784 734763 738093 739277 738820 737071 734175 730032 724676 718798 713504 709403
61913G09403l034j941qK962O154Q687J0418J1689J2729J3428J3405J2321J0338
$$ 709403 706369 704428 704420 707382 713536 722223 732641 744330 757059 770487 783892 796213 806551
61900H06551Q054N671K557j751o416r974j1948j3066j3945j4446j4398j4049j3537
$$ 806551 814605 820276 822833 821082 814666 804692 792744 779678 765733 751287 736889 722840 709303
61887G09303j2628j1359j0288r761r493r207r107r361r684r785r859j0204j0687
$$ 709303 696675 685316 675028 665267 655774 646567 637460 628099 618415 608630 598771 588567 577880
61874E77880j0925j0650r704q044o020m326l345k753j925m27J825M445O550P411
$$ 577880 566955 556305 546601 538557 532537 528211 524866 522113 520188 519761 521586 526031 532581 539992
61860E39992P328P423Q364R872J1579J3701J6473J9498K2098K3927K4974K5497
$$ 539992 547320 554743 563107 572979 584558 598259 614732 634230 656328 680255 705229 730726
61848G30726K6160K7588K9399L0293K9539K7699K5480K2576J8399J3254Q006K998
$$ 730726 756886 784474 813873 844166 873705 901404 926884 949460 967859 981113 989119 992117
61836I92117j832o174r603j2264j4391j5289j3862j0269o070k496O76M195Q053
$$ 992117 990285 984111 974508 962244 947853 932564 918702 908433 902363 899867 900543 904738 912791
61823I12791J1581J4234J5675J5427J3079Q873L723j445o279j0914j5492j9823
$$ 912791 924372 938606 954281 969708 982787 991660 995383 993938 987659 976745 961253 941430
61811I41430k3509k6266k7995k8586k7942k6318k4449k3080k2370k1820k0696
$$ 941430 917921 891655 863660 835074 807132 780814 756365 733285 710915 689095 668399
61800F68399j8554j5577j2551j0284q942q092p392o809o208n308m336m112m921
$$ 668399 649845 634268 621717 611433 602491 594399 587007 580198 573990 568682 564346 560234 555313
61787E55313n779n555m487l800l925l977l169j941j244j247j342j145r48j172
$$ 555313 549534 543979 539492 535692 531767 527790 524621 522680 521436 520189 518847 517702 516754 515582
61773E15582j744k151j960j187k63L14L61Q2j16K2M29Q81J341K030L030L971M334
$$ 515582 513838 511687 509727 508540 508277 508591 508952 509034 508918 508940 509369 510250 511591 513621 516651 520622 524956
61756E24956M118L845L864L888L446K473J298J81q34j805k798l858m850n453n480
$$ 524956 529074 532919 536783 540671 544117 546590 547888 548069 547235 545430 542632 538774 533924 528471 522991
61741E22991n113m647m110l344k436j832j933k513k710j758J11J726K165J715
$$ 522991 517878 513231 509121 505777 503341 501509 499576 497063 494353 492595 492706 494432 496597 498312
61727D98312J318J322J375J365J662K175K070R49k58k58J077K656L377K917J675
$$ 498312 499630 500952 502327 503692 505354 507529 509599 510548 510290 510032 511109 513765 517142 520059 521734
61712E21734M36r5Lj68j242k710l608l805l951m334m557m389m179m255m397m250
$$ 521734 522170 522075 522078 521910 520668 517958 514350 510545 506594 502260 497703 493314 489135 484880 480483 476233
61696D76233l860l589l670m033m325m150l529l033l187l742l926l445k813k587
$$ 476233 472373 468784 465114 461081 456756 452606 449077 446044 442857 439115 435189 431744 428931 426344
61682D26344k668k558k048j419j064j082j251j376j502j687j660j092l34k55j009
$$ 426344 423676 421118 419070 417651 416587 415505 414254 412878 411376 409689 408029 406937 406603 406348 405339
61667D05339j475n94J126K211K077J464J060O73O0l17J10J149K094K502K324J620
$$ 405339 403864 403270 404396 406607 408684 410148 411208 411881 411941 411624 411734 412883 414977 417479 419803 421423
61651D21423N90l29p31n96j90K74P87J490K477L439L670K850J776J672K605L232
$$ 421423 422013 421684 420953 420357 420167 420441 421228 422718 425195 428634 432304 435154 436930 438602 441207 444439
61635D44439K435O48q83j586j755j774j873k385l454m488m588l617k328j455j125
$$ 444439 446874 447522 446639 445053 443298 441524 439651 437266 433812 429324 424736 421119 418791 417336 416211
61620D16211j232j743k408k688k264j338l17N08Q04L02p37j654k405l792o084
$$ 416211 414979 413236 410828 408140 405876 404538 404221 404729 405533 405835 405098 403444 401039 397247 391163
61605C91163p915p557n181k859k127k500k697k438k244k182j852j369j341j841
$$ 391163 383248 375691 370510 367651 365524 363024 360327 357889 355645 353463 351611 350242 348901 347060
61591C47060k194k013j735j839k128k165j911j582j221q12m92l48k37j53l73r19
$$ 347060 344866 342853 341118 339279 337151 334986 333075 331493 330272 329460 328968 328620 328383 328230 327857 326938
61575C26938j189o32M28J168J242R76O55K13l56q09r43q02m51R2P01J152J412
$$ 326938 325749 325117 325545 326713 327955 328931 329586 329799 329443 328634 327691 326889 326438 326530 327231 328383 329795
61558C29795J670K014K294K319K083J723J415J202R34N02K46P14J798K512K096
$$ 329795 331465 333479 335773 338092 340175 341898 343313 344515 345449 345951 346197 346911 348709 351221 353317
61543C53317J036L88M20N52N34P34J219J412J038O71R40J677K312K655K785K537
$$ 353317 354353 354741 355161 355713 356247 356981 358200 359612 360650 361321 362261 363938 366250 368905 371690 374227
61527C74227J677L31j087k268k997l068k543j887j468j177q63p43r17q91k61L96
$$ 374227 375904 376235 375148 372880 369883 366815 364272 362385 360917 359740 358877 358134 357217 356326 356065 356461
61511C56461J61p63j151n32Q8j70o14l3J286J757O85p55j103l30N16P85O21K86
$$ 356461 356622 355859 354708 354176 354264 354094 353480 353447 354733 356490 357175 356420 355317 354987 355503 356288 356909 357195
61493C57195r2k12J82P19P12K13M8M84P03P4o45l31P55J261P36L02R96K341L080
$$ 357195 357103 356891 357073 357792 358504 358717 358765 359249 359952 360026 359381 359050 359805 361066 361802 362104 363100 365441 368521
61474C68521K777K007J312O86j6o92j112j136p32l4O05Q22N82J64j46k17mM28
$$ 368521 371298 373305 374617 375303 375287 374595 373483 372347 371615 371581 372186 373008 373590 373754 373608 373391 373387 373815
61456C73815P94P37K24m18q34q98n56L00J509K405K332J448O79O89J177J439J364
$$ 373815 374609 375346 375570 375152 374318 373420 372864 373164 374673 377078 379410 380858 381537 382226 383403 384842 386206
61439C86206J403J702J815J424R64J152K142L370M038L671K401R96L23N50J010
$$ 386206 387609 389311 391126 392550 393514 394666 396808 400178 404216 407887 410288 411284 411607 412157 413167
61424D13167J119J083J343J712J652J221J062J377J618J309P15L27J49j88q71
$$ 413167 414286 415369 416712 418424 420076 421297 422359 423736 425354 426663 427378 427705 427854 427666 426795
61409D26795j747k537k958k822k203j397o85k58l36j009j886k341k239j998j804
$$ 426795 425048 422511 419553 416731 414528 413131 412446 412188 411852 410843 408957 406616 404377 402379 400575
61394D00575j266j76Q99J294J140J020J045Q79M90K35K04J30L3K91R36J406J387
$$ 400575 399309 399133 400032 401326 402466 403486 404531 405410 405900 406135 406339 406469 406502 406793 407729 409135 410522
61377D10522J388K027L036L525L112K337J911J935J976J685J150P94J023J790
$$ 410522 411910 413937 416973 420498 423610 425947 427858 429793 431769 433454 434604 435398 436421 438211
61363D38211K468K333J369N23R22K719M913O325O666O521O491O648O814P067P658
$$ 438211 440679 443012 444381 444904 445826 448545 453458 459783 466449 472970 479461 486109 492923 499990 507648
61348E07648Q537R199R117Q216O879N576M467L383K166J041N93J130K098K415
$$ 507648 516185 525384 534501 542717 549596 555172 559639 563022 565188 566229 566822 567952 570050 572465
61334E72465J585K94m01l88o03j760l391m440m539m255m186m243l976l285k530
$$ 572465 574050 574344 573943 573555 572952 571192 567801 563361 558822 554567 550381 546138 542162 538877 536347
61319E36347k102k039k023j612n52J021K628L800M447M953N917P648R773J1422
$$ 536347 534245 532206 530183 528571 528019 529040 531668 535468 539915 544868 550785 558433 568206 579628
61305E79628J2008J1862J1839J2319J2744J2235J0437P700M617J657q77k799m104
$$ 579628 591636 603498 615337 627656 640400 652635 663072 670772 675389 677046 676169 673370 669266
61292F69266n035n970p065p978q176p685p246p456p940p791o762n426m237l010
$$ 669266 664231 658261 651196 643218 635042 627357 620111 612655 604715 596924 590162 584736 580499 577489
61278E77489j526n4J024J687K048K144K224K750L688M219L748K796K354K703L461
$$ 577489 575963 575909 576933 578620 580668 582812 585036 587786 591474 595693 599441 602237 604591 607294 610755
61263F10755M478N840P178P837P850Q034Q842R745R999R483Q497P155N422L420
$$ 610755 615233 621073 628251 636088 643938 651972 660814 670559 680558 690041 698538 705693 711115 714535
61249G14535J384n43k250l563m475n239o055o800p197p186o915o426n598m396
$$ 714535 715919 715376 713126 709563 705088 699849 693794 686994 679797 672611 665696 659270 653672 649276
61235F49276l084k090j625j538j575j634j635j224m6J696L294M329N020N603N816
$$ 649276 646192 644102 642477 640939 639364 637730 636095 634871 634825 636521 639815 644144 649164 654767 660583
61220F60583N359M565M111M243M633M806M526L953L703M330N405N657M481K838
$$ 660583 665942 670507 674618 678861 683494 688300 692826 696779 700482 704812 710217 715874 720355 723193
61206G23193J983J902J860J917K768M270N486O287P632R941J2368J4200J5851
$$ 723193 725176 727078 728938 730855 733623 737893 743379 749666 757298 767239 779607 793807 809658
61193H09658J7792J9369J9649J8741J7361J5570J2931R647O653M495K883J442
$$ 809658 827450 846819 866468 885209 902570 918140 931071 940718 947371 951866 954749 956191
61181I56191L19k79p11j687l432n338o649p416q431j0073j1616j2162j1940j1997
$$ 956191 956510 956231 955520 953833 950401 945063 938414 930998 922567 912494 900878 888716 876776 864779
61167H64779j2709j3435j3700j3896j4450j5051j5198j4946j4593j4146j3465
$$ 864779 852070 838635 824935 811039 796589 781538 766340 751394 736801 722655 709190
61156G09190j2556j1285r357o915m692l051j508L34J922K587K586K552K308J145
$$ 709190 696634 685349 675992 669077 664385 661334 659826 660160 662082 664669 667255 669807 672115 673260
61142F73260r39l239n352p259q460q140o435m623l593k801j237J173L650N637
$$ 673260 672321 669082 663730 656471 648011 639871 633436 628813 625220 622419 621182 622355 626005 631642
61128F31642P162Q383R343J0187J1244J2690J4372J6066J7801J9795K2049K4120
$$ 631642 638804 647187 656530 666717 677961 690651 705023 721089 738890 758685 780734 804854
61116H04854K5446K5960K6241K6898K7828K8288K7628K5906K3793K2014K0861
$$ 804854 830300 856260 882501 909399 937227 965515 993143 1019049 1042842 1064856 1085717
61105A085717K0066J9023J7206J4424J0844O829K744j229n144r063j2812j6083
$$ 1085717 1105783 1124806 1142012 1156436 1167280 1174109 1176853 1175624 1170480 1161417 1148605 1132522
61093A132522j8793k1116k3130k4614k5285k5068k4077k2554k0914j9609j8755
$$ 1132522 1113729 1092613 1069483 1044869 1019584 994516 970439 947885 926971 907362 888607
61082H88607j7981j6815j5145j3192j1224r419p855o490n195l891k605j341m6
$$ 888607 870626 853811 838666 825474 814250 804831 796976 790486 785291 781400 778795 777454 777408
61069G77408J279K570L820N131O563P983R113R695R797R936J0766J2427J4345
$$ 777408 778687 781257 785077 790208 796771 804754 813867 823562 833359 843295 854061 866488 880833
61056H80833J5870J6883J7638J8359J9288K0784K2904K5086K6738K7992K9395
$$ 880833 896703 913586 931224 949583 968871 989655 1012559 1037645 1064383 1092375 1121770
61045A121770L1129L2974L4801L6509L7774L8443L8973L9750M0395M0523M0766
$$ 1121770 1152899 1185873 1220674 1257183 1294957 1333400 1372373 1412123 1452518 1493041 1533807
61034A533807M1936M3462M4052M3851M4388M6130M7643M7853M7684M8566N0433
$$ 1533807 1575743 1619205 1663257 1707108 1751496 1797626 1845269 1893122 1940806 1989372 2039805
61023B039805N2174N3219N3702N3890N4283N5775N8953O3809P0578P9949R1846
$$ 2039805 2091979 2145198 2198900 2252790 2307073 2362848 2421801 2485610 2556188 2636137 2727983
61012B727983J04955J18261J32251J48161J67215J91457K24018K67471L22988
$$ 2727983 2832938 2951199 3083450 3231611 3398826 3590283 3814301 4081772 4404760
61003D404760L91862M76178N76810O92817Q25076R78982J161825J379224J634041
$$ 4404760 4796622 5272800 5849610 6542427 7367503 8346485 9508310 10887534 12521575
60994A2521575J918613K193322K371181K342142K038386J491384Q28385K11169
$$ 12521575 14440188 16633510 19004691 21346833 23385219 24876603 25704988 25916157
60986B5916157k30093m27073l76330j42713J39762L00034K02386j83482p69104
$$ 25916157 25686064 25258991 24882661 24739948 24879710 25179744 25382130 25198648 24429544
60977B4429544j399466j927142k260239k372145k289527k072651j791457j502789
$$ 24429544 23030078 21102936 18842697 16470552 14181025 12108374 10316917 8814128
60969H814128j239444j014032q28263o78507n58057m60029l80041l15883k65453
$$ 8814128 7574684 6560652 5732389 5053882 4495825 4035796 3655755 3339872 3074419
60960C074419k26096j95338j71178j51871j36087j22976j11584j00779r0107q0087
$$ 3074419 2848323 2652985 2481807 2329936 2193849 2070873 1959289 1858510 1768403 1688316
60950A688316p1109o2798n5012m8699m4855m3164m2456m2070m1973m1912m1278
$$ 1688316 1617207 1554409 1499397 1450698 1405843 1362679 1320223 1278153 1236180 1194268 1152990
60939A152990l9773l7577l4994l2434l0498k9470k8824k7698k5768k3403k1125
$$ 1152990 1113217 1075640 1040646 1008212 977714 948244 919420 891722 865954 842551 821426
60928H21426j9217j7673j6182j4442j2688j1513j0883r866p880n769m842n152
$$ 821426 802209 784536 768354 753912 741224 729711 718828 708962 701082 695313 690471 685319
60916F85319n476m988m182l861l901l473k219p70l0j87o22o99m13j39l0K1r9p59
$$ 685319 679843 674855 670673 666812 662911 659438 657219 656449 656419 656232 655610 654911 654498 654359 654329 654350 654251 653492
60898F53492k059l537m591n013n040n059n324n783o123o134n930n727n578n536
$$ 653492 651433 647896 643305 638292 633252 628193 622869 617086 610963 604829 598899 593172 587594 582058
60884E82058n814o345o544o034n396n517o306o786o491o023o017o288o221n491
$$ 582058 576244 569899 563355 557321 551925 546408 540102 533316 526825 520802 514785 508497 502276 496785
60870D96785m170k637j552j371j711j787j444j154r15o6J534L106M058M657N095
$$ 496785 492615 489978 488426 487055 485344 483557 482113 480959 480044 479978 481512 484618 488676 493333 498428
60855D98428M811L569K382K394L306L809L294K351J758J742K130K601K678K063
$$ 498428 503239 506808 509190 511584 514890 518699 521993 524344 526102 527844 529974 532575 535253 537316
60841E37316R88p7j001j989l167m418n479n985n708m989m596m787m929m401l516
$$ 537316 538304 538227 537226 535237 532070 527652 522173 516188 510480 505491 500895 496108 491179 486778 483262
60826D83262l010k975k918k667k550k688k752k598k600l119l862m172l825l331
$$ 483262 480252 477277 474359 471692 469142 466454 463702 461104 458504 455385 451523 447351 443526 440195
60812D40195l348l888m346m313m027l821l540k925k361k499l287l946l925l303
$$ 440195 436847 432959 428613 424300 420273 416452 412912 409987 407626 405127 401840 397894 393969 390666
60798C90666k333j304p88j187j879j781q71k50l80l92M01J380J774J869K145K169
$$ 390666 388333 387029 386241 385054 383175 381394 380523 380273 379893 379501 379902 381282 383056 384925 387070 389239
60782C89239J407N25N58J263J466Q75M21P49J442J801J645J175O75N05Q31J372
$$ 389239 390646 391171 391729 392992 394458 395333 395754 396503 397945 399746 401391 402566 403241 403746 404577 405949
60766D05949J754K031K398K592K183J275L90j77m14k35L01O41K91m11p22o38p80
$$ 405949 407703 409734 412132 414724 416907 418182 418572 418395 417981 417746 418047 418688 418979 418568 417846 417208 416428
60749D16428j296j578j233o25k53j69k35m81r88j737k664l606m250m418m296m092
$$ 416428 415132 413554 412321 411696 411443 411274 411039 410558 409570 407833 405169 401563 397313 392895 388599 384507
60733C84507l640k824k124k192k915l529l600l347k962k227j005L38J215J316
$$ 384507 380867 378043 375919 373727 370812 367283 363683 360336 357374 355147 354142 354480 355695 357011
60719C57011P75O4l45m04l98k94L54J541K355K079J318J273K112K911L054K769
$$ 357011 357786 357850 357505 357101 356703 356409 356763 358304 360659 362738 364056 365329 367441 370352 373406 376175
60703C76175K349J725J051Q25J173J628J849J945J925J520P70K25K35O08J148
$$ 376175 378524 380249 381300 382125 383298 384926 386775 388720 390645 392165 392935 393160 393395 394003 395151
60688C95151J904K615K651J875J001N91K84m32j153j005P5J155J397Q79K94K30
$$ 395151 397055 399670 402321 404196 405197 405788 406072 405640 404487 403482 403557 404712 406109 406988 407282 407512
60672D07512P95J635K191K058J261J62q98j834k733l530l905l660l174l089l430
$$ 407512 408307 409942 412133 414191 415452 415614 414716 412882 410149 406619 402714 399054 395880 392791 389361
60657C89361l405k457j117k56J40P69J739K398K420K302K430K504K253K005J955
$$ 389361 385956 383499 382382 382126 382266 383035 384774 387172 389592 391894 394324 396828 399081 401086 403041
60642D03041J549K80j287k173k334k585l195l486l003k279j973j871j386o39l21
$$ 403041 404590 404870 403583 401410 399076 396491 393296 389810 386807 384528 382555 380684 379298 378659 378338
60627C78338n29m69M75J848K667K517J737Q28O6l70m15k87l46o64r54q98m23L40
$$ 378338 377809 377340 377815 379663 382330 384847 386584 387412 387478 387108 386693 386406 386060 385396 384442 383544 383121 383461
60609C83461J083J435J293R50O46K23l82o08P4J111J327N30j69R7Q97J411J580
$$ 383461 384544 385979 387272 388222 388868 389091 388709 388101 388175 389286 390613 391143 390974 391071 391968 393379 394959
60592C94959J727J746J469J302J720K385K447J696P49K86N18J199J806J793J138
$$ 394959 396686 398432 399901 401203 402923 405308 407755 409451 410200 410486 411004 412203 414009 415802 416940
60577D16940M73M19R94J835K574K818K382J962K870N463Q446J0394J1336J2108
$$ 416940 417413 417832 418826 420661 423235 426053 428435 430397 433267 438730 447176 457570 468906 481014
60563D81014J2812J2969J2719J2584J2210J0558P460L958R28j749m356o577p918
$$ 481014 493826 506795 519514 532098 544308 554866 562326 566284 567212 565463 561107 554530 546612
60550E46612q341q087p276n929m092j825O33K809M368N477O473P386Q214R354
$$ 546612 538271 530184 522908 516979 512887 511062 511695 514504 518872 524349 530822 538208 546422 555776
60536E55776J1270J3862J6628J9140K1000K1701K1172J9953J8197J5090J0120
$$ 555776 567046 580908 597536 616676 637676 659377 680549 700502 718699 733789 743909
60525G43909M441j38l230n851q548j0732j1898j2317j2292j1676j0415q803p088
$$ 743909 748350 748212 744982 739131 730583 719851 707953 695636 683344 671668 661253 652450 645362
60512F45362n412m096l239k240n99J051J793K061L244N710Q522J1167J4219J8043
$$ 645362 639950 635854 632615 630375 629776 630827 632620 634681 637925 643635 652157 663324 677543 695586
60498F95586K2179K6432L1249L6546M1326M4998M7936N0203N0892M9387M6252
$$ 695586 717765 744197 775446 811992 853318 898316 946252 996455 1047347 1096734 1142986
60487A142986M2176L7019L0571K3269J5500P099j770j0246j8001k5843l4253m2218
$$ 1142986 1185162 1222181 1252752 1276021 1291521 1298620 1296850 1286604 1268603 1242760 1208507 1166289
60475A166289m8380n2532n5034n5689n4213n1186m7440m3063l7981l3001k9162
$$ 1166289 1117909 1065377 1010343 954654 900441 849255 801815 758752 720771 687770 658608
60464F58608k6404k3810k0931j8002j5174j2451j0184q836q272p908p466p040
$$ 658608 632204 608394 587463 569461 554287 541836 531652 522816 514544 506636 499170 492130
60452D92130o645o160n524m649l457k312j904k287k627k354k023k283k649k105
$$ 492130 485485 479325 473801 469152 465695 463383 461479 459192 456565 454211 452188 449905 447256 445151
60438D45151n75R60J559R88l53j583j828j121m83o12j020j013q40j095j555j533
$$ 445151 444576 445536 447095 448083 447730 446147 444319 443198 442715 442103 441083 440070 439230 438135 436580 435047
60422D35047r92l98K10J095J969K185J692J053O25L59K39K96L30L01O76J696K623
$$ 435047 434055 433657 433867 434962 436931 439116 440808 441861 442486 442845 443084 443380 443710 444011 444687 446383 449006
60405D49006K569J917J864K661L219K719J697J168J286J414J206J090J653K772
$$ 449006 451575 453492 455356 458017 461236 463955 465652 466820 468106 469520 470726 471816 473469 476241
60391D76241L604L580L170L253L858M175L824L298K968K534J943J882K658L389
$$ 476241 479845 483425 486595 489848 493706 497881 501705 505003 507971 510505 512448 514330 516988 520377
60377E20377L194K447K048K141K418K984L858M247L617K892L255M090L630J648
$$ 520377 523571 526018 528066 530207 532625 535609 539467 543714 547331 550223 553478 557568 561198 562846
60363E62846o2j21Q52J583J872K299L033L701M086M401N035O180P564Q601R079
$$ 562846 562784 562663 563515 565098 566970 569269 572302 576003 580089 584490 589525 595705 603269 611870 620949
60348F20949R432R917R905Q646O475M392K628N19k223n003p183q641r353r220
$$ 620949 630381 640298 650203 658849 665324 669716 672344 672863 670640 665637 658454 649813 640460 631240
60334F31240q517p793p118o033m437k961k290k545l409m367m769m349l665l554
$$ 631240 622723 614930 607812 601779 597342 594381 592091 589546 586137 581770 577001 572652 568987 565433
60320E65433m035m317l888k932j749l48J276L054N055P179Q850R657J0254J1721
$$ 565433 561398 557081 553193 550261 548512 548164 549440 552494 557549 564728 573578 583235 593489 605210
60306F05210J4013J5964J6952J7562J8356J8846J8258J6521J3970J0634O394J451
$$ 605210 619223 635187 652139 669701 688057 706903 725161 741682 755652 766286 772680 774131
60294G74131l830r235j4479j8912k1730k2441k1129j8530j5729j3418j1411r278
$$ 774131 770301 761066 746587 727675 705945 683504 662375 643845 628116 614698 603287 594009
60282E94009p262o087n986o458o893o895o133m636l178k673l094l668m009m284
$$ 594009 586747 580660 574674 568216 561323 554428 548295 543659 540481 537808 534714 531046 527037 522753
60268E22753m315l560k156j072r05j244j519j679j782j656j303r73n92J16Q22
$$ 522753 518438 514878 512722 511650 510745 509501 507982 506303 504521 502865 501562 500589 499997 500113 500935
60253E00935P69O1j90N88J614K006J957K007K015J581R09M81L57M36Q00J232R81
$$ 500935 501704 501765 501575 502163 503777 505783 507740 509747 511762 513343 514252 514733 515090 515526 516326 517558 518539
60236E18539k84j714k171j485j95J339K833L647L451K986L245L986M078L212K370
$$ 518539 518255 516541 514370 512885 512690 514029 516862 520509 523960 526946 530191 534177 538255 541467 543837
60221E43837K398K985L423L663M131M940N772O426O979P471P765P810P854Q075
$$ 543837 546235 549220 552643 556306 560437 565377 571149 577575 584554 592025 599790 607600 615454 623529
60207F23529Q118P400O057N137N442O452O979O700O308O153N598M092K124N99
$$ 623529 631647 639047 645104 650241 655683 662135 669114 675814 682122 688275 693873 697965 700089 700688
60193G00688k52q09j319j761k230k898l668m234m484m639m984n568o080o046n343
$$ 700688 700436 699627 698308 696547 694317 691419 687751 683517 679033 674394 669410 663842 657762 651716 646373
60178F46373m434l865l622l425l352l607l772l177k065j423j448j155m0R09N93
$$ 646373 641939 638074 634452 631027 627675 624068 620296 617119 615054 613631 612183 611028 610988 611897 612490
60163F12490n78j404j599j770k084k036j430o70k7N96J156J411J450J634J937
$$ 612490 611912 610508 608909 607139 605055 603019 601589 600919 600892 601488 602644 604055 605505 607139 609076
60148F09076J912J466J136J312J691J753J513J540K340L795N129N554N121M770
$$ 609076 610988 612454 613590 614902 616593 618346 619859 621399 623739 627534 632663 638217 643338 648108
60134F48108N246O172O580O215N732N623N497M729L372K096J426J360J629K022
$$ 648108 653354 659526 666106 672321 678053 683676 689173 693902 697274 699370 700796 702156 703785 705807
60120G05807K491L078L789M426M628M210L449K842K487J976J013k4n20n25p59
$$ 705807 708298 711376 715165 719591 724219 728429 731878 734720 737207 739183 740196 740172 739652 739127 738368
60105G38368j671k950m166n326o409o916o516n812n660n932n703m631l330k297
$$ 738368 736697 733747 729581 724255 717846 710930 704414 698602 692942 687010 681307 676676 673346 671049
60091F71049j321k10P05J148J339J444J220O07J33J47J94l20j249j949k181k212
$$ 671049 669728 669518 670223 671371 672710 674154 675374 675981 676114 676261 676455 676135 674886 672937 670756 668544
60075F68544k356k822l739m911n832o348o946p884q531q124o948n999n644n356
$$ 668544 666188 663366 659627 654716 648884 642536 635590 627706 619175 611051 604103 598104 592460 587104
60061E87104m709l960l491l336l437l830m258m085k964j342pP59J328K123L141
$$ 587104 582395 578435 574944 571608 568171 564341 560083 555998 553034 551692 551685 552444 553772 555895 559036
60046E59036M056M583M709M627M558M591M660M658M571M462M271L768K915K161
$$ 559036 563092 567675 572384 577011 581569 586160 590820 595478 600049 604511 608782 612550 615465 617626
60032F17626J932J801P12j622m076n374n628n919o634p122o967o694o913p534
$$ 617626 619558 621359 622071 620449 616373 610999 605371 599452 592818 585696 578729 572035 565122 557588
60018E57588q164q676r005q874q201p318o526n717m784l941l336k742j965j169
$$ 557588 549424 540748 531743 522869 514668 507350 500824 495107 490323 486382 483046 480304 478339 477170
60004D77170n03J74Q48J065N27l37q06n81J76J166J970K163J851J833K661L853
$$ 477170 476667 476841 477689 478754 479281 478944 478138 477557 477733 478899 480869 483032 484883 486716 489377 493230
59988D93230M446M166L636L535L892M191L846K676J062l74j343k009k601l152
$$ 493230 497676 501842 505478 509013 512905 517096 520942 523618 524680 524306 522963 520954 518353 515201
59974E15201l669m127m285l849k995k240j814j529j281j106p26K06J312J717J327
$$ 515201 511532 507405 503120 499271 496276 494036 492222 490693 489412 488306 487580 487786 489098 490815 492142
59959D92142J088J578K212K328K172K232K240J627M33q52j764j773m66J507K471
$$ 492142 493230 494808 497020 499348 501520 503752 505992 507619 508052 507200 505436 503663 503197 504704 507175
59944E07175J594N0n42j75K4l66q74j354k060k715k727k189j650r65M31K191L241
$$ 507175 508769 508819 508277 508102 508126 507760 506886 505532 503472 500757 498030 495841 494191 493226 493657 495848 499089
59927D99089L412L723M707N664N951N933O086O060N335M108K848J520p8j553k150
$$ 499089 502501 506224 510931 516595 522546 528479 534565 540625 545960 550068 552916 554436 554358 552805 550655
59912E50655j563j09J643L084L687L362K630K115J939J838J674J550J480J235
$$ 550655 549092 548983 550626 553710 557397 560759 563389 565504 567443 569281 570955 572505 573985 575220
59898E75220O87J84M00J625L276M384M590M428M426M415M050L662M050N389O872
$$ 575220 575907 576091 576491 578116 581392 585776 590366 594794 599220 603635 607685 611347 615397 620786 627658
59883F27658P523P137O342N880N898N914N523M956M645M352L373J687J82o75j625
$$ 627658 635181 642318 648660 654540 660438 666352 671875 676831 681476 685828 689201 690888 691070 690395 688770
59868F88770l431n512o616o443n760n167m633m143l904l806l421k683j983j515
$$ 688770 685339 679827 673211 666768 661008 655841 651208 647065 643161 639355 635934 633251 631268 629753
59854F29753j133q34p66o18L32K264M470O229P598R032J0545J1594J1640J0608
$$ 629753 628620 627786 627020 626402 626734 628998 633468 639697 647295 656327 666872 678466 690106 700714
59840G00714Q818O570L949J121j215k073j111R30K869L835L440J730o22k673m192
$$ 700714 709532 716102 720051 721172 719957 717884 716773 717703 720572 724407 727847 729577 728955 726282 722090
59825G22090n796p707r113r350q991q856q636p591o183n621o059o478o394o387
$$ 722090 716294 708587 699474 690124 681133 672277 663641 656050 649867 644246 638187 631709 625315 618928
59811F18928o722o724o016n282n169n231m627l253j679m13K83L09p0l34k83k28
$$ 618928 612206 605482 599466 594184 589015 583784 579157 575904 574225 573812 574095 574404 574334 574000 573717 573489
59795E73489l86n56n83o72r29j068q97o58o11n89l94k34m40r18j240j164q81p36
$$ 573489 573103 572547 571964 571292 570363 569295 568398 567740 567129 566540 566146 565912 565472 564554 563314 562150 561269 560533
59777E60533q30r33p92n13m59o43n83N1R11J479J767K076K402K565K709L039L305
$$ 560533 559703 558770 557978 557465 557006 556363 555780 555831 556742 558221 559988 562064 564466 567031 569740 572779 576084
59760E76084L170K897L054L641M197M602N055N400N310N115N629O972Q292Q761
$$ 576084 579254 582151 585205 588846 593043 597645 602700 608100 613410 618525 624154 631126 639418 648179
59746F48179Q285P141N650M331L724L780L926L802L442K797J763O95K13M19Q42
$$ 648179 656464 663605 669255 673586 677310 681090 685016 688818 692260 695057 696820 697515 697728 698147 698989
59731F98989J163J335J119K81p10j047p27n35q61j348j762k259k705k666k326
$$ 698989 700152 701487 702606 702887 702177 701130 700403 699868 699007 697659 695897 693638 690933 688267 685941
59716F85941k429l033l294k808k191j979j878j599j433j460j106j08Q76J266J387
$$ 685941 683512 680479 677185 674377 672186 670207 668329 666730 665297 663837 662731 662623 663499 664765 666152
59701F66152J700J984J990K109K680L238L268L106L337L689L400K317R62k12j046
$$ 666152 667852 669836 671826 673935 676615 679853 683121 686227 689564 693253 696653 698970 699932 699720 698674
59686F98674j480j642j880k222k224j813j762k712m081m695m336l958m435n610
$$ 698674 697194 695552 693672 691450 689226 687413 685651 682939 678858 674163 669827 665869 661434 655824
59672F55824o647o923o507n862n220m362l143j957j244q03k13L26L28J18N83J758
$$ 655824 649177 642254 635747 629885 624665 620303 617160 615203 613959 613156 612943 613269 613597 613715 614298 616056
59656F16056K653K725K547K663K883L053L506M179M240L282J936P56n73k249l708
$$ 616056 618709 621434 623981 626644 629527 632580 636086 640265 644505 647787 649723 650479 649906 647657 643949
59641F43949m715o023p913r148q580o919n685n094m291l058j890q05M76J444J212
$$ 643949 639234 633211 625298 616150 607570 600651 594966 589872 585581 582523 580633 579828 580304 581748 582960
59626E82960n9j347k247l144l989m163l691l454l932m645n013m922m360l338k305
$$ 582960 582901 581554 579307 576163 572174 568011 564320 560866 556934 552289 547276 542354 537994 534656 532351
59611E32351j774j443m98J054K220K437K292K559L195L636L522K833J765P72K38
$$ 532351 530577 529134 528636 529690 531910 534347 536639 539198 542393 546029 549551 552384 554149 554921 555159
59596E55159R5R8M41J452K687L095K302J060K00k14m75p12j113k021l271l971
$$ 555159 555254 555352 555793 557245 559932 563027 565329 566389 566589 566375 565900 565188 564075 562054 558783 554812
59580E54812l551k596k129k320k547k512k554k800k718j844n95J55J82J08M96
$$ 554812 551261 548665 546536 544216 541669 539157 536603 533803 531085 529241 528646 528801 528983 529091 529587
59565E29587J071J170N97k26q10r92q23m70j50J05N61J382K190K367J722N78o22
$$ 529587 530658 531828 532425 532199 531389 530397 529574 529104 528954 529059 529620 531002 533192 535559 537281 537859 537237
59548E37237j333r11P55K753M052M814N990P724R202J0228J1786J4615J8052K0774
$$ 537237 535904 534993 535748 538501 542553 547367 553357 561081 570283 580511 592297 606912 624964 645738
59534F45738K1667J9725J4285O262j741p409j0257j0870r678p207m471k071K97
$$ 645738 667405 687130 701415 707677 705936 698527 688270 677400 667722 660515 656044 653973 654270
59521F54270K625L874L472K493K026J367p51l801o088p203q098r036r191q375
$$ 654270 656895 660769 664241 666734 668760 670127 669376 665575 659487 652284 644186 635150 625959 617584
59507F17584p494p118o972o956p266p339o154l954k321k099k518k735k897l118
$$ 617584 610090 602972 596000 589044 581778 574439 568285 564331 562010 559911 557393 554658 551761 548643
59493E48643k765j588m86k34l57r3L77N63Q21J842L405M515M602L958L219K888
$$ 548643 545878 544290 543804 543570 543213 543120 543497 544060 544881 546723 550128 554643 559245 563203 566422 569310
59477E69310L196L972M816N605O482P183O921N440L608K478K082J705J076O25
$$ 569310 572506 576478 581294 586899 593381 600564 607485 612925 616533 619011 621093 622798 623874 624499
59463F24499O76Q78O90K13L05J733M162O273P166P378Q019R205J0006R854R129
$$ 624499 625175 626053 626743 626956 627261 628994 633156 639429 646595 653973 661992 671197 681203 691057 700186
59448G00186Q282P229N977M948M172K838K86k964n812p766q997r574r364q507
$$ 700186 708468 715697 721674 726622 730794 733632 733918 730954 725142 717376 708379 698805 689441 680934
59434F80934p358o008m443l070k523k769k945k284q71P71K478M524P076R911J2691
$$ 680934 673576 667568 663125 660055 657532 654763 651818 649534 648663 649434 651912 656436 663512 673423 686114
59419F86114J5171J7171J8678K0028K1728K3819K5818K7500K9133L0228K8578
$$ 686114 701285 718456 737134 757162 778890 802709 828527 856027 885160 915388 943966
59408I43966K1890J0664j548j1276j7613k1131k1670j8507j2118m334L081Q861
$$ 943966 965856 976520 974972 963696 946083 924952 903282 884775 872657 868323 871404 880265
59396H80265J1425R187K231p139j6011k2503k5807k5764k3105j9374j5820j2584
$$ 880265 891690 900877 903108 895969 879958 857455 831648 805884 782779 763405 747585 735001
59384G35001r377o526m685l797l050j924q56o02j210j952k136j749j161n32K12
$$ 735001 725624 719098 714413 710616 707566 705642 704786 704184 702974 701022 698886 697137 695976 695444 695656
59369F95656R19J258J297J495K024K477K545K490K689L183L949N074O349P246
$$ 695656 696575 697833 699130 700625 702649 705126 707671 710161 712850 716033 719982 725056 731405 738651
59355G38651P840R045J1290J3619J4918J5507J6504J8009J9022J9031J8638J8551
$$ 738651 746491 755536 766826 780445 795363 810870 827374 845383 864405 883436 902074 920625
59343I20625J8796J8942J8420J6623J3473R776O397L190m81m417p787j0564j3632
$$ 920625 939421 958363 976783 993406 1006879 1016655 1023052 1026242 1025761 1021344 1013557 1002993 989361
59330I89361j7255k0415k2015k1986k1031j9904j9173j8942j8676j7798j6433
$$ 989361 972106 951691 929676 907690 886659 866755 847582 828640 809964 792166 775733
59319G75733j5043j3531j1631r888r172r154q566p094n813n433n426n353n720
$$ 775733 760690 747159 735528 725640 716468 707314 698748 691654 685841 680408 674982 669629 663909
59306F63909o617o739m854j581J333L033L969M792N839P526J0262J3758J6899
$$ 663909 657292 650553 645699 644118 645451 648484 652453 657245 663084 670610 680872 694630 711529
59293G11529J8395J7338J3383O925p85q020j3304j6018j6469j5427j3463j0750
$$ 711529 729924 747262 760645 767570 766785 758765 745461 729443 712974 697547 684084 673334
59281F73334p464m006o83K424M958O287O569P159R106J1719J3645J4786J5935
$$ 673334 665870 661864 661181 663605 668563 674850 681419 688578 697684 709403 723048 737834 753769
59268G53769J6935J6782J5470J4097J2900J0852P681M678K696Q57j786m604o560
$$ 753769 770704 787486 802956 817053 829953 840805 848486 853164 855860 856717 854931 850327 843767
59255H43767p953r636j1296j1784j0763q966p160n744m967m672m072k618p79P26
$$ 843767 835814 826178 814882 803098 792335 783369 776209 770465 765498 760826 756754 754136 753357 754083
59241G54083K042L693N392O272O186N864N767N582M949M060L260K429J052j189
$$ 754083 756125 759818 765210 771482 777668 783532 789299 794881 799830 803890 807150 809579 810631 809442
59227H09442l933o294p687q532r787j1713j3433j3892j2953j1413j0221r774r658
$$ 809442 805509 799215 791528 782996 773209 761496 748063 734171 721218 709805 699584 689810 680152
59214F80152r050p727o442n858n453m308k799k241k856l283k565j355n60M5J029
$$ 680152 671102 663375 656933 651075 645622 641314 638515 636274 633418 630135 627570 626215 625655 625700 626729
59199F26729K126K754L015L269L390L247L270L679L793L049K185K341L407M245
$$ 626729 628855 631609 634624 637893 641283 644530 647800 651479 655272 658321 660506 662847 666254 670499
59185F70499M273L840L313K759K461K761L302L174K042N27n70r78q36l38L60J167
$$ 670499 674772 678612 681925 684684 687145 689906 693208 696382 698424 698951 698381 697403 696567 696229 696589 697756
59169F97756K061K962L704M229M584M648M149L147K098J308O40o5q01j749l323
$$ 697756 699817 702779 706483 710712 715296 719944 724093 727240 729338 730646 731286 731221 730420 728671 725348
59154G25348n539p815r629j0885j1434j1005r854q846q413q050p254o361n901
$$ 725348 719809 711994 702365 691480 680046 669041 659187 650341 641928 633878 626624 620263 614362
59141F14362n744n387m678l796k988k675l211m185m537l758k392j092Q2J074J506
$$ 614362 608618 603231 598553 594757 591769 589094 585883 581698 577161 573403 571011 569919 570001 571075 572581
59126E72581J442J654K504L420M112N294P426R567J0490J0290R992J0211J0974
$$ 572581 574023 575677 578181 581601 585713 591007 598433 608000 618490 628780 638772 648983 659957
59113F59957J2207J3455J3767J2815J1515J0670R711P866N833M937N084M941L867
$$ 659957 672164 685619 699386 712201 723716 734386 744097 751963 757796 762733 767817 772758 776625
59100G76625K463J287K43p80j691k717m176n615o052n207l836k733k034j518j028
$$ 776625 779088 780375 780618 779838 778147 775430 771254 765639 759587 754380 750544 747811 745777 744259 743231
59085G43231n53l83r93k430m028n179o017o885p588p758p541p297o993o507o128
$$ 743231 742678 742295 741302 738872 734844 729665 723648 716763 709175 701417 693876 686579 679586 673079 666951
59070F66951o068n932n307m480l966l715l463l274l124k605j766j502k234k915
$$ 666951 660883 654951 649644 645164 641198 637483 634020 630746 627622 625017 623251 621749 619515 616600
59056F16600k445j392j104j727k348k664l074l380k775j199M13J319J450R13n
$$ 616600 614155 612763 611659 609932 607584 604920 601846 598466 595691 594492 594905 596224 597674 598587 598582
59041E98582n06r3N05K04o89q52L9Q45O93R2J3P28J877L018L928M845O296Q303
$$ 598582 598076 597983 598488 598692 598003 597151 597190 598035 598728 598820 598833 599561 601438 604456 608384 613229 619525 627828
59023F27828J0087J1163J2116J3511J4611J4295J2736J0945R070O485L323N45
$$ 627828 637915 649078 661194 674705 689316 703611 716347 727292 736362 742847 746170 746715
59011G46715j502l310m940n794n687m995l767j860J04J210J763K957M970O692
$$ 746715 745213 741903 736963 731169 725482 720487 716720 714860 714964 716174 717937 720894 725864 732556
58997G32556P476P738P568O316M110K330J812J764J220M51R9j56j033k397l417
$$ 732556 740032 747770 755338 761654 765764 768094 769906 771670 772890 773341 773440 773284 772251 769854 766437
58982G66437l609l118k333j592j006k31J178L126N057O700Q116R120R400R317
$$ 766437 762828 759710 757377 755785 754779 754548 755726 758852 763909 770609 778725 787845 797245 806562
58968H06562R676J0581J1260J1278J1101J1239J1533J1625J1338J0359Q278N282
$$ 806562 816238 826819 838079 849357 860458 871697 883230 894855 906193 916552 924830 930112
58956I30112K226l62k779n516q641j1918j4973j7212j8251j8498j8709j8859j8153
$$ 930112 932338 931976 929197 923681 915040 903122 888149 870937 852686 834188 815479 796620 778467
58943G78467j6211j3607j1074q910p236o182n561m905m006l030k161j583j588
$$ 778467 762256 748649 737575 728665 721429 715247 709686 704781 700775 697745 695584 694001 692413
58930F92413k101k373j802q76m83o41p29o72q15r22m85O4l15j637k690k569j441
$$ 692413 690312 687939 686137 685261 684778 684137 683408 682736 681921 680999 680514 680578 680263 678626 675936 673367 671926
58913F71926J93J907K956K765K023K232L811N687O903P687Q639R876J1262J2629
$$ 671926 672119 674026 676982 679747 681770 684002 687813 693500 700403 708090 716729 726605 737867 750496
58899G50496J3639J4116J4491J5069J5197J4236J2995J2844J3626J4131J4477
$$ 750496 764135 778251 792742 807811 823008 837244 850239 863083 876709 890840 905317
58888I05317J6141J9306K2128K3242K3268K2959K1587J8237J3496Q666M344O04
$$ 905317 921458 940764 962892 986134 1009402 1032361 1053948 1072185 1085681 1094347 1098691 1099295
58876A099295k361m709p228j0340j3499j6086j7990j8896j8145j5895j3414j1577
$$ 1099295 1096934 1092225 1084997 1074657 1061158 1045072 1027082 1008186 990041 974146 960732 949155
58864I49155j0067q628p871q108q591q743r068r978j0859j1194j1581j2450j2856
$$ 949155 939088 930460 922589 914481 905890 897147 888079 878101 867242 856048 844467 832017 819161
58851H19161j1794r976q961r030r201q965q765q862q855q478q101q140q467q581
$$ 819161 807367 797391 788430 779400 770199 761234 752469 743607 734752 726274 718173 710033 701566 692985
58837F92985q196p528p011o712o269n559m982m709m156k964j861j515j093N89
$$ 692985 684789 677261 670250 663538 657269 651710 646728 642019 637863 634899 633038 631523 630430 631019
58823F31019K880L861L116K233K350K868L074L374M172M914M995M487L479J928
$$ 631019 633899 637760 640876 643109 645459 648327 651401 654775 658947 663861 668856 673343 676822 678750
58809F78750N58M74J297J235l53j957k270j971k182k714k980l272l911m265l904
$$ 678750 679308 679782 681079 682314 681961 680004 677734 675763 673581 670867 667887 664615 660704 656439 652535
58794F52535l617m153m860m818m339m150l998l184j760j32J711L636M851M963
$$ 652535 648918 644765 639905 635087 630748 626598 622600 619416 617656 617524 619235 622871 627722 632685
58780F32685M753N049N577N769N772N827N533M624L489K158j35l430o295p631
$$ 632685 637438 642487 648064 653833 659605 665432 670965 675589 679078 681236 681101 677671 671376 663745
58766F63745q063q418q162o695n004m377m398l800k620j871j646j140j73O73J202
$$ 663745 655682 647264 639102 632407 627403 623026 618628 614828 612208 610337 608691 607551 607378 608051 609253
58751F09253J651J855J532J157J492K463L289L556L447L330L708N060P081Q643
$$ 609253 610904 612759 614291 615448 616940 619403 622692 626248 629695 633025 636733 641793 648874 657517
58737F57517R073Q805Q350P579O555N961O012N967N496N294N593N420M290L262
$$ 657517 666590 675395 683745 691324 697879 703840 709852 715819 721315 726609 732202 737622 741912 745174
58723G45174L152L101K224J395J782K929L809M724O420Q272R102Q941Q410P210
$$ 745174 748326 751427 753651 755046 756828 759757 763566 768290 774710 782982 792084 801025 809435 816645
58709H16645M902K347O16q25l147o077q505j0493j2840j5170j6401j6751j7505
$$ 816645 821547 823894 824510 823685 820538 814461 805956 795463 782623 767453 751052 734301 716796
58696G16796j8909j9946j9933j8891j6691j3417j0340q834q499p809o415n280
$$ 716796 697887 677941 658008 639117 622426 609009 598669 589835 581336 573527 567112 561832
58684E61832m770m234l506l233l572l880l762l332k471j034L52Q65Q75J572L279
$$ 561832 557062 552828 549322 546089 542517 538637 534875 531543 529072 528038 528390 529255 530130 531702 534981
58669E34981N139O460P387Q344R600J1305J3207J4593J5000J4489J2776R118L838
$$ 534981 540120 546580 553967 562311 571911 583216 596423 611016 626016 640505 653281 662399 666237
58656F66237j124m279o227q074r425r418q623q224q050p195n836m843m143l133
$$ 666237 665113 660834 654607 646533 637108 627690 619067 610843 602793 595598 589762 584919 580776 577643
58642E77643k096j549q36Q35K615L117K786L258M696N686N609N222M953M356L374
$$ 577643 575547 573998 573162 573997 576612 579729 582515 585773 590469 596155 601764 606986 611939 616295 619669
58627F19669K494J644L30j139j897j922k030k562l200l737l934l138j272M33R91
$$ 619669 622163 623807 624137 622998 621101 619179 617149 614587 611387 607650 603716 600578 599306 599739 600730
58612F00730J279K632M607N619N194M008K388M44r91j236j052j474k064j927j577
$$ 600730 602009 604641 609248 614867 620061 624069 626457 626901 625910 624674 623622 622148 620084 618157 616580
58597F16580j989k664k551k087k204k148n96J782L173L511M182N447O477P543
$$ 616580 614591 611927 609376 607289 605085 602937 602341 604123 607296 610807 614989 620436 626913 634456
58583F34456R598J2053J3386J3637J3947J3927J2174R199P167O701O435N866O081
$$ 634456 644054 656107 669493 683130 697077 711004 723178 732377 739544 746245 752680 758546 764627
58570G64627P448R037J0623J2966J5916J8429K0572K3268K6078K7528K7684K7916
$$ 764627 772075 781112 791735 804701 820617 839046 859618 882886 908964 936492 964176 992092
58558I92092K8152K6847K3756K0068J5821R935L085k327n544q113j0654j1779
$$ 992092 1020244 1047091 1070847 1090915 1106736 1116671 1119756 1117429 1111885 1103772 1093118 1081339
58546A081339j0876r314q143p102o531p675j0371j2911j4896j7653k1203k3591
$$ 1081339 1070463 1061149 1053006 1045904 1039373 1031698 1021327 1008416 993520 975867 954664 931073
58534I31073k4023k3847k3546k1646j7841j4346j2591j1150q617o155n308n415
$$ 931073 907050 883203 859657 838011 820170 805824 793233 782083 773466 767311 762003 756588
58522G56588m956l876k882j929q58l32q68j940k838l348l242k430j790k314l323
$$ 756588 751632 747756 744874 742945 742087 741755 740887 738947 736109 732761 729519 727089 725299 722985 719662
58507G19662l313k472k246k565j920l78K69l23m79L30N99k54q10l86j10l80N6
$$ 719662 716349 713877 711631 709066 707146 706768 707037 706714 706235 706565 707164 706910 706100 705714 705604 705224 705280
58490G05280J526K624K928L811N598O714O681P184Q982J0718J1865J3906J7148
$$ 705280 706806 709430 712358 716169 721767 728481 735162 742346 751328 762046 773911 787817 804965
58477H04965J9420J9459J8707J8056J5860J1056N495J112k680o824j0374j2372
$$ 804965 824385 843844 862551 880607 896467 907523 913018 914130 911450 904626 894252 881880
58465H81880j3569j4394j3593j0719p588n406k920P85M156N924P418J0007J2556
$$ 881880 868311 853917 840324 829605 822017 816611 813691 814476 818632 824556 831974 841981 854537
58452H54537J3658J4083J4757J4419J1623P219K746j748o417j0108j2041j3106
$$ 854537 868195 882278 897035 911454 923077 930296 933042 931294 924877 914769 902728 889622
58440H89622j3725j2673r667o847n720m930l018r92p8O55K246L649L906M247N863
$$ 889622 875897 863224 853557 846710 840990 836060 833042 832050 831972 832627 834873 838522 842428 846675 852538
58425H52538P656Q442R068J0224J0390Q372N634L678J408k458o515q761r636j0447
$$ 852538 860194 868636 877704 887928 898318 906690 912324 916002 917410 914952 908437 899676 890040 879593
58411H79593j0744r807q811r016r497q894p711o819n676l973k950k987k243K85
$$ 879593 868849 859042 850231 841215 831718 822824 815113 808294 802618 798645 795695 792708 790465 790750
58397G90750K733L538M020N447O380N561M635N219N822M767L522M014N035M609
$$ 790750 793483 797021 801041 806488 812868 818429 823064 828283 834105 838872 842394 846408 851443 856052
58383H56052L650L983M796M436L698M095M733M075K980L024L630L715M194N865
$$ 856052 859702 863685 868481 872917 876615 880710 885443 889518 892498 895522 899152 902867 907061 912926
58369I12926P042O321N535O846R044R934J0134J1281J2631J2820J2897J4127J4941
$$ 912926 919968 926289 931824 938670 947714 957648 967782 979063 991694 1004514 1017411 1031538 1046479
58356A046479J3378J0641Q850P441N058K817K197J915L62j038l95J010J238J469
$$ 1046479 1059857 1070498 1079348 1086789 1091847 1094664 1096861 1098776 1099138 1098100 1097705 1098715 1099953 1101422
58342A101422L602O362P611Q240J0080J2195J3028J3835J6118J8165J8024J7381
$$ 1101422 1105024 1111386 1118997 1127237 1137317 1149512 1162540 1176375 1192493 1210658 1228682 1246063
58330A246063J8370J9214J7320J4114J2266J0760P396L654K276K301J315K72J239
$$ 1246063 1264433 1283647 1300967 1315081 1327347 1338107 1345503 1349157 1351433 1353734 1355049 1355321 1356560
58317A356560K716K228J247K501M733N267N379P800J1151J2302J2127J3390J5113
$$ 1356560 1359276 1361504 1362751 1365252 1369985 1375252 1380631 1388431 1399582 1411884 1424011 1437401 1452514
58304A452514J4684J3470J4606J7154J8078J7961J9083K0048J8331J6022J6831
$$ 1452514 1467198 1480668 1495274 1512428 1530506 1548467 1567550 1587598 1605929 1621951 1638782
58293A638782J9389J9745J8484J9001K0689K0483J9429K0907K3876K4598K3646
$$ 1638782 1658171 1677916 1696400 1715401 1736090 1756573 1776002 1796909 1820785 1845383 1869029
58282A869029K4648K7483K9241L0342L3100L5976L5950L4883L6715M0182M1294
$$ 1869029 1893677 1921160 1950401 1980743 2013843 2049819 2085769 2120652 2157367 2197549 2238843
58271B238843M1021M3194M6762M7706M6899M8371N1568N2982N3635N7009O1498
$$ 2238843 2279864 2323058 2369820 2417526 2464425 2512796 2564364 2617346 2670981 2727990 2789488
58260B789488O2981O2903O5513O9188O9144O6647O6690O8655O8319O6976O9128
$$ 2789488 2852469 2915372 2980885 3050073 3119217 3185864 3252554 3321209 3389528 3456504 3525632
58249C525632P3283P4874P5992Q2083R1252R7329J01324J08874J18714J25171
$$ 3525632 3598915 3673789 3749781 3831864 3923116 4020445 4121769 4230643 4349357 4474528
58239D474528J29866J38967J50852J58837J64228J73894J86833J96436K04267
$$ 4474528 4604394 4743361 4894213 5053050 5217278 5391172 5578005 5774441 5978708
58230E978708K17778K36012K51721K66046K86383L11420L33722L55404L85122
$$ 5978708 6196486 6432498 6684219 6950265 7236648 7548068 7881790 8237194 8622316
58221H622316M21130M54220M85997N26699N76552O27728O83035P53046Q36275
$$ 8622316 9043446 9497666 9983663 10510362 11086914 11714642 12397677 13150723 13986998
58212A3986998R22985J017065J132282J268679J416365J581080J780921K019735
$$ 13986998 14909983 15927048 17059330 18328009 19744374 21325454 23106375 25126110
58204B5126110K291320K608829L000986L481439M054605M750958N621946O701207
$$ 25126110 27417430 30026259 33027245 36508684 40563289 45314247 50936193 57637400
58196E7637400Q007180R578820J1465010J3685191J6253913J9241599K2756199
$$ 57637400 65644580 75223400 86688410 100373601 116627514 135869113 158625312
58189A58625312K6868016L1567601L6625867M1179952M3387984M0897767L2233565
$$ 158625312 185493328 217060929 253686796 294866748 338254732 379152499 411386064
58182D11386064J8043835J036677j5325099k8232414l6213511l9187505l8224836
$$ 411386064 429429899 430466576 415141477 386909063 350695552 311508047 273283211
58175B73283211l5025558l1162759k7525159k4326555k1479151j8868171j6404592
$$ 273283211 238257653 207094894 179569735 155243180 133764029 114895858 98491266
58168I8491266j4042836j1827206r858888q192775o806740n663880m745551m019115
$$ 98491266 84448430 72621224 62762336 54569561 47762821 42098941 37353390 33334275
58160C3334275l429178k937455k534925k207692j926794j678505j471394j305495
$$ 33334275 29905097 26967642 24432717 22225025 20298231 18619726 17148332 15842837
58152A5842837j163075j035411r30798q49749p77738p08343o49933o03805n57856
$$ 15842837 14679762 13644351 12713553 11863804 11086066 10377723 9727790 9123985 8566129
58143H566129n07466m61895m24723l87526l47918l14970k91481k68549k42984
$$ 8566129 8058663 7596768 7172045 6784519 6436601 6121631 5830150 5561601 5318617
58134E318617k23377k13606k06036j96022j88375j84544j77648j65248j53924
$$ 5318617 5095240 4881634 4675598 4479576 4291201 4106657 3929009 3763761 3609837
58125C609837j46578j37724j25518j16134j12005j07415r9702r3602r0763q5990
$$ 3609837 3463259 3325535 3200017 3083883 2971878 2864463 2764761 2671159 2580396 2494406
58115B494406p7650p1182o8620o4940n8257n3623n3159n2197m8623m6639m7914
$$ 2494406 2416756 2345574 2276954 2212014 2153757 2100134 2046975 1994778 1946155 1899516 1851602
58104A851602m8174m5813m4908m6605m6360m2748m0229m0186l8028l2367k8363
$$ 1851602 1803428 1757615 1712707 1666102 1619742 1576994 1536765 1496579 1458551 1426184 1397821
58093A397821k8523k8545k5766k3561k3813k2983j9443j7156j8226j8991j7206
$$ 1397821 1369298 1340753 1314987 1291426 1267613 1244630 1225187 1208031 1189805 1170814 1153608
58082A153608j6173j8132k0063j9697j9321k0389k0439j8612j8077j9962k0783
$$ 1153608 1137435 1119303 1099240 1079543 1060222 1039833 1019394 1000782 982705 962743 941960
58071I41960j8822j7095j7259j6636j4087j2731j3856j4027j1317q669q146p506
$$ 941960 923138 906043 888784 872148 858061 845330 831474 817447 806130 797461 789315 781809
58059G81809n419m517o228p961q201r102j1404j2210j0537r596j0809j1126q950
$$ 781809 776390 771873 765645 757684 749483 740381 728977 716767 706230 696634 685825 674699 665749
58046F65749p171p444p149n003m028n694o731n222m312o284q275p709o785p621
$$ 665749 658578 651134 643985 638982 634954 629260 622529 617307 612995 606711 598436 590727 583942 576321
58032E76321p974n980m314n400o912o276n441o801q445p843o602p218q407p819
$$ 576321 568347 562367 558053 552653 545741 539465 534024 527223 518778 510935 504333 497115 488708 480889
58018D80889o357n837n305l457j916k439l544l259k521k742k819j726j045j847
$$ 480889 474532 468695 463390 459933 458017 455578 452034 448775 446254 443512 440693 438967 437922 436075
58004D36075k081k91J170K8j809j548j18R9n54n92o65j805k687j993j289k330
$$ 436075 433994 433703 434873 434901 433092 431544 431426 431525 430971 430379 429714 427909 425222 423229 421940 419610
57988D19610l748l550k646k761l064k188j378k251l401k628q40m10j299j849j950
$$ 419610 415862 412312 409666 406905 403841 401653 400275 398024 394623 391995 391155 390745 389446 387597 385647
57973C85647k441k746j996j116j244j437m07R56J229R51J163J176K43k97Q55K334
$$ 385647 383206 380460 378464 377348 376104 374667 374260 375216 376445 377396 378559 379735 379978 379681 380536 382870
57957C82870K163Q05j77r40k289l461l464l196l792m304l390j845j098p17L32
$$ 382870 385033 385838 385661 384721 382432 378971 375507 372311 368519 364215 360825 358980 357882 357165 357497
57942C57497J456J840K536M695P169Q249Q470R299J0406J0601J0243J0369J0521
$$ 357497 358953 360793 363329 368024 375193 383442 391912 401211 411617 422218 432461 442830 453351
57929D53351R636P983O217L703j64m178o846q495j0043j0997j0614r720r448r457
$$ 453351 462987 470970 477187 480890 480726 476548 469702 461207 451164 440167 429553 419833 410385 400928
57915D00928r030q563q340p446n581m196m042l486j219J330K382K649L527M311
$$ 400928 391898 383335 374995 367549 361968 357772 353730 350244 349025 350355 352737 355386 358913 363224
57901C63224L680K297J515J002Qn69L06J679K226K472L244L681L085K875M258
$$ 363224 366904 369201 370716 371718 371726 371157 371463 373142 375368 377840 381084 384765 387850 390725 394983
57886C94983N667N139L542K711K189O19j197j681j521k339l665m072m096n023
$$ 394983 400650 405789 409331 412042 414231 414850 413653 411972 410451 408112 404447 400375 396279 391256
57872C91256o007n452m141l919m299l491j828j024q44K19J679J734P35P94K160
$$ 391256 385249 379797 375656 371737 367438 363947 362119 361095 360251 360470 362149 363883 364618 365412 367572
57857C67572L054L005L348M497N396N808O497P178O749N511M811M588L609J972
$$ 367572 370626 373631 376979 381476 386872 392680 399177 406355 413104 418615 423426 428014 431623 433595
57843D33595R86P17J9j135j674j652k133l018l152k567k419k840k914k615k697
$$ 433595 434581 435298 435317 434182 432508 430856 428723 425705 422553 419986 417567 414727 411813 409198 406501
57828D06501k905k385j554j491j839j395m23j67n45n10l20j076k360k730k252
$$ 406501 403596 401211 399657 398166 396327 394932 394509 394342 393797 393287 392967 391891 389531 386801 384549
57813C84549k273k930l221l191l709m421m438m616o528r386j0724j0038r089q620
$$ 384549 382276 379346 376125 372934 369225 364804 360366 355750 349222 339836 329112 319074 309985 301365
57799C01365p628n959m855m495l598j933p28k89L47J128R20J24O54K720M243M148
$$ 301365 293737 287778 282923 278428 274830 272897 272169 271880 272227 273355 274275 274399 275053 277773 282016 286164
57783B86164L765M176M684M838N566P153Q218P867P062O828O878O831O962O946
$$ 286164 289929 294105 298789 303627 309193 316346 324564 332431 339493 346321 353199 360030 366992 373938
57769C73938N665L153J116O01P32M08l02j155k435l899m560m264m038m302m309
$$ 373938 379603 382756 383872 384473 385205 385613 385311 384156 381721 377822 373262 368998 364960 360658 356349
57754C56349l799l637m114m298l702l105l013k813k066j263p13r5M29J22q53j304
$$ 356349 352550 348913 344799 340501 336799 333694 330681 327868 325802 324539 323826 323731 324160 324282 323429 322125
57738C22125q33k45J31R26K082K538K109J989K707L242K877K355K363K479K339
$$ 322125 321292 321047 321178 322104 324186 326724 328833 330822 333529 336771 339648 342003 344366 346845 349184
57723C49184K472L105L512L297L056L199L280L146L340L871L818K761J357J27
$$ 349184 351656 354761 358273 361570 364626 367825 371105 374251 377591 381462 385280 388041 389398 389525
57709C89525j109k194k512k212k216k680k876k768k999l193k156j62R90Q04Q32
$$ 389525 388416 386222 383710 381498 379282 376602 373726 370958 367959 364766 362610 362448 363438 364242 365074
57694C65074J805K095K81k633m891o254p247p601o879n689m951m701m398l586
$$ 365074 366879 368974 369255 366622 361731 355477 348230 340629 333750 328061 323110 318409 314011 310425
57680C10425j746J417M940P225Q256R941J3531J8205K2869K7912L4167M1519M9548
$$ 310425 308679 310096 315036 322261 330517 340458 353989 372194 395063 422975 457142 498661 548209
57667E48209N8271O6972P3161P3522O5403M7429K0550j0631l9138n9716p1181
$$ 548209 606480 673452 746613 820135 885538 932967 953517 942886 903748 844032 772851
57656G72851p4768p1895o4348n4790m5329l6420k8093k1191j6484j3542j1454
$$ 772851 698083 626188 561840 507050 461721 425301 397208 376017 359533 345991 334537
57645C34537r820q327o523m663l735l839l749k733j608j219j197j056j140j549
$$ 334537 324717 316390 309867 305204 301469 297630 293881 291148 289540 288321 287124 286068 284928 283379
57631B83379j424l32P78J015P54N15j14j440k661l035k960k985k801k157j645
$$ 283379 281955 281623 282401 283416 284170 284685 284571 283131 280470 277435 274475 271490 268689 266532 264887
57616B64887j643j576j130j002j496j698j087o70j349k306k352j748j382j185
$$ 264887 263244 261668 260538 259536 258040 256342 255255 254585 253236 250930 248578 246830 245448 244263
57602B44263p03l05n20r10q31o19r19j556k050k498l057l324l115k947k933k285
$$ 244263 243560 243255 242735 241825 240994 240375 239456 237900 235850 233352 230295 226971 223856 220909 217976 215691
57586B15691q03K61j15j211j793j788j662j268n37k75r84j768j678j190j215j562
$$ 215691 214888 215149 215034 213823 212030 210242 208580 207312 206775 206500 205516 203748 202070 200880 199665 198103
57570A98103j650j772k352k812k474j784j395r68r5M96N2p23p36k31j06k73j10
$$ 198103 196453 194681 192329 189517 187043 185259 183864 182896 182801 183297 183349 182626 181890 181659 181553 181280 181170
57553A81170J99K06L52J163J996K005J690J969K318J593J79l64M19J427J814J832
$$ 181170 181369 181575 181927 183090 185086 187091 188781 190750 193068 194661 194840 194476 194895 196322 198136 199968
57537A99968J967K329K867L223K624Q87p79j038r6P70R80R13Q93Q92R74J100Q92
$$ 199968 201935 204264 207131 210354 212978 213865 213086 212048 211952 212722 213702 214615 215508 216400 217374 218474 219366
57520B19366L29J45P26J266R55K46m8j56o97j340j343q01k72K66R80J371J097
$$ 219366 219695 219840 220566 221832 222787 223033 222985 222829 222132 220792 219449 218648 218376 218642 219622 220993 222090
57503B22090Q96J529K369K305J320R6j293k941m069l868k883k214j928j449r53
$$ 222090 222986 224515 226884 229189 230509 230605 229312 226371 222302 218434 215551 213337 211409 209960 209007
57488B09007j001j337j396j385j611j432l31O83L64p24j089o56n74j159j755k298
$$ 209007 208006 206669 205273 203888 202277 200845 200514 201197 201561 200837 199748 199092 198518 197359 195604 193306
57472A93306l169l814l263j923j202j476j901k048k093j643j69J528K030J436
$$ 193306 190137 186323 183060 181137 179935 178459 176558 174510 172417 170774 170605 172133 174163 175599
57458A75599J076J236J017M17N51J456J746Q96J76N68J341J450J011O50M99M76
$$ 175599 176675 177911 178928 179345 179896 181352 183098 183994 184170 184738 186079 187529 188540 189190 189689 190165
57442A90165O09O13J64k45K63J427J951J421Q83J093J442J136L23m80j132j476
$$ 190165 190774 191387 191551 191306 191569 192996 194947 196368 197251 198344 199786 200922 201245 200765 199633 198157
57426A98157j065O9J085J260P20j0o26r55r12o38l58p9J21j56r26j304n09R03
$$ 198157 197092 197161 198246 199506 200226 200216 199590 198635 197723 197085 196727 196648 196769 196613 195687 194383 193874 194777
57408A94777J769J882J835J704J089K44r5J9j26n59n65ON64Q80J316J880K102
$$ 194777 196546 198428 200263 201967 203056 203300 203205 203224 203098 202539 201974 201980 202544 203424 204740 206620 208722
57391B08722J891J545J001P4p50p79k20K20N91J366K230K423K114K032K022J362
$$ 208722 210613 212158 213159 213233 212483 211704 211484 211704 212295 213661 215891 218314 220428 222460 224482 225844
57375B25844L63N4L90K91m68j032j144j441j924j793j052p13j031j084l74N07
$$ 225844 226207 226261 226651 226942 226474 225442 224298 222857 220933 219140 218088 217375 216344 215260 214886 215393
57359B15393J174J889K467K214J324Q91J164J337J275J726K443J918j87k019j971
$$ 215393 216567 218456 220923 223137 224461 225352 226516 227853 229128 230854 233297 235215 235028 233009 231038
57344B31038o52M36Q34P62J20j011j778j507n83K63P95R33M73k71m94j9M32L78
$$ 231038 230386 230822 231656 232418 232538 231527 229749 228242 227659 227922 228717 229650 230123 229852 229358 229339 229771 230149
57326B30149R9k19p46j192r35k29nk70q9N37M86l30m08Q79J952J261n37j855k307
$$ 230149 230248 230029 229283 228091 227156 226927 226922 226652 226563 227100 227586 227256 226848 227727 229679 230940 230403 228548 226241
57307B26241k425k291j770j281j144q91j40M75K32m78p00j40P88J596J817J247
$$ 226241 223816 221525 219755 218474 217330 216439 216299 216774 217006 216528 215828 215688 216476 218072 219889 221136
57291B21136M91N30J326J769J382J013J292J633J469J334J842K604L050L487M350
$$ 221136 221627 222157 223483 225252 226634 227647 228939 230572 232041 233375 235217 237821 240871 244358 248708
57276B48708N247N580N500N514N698N928O227O374N847M671L607L065K643K067
$$ 248708 253955 259535 265035 270549 276247 282175 288402 294776 300623 305294 308901 311966 314609 316676
57262C16676J704J740J766J567J405J247P12M0o3K21J3n46k77Q75J443Q14K42
$$ 316676 318380 320120 321886 323453 324858 326105 326817 326857 326794 327015 327028 326482 326205 327080 328523 329337 329579
57245C29579O56J179R66P67J382K079K008J856K553L493L529K813K201J766J249
$$ 329579 330235 331414 332380 333147 334529 336608 338616 340472 343025 346518 350047 352860 355061 356827 358076
57230C58076J076J609K144J985J656J870K201K051J983K758L771L995L719L900
$$ 358076 359152 360761 362905 364890 366546 368416 370617 372668 374651 377409 381180 385175 388894 392794
57216C92794M357M119L172K482K416K431K184J959K133K866M083N182N294M407
$$ 392794 397151 401270 404442 406924 409340 411771 413955 415914 418047 420913 424996 430178 435472 439879
57202D39879L627L705M093M085L977M339M927N234N273N148M674M149M501N917
$$ 439879 443506 447211 451304 455389 459366 463705 468632 473866 479139 484287 488961 493110 497611 503528
57188E03528P425Q510R863J1616J2395J1333R746R405J0234J1156J2055J3316
$$ 503528 510953 519463 529326 540942 553337 564670 574416 583821 594055 605211 617266 630582
57176F30582J4441J4704J4485J4468J4289J3429J2623J2902J3870J4425J4564
$$ 630582 645023 659727 674212 688680 702969 716398 729021 741923 755793 770218 784782
57165G84782J5108J6158J7180J8043J8744J8713J7675J6529J6216J6311J5913
$$ 784782 799890 816048 833228 851271 870015 888728 906403 922932 939148 955459 971372
57154I71372J5228J5059J5441J5939J6547J7190J7177J6293J5590J5934J6693
$$ 971372 986600 1001659 1017100 1033039 1049586 1066776 1083953 1100246 1115836 1131770 1148463
57143A148463J6987J7143J7685J8013J7543J7073J7596J8657J9300J9622K0054
$$ 1148463 1165450 1182593 1200278 1218291 1235834 1252907 1270503 1289160 1308460 1328082 1348136
57132A348136K0190J9703J9303J9530J9783J9773K0453K2200K3713K4341K5669
$$ 1348136 1368326 1388029 1407332 1426862 1446645 1466418 1486871 1509071 1532784 1557125 1582794
57121A582794K9077L3488L7445M1595M7011N3017N8877O5800P4797Q4389R3023
$$ 1582794 1611871 1645359 1682804 1724399 1771410 1824427 1883304 1949104 2023901 2108290 2201313
57110B201313J01821J12363J23868J35511J49451J68229J91091K16343K45415
$$ 2201313 2303134 2415497 2539365 2674876 2824327 2992556 3183647 3399990 3645405
57101C645405K81147L24019L73880M33433N05981N91598O89209P99675R21990
$$ 3645405 3926552 4250571 4624451 5057884 5563865 6155463 6844672 7644347 8566337
57092H566337J048762J170004J278483J366897J425213J448386J442108J413090
$$ 8566337 9615099 10785103 12063586 13430483 14855696 16304082 17746190 19159280
57084A9159280J362327J303136J277327J323882J420050J474789J400566J184028
$$ 19159280 20521607 21824743 23102070 24425952 25846002 27320791 28721357 29905385
57076B9905385Q74343N16356J17690l23844p87128j231387j617751j918012k113834
$$ 29905385 30779728 31296084 31413774 31089930 30302802 29071415 27453664 25535652 23421818
57067B3421818k200760k191311k107411j969936j796917j606144j413330j228633
$$ 23421818 21221058 19029747 16922336 14952400 13155483 11549339 10136009 8907376
57059H907376j057952r05850p74730o63385n69453m92191m30807l81752l40146
$$ 8907376 7849424 6943574 6168844 5505459 4936006 4443815 4013008 3631256 3291110
57050C291110l03098k69880k39837k12041j86448j63761j44274j27577j12988
$$ 3291110 2988012 2718132 2478295 2266254 2079806 1916045 1771771 1644194 1531206
57041A531206r9766q7482p6568o7750o0657n3952m7080m0792l5544l0619k5328
$$ 1531206 1431440 1343958 1267390 1199640 1138983 1085031 1037951 997159 961615 930996 905668
57030I05668j9956j4822r380k881M900J4045K4688L6323M7489N6299O0299N5860
$$ 905668 885712 870890 861510 858629 863529 877574 902262 938585 986074 1042373 1102672 1158532
57018A158532L9629J2008k1351n2505p5478q7858q9940q3952p3456o1903n1106
$$ 1158532 1198161 1210169 1188818 1136313 1060835 972977 883037 799085 725629 663726 612620
57007F12620m1409l3080k6739k2478j9387j6465j3592j1259r573q136o877o363
$$ 612620 571211 538131 511392 488914 469527 453062 439470 428211 418638 410502 403625 397262
56995C97262o854p476p015n366l524k109p01J209L427N568P688R922J1996J3435
$$ 397262 390408 382932 375917 370551 367027 364918 364217 365426 368853 374421 382109 392031 404027 417462
56981D17462J3706J2006P628J046o043j2136j6677j9273j9269j6875j3631j0832
$$ 417462 431168 443174 450802 451848 445805 433669 416992 397719 378450 361575 347944 337112
56969C37112q259n343k610q32M56K307M719O870Q691J0968J4073J7634K1201K4178
$$ 337112 328853 323510 320900 320068 320524 322831 327550 334420 343111 354079 368152 385786 406987 431165
56955D31165K5223K2932J7132Q808r70j1129j9851k5147k6398k4679k1473j7770
$$ 431165 456388 479320 496452 505260 504290 493161 473310 448163 421765 397086 375613 357843
56943C57843j4178j0958p794m289p24K298M942Q047J1966J6180K0194K4120K8149
$$ 357843 343665 332707 324913 320624 319900 322198 327140 335187 347153 363333 383527 407647 435796
56930D35796L1758L3515L1441K4043J1630l360j7741k9131l6204l8389l6275l1811
$$ 435796 467554 501069 532510 556553 568183 564823 547082 517951 481747 443358 407083 375272
56918C75272k7089k2970j9326j6147j3560j1256q946p078o202n862n076l801k885
$$ 375272 348183 325213 305887 289740 276180 264924 255978 248900 242698 236836 231760 227959 225074
56905B25074k646k509k004j286n29K87R85J320J598K403L790N374P132R292J1580
$$ 225074 222428 219919 217915 216629 216100 216387 217372 218692 220290 222693 226483 231857 238989 248281 259861
56890B59861J3548J5607J8721K2895K6936K9810L1218L0568K6553J8621Q247j949
$$ 259861 273409 289016 307737 330632 357568 387378 418596 449164 475717 494338 502585 500636
56878E00636j0030j5392j8147j8610j7240j4543j0939o807k571J474N337R270
$$ 500636 490606 475214 457067 438457 421217 406674 395735 388928 386357 387831 393168 402438
56866D02438J3552J8370K3862L0217L7596M5801N4040O1045O5189O4225N5549
$$ 402438 415990 434360 458222 488439 526035 571836 625876 686921 752110 816335 871884
56855H71884L7983J3738j1978l3774m8484n5366n5347n0468m3044l4397k4833
$$ 871884 909867 923605 911627 877853 829369 774003 718656 668188 625144 590747 565914
56844E65914j4971o079J459Q918J7626K7416L7479M7828N8932P0719Q2908R5120
$$ 565914 550943 544864 546323 555241 572867 600283 637762 685590 744522 815241 898149 993269
56832I93269J05041J07212R5708O8727L0099j2961n2685q2630r9489j04122r9993
$$ 993269 1098310 1205522 1301230 1369957 1400056 1387095 1334410 1251780 1152291 1048169 948176
56821I48176r0275p7010o2229m8111l5566k4006j2935k786O165J4653K3589L3121
$$ 948176 857901 780891 718662 670551 634985 610979 598044 595258 601423 616076 639665 672786
56809F72786M3010N3249O3516P2082P5576P0183N3670K7080n199l7192o3424q0185
$$ 672786 715796 769045 832561 904643 980219 1050402 1104072 1131152 1125953 1088761 1025337 945152
56797I45152q6309q3547p5539o5476n4856m4375l4818k6329j7984r331j514M316
$$ 945152 858843 775296 699757 634281 579425 535050 500232 473903 455919 446588 445074 449390
56785D49390Q931J3988J9768K5394L0700L5966L9836L9114L1257J6387k768k2013
$$ 449390 458321 472309 492077 517471 548171 584137 623973 663087 694344 710731 707963 685950
56773F85950l7180m6177m9781m9824m7069m1811l5565l0280k6194k2229j8305
$$ 685950 648770 602593 552812 502988 455919 414108 378543 348263 322069 299840 281535
56762B81535j5481j3869j2302j0318q672p585o246m531l536l709l976l449k650
$$ 281535 266054 252185 239883 229565 220893 213308 207062 202531 198995 195286 191310 187861 185211
56749A85211k338k342k231k047j790j192n69p31j609k102j741j354j526j590q62
$$ 185211 182873 180531 178300 176253 174463 173271 172702 171971 170362 168260 166519 165165 163639 162049 161187
56734A61187K02P86P32K77m14r26p24rM30M75P59J341J473J053R41J449J826J729
$$ 161187 161389 162175 162907 163184 162770 161844 161120 161111 161541 162016 162775 164116 165589 166642 167583 169032 170858 172587
56716A72587J803K186K010J090O25J265J855J301L40K08O66P35M91O39R88P75
$$ 172587 174390 176576 178586 179676 180301 181566 183421 184722 185062 185270 185936 186671 187162 187801 188789 189564
56700A89564P4l45k91k32l46l93l29l33l56k49p3J37M65O55J55q65j251k88J250
$$ 189564 189638 189293 189002 188770 188424 188031 187702 187369 187013 186764 186691 186828 187293 187948 188103 187238 185987 185699 186949
56681A86949K121K105J836J695J572J365J113Q77P92Q32M20q92k280k182m28J303
$$ 186949 189070 191175 193011 194706 196278 197643 198756 199633 200425 201257 201677 200785 198505 196323 195895 197198
56665A97198J673J247J086J077O25P9J24M82M20K8j05m6k79o67o89m85o17j012
$$ 197198 198871 200118 201204 202281 202906 202985 203109 203591 204011 204039 203934 203888 203609 202942 202253 201768 201151 200139
56647B00139j088q39q00r55n28Q85K632L719L826L435L123K917K328J121k05r72
$$ 200139 199051 198212 197412 196457 195929 196814 199446 203165 206991 210426 213549 216466 218794 219915 219710 218738
56631B18738j177j283j390j283j200j594k128j948j106o69j141j851k258k728
$$ 218738 217561 216278 214888 213605 212405 210811 208683 206735 205629 204960 203819 201968 199710 196982
56617A96982l465l771l058j740m86N16J048O79k76o45l4M78Pq06j005p57o46m73
$$ 196982 193517 189746 186688 184948 184462 184978 186026 186705 186429 185784 185750 186228 186235 185429 184424 183667 183021 182548
56599A82548R1N35K87k33m11m48n67j61J030J744O90j320k241j421J7J043J576
$$ 182548 182639 183174 183461 183228 182817 182369 181802 181641 182671 184415 185105 183785 181544 180123 180140 181183 182759
56582A82759J632J054K28j48j32m08j008j110l13P46J312J403J573K142K889L275
$$ 182759 184391 185445 185673 185525 185393 184985 183977 182867 182554 183300 184612 186015 187588 189730 192619 195894
56566A95894L066K774L144M044M584M575N008O460P916Q070P056N837M441K084
$$ 195894 198960 201734 204878 208922 213506 218081 223089 229549 237465 245535 252591 258428 262869 264953
56552B64953j108l695m423l424j808o36l79q85j660k275k429j854o25M81O23J3
$$ 264953 263845 260150 255727 252303 250495 249859 249480 248595 246935 244660 242231 240377 239752 240233 240856 240869
56536B40869m28n63j103k037k279j490q93j422k252k185j426q69n70j53L9m72
$$ 240869 240441 239878 238775 236738 234459 232969 232076 230654 228402 226217 224791 223922 223352 223199 223238 222766
56520B22766j156j134n01L9K89L25j93j376k407k539k299k533k880k385j165k70
$$ 222766 221610 220476 219975 220014 220303 220628 220435 219059 216652 214113 211814 209281 206401 204016 202851 202581
56504B02581k00o42j194j406o43R87K087J538R5p20p64r76j439j262k11Q18J061
$$ 202581 202381 201739 200545 199139 198496 199483 201570 203108 203203 202483 201719 200743 199304 198042 197831 198649 199710
56487A99710N37l68j075q50L31J260Q62k95q22m06K54Q62J592K126J932J352J198
$$ 199710 200247 199879 198804 197954 198285 199545 200407 200112 199290 198884 199138 200000 201592 203718 205650 207002 208200
56470B08200J421J339R20P28P60N18O7j05p6k78n37l57N7J62J55N91J195J215
$$ 208200 209621 210960 211880 212608 213368 213886 213953 213848 213772 213494 212957 212600 212657 212819 212974 213565 214760 215975
56452B15975P28M14L56J73O5M78R86P75K5l62k03n3J0L90R40J099Q73O63L51l20
$$ 215975 216703 217117 217473 217646 217711 218189 219175 219950 219975 219613 219410 219357 219367 219757 220697 221796 222669 223332 223683 223363
56432B23363q67o79j72p3p6N42J378J426P36J63j15n11q15o11l84o54n71Q68K654
$$ 223363 222496 221817 221645 221572 221496 222038 223416 224842 225578 225741 225626 225115 224300 223689 223305 222651 222080 222948 225602
56413B25602K819J383K55K84N53N66R61J695J694R02P66J974L364L753L320K611
$$ 225602 228421 229804 230059 230343 230896 231462 232423 234118 235812 236714 237480 239454 242818 246571 249891 252502
56397B52502J711R59J083J998K705K915L367M232M578L967L152K678K152J391
$$ 252502 254213 255172 256255 258253 260958 263873 267240 271472 276050 280017 283169 285847 287999 289390
56383B89390R33P97M7j750l732m978n515n629n246m467l725l058k181j382j307
$$ 289390 290323 291120 291167 289417 285685 280707 275192 269563 264317 259850 256125 253067 250886 249504 248197
56368B48197j694j506n21M20Q38J100J332J207Q77R13J140R15N08P59J324R66
$$ 248197 246503 244997 244476 244896 245734 246834 248166 249373 250250 251163 252303 253218 253726 254485 255809 256775
56352B56775k59q62k55M88O06O67J086J302J034Q83J040Q97M71O90J723K491K476
$$ 256775 256516 255654 255399 255887 256493 257160 258246 259548 260582 261465 262505 263402 263873 264563 266286 268777 271253
56335B71253K453K903L140K749K358K392K404K273K629L462L698K868J848J405
$$ 271253 273706 276609 279749 282498 284856 287248 289652 291925 294554 298016 301714 304582 306430 307835
56321C07835J310J376J827K192J432k04j051m65K36rm38o9P26J253J720K440K957
$$ 307835 309145 310521 312348 314540 315972 315768 314717 314252 314488 314479 314041 313972 314698 315951 317671 320111 323068
56304C23068K985L117L822M673N201N469N386M627L581L141L205K815J984J905
$$ 323068 326053 329170 332992 337665 342866 348335 353721 358348 361929 365070 368275 371090 373074 374979
56290C74979K897L897M325M792N487N645N235N395O511P561P977Q425R146R348
$$ 374979 377876 381773 386098 390890 396377 402022 407257 412652 419163 426724 434701 443126 452272 461620
56276D61620Q834Q449Q410Q069P843R141J1783J3710J4110J4510J5900J7215J7765
$$ 461620 470454 478903 487313 495382 503225 512366 524149 537859 551969 566479 582379 599594 617359
56263F17359J8723K0875K3259K5362K8344L2630L6685L9810M3773M9894N6823
$$ 617359 636082 656957 680216 705578 733922 766552 803237 843047 886820 936714 993537
56252I93537O3104O9764P8167Q7308R5519J03056J10796J17938J23206J26828
$$ 993537 1056641 1126405 1204572 1291880 1387399 1490455 1601251 1719189 1842395 1969223
56242A969223J29247J29388J26179J20371J12786J02286Q7538O9450M9757K8673
$$ 1969223 2098470 2227858 2354037 2474408 2587194 2689480 2777018 2846468 2896225 2924898
56232B924898O075j6315l6338n3903p0009q4212r5257j03187j08881j12299j13084
$$ 2924898 2930973 2914658 2878320 2824417 2754408 2670196 2574939 2471752 2362871 2250572 2137488
56221B137488j12033j10120j06968j01974r6057r0542q5278p9474p3438o7848
$$ 2137488 2025455 1915335 1808367 1706393 1610336 1519794 1434516 1355042 1281604 1213756
56211A213756o2461n7086n2587m9295m5745m0811l5819l2628l0867k8914k6465
$$ 1213756 1151295 1094209 1041622 992327 946582 905771 869952 837324 806457 777543 751078
56200G51078k4105k1577j8489j5709j4068j2668j0400q149p440p854p752o739
$$ 751078 726973 705396 686907 671198 657130 644462 634062 625913 618473 610619 602867 596128
56188E96128n496m116k443j318j565k443k698k444k483k589k042j042k33L35P14
$$ 596128 590632 586516 584073 582755 581190 578747 576049 573605 571122 568533 566491 565449 565216 565551 566265
56173E66265O22L91R84K185K555K059K515M293N212M284L764N377P291P411P049
$$ 566265 566887 567278 568262 570447 573002 575061 577576 581869 587081 591365 595129 600506 607797 615208 622257
56158F22257Q346J0400J1161J1187J2261J4006J5095J6271J8975K2320K4582K6499
$$ 622257 630603 641003 652164 663351 675612 689618 704713 720984 739959 762279 786861 813360
56146H13360K9989L4867L9786M5256N2662O1474P0352P9845R0969J02239J11030
$$ 813360 843349 878216 918002 963258 1015920 1077394 1147746 1227591 1318560 1420799 1531829
56135A531829J16632J19043J16288J06473R1579P6074O2578N1731M4801M2642
$$ 1531829 1648461 1767504 1883792 1990265 2081844 2157918 2220496 2272227 2317028 2359670
56125B359670M2723M0669L4516K5054J3100m97j3253k2756k9590l6062m3196n1402
$$ 2359670 2402393 2443062 2477578 2502632 2515732 2515235 2501982 2479226 2449636 2413574 2370378 2318976
56113B318976o2307p6595r1423j03119j11097j16126j16706j11006j00788q9498
$$ 2318976 2256669 2180074 2088651 1985532 1874435 1758309 1641603 1530597 1429809 1340311
56103A340311p7854o5058n2755m3478l6446k9221k2358j8151j5780j2384q124
$$ 1340311 1262457 1197399 1144644 1101166 1064720 1035499 1013141 994990 979210 966826 958702
56092I58702n641n017l746j414n7m5K94J233J716K383M592P069P403O326O511
$$ 958702 953061 948044 944298 942884 942827 942782 943076 944309 946025 948408 953000 960069 967472 973798 980309
56077I80309P980Q702Q775R757J0851J0264R339J0696J3239J3792J2832J3554
$$ 980309 988289 996991 1005766 1015523 1026374 1036638 1045977 1056673 1069912 1083704 1096536 1110090
56065A110090J6023J7358J7132J7435J8074J6948J4836J4548J5670J5273J3429
$$ 1110090 1126113 1143471 1160603 1178038 1196112 1213060 1227896 1242444 1258114 1273387 1286816
56054A286816J2844J3491J2985J1800J2544J4544J4762J3671J4529J7176J8478
$$ 1286816 1299660 1313151 1326136 1337936 1350480 1365024 1379786 1393457 1407986 1425162 1443640
56043A443640J8452J9927K2559K3397K3101K5075K8653K9808K8630K9366L2790
$$ 1443640 1462092 1482019 1504578 1527975 1551076 1576151 1604804 1634612 1663242 1692608 1725398
56032A725398L5288L5677L6380L7675L7527L7121L9580M3285M3638M1377M1581
$$ 1725398 1760686 1796363 1832743 1870418 1907945 1945066 1984646 2027931 2071569 2112946 2154527
56021B154527M4651M6276M6283M9016N4510N8005N8891O1487O6173O8601O8649
$$ 2154527 2199178 2245454 2291737 2340753 2395263 2453268 2512159 2573646 2639819 2708420 2777069
56010B777069P1014P5971P8770P9323Q2842Q9675R4356R6265J00993J09517J16475
$$ 2777069 2848083 2924054 3002824 3082147 3164989 3254664 3349020 3445285 3546278 3655795 3772270
55999C772270J21043J28783J40442J49844J55326J62307J72155J79834J85081
$$ 3772270 3893313 4022096 4162538 4312382 4467708 4630015 4802170 4982004 5167085
55990E167085J94256K08467K21736K33428K50085K72447K93745L13436L38848
$$ 5167085 5361341 5569808 5791544 6024972 6275057 6547504 6841249 7154685 7493533
55981G493533L70535M00769M29438M65935N12017N59333O07507O67042P40237
$$ 7493533 7864068 8264837 8694275 9160210 9672227 10231560 10839067 11506109 12246346
55972A2246346Q17989R00228R99709J120330J252763J397645J570954J780358
$$ 12246346 13064335 13964563 14964272 16084602 17337365 18735010 20305964 22086322
55964B2086322K020550K299368K642889L067536L576422M192828M966288N935254
$$ 22086322 24106872 26406240 29049129 32116665 35693087 39885915 44852203 50787457
55956E0787457P116461Q539188J0249566J2271188J4610888J7320106K0500352
$$ 50787457 57903918 66443106 76692672 88963860 103574748 120894854 141395206
55949A41395206K4233563K8539117L3291922L7880059M0767542L9673972L2758166
$$ 141395206 165628769 194167886 227459808 265339867 306107409 345781381 378539547
55942C78539547K0033197L707579j2887466k6794828l6263582m0800791m0935280
$$ 378539547 398572744 402280323 389392857 362598029 326334447 285533656 244598376
55935B44598376l7911751l3222365k8091352k3238398j8986102j5445090j2591910
$$ 244598376 206686625 173464260 145372908 122134510 103148408 87703318 75111408
55928G5111408j0312407q484558p028194n876740m952024m192931l574740l078745
$$ 75111408 64799001 56314443 49286249 43409509 38457485 34264554 30689814 27611069
55920B7611069k670230k321486k028370j787494j580377j393717j232833j101406
$$ 27611069 24940839 22619353 20590983 18803489 17223112 15829395 14596562 13495156
55912A3495156r87639q82221p91028p18353o54890n93163n38802m96160m57743
$$ 13495156 12507517 11625296 10834268 10115915 9461025 8867862 8329060 7832900 7375157
55903G375157m17609l81266l53132l27299k99347k74779k57499k41730k23183
$$ 7375157 6957548 6576282 6223150 5895851 5596504 5321725 5064226 4822496 4599313
55894D599313k06807j96017j85246j70550j57009j48386j39660j26967j15200
$$ 4599313 4392506 4196489 4011243 3840693 3683684 3535298 3395638 3268671 3153471
55885C153471j08552j02695r3359q4052p8395p2969o4526n6830n3860n3154n1894
$$ 3153471 3044919 2942224 2848865 2764813 2686418 2613449 2548923 2492093 2438233 2385079 2333185
55874B333185n2737n7903o3799o6833o8545p0337o9475o4911o0751n9399n7408
$$ 2333185 2280448 2222545 2158746 2091913 2023368 1953031 1883556 1818645 1757894 1698495 1641087
55863A641087n2407m7742m5949m4060l9841l6435l6201l5983l3127l0335k9971
$$ 1641087 1588680 1540938 1494989 1450929 1411088 1374653 1338452 1302469 1269342 1239007 1209036
55852A209036k9212k5552k1708k0527k0153j8672j8397k1108k3863k3918k3200
$$ 1209036 1179824 1154272 1132564 1112037 1091884 1073212 1054815 1033707 1009844 985926 962726
55841I62726k3857k3996k1819j9445j8762j7947j5723j4414j5215j5205j2741
$$ 962726 938869 914873 893054 873609 854847 836900 821177 806763 791548 776343 763602
55830G63602j0888j1658j1905r012n882n812p027o779o467q120r884r660r395
$$ 763602 752714 741056 729151 720139 714257 708445 701418 694639 688172 680052 670168 660508 651113
55817F51113j1235j2987j1900r607q917q852p176m801l593k653o20J115J195J307
$$ 651113 639878 626891 614991 605384 596467 587615 580439 575638 572045 569392 568772 569887 571082 572389
55803E72389L014M572M427M555O730Q739Q051O045M761K740j766o578q829r643
$$ 572389 575403 579975 584402 588957 595687 604426 612477 618522 623283 626023 624257 617679 608850 599207
55789E99207j1424j3134j2521j0608r672q992o745m179l796n188o412p640r729
$$ 599207 587783 574649 562128 551520 541848 532856 526111 521932 518136 512948 506536 498896 489167
55776D89167j0948q965m578r2M341R566J4354J6763J6837J5045J0097J560p466
$$ 489167 478219 469254 464676 464584 468925 478491 492845 509608 526445 541490 551587 553147 545681
55763E45681j3710j7792k1641k4165k3192j9821j6990j5178j3130j1261j0716
$$ 545681 531971 514179 492538 468373 445181 425360 408370 393192 380062 368801 358085
55752C58085j0590r573q930j0213j1556j0004o308l668k856k135j100q16q93L2
$$ 358085 347495 337922 328992 318779 307223 297219 290911 287243 284387 282252 281152 280336 279443 279475
55738B79475J419J645J060J225J761J094m01j064j081j942l311l527k715k541
$$ 279475 280894 282539 283599 284824 286585 287679 287278 286214 285133 283191 279880 276353 273638 271097
55724B71097l261l738l951m825n957o007m961l774k356j62K022L129L864N399
$$ 271097 267836 264098 260147 255322 249365 243358 238397 234623 232267 232105 234127 237256 241120 246519
55710B46519P061P550P336P438O951M511J108j223k504m003n428n756n749o763
$$ 246519 253580 261130 268466 275904 282855 287366 288474 287251 284747 280744 275316 269560 263811 257048
55696B57048p965p658o412n917n740m347k443j890k069p61J744K900K142J518
$$ 257048 249083 241425 235013 229096 223356 219009 216566 214676 212607 211846 213590 216490 218632 220150
55682B20150K085K851L408M493N644N324L744K751K643J760l11j919k209k259
$$ 220150 222235 225086 228494 232987 238631 243955 247699 250450 253093 254853 254542 252623 250414 248155
55668B48155k777k997k484j867j378n33L73M38o9K1O90R39R56J829L153L277K113
$$ 248155 245378 242381 239897 238030 236652 236119 236492 236930 236861 236882 237572 238511 239467 241296 244449 247726 249839
55651B49839J433J984K447J712K33j236k453l047k779k563l548n205o035o015
$$ 249839 251272 253256 255703 257415 257648 256412 253959 250912 248133 245570 242022 236817 230782 224767
55637B24767o393p294p530o788o006n518m711l548k607j765o38M9n11j246n00
$$ 224767 218374 211080 203550 196762 190756 185238 180527 176979 174372 172607 171969 172018 171507 170261 169761
55622A69761J057J263q9j048p58l56n47p58r26j739k812k955k424k588l233k763
$$ 169761 170818 172081 171992 170944 170186 169830 169283 168525 167599 165860 163048 160093 157669 155081 151848 149085
55606A49085j281p87j834k590j940r78o01j24P50R29j7q27o29j63k8L62J174J385
$$ 149085 147804 147017 145183 142593 140653 139675 139074 138950 139700 140629 140612 139785 139156 138993 138965 139327 140501 141886
55588A41886N59l22o03q10j105o74N79J551J926K705M068M665M047L815N172P068
$$ 141886 142445 142123 141520 140710 139605 138931 139510 141061 142987 145692 149760 154425 158472 162287 167459 174527
55572A74527Q046Q304Q726R294R674J0076J0425R832P855N204K437q24m613p901
$$ 174527 182573 190877 199603 208897 218571 228647 239072 248904 256759 261963 264400 263576 258963 251062
55558B51062r931j1098j1816j1739j0772r618q601p209n395m043l499k966k000
$$ 251062 241131 230033 218217 206478 195706 186088 177487 170278 164883 160840 157341 154375 152375
55545A52375j275j239j289r81p36p55m41M05J044J056R17Q64M21m66j093j171
$$ 152375 151100 149861 148572 147591 146855 146100 145659 146064 147108 148164 149081 149945 150366 149900 148807 147636
55529A47636j128j029o09n02j695l537m202l481l018l375l119j645n43r57j781
$$ 147636 146508 145479 144870 144368 142673 139136 134934 131453 128435 125060 121941 120296 119753 118796 117015
55514A17015j841j874k731l572l474l250l891m613m230l185k580k289j674j154
$$ 117015 115174 113300 110569 106997 103523 100273 96382 91769 87539 84354 81774 79485 77811 76657
55500G6657j328j481n69R69J887J963J832J668J326J204J677K171J917J130N25
$$ 76657 75329 73848 73279 74248 76135 78098 79930 81598 82924 84128 85805 87976 89893 91023 91548
55485I1548K10n0j22J34M18O11J057J617J422L43m14k6P48J020J182J725J913
$$ 91548 91758 91708 91586 91720 92138 92749 93806 95423 96845 97188 96774 96748 97496 98516 99698 101423 103336
55468A03336R50m66j165j230j320j183l14O13M75n31j243j250j049q86n98l04
$$ 103336 104286 103820 102655 101425 100105 98922 98608 99221 99696 99165 97922 96672 95623 94737 94139 93835
55452I3835j49K92J314K200K054J119L07j71p29j342j570j354q97q7J048J721
$$ 93835 93686 93978 95292 97492 99546 100665 100972 100801 100072 98730 97160 95806 94909 94822 95870 97591
55436I7591J230J47k75K33Q21Q29M90K95L62M75L65K4j13L58J037J076M87L88
$$ 97591 98821 98968 98693 98926 99747 100576 101066 101361 101723 102198 102563 102587 102474 102832 103869 104945 105432 105820
55418A05820J439K874L592L442K876K159J550J557K149K418J672L17r18j930k786
$$ 105820 107259 110133 113725 117167 120043 122202 123752 125309 127458 129876 131548 131865 130947 129017 126231
55403A26231l191l058k992l396l798l610k955k209j498j121j463j973j353N20
$$ 126231 123040 119982 116990 113594 109796 106186 103231 101022 99524 98403 96940 94967 93614 94134
55389I4134K038K009J231R31R06M54j1J93N29J13n47l32N29P19j48j165j576j457
$$ 94134 96172 98181 99412 100343 101249 101703 101692 101885 102414 102527 101980 101648 102177 102896 102748 101583 100007 98550
55371I8550j096p34p25j094j192n85J20J54k36l76l55n95p98l60N12J126J269
$$ 98550 97454 96720 95995 94901 93709 93124 93244 93398 93162 92786 92431 91836 91038 90678 91190 92316 93585
55354I3585J044L23p23j241q51m28o68p22L28J552J420L80K18J143J522O10l83
$$ 93585 94629 94952 94229 92988 92137 91709 91041 90319 90647 92199 93619 93999 94217 95360 96882 97492 97109
55337I7109l83P2R4j50j05J98M61O57O63J36q39j580j708j588j550j304n25M17
$$ 97109 96726 96798 96892 96742 96637 96835 97296 97953 98616 98752 97913 96333 94625 93037 91487 90183 89658 90075
55319I0075Q17M47k25n06o3Q41J661K139K321K110J326L52JL79N65k2p65r65r89
$$ 90075 90892 91339 91114 90608 90545 91386 93047 95186 97507 99617 100943 101295 101296 101675 102240 102218 101453 100488 99499
55300I9499j402j718j126J9O21M26L1l73j086j754j444p3J210J425Q12K24J03
$$ 99499 98097 96379 95253 95272 95893 96319 96350 95977 94891 93137 91693 91620 92830 94255 95067 95291 95394
55283I5394L17N73O46M59M8n22j099j293q78l20l57q68r26k56K62L0l01M6P57
$$ 95394 95711 96284 96930 97389 97437 96915 95816 94523 93645 93325 92968 92100 91174 90918 91180 91210 90909 90955 91712
55264I1712J130J138R86M22n35j034n67O9N7o0N80J548J851J530J201O62m74j449
$$ 91712 92842 93980 94966 95388 94853 93819 93252 93321 93378 93318 93898 95446 97297 98827 100028 100690 100216 98767
55246I8767j225k86O3j96m1N37M89l12q28p23p83j235j236m76J54J7l95n26n88
$$ 98767 97542 97256 97319 97123 97082 97619 98108 97796 96968 96245 95462 94227 92991 92515 92669 92686 92291 91765 91177
55227I1177q17q86n93k65j57j73l25o88q48k82O83J232J297J459J685J302L15
$$ 91177 90360 89474 88881 88616 88459 88286 87961 87273 86425 86143 86826 88058 89355 90814 92499 93801 94116
55210I4116m79p65r06q24L9J378K015J591J061J062J043N05q5k38k58m50m65r6
$$ 94116 93637 92872 91966 91142 91181 92559 94574 96165 97226 98288 99331 99836 99751 99513 99255 98805 98340 98244
55192I8244J21k66q74j162j174j180j139r73p09j67Q38J769J684N89l81m53l7
$$ 98244 98365 98099 97225 96063 94889 93709 92570 91597 90888 90721 91559 93328 95012 95601 95220 94767 94730
55175I4730K47M68Q12R69P02L85L94N09L58n6n17q26o82Q7J000J261Q09L77M58
$$ 94730 94977 95445 96257 97226 97928 98313 98707 99216 99574 99518 99001 98175 97493 97580 98580 99841 100650 101027 101485
55156A01485Q82J394J789J452j24k116k756j396O76J871J852J139J82o19q34n60
$$ 101485 102367 103761 105550 107002 106878 104762 102006 100610 101286 103157 105009 106148 106330 105711 104877 104317
55140A04317m41o77p15k13M49R77J516J819J111n75j857j623m56L21L15J9k87
$$ 104317 103876 103199 102484 102271 102720 103697 105213 107032 108143 107568 105711 104088 103632 103953 104268 104287 104000
55123A04000o89j093j225j037n87J53R94J399J048K16o11j103r77j36Q05Q55r3
$$ 104000 103311 102218 100993 99956 99369 99522 100516 101915 102963 103179 102568 101465 100488 100352 101157 102012 101919
55106A01919r68q49o1M79M33J50L6K32N29N22K04K82J202K052J492j73j139o03
$$ 101919 100951 100102 100041 100520 100953 101103 101139 101371 101900 102422 102626 102908 104110 106162 107654 107481 106342 105739
55088A05739K13J16l33l4Q28J343J379J355J169M96k40l02J72L22j90q44j019
$$ 105739 105952 106068 105735 105701 106529 107872 109251 110606 111775 112271 112031 111729 111901 112223 112033 111189 110170
55071A10170m90N75J593J718O59q09j632j582j202r80r33q49n10J23O63N83o0
$$ 110170 109680 110255 111848 113566 114225 113416 111784 110202 109000 108020 107087 106238 105728 105851 106514 107097 107037
55054A07037n16k86K62N05L28ol35n81o38n93o16n36M3R36J333Q13j17p31p76
$$ 107037 106521 106235 106497 107002 107330 107324 106989 106408 105770 105177 104561 104025 104068 105004 106337 107150 107033 106302 105526
55035A05526k55P11J585J680J079N98N49M01n5j90L06O65J66p60j232j033m09
$$ 105526 105271 105982 107567 109247 110326 110924 111473 111874 111819 111629 111935 112600 112766 112006 110774 109741 109332
55018A09332M62J175J013m6r10o80J83O43M33o1n25o94k41N88R33N19J22K09J11
$$ 109332 109794 110969 111982 111936 111026 110346 110529 111172 111605 111544 111019 110325 110084 110672 111605 112124 112246 112455 112566
54999A12566o37j109l60R35J400Q81K37j21k24K77J524K494K040O43k24k01j10
$$ 112566 111929 110820 110460 111395 112795 113676 113913 113792 113568 113845 115369 117863 119903 120546 120322 120121 120011
54982A20011j93J62Q92J061M24q9J09M78M71L38L76M05M08Q02J509J675Q66j43
$$ 120011 119818 119980 120872 121933 122357 122268 122377 122855 123326 123664 124040 124445 124853 125655 127164 128839 129705 129562
54964A29562m24o9K37L06M43O85O95L04j97l67o3M19O04L40o4l73p56j380j859
$$ 129562 129138 129069 129306 129612 130055 130740 131435 131739 131542 131175 131112 131531 132135 132475 132411 132038 131282 129902 128043
54945A28043j646q27m3K67J26l27r31j273q92K07J506K359K229R17q98j683m01
$$ 128043 126397 125570 125527 125794 125920 125593 124662 123389 122497 122704 124210 126569 128798 129715 128817 127134 126733
54928A26733K214M300M862M500M278M548N087N681O252O710O930O726N834M217
$$ 126733 128947 133247 138109 142609 146887 151435 156522 162203 168455 175165 182095 188821 194655 198872
54914A98872K334P15o80k321m327o218p437p775p328o426n586n104m667l706k229
$$ 198872 201206 201921 201241 198920 194593 188375 180938 173163 165835 159409 153823 148719 144052 140346 138117
54899A38117r61n35q09j061p23J19Q51R90P73P95J112J090M24k52j64N89J385
$$ 138117 137156 136621 135812 134751 134028 134147 134998 135988 136761 137556 138668 139758 140182 139930 139766 140355 141740
54882A41740K108L132M464N551O014O120O376O986P680P819O758M392J381j312
$$ 141740 143848 146980 151444 156995 163009 169129 175505 182491 190171 197990 204748 209140 210521 209209
54868B09209l136m119m698n397o389p153o980n965n008m608m253l348k186j524
$$ 209209 206073 201954 197256 191859 185470 178317 171337 165372 160364 155756 151503 148155 145969 144445
54854A44445j576j985k293k111j328n89r06k298l411l147j969r94n19k70l43q80
$$ 144445 142869 140884 138591 136480 135152 134563 133657 131359 127948 124801 122832 121838 121319 121049 120706 119826
54838A19826j344j185p77p24p64l97p7m23p25K28K002K739J712J91m87m17k32
$$ 119826 118482 117297 116520 115796 115032 114635 114558 114135 113410 113638 115640 118379 120091 120282 119795 119378 119146
54821A19146OM18P24O75M40J72j15q4P17J913K410J795Q75M59L72J25k32m23n36
$$ 119146 119152 119570 120294 120969 121409 121581 121466 121382 122099 124012 126422 128217 129092 129551 129923 130048 129816 129393 128857
54802A28857p09o83j34Q41J778K190J766P37p2p7K21p5p55p20K22Q27J82r87j412
$$ 128857 128148 127465 127331 128172 129950 132140 133906 134643 134571 134494 134715 134640 133885 133165 133387 134214 134396 133409 131997
54783A31997r42l43k6K22N54Q71J239J923K929L849M175L767L105L035L968N319
$$ 131997 131055 130712 130686 130908 131462 132333 133572 135495 138424 142273 146448 150215 153320 156355 160323 165642
54767A65642O104O069N807N856O159O499O725O466N147K672l08l070n364p167
$$ 165642 171746 177815 183622 189478 195637 202136 208861 215327 220474 223146 222838 219768 214404 207237
54753B07237q302q587q065o969n685m745m453m522m385l823l005k071j160o27
$$ 207237 198935 190348 182283 175314 169629 164884 160431 155909 151524 147701 144696 142625 141465 140838
54739A40838n88n09J32R16J064O53L79K67k20p52j40J830L730M314M026M076M823
$$ 140838 140250 139741 139873 140789 141853 142506 142885 143152 142932 142180 142040 143870 147600 151914 155940 160016 164839
54722A64839N858O937P937Q338P531N479K703j43k419l751m484n453o881p954
$$ 164839 170697 177634 185571 193909 201440 206919 209622 209479 207060 203309 198825 193372 186491 178537
54708A78537p821o563m819l067j656j062j444k259k671k240j131K2M18j72r99
$$ 178537 170716 164153 159334 156267 154611 153549 152105 149846 147175 144935 143804 143826 144244 144072 143073
54693A43073j187j000j323j955j626p2J173Q20m57j225j265j216j135o62j49k97
$$ 143073 141886 140886 139563 137608 135982 135910 137083 137903 137446 136221 134956 133740 132605 131943 131794 131497
54677A31497q76r38l10J74n3n84p68n09j44k7l06p54q80n34k28m44q60p82j54
$$ 131497 130621 129683 129373 129547 129494 128910 128142 127633 127489 127462 127156 126402 125522 124988 124760 124316 123456 122674 122520
54658A22520L91M11Q2k26l16j35K53O58R52J155J206R21L75m1j99m56r25j032
$$ 122520 122911 123322 123404 123178 122862 122727 122980 123638 124590 125745 126951 127872 128247 128206 128007 127551 126626 125594
54640A25594l35O49J027O42O2k53k10K17R15J392J225O20Q1l01o90r46q31o14
$$ 125594 125259 125908 126935 127577 127639 127386 127176 127393 128308 129700 130925 131545 131626 131325 130635 129689 128858 128244
54622A28244p78j189j217o66l3K30J57p6m28q15j006q38l09M55J084J076M12j78
$$ 128244 127466 126277 125060 124394 124361 124591 124748 124672 124244 123429 122423 121585 121276 121731 122815 123891 124303 124125
54604A24125j1O48J034R22P14N94L96J92L01O47P39M75L00L85L26r4l99j08N29
$$ 124125 124114 124762 125796 126718 127432 128026 128422 128614 128915 129562 130301 130776 131076 131461 131787 131693 131294 131186 131715
54585A31715Q45M95m05j450k004j441J24J661K219J960J762J866J516J50j550
$$ 131715 132560 133055 132650 131200 129196 127755 127879 129540 131759 133719 135481 137347 138863 139013 137463
54570A37463k246j473j94L24j41p63p70j97M56Q68R96R06O96M87K47k23q95j355
$$ 137463 135217 133744 133550 133874 133733 132970 132200 132003 132459 133327 134323 135229 135925 136412 136659 136436 135541 134186
54552A34186j259q09m43j73L60J240K113K710L103L227K585R37r33j712j048J0
$$ 134186 132927 132118 131675 131502 131862 133102 135215 137925 141028 144255 146840 147777 146844 145132 144084 144094
54536A44094L12o0k44j1M7l16o03o18r55j819k241j364M4M85j42n75k19J64k3
$$ 144094 144406 144346 144102 144091 144138 143822 143219 142601 141646 139827 137586 136222 136266 136751 136609 136034 135815 135979 135956
54517A35956k18K14R21J265J224R38J43j167k150k035j203o16n88p72r14q80k95
$$ 135956 135738 135952 136873 138138 139362 140300 140443 139276 137126 135091 133888 133272 132684 131912 130998 130118 129823
54500A29823R70K119K057P21q13j532j291n22K83Q03J025J213J451J377P32n2
$$ 129823 130793 132912 134969 135690 134877 133345 132054 131532 131815 132618 133643 134856 136307 137684 138416 138364
54484A38364k60K25Q22R38M22l88p91j76J186K122J831Q92M73Q01J130R99P73
$$ 138364 138104 138329 139151 140089 140511 140123 139332 139156 140342 142464 144295 145187 145660 146461 147591 148590 149363
54467A49363Q54J082J094Q74O04L82J64q1l07l46j12J67J69L7K49P17O43k97j239
$$ 149363 150217 151299 152393 153267 153871 154253 154417 154336 154029 153683 153571 153738 153907 153944 154193 154910 155553 155256 154017
54448A54017j305r20j084j732j828r47K52J124J617J627P80p79k067k275j558
$$ 154017 152712 151792 150708 148976 147148 146201 146453 147577 149194 150821 151601 150822 148755 146480 144922
54433A44922n90J54M24J07m49n33J21R70J398J392J227Q94L20k31m47m90p42j082
$$ 144922 144332 144486 144910 145017 144568 144035 144156 145126 146524 147916 149143 150037 150357 150126 149679 149189 148447 147365
54415A47365q89J45J518K374K307J591P26j0n07o04j92M77R06R02P41O59N24K46
$$ 147365 146476 146621 148139 150513 152820 154411 155137 155127 154620 154016 153824 154301 155207 156109 156850 157509 158033 158279
54397A58279J41M51P95O48K15K64J005J701J597Q22J6o05j330k160k472j747m14
$$ 158279 158420 158871 159666 160314 160529 160793 161798 163499 165096 165918 165934 165329 163999 161839 159367 157620 157206
54380A57206N01O14N41Q33J075O50l2K3Q32J319R51N04P12J111R67O37J065K348
$$ 157206 157707 158321 158862 159695 160770 161420 161388 161411 162243 163562 164513 165017 165729 166840 167807 168444 169509 171857
54362A71857L654M369M540M349L882L338K838K093P35j080k831m216n099n165
$$ 171857 175511 179880 184420 188769 192651 195989 198827 200920 201655 200575 197744 193528 188429 183264
54348A83264m256k840j623q35m04m79j112j705j610j137j177j848k296j908j015
$$ 183264 179008 176168 174545 173710 173306 172827 171715 170010 168400 167263 166086 164238 161942 160034 159019
54333A59019k67Q4J01r5l20m64o50r30r45l65M66Q60O56K88Q2P9L09O87P53J86
$$ 159019 158752 158836 158937 158842 158522 158058 157408 156478 155533 155168 155634 156494 157150 157438 157520 157599 157908 158595 159348 159534
54313A59534o10j027j151j450j710j262j99N42M34p8l64k91L4M71P23O45O43J097
$$ 159534 158924 157897 156746 155296 153586 152324 152125 152667 153101 153023 152659 152368 152402 152873 153596 154241 154884 155981
54295A55981J483R03m89j573j759j499j225q48m67m56n37J25J416K005J205P5
$$ 155981 157464 158367 157878 156305 154546 153047 151822 150974 150507 150051 149514 149639 151055 153060 154265 154340
54279A54340o6O20J098J002O74K62k51m73J1Q53J237R18L89J93M35R35J384J457
$$ 154340 154274 154894 155992 156994 157668 157930 157679 157206 157217 158070 159307 160225 160614 160807 161242 162177 163561 165018
54261A65018J053L43m63j131j238m74P50J439J143M33O9J12J27j40n79q65o26
$$ 165018 166071 166414 165951 164820 163582 163108 163858 165297 166440 166873 166942 167054 167181 167041 166462 165597 164971
54244A64971J69R12Q85J75m95q12j055j200p93N0M18j41r44j176q14j82N96J198
$$ 164971 165140 166052 166937 167112 166617 165805 164750 163550 162757 162807 163225 163084 162140 160964 160150 159968 160564 161762
54226A61762J044K68j14L88R44P42K44K44N45N15L09L72L53l32j281j588j251
$$ 161762 162806 163074 162960 163348 164292 165034 165278 165522 166067 166582 166891 167263 167616 167284 166003 164415 163164
54209A63164r82r00n50n1n7n36o90k36K33L29L73O12P48O20N12N43L83q0l56Q
$$ 163164 162182 161282 160732 160681 160624 160088 159398 159162 159395 159724 160097 160709 161457 162077 162589 163132 163515 163435 163079 163087
54189A63087Q25J573J889J622Q83J36j25m1j77o30q20m02K00M21K34r9m94q53
$$ 163087 163912 165485 167374 168996 169879 170015 169890 169849 169672 169042 168222 167820 168020 168441 168675 168576 168082 167229
54171A67229q04j94M54M70m2l42j18J09j67n94m37K72O49J23q08j305j294j266
$$ 167229 166425 166231 166685 167155 167113 166771 166653 166762 166595 166001 165564 165836 166485 166608 165800 164495 163201 161935
54153A61935j260q15M1N34J89m87p57o14m62k47L94J302J719J147n5j049j315
$$ 161935 160675 159860 159901 160435 160624 160137 159380 158766 158304 158057 158451 159753 161472 162619 162564 161515 160200
54136A60200r92n49j81L40J103J661J615J368J628K127J785L56r52j071m68k21
$$ 160200 159208 158659 158478 158818 159921 161582 163197 164565 166193 168320 170105 170461 169509 168438 167970 167749
54120A67749l66r2P88J598J888J893J914J902J835J819J734J252L70m47p30l58
$$ 167749 167383 167291 168079 169677 171565 173458 175372 177274 179109 180928 182662 183914 184284 183837 183107 182749
54104A82749M80J397K002K276K661L426M191M444M382M673N483O137N748L905
$$ 182749 183229 184626 186628 188904 191565 194991 199182 203626 208008 212681 218164 224301 230049 233954
54090B33954Q87k413m936o117o170n555m507l312k484k228k047j481q71p54q34
$$ 233954 234841 232428 227492 221375 215205 209650 205143 201831 199347 197119 195072 193591 192720 191966 191132
54075A91132k35J239K878L979M410M289L770L125K558J846P25n01j215j352j462
$$ 191132 190897 192136 195014 198993 203403 207692 211462 214587 217145 218991 219716 219215 218000 216648 215186
54060B15186j920k550l007k986k226q76K25L32k16m45q8K44K73N02J264K147K756
$$ 215186 213266 210716 207709 204723 202497 201621 201846 202178 201962 201517 201429 201673 201946 202448 203712 205859 208615
54043B08615L324M131M863N103N055N217N634N881N660N140M791N008N712O272
$$ 208615 211939 216070 220933 226036 231091 236308 241942 247823 253483 258623 263414 268422 274134 280406
54029B80406O119N432M913M829M688L994K939K120J848J881J718J074K50p7K70
$$ 280406 286525 291957 296870 301699 306387 310381 313320 315440 317288 319169 320887 321961 322211 322134 322404
54014C22404M81l56j961l084l110k814l261m496n715o296o242n867n458n169m968
$$ 322404 322885 322529 320568 317484 314374 311560 308299 303803 298088 291792 285550 279683 274225 269056 264088
53999B64088m712m344l973l741l717l807l651k833j495m86m69j057j356j197j208
$$ 264088 259376 255032 251059 247318 243601 239794 236143 233310 231815 231329 230860 229803 228447 227250 226042
53984B26042j670k058j876j282o60j28K44K54q8m31n48n37m26q2L19L04j10j75
$$ 226042 224372 222314 220438 219156 218496 218368 218612 218866 218778 218347 217799 217262 216836 216754 217073 217377 217267 217092
53966B17092O20J805K583K841L021L367L773M201M771N565O637Q074R702J0966
$$ 217092 217712 219517 222100 224941 227962 231329 235102 239303 244074 249639 256276 264350 274052 285018
53952B85018J1302J0530Q666N682J834k044m924o264o112m888l306k240k086k329
$$ 285018 296320 306850 315516 321198 323032 320988 316064 309800 303688 298800 295494 293254 291168 288839
53938B88839k078r94N06J848K717L019K777K188J540R61M34K9%N80J771L303M751
$$ 288839 286761 285767 286273 288121 290838 293857 296634 298822 300362 301323 301757 301786 301786 302366 304137 307440 312191
53921C12191N766O262O378O323O311O613P379Q394R205R606R811J0013R988R328
$$ 312191 317957 324219 330597 336920 343231 349844 357223 365617 374822 384428 394239 404252 414240 423568
53907D23568P949O241M766L806L112K072L47j606k878l074k725k636l039l602
$$ 423568 431517 437758 442524 446330 449442 451514 451861 450255 447377 444303 441578 438942 435903 432301
53893D32301m003m305m757n499o434p301p852q053q080q119q234q443q729q947
$$ 432301 428298 423993 419236 413737 407303 400002 392150 384097 376017 367898 359664 351221 342492 333545
53879C33545q834q195p060n692m532m033m317m904n046m465l609l065k852k518
$$ 333545 324711 316516 309456 303764 299232 295199 290882 285978 280932 276467 272858 269793 266941 264423
53865B64423j897j490j932l110m093m055l163k294k051k279k530k531k188j558
$$ 264423 262526 261036 259104 255994 251901 247846 244683 242389 240338 238059 235529 232998 230810 229252
53851B29252j041j139j690j797q62N64J439J416R01L17j87l89j00M49P26M89q0
$$ 229252 228211 227072 225382 223585 222723 223287 224726 226142 227043 227360 227173 226784 226684 227133 227859 228348 228268
53834B28268p42j359j796j991j983j652p34M93J042M13m15o4J395K528K370J344
$$ 228268 227526 226167 224371 222380 220397 218745 218011 218504 219546 219959 219544 219480 220875 223403 225773 227117
53818B27117K79m39o15o3Q85J442J346J178J422J796J929K032K538L479M591N640
$$ 227117 227396 226957 226342 226279 227164 228606 229952 231130 232552 234348 236277 238309 240847 244326 248917 254557
53802B54557O323O355N893N517N510N622N650N777O058O153N832N251M493L441
$$ 254557 260880 267235 273128 278645 284155 289777 295427 301204 307262 313415 319247 324498 328991 332432
53788C32432K350J878K129K244J496K31p49j315j970k968m053m860n205n084m707
$$ 332432 334782 336660 338789 341033 342529 342760 342011 340696 338726 335758 331705 326845 321640 316556 311849
53773C11849m350m087l874l872m274m802m917m678m647m879m738m023l394l288
$$ 311849 307499 303412 299538 295666 291392 286590 281673 276995 272348 267469 262731 258708 255314 252026
53759B52026l190k622k042k046k328k225j863j881k335k657k515k063j515j024
$$ 252026 248836 246214 244172 242126 239798 237573 235710 233829 231494 228837 226322 224259 222744 221720
53745B21720q19r35r70o03j09J5k16l67j27N16J370J989J898J225O94O37N55N2
$$ 221720 220901 219966 218996 218393 218284 218299 218083 217716 217589 218105 219475 221464 223362 224587 225281 225918 226473 226525
53727B26525m12k97M9n3n34p71n52p7O53J701K646K843K248J405P96O02Q97J589
$$ 226525 226113 225816 225865 225812 225278 224507 223955 223878 224531 226232 228878 231721 233969 235374 236170 236772 237669 239258
53709B39258K334K870L164L034K213J128Q73J807K915L252L247L671M222M248
$$ 239258 241592 244462 247626 250660 252873 254001 254874 256681 259596 262848 266095 269766 273988 278236
53695B78236M188M834N624N211L536J887Q94p4j294j967j572p60l00j65j40m59
$$ 278236 282424 287258 292882 298093 301629 303516 304410 304336 303042 301075 299503 298743 298443 298278 298138 297679
53679B97679j216j901k002j552p43L11J176J171K88o50j029j115j305j440j243
$$ 297679 296463 294562 292560 291008 290265 290576 291752 292923 293211 292561 291532 290417 289112 287672 286429
53664B86429q23l15M46J445K103J854Q04m08j198j306q85l83p2K93Q99J204N33
$$ 286429 285606 285291 285737 287182 289285 291139 291943 291535 290337 289031 288146 287763 287691 287984 288883 290087 290620
53647B90620p56j567j470j010n28K37J226J830J892K003K331K302J870J984L012
$$ 290620 289864 288297 286827 285817 285289 285526 286752 288582 290474 292477 294808 297110 298980 300964 303976
53632C03976L836L387K206J435J165Q96Q81J684K887L575L833M541N719O372O040
$$ 303976 307812 311199 313405 314840 316005 316901 317782 319466 322353 325928 329761 334302 340021 346393 352433
53617C52433N354M848M291L567L232L649M239M204L546K937K847L175L475L338
$$ 352433 357787 362635 366926 370493 373725 377374 381613 385817 389363 392300 395147 398322 401797 405135
53603D05135K748K185K036J978J375L55r8N17J407J472O62k80j043j935k836k893
$$ 405135 407883 410068 412104 414082 415457 415812 415714 416231 417638 419110 419772 419492 418449 416514 413678 410785
53587D10785j694j93K12o93j816k250k256k561l211l560l161k192j214p88j232
$$ 410785 409091 408898 409110 408417 406601 404351 402095 399534 396323 392763 389602 387410 386196 385408 384176
53572C84176k328l249l187k112p16L21P00L82l85r82r16m56l46p11q80l83M49
$$ 384176 381848 378599 375412 373300 372584 372905 373605 373987 373602 372620 371704 371248 370902 370191 369311 368928 369377
53555C69377J136J662K080K080J493P48L07L1l72o38l34L64R61J492K356L409
$$ 369377 370513 372175 374255 376335 377828 378576 378883 378914 378542 377904 377570 377934 378895 380387 382743 386152
53539C86152M009M068M225M746N028M622M141M502N629O645P189P816Q951J0110
$$ 386152 390161 394229 398454 403200 408228 412850 416991 421493 427122 433767 440956 448772 457723 467833
53525D67833J0609J0624J0986J1972J2927J3241J3198J3444J4010J4450J4760
$$ 467833 478442 489066 500052 512024 524951 538192 551390 564834 578844 593294 608054
53514F08054J5534J7001J8521J9383J9738K0315K1425K2665K3503K3854K3958
$$ 608054 623588 640589 659110 678493 698231 718546 739971 762636 786139 809993 833951
53503H33951K4017K3975K3631K2885K1877K0810J9702J8527J7533J7134J7359
$$ 833951 857968 881943 905574 928459 950336 971146 990848 1009375 1026908 1044042 1061401
53492A061401J7738J7944J8163J8536J8659J8134J7393J7296J7906J8277J7687
$$ 1061401 1079139 1097083 1115246 1133782 1152441 1170575 1187968 1205264 1223170 1241447 1259134
53481A259134J6592J5947J5985J6141J6031J5847J5662J4860J2787R755O851M682
$$ 1259134 1275726 1291673 1307658 1323799 1339830 1355677 1371339 1386199 1398986 1408741 1415592 1420274
53469A420274K725K06k752n305p076q597j0499j2654j4385j5237j5346j5225j5376
$$ 1420274 1422999 1423205 1420453 1415148 1408072 1399475 1388976 1376322 1361937 1346700 1331354 1316129 1300753
53456A300753j5956j6661j7081j7255j7687j8615j9582k0018k0025k0123k0358
$$ 1300753 1284797 1268136 1251055 1233800 1216113 1197498 1177916 1157898 1137873 1117750 1097392
53445A097392k0163j9241j8131j7499j7182j6394j4794j2870j1072r079o336l132
$$ 1097392 1077229 1057988 1039857 1022358 1005176 988782 973988 961118 950046 940967 934631 931499
53433I31499o08M43L62J00K49Q45J773K965M283N626P065Q723J0448J1946J3095
$$ 931499 930891 931334 931696 931796 932045 932890 934663 937628 941911 947537 954602 963325 973773 985719 998814
53418I98814J4019J4885J5945J7546J9768K2080K3749K4585K5056K5694K6755
$$ 998814 1012833 1027718 1043663 1061209 1080977 1103057 1126806 1151391 1176447 1202141 1228896
53407A228896K8332L0307L2132L3189L3516L3904L5078L7093L9597M2242M4749
$$ 1228896 1257228 1287535 1319667 1352856 1386372 1420276 1455354 1492447 1532044 1574286 1619035
53396A619035M6892M8696N0320N1689N2532N2929N3399N4251N5211N5819N5867
$$ 1619035 1665927 1714623 1764943 1816632 1869164 1922093 1975492 2029743 2084954 2140773 2196640
53385B196640N5201N3599N1112M8214M5286M2291L9238L6508L4316L2148K9245
$$ 2196640 2251841 2305440 2356552 2404766 2450052 2492343 2531581 2568089 2602405 2634553 2663798
53374B663798K5396K0929J6171J1354O758K387k297p848j4092k0410k6575l2702
$$ 2663798 2689194 2710123 2726294 2737648 2744406 2746793 2744496 2736648 2722556 2702146 2675571 2642869
53362B642869l8492m3229m6779m9862n2992n5555n6531n5825n4401n3114n1932
$$ 2642869 2604377 2561148 2514369 2464507 2411515 2355960 2299429 2243604 2189203 2136089 2084157
53351B084157n0367m8313m6122m4105m2313m0839l9941l9697l9790l9831l9711
$$ 2084157 2033790 1985477 1939355 1895250 1852937 1812098 1772157 1732460 1692670 1652839 1613128
53340A613128l9419l8640l6998l4645l2207l0091k8108k5916k3472k1020j8868
$$ 1613128 1573709 1535069 1498071 1463426 1431219 1401128 1373020 1347104 1323632 1302612 1283744
53329A283744j7287j6329j5592j4495j3018j1838j1542j1942j2390j2494j2255
$$ 1283744 1266457 1250128 1234536 1220041 1207023 1195185 1183643 1171701 1159311 1146817 1134562
53318A134562j1779j1123j0334r418q392p373o422n185l200p07J315K269K691
$$ 1134562 1122783 1111660 1101326 1091908 1083516 1076143 1069721 1064536 1061336 1060629 1061944 1064213 1066904
53305A066904L454M600N629O536P853R714J1597J3077J4275J5464J6798J8544
$$ 1066904 1070358 1074958 1080587 1087123 1094976 1104690 1116287 1129364 1143639 1159103 1175901 1194445
53293A194445K0930K3491K5214K5767K6070K7065K8320K8541K7264K5268K3340
$$ 1194445 1215375 1238866 1264080 1289847 1315917 1342982 1371302 1399843 1427107 1452375 1475715
53282A475715K1455J9418J7447J5625J3403J0370P082M321J788j487n482q925
$$ 1475715 1497170 1516588 1534035 1549660 1563063 1573433 1580515 1584836 1586624 1585137 1579655 1570730
53270A570730j0999j2347j3917j5672j7145j8485k0170k2142k4031k5766k7249
$$ 1570730 1559731 1547384 1533467 1517795 1500650 1482165 1461995 1439853 1415822 1390056 1362807
53259A362807k7960k7781k7704k8586k9716k9753k8803k8102k7869k7138k5827
$$ 1362807 1334847 1307066 1279362 1250776 1221060 1191307 1162504 1134402 1106533 1079395 1053568
53248A053568k5155k5503k5595k4694k3965k4477k5245k4765k3381k2536k2394
$$ 1053568 1028413 1002910 977315 952621 928656 904179 878934 854169 830788 808252 785858
53237G85858k1898k0735j9644j8852j7747j6200j4879j4055j3068j1382r263p279
$$ 785858 763960 743225 723581 704729 686982 670782 655903 641848 628780 617398 608135 600856
53225F00856n886n554o475p924q773q841r026r890j0855j1124j0739j0402j0638
$$ 600856 594970 589416 582941 575017 566244 557403 548377 538487 527632 516508 505769 495367 484729
53212D84729j1425j2202j2217j1172r588q130o830n515m667m913n753n901n084
$$ 484729 473304 461102 448885 437713 428125 419995 413165 407650 402983 398070 392317 386416 381332
53199C81332m475m928n832o255o328o639p007o807o146n727n661n294m266l148
$$ 381332 376857 371929 366097 359842 353514 346875 339868 333061 326915 321188 315527 310233 305967 302819
53185C02819k691k916l198l071k682k463k556k693k587k254j838j377r17o40o10
$$ 302819 300128 297212 294014 290943 288261 285798 283242 280549 277962 275708 273870 272493 271576 270936 270326
53170B70326n87m05l73q05j377j447j031p98j067j382j259q83p29r22j235j448
$$ 270326 269739 269334 268961 268156 266779 265332 264301 263503 262436 261054 259795 258912 258183 257261 256026 254578
53154B54578j495j411j319j222q61q3O75P17l3q37j025o37j88j41o69j479j798
$$ 254578 253083 251672 250353 249131 248270 248187 248862 249579 249546 248709 247684 247047 246859 246718 246049 244570 242772
53137B42772j027M65J658K029J883J572J102P04R45J779K182J421J34n17l48j15
$$ 242772 241745 242210 243868 245897 247780 249352 250454 251158 252103 253882 256064 257485 257619 257102 256754 256639
53121B56639j52Q6J061K316K888K330J190M91P61J505J818J342M17o72j927l024
$$ 256639 256487 256573 257634 259950 262838 265168 266358 266849 267610 269115 270933 272275 272692 272020 270093 267069
53105B67069l197k226j048p46j293j811j792j447j081p85p29j097j626j750j299
$$ 267069 263872 261646 260598 259852 258559 256748 254956 253509 252428 251643 250914 249817 248191 246441 245142
53090B45142o94l22j60p3j52m96r43j142q37r1O44Q24M25J15M80J189J376Q41
$$ 245142 244448 244126 243966 243893 243741 243245 242302 241160 240323 240232 240876 241700 242125 242240 242720 243909 245285 246126
53072B46126K91K15J99l01j010j292j186j313j782j988j617j184j168j238r18
$$ 246126 246417 246632 246831 246530 245520 244228 243042 241729 239947 237959 236342 235158 233990 232752 231834
53057B31834n04o16j018p92K77J300J543J302J226J361J479J660J943J833R60
$$ 231834 231330 230714 229696 228904 229181 230481 232024 233326 234552 235913 237392 239052 240995 242828 243788
53042B43788j24o19o75j014j535j348l07N69O05M11P66J356J330O14j55o32r86
$$ 243788 243664 243045 242370 241356 239821 238473 238166 238735 239340 239751 240517 241873 243203 243817 243662 243030 242044
53025B42044j262j225q85o44p48r06n59N13J864K607K195J061K83M08Q99R30M03
$$ 242044 240782 239557 238672 238028 237280 236374 235815 236328 238192 240799 242994 244055 244338 244746 245645 246575 246978
53008B46978r7j76JJ00k2l51p83j083r77m67N2J67n6p3M50J044Q83q8q79o09M82
$$ 246978 246881 246705 246706 246806 246784 246433 245650 244567 243590 243123 243175 243342 243286 243213 243663 244707 245590 245502 244623 244014 244496
52987B44496J521K106K250J724M40o92m53R83K058J959J592J922K386J932P37
$$ 244496 246017 248123 250373 252097 252537 251845 251392 252375 254433 256392 257984 259906 262292 264224 264961
52972B64961j71m64n29l38M80J521J742R13M0J7O37J196J376J187O49m5m82o08
$$ 264961 264790 264326 263797 263459 263939 265460 267202 268115 268155 268172 268809 270005 271381 272568 273217 273172 272690 272082
52954B72082r62j946l090l512k998k233j914j929j642q18l6K4n26r39q12n55o43
$$ 272082 271120 269174 266084 262572 259574 257341 255427 253498 251856 251038 251002 251026 250500 249561 248749 248194 247551
52937B47551q41n63K41J008J246R72N18J95J13L3m71j432k189k006r61Q9M24J03
$$ 247551 246710 246147 246388 247396 248642 249614 250132 250327 250440 250473 250002 248570 246381 244375 243414 243503 243927 244030
52919B44030k71j76L83R13R21N16K62L80M21M6l93m73n05j052j869k145j665j049
$$ 244030 243759 243583 243966 244879 245800 246316 246578 246958 247379 247425 247032 246559 246054 245002 243133 240988 239323 238274
52901B38274p26n07k72l54q50j173p18M36J758K752K985K135N88n00k85Q30J720
$$ 238274 237548 237041 236769 236415 235565 234392 233674 234110 235868 238620 241605 243740 244328 243828 243543 244373 246093
52884B46093J798J290N46k94r43r64k93N33R56R21P40O77Q27J155J475J591J659
$$ 246093 247891 249181 249727 249433 248490 247526 247233 247766 248722 249643 250383 251060 251887 253042 254517 256108 257767
52867B57767K207L420M559M570L307J715N68l66j524k447k313j399j073k013l313
$$ 257767 259974 263394 267953 272523 275830 277545 278113 277747 276223 273776 271463 270064 268991 266978 263665
52852B63665l804l629l745m338m627m089l087k144j364p41m43m41l39L6K59j38
$$ 263665 259861 256232 252487 248149 243522 239433 236346 234202 232838 232097 231654 231213 230874 230910 231169 231031
52836B31031r63j559j503q14K98J469K136J876R75K82L31P72Q16J29q90j626j838
$$ 231031 230068 228509 227006 226192 226490 227959 230095 231971 232946 233228 233559 234331 235147 235276 234386 232760 230922
52819B30922j609j015o9J005J665J509P48R9J46Q21J532J726J376R11P17P25N33
$$ 230922 229313 228298 228229 229234 230899 232408 233156 233255 233401 234222 235754 237480 238856 239767 240484 241209 241742
52802B41742j44j186k194k821k975k808k511k034j185p1P73R25N90K14j83p99
$$ 241742 241598 240412 238218 235397 232422 229614 227103 225069 223884 223813 224586 225511 226101 226315 226132 225333
52786B25333j320j105j96N75P49Q26J271J681J473Q81M84K50j47m00L1P83Q23
$$ 225333 224013 222908 222712 223287 224036 224862 226133 227814 229287 230168 230652 230902 230755 230355 230386 231169 231992
52769B31992j6p34o28k53m44j116j579j554j264q23j66O23J316J864K326K620
$$ 231992 231976 231242 230614 230361 229917 228801 227222 225668 224404 223581 223415 224038 225354 227218 229544 232164
52753B32164K628K447K232J874J166K60l33l12J22N63Q75J225J730K181K217J778
$$ 232164 234792 237239 239471 241345 242511 242771 242438 242126 242248 242811 243686 244911 246641 248822 251039 252817
52737B52817J312J289J558J485Q64L41O17J432J861J553J110J123J339J133M06
$$ 252817 254129 255418 256976 258461 259325 259666 260283 261715 263576 265129 266239 267362 268701 269834 270240
52722B70240n03j423k316k821k553j892j761k396k985k854k330j926j418m10O81
$$ 270240 269737 268314 265998 263177 260624 258732 256971 254575 251590 248736 246406 244480 243062 242652 243333
52707B43333J139J066J060J026L57p12j085l79M70N77K36J58L50K95k50j119j873
$$ 243333 244472 245538 246598 247624 247981 247269 246184 245805 246275 246852 247088 247246 247596 247891 247641 246522 244649
52690B44649j830n55J290K326K047J290Q47M86q0l11J87O71L14n02q98r15j089
$$ 244649 242819 242264 243554 245880 247927 249217 250064 250550 250470 250159 250346 251017 251331 250829 249931 249016 247927
52673B47927j230q52l14k93m64p1M74P9j072j490n52P41J415J647J833J799J549
$$ 247927 246697 245845 245531 245238 244774 244703 245177 245256 244184 242694 242142 242883 244298 245945 247778 249577 251126
52656B51126J661K291K698K415K037K227K658K617J987J089J31o14p59m51n15
$$ 251126 252787 255078 257776 260191 262228 264455 267113 269730 271717 272806 272937 272323 271564 271113 270598
52641B70598j403k447k719k137j275n27L7M18P57J241J686J641J183J021J408
$$ 270598 269195 266748 264029 261892 260617 260090 260127 260545 261302 262543 264229 265870 267053 268074 269482
52626B69482J695J376Q27M52j52j397k683l118k802k549k562k321j634r72o22
$$ 269482 271177 272553 273380 273832 273680 272283 269600 266482 263680 261131 258569 256248 254614 253642 253020
52611B53020k51M18J034R77J53q17j134o11J75O24Q03J098J378J132M43J8J01
$$ 253020 252769 253187 254221 255198 255351 254534 253400 252789 252964 253588 254391 255489 256867 257999 258442 258460 258561
52594B58561J51j45l29p2K07J81K08M79L73m25r70k55J142J778J313P55Q56J342
$$ 258561 258712 258567 258238 258166 258373 258554 258762 259241 259614 259189 258219 257964 259106 260884 262197 262952 263808 265150
52576B65150J716J823J527P07k63p29n45r5L62O93M06q64k355k634j396M5M37
$$ 265150 266866 268689 270216 270923 270660 269931 269386 269291 269653 270346 270752 269888 267533 264899 263503 263548 263985
52559B63985l0m59o20q73j187j098n51j35l46r06j053l72P55J535J574J184Q86
$$ 263985 263955 263496 262876 262003 260816 259718 259167 259032 258686 257780 256727 256355 257110 258645 260219 261403 262289
52542B62289P93O27K32k02l51p3M61Q31P30L08m8k60n82r53q75k27L76M68M55
$$ 262289 263082 263709 263941 263739 263388 263315 263776 264607 265337 265645 265597 265337 264755 263802 262927 262700 263076 263544 263999
52523B63999Q75J348J113L18r7K56Q34J155J384J688J810J651J740K534L641M171
$$ 263999 264874 266222 267335 267653 267556 267812 268646 269801 271185 272873 274683 276334 278074 280608 284249 288420
52507B88420L723K688J710J017L37o59j857k733k975k841k757k744k511j993j418
$$ 288420 292143 294831 296541 297558 297895 297236 295379 292646 289671 286830 284073 281329 278818 276825 275407
52492B75407r99q30r53j230j300j000o68o69p56m54J82O62R09J384K242K922K760
$$ 275407 274408 273578 272625 271395 270095 269095 268427 267758 267002 266548 266730 267392 268301 269685 271927 274849 277609
52475B77609J744N39m4L16J080J231L78o38o32N76K096L058L221K727J887J266
$$ 277609 279353 279892 279848 280164 281244 282475 282853 282215 281583 282159 284255 287313 290534 293261 295148 296414
52459B96414J278J589J354J94j516l233m595n231m945m185l620l166k121m81O90
$$ 296414 297692 299281 300635 300829 299313 296080 291485 286254 281309 277124 273504 270338 268217 267736 268426
52444B68426O54j6l54k53j79j76P4M51M84J51l6J78M66N24N04O05N53q7j147j812
$$ 268426 269080 269064 268710 268457 268278 268102 268176 268627 269111 269262 269226 269404 269870 270394 270898 271503 272056 271969 270822 269010
52424B69010j492n30K04L61L92Q00J468J955K059J840J428J131J388K244L155
$$ 269010 267518 266988 267192 267553 267945 268745 270213 272168 274227 276067 277495 278626 280014 282258 285413
52409B85413L719M251N149O127O786P485Q737R923R710P805N296K966L60l008
$$ 285413 289132 293383 298532 304659 311445 318930 327667 337590 347300 355105 360401 363367 363727 360719
52395C60719o353q305q407p384o230n437m878m041k657j198m29m65p07p73p91
$$ 360719 354366 346061 337654 330270 324040 318603 313725 309684 307027 305829 305400 304935 304228 303455 302664
52380C02664p12r9J030J961K291K477K907L162K846K471K739L451L918M030M075
$$ 302664 301952 301853 302883 304844 307135 309612 312519 315681 318527 320998 323737 327188 331106 335136 339211
52365C39211L837K810J153l47j283j871k234k095j326l17L98N36J73k22o6O50
$$ 339211 343048 345858 347011 346664 345381 343510 341276 339181 337855 337538 337936 338472 338645 338423 338357 339007
52349C39007J072M79o07r15j9J245K029K448K939L326L083K260J600J754K753
$$ 339007 340079 340558 339951 339036 339017 340262 342291 344739 347678 351004 354087 356347 357947 359701 362454
52334C62454M202N678O837P478P707P930Q471R198R775J0229J0925J1899J2621
$$ 362454 366656 372334 379171 386649 394356 402286 410757 419955 429730 439959 450884 462783 475404
52321D75404J2695J2446J2403J2469J2193J1637J1336J1446J1618J1732J2096
$$ 475404 488099 500545 512948 525417 537610 549247 560583 572029 583647 595379 607475
52310F07475J2742J3281J3675J4394J5527J6381J6511J6465J6913J7572J7605
$$ 607475 620217 633498 647173 661567 677094 693475 709986 726451 743364 760936 778541
52299G78541J6781J5601J4606J3930J3276J1947R380O031L243J765R72l0j206
$$ 778541 795322 810923 825529 839459 852735 864682 874062 880093 883336 885101 886073 886043 884837
52286H84837k180l183m475n432n387m912n001n338m710l082j755j339r63L8J045
$$ 884837 882657 879474 874999 869567 864180 859268 854267 848929 844219 841137 839382 838043 837080 837118 838163
52271H38163J497K007L276M727N355N187M993N020N073N409O415P629Q208Q402
$$ 838163 839660 841667 844943 849670 855025 860212 865205 870225 875298 880707 887122 894751 902959 911361
52257I11361R460J1698J3746J4277J3782J3764J4624J5284J4748J3230J1516R872
$$ 911361 920821 932519 946265 960542 974324 988088 1002712 1017996 1032744 1045974 1057490 1067362
52245A067362Q095O079L847J292j527l893m894m471l626l423m152n474o937q038
$$ 1067362 1075457 1081536 1085383 1086675 1085148 1081255 1076361 1071890 1068264 1064841 1060689 1055215 1048278 1040240
52231A040240q329p809p047o588o447o353o213o057n819n483n158m773m071l120
$$ 1040240 1031911 1024102 1017055 1010467 1004020 997667 991454 985397 979578 974095 968937 964164 960093 956973
52217I56973k489k497k692k414j515j03J815L909N255N277M628M322M325L850
$$ 956973 954484 951987 949295 946881 945366 945263 947078 950987 956242 961519 966147 970469 974794 978644
52203I78644K834K044J858J960K328L422N137O575P241P602Q035Q125P565O877
$$ 978644 981478 983522 985380 987340 989668 993090 998227 1004802 1012043 1019645 1027680 1035805 1043370 1050247
52189A050247O538O063M769K946J377J14j436l350m969n874o445p260q381r337
$$ 1050247 1056785 1062848 1067617 1070563 1071940 1072054 1070618 1067268 1062299 1056425 1049980 1042720 1034339 1025002
52175A025002r559q824p506o354n773n391m656l647k887k422j650k14J356K282
$$ 1025002 1015443 1006619 999113 992759 986986 981595 976939 973292 970405 967983 966333 966119 967475 969757
52161I69757K532K700K950K711J658N25L01Q31R96L38l06k15N7k54o42JJ484K333
$$ 969757 972289 974989 977939 980650 982308 982833 983134 983965 984961 985299 984993 984778 984835 984581 983939 983940 985424 987757
52143I87757J849R67P67J069J025K83r83k428l361k868r75R63J743J832K677M777
$$ 987757 989606 990573 991340 992409 993434 993717 992734 990306 986945 984077 983102 984065 985808 987640 990317 995094
52127I95094P383R775J2018J4339J6517J8173J9200J9709J9813J9694J9623J9818
$$ 995094 1002477 1012252 1024270 1038609 1055126 1073299 1092499 1112208 1132021 1151715 1171338 1191156
52115A191156K0224K0416J9785J8230J6575J5841J5879J5399J3732J1845J1064
$$ 1191156 1211380 1231796 1251581 1269811 1286386 1302227 1318106 1333505 1347237 1359082 1370146
52104A370146J1427J2049J2597J3341J4063J3994J2792J0720P855M218O05j826
$$ 1370146 1381573 1393622 1406219 1419560 1433623 1447617 1460409 1471129 1478984 1483202 1483807 1481981
52092A481981l214n127q442j1994j4134j4800j5158j5640j5524j4336j2712j1546
$$ 1481981 1478767 1473640 1465198 1453204 1439070 1424270 1409112 1393472 1377948 1363612 1350900 1339354
52080A339354j0969j0475r657q472p061n598m266l120k007p89M22J345J976K727
$$ 1339354 1328385 1317910 1308253 1299781 1292720 1287122 1282856 1279736 1277729 1276940 1277362 1278707 1280683 1283410
52066A283410L978N550O936Q011R121J0369J1242J1387J1331J1867J2936J3716
$$ 1283410 1287388 1292938 1299874 1307885 1317006 1327375 1338617 1350004 1361335 1373202 1386138 1399854
$$ [...]
##END NTUPLES=NMR SPECTRUM
##END=
