
##TITLE=AC1200_HiSAH12054_6666810_o7svrTITCg
##JCAMPDX= 6.0         $$ Bruker NMR JCAMP-DX V2.0
##DATA TYPE= NMR SPECTRUM
##DATA CLASS= NTUPLES
##ORIGIN= BRUKER
##OWNER= Administrator
$$ 1.72 TOPSPIN		Version 2.1
$$ 2012-08-14 10:14:58.531 -0500  Administrator@TOPSPIN
$$ Compression mode = diff/dup
##.OBSERVE FREQUENCY= 400.02188249412
##.OBSERVE NUCLEUS= ^1H
##.ACQUISITION MODE= SIMULTANEOUS (DQD)
##.ACQUISITION SCHEME= undefined
##.AVERAGES= 64
##.DIGITISER RES= 22
##SPECTROMETER/DATA SYSTEM= spect
##.PULSE SEQUENCE= noesygpps1d.comp
##.SOLVENT NAME= COFFEE_meoh
##.SHIFT REFERENCE= INTERNAL, COFFEE_meoh, 1, 14.96242
##AUDIT TRAIL= $$ (NUMBER, WHEN, WHO, WHERE, PROCESS, VERSION, WHAT)
$$ ##TITLE= Audit trail, TOPSPIN		Version 2.1
$$ ##JCAMPDX= 5.01
$$ ##ORIGIN= Bruker BioSpin GmbH
$$ ##OWNER= Administrator
$$ $$ C:\Bruker\TOPSPIN/data/COFFEE/nmr/AC1200_HiSAH12054_6666810_o7svrTITCg/12/pdata/1/auditp.txt
$$ ##AUDIT TRAIL=  $$ (NUMBER, WHEN, WHO, WHERE, PROCESS, VERSION, WHAT)
(   1,<2012-08-14 10:14:53.546 -0500>,<Administrator>,<TOPSPIN>,<go>,<TOPSPIN 2.1>,
      <created by zg
	started at 2012-08-14 10:03:23.328 -0500,
	POWCHK enabled, PULCHK disabled,
       configuration hash MD5:
       6B 1B 68 BB D9 2E 58 E2 7F 35 AD 54 07 DF 0E 41
       data hash MD5: 64K
       55 37 D4 38 84 37 45 15 30 B1 57 D4 A4 F4 7A E2>)
(   2,<2012-08-14 10:14:56.375 -0500>,<Administrator>,<TOPSPIN>,<proc1d>,<TOPSPIN 2.1>,
      <Start of raw data processing
       efp LB = 0.3 FT_mod = 6 PKNL = 1 PHC0 = 0 PHC1 = 0 SI = 128K 
       data hash MD5: 128K
       BD 03 70 EB F5 98 84 FB E7 71 6A 17 D4 4B AF 42>)
(   3,<2012-08-14 10:14:57.625 -0500>,<Administrator>,<TOPSPIN>,<proc1d>,<TOPSPIN 2.1>,
      <pk PHC0 = 5.960083 PHC1 = 0 
       data hash MD5: 128K
       57 FE D7 16 B4 B3 A0 A7 FF 82 E5 FF 8A EE 2A B6>)
(   4,<2012-08-14 10:14:58.156 -0500>,<Administrator>,<TOPSPIN>,<proc1d>,<TOPSPIN 2.1>,
      <abs ABSG = 1 
       data hash MD5: 128K
       63 EC 2F 0A 9C 46 1B 7B 83 3B 22 86 FD 50 AA 2D>)
(   5,<2012-08-14 10:14:58.234 -0500>,<Administrator>,<TOPSPIN>,<proc1d>,<TOPSPIN 2.1>,
      <abs ABSG = 2 
       data hash MD5: 128K
       50 62 0F 09 30 98 3C 45 AA 59 17 4F 67 8A E0 2F>)
(   6,<2012-08-14 10:14:58.296 -0500>,<Administrator>,<TOPSPIN>,<proc1d>,<TOPSPIN 2.1>,
      <abs ABSG = 3 
       data hash MD5: 128K
       77 30 59 6C 4C 25 9E 67 BA 03 CB 76 10 10 97 EA>)
(   7,<2012-08-14 10:14:58.359 -0500>,<Administrator>,<TOPSPIN>,<proc1d>,<TOPSPIN 2.1>,
      <abs ABSG = 4 
       data hash MD5: 128K
       82 6A 5C 28 81 68 C1 5C 99 95 5C 8F CE 5A 26 28>)
(   8,<2012-08-14 10:14:58.406 -0500>,<Administrator>,<TOPSPIN>,<proc1d>,<TOPSPIN 2.1>,
      <abs ABSG = 5 
       data hash MD5: 128K
       F6 ED FE 53 DD 48 0A 0C B0 35 43 13 26 2A 51 CC>)
$$ ##END=
$$ 
$$ $$ hash MD5
$$ $$ 07 D4 37 A8 F4 A9 66 AE 70 8E 1A 7C 2D 7A 76 9C
##$RELAX= 
##$RELAX= 
##$RELAX= 
##$RELAX= 
##$RELAX= 
##$RELAX= 
##$RELAX= 
##$RELAX= 
$$ Bruker specific parameters
$$ [...]
150 150 150 150 150 150 150 150
##$TP07= 0
##$TPNAME0= <>
##$TPNAME1= <>
##$TPNAME2= <>
##$TPNAME3= <>
##$TPNAME4= <>
##$TPNAME5= <>
##$TPNAME6= <>
##$TPNAME7= <>
##$TPOAL= (0..7)
0.5 0.5 0.5 0.5 0.5 0.5 0.5 0.5
##$TPOFFS= (0..7)
0 0 0 0 0 0 0 0
##$TUNHIN= 0
##$TUNHOUT= 0
##$TUNXOUT= 0
##$USERA1= <user>
##$USERA2= <user>
##$USERA3= <user>
##$USERA4= <user>
##$USERA5= <user>
##$V9= 5
##$VALIST= <valist>
##$VCLIST= <CCCCCCCCCCCCCCC>
##$VD= 0
##$VDLIST= <DDDDDDDDDDDDDDD>
##$VPLIST= <PPPPPPPPPPPPPPP>
##$VTLIST= <TTTTTTTTTTTTTTT>
##$WBST= 1024
##$WBSW= 4
##$XGAIN= (0..3)
0 0 0 0
##$XL= 0
##$YL= 0
##$YMAX_a= 15997112
##$YMIN_a= -8669306
##$ZGOPTNS= <>
##$ZL1= 120
##$ZL2= 120
##$ZL3= 120
##$ZL4= 120
##$ABSF1= 14.96242
##$ABSF2= -5.595761
##$ABSG= 5
##$ABSL= 3
##$ALPHA= 0
##$AQORDER= 0
##$ASSFAC= 0
##$ASSFACI= 0
##$ASSFACX= 0
##$ASSWID= 0
##$AUNMP= <proc_prof1d_extract.lims>
##$AXLEFT= 0
##$AXNAME= <>
##$AXNUC= <1H>
##$AXRIGHT= 0
##$AXTYPE= 0
##$AXUNIT= <>
##$AZFE= 0.1
##$AZFW= 0.1
##$BCFW= 0
##$BC_mod= 0
##$BYTORDP= 0
##$COROFFS= 0
##$CY= 15
##$DATMOD= 1
##$DC= 0
##$DFILT= <>
##$DTYPP= 0
##$F1P= 0
##$F2P= 0
##$FCOR= 0.5
##$FTSIZE= 131072
##$FT_mod= 6
##$GAMMA= 0
##$GB= 0
##$INTBC= 1
##$INTSCL= 1
##$ISEN= 128
##$LB= 0.3
##$LEV0= 0
##$LPBIN= 0
##$MAXI= 10000
##$MC2= 0
##$MEAN= 0
##$ME_mod= 0
##$MI= 0
##$NCOEF= 0
##$NC_proc= -2
##$NLEV= 6
##$NOISF1= 0
##$NOISF2= 0
##$NSP= 0
##$NTH_PI= 0
##$NZP= 0
##$OFFSET= 14.96242
##$PC= 1
##$PHC0= 5.960083
##$PHC1= 0
##$PH_mod= 1
##$PKNL= yes
##$PPARMOD= 0
##$PPDIAG= 0
##$PPIPTYP= 0
##$PPMPNUM= 2147483647
##$PPRESOL= 1
##$PSCAL= 4
##$PSIGN= 0
##$PYNMP= <proc.py>
##$REVERSE= no
##$SF= 400.020009069608
##$SI= 131072
##$SIGF1= 0
##$SIGF2= 0
##$SINO= 400
##$SIOLD= 131072
##$SPECTYP= <>
##$SREGLST= <1H.CDCl3>
##$SSB= 0
##$STSI= 131072
##$STSR= 0
##$SW_p= 8223.68421052631
##$SYMM= 0
##$S_DEV= 0
##$TDeff= 65536
##$TDoff= 0
##$TI= <>
##$TILT= no
##$TM1= 0
##$TM2= 0
##$TOPLEV= 0
##$USERP1= <user>
##$USERP2= <user>
##$USERP3= <user>
##$USERP4= <user>
##$USERP5= <user>
##$WDW= 1
##$XDIM= 131072
##$YMAX_p= 452481505
##$YMIN_p= -71315
##$CURPLOT= <Network HP LaserJet P1505>
##$CURPRIN= <$Network HP LaserJet P1505>
##$DFORMAT= <normdp>
##$LAYOUT= <+/1D_H.xwp>
##$LFORMAT= <normlp>
##$PFORMAT= <normpl>
##$SURQMSG= 1
$$ End of Bruker specific parameters
$$ ---------------------------------
##NTUPLES= NMR SPECTRUM
##VAR_NAME=  FREQUENCY,     SPECTRUM/REAL,   SPECTRUM/IMAG
##SYMBOL=    X,             R,               I
##VAR_TYPE=  INDEPENDENT,   DEPENDENT,       DEPENDENT
##VAR_FORM=  AFFN,          ASDF,            ASDF
##VAR_DIM=   131072,        131072,          131072
##UNITS=     HZ,            ARBITRARY UNITS, ARBITRARY UNITS
##FACTOR=    0.0627417313425164, 1,          1
##FIRST=     8223.62146879497, -902,         -56295
##LAST=      0,             1233,            -56254
##MIN=       0,             -71315,          0
##MAX=       8223.62146879497, 452481505,    0
$$ Real data points
##PAGE= N=1
##DATA TABLE= (X++(R..R)), XYDATA
$$ [...]
64475 62231 62131 62575 63060 63568 64714 66713 68698 69421 68405 66304 64436 63930 64833 65963 66074 65224 64583
64458 64583 64931 65905 66760 67202 67305 67203 67191 67644 68562 69535 70319 71044 71692 71856 71302 70361 69480 68729 68002
64439 68002 67411 67149 67196 67399 67688 68044 68417 68828 69402 70178 70972 71564 71941 72339 73052 74120 75187 75884 76465
64420 76465 77758 80264 83591 87085 90643 94440 98175 101204 103343 104973 106419 107776 109216 110826
64406 110826 112090 112205 111067 109430 107929 106460 104692 102654 100502 98127 95304 91956 88105 83866
64392 83866 79681 76227 73827 72213 71023 70291 70229 70746 71405 71762 71639 71201 70837 70857 71214 71628 71938 72155
64374 72155 72241 72140 72050 72372 73245 74362 75344 76110 76745 77153 77118 76658 76111 75715 75252 74338 73134 72387 72516
64355 72516 72969 72984 72769 73227 74520 75694 76019 75949 76238 76711 76574 75539 74068 72738 71928 71901 72589 73425
64337 73425 73804 73665 73362 73172 73180 73364 73498 73388 73522 74923 77878 81314 84051 86176 88446 90842 92600
64320 92600 93494 94131 95036 96190 97425 98585 99323 99425 99342 99777 100772 101714 102121 101829 100650 98614 96497
64303 96497 95279 95048 95101 95087 95355 96152 97221 98318 99421 100339 100752 100785 100985 101594 102422 103390 104561 105599
64285 105599 105970 105921 106562 108734 112243 116374 120569 124443 127709 130399 132873 135424 138119 140921 143607
64270 143607 145713 147012 147846 148418 148037 145857 142195 138281 134723 131095 127130 123397 120511 118421 116759
64255 116759 115313 113928 112577 111664 111658 112278 112683 112560 112380 112519 112848 113258 113820 114282 114312 114395 115571 117957
64237 117957 120415 122099 123424 125066 126937 128823 131245 134872 139519 144432 149162 153591 157460 160497
64223 160497 162760 164469 165673 166386 166708 166533 165517 163576 161060 158184 154753 150751 146776 143550 141296
64208 141296 139856 139040 138586 138159 137674 137433 137801 138973 140987 143564 146059 148107 150209 153047 156320 159091
64192 159091 161255 163626 166438 168795 169966 170230 169994 169095 167572 166151 165195 164031 162093 160014 158712
64177 158712 158094 157606 157491 158438 160225 161755 162427 162696 163264 164292 165489 166530 167362 168383 170203 173036
64161 173036 176555 180467 184922 190107 195886 202083 208730 215796 223188 231269 240761 251782 263618 275852
64147 275852 289000 303457 318522 333199 347307 360933 373262 382973 389558 393298 394070 391112 384180
64134 384180 374235 362709 350487 337756 324534 311230 298689 287609 277849 268745 260168 252696
64122 252696 246419 240341 233700 227346 222863 220528 218991 216956 214352 211737 209338 207154 205536 205113
64108 205113 206111 207992 209849 211196 212333 213894 216142 218849 221752 224795 228045 231756 236454 242427
64094 242427 249168 255907 262746 270515 279425 288718 298007 307976 319106 330497 340784 349624 357352
64081 357352 363606 367373 368313 367174 364773 361224 356358 350304 343432 336024 328211 320152 312168 304732
64067 304732 298190 292492 287411 282956 279310 276412 274099 272610 272321 272952 273782 274835 276968 280341 283665
64052 283665 285736 287060 289223 293095 298402 304682 311907 320335 330303 341996 354976 368267 381360
64039 381360 394814 409401 425011 440876 456487 471783 486764 501430 515743 529208 540925
64028 540925 550612 559154 567580 575897 583515 590361 596853 603158 609268 615579 622594 630081 637076 642660
64014 642660 646286 647588 646423 643069 638042 631833 625012 618191 611648 605442 600131 596696 595375 595345 596115
63999 596115 598387 602850 608933 615724 623438 632926 644239 656782 670524 685977 703231 722022 742478
63986 742478 764829 788684 813702 840861 871945 907729 947467 990096 1035083 1082307 1132040
63975 1132040 1185050 1241941 1302570 1366952 1436427 1512931 1597395 1690028 1791953 1905305 2031818
63964 2031818 2172920 2331565 2512670 2721332 2961829 3238935 3559067 3929381 4356513
63955 4356513 4846718 5406043 6039039 6747210 7528855 8379665 9292881 10259466 11268794
63946 11268794 12308848 13365041 14418675 15446616 16422337 17317847 18106395 18765445 19278500
63937 19278500 19635026 19829181 19858336 19721936 19421229 18960372 18348256 17599596 16734792
63928 16734792 15778999 14760242 13706288 12641529 11585854 10555424 9563569 8621167
63920 8621167 7737398 6920633 6177868 5512710 4924217 4407999 3958189 3568481 3232224
63911 3232224 2942564 2692818 2476820 2289151 2125241 1981293 1854265 1741927 1642549 1554211
63901 1554211 1474759 1402665 1337383 1278296 1223928 1172884 1125002 1080572 1038772 997975 957472
63890 957472 917800 879424 842179 806046 771339 737908 705191 673314 643107 614786 587644
63879 587644 561452 537075 515100 494796 475189 456462 439483 424445 410708 397692 385356
63868 385356 374022 364123 355879 348906 342359 335638 328749 321980 315633 310149 305909 302766 300171 297858
63854 297858 295989 294672 293925 294110 295635 298141 300720 303178 306330 310756 315894 320665 324350 326586 327175
63839 327175 326263 324209 320987 316255 310136 303237 295754 287322 278059 268879 260323 251823 242707 233319
63825 233319 224663 217445 211901 207912 204754 201226 196626 191323 186100 181395 177393 174219 171609 168945
63811 168945 166009 163129 160326 157151 153748 151207 150059 149231 147364 144634 142340 141114 140509 140081 139879
63796 139879 139831 139531 138814 137936 137010 135716 133763 131373 129165 127693 127032 126664 125912 124612 123232 122170
63780 122170 121206 119897 118357 117334 117578 119182 121444 123324 124168 124028 123224 121825 119898 117892 116201
63765 116201 114496 112194 109570 107628 106775 106424 106117 106236 107201 108689 110127 111368 112410 112934 112648 111781
63749 111781 110914 110566 111024 112124 113129 113407 113362 113980 115332 116398 116689 117106 118656 121129 123700 126105
63733 126105 128524 131005 133732 137358 142269 147955 153777 159912 166887 174563 182288 189710 196794 203352
63719 203352 209107 213961 217690 219761 219924 218575 216055 212141 206880 201400 197045 193999 191428 188679
63705 188679 185640 182265 178544 174827 171484 168356 165037 161494 157888 154092 150024 146145 142982 140374
63691 140374 137847 135484 133731 132595 131813 131578 132285 133630 134854 135921 137597 140197 143076 145704 148604
63676 148604 152748 158391 164968 171859 178877 186004 193005 199529 205590 211662 217953 223675 227512 228877
63662 228877 228269 226260 222742 217462 210696 202937 194451 185710 177760 171434 166493 162164 158316 155411
63648 155411 153521 152104 150732 149489 148611 148209 148293 148737 149251 149762 150696 152513 155097 157928 160718 163570
63632 163570 166753 170633 175514 181172 186842 192120 197609 204220 212181 221187 231202 242414 254665
63619 254665 267637 281549 297079 314588 333885 354657 376687 399757 423865 449435 476637
63608 476637 504356 530173 551523 566793 575604 578605 577043 572260 565503 558120 551462 546208 542122
63595 542122 538794 536131 533705 530141 523883 514368 501991 487300 470915 453869 437115 420774 404563
63582 404563 388867 374622 362171 350955 340422 330596 321612 313358 305795 299156 293616 289111 285563
63569 285563 282985 281356 280760 281562 283979 287567 291632 296248 302339 310616 320873 332543 345560 360431
63555 360431 377659 397341 419201 442880 468139 494793 522497 550698 578620 604998 627944
63544 627944 645685 657671 664640 667519 666970 664213 661420 660509 661838 664508 667478 669891 670895 669906
63530 669906 666723 660782 650783 635747 616129 593166 567545 539451 509554 479028 448779 419473
63518 419473 392129 367766 346519 327818 311307 296864 283960 271965 261072 252041 244986 239168
63506 239168 233949 229177 224720 220547 217265 215606 215194 214695 213427 211958 210940 210250 209637 209358 209664 210337
63490 210337 211222 212666 215019 218173 221943 226489 232035 238616 246274 254987 264150 272716 280190 286929
63476 286929 293176 298381 301892 303742 304181 302897 299394 293917 287420 280723 274219 268328 263651 260434
63462 260434 258202 256167 253899 251534 249442 247884 246950 246609 246680 246788 246567 245922 245027 244130 243562 243817 245220
63445 245220 247519 250192 253173 256872 261417 266497 272124 278925 287328 297008 307527 319023 331875
63432 331875 346260 362446 380851 401292 422774 444728 467865 493070 520051 547971 576957
63421 576957 608004 641571 677049 713291 748786 781456 809118 830155 843389 848004 844541 835512
63409 835512 823988 811763 799656 788864 780551 774239 767988 760231 750292 737246 719823 697844
63397 697844 672554 645102 615757 585017 554391 525416 498632 474051 451941 432674 416286
63386 416286 402552 391062 381202 372618 365731 361108 358359 356472 355236 355427 357547 361382 366913 374504
63372 374504 383874 393991 404561 416717 431629 449141 468276 488460 509814 532854 558289 586526
63360 586526 617021 648565 680223 711352 740690 766405 787246 802755 812288 815051 811554 803961
63348 803961 794428 784027 773674 764797 758142 752812 747443 741662 735562 728351 718460 704663 686554
63335 686554 664496 639797 614457 589933 566301 542949 519611 496417 473648 452034 432745
63324 432745 416440 402676 390704 380304 371465 363889 357402 352271 348534 345562 342918 341077 340609
63311 340609 341108 341580 341501 340888 339823 338618 338032 338556 339573 339839 338711 336530 334018 331726 329855 328268
63295 328268 326768 325519 324891 324812 324727 324319 323731 323012 322039 321194 321241 322188 323058 323268 323377 323909 324315 323898 323065
63276 323065 322778 323244 323953 324616 325307 325986 326506 326875 327088 327064 327028 327370 327811 327518 326608 326643 328735 331885 334214
63257 334214 335300 336373 338577 342037 346309 350742 354611 357843 361531 366915 373889 381187 387939 394330
63243 394330 400892 407942 415744 424521 434161 444370 455191 467042 480280 495034 511243 528561
63231 528561 546473 564900 584442 605691 628545 652421 676689 700580 723241 744427 764706
63220 764706 784540 803676 821941 840054 858896 878370 897624 916034 933386 949543 964610
63209 964610 978913 992020 1002086 1006961 1005764 998824 986539 969071 946837 920515 890817 858911
63197 858911 826686 795813 766794 739572 714638 692731 673866 657705 644609 635345 629860 627357
63185 627357 627508 630664 636911 645840 657328 671624 688475 706980 726494 746987 768357 790077
63173 790077 811752 833453 855289 877149 898949 920618 941674 961279 978856 994366 1007925
63162 1007925 1019478 1028733 1034970 1036985 1033673 1024739 1010624 991891 969029 942642 913467 882341
63150 882341 850405 818983 788853 759946 732164 706098 682456 661260 642159 625142 610308
63139 610308 597362 586023 576496 568880 562590 557182 553257 551538 551426 551537 551445 551761 552655 553485 554035 555002
63123 555002 556928 559495 562124 564553 566646 568360 570083 572338 574979 577310 579078 580723 582552 584349
63109 584349 585927 587418 588943 590534 592461 594996 597816 600298 602441 604856 607819 610984 614010 616779
63095 616779 618976 620226 620755 621163 621484 621210 620391 619846 620059 620643 621186 621941 623365 625602 628709 632766 637432
63078 637432 641927 645872 649777 654500 660597 668281 677493 687826 698760 710119 721954 734096 746355
63065 746355 759085 772882 787747 803196 819232 836412 854917 874390 894900 917169 941520
63054 941520 967379 994326 1022939 1054095 1087966 1124188 1162566 1203059 1245383 1289039 1333605
63043 1333605 1378741 1424113 1469443 1514391 1558349 1600761 1641723 1681958 1722133 1762564 1803528
63032 1803528 1845324 1887936 1931025 1974268 2017201 2058691 2097023 2130444 2157065 2174519 2180620
63021 2180620 2174561 2156788 2127656 2087203 2036530 1978419 1915992 1851289 1785543 1720130 1656663
63010 1656663 1596681 1541746 1493358 1452161 1417590 1388821 1365856 1349313 1339472 1335979 1338306 1346140
62998 1346140 1359389 1377970 1401352 1428243 1457044 1486793 1517417 1549005 1581289 1613914 1646711
62987 1646711 1679389 1711336 1742006 1771220 1798858 1824548 1847827 1868182 1884700 1895908 1900179
62976 1900179 1896064 1882363 1858481 1824973 1783263 1734470 1678917 1617117 1550823 1482532 1414054
62965 1414054 1346002 1278739 1213471 1152129 1096179 1045752 1000144 958954 922223 889504 859595
62954 859595 831698 806207 783740 763939 746017 730006 716400 704806 694075 683762 674384 666106
62942 666106 658273 650507 643224 636526 629534 621462 612654 603908 595342 586614 577796 569374 561517 553884
62928 553884 546097 538211 530821 524749 520365 517182 514336 511415 508380 504927 500660 495983 492040 489477
62914 489477 487860 486585 485736 485668 486219 486754 486655 485584 483676 481652 480318 479792 479603 479590 480158 481520 483315
62897 483315 485182 487127 489110 490806 491967 492527 492172 490468 487621 484496 481610 478735 475754 473140 471131
62882 471131 469047 466083 462357 458696 455677 453317 451462 450082 449309 449317 449982 450685 450874 450828 451395 452824 454326
62865 454326 454869 453930 451512 448142 444984 443245 443044 443312 442924 441506 439164 436196 433251 431062 429647
62850 429647 428344 426750 425071 423453 421710 419872 418255 416779 415033 413204 412119 412015 412110 411785 411375
62835 411375 411373 411639 411876 412209 412816 413557 414323 415081 415419 414869 413963 413971 415180 416383 416630 416478 416859 417650 418131
62816 418131 418060 417559 416706 415985 416351 417999 419771 420582 420747 421156 421956 422980 424743 427876 432034 436396 440914
62799 440914 446090 451884 457802 463821 470394 477752 485909 495101 505549 517084 529699 544076 560804
62786 560804 579465 599309 620497 643875 669823 698208 729256 763566 801363 842609 887854
62775 887854 938239 994488 1056476 1123776 1196067 1272897 1353492 1436878 1521900 1607101 1690709
62764 1690709 1770596 1844215 1908883 1962378 2002988 2029056 2039164 2032957 2011157 1974600 1924088
62753 1924088 1861512 1790121 1713010 1632020 1548573 1464546 1381508 1299942 1220231 1143746 1072055
62742 1072055 1005685 944580 889068 839345 794579 753701 716641 683678 654053 626463 600690
62731 600690 577531 557206 538944 522138 506932 493625 482351 473290 466363 460755 455561 450819
62719 450819 447210 444893 443428 442547 442191 442032 442007 443128 446654 452430 459071 465906 473801 483862 496218
62704 496218 510373 526049 543441 563192 586231 613082 643304 676149 711731 750925 794198
62693 794198 841243 891790 946084 1004487 1067183 1134209 1205092 1278308 1351641 1423088 1490980
62682 1490980 1553379 1607984 1652642 1685523 1705080 1710596 1702613 1682208 1650005 1606575 1553547 1493318
62670 1493318 1427710 1357745 1284785 1210985 1138365 1068168 1001353 939016 881891 829842 782208
62659 782208 738432 698353 662088 629657 600591 574100 549779 527761 507952 489716 472738
62648 472738 457481 444177 432079 420571 410241 401739 394128 385723 376293 367105 358889 351127 343434
62635 343434 336373 330541 325922 322399 319925 317804 314861 310869 307135 305084 304682 304561 303335 300651 297340
62620 297340 294613 292883 291568 290373 290170 291841 294745 297386 299344 301425 304061 306812 309531 312779
62606 312779 316805 321217 326012 331943 339457 348150 357675 368421 380924 395280 411409 429246 448472
62593 448472 468780 490589 514787 541674 570953 602860 638344 677837 720642 765747 812309
62582 812309 859117 904509 947222 986409 1020552 1047401 1065616 1075621 1078187 1073039 1059525 1038077
62570 1038077 1010230 977700 941942 904127 864919 824641 784112 744952 708597 675348 644769
62559 644769 616658 591300 569012 549734 532785 516957 501261 485792 471467 458805 447325
62548 447325 436161 424765 413009 401106 389583 378858 368898 359703 351848 345822 341050 336496 332082
62535 332082 328509 325755 323020 320293 318677 318744 319799 321334 323999 328335 333559 338517 343112 347995 353539
62520 353539 359927 367617 376826 386963 397428 408719 422138 438600 458120 480114 503820 528850
62508 528850 555790 585855 619577 656235 694823 734909 776083 817256 857161 895016 930006
62497 930006 960510 984561 1000879 1009029 1008924 1000692 984823 961991 932972 899065 862158 823960
62485 823960 785396 747074 709902 674799 642213 612375 585720 562559 542585 525145 509830
62474 509830 496476 484853 474721 466017 458690 452528 447425 443565 441101 439797 439147 438691 438143 437553
62460 437553 437444 438504 440990 444684 449369 454928 460977 466914 472453 477791 483252 489151 495853 503394
62446 503394 511158 518518 525600 532680 539020 543286 545102 545172 543804 540470 535047 528267 520374 510461 497858
62431 497858 483329 468317 453830 440578 429158 419262 409604 399552 390185 382904 377688 373678 370830
62418 370830 369827 370639 372231 373681 374844 375997 377501 379789 383087 387115 391417 395967 401185 407500
62404 407500 415048 423502 432029 439837 446993 454310 462179 470015 477056 483115 488202 492048 494466 495663
62390 495663 495704 494103 490430 485017 478703 472254 466239 460935 456073 451207 446600 443153 441234 440354 440389
62375 440389 442265 446839 453785 462299 472293 484317 498777 515904 536046 559422 585926 615578
62363 615578 648773 685775 726577 771516 821186 875272 932288 991066 1051564 1113393 1174262
62352 1174262 1230820 1280523 1321965 1354070 1376021 1387690 1389446 1381901 1366381 1344971 1319156 1288818
62340 1288818 1253284 1212877 1168724 1121744 1072872 1023818 976486 931803 889955 851486 817162
62329 817162 786883 759644 734651 711771 690926 671700 653637 636476 620163 604924 591173
62318 591173 579064 568477 559640 553128 548900 546062 544101 543538 544599 546048 546341 545350 543946 542418
62304 542418 540394 537872 535128 531780 527119 521311 515287 509408 503162 496290 489422 483491 479122 476556
62290 476556 475502 475092 474569 474017 473989 474670 475946 477988 481003 484672 488570 493008 498699 505714 513468 521668
62274 521668 530598 540470 551129 562360 574018 585988 598510 612395 628369 646404 666179 687939
62262 687939 712399 740141 771660 807586 848123 892545 940056 990840 1045413 1102989 1161159
62251 1161159 1217017 1267947 1311613 1346186 1370843 1385562 1390467 1385896 1372906 1352999 1327248 1296058
62239 1296058 1259707 1218720 1173919 1126548 1078191 1030224 983582 939300 898768 862934 831644
62228 831644 804238 780423 760198 743549 730670 721791 716172 711981 707879 704120 701382 699345 697297
62215 697297 695382 694146 693431 692793 692398 692406 692076 690725 689077 688332 688351 688213 688247 689961 693913 699017 704122
62198 704122 709103 714287 719964 726651 734852 744399 754841 766482 780153 796064 813820 833397 855020
62185 855020 878082 901242 923658 945192 965457 983716 999688 1013584 1025436 1035414 1044611 1054381
62173 1054381 1065005 1076204 1088880 1104997 1125601 1150173 1178062 1209317 1243867 1281080 1320359
62162 1320359 1361084 1401724 1440086 1474654 1504676 1529030 1546491 1557386 1563527 1565993 1564306 1558321
62150 1558321 1549528 1539553 1528425 1515195 1499484 1481729 1462738 1443791 1426547 1412093 1400430 1391242
62138 1391242 1384536 1380239 1377875 1377077 1377826 1379870 1382615 1385924 1390345 1396194 1403035 1410411 1418376 1427043
62124 1427043 1436329 1446468 1458096 1471485 1486297 1502308 1519669 1538265 1557606 1577618 1598717
62113 1598717 1620827 1643150 1665302 1687813 1711124 1734914 1758857 1783291 1808617 1834682 1861260
62102 1861260 1888505 1916523 1945040 1973965 2003843 2035491 2069572 2106608 2146729 2189220 2232925
62091 2232925 2277255 2322070 2366458 2408478 2446587 2480918 2513133 2545704 2581209 2621193 2665210
62080 2665210 2711461 2758343 2804663 2848672 2888456 2923781 2956438 2988218 3019420 3049798 3079960
62069 3079960 3111179 3144595 3181047 3220946 3263807 3308598 3354835 3402511 3450659 3496972 3539257
62058 3539257 3576399 3607581 3631774 3648722 3659461 3665083 3665717 3661302 3652404 3639472 3622104 3599948
62046 3599948 3573751 3544786 3513763 3480996 3447155 3413233 3380143 3348783 3319949 3293716 3269454
62035 3269454 3246839 3226292 3208127 3192020 3177705 3165364 3154791 3144996 3135277 3126061 3118045 3111107
62023 3111107 3104637 3098376 3092330 3086381 3080545 3075172 3070426 3065959 3061368 3056501 3051153 3045105 3038578 3031932
62009 3031932 3024815 3016576 3007635 2999295 2991815 2983856 2974324 2963629 2952537 2941055 2929316 2918331 2908682
61996 2908682 2899219 2888072 2874345 2858007 2838882 2816648 2791234 2762443 2729921 2694226 2657151
61985 2657151 2620093 2582928 2545399 2508716 2474524 2442857 2412383 2382304 2352909 2324547 2297185
61974 2297185 2270935 2246087 2222529 2199767 2177447 2155402 2133509 2112040 2091851 2073657 2057306
61963 2057306 2042159 2027808 2014061 2000694 1987683 1975147 1962668 1949238 1934454 1919208 1904751
61952 1904751 1891585 1879679 1868928 1858824 1848490 1837876 1828301 1821061 1816035 1812392 1810019 1809400 1810526
61939 1810526 1812792 1815798 1819696 1824992 1832333 1842061 1853719 1866583 1880974 1898278 1919388 1943953
61927 1943953 1971503 2002228 2036237 2073297 2114026 2160103 2212439 2270364 2333617 2403973 2483729
61916 2483729 2573753 2674514 2788046 2917368 3064642 3231488 3420572 3635391 3878874 4153706
61906 4153706 4463828 4814319 5209993 5655238 6154870 6713528 7333692 8014322 8749849
61897 8749849 9527835 10326249 11112950 11847599 12484553 12977383 13286095 13384815 13266075 12941162
61887 12941162 12438275 11798281 11067174 10287989 9496481 8720754 7981462 7291480 6656984
61878 6656984 6080016 5560170 5094786 4679574 4310105 3982430 3692409 3435485 3207430
61869 3207430 3004759 2824383 2663517 2519959 2391840 2277167 2174159 2081798 1999348 1925474
61859 1925474 1858564 1797830 1743440 1695660 1654353 1619019 1588712 1562209 1538908 1519244 1503622
61848 1503622 1491335 1481100 1472194 1464490 1457965 1452852 1449531 1447426 1444807 1440709 1436262 1432935 1430293
61835 1430293 1426974 1423277 1421068 1421336 1423437 1426731 1431370 1437251 1443501 1449452 1455194 1461044 1467231 1474041
61821 1474041 1481388 1488378 1494238 1499465 1505142 1511495 1518251 1526013 1535894 1547920 1561271 1576188 1594276
61808 1594276 1616719 1643368 1673707 1707549 1744617 1784625 1828058 1875949 1928785 1986582 2049934
61797 2049934 2119803 2196256 2278663 2367285 2463475 2568196 2681565 2804080 2937076 3081729
61787 3081729 3238925 3410570 3599963 3810459 4044798 4306069 4598279 4925563 5291936
61778 5291936 5702290 6162759 6679779 7259818 7910414 8640439 9458749 10373184 11390541
61769 11390541 12515216 13745383 15068969 16461256 17883095 19279150 20578595 21700643
61761 21700643 22564240 23099771 23260896 23033643 22438978 21527724 20370627 19047150 17634890
61752 17634890 16201172 14798610 13464611 12222837 11085243 10055047 9130122 8305280
61744 8305280 7573132 6924954 6351859 5845182 5396213 4996763 4640403 4322456 4038653
61735 4038653 3784511 3556168 3350922 3166562 3000830 2851684 2717420 2596229 2486206
61726 2486206 2385903 2294346 2210516 2133417 2062517 1997365 1936884 1879852 1826004 1775750 1728932
61715 1728932 1684814 1643199 1604510 1568726 1535317 1504165 1475510 1448930 1423628 1399796 1378388
61704 1378388 1359324 1341260 1323464 1306592 1291081 1276092 1260713 1245135 1229890 1214929 1200112
61693 1200112 1185729 1171815 1157775 1143364 1129283 1116170 1103681 1091246 1079112 1067982 1057961
61682 1057961 1048342 1038102 1026478 1013583 1000588 988748 978185 968212 958706 950143 942295 934117
61670 934117 925298 916812 909452 902860 896535 890794 886022 881776 877346 872587 867571 862037 855886 849839
61656 849839 845039 842133 840910 840579 840341 840068 840358 841527 842869 843621 844254 845812 848192 850324 851910 853607
61640 853607 855398 856279 856008 855791 856571 857748 858232 857855 857118 856411 856025 856206 856704 856922 856806 856869 857136 856880
61622 856880 855596 853358 850082 845382 839373 832737 825845 818765 812091 806614 802089 797532 792749 788246
61608 788246 783697 778146 771920 766587 762546 758385 753205 747831 743033 738366 733755 730505 729465 729585
61594 729585 729509 729374 729897 730900 731969 733487 735876 738735 741770 745544 750399 755738 761420 768646 778303
61579 778303 789486 800854 812457 825022 838504 852626 867989 885345 904561 925405 948484
61568 948484 974186 1001588 1029709 1059005 1090297 1122932 1155352 1186899 1217792 1247869 1276632
61557 1276632 1304069 1330305 1354916 1377601 1398977 1419600 1438780 1455433 1469580 1481898 1492366
61546 1492366 1500453 1506093 1509338 1509483 1505654 1497936 1487045 1473378 1457296 1439783 1421868 1403885 1386134
61533 1386134 1369581 1354900 1341502 1328617 1316776 1307254 1300723 1297463 1298079 1302724 1310275 1319682 1331698
61520 1331698 1348066 1369421 1395268 1425564 1461011 1502107 1549323 1604092 1668330 1742917 1827598
61509 1827598 1922363 2028113 2146193 2278174 2425917 2591011 2774215 2975983 3197004 3437327
61499 3437327 3695083 3966498 4246323 4527232 4799124 5049985 5267564 5440527 5559773
61490 5559773 5620429 5622693 5570370 5469307 5327527 5155145 4962236 4756915 4546000 4336282
61480 4336282 4133693 3941957 3763357 3600037 3453357 3322909 3207852 3108665 3026142 2959264
61470 2959264 2905737 2864291 2835047 2818018 2812689 2818729 2835607 2861716 2895138 2934972 2980772 3031270
61458 3031270 3085087 3142103 3202419 3264278 3324752 3382386 3437624 3490769 3541185 3588661 3634011
61447 3634011 3677982 3720804 3763032 3805863 3850418 3897425 3947252 3999225 4051198 4100937 4147701
61436 4147701 4191554 4231697 4266693 4295786 4318609 4334088 4341165 4340245 4332445 4317720 4295288 4265640
61424 4265640 4230565 4191449 4149172 4105405 4062215 4020296 3979220 3939451 3902644 3870031 3842101
61413 3842101 3819696 3803583 3792822 3785340 3780336 3778469 3779471 3781342 3782182 3781112 3777011 3768203 3754053
61400 3754053 3735440 3713214 3687734 3660417 3634055 3610811 3591363 3576788 3569866 3573570 3589429 3618345
61388 3618345 3662025 3722600 3801489 3899409 4017081 4155523 4316039 4500026 4708135 4939595
61378 4939595 5192854 5466285 5756988 6058964 6363697 6662287 6945610 7202691 7421145
61369 7421145 7590395 7703985 7759277 7756852 7700637 7596881 7451933 7271573 7062184 6830580
61359 6830580 6582050 6320090 6048735 5773688 5500372 5232191 4971507 4721027 4483213
61350 4483213 4259319 4049924 3855652 3676799 3513145 3364758 3232174 3115293 3013004
61341 3013004 2924341 2849165 2787330 2738110 2700859 2675190 2660168 2654360 2657158 2668977 2689717 2718036
61329 2718036 2752575 2792842 2838449 2888528 2942268 2998955 3056996 3114074 3168834 3221429 3272004
61318 3272004 3319683 3363444 3402878 3437695 3467752 3494038 3518366 3541404 3562181 3579970 3595250
61307 3595250 3608017 3616532 3618859 3614645 3604454 3588263 3565693 3537006 3502958 3464152 3421179 3374852
61295 3374852 3325721 3273857 3219464 3163152 3105483 3047024 2988968 2932792 2879206 2828431 2781486
61284 2781486 2739949 2704294 2673855 2648592 2629322 2615768 2605964 2598179 2591927 2586471 2579954 2570940
61272 2570940 2559407 2545430 2528380 2508389 2487223 2466640 2447102 2429024 2413848 2402696 2395174
61261 2395174 2390732 2390103 2394246 2403078 2416581 2436223 2463985 2500815 2547263 2604796 2675217 2759338
61249 2759338 2857139 2968413 3092128 3225823 3366532 3511346 3655965 3793419 3915358 4014052
61239 4014052 4082485 4114001 4103931 4051764 3960988 3837281 3687577 3519888 3342324 3161860
61229 3161860 2984190 2813954 2654194 2506136 2370242 2247115 2136926 2038844 1951793 1875131
61219 1875131 1807941 1748495 1695242 1647695 1605698 1568566 1535700 1507242 1483269 1463032 1445737
61208 1445737 1431507 1420999 1414750 1413336 1417272 1426164 1438807 1454608 1473882 1496273 1520077 1543782
61196 1543782 1567046 1589451 1609527 1625843 1637943 1645545 1648254 1646838 1643258 1638280 1630489 1618716
61184 1618716 1603988 1587820 1570090 1550006 1527769 1503834 1477978 1450756 1424431 1400518 1377584
61173 1377584 1353422 1328372 1304454 1282050 1259569 1235833 1210865 1184790 1157875 1131301 1106125
61162 1106125 1081694 1056615 1031013 1006351 983478 962399 943453 927040 912457 898582 885451
61151 885451 873622 862259 849395 833913 815945 795699 773496 750769 729479 710428 693311
61140 693311 678101 665111 653987 644056 635571 629347 625324 622674 621086 620810 621725 623540 626576 631260
61126 631260 637233 644023 651998 661437 671374 680778 690272 701127 713030 724415 734611 744123 753262
61113 753262 762146 771761 783253 796178 808882 820492 831162 840649 848116 853186 855830 855451 851485
61100 851485 844731 836758 828266 819240 810209 801893 794011 785899 777928 770848 764289 757456 750719 744791
61086 744791 738813 731124 721620 711641 701877 692152 682774 674183 665635 656243 646981 639612 633913 628138
61072 628138 622014 617017 613725 611216 609196 608464 608991 609655 610257 611761 614294 616872 619344 622560 626403
61057 626403 629767 632736 636629 641481 645642 648387 650811 653627 656180 658209 660544 663360 665675 667248
61043 667248 669179 672084 675434 679126 683838 689447 694952 700375 706840 714585 722885 732004 742920 755064
61029 755064 766924 779056 793610 810411 826599 840926 855287 870919 886218 899782 912724
61018 912724 926326 940090 953686 968254 984184 1000162 1016017 1033884 1055005 1078107 1102635
61007 1102635 1130683 1163770 1200613 1240239 1284433 1334711 1389564 1446979 1506972 1569452 1632974
60996 1632974 1698583 1771905 1858291 1958751 2073425 2205302 2356683 2525568 2710227 2914567
60986 2914567 3145072 3406531 3706011 4056812 4472059 4959092 5528912 6207984 7032480
60977 7032480 8038339 9274258 10821595 12774312 15180873 18010383 21167917 24495597
60969 24495597 27714669 30397965 32106474 32653936 32266364 31460257 30744431 30416018 30566501
60960 30566501 31154485 31983096 32642374 32603233 31483718 29270486 26293599 23002509 19759861
60951 19759861 16782395 14178048 11981648 10170517 8689314 7481834 6502951 5711336
60943 5711336 5067011 4538882 4106319 3751319 3454792 3201191 2980876 2786165 2609372
60934 2609372 2445960 2295546 2158150 2032227 1917084 1813813 1722499 1641060 1567792 1502399
60924 1502399 1443405 1387061 1330201 1272412 1214576 1157423 1102522 1052397 1008088 968069 930764
60913 930764 896597 866451 839741 815447 793647 774589 757371 740987 725712 712123 699640
60902 699640 687443 676034 666463 658539 651273 644713 639955 637420 636300 635726 635493 635593 635958 636779 638434
60887 638434 641007 644360 648456 653092 657550 661136 663812 665617 665838 663662 659527 654851 650317 645269
60873 645269 638946 631546 623798 616196 608994 602363 596214 590282 584665 579908 576298 573454 570880 568610
60859 568610 567112 566801 567854 570235 573740 578193 583664 590294 597926 606192 614977 624557 635325 647705
60845 647705 662199 679053 697884 718041 739243 761352 783547 804396 822793 838304 850562
60834 850562 859111 864161 866951 869006 871330 874256 877364 879432 879196 876458 871873 865671 857587 848334
60820 848334 839994 834106 830181 826819 823414 819828 815222 808569 800068 790903 781620 771676 760593 748831
60806 748831 737421 727240 718536 710647 702450 693688 685582 679468 675124 671241 667325 664238 662872 663080
60792 663080 664024 665007 665988 667757 671441 677282 684192 691126 698509 707470 718113 729599 741650 754657
60778 754657 768339 781675 794533 808057 822865 837906 851839 864701 877437 890424 903197
60767 903197 915135 925686 934316 940916 946125 950700 954653 957343 958333 957879 956694 955412 954135 952370
60753 952370 949544 945678 941475 937717 934758 932438 930261 927722 924793 922031 919909 918148 915933 912589
60739 912589 907802 901535 894176 886440 878602 870159 860778 851181 842398 834597 827488 821465 817269 814749
60725 814749 813075 812107 812353 813600 814849 815892 817743 821089 825368 829840 834473 839185 843124 845476 846366
60710 846366 846341 845587 844126 842210 839937 836981 833160 828800 824172 819064 813314 807319 801625 796418 791613
60695 791613 787004 782158 776708 770864 765042 758938 751724 743290 734421 725475 715774 704715 692708 680611
60681 680611 668967 658127 648312 639159 630033 621171 613654 607858 602895 598171 594482 592794 592790 593479 594541
60666 594541 596240 598622 601613 605432 610138 615248 620376 625677 631066 635692 638989 641690 644934 648880
60652 648880 652972 657087 661524 666202 670784 675380 680335 685488 690324 694666 698641 702203 705398 708829
60638 708829 713152 718169 723058 727501 732109 737764 744895 753364 762686 772442 782596 793282 804302
60625 804302 815255 826206 837662 849599 861100 871260 879952 887451 893916 899511 904307 907647 908371
60612 908371 906220 902363 897976 892984 886933 880469 875088 871737 870256 869840 869466 868247 865950 862961 859391
60597 859391 854607 847976 839474 829216 817172 803888 790805 779160 769174 760918 755180 752564 752378
60584 752378 753433 755589 759499 765030 770822 775402 778106 779054 778882 778438 778205 778035 777699 777453 777847 779273
60568 779273 781896 785448 788892 790996 791793 792857 795581 799659 803628 806238 806869 805402 802394 798795 794884
60553 794884 789998 783757 776850 770157 763973 758599 754736 752538 751312 750972 752772 757578 764463 772250
60539 772250 781599 794254 810997 831838 857566 889403 927232 969544 1014871 1061859 1107841 1148667
60527 1148667 1180339 1200219 1206923 1200185 1181077 1151756 1114994 1074328 1034012 997702 967214 943073
60515 943073 925719 915312 910944 911203 915311 922826 932601 943031 953053 962076 969515 975494 981531
60502 981531 989356 999349 1011205 1025598 1043859 1066544 1093848 1127198 1168788 1219532 1278930 1346981
60490 1346981 1424657 1512218 1608482 1712239 1823249 1941752 2068590 2206685 2361658 2540529
60480 2540529 2750368 2997755 3287443 3619758 3988733 4381719 4778908 5152889 5471175
60471 5471175 5702637 5824227 5824240 5702475 5469562 5145896 4759026 4339340 3915068 3508193
60461 3508193 3132698 2795547 2498933 2241916 2021212 1832150 1669874 1530129 1409624
60452 1409624 1306150 1217993 1142785 1077502 1020112 970505 928896 893916 863269 835787 811652
60441 811652 790954 773185 757867 744462 731769 718623 705168 692344 680218 668007 655693
60430 655693 644326 634525 625884 618113 611624 606619 602567 598984 595920 593363 590967 588629 586699 585380
60416 585380 584531 584150 584453 585459 587066 589359 592246 595081 597442 599933 603273 606927 609773 611861 614311
60401 614311 617540 620901 624084 627636 631949 636875 642540 649380 657165 664963 672292 679375 686210 692427
60387 692427 698055 703308 707588 709925 710538 710761 711199 711130 709877 707557 704283 699977 695376 691925 690143
60372 690143 689147 688170 687460 687310 687383 687437 687658 687894 687662 687326 688022 689962 691984 693382 694949 697537 700749
60355 700749 703921 707363 711637 716372 720741 724658 728840 734086 740865 749043 757740 766109 774508 784118
60341 784118 795129 806255 816317 825298 833370 840002 844713 847845 849810 850395 849587 848517 848813 851384
60327 851384 856295 863402 872676 884206 898085 913765 929360 942208 950412 953433 951357 944477 933683
60314 933683 920318 905288 889013 872350 856660 842789 830797 820807 813155 807465 802623 798026
60302 798026 794009 790856 788317 786421 785739 786511 788314 790827 794056 797704 801269 804874 808934 812924 815653
60287 815653 816903 817547 817931 817602 816890 817178 819014 821391 823559 826157 829839 834059 838052 841787 845197
60272 845197 847673 849187 850838 853469 856771 860484 865304 871763 879305 887445 896829 908229 921395 935831
60258 935831 951834 969919 990003 1011988 1036437 1063963 1094736 1129166 1168118 1211802 1259506
60247 1259506 1311160 1368150 1431821 1502192 1578999 1662992 1755199 1855749 1964251 2080442 2203593
60236 2203593 2332075 2464310 2599339 2735627 2870081 2998979 3119173 3227970 3322980 3402911
60226 3402911 3467587 3516489 3548310 3562538 3560305 3543021 3511520 3467420 3413952 3354341 3290654
60215 3290654 3225295 3162204 3105064 3055425 3013978 2982591 2963524 2957521 2964288 2984283 3018607 3067687
60203 3067687 3131391 3209937 3303386 3410685 3530203 3660573 3799826 3944237 4089151 4230448
60193 4230448 4364284 4486274 4592329 4679898 4747397 4793042 4815453 4814805 4792176 4748166 4683205
60182 4683205 4598843 4497890 4383918 4261590 4136686 4014529 3898647 3791681 3696789 3617069
60172 3617069 3554312 3509378 3483098 3475778 3486641 3514937 3560872 3624216 3702615 3792447 3890613
60161 3890613 3994225 4099280 4201017 4295192 4377986 4445569 4495258 4526601 4540093 4535525 4513032
60150 4513032 4475123 4426164 4370253 4310943 4252373 4198984 4154170 4120480 4100665 4097121 4110717
60139 4110717 4141720 4191673 4262930 4356561 4472269 4610333 4772368 4960272 5175704 5420490
60129 5420490 5696133 6002631 6338591 6702218 7091037 7500752 7925511 8359245 8795708
60120 8795708 9227355 9645314 10040621 10404919 10730438 11010437 11239643 11413642 11528279
60111 11528279 11580451 11568868 11493146 11352949 11149538 10887902 10576327 10224279 9841783 9440111
60101 9440111 9031230 8626208 8234762 7865726 7526513 7222135 6955729 6729780 6546020
60092 6546020 6404698 6305159 6246841 6228737 6248430 6302700 6388449 6501693 6636130 6783994
60082 6783994 6937918 7090936 7235473 7364053 7470908 7551839 7603174 7622462 7609910 7567670
60072 7567670 7497901 7402580 7284587 7147319 6993355 6824692 6643837 6453421 6255304 6051559
60062 6051559 5845935 5642929 5445926 5257668 5081745 4921762 4779380 4654933 4549566
60053 4549566 4464929 4401173 4357347 4333758 4332073 4353053 4395988 4460355 4546098 4652010 4775456
60042 4775456 4913878 5064914 5224793 5388056 5549021 5702185 5841384 5960423 6054921 6122348
60032 6122348 6160446 6167282 6142812 6088684 6006340 5896905 5763029 5609268 5440581 5262003
60022 5262003 5079615 4899776 4726926 4563534 4412231 4276229 4157574 4056781 3974469 3911647
60012 3911647 3868282 3843480 3837525 3851984 3887472 3943071 4018410 4114653 4232976 4373570 4536264
60001 4536264 4720196 4922211 5137141 5359899 5585603 5807403 6016356 6204458 6366510
59992 6366510 6498946 6598927 6665309 6698541 6698593 6664387 6595891 6495210 6365242 6209235 6032522
59981 6032522 5842785 5647486 5452410 5263214 5086322 4926906 4787407 4669096 4573737 4502779
59971 4502779 4456352 4434110 4435797 4460153 4504725 4567713 4648705 4746634 4858422 4980656 5111186
59960 5111186 5247907 5387116 5524204 5654990 5775626 5882549 5973691 6048808 6107878 6150314
59950 6150314 6176550 6189063 6190859 6184172 6171516 6156758 6144137 6137472 6141425 6162224 6205796 6276051
59938 6276051 6376065 6509832 6681547 6893919 7148277 7445598 7786312 8169556 8593109
59929 8593109 9052915 9541484 10047224 10555822 11051289 11515091 11925939 12262447 12506537
59920 12506537 12644827 12669080 12577692 12376931 12079829 11703575 11267475 10791536 10294926 9794868
59910 9794868 9306179 8840687 8406646 8009491 7653276 7340665 7071892 6845548 6660876
59901 6660876 6518153 6416704 6354308 6329159 6340914 6389151 6472283 6588562 6736432 6912937
59891 6912937 7113095 7331423 7562253 7797589 8026209 8235966 8415599 8553811 8639141 8663009
59881 8663009 8622088 8516827 8349484 8125218 7853429 7545780 7213333 6866532 6516128 6171673
59871 6171673 5839520 5523801 5228532 4957126 4710617 4488298 4290040 4116541 3967556
59862 3967556 3841200 3734999 3646706 3574271 3515789 3469188 3431461 3398751 3367709 3336145 3302139
59851 3302139 3263917 3221567 3177742 3135588 3096887 3063027 3036293 3018531 3009166 3005785 3005992 3007530
59839 3007530 3007337 3001977 2988901 2966580 2934158 2891952 2841853 2786413 2728026 2669409 2613719 2563168
59827 2563168 2518254 2479211 2447345 2424135 2409920 2404340 2407082 2417175 2432370 2450292 2469716 2490468
59815 2490468 2513382 2541070 2577234 2623915 2680278 2744631 2815932 2892143 2968909 3041814 3108956
59804 3108956 3169890 3223276 3267365 3301772 3326947 3342643 3348690 3346716 3339465 3328820 3315902 3302658
59792 3302658 3291923 3286324 3288239 3300229 3324234 3360904 3410846 3475883 3558074 3658490 3778399
59781 3778399 3920902 4089949 4288533 4519432 4787193 5097640 5455203 5860914 6311172
59772 6311172 6795707 7295831 7784917 8230221 8595086 8843794 8950322 8906301 8722573 8424879
59762 8424879 8047852 7628655 7200096 6786017 6401616 6056199 5754309 5495896 5278298
59753 5278298 5098728 4954421 4841694 4756729 4696881 4659944 4643061 4643992 4662699 4699911 4754769
59742 4754769 4825623 4912472 5016647 5138558 5277730 5434847 5611907 5810417 6031152 6275600
59732 6275600 6546095 6844650 7173258 7535182 7934363 8373518 8854189 9378366 9948378
59723 9948378 10564916 11226130 11928059 12664031 13423356 14191916 14954403 15695536 16400494
59714 16400494 17056956 17658222 18204518 18702232 19163182 19603703 20041936 20494483 20974930
59705 20974930 21493501 22055457 22659172 23296369 23953601 24612388 25249124 25837505 26352363
59696 26352363 26771726 27077691 27258827 27312826 27246112 27071237 26805777 26472460 26097292 25706007
59686 25706007 25322351 24968389 24663932 24424837 24262978 24187984 24208124 24330010 24559055 24900514
59676 24900514 25359174 25938236 26639261 27462101 28402762 29450551 30587194 31786706 33013483
59667 33013483 34220483 35351133 36343992 37136817 37670892 37898730 37793002 37351013 36593602
59658 36593602 35562025 34313974 32916798 31438907 29943274 28484042 27104144 25833653
59650 25833653 24690098 23679256 22794176 22014322 21308142 20637725 19962467 19243569 18452602
59641 18452602 17580297 16637817 15649943 14647032 13659694 12714318 11829084 11013351 10270502
59632 10270502 9600304 8999416 8462428 7983827 7558416 7180417 6843942 6544511 6278728
59623 6278728 6042760 5832831 5646993 5484518 5343562 5221191 5115563 5026079 4951286 4888586
59613 4888586 4836050 4792400 4754866 4719001 4681168 4639509 4592294 4537257 4473097 4399975 4318114
59602 4318114 4227590 4129818 4027620 3923418 3818788 3715783 3616871 3523309 3435386 3354451
59592 3354451 3282799 3221258 3168821 3125053 3090814 3066077 3048996 3037951 3032845 3033738 3039894 3050862
59580 3050862 3066886 3087554 3111485 3137860 3166731 3197349 3227769 3256762 3284664 3312008 3338941
59569 3338941 3366491 3396715 3430921 3469178 3512080 3561429 3618713 3684449 3759532 3845602 3943526
59558 3943526 4053111 4174921 4310874 4462525 4630301 4814947 5018133 5240927 5483041
59549 5483041 5743984 6023344 6319304 6628331 6946960 7272467 7601251 7928004 8247130
59540 8247130 8553879 8843914 9113249 9359202 9580413 9775979 9945614 10089802 10207646
59531 10207646 10295103 10348403 10370027 10369305 10356774 10340213 10326297 10322768 10337151 10375229 10441874 10541120
59519 10541120 10673513 10834482 11016052 11208410 11398985 11572143 11711695 11803230 11834168 11794179
59509 11794179 11677458 11483725 11216380 10881066 10486479 10044565 9568624 9072183 8569599
59500 8569599 8075100 7599603 7149609 6729677 6344048 5995079 5682316 5404518 5161083
59491 5161083 4950576 4769738 4615300 4485468 4378833 4293437 4227819 4181411 4153159 4141452
59481 4141452 4146060 4168246 4208252 4264793 4337853 4429717 4542142 4674691 4826958 5000136 5194984
59470 5194984 5410417 5645451 5900135 6172744 6458009 6749807 7043390 7332853 7608171
59461 7608171 7856985 8068190 8232382 8340922 8387270 8368763 8285824 8140779 7938943 7689413
59451 7689413 7402867 7089181 6757852 6418745 6080485 5749107 5429454 5126365 4843044
59442 4843044 4579756 4335743 4111226 3906401 3720130 3551163 3399284 3263929 3143232
59433 3143232 3035753 2941541 2860042 2788725 2725329 2669827 2622685 2582887 2549375 2522704 2503521
59422 2503521 2490861 2483529 2481499 2484466 2490800 2499653 2512317 2529830 2551101 2575004 2602325 2633891
59410 2633891 2668964 2707078 2748526 2790538 2825987 2849598 2863904 2876269 2892124 2914290 2946409
59399 2946409 2992219 3052109 3124323 3208961 3306837 3414584 3525097 3634059 3743644 3859762
59389 3859762 3988586 4136112 4307944 4507959 4738507 5002150 5301694 5638959 6015642
59380 6015642 6435296 6902101 7417282 7978336 8581252 9220868 9888498 10571146 11253752
59371 11253752 11921045 12557812 13150133 13687967 14166224 14583786 14942799 15248400 15507002
59362 15507002 15723945 15903154 16047996 16160452 16239230 16279921 16276938 16224486 16116728 15949329
59352 15949329 15721602 15436772 15100920 14722735 14313081 13882601 13439210 12988236 12533583
59343 12533583 12077136 11618023 11154499 10686506 10215487 9743064 9271847 8806758 8353595
59334 8353595 7916627 7499061 7104868 6738060 6400622 6092828 5814920 5566622 5345817
59325 5345817 5149826 4977619 4828906 4701634 4592539 4499850 4423493 4362847 4316222 4282363
59315 4282363 4260656 4249976 4248882 4256664 4272729 4295423 4322914 4354503 4389430 4425191 4458817 4488986
59303 4488986 4514985 4534640 4545663 4548280 4544109 4533028 4513849 4487762 4458361 4428093 4397145 4366150
59291 4366150 4337710 4314709 4299029 4292310 4296197 4311478 4338485 4378502 4433346 4503683 4589246 4690448
59279 4690448 4808119 4941825 5090104 5252082 5427135 5613149 5806630 6004073 6201460
59270 6201460 6392813 6570962 6729118 6859903 6954077 7003553 7006447 6967618 6894615 6794901 6676056
59259 6676056 6545201 6407211 6265232 6123024 5984737 5852302 5725217 5603186 5487012
59250 5487012 5376680 5270765 5168315 5069660 4975065 4884244 4797492 4715811 4639890 4570498 4509719
59239 4509719 4460112 4422800 4398119 4387849 4394938 4421243 4467565 4535731 4628651 4748401 4896344
59228 4896344 5075056 5288036 5537454 5824061 6149052 6513611 6916277 7352389 7815514
59219 7815514 8296788 8782619 9255371 9696798 10089200 10414161 10653754 10794517 10829000 10753942
59209 10753942 10569941 10283815 9909088 9463023 8964192 8432182 7886458 7343787 6817467
59200 6817467 6318445 5854856 5430280 5044755 4697957 4389673 4117536 3877117 3664945
59191 3664945 3479263 3317506 3175501 3049946 2939515 2842845 2757495 2681600 2614686 2556204
59181 2556204 2504994 2460523 2422765 2390584 2362215 2337664 2318599 2305567 2297337 2293168 2293434 2297733
59169 2297733 2304780 2314725 2329307 2349098 2372770 2399566 2430328 2465561 2504712 2547891 2595999 2648575
59157 2648575 2703734 2760856 2821094 2884574 2949393 3014005 3078250 3141270 3200746 3255104 3304272
59146 3304272 3347441 3382295 3407344 3422963 3429424 3426188 3414013 3395445 3372102 3343501 3309592 3272438
59134 3272438 3234461 3197022 3161686 3130877 3106168 3087548 3075121 3069914 3072548 3083108 3102776 3133556
59122 3133556 3175858 3228540 3291679 3366960 3454806 3553684 3662932 3783722 3916490 4060120
59112 4060120 4214675 4382273 4564112 4759074 4966495 5187730 5423632 5672614 5932284
59103 5932284 6200413 6472759 6741932 6999602 7237762 7446908 7615623 7733715 7794312 7792667
59093 7792667 7725999 7596161 7410208 7176907 6904628 6603059 6283606 5955975 5626458 5300822
59083 5300822 4986038 4687327 4405915 4141608 3895436 3668153 3458591 3265499 3089054
59074 3089054 2928859 2782550 2648092 2525420 2414172 2312000 2216885 2129087 2049127 1975892
59064 1975892 1908387 1847195 1792464 1742527 1696123 1653839 1615720 1579824 1545028 1512960 1485150
59053 1485150 1460405 1436933 1414863 1394626 1375091 1355476 1336948 1320083 1302841 1283390 1262962
59042 1262962 1243523 1224604 1204931 1185404 1167856 1152399 1138449 1126957 1119183 1114463 1111390 1110002
59030 1110002 1110877 1113391 1116886 1122169 1130077 1139956 1151215 1164599 1179998 1194864 1206935 1216883 1226112
59017 1226112 1233770 1238296 1240335 1241696 1242773 1243283 1244175 1246476 1249450 1252105 1255436 1261178 1269465 1279519
59003 1279519 1291236 1304203 1316634 1327225 1336650 1345385 1351774 1354339 1354361 1353982 1353341 1351771 1350185 1349873
58989 1349873 1350399 1351059 1353030 1357680 1364032 1370211 1376187 1382915 1390101 1397070 1404563 1413445 1422908 1432121
58975 1432121 1442259 1454718 1468757 1483152 1498727 1516929 1537327 1558869 1582175 1608111 1635536
58964 1635536 1663011 1691438 1722316 1754590 1785810 1815450 1844584 1873437 1901684 1930168 1959854
58953 1959854 1990063 2020067 2051358 2086041 2124083 2164459 2207865 2255931 2308818 2365939 2427921
58942 2427921 2495561 2568002 2644281 2725572 2813726 2908943 3011117 3121926 3243006 3373552
58932 3373552 3512412 3661262 3823060 3998817 4188684 4394880 4620538 4866805 5134045
58923 5134045 5424833 5742833 6089721 6466155 6874885 7319963 7803761 8327513 8893839
58914 8893839 9505770 10164012 10867715 11616531 12408464 13236132 14087598 14949431 15805517
58905 15805517 16633652 17406919 18098469 18682932 19135318 19433675 19564333 19522949 19311804
58896 19311804 18939724 18424300 17790311 17064506 16272875 15441022 14592928 13748180 12922162
58887 12922162 12128212 11376922 10673723 10019951 9416290 8863038 8357821 7896106 7474105
58878 7474105 7089093 6737456 6414871 6118093 5844434 5590307 5352638 5130890 4925282
58869 4925282 4733938 4554279 4386224 4231198 4088870 3957530 3836699 3726549 3625662
58860 3625662 3532235 3446644 3370046 3301495 3239199 3183423 3135103 3092917 3055047 3022605 2997785
58849 2997785 2979715 2965853 2956540 2954384 2959928 2971683 2989691 3015055 3046581 3081982 3122087 3169878
58837 3169878 3225681 3287308 3354757 3430545 3515374 3607664 3707670 3818040 3939742 4071235
58827 4071235 4212294 4365084 4531065 4710375 4904781 5117724 5350982 5604737 5881301
58818 5881301 6185293 6519702 6885380 7284860 7723053 8203442 8726966 9295204 9911090
58809 9911090 10575513 11286130 12039785 12832356 13654978 14492938 15328406 16140989 16905428
58800 16905428 17592740 18175299 18629206 18933111 19069934 19031931 18822096 18450795 17934283
58791 17934283 17296020 16564392 15766716 14927063 14068868 13214663 12381560 11579953 10817468
58782 10817468 10100887 9433598 8814897 8243325 7718117 7236927 6795476 6390357 6019417
58773 6019417 5679098 5364715 5073806 4805950 4558939 4328627 4113038 3912990 3728126
58764 3728126 3555966 3395443 3247568 3111831 2985634 2868106 2760730 2663356 2573407 2489916
58754 2489916 2414521 2347398 2286015 2229106 2178111 2133477 2093115 2055742 2022102 1991761 1962373
58743 1962373 1933429 1907100 1884151 1862526 1841084 1821056 1802698 1784313 1765777 1749119 1734302
58732 1734302 1718397 1700435 1683090 1667871 1652537 1635043 1616275 1597081 1576301 1553574 1530454
58721 1530454 1506849 1480080 1449384 1417792 1387567 1357257 1325248 1292706 1260922 1229170 1197380
58710 1197380 1167743 1141500 1117108 1093427 1071679 1052608 1034848 1017766 1002656 989498 975888
58699 975888 960880 946503 933869 921269 907877 895721 886040 877113 867584 858597 850916 843399 836133
58686 836133 831464 830130 829874 829521 830592 833187 834368 832767 830692 829431 826556 820422 813450 808235 803986
58671 803986 799435 795646 793287 790550 786401 782642 780459 778421 776116 776003 779178 782897 784755 785666 786389
58656 786389 785131 781253 777455 775437 773268 769833 767967 770124 774798 780247 787874 798711 810412 821138
58642 821138 832736 846701 860675 872573 884647 899792 917158 935035 954830 978545 1005379
58631 1005379 1034390 1067480 1106301 1149155 1194354 1243673 1299298 1360504 1426677 1500381 1584080
58620 1584080 1677023 1778771 1892493 2021226 2164102 2319872 2490934 2680120 2886491 3107861
58610 3107861 3344243 3594868 3854543 4116391 4375058 4623498 4849572 5039721 5183733
58601 5183733 5273521 5301620 5265521 5170896 5026947 4841415 4623059 4384676 4138670 3892143
58591 3892143 3649803 3418083 3202107 3001871 2815903 2645936 2493982 2358080 2235361
58582 2235361 2126386 2032260 1950487 1878034 1815497 1763798 1719715 1679134 1641917 1609157 1578664
58571 1578664 1547799 1517947 1491483 1466865 1441194 1414956 1389765 1364143 1336139 1307450 1280435
58560 1280435 1253651 1224807 1195453 1168165 1141842 1114329 1086993 1062173 1038883 1015613 994487
58549 994487 977896 963826 949287 935461 924670 915318 904945 895330 889275 885127 879759 874219 871029
58536 871029 868621 864000 858424 854860 852140 847138 840445 834512 828435 819929 810168 801326 791729 778839
58522 778839 764588 752329 740945 727506 713183 700868 689480 676514 663796 654752 648228 640856
58510 640856 633219 627734 622973 616365 610178 608307 609216 608487 606420 606594 608752 609761 610033 612417 616052
58495 616052 617704 617982 620118 623838 626392 628167 631407 634994 636432 637262 640508 644665 646294 646579 649014
58480 649014 652657 654213 654793 657899 662597 665417 667149 670950 675550 677237 676725 677068 676772 672252 665286
58465 665286 660542 657383 651612 643651 637262 631831 623920 615044 609746 607053 602053 595049 590882 589874
58451 589874 587693 583709 581274 579964 575765 569014 564241 562071 558949 554818 553327 554435 554458 553473 555188
58436 555188 559608 563292 566513 572564 580316 585213 587342 590815 595615 597882 597711 598668 600186 598664 595469
58421 595469 595495 598434 600050 601234 606724 615403 621411 624705 630879 640353 647583 651583 657405 666104 672766
58406 672766 675801 679040 683426 685643 685967 688384 691953 691312 686676 683940 683947 681315 675038 670384 668751
58391 668751 665545 659914 656827 657498 657252 654901 654844 657946 659660 659152 661022 666219 670575 673878 680824
58376 680824 691412 700167 706434 715377 727199 735758 739827 745277 753958 760900 764792 770618 779479 786388
58362 786388 790709 798093 809350 818094 822204 826982 834186 838813 839679 842321 848244 852072 852421 854803
58348 854803 860686 864547 864805 866743 871718 874566 874496 877116 882872 885338 883838 885621 892443 897476 898786
58333 898786 903103 912572 920662 925149 932209 943616 953007 959049 968950 984509 998042 1006609 1016663
58320 1016663 1030215 1040565 1046567 1056485 1072307 1084956 1090796 1098147 1111329 1123185 1129954 1138545
58308 1138545 1152084 1163065 1168059 1174589 1186207 1195552 1199497 1206196 1219615 1232118 1239958 1250805
58296 1250805 1268253 1284478 1296244 1312243 1336242 1359053 1375887 1395392 1422587 1449239 1470481
58285 1470481 1494378 1525499 1555631 1580524 1609008 1645700 1681709 1712422 1747040 1790366 1832998
58274 1832998 1869883 1910064 1957263 1999927 2032080 2064882 2105600 2144701 2176092 2210038 2253002
58263 2253002 2294851 2329591 2368575 2419377 2472216 2521229 2577930 2648979 2722090 2788770 2858988
58252 2858988 2938425 3014389 3080197 3149833 3231996 3313936 3387993 3468714 3565578 3664922 3757970
58241 3757970 3859993 3981504 4107809 4228113 4356983 4505164 4658060 4806147 4967098
58232 4967098 5153760 5350545 5546397 5759472 6003119 6260227 6518741 6798657 7115317
58223 7115317 7451507 7796003 8172574 8599026 9056457 9532672 10055081 10645116 11283555
58214 11283555 11959134 12705818 13551596 14479464 15483018 16609116 17899298 19345696 20956975
58205 20956975 22809146 24977726 27486769 30385887 33804308 37860276 42597491 48089234
58197 48089234 54521715 62101779 71005654 81542214 94272866 109887030 129142397
58190 129142397 153065244 182889834 219316748 261733856 308214722 355802802 400076582
58183 400076582 434641507 452481505 449304103 426117715 388524553 343573483 297094104
58176 297094104 252965448 213450420 179509427 151092206 127636725 108479423 92932838
58169 92932838 80286292 69941816 61492334 54613933 48986881 44369132 40633686 37677398
58161 37677398 35382496 33696283 32649833 32279254 32632263 33847713 36076092 39277322
58153 39277322 43205570 47562873 51937037 55526311 57216959 56233346 52714904 47558614
58145 47558614 41770449 36047549 30797572 26249052 22456596 19336982 16785830 14728269
58137 14728269 13073628 11710682 10568125 9622254 8839736 8167656 7581111 7086032 6670412
58128 6670412 6299017 5956618 5651817 5377983 5111764 4849356 4605335 4377421 4149143
58119 4149143 3924336 3723069 3546262 3378296 3220723 3089660 2983222 2884206 2791759 2718631
58109 2718631 2659822 2594673 2518088 2441118 2363676 2275197 2179901 2093638 2017275 1938771 1858887
58098 1858887 1789311 1728122 1662495 1593559 1534229 1484785 1434563 1385428 1349581 1325667 1300140
58087 1300140 1270970 1247769 1229942 1206902 1179056 1157281 1142243 1124624 1104862 1092541 1086948
58076 1086948 1077757 1064204 1054604 1047983 1035173 1017247 1004181 995885 982797 964599 950284 940269
58064 940269 926343 909040 897411 891590 882736 870313 862581 859740 853187 841800 832839 826455 815350
58051 815350 800199 789560 783829 774740 761483 751992 747447 740598 730541 724438 723272 720216 714448
58038 714448 712571 715107 715257 712361 713083 717997 720355 719434 721917 728506 732064 730629 729756 730594 728108
58023 728108 722561 720364 721892 720422 714665 710593 709506 706164 700098 696898 696707 693106 685061 678485
58009 678485 674458 667356 656343 647178 640803 631475 618218 607020 599644 591218 580912 573914 570646
57996 570646 564940 555432 548082 544944 541058 535092 532590 535584 539008 540416 543638 549930 555054 558010
57982 558010 563382 572054 578665 581110 583817 589014 593364 595687 599327 604472 606771 605851 606596 609825 610473
57967 610473 607166 604725 604835 603154 598235 594474 593515 591324 586458 582769 581330 578161 572486 568657 567325
57952 567325 563412 555652 549375 546911 544028 539075 536818 539437 542170 541923 542262 545978 550327 553456 558046
57937 558046 564739 569226 569519 569095 569463 566897 559907 552563 546763 538502 525544 511670 499580 486679
57923 486679 471728 458659 449799 442033 433532 427545 425599 423704 419524 416850 418765 422516 425332 429348
57909 429348 436693 445425 454178 465140 478799 491446 501368 511714 523942 534470 541262 547433 554710
57896 554710 559636 560146 559681 560706 560246 556010 550949 547443 542767 534649 525674 517887 508714 496701 485692
57881 485692 478734 473160 466275 460585 458692 458103 455951 454139 455123 457188 458449 461003 466621 472705 476941
57866 476941 481644 489179 497414 503967 510573 518965 526713 531464 535157 539837 543493 544201 544143 545183 544649
57851 544649 539922 533234 527643 522124 514918 507781 502549 497262 489985 482815 477982 473690 467905 462554
57837 462554 459807 457957 455101 453076 453558 454043 452035 449503 448778 447694 443355 437246 432068 426760 419125
57822 419125 410303 402218 393665 383168 372713 364494 356983 348207 339675 333062 326473 318358 311659 309373
57808 309373 309103 306787 302992 300797 300192 299322 298913 300766 303894 306510 309889 316271 324969 334239 344689
57793 344689 357173 369640 379703 387865 394883 398909 398987 398308 399959 402315 402627 402107 403120 404277 402886
57778 402886 399728 396897 393366 387133 379346 371921 363493 352188 340028 330099 321622 312355 303464 297341
57764 297341 292729 286814 280256 275507 271980 267497 262765 259799 257706 254726 252856 255641 262609 270467
57750 270467 278556 288691 300657 312275 323012 333567 342932 349767 355494 362325 369540 375375 380932
57737 380932 388303 396498 403301 409529 417198 425034 430149 432740 434877 436161 434995 432821 432454 433287 432708
57722 432708 431332 432405 436830 443083 451233 462604 476058 488960 501405 515575 531479 547219
57710 547219 562772 579651 597595 615538 635046 658717 685850 713653 742075 773444 808038
57699 808038 844199 882370 925021 972882 1024987 1081955 1145534 1215468 1290576 1372377 1464144
57688 1464144 1567221 1681999 1811500 1959841 2127908 2314493 2520795 2749332 2998863
57679 2998863 3264379 3541352 3825459 4108563 4379328 4627753 4845586 5024002 5156629
57670 5156629 5245175 5297402 5319255 5312846 5280461 5223130 5133173 4994040 4791915 4526741 4212760
57659 4212760 3872544 3530743 3207741 2914724 2654811 2428354 2234940 2071482 1932897
57650 1932897 1815665 1718056 1637173 1569322 1513290 1469569 1436343 1409992 1389641 1377249 1372846
57639 1372846 1373639 1378380 1388728 1405592 1427845 1455522 1490710 1534451 1586062 1646151 1716932 1799005
57627 1799005 1891276 1994617 2112124 2245111 2392303 2553574 2730854 2924412 3131420 3348593
57617 3348593 3572537 3796535 4010309 4203693 4367520 4491053 4563185 4577974 4536255 4441666
57607 4441666 4298995 4116985 3908056 3683118 3449489 3214402 2986186 2770208 2567263
57598 2567263 2377743 2204023 2047171 1904872 1774740 1656781 1550943 1455244 1368139 1289979
57588 1289979 1220471 1157334 1099027 1046179 998992 955960 916420 881515 851237 823341 796590
57577 796590 772253 751033 731477 712905 696908 684174 672670 660848 649981 641461 634316 627329
57565 627329 621270 617133 614308 612154 611387 612383 614200 616646 621176 628441 637126 646503 657758 671396
57551 671396 685663 699187 713061 728803 746243 764865 785351 808479 834280 863350 897067
57540 897067 935577 977594 1023078 1073970 1131511 1195181 1265163 1343332 1430804 1526987 1632127
57529 1632127 1748298 1876726 2016575 2167357 2329836 2503141 2683202 2864892 3043018
57520 3043018 3210142 3356372 3472901 3553726 3593500 3587412 3535141 3442271 3316249 3163525
57510 3163525 2991643 2810328 2627826 2448482 2275567 2113590 1965645 1831094 1708238
57501 1708238 1597183 1498321 1410500 1332769 1265663 1208829 1159734 1116594 1080208 1051034 1026995
57490 1026995 1006252 989604 977951 969897 964321 962826 967066 975734 986818 1000852 1019368 1042020
57478 1042020 1067941 1098394 1135553 1179917 1231090 1289772 1356947 1432541 1516816 1611711 1719026
57467 1719026 1838724 1970435 2114742 2271195 2436805 2607924 2781275 2951202 3108192
57458 3108192 3242368 3346638 3414872 3440118 3417968 3350190 3242650 3101513 2933825 2749393
57448 2749393 2558330 2367291 2180240 2001374 1834575 1681159 1540734 1413437 1299298
57439 1299298 1196716 1103865 1020620 947098 881620 822177 768573 721014 678011 637949 601389
57428 601389 569522 541513 515591 491597 470266 451094 433051 416300 401224 386862 372303
57417 372303 358458 346616 336453 327174 319097 312201 304838 296018 287331 280393 274050 266522 258648
57404 258648 252392 247612 243008 238940 236489 234868 232554 230079 229056 229189 228801 227576 226425 225384 223952
57389 223952 222778 222742 223082 222508 221371 220773 220486 219762 219087 219076 218759 217028 214604 212549 210223 206933 204039
57372 204039 202950 202502 200988 199329 199397 200479 200495 199616 199566 200223 200058 199282 199458 200374 200222 198604 196775 195289
57354 195289 193921 193298 193972 194447 192818 189874 188010 187681 187538 187399 188195 189466 189818 189501 189796 190269 189516
57337 189516 188214 188445 190209 191592 192223 193599 195999 198087 199730 202322 206036 209429 212032 214736 217439
57322 217439 218971 219649 221292 224312 227240 229470 232109 235793 239921 244306 249284 254038 257179 259220
57308 259220 262165 266581 271382 276528 283258 291409 299181 306048 313438 322024 330824 339640 349945 362533
57294 362533 376396 390716 406070 423058 441564 461881 484724 509712 535602 562323 590976
57283 590976 621582 652730 683688 714907 746139 775926 803231 827852 849094 865903 878264
57272 878264 886522 889257 883942 869983 849270 823698 794021 761071 726012 689351 651668 615174
57260 615174 582362 553239 525974 500094 476642 455546 435621 417243 402204 390550 380218
57249 380218 370219 361582 354656 348106 341243 334890 329295 323574 317889 313757 311398 309001 305402 301408
57235 301408 297839 294403 291105 288693 287028 284977 282403 280321 278799 276758 274151 272052 270446 268226
57221 268226 265620 264096 263530 262088 259360 256950 255422 253305 249758 245602 241103 235502 229435 225033
57207 225033 222654 220228 216735 213655 212036 210936 209849 209823 210875 211051 209563 208338 208926 210190 210502
57192 210502 209931 208870 206773 203706 200989 198997 196493 193300 191269 191285 191728 191333 191226 192607 194761 196963
57176 196963 200033 204378 208697 212461 217648 226307 238275 252774 270274 291137 314382 339402 367050
57163 367050 397530 429095 460323 491722 523675 554847 584180 612518 640684 667956 693934
57152 693934 719899 746804 774052 801771 831980 865637 900713 935163 969870 1006753 1046047
57141 1046047 1087453 1131966 1180282 1230979 1282398 1334922 1389632 1446329 1504576 1565092 1628265
57130 1628265 1692904 1758140 1824897 1893794 1963261 2031319 2097523 2161628 2222473 2280008 2336450
57119 2336450 2393455 2449905 2504271 2557294 2610660 2665194 2722355 2785275 2855966 2933177 3014879
57108 3014879 3100872 3191185 3284681 3382137 3488891 3611916 3756053 3925384 4126253 4366305
57098 4366305 4652253 4990957 5390517 5857393 6394018 7001599 7683367 8442808 9280913
57089 9280913 10197432 11191764 12259418 13390314 14573624 15800894 17061592 18342792
57081 18342792 19642877 20981805 22381456 23822567 25217802 26427632 27305252 27738732
57073 27738732 27673016 27112115 26107257 24738135 23095841 21272105 19353020 17414805
57065 17414805 15521760 13725715 12064714 10561600 9225274 8054095 7038382 6162261
57057 6162261 5407382 4757216 4198155 3717910 3304958 2949425 2642902 2377599 2147022
57048 2147022 1946937 1774074 1624334 1493650 1379677 1280892 1194769 1118657 1051658 993642
57038 993642 943030 897434 855787 817906 782667 748641 715915 685313 656463 628531 602085
57027 602085 578211 556535 536138 517522 501496 487022 472459 458161 445524 434344 423519
57016 423519 413513 405577 399187 392816 386696 382449 380668 381247 385330 394499 408973 429147 457923
57003 457923 499147 555363 630099 730270 862015 1024910 1213285 1419419 1627517 1804848
56993 1804848 1908994 1911862 1816792 1652024 1451427 1242132 1042924 865436 714732 591021
56983 591021 491898 413242 349896 297088 250869 207329 163390 119000 76801 38927 5728 -22273
56970 -43602 -57872 -66640 -71205 -71315 -66755 -58298 -46294 -30138 -9952 13000 38287 66873 99071
56957 99071 133570 168974 204168 236381 261014 274707 277286 270266 255371 235266 213702 193565
56945 193565 175913 161385 150815 143889 139027 135604 134812 137689 143877 153003 165791 183175 205724
56932 205724 234224 269010 308077 347204 382195 409376 424293 422849 405017 375604 340524 303807
56920 303807 268303 236566 209614 186662 167224 151936 140611 131389 122868 115401 109362 103833
56908 103833 98036 92453 87525 82618 77259 72066 67718 64192 61530 60012 59206 58293 57659 58558 61010
56893 61010 63755 66583 70914 77867 87679 101180 119626 142641 168406 196030 225226 253250 275061
56880 275061 287693 292273 291123 285553 277474 270313 266452 265616 266987 270877 277270 285039 294013 305809
56866 305809 321499 340592 363662 393653 433053 481610 538036 601405 668825 733371 786153
56855 786153 819596 828557 811307 771556 717840 658954 600729 547286 502431 467989 442998 426417
56843 426417 418957 420931 430673 447014 471529 506727 553973 614768 691527 784623 889987 1000958
56831 1000958 1109882 1205567 1272249 1295875 1272357 1208723 1117685 1012822 906518 807962 721554
56820 721554 648162 587703 539801 503364 477380 461682 455982 459226 471180 493610 528722 577387
56808 577387 639581 714615 798996 884835 961449 1017885 1044415 1035177 992142 925234 846579 765098
56796 765098 686627 615951 555951 506327 465589 433403 409588 392531 380747 374736 375570 383059
56784 383059 397036 418824 449270 486551 527603 569987 610061 640915 655064 649131 624656 585711
56772 585711 537610 486428 436953 391010 349012 312171 281717 257179 237168 220955 207913
56761 207913 196708 186667 178711 173418 169499 165638 162280 159966 157630 154380 151372 150004 149840 150160
56747 150160 151696 154714 157243 157610 157075 157518 158176 157272 155326 154053 153328 152046 150785 150745 151001 149594
56731 149594 146529 143116 139288 134283 129114 125561 123353 120912 118233 116475 115406 113879 112182 111406
56717 111406 111082 110003 108760 108910 110198 111152 111842 113417 115371 115969 115116 114291 113915 113217 112451 112780 114113
56700 114113 115302 116300 117952 119976 121249 121772 122242 122233 120958 119321 118929 119515 119530 118793 118346 118223 117645 116897
56682 116897 116754 116654 115732 115036 116281 118934 120937 121753 122320 122664 122124 121407 121825 122940 123416 123641 124928
56665 124928 126765 127605 127825 129087 131231 132668 133456 135066 137396 138946 139755 141306 143640 145444 146741
56650 146741 148608 150427 150507 149378 149331 150643 151335 150838 150716 151429 151483 150389 149514 149348 148731 147429 146834 147459
56632 147459 148242 148883 150413 152925 155184 156952 159294 162180 164215 165140 166160 167392 167400 165660 163128 160058
56616 160058 155610 149963 144476 139468 134114 128586 123926 119865 115314 110987 108810 108751 109003 109339 111293
56601 111293 114946 118554 121653 125411 129596 132353 133512 135025 137500 139319 139749 139922 140178 139516 138313
56586 138313 138386 139650 139886 138583 137787 138267 138199 136775 135864 136728 138150 139106 140325 141873 142189 141039 140656
56569 140656 142405 144909 146805 148813 151708 154816 157849 161809 166840 171592 175785 180880 187203 193065
56555 193065 197697 202288 207081 210410 211862 213423 216121 218416 219281 219950 221146 221536 220552 219839 220200 219989
56539 219989 218239 216547 215903 214499 210756 205981 201945 198215 193982 190212 187877 186111 184103 182837
56525 182837 183178 184087 184384 184396 184472 183839 182308 181031 180354 179077 176964 175559 175329 174563 172368 170069 168370
56508 168370 166024 162748 160434 159723 158383 155007 151434 149474 148085 145915 143908 143044 142206 140651 140075
56493 140075 141751 143930 144538 144276 144779 145812 146564 147645 149616 151513 152808 154764 157921 160527 161464
56478 161464 162408 164983 168044 169986 171465 173612 175730 177033 178602 181447 184627 187252 190210 193991
56464 193991 197120 198822 200856 204568 208490 210964 212740 214767 215933 215383 214673 215130 215347 213733 211307
56449 211307 209638 208312 206815 206498 208207 210207 210915 211438 213063 214654 214885 214590 214505 213320 210490 208264
56433 208264 208177 208223 206335 203953 203116 202785 201304 199896 200248 200989 200099 198700 198965 200268 200782 201007 202355
56416 202355 204009 204426 204200 204398 203978 201908 199795 199311 199106 197437 195634 195546 195731 193776 190397 187585
56400 187585 184626 179751 174053 170023 167648 165424 163723 163695 164439 164702 165832 169610 174756 178959 182711
56385 182711 187662 192925 196634 199613 203919 209308 214577 220704 229071 238276 246351 254361 264001 273386
56371 273386 279288 282050 284245 285867 284937 281734 278424 275444 271919 268629 266948 265962 264035 261931 261014
56356 261014 259978 257042 253755 252850 253913 254895 256154 258971 261796 262239 261275 261357 261963 261296 260731 262940
56340 262940 266936 269584 270849 273103 276447 279244 282093 286645 291605 294514 296444 300283 305505 309462
56326 309462 312826 318705 327097 335151 342362 350655 359839 367785 374737 382831 391761 399478 406550 415146
56312 415146 424271 430791 434683 438548 442431 444017 443403 442766 441710 437992 432623 429191 428149 426680 424180
56297 424180 422973 423620 424294 424887 427038 430180 432197 433889 438056 444386 450047 455057 462157 471574 480995
56282 480995 490573 502853 517816 533063 548841 567674 589114 610202 631215 655555 683850 713702
56270 713702 745537 783042 827133 874955 925662 981966 1045281 1114563 1190743 1277111 1374445
56259 1374445 1480649 1595905 1723258 1863463 2014119 2174246 2344653 2523262 2705061
56250 2705061 2887051 3068171 3244118 3407622 3554206 3682527 3789000 3867953 3917602 3940488
56240 3940488 3937835 3909352 3858767 3793230 3716491 3628526 3532207 3433806 3336064 3237248 3137904
56229 3137904 3041870 2949341 2855686 2758828 2661496 2564664 2465209 2361924 2257627 2153577 2047976
56218 2047976 1941726 1839329 1742144 1646865 1552487 1462530 1378573 1298078 1220699 1150315 1088418
56207 1088418 1031665 978305 930944 890670 854534 821144 792684 769166 746808 724389 705110
56196 705110 689912 675222 659651 646652 638005 630824 623479 618272 615780 612744 608079 604956 604558
56183 604558 603940 602205 602415 605241 607338 608221 611926 619557 627192 633613 642820 656266 669981 682283
56169 682283 696847 714971 732193 745954 759294 773675 785643 793966 802453 812015 817679 817453 816491
56156 816491 818341 819697 818110 817198 819560 822008 822641 825615 834236 846356 861012 882322 912225 946766
56142 946766 984443 1030977 1091151 1163300 1246657 1346522 1466828 1604602 1756452 1922722 2099791
56131 2099791 2275726 2439282 2586812 2716415 2823899 2910271 2985204 3056721 3123789 3183300
56121 3183300 3235836 3279076 3304347 3306509 3290231 3261247 3219504 3166041 3106996 3043692 2967028
56110 2967028 2868630 2749931 2614720 2462458 2296403 2129290 1972692 1828291 1696244 1582912
56100 1582912 1492317 1418648 1355578 1304922 1268302 1238962 1210432 1185184 1166444 1149646 1130323
56089 1130323 1112109 1098521 1085141 1068274 1052680 1042184 1031490 1016147 1001584 993097 986042 975444
56077 975444 966169 963630 963410 960248 958378 962723 968712 971139 974206 982372 990433 993334 996658 1006424
56063 1006424 1017831 1025126 1033032 1046946 1061531 1070942 1080715 1097393 1116032 1130312 1145166 1166696
56051 1166696 1189608 1207739 1226988 1254337 1284134 1308919 1333620 1364929 1397215 1423633 1450588
56040 1450588 1485877 1522975 1552840 1580867 1615934 1653090 1683780 1712926 1748720 1785553 1814496
56029 1814496 1840840 1873924 1909769 1941282 1974928 2019083 2066743 2108439 2151147 2205205 2264048
56018 2264048 2317028 2370600 2435762 2506049 2569512 2630878 2699822 2769351 2828851 2886545 2955397
56007 2955397 3028997 3095714 3163867 3247215 3338453 3423827 3511101 3615251 3729559 3839838 3954124
55996 3954124 4088178 4234681 4378035 4526419 4696881 4882257 5066459 5258636 5477181
55987 5477181 5714265 5952926 6204487 6490550 6803045 7122567 7460602 7841100 8256678
55978 8256678 8688313 9151516 9675126 10251941 10861429 11523193 12273640 13109042 14010568
55969 14010568 15006205 16145330 17433739 18863491 20486499 22385325 24595747 27141250
55961 27141250 30119404 33662121 37836155 42685993 48350875 55032785 62895775 72152210
55953 72152210 83238296 96776097 113440016 134076025 159839956 191748745 229818778
55946 229818778 272707836 317997187 362129097 399776473 424206462 429826017 415326771
55939 415326771 384467438 343783003 299524095 256153406 216411208 181709099 152368686
55932 152368686 127996195 107965669 91641874 78355078 67452396 58442615 50993712
55925 50993712 44804441 39585256 35144284 31377372 28169060 25384995 22948783 20838645
55917 20838645 19009299 17388849 15945220 14683872 13582015 12588318 11683587 10881425
55909 10881425 10171641 9518978 8914803 8376418 7897012 7446461 7019875 6637451 6297410
55900 6297410 5974592 5664648 5385910 5137626 4898023 4664009 4453064 4265126 4080546
55891 4080546 3896710 3730364 3582605 3436491 3290491 3160536 3047353 2934203 2818662
55882 2818662 2715324 2625226 2532950 2436093 2348273 2270793 2189884 2104531 2029430 1967733 1907499
55871 1907499 1847629 1800937 1768400 1735656 1698336 1666381 1640177 1606787 1563723 1523266 1489228
55860 1489228 1451820 1409539 1374164 1349675 1327096 1304510 1291797 1290946 1290863 1285826 1280521 1273386 1254024
55847 1254024 1221497 1187413 1156984 1124230 1089098 1061560 1044812 1031248 1018724 1014174 1017696 1019572
55835 1019572 1016791 1016451 1019464 1016932 1006305 995284 986098 971555 950379 930955 915912 898072
55823 898072 875479 855336 839051 818461 791382 766372 747458 728283 705976 686874 673639
55812 673639 660256 644635 633118 627689 621529 611970 605262 603898 601785 596754 595465 600914 606961
55799 606961 610153 615191 623758 629447 628810 626361 623902 616081 601431 586908 576381 565079 550165
55786 550165 536338 526195 515443 502516 492798 488474 484145 477235 472892 473920 475526 474572 474165 474457
55772 474457 468900 454878 438672 425007 410905 394613 381088 373331 367338 360776 357773 359894 361109
55759 361109 357003 350671 344522 334826 319651 303979 291594 279737 266788 257309 254290 253973 253221
55746 253221 254422 258405 260389 257963 255565 256143 255864 251891 247806 246351 244299 239600 236289 237202 238965
55731 238965 239128 241027 246503 250975 250927 249258 248226 244322 235532 226604 221455 216977 209933 203368 200531
55716 200531 198791 195273 192455 192654 192935 190934 189865 192363 195233 195656 196733 201468 207088 210856 215686
55701 215686 224192 232590 236369 237024 237675 237117 233772 230647 230790 232324 233070 235308 240978 246993 250464
55686 250464 253777 259383 264454 265906 265990 267627 268938 267679 266396 267678 268748 266225 262107 259686 257705
55671 257705 253885 250186 249269 249554 248857 249040 252060 255339 256093 256370 258918 261972 263156 264466 268226 272021
55655 272021 272946 273142 275867 279648 281602 282993 286184 289386 289638 287829 285774 281569 273044 262731 254365
55640 254365 247255 238890 230098 222913 216307 208730 201850 197211 192378 184992 177378 172399 168090 161318
55626 161318 153552 147966 143868 139022 134493 132096 129916 125427 120344 117456 115489 112006 108536 107639
55612 107639 107619 105426 102290 101316 101857 101444 100956 102633 105037 105152 103643 103130 103070 101152 97957 95648 93878
55595 93878 91413 89817 91048 93426 94386 95063 97727 101017 102326 102603 104065 105421 104269 102076 101806
55580 101806 102578 101616 99550 98899 99184 98443 97678 98791 100037 98765 96985 98848 104020 108777 112491 117811
55564 117811 125316 133003 140286 147812 154126 157025 157422 157565 156595 152153 145067 137880 130120 119840 108668
55549 108668 100348 95084 90067 84822 81324 79535 77598 75913 76493 78705 80028 80517 82270 85078 86919
55534 86919 88169 90975 94924 97552 98706 100327 102434 103429 103790 105353 107437 107692 106209 104798 102944
55519 102944 98590 92263 86215 80100 71790 61954 53568 47301 41568 36725 34885 35840 37279 38830
55505 38830 41864 45592 47453 47244 46982 46950 45752 43872 43204 43367 42497 41281 42154 44752 46176 45526 44286
55488 44286 42609 39341 35387 32868 31111 27508 22145 17531 14101 10233 6448 5118 5975 6272 5583
55473 5583 6153 8318 9874 10305 11419 13372 14238 13999 14875 17193 18957 19949 22218 25928 28705 29799
55457 29799 31011 32861 33634 32927 32425 32546 31937 30808 30999 32225 32052 30250 29338 30130 30524 29529 28759
55440 28759 29077 29297 29108 29801 31305 31888 31526 32096 33635 33924 32471 31358 31451 31312 30623 31030 32758 33947
55422 33947 34219 35376 37672 38915 38215 37189 36581 35158 32903 31731 32009 31745 30279 29436 30053 30788
55406 30788 31308 33172 36454 38921 39749 40747 42806 44428 44850 45254 45820 44967 42647 41024 40685 39625
55390 39625 37167 35395 35363 35313 34167 33353 33674 33631 32474 31740 32194 32369 31668 31697 32937 33317 31859 30660
55372 30660 31314 32267 31646 30055 28726 27373 25576 23976 22643 20665 18543 18418 20724 23304 24917
55357 24917 26753 29289 30807 30517 30121 30661 30734 29478 28483 28982 29839 29968 30108 30553 29850 27361 24577
55340 24577 22436 20007 17230 16026 17081 18364 18522 18874 20315 21220 20376 19225 19180 19314 18680 18294 18819
55323 18819 18834 17488 16464 17254 18713 19240 19195 19396 19426 19079 19210 19666 18826 16672 15612 16672 17716 17221
55305 17221 16846 18146 19622 19374 18137 17397 16949 16478 17019 18640 19259 18044 17454 19503 22539 24238
55289 24238 25214 26914 28364 28003 26807 26650 27227 27196 26760 26659 26315 25344 25174 26760 28467 28568 28052 28549
55271 28549 29255 28488 26665 25225 24120 22811 22174 22940 23730 23116 22214 22835 24436 25293 25376 25628 25665 24586
55253 24586 22958 21793 20685 19053 17953 18469 19510 19386 18463 18219 18758 19252 19713 20420 20715 20137 19590
55236 19590 19763 19816 19166 18926 19798 20427 19790 19360 20703 22708 23566 23752 24583 25464 25198 24649 25430 27104
55218 27104 28149 28579 29249 29704 29150 28518 29187 30587 31277 31360 31734 32066 31667 31269 31745 32221 31607 30739 30814
55199 30814 31065 30347 29686 30707 32667 33663 33739 34271 35212 35584 35773 36760 37776 37235 35365 33570 31986
55182 31986 30036 28537 28653 29386 28689 26630 24996 24280 23480 22567 22708 24140 25888 27435 28791 29329
55166 29329 28452 27041 26426 26376 25821 24881 24385 24102 23354 22636 22751 23114 22806 22451 23051 23888 23706 23131 23673
55147 23673 25145 26286 27207 28851 30662 31163 30437 29814 29525 28753 27598 26883 26496 25862 25575 26585 28307
55130 28307 29475 30249 31564 33182 34384 35733 38019 40306 41332 41975 43872 46349 47284 46489 45688 45578
55114 45578 45444 45298 45848 46533 46028 44599 43713 43564 43118 42363 42237 42646 42762 42918 43931 45031 44877 44252
55096 44252 45206 47730 49794 50548 50996 51550 51483 50939 51042 51788 52034 51671 51682 52068 51903 51436 51871 53094 53865
55077 53865 54262 55571 57769 59485 60590 62360 64863 66547 66825 66866 67444 68098 68668 69531 70122 69386 67928
55060 67928 67513 68168 68060 66607 65428 65681 66601 67254 67728 68017 67594 66619 65833 65000 63245 61113 60263 60863
55042 60863 61288 60673 59773 59003 57811 56371 55768 55990 55777 54939 54724 55410 55641 54877 54400 55058 55885 55874 55382
55023 55382 54950 54286 53247 52417 52065 51830 51833 52678 54053 54881 55200 56303 58667 61254 63194 64567 65289
55006 65289 64930 64002 63772 64366 64579 63834 62773 61742 60408 59054 58484 58367 57442 55663 54331 53818 53010
54989 53010 51429 50102 49770 49907 49993 50244 50705 51112 51875 53676 56035 57839 59202 60970 62558 62435 60869
54972 60869 59927 60536 61699 62845 64591 66719 67845 67822 68235 69777 71274 72092 73390 76069 79452 82892
54956 82892 86870 91690 96890 102590 109502 117069 123675 129465 136840 147228 159411 171903 184847
54943 184847 198391 211133 221464 228892 233041 233049 228877 221635 211806 198841 183256 167234 152283
54930 152283 138147 124861 113734 105182 97655 90061 83479 79131 76367 74027 72253 71526 71284 70784
54916 70784 70192 69853 69681 70069 71981 75340 78842 82083 86307 92290 99273 106842 116017 127407 140034
54901 140034 153023 166704 180912 193947 204341 211974 216415 216089 210402 201015 189695 176567 161751
54888 161751 146852 133363 121200 110228 101557 95690 91006 85790 80460 76230 72882 69484 66133
54875 66133 63401 61105 58997 57632 57223 56771 55530 54211 53516 52750 51162 49458 48677 48652 48773 49158 49853
54858 49853 50091 49497 48892 48837 48638 47826 47183 47186 46940 45962 45432 46293 47564 47995 47973 48212 48025 46657 45103
54839 45103 44795 45452 45866 45888 46082 46299 46109 45833 45805 45441 44290 43092 42626 42547 42529 43381 45649 48172 49386
54820 49386 49176 48346 47371 46791 47516 49485 51206 51827 52334 53569 54674 54927 55458 57443 60083 62201 64436
54803 64436 67918 72043 75592 78970 83369 88671 94169 100402 108310 117400 126682 136673 148622 162424
54789 162424 176994 191925 206934 220432 230476 236612 239237 237932 232199 223097 212361 200562
54777 200562 187800 175386 164945 156485 149085 142845 138375 135032 131615 128267 125921 124396 122845
54764 122845 121535 121340 121984 122625 123775 126750 131617 137451 144276 152911 163223 174404 186779 201522
54750 201522 218735 237457 257445 279299 302868 326952 350258 371156 386850 394629 394077 386819
54738 386819 374318 357232 336497 313481 289147 264390 240795 219722 201069 184294 170040
54727 170040 159124 150508 142157 133662 126311 120732 116190 112066 108415 105101 101876 99238 97826 97131
54713 97131 96136 94941 94331 94144 93604 92846 92491 92003 90225 87401 85056 83964 83721 84052 84935 85682 85582
54696 85582 85332 86167 87739 88461 87819 86728 85728 84591 83661 83836 85097 86554 87920 89431 90485 90099
54680 90099 88740 87992 88378 89211 90501 93151 97033 100760 103750 106807 110294 113416 115855 118566 122279
54665 122279 126483 130433 134024 137300 140200 143134 146737 150760 154224 156784 159002 161251 163472 165945
54651 165945 169150 172925 176883 181531 187799 195682 204658 215143 228003 242858 258512 274980 293429
54638 293429 314129 336100 358718 381776 403733 421777 434090 440509 440736 433754 419594 400031
54626 400031 376891 351126 324101 298135 274892 254348 235964 219721 205497 192731 181412
54615 181412 172376 166021 161675 158576 156420 154613 152207 149102 146298 144480 143250 142059 140874 139540
54601 139540 137556 134872 132007 128993 125133 120199 115034 110664 107449 105178 103259 100836 97516 93980
54587 93980 91110 88785 86367 83926 81865 79808 77223 74741 73404 72877 72006 70827 70366 70636 70651 70407
54571 70407 70860 71813 71772 70319 68822 68270 68063 67525 67009 66913 67013 67263 67945 68680 68735 68562 69487 71580 73436
54552 73436 74386 75177 76126 76522 76488 77492 80091 82915 84865 86782 89925 94210 98918 103829 108750 113144
54536 113144 117117 121663 127262 133495 140532 149439 160257 171313 181366 190937 200571 209323 216078
54523 216078 220956 224156 224703 221609 215262 206586 195970 184112 172646 162592 153135 143281 133811
54510 133811 126258 120660 115642 110198 104282 98139 92145 87005 83228 80675 79060 78331 78105 77536 76377
54495 76377 75385 75051 74776 73991 73241 73361 74278 75368 76296 76862 76786 76378 76656 78079 79842 81079 82064 83524
54477 83524 85467 87367 88913 89924 90093 89442 88541 87864 87451 87412 87988 88810 88969 88168 87024 85972 84783
54460 84783 83419 82301 81420 80305 79169 78884 79385 79419 78414 77302 76873 76673 76236 76024 76326 76490 76158
54443 76158 75992 76226 75827 74183 72459 72002 72429 72477 71869 71088 70170 68908 67620 66630 65674 64739 64682 65908
54425 65908 67232 67293 66493 66366 67445 68934 70175 71376 72965 74984 77067 78611 79236 79395 80032 81382
54409 81382 82734 83584 84237 85012 85833 87004 89325 92901 96808 100451 104218 108337 112243 115643 118960
54394 118960 122073 124009 124710 125662 127756 129798 130320 129597 128586 127081 124415 121096 118180 115676 112908
54379 112908 109905 107186 104681 101994 99284 96859 94453 91847 89579 88055 86653 84717 82769 81664
54365 81664 81149 80407 79477 79083 79469 80297 81262 82024 82080 81484 81040 81111 81066 80693 81148 83376 86434 88589 89477
54346 89477 90089 91245 93150 95942 99570 103550 107624 112060 116579 119871 121125 121188 121163 120819 119553 118010
54330 118010 117277 117068 116106 113932 111089 107962 104565 101168 98092 95211 92471 90316 88785 86942 84168
54315 84168 81259 79183 77521 75345 72889 71060 69885 68683 67288 65900 64275 62213 60381 59515 59305
54300 59305 59110 59086 59550 59917 59569 59110 59503 60466 60958 60667 59853 58419 56463 55105 55356 56588 57382 57326
54282 57326 56825 55878 54516 53725 54361 55617 56108 55973 56392 57479 58249 58316 58088 57615 56795 56393 57246 58738
54264 58738 59543 59634 60016 60809 61212 61118 61107 60995 60069 58699 58066 58297 58441 58250 58396 58858 58720 57775 56846 56350
54244 56350 55924 55610 55969 56794 57119 56743 56546 57141 58329 59869 61587 62760 62780 62425 63103 64847 66388
54227 66388 67164 67788 68469 68539 67769 66742 65731 64541 63559 63501 64001 63989 63610 64114 65558 66349 65645 64569
54209 64569 64348 64643 64565 64093 63664 63388 63382 63981 64930 65253 64445 63083 61870 60928 60302 60254 60683 61100 61418 61950
54189 61950 62522 62563 62146 61840 61396 59878 57360 55228 54342 54065 53631 53346 53773 54679 55482 56016 56357 56527
54171 56527 56688 57001 57105 56445 55210 54122 53309 52371 51541 51618 52539 53218 53128 52995 53601 54934 56795 59087
54153 59087 61126 61803 60939 59565 58489 57539 56543 55901 55698 55329 54602 54277 54881 55790 56136 55928 55757 55990
54135 55990 56667 57628 58428 58637 58416 58219 57938 57088 55813 54837 54376 53996 53583 53453 53418 52804 51572 50398
54117 50398 49465 48210 46508 45105 44647 45119 46280 47663 48194 47087 45234 44446 45116 45959 46207 46550 47506
54100 47506 48372 48613 48961 50286 52354 54433 56281 57841 58773 58906 58552 57982 57235 56573 56327 56169 55451
54083 55451 54332 53553 53089 52221 51035 50573 51257 52442 53635 54843 55555 54935 53386 52389 52470 52821 53185
54066 53185 54282 55920 56716 56468 56883 58852 60861 61342 60946 61077 61703 62124 62615 63760 65185 66407 67941
54049 67941 70251 72512 73751 74355 75234 76400 77540 79021 81038 82734 83558 84547 86841 89783 92046
54034 92046 93913 96789 100954 105424 109731 114355 119535 124979 130661 136733 142776 148208 153319 158920
54020 158920 165101 171204 176754 181505 184893 186470 186847 187359 188816 191107 193684 195783 196555 195766 194148
54005 194148 192481 190669 188249 185210 181642 177167 171610 165849 161178 158057 156047 154496 152683 149915
53991 149915 146281 142852 140430 138590 136549 134329 132309 130330 128093 125873 124015 122334 120808 120131
53977 120131 120621 121300 121140 120598 120773 121620 122228 122412 122765 123366 123669 123540 123355 123191 122855 122569 122678 122892 122724
53958 122724 122450 122686 123215 123251 122709 122207 121883 121226 120125 119239 119171 119931 121195 122532 123500 124163 125326 127693
53940 127693 131095 135122 139985 145919 152153 157501 161741 165447 168671 170857 171946 172455 172446 171432 169492
53925 169492 167584 166493 166197 166462 167369 169024 171359 174461 178501 183168 187642 191379 194595 197911 201806
53910 201806 206443 211744 217569 223965 231047 238474 245412 251406 256957 262824 268984 274664 279089 281864
53896 281864 282946 282697 281668 279999 277391 274008 270786 268315 265895 262385 257654 252596 248038 244145
53882 244145 240509 236229 230332 222802 214947 208150 202500 197131 191533 185976 180931 176677 173209 170096
53868 170096 166757 163236 160213 157856 155322 151939 148168 144713 141350 137487 133355 129699 126722 124123
53854 124123 121739 119387 116506 112869 109258 106590 104685 102718 100520 98631 97378 96711 96573 96686 96342
53839 96342 95194 93807 92663 91209 88921 86718 86108 87183 88645 89628 90337 91000 91332 91239 91090 91136 91337
53822 91337 91737 92350 92801 92796 92771 93346 94341 95102 95565 96219 97231 98414 99833 101602 103300 104431 105232 106264
53804 106264 107509 108742 110367 112899 115902 118579 121157 124557 128837 133196 137469 142328 147846 153081
53790 153081 157412 161314 165483 170026 174750 179457 183694 186994 189517 191881 194252 196303 197942 199296
53776 199296 199935 199091 196823 194213 192172 190704 189348 187664 185207 181823 178103 174922 172458 170260 168214
53761 168214 166700 165801 165116 164366 163501 162231 160250 157893 155806 153894 151436 148293 145217 142797 140802
53746 140802 138756 136555 134399 132600 131498 131028 130497 129312 127758 126465 125420 124242 123098 122419 121887
53731 121887 120724 118935 117298 116175 115302 114714 114809 115368 115517 114939 114268 114092 114320 114700 115192 115639 115866 116285
53713 116285 117615 119798 121834 122912 123176 123307 123991 125721 128390 131011 132541 133060 133596 134908 137059
53698 137059 139920 143230 146313 148663 150786 153571 156879 159707 161644 163208 164731 165978 167038 168583
53684 168583 170925 173594 176066 178249 180186 181957 183819 185775 187117 187255 186776 186748 187191 187254 186717 186138
53668 186138 185655 184839 183757 182944 182337 181464 180662 180767 181532 181821 181476 181465 181903 181601 180055 178312 177210 176247
53650 176247 174972 173976 173583 172920 171423 170109 170159 171192 172131 172950 174307 176058 177347 177899 178224 178694 179152
53633 179152 179330 179117 178599 178210 178564 179844 181629 183413 184832 185452 185171 184919 186051 188728 191751 194284
53617 194284 196722 199485 202088 204069 205819 207726 209400 210591 212119 214906 218615 222152 225100 227958
53603 227958 231309 235408 240296 245714 251138 256263 261187 265881 269971 273304 276218 278978 281548 284210
53589 284210 287623 291865 296058 299411 302042 304404 306624 308860 311507 314435 316658 317451 317326 317377 318110
53574 318110 319372 320833 322005 322276 321519 320380 319572 319255 319333 319785 320343 320388 319619 318394 317128 315838 314555
53557 314555 313584 313048 312720 312559 312810 313354 313636 313514 313500 313927 314600 315505 317044 319188 321211 322640 323759
53540 323759 324923 326237 328104 331026 334380 336501 336643 335968 336022 337148 339079 341994 346089 350885 355899
53525 355899 361367 367529 373909 380095 386614 394153 402462 410851 419368 428709 439279 450893 463051
53512 463051 475099 486655 498252 511001 525203 540000 554775 569977 586046 602493 618866
53501 618866 635840 654372 674431 695428 717329 740414 764279 787967 811005 833788 857108
53490 857108 881579 907140 932879 957729 981444 1004322 1026145 1046427 1065755 1085580 1106361
53479 1106361 1127223 1147870 1169341 1192113 1214917 1236430 1256795 1276455 1294860 1311722 1328351
53468 1328351 1346214 1364966 1383191 1400212 1415868 1429444 1440429 1449694 1458423 1466352 1472351 1476165
53456 1476165 1478170 1477945 1474629 1468381 1460118 1450105 1438133 1424771 1411065 1397143 1382340 1366528
53444 1366528 1350134 1333083 1314974 1296112 1277088 1257528 1236505 1214196 1191858 1170171 1148662
53433 1148662 1126788 1104593 1082303 1060311 1039567 1021009 1004572 989521 975621 963223 952479
53422 952479 943385 936224 930962 926495 921588 916410 912140 909377 907995 908200 910458 914547 919942 926902
53408 926902 935916 946311 956918 968132 981717 998329 1016661 1035451 1054951 1075832 1097943 1120958
53396 1120958 1145334 1171746 1200122 1229844 1260586 1292640 1326747 1363725 1403864 1446586 1491058
53385 1491058 1536963 1584230 1632405 1681040 1730467 1781325 1833548 1886641 1940707 1996059 2051919
53374 2051919 2106603 2159165 2209940 2259414 2307524 2354112 2399036 2441524 2480370 2515080 2546083
53363 2546083 2573621 2597123 2615860 2629610 2638615 2643502 2645139 2643778 2638406 2627772 2611959 2592102
53351 2592102 2568699 2541255 2509583 2474347 2436191 2395377 2352411 2307977 2261982 2213673 2163046
53340 2163046 2111280 2059630 2008829 1959753 1913474 1870187 1828868 1788440 1748479 1708630 1668400
53329 1668400 1628035 1588704 1551224 1515320 1480526 1447015 1415099 1384678 1355764 1328862 1304321
53318 1304321 1281869 1261257 1242727 1226346 1211427 1197104 1183063 1169308 1155690 1142033 1128371
53307 1128371 1114766 1101315 1088515 1077110 1067353 1058924 1051725 1046166 1042416 1040070 1038885 1039263 1041550
53294 1041550 1045331 1049848 1054742 1060077 1065995 1072707 1080613 1090168 1101724 1115468 1131258 1148649 1167496
53281 1167496 1188338 1211658 1236893 1262847 1288979 1315581 1342613 1369182 1394330 1417688 1439224
53270 1439224 1459044 1477666 1495777 1513361 1529460 1542902 1552882 1559037 1561773 1562615 1563326 1564302 1564422
53257 1564422 1562598 1558754 1553012 1544750 1533129 1518134 1500660 1481762 1462001 1441293 1419309 1396251
53245 1396251 1373012 1350134 1326865 1301958 1275298 1248026 1221150 1194843 1169096 1144167 1120098
53234 1120098 1096564 1073443 1050981 1029251 1008052 987406 967541 948354 929540 911188 893527
53223 893527 876178 858585 841160 824996 810367 796609 783635 772364 763121 754714 745731 735994
53211 735994 726176 716768 707985 699911 692049 683216 672485 659956 646347 632325 618452 605154 592354
53198 592354 579614 566930 554892 543970 534186 525586 518228 511507 504274 495962 486932 477519 467592
53185 467592 457357 447711 439165 431037 422206 412209 401331 390176 379445 369598 360516 351963 344296
53172 344296 337958 332346 326246 319508 313192 307814 302706 297553 293216 290250 287714 284457 280689 277334
53158 277334 274491 271490 267926 263823 259211 254338 249896 246343 243318 240252 237116 234142 231317 228730
53144 228730 226827 225707 224622 222794 220368 218130 216665 216144 216345 216455 215513 213590 211936 211409 211360 210652
53128 210652 209157 207586 206460 205938 206156 206939 207577 207554 207216 207167 207399 207625 208006 208873 210019 210865 211095 210695
53110 210695 209728 208554 207908 208188 208921 209451 209844 210729 212466 214811 217095 218523 218665 217911 217034 216173 214786
53093 214786 212711 210440 208115 205197 201592 198209 195730 193687 191497 189544 188338 187301 185381 182441
53079 182441 179155 175970 172998 170524 168696 166926 164478 161487 158682 156293 153845 150932 147628 144366
53065 144366 141836 140663 140628 140538 139433 137587 135821 134287 132635 130956 129748 129045 128296 127091 125567 124216
53049 124216 123649 124268 125677 126673 126298 124736 122871 121293 120157 119587 119657 120164 120806 121383 121603 121064 119739
53032 119739 118038 116128 113723 110909 108600 107669 108040 109005 109953 110482 110360 109850 109471 109117 108072 106241
53016 106241 104516 103497 102783 102140 102260 103373 104069 102802 100001 97504 96272 95771 95388 95228 95553 96343
53000 96343 97498 98846 99961 100512 100722 101020 101492 102006 102528 102924 102946 102903 103729 105766 108049 109429 109828 109796
52982 109796 109518 109011 108671 108765 108982 109234 110179 112023 113566 113581 112574 112044 112526 113585 115198 117728 120753
52965 120753 123294 125246 127464 130480 134129 138303 142978 147553 151292 154473 158110 162491 166870 170631
52951 170631 173787 176312 177921 178651 178839 178470 177318 175759 174614 174101 173586 172430 170544 168237 166071
52936 166071 164579 163499 161780 159104 156835 156365 157028 156994 155908 155126 155310 155341 154026 151671 149391 147813
52920 147813 146959 146598 146295 145693 145051 144958 145463 146120 146852 148033 149615 151036 152049 152913 153667 153936 153583 152857
52902 152857 151891 150778 150120 150672 152390 154484 156355 157722 158145 157464 156648 157001 158384 159243 158623 157155
52886 157155 155914 155393 155866 157631 160301 162732 164181 164863 165106 164766 163874 163073 162843 162901 162777 162539 162600 163259
52868 163259 164605 166420 168094 169125 169695 170225 170569 170381 170093 170502 171452 172066 172395 173544 175792 177823
52852 177823 178505 178442 178937 180210 181527 182585 183902 186044 188994 192216 195087 197440 199751 202514 205479
52837 205479 207933 209681 211149 212575 213832 215077 216773 218814 220349 220735 220167 219186 218122 217056 215740
52822 215740 213518 210034 205977 202445 199578 196599 193173 189755 186598 183438 180316 177688 175460 172948
52808 172948 170093 167685 166047 164491 162503 160466 158725 156897 154676 152467 150592 148709 146597 144780
52794 144780 143713 142977 141886 140350 138721 137326 136475 136302 136294 135646 134269 132750 131196 129133 126732 124936
52778 124936 123944 122802 121090 119752 119490 119581 119249 119012 119442 119619 118271 115817 113870 113097 112838 112585 112527
52761 112527 112621 112209 110801 108572 106007 103534 101443 99680 97872 95884 94027 92388 90474 88061 85833
52746 85833 84533 83955 83456 83002 82859 82703 81946 80742 79770 79098 78066 76327 74332 72724 71766 71333 71017
52729 71017 70327 69248 68524 68965 70544 72536 74317 75692 76659 77362 78062 78722 78837 78122 77105 76523 76373
52712 76373 76091 75501 74993 74797 74654 74251 73588 72843 72198 71811 71696 71672 71631 71794 72515 73914 75867 78216 80800
52693 80800 83423 85884 87956 89410 90344 91437 93335 95724 97567 98474 99284 100969 103500 106179 108544
52678 108544 110484 111846 112494 112605 112460 112083 111313 110035 108192 105760 102891 99860 96840 93962 91496
52663 91496 89499 87496 85138 83080 82275 82429 82135 80807 79364 78638 78236 77658 77429 78193 79489 80431 80969
52646 80969 81553 81992 81528 79771 76903 73439 70377 68903 69166 69863 69909 69936 71279 74029 77181 80206 83265
52629 83265 86040 87637 87723 86860 85614 84111 82520 81205 80296 79749 79756 80460 81364 81756 81671 81746 82203 82733 83255
52610 83255 83951 84479 84080 82708 81311 80683 80613 80478 80114 79812 79832 80265 81070 82029 82900 83709 84686 85839 86885
52591 86885 87612 88112 88674 89635 91217 93199 94914 95896 96452 97232 98346 99279 99683 99889 100604 102301 104843
52574 104843 107550 109726 111247 112460 113461 113867 113588 113309 113749 114702 115384 115577 115929 117072 118863 120510
52558 120510 121295 121238 121138 121789 123100 124325 125134 125907 126828 127423 127422 127381 127900 128766 129546 130501 132094 134050 135746
52539 135746 137261 139139 141240 142713 143178 143246 143700 144739 146108 147484 148567 149199 149550 149961 150584 151314
52523 151314 151908 151980 151145 149457 147550 146092 145377 145593 146948 149081 150880 151448 150978 150181 149268 148071 146801
52506 146801 145986 145785 145909 146062 146015 145531 144670 143917 143554 143268 142827 142692 143295 144146 144381 143905 143354 143245 143842
52487 143842 145467 148104 150932 153061 154556 155996 157289 157817 157601 157438 157886 158894 160392 162405 164554
52472 164554 166201 167268 168267 169475 170653 171553 172130 172238 171716 170756 169635 168211 166342 164614 163942 164483
52456 164483 165573 166688 167761 168646 169047 169019 168828 168339 167276 166101 165789 166594 167761 168645 169407 170335 171146
52439 171146 171300 170640 169459 168235 167389 167013 166869 166824 167089 167667 167995 167665 167158 167185 167611 167793 167668 167629 167581
52420 167581 167117 166565 166804 167908 168902 169026 168420 167397 165885 163902 161860 160146 158942 158510 158992 159863
52404 159863 160240 159828 158941 157716 156172 154982 155096 156372 157544 157863 157958 158706 160095 161574 162762 163418
52388 163418 163392 163035 162984 163217 162990 162042 161169 161174 161924 162932 164217 166041 168224 170237 171748 172835 173914
52371 173914 175540 177813 179997 181267 181863 182768 184267 185736 187012 188898 191766 194664 196533 197660 199146
52356 199146 201478 204331 207298 210034 212007 212907 213250 214009 215608 217595 219306 220529 221607 223112 225399
52341 225399 228340 231472 234310 236470 237742 238395 239235 240908 243260 245712 247986 249946 251115 251211 250996
52326 250996 251666 253392 255346 257211 259608 262838 266240 269260 272203 275475 278838 281983 285167 288757
52312 288757 292747 297141 302212 307935 313760 319412 325360 332062 339340 346921 354966 363617 372644 382050
52298 382050 392427 404067 416269 428169 439880 452244 465753 480219 495181 510202 525038
52287 525038 539879 555190 571064 587121 603162 619367 635619 651274 665971 680132 694209
52276 694209 707993 721041 733233 744475 754461 763244 771446 779382 786488 792162 796666 800662 804320
52263 804320 807507 810261 812372 812937 811207 807731 803983 800924 798409 795849 792930 789746 786659 784051
52249 784051 782009 780317 778858 777775 777220 777341 778617 781639 786348 792020 798221 805275 813598 823143 833713
52234 833713 845087 856637 867675 878571 890611 904170 917923 930502 942059 953282 963790
52223 963790 972656 980017 986942 993913 1000344 1005466 1008897 1010544 1010680 1009914 1008438 1005582 1000790 994659 988221
52208 988221 981531 973830 964835 954925 944268 932776 920967 909925 900193 891358 882859 874566 866500
52195 866500 858575 850769 843163 835835 829122 823745 820043 817275 814367 811212 808581 806833 805556 804419
52181 804419 803499 802625 801255 799353 797654 796688 796067 795073 793453 791302 788710 785940 783509 781604 779659
52166 779659 776956 773513 769993 766837 763796 760377 756477 752477 748798 745467 742156 738672 735297 732568
52152 732568 730708 729318 727683 725433 722934 720866 719262 717188 713720 709174 704901 701778 699410 696966
52138 696966 694243 691524 688814 685750 682127 678133 674140 670429 666975 663386 659330 655156 651680 649169
52124 649169 646937 644198 640863 637229 633365 629316 625507 622395 619965 617989 616510 615631 615156 614944 615371
52109 615371 616940 619631 623131 627467 632905 639350 646370 653734 661528 669934 679332 690468 703920 719410
52095 719410 736063 753283 771026 789383 808428 828386 849429 871259 893347 915602 938249
52084 938249 960872 982187 1001188 1018251 1034601 1050803 1066241 1080168 1092724 1104468 1115214
52073 1115214 1124080 1130770 1135993 1140219 1142736 1142683 1140403 1136855 1132139 1125726 1117948 1109926 1101947 1093166
52059 1093166 1083243 1073055 1063334 1053798 1044246 1035383 1027741 1020758 1013824 1007382 1002072 997599 993463 990135
52045 990135 988468 988429 989354 990975 993301 996007 998859 1002305 1006731 1011650 1016503 1021704 1027755 1033896 1038884
52030 1038884 1042803 1046865 1051617 1056522 1061170 1065619 1069564 1072386 1074215 1075886 1077659 1078911 1079203 1078685
52016 1078685 1077328 1074756 1071084 1066978 1062612 1057374 1050840 1043236 1034666 1024703 1013096 1000237 986527
52003 986527 971849 955881 938427 919319 898588 876878 855134 833655 811932 789460 766205
51992 766205 742300 717907 693412 669170 645055 620893 597186 574614 552889 531051 508966
51981 508966 487606 467654 448842 430908 414165 398616 383458 368219 353696 340983 330070
51970 330070 320049 310357 301188 292875 285397 278410 271443 264179 256864 250311 245258 241742 239111 236505
51956 236505 233345 229627 225857 222580 220010 218130 216831 215686 213962 211331 208305 205469 202680 199700
51942 199700 197182 196047 196000 195716 194543 193069 191840 190538 188825 187086 185788 184783 183770 182865 182145
51927 182145 181098 179090 176160 172978 170229 168235 166911 165952 165315 165503 166928 168991 170392 170495 169812
51912 169812 168985 167945 166387 164445 162451 160416 158150 155581 152678 149414 146091 143396 141791 141073 140650
51897 140650 140031 138928 137292 135405 133672 132226 130994 130049 129487 128977 127987 126493 124977 123691 122462
51882 122462 121302 120550 120241 119969 119608 119579 120166 121106 122161 123533 125329 127042 127913 127531 125919 123490 121150
51865 121150 119917 120097 121105 122262 123406 124614 125878 127311 129177 131383 133339 134650 135573 136471 137240
51850 137240 137611 137828 138573 140212 142263 143688 143892 143534 144011 145768 147486 147573 146190 145066 145419 146873
51834 146873 148397 149405 149731 149397 148782 148424 148359 148218 148078 148477 149443 150309 150777 151327 152220 152906 152951 152773 152912
51815 152912 153210 153271 153182 153185 153183 153112 153246 153559 153323 152048 150482 149941 150819 152283 153300 153535 153388 153531 154299 155292
51795 155292 155726 155250 154161 152791 151257 149949 149587 150384 151658 152726 153706 154964 156290 157173 157588 157954
51779 157954 158557 159454 160690 162192 163611 164580 164973 164683 163492 161552 159712 158969 159657 161362 163477 165688
51763 165688 168082 170892 173968 176581 178139 179037 180389 182876 186318 190326 194730 199263 203536 207640
51749 207640 212249 217860 224293 231055 237718 243938 249635 255115 260313 264015 264793 262893 260254 258388
51735 258388 257152 255912 254788 254182 254026 254213 255030 256569 258520 261082 265165 270898 276694 280668 282416
51720 282416 282785 282637 282686 283798 286452 290220 294411 298716 302550 304576 303844 300935 297143 293021 288625
51705 288625 284633 282085 281204 281281 281468 280983 279010 275389 271193 267805 265596 264109 263107 262593 262225 261632
51689 261632 261105 261159 261710 262486 263916 266686 270753 275634 281339 287918 294322 298827 300637 300193 298086 294741
51673 294741 291115 288513 287400 287232 287554 288468 289931 291505 293008 294598 296131 297264 298408 300678 304599
51658 304599 309569 314770 319810 324152 326736 326737 324140 319223 312055 302919 292719 282454 272544 263044
51644 263044 254218 246512 240122 234860 230425 226745 224132 222931 222788 222480 220921 218221 215332 212786 210373
51629 210373 207999 206087 204898 204041 203011 201767 200480 199040 197221 195147 193268 191892 190858 189687
51615 189687 188068 186211 184660 183729 183224 182818 182427 182142 182102 182587 183837 185446 186353 185927 184748 183860 183554
51598 183554 183493 183708 184721 186682 189118 191677 194607 198246 202398 206423 209815 212598 215242 218111 220992
51583 220992 223465 225773 228775 232740 236727 239677 241650 243337 244783 245419 245177 244714 244462 244155 243411 242276
51567 242276 240987 239622 238177 236778 235751 235554 236382 237739 238727 239068 239450 240571 242330 244347 246678
51552 246678 249349 251742 253249 254263 255682 257706 259822 261802 263909 266207 268367 270044 270809 270024 267543
51537 267543 264377 261818 260055 258412 256783 255873 256069 256995 258236 259700 261207 262557 264057 266102 268203
51522 268203 269289 269127 268534 268042 267263 265896 264407 263269 262225 260761 258694 255979 252521 248553 244676
51507 244676 241241 238106 235246 233017 231599 230679 229921 229267 228575 227522 226108 224760 223722 222808 221925 221330
51491 221330 221150 221124 221020 220863 220607 220056 219269 218614 218293 218269 218690 219853 221702 223943 226634 230004 233732
51474 233732 237208 240601 244763 249845 254928 259399 263741 268433 272947 276638 279995 284103 289184 294396
51460 294396 298916 302632 305895 309081 312397 315746 318732 320942 322174 322488 322342 322602 323884 325767 327162
51445 327162 327631 327772 328151 328505 328460 328393 328857 329508 329364 328071 326331 324945 323860 322352 319903 316682 313189
51428 313189 309739 306371 303103 299869 296239 291733 286738 282631 280477 279864 279555 278961 278369 277975 277502 276776
51412 276776 276017 275425 275044 275064 275739 276926 278200 279440 280847 282464 284196 286189 288567 290873 292436 293187
51396 293187 293459 293092 291581 289028 285999 282374 277309 270643 263426 256670 250388 244306 238765 234335 230997
51381 230997 228154 225149 221581 217549 213714 210678 208290 206091 204309 203630 203978 204447 204500 204295 203606 201518
51365 201518 197613 192573 187227 181844 176759 172641 169579 166811 163980 161807 160875 160673 160556 160804 161802
51350 161802 162861 162869 161619 159675 157401 155051 153359 153018 153674 154215 154017 153318 152550 151982 151916 152595 153862
51333 153862 155253 156423 157291 158008 158997 160725 163108 165437 167159 168480 170008 172113 174802 177770 180418
51318 180418 182307 183738 185347 187010 187921 187933 187909 188295 188224 186720 184010 180960 177918 174895 172248 170265
51302 170265 168497 166327 163878 161586 159190 155977 151869 147597 143924 141213 139526 138584 137755 136599 135271
51287 135271 134060 132850 131445 130031 128892 127992 127307 127138 127587 128110 128099 127602 127044 126599 126327 126452 126977
51270 126977 127418 127436 127287 127208 126903 126285 126148 127257 129065 130110 129555 127790 125756 124247 123621 123640 123747 123818
51252 123818 124300 125293 126146 126406 126520 126928 127132 126462 125225 124234 123638 123067 122472 121966 121214 119979 118934 118917
51234 118917 119598 119806 119109 118202 117903 118540 120143 122338 124158 124859 124866 125151 125828 126215 126120 126046 126123 125811 124911
51215 124911 124064 123969 124688 125869 127070 127796 127801 127456 127391 127776 128380 129161 130295 131859 133939 136693 139632 141314
51197 141314 140715 138621 136685 135403 134116 132801 132395 133123 133844 133654 133148 133443 134673 136031 136720 136451
51181 136451 135483 134492 133917 133288 131833 129900 128964 129825 131544 132661 132823 132648 132499 132146 131374 130327 129278
51164 129278 128367 127537 126555 125201 123565 121980 120652 119554 118679 118026 117332 116185 114556 112915 111752 111193
51148 111193 111079 111056 110671 109756 108775 108371 108531 108581 108093 107381 106987 107071 107456 107943 108458 109110 110182 111874 114033
51129 114033 116279 118319 119929 120882 121192 121234 121242 120926 119952 118588 117375 116394 115455 114813 114962 115775 116500 116698
51111 116698 116544 116169 115360 114090 112787 111811 111100 110529 110208 110297 110886 112180 114373 117168 119726 121291 121733
51094 121733 121533 121440 122012 123154 124214 124831 125538 127093 129444 131809 133695 135260 136720 137964 138806 139172
51078 139172 138982 138222 137142 136090 135200 134559 134420 134855 135455 135830 136197 136944 137950 138908 140054 141849 144143
51061 144143 146323 148074 149328 149768 149310 148891 149811 152243 155229 158069 160802 163382 165493 167370 169728
51046 169728 172541 174834 176060 176796 177654 178399 178696 178946 179719 180876 181872 182508 182906 183058 182823 182104 180853
51029 180853 179226 177824 177301 177568 177867 177728 177304 176650 175361 173209 170561 167848 165154 162601 160624 159529
51013 159529 159187 159379 160037 161014 162130 163585 165743 168338 170494 171766 172622 173638 174894 176433 178649
50998 178649 181728 185215 188555 191776 195337 199659 205015 211447 218526 225563 232253 238806 245441 252254
50984 252254 259590 267898 277110 286803 297054 308487 321370 335451 350852 368267 387963 409419
50972 409419 432359 457357 485017 515390 548754 586096 628058 674021 723013 775014 830651
50961 830651 889919 951926 1015590 1080000 1144309 1207781 1269751 1329125 1384142 1433019 1474776
50950 1474776 1509237 1536574 1557088 1571088 1578732 1580257 1576458 1568518 1557317 1543554 1528720 1515121
50938 1515121 1504365 1496336 1490080 1485098 1481225 1477716 1473173 1466176 1455549 1440310 1419883 1394331 1364104
50925 1364104 1329597 1290877 1247576 1199201 1146116 1090157 1033588 977435 921620 866740 814608
50914 814608 766685 722987 683059 647053 615193 587001 561832 539544 520038 502779 487391
50903 487391 474014 462503 452081 442489 434632 429161 425173 421293 417465 414654 413373 413493 415006 417766
50889 417766 420779 422945 424362 425958 428006 430021 431963 434457 437792 441694 446150 451501 457550 463461
50875 463461 468817 474129 480135 487210 495541 505142 515526 526046 536878 549071 563358 579455 596781
50862 596781 615369 635750 658403 683805 712774 746265 784778 828236 876535 930248 990722
50851 990722 1059441 1137254 1224267 1320306 1425185 1538524 1659711 1788244 1923734 2065375
50841 2065375 2211599 2360355 2509225 2654895 2792962 2918865 3029113 3121553 3194813 3247900
50831 3247900 3280390 3292906 3287438 3267101 3235239 3194858 3149174 3102342 3058809 3021840 2993252
50820 2993252 2974311 2965668 2966071 2972112 2979752 2985372 2985259 2975474 2953109 2916847 2865647 2798072 2713827
50807 2713827 2615002 2504602 2384604 2256577 2123382 1988796 1855846 1726692 1603649 1488901
50797 1488901 1383372 1287135 1200798 1125311 1060467 1004836 957286 917458 884681 857469 834377
50786 834377 814655 798110 785038 776125 771464 769701 769023 768752 769064 769500 769205 768485 768549 769317 768936 766010
50770 766010 761077 755305 748925 741818 734622 728228 722757 717780 713063 708456 703626 698622 694245 691210
50756 691210 689287 687923 687398 688789 692985 700206 710279 722877 737602 754217 772730 793136 815302
50743 815302 839241 865085 892494 920575 948871 978191 1010053 1045500 1084857 1128481 1177166
50732 1177166 1231710 1292423 1359239 1432085 1510858 1594993 1683093 1773048 1862541 1949471 2032091
50721 2032091 2108992 2178903 2240166 2290342 2326763 2347749 2353097 2343284 2318838 2281053 2232943 2178750
50709 2178750 2122483 2067325 2016097 1971450 1935275 1908249 1890017 1879486 1875018 1874756 1876865 1879208
50697 1879208 1878988 1873141 1859098 1834983 1799470 1752135 1693929 1626791 1552806 1474078 1393208 1313153
50685 1313153 1236416 1164666 1098972 1039833 987020 940059 898932 863846 834377 809494 788615
50674 788615 772051 760240 753074 750172 751332 756451 765299 777545 792709 809955 828265 846977
50662 846977 865969 885310 904907 924417 943242 960858 977556 994615 1013160 1032965 1053008
50651 1053008 1073165 1094647 1118621 1145060 1173272 1203134 1235397 1271021 1310404 1353118 1398308
50640 1398308 1445432 1494548 1545767 1598681 1652518 1706503 1759719 1810982 1859438 1904986 1947550
50629 1947550 1986165 2019419 2046596 2067689 2082516 2090580 2091763 2086515 2075444 2059473 2040311 2020012
50617 2020012 1999994 1981093 1964448 1951514 1943270 1940139 1942513 1950387 1962513 1976985 1992748 2009481
50605 2009481 2025913 2039643 2049144 2054769 2057029 2054790 2045926 2028920 2003009 1967487 1921901 1866757
50593 1866757 1803390 1733469 1659115 1583018 1507675 1434538 1364300 1297622 1235102 1176826 1122483
50582 1122483 1071798 1024536 980465 939807 903485 872312 845995 823305 803265 785831 771424
50571 771424 760152 751725 745997 743229 743508 746057 749692 754193 760674 770079 781841 794728 808620
50558 808620 824511 842925 863318 885086 908210 932746 958638 986279 1016376 1048860 1082700
50547 1082700 1117169 1152619 1189651 1228182 1267554 1306842 1344844 1380783 1415499 1451107 1488860
50536 1488860 1528165 1568274 1610077 1655371 1705043 1758921 1816882 1879098 1945420 2015416 2089089
50525 2089089 2166990 2249668 2337329 2429803 2526359 2625693 2726388 2827269 2927077 3024135 3116556
50514 3116556 3202393 3279352 3344808 3396515 3432935 3452710 3454468 3437648 3403092 3352341 3286770
50503 3286770 3207801 3117553 3018787 2914616 2808617 2704697 2606345 2516321 2437389 2372698 2324748
50492 2324748 2294262 2280498 2282335 2298639 2327966 2368303 2416640 2468481 2518401 2561627 2594518
50481 2594518 2613194 2612839 2589582 2542823 2474893 2388997 2288432 2177237 2060089 1941151 1823654
50470 1823654 1710465 1604074 1505756 1415386 1332349 1256306 1187204 1125162 1070371 1022599 980761
50459 980761 943533 910410 881790 858061 839098 824575 814199 807536 803962 802867 803707 806080 810158
50446 810158 816755 826452 838818 852974 868737 886478 905990 926292 946795 968063 991086 1016208
50434 1016208 1043019 1070942 1099646 1129009 1158881 1188851 1218321 1246959 1274971 1302751 1330333
50423 1330333 1357392 1383583 1408617 1432070 1453537 1473010 1490957 1508081 1525176 1543138 1562877
50412 1562877 1585186 1610732 1639944 1672776 1708712 1747181 1787862 1830528 1874842 1920322 1966147
50401 1966147 2010909 2052972 2091289 2125473 2154925 2178324 2194257 2201816 2200298 2188793 2166482 2132955
50389 2132955 2087997 2031692 1965210 1891004 1811755 1729609 1646855 1566494 1491226 1422291 1360166
50378 1360166 1305957 1261157 1226283 1200827 1184561 1177905 1180797 1191982 1209689 1232397 1258589 1286198
50366 1286198 1312556 1334795 1350335 1357339 1354796 1342184 1319414 1287411 1248311 1204455 1157390 1108269
50354 1108269 1058833 1011228 966830 925763 887478 851431 817453 786030 757972 733330 710999
50343 710999 690157 671567 656518 644693 634364 624748 616902 611883 609086 607162 605780 605714 607628
50330 607628 611490 616980 623847 631877 640895 650818 661684 673695 687189 702245 718268 734319 749994
50317 749994 765704 781988 798876 816083 833523 851410 869956 889142 908650 928037 947073
50306 947073 965812 984157 1001481 1017021 1030527 1042198 1052052 1059747 1065015 1067838 1068184 1065974 1061382
50293 1061382 1054775 1046278 1035817 1023800 1011315 999285 987533 974997 960850 945260 928995 912458
50281 912458 895376 877531 859487 842144 825674 809470 793270 777659 763134 749228 735083
50270 735083 720415 705378 690003 674505 659775 646719 635316 625104 616414 610153 606350 603829
50258 603829 601576 599682 598653 598576 599423 601542 605216 609997 614947 619396 623179 626328 628848 630765 632187
50243 632187 633284 634138 634550 634114 632791 631246 630242 629617 628249 625182 620571 615413 610545 606028 601453
50228 601453 596618 591835 587500 583496 579352 575023 571072 567919 565343 563048 561313 560697 561409 563367 566550
50213 566550 570853 575862 581199 586774 592320 597164 601023 604600 608643 612718 615694 617194 617739 617601 616394
50198 616394 613870 610351 606268 601876 597399 592796 587424 580647 572842 565132 558118 551550 545229 539386
50184 539386 533974 528473 522696 517129 512072 506990 501097 494233 486931 479957 473863 468652 463852 459350
50170 459350 456013 454885 455809 457481 458878 460002 461224 462657 464222 465561 465782 464082 460840 457246 453655
50155 453655 449199 443302 436627 430135 424156 419014 415586 414253 413847 412620 410116 407432 405777 405307 405294
50140 405294 404995 404368 404080 404654 405575 405690 404622 403234 402507 402618 403443 405288 408424 412342 416195 419754
50124 419754 423393 427322 431325 435162 438813 442334 445822 449488 453566 458183 463287 468494 473019 476219
50110 476219 478347 480374 482912 485724 488371 490780 492997 494934 496738 498853 501280 503292 504313 504681
50096 504681 505092 505775 506697 508149 510470 513500 516906 520799 525443 530571 535600 540473 545687 551562 558017
50081 558017 565071 572950 581510 590015 597778 604756 611356 617906 624559 631494 638882 646645 654491 662354
50067 662354 670617 679692 689362 698829 707474 715293 722510 729188 735547 742302 750064 758573 766977 774840
50053 774840 782449 790193 798183 806452 814984 823427 831209 838003 843821 848710 852700 855851 857962 858552
50039 858552 857721 856684 856600 857085 856846 855606 854254 853107 851460 849312 848227 849660 853473 858954 866442
50024 866442 876899 890452 906373 924186 943876 965154 987150 1008770 1028836 1046130 1059789
50013 1059789 1069646 1076092 1079931 1082535 1085456 1089454 1094320 1099837 1106182 1112930 1118385 1120581 1118430 1111377
49999 1111377 1098677 1079853 1055366 1026207 993298 957979 922331 887961 854840 822294 790713
49988 790713 761290 734370 709271 685693 664162 644910 627264 610481 594484 579539 565754
49977 565754 553116 541583 531011 521414 513185 506643 501447 497024 493371 490832 489215 487895 486718
49964 486718 485971 485411 484191 481954 479203 476288 472891 468934 465220 462411 459873 456356 451652 446906 443234
49949 443234 440570 438011 434906 431296 427465 423485 419352 415378 412127 409904 408508 407532 406693 405793 404712
49934 404712 403683 403351 404246 406325 409201 412559 416106 419421 422369 425552 429883 435625 442113 448505 454604
49919 454604 461033 468783 478553 490292 503385 517403 532602 549590 568775 590336 614512 641606
49907 641606 671772 705007 741154 779583 818922 857448 893829 927454 958114 985570 1009420
49896 1009420 1029421 1046069 1060803 1075295 1090374 1105853 1121265 1136254 1150078 1161301 1168394
49885 1168394 1170311 1166291 1155626 1138128 1114532 1086036 1053679 1018480 981718 944545 907518 870883
49873 870883 835052 800347 766598 733533 701432 671030 642956 617555 594925 574659 555843
49862 555843 537888 521208 506613 494206 483357 473577 464875 457325 450811 445266 440719 437022 433773
49849 433773 430523 426929 422880 418663 414824 411634 408850 406116 403259 400087 396311 391909 387145 382066
49835 382066 376553 371143 367038 364759 363396 361840 360175 359172 358963 358988 358879 358630 358278 358055 358414 359214
49819 359214 359490 358887 358667 360174 362862 365149 366888 369462 373469 377860 381595 384819 387875 390444 392343
49804 392343 394210 396731 399898 403639 408420 414516 421183 427297 432523 437491 443055 449711 457434 465882
49790 465882 475042 485724 498919 514627 531903 550291 570568 593682 619501 646987 675058 702748
49778 702748 728827 751877 770844 785351 795560 801880 804831 805313 805075 806377 810558 816980 823904
49765 823904 830213 835617 839335 839609 834854 824593 808923 787825 761597 731466 699233 666555 634829
49752 634829 605356 579083 556255 536566 519540 504709 491713 480403 470652 462112 454491 448087
49740 448087 443560 441006 439578 438160 436189 433935 432363 432578 434763 437658 439654 440450 441077 442327 443989
49725 443989 445712 447642 449767 451419 452051 451957 451699 451245 450152 448239 445755 443240 441493 441117 441731 442166
49709 442166 441831 441300 441178 441102 440540 439920 440008 440561 440637 440134 440041 441001 442423 443351 443595 443624 443739 443862 444006 444577
49689 444577 446091 448648 451719 454457 456251 457002 456996 456755 456952 458145 460252 462462 463909 464457 464704 465265
49673 465265 466227 467292 468299 469412 470800 472269 473454 474368 475465 477004 478629 479883 480891 482100 483480
49658 483480 484484 484795 484676 484602 484947 486039 487956 490114 491518 491767 491528 491764 492768 494116 495227 495710
49642 495710 495451 494758 494357 494901 496338 497852 498535 498211 497609 497678 498681 500085 501266 502046 502498 502708 503006
49625 503006 504017 506009 508456 510683 512662 514750 517025 519466 522477 526496 531247 536071 540845 545880
49611 545880 551037 555802 560209 564880 570045 575383 580892 587101 594206 601821 609889 618989 629339 640222
49597 640222 650866 661260 671718 682276 693031 704456 716810 729708 742808 756511 771484
49586 771484 787830 805158 823159 841696 860647 880071 900264 921310 942857 964620 986858
49575 986858 1010017 1034255 1059564 1086058 1113791 1142492 1171737 1201207 1230749 1260481 1290918
49564 1290918 1322542 1355101 1387716 1419807 1451434 1482671 1513228 1542944 1572100 1600903 1629103
49553 1629103 1656327 1682286 1706398 1727751 1745867 1761155 1774357 1785903 1795896 1804214 1810538 1814816
49541 1814816 1817759 1820137 1821471 1820365 1816482 1811276 1806336 1801929 1797756 1794081 1791274 1789030 1787070 1786070
49527 1786070 1786913 1789463 1793020 1797619 1803867 1811673 1820150 1828848 1838364 1849610 1862978 1878251 1894853
49514 1894853 1912171 1929904 1948019 1966225 1983861 2000511 2016180 2030418 2041876 2049388 2053086 2053817
49502 2053817 2051868 2046920 2038820 2027605 2013064 1995092 1974411 1952161 1928784 1903800 1876612 1847114
49490 1847114 1815740 1783403 1751064 1718762 1685422 1650325 1614495 1579787 1546770 1514369 1481511
49479 1481511 1448292 1415378 1383105 1351474 1320504 1290241 1260791 1232507 1205832 1180906 1157531
49468 1157531 1135552 1115026 1096105 1078974 1063714 1049893 1036602 1023235 1009996 997319 985177
49457 985177 973536 963046 954475 947614 941429 935294 929473 924460 920470 917498 915233 912947 910053 906818
49443 906818 903946 901509 899012 896520 894985 895195 896945 899475 902323 905533 909434 914370 920394 927189
49429 927189 934549 942790 952296 963000 974980 989486 1008444 1032754 1061862 1095099 1132081 1170582
49417 1170582 1204665 1226719 1232549 1224485 1209367 1193709 1180767 1171299 1165600 1164081 1166595 1172425 1181132
49404 1181132 1192711 1206762 1222231 1238295 1254878 1271916 1288770 1304873 1320411 1335763 1350770
49393 1350770 1365209 1379478 1393985 1408167 1421023 1432483 1443439 1454442 1465125 1474969 1483957 1492378
49381 1492378 1500598 1509121 1518315 1527923 1537269 1546071 1554695 1563692 1573439 1584135 1595607 1607195 1618363
49368 1618363 1629486 1641587 1655303 1670471 1686626 1703395 1720447 1737580 1754951 1772830 1791202
49357 1791202 1809981 1829488 1850229 1872302 1895536 1920032 1945972 1973002 2000463 2028295 2057120
49346 2057120 2087407 2119147 2152323 2187091 2223373 2260845 2299487 2339587 2381084 2423463 2466548
49335 2466548 2510912 2557187 2605232 2654189 2703173 2751829 2800367 2848972 2897101 2943698 2988418
49324 2988418 3032218 3076159 3119946 3162341 3202697 3241219 3277762 3311360 3341179 3367225 3389881
49313 3389881 3409342 3425658 3438739 3448172 3453593 3455433 3454728 3452132 3447666 3441471 3434043 3425505 3415401
49300 3415401 3403567 3390690 3377716 3365245 3353763 3343813 3335497 3328223 3321385 3315102 3310070 3307010 3306312
49287 3306312 3307817 3310840 3314799 3319935 3326905 3335748 3345899 3357298 3370568 3385712 3401385 3416032
49275 3416032 3429194 3441148 3451772 3460424 3466647 3470358 3471409 3469380 3463695 3453706 3438989 3419910 3397732
49262 3397732 3373711 3348111 3320312 3289734 3256443 3221089 3184550 3147595 3110579 3073377 3035608
49251 3035608 2996889 2956981 2916024 2874663 2833759 2793738 2754313 2714867 2675087 2635391 2596939
49240 2596939 2561076 2528363 2498124 2469118 2440563 2412294 2384259 2356450 2329282 2303534 2279749
49229 2279749 2257922 2237670 2218330 2199107 2179712 2160865 2143671 2128507 2115052 2103301 2093793
49218 2093793 2086644 2081038 2076011 2071308 2067190 2063856 2061385 2059915 2059508 2059949 2060828 2061763 2062651 2063849 2065978
49203 2065978 2069309 2073553 2078523 2084599 2092050 2100317 2108706 2117489 2127493 2138812 2150833 2163420 2177010
49190 2177010 2191486 2205999 2220082 2233978 2247685 2260841 2273933 2288487 2305343 2323593 2341911
49179 2341911 2360138 2378879 2398290 2418171 2438755 2460573 2483834 2508527 2534655 2561720 2588326
49168 2588326 2612987 2635117 2654747 2671806 2686437 2699627 2712537 2725281 2737210 2748542 2760950
49157 2760950 2776154 2794337 2814227 2834425 2854396 2874395 2894919 2916320 2938716 2962036 2986152
49146 2986152 3011154 3037516 3065591 3094768 3123342 3149531 3172504 3192343 3209508 3224742 3239045
49135 3239045 3253085 3266803 3280100 3293567 3307895 3322862 3337666 3351970 3365770 3378520 3389487
49124 3389487 3398999 3408235 3417619 3426349 3433689 3439779 3444934 3449179 3452778 3456284 3459627 3461978 3462952 3463172
49110 3463172 3463337 3463625 3464339 3466177 3469344 3473199 3477234 3481542 3486010 3490101 3494017 3498991 3505653 3512994 3519730
49095 3519730 3525798 3531719 3537328 3542174 3546533 3550984 3555417 3559216 3562073 3564033 3565264 3566374 3568276 3571134
49081 3571134 3574099 3576648 3579322 3582407 3584968 3586250 3587123 3588807 3590841 3591727 3591167 3590215 3589415 3588188 3586074
49066 3586074 3583314 3579964 3575425 3569208 3561406 3552183 3541432 3529078 3515282 3500282 3484401 3468079
49054 3468079 3451435 3433975 3415108 3394686 3372678 3348808 3323137 3296652 3270609 3245527 3221244
49043 3221244 3197468 3173711 3149313 3124337 3099977 3077291 3055962 3035080 3014679 2995555 2977975
49032 2977975 2961539 2946016 2931491 2917973 2905760 2895733 2888282 2882319 2876380 2870467 2865766 2862897
49020 2862897 2861543 2861575 2863180 2865980 2869242 2873021 2877951 2883880 2889869 2895645 2901950 2909275 2917296 2925699
49006 2925699 2934395 2942710 2949472 2954292 2957860 2960713 2962676 2963712 2964232 2964160 2962697 2959467 2955034 2949871 2943738
48991 2943738 2936476 2928448 2919636 2909245 2896870 2883312 2869540 2855486 2840503 2824392 2807347 2789358
48979 2789358 2770337 2750437 2729756 2708151 2685816 2663567 2641991 2620695 2598984 2577009 2555693
48968 2555693 2535691 2516896 2498888 2481511 2464968 2449564 2435400 2422371 2410630 2400832 2393455 2387867
48956 2387867 2382564 2376506 2369995 2364267 2360621 2359849 2361917 2365965 2370998 2376658 2383162 2390736 2399593 2410196
48942 2410196 2422753 2436602 2450888 2465809 2482266 2500246 2518610 2536779 2555684 2576575 2599678
48931 2599678 2624526 2650806 2678335 2706820 2736220 2766720 2797902 2828599 2858197 2887481 2917570
48920 2917570 2948531 2979789 3011397 3044148 3078705 3115270 3153852 3194164 3235456 3277197 3319878
48909 3319878 3364496 3411259 3459358 3508099 3557770 3609121 3662337 3716769 3771572 3826442 3881763
48898 3881763 3938085 3995518 4053657 4111966 4170107 4227945 4285387 4342117 4397326 4449935 4499416
48887 4499416 4546234 4591028 4633466 4672379 4706933 4737068 4762824 4783948 4800356 4812345 4820090
48876 4820090 4823513 4822892 4818948 4811891 4800936 4785214 4764805 4740422 4712568 4681534 4647858 4612113
48864 4612113 4574276 4533840 4490606 4445111 4398226 4350521 4302013 4252436 4201796 4150690 4099921
48853 4099921 4049763 3999815 3949688 3899676 3850679 3803503 3758205 3714030 3670158 3626740 3584955
48842 3584955 3545789 3509094 3474279 3441442 3411061 3382858 3356051 3330703 3307821 3287784 3269684
48831 3269684 3252691 3237262 3224332 3214032 3205849 3199587 3195442 3193448 3193468 3195598 3200123 3207237 3217029
48818 3217029 3229456 3244120 3260430 3278273 3298042 3319727 3342558 3365999 3390516 3416737 3444365
48807 3444365 3472697 3501868 3532696 3565347 3598962 3632757 3666803 3701433 3736359 3770788 3804187
48796 3804187 3836627 3868440 3899772 3930513 3960464 3989445 4017280 4043986 4070044 4096189 4122636
48785 4122636 4148716 4173623 4197326 4220347 4242896 4264910 4286836 4309566 4333309 4357181 4380213
48774 4380213 4402222 4423414 4443691 4462767 4480500 4496598 4510315 4520907 4528207 4532434 4533533 4530951
48762 4530951 4523926 4511925 4494981 4473636 4448316 4418853 4385030 4347477 4307373 4265269 4220894
48751 4220894 4174252 4126101 4077071 4027198 3976844 3927267 3879510 3833214 3787234 3741125 3695483
48740 3695483 3651210 3609074 3569776 3533840 3501470 3472763 3447843 3426520 3408236 3392714 3380287
48729 3380287 3371282 3365558 3363054 3364194 3369091 3376755 3385782 3395591 3406421 3418378 3431208 3444877 3459694
48716 3459694 3475763 3492810 3510594 3529222 3549025 3570328 3593236 3617471 3642563 3668204 3694108
48705 3694108 3719533 3743575 3766252 3788673 3811717 3835130 3858378 3881819 3906372 3932509 3960240
48694 3960240 3989650 4020717 4052910 4085723 4119413 4154572 4191246 4229123 4268318 4309138 4351191
48683 4351191 4393558 4435867 4478563 4521968 4565683 4608940 4651101 4691733 4730636 4767819 4803147
48672 4803147 4836123 4866294 4893543 4917551 4937318 4951927 4961594 4967255 4969296 4967365 4961362 4951721
48660 4951721 4938534 4921019 4898075 4868933 4833188 4790763 4742040 4687775 4628862 4566529 4502531
48649 4502531 4438472 4374871 4311334 4247661 4184250 4121510 4059600 3998903 3940079 3883306 3827987
48638 3827987 3773484 3719733 3666931 3615016 3563754 3513022 3462774 3412993 3363879 3315870 3269296
48627 3269296 3224139 3180163 3137074 3094601 3052760 3012043 2973009 2935605 2899208 2863393 2828344
48616 2828344 2794431 2761704 2729908 2698774 2668244 2638661 2610752 2585069 2561371 2538769 2516562
48605 2516562 2494763 2473888 2454498 2436914 2421065 2406546 2393029 2380512 2368913 2357662 2346165
48594 2346165 2334626 2323961 2314893 2307581 2302048 2298397 2296402 2295413 2295002 2295433 2297248 2300569 2304964 2309816
48580 2309816 2314796 2320153 2326555 2334425 2343456 2352983 2362761 2373043 2384020 2395616 2407906 2421225 2435724
48567 2435724 2451148 2467122 2483304 2499119 2513777 2526761 2538058 2547710 2555436 2560962 2564554 2567047
48555 2567047 2569407 2572260 2575605 2578897 2581613 2583815 2586031 2588626 2591506 2594407 2597123 2599398 2600988 2602022
48541 2602022 2603046 2604499 2606356 2608383 2610545 2612971 2615721 2618770 2622173 2626055 2630384 2634846 2639072 2643253
48527 2643253 2648545 2656507 2667719 2681108 2695014 2708879 2723547 2740014 2758358 2777943 2798164 2818773
48515 2818773 2839949 2862348 2886733 2913091 2940316 2967169 2993551 3020582 3049370 3079932 3111314
48504 3111314 3142482 3172989 3203006 3233067 3263718 3295041 3326331 3356505 3385184 3413149 3441289
48493 3441289 3469195 3495312 3518566 3539259 3558093 3574863 3588595 3598631 3605074 3608413 3609198 3607907
48481 3607907 3604666 3599151 3591105 3580856 3568990 3555753 3541174 3525553 3509246 3492065 3473428 3453182
48469 3453182 3431756 3409516 3386468 3362711 3338646 3314442 3289638 3263526 3235791 3206702 3176907
48458 3176907 3147122 3117777 3088816 3059904 3030812 3001532 2972218 2943324 2915580 2889466 2864785
48447 2864785 2841175 2818918 2798725 2780714 2764155 2748455 2733900 2721147 2710302 2700917 2692748 2686153
48435 2686153 2681617 2679021 2677520 2676289 2675343 2675375 2676714 2678743 2680588 2682117 2683939 2686651 2690479 2695425 2701187
48420 2701187 2707007 2712166 2716791 2721765 2727734 2734541 2741697 2748996 2756413 2763733 2770576 2776738 2782362 2787814
48406 2787814 2793404 2799243 2805425 2812264 2820020 2828278 2835996 2842536 2848339 2854189 2860096 2865460 2870072 2874287
48392 2874287 2878197 2881301 2883210 2884219 2884915 2885533 2885815 2885256 2883354 2879885 2875139 2869769 2864380 2859253 2854240
48377 2854240 2848783 2842344 2835196 2828618 2823918 2821358 2820289 2820092 2820524 2821491 2823054 2825503 2828854 2832399 2835407
48362 2835407 2838214 2841984 2847344 2853838 2860735 2867679 2874420 2880610 2886175 2891448 2896705 2901963 2907304 2912894
48348 2912894 2918518 2923575 2927760 2931285 2934255 2936250 2936795 2935834 2933507 2929809 2924701 2918319 2910948 2902995
48334 2902995 2894999 2887267 2879412 2870678 2860860 2850591 2840624 2831234 2822324 2813573 2804275 2793546 2781180
48321 2781180 2768110 2755687 2744578 2734479 2724777 2715302 2706490 2698868 2692449 2686801 2681672 2677150 2673137
48308 2673137 2669235 2665580 2663160 2662666 2663465 2664472 2665644 2667683 2670585 2673531 2676154 2678837 2681662 2684144
48294 2684144 2686188 2688334 2690674 2692421 2692903 2692103 2689890 2685629 2679106 2670983 2661682 2650483 2636353 2619138
48280 2619138 2599466 2578050 2555592 2532730 2509419 2484767 2458067 2429694 2400627 2371497 2342527
48269 2342527 2313912 2285829 2258431 2232106 2207224 2183350 2159352 2134725 2110185 2086482 2063381
48258 2063381 2040471 2018338 1998019 1979640 1962428 1945862 1930115 1915447 1901753 1888636 1875607
48247 1875607 1862367 1849202 1836816 1825426 1814372 1803024 1791663 1781058 1771517 1762813 1754692 1746972
48235 1746972 1739437 1732134 1725508 1719929 1715391 1711942 1709836 1708813 1707801 1705859 1702941 1699254 1694542 1688733
48221 1688733 1682597 1676822 1670945 1664214 1657101 1650775 1645303 1639601 1633241 1627108 1621864 1616810 1610780 1603415
48207 1603415 1594985 1585568 1575061 1563681 1551876 1539851 1527599 1515335 1503445 1491888 1479894 1466659
48195 1466659 1452422 1438577 1426364 1415590 1405088 1394297 1383768 1374052 1364991 1356572 1349626 1344849
48183 1344849 1341564 1338327 1334575 1330973 1328328 1326889 1326621 1327401 1328830 1330406 1331979 1333665 1335475 1337496
48169 1337496 1340244 1344200 1349018 1353778 1357993 1361763 1365018 1367396 1369090 1371098 1374259 1378399 1382681 1386477
48155 1386477 1389723 1392786 1396154 1399988 1403868 1407229 1410018 1412572 1414945 1416898 1418588 1420607 1423111 1425442
48141 1425442 1426991 1428032 1429216 1430615 1431685 1432090 1432144 1432510 1433753 1436169 1439664 1443632 1447175 1449759 1451714
48126 1451714 1453976 1457184 1461029 1464626 1467487 1469904 1472362 1474925 1477466 1480195 1483537 1487504 1491617 1495509
48112 1495509 1499307 1503216 1506950 1509832 1511473 1512222 1512837 1513718 1514532 1514602 1513647 1512046 1510484 1509497 1509312 1509945
48096 1509945 1511363 1513659 1517044 1521559 1526927 1532841 1539334 1546639 1554797 1563735 1573668 1585050 1598085
48083 1598085 1612616 1628494 1645753 1664481 1684814 1707012 1731195 1757197 1785127 1815936 1850955
48072 1850955 1891220 1937983 1993454 2059637 2136121 2219741 2305987 2388827 2458732 2503583 2514626
48061 2514626 2492155 2444731 2383333 2316831 2251555 2192146 2141264 2099155 2064419 2035293 2010345
48050 2010345 1988559 1969204 1951587 1934994 1918968 1903470 1888656 1874657 1861639 1849511 1837392
48039 1837392 1823988 1808960 1793387 1778452 1764249 1750325 1736596 1722976 1708828 1693806 1678783
48028 1678783 1664987 1652434 1640074 1627179 1613707 1599586 1584610 1568886 1552539 1535080 1515851
48017 1515851 1494890 1472582 1448823 1423577 1397941 1373341 1349688 1325564 1300434 1275491 1251937
48006 1251937 1229516 1207352 1185436 1164709 1146090 1129778 1115063 1100670 1085781 1070789 1056615
47995 1056615 1043454 1030873 1018949 1008290 998889 989958 981160 973027 965902 959409 953344 948145 943954
47982 943954 940089 936031 932219 929235 926879 924674 922793 921781 921718 922130 922445 922163 921015 919400 918257
47967 918257 918087 918377 918251 917315 915574 913071 909989 906699 903226 899058 893856 887930 881676 874999 867742
47952 867742 860236 852857 845400 837495 829443 822040 815633 809820 804075 798293 792745 787772 783564 780004
47938 780004 776738 773486 770216 766992 763929 761445 760262 760835 762820 765348 767801 770225 773005 776249
47924 776249 779566 782482 785069 787999 791933 797055 803188 809993 816900 823369 829627 836642 844844 853311
47910 853311 860824 867278 873189 878269 881588 883045 883557 883609 882648 880149 876339 871550 865725 858971 851807
47895 851807 844451 836592 828177 819695 811287 802427 792914 783374 774240 765112 755787 747118 740030 734340
47881 734340 729392 725291 722506 720677 718863 716829 715258 714724 715249 716851 719749 723844 728587 733589 739024
47866 739024 745263 752332 759802 767085 773923 780680 788031 796205 804777 813304 821792 830285 838403 845654
47852 845654 851942 857445 862222 866264 869618 872072 873028 872146 869921 867204 864382 861419 858423 855588 852627
47837 852627 848768 843405 836466 828223 819133 809819 800812 792218 783962 776355 770082 765432 761803 758254
47823 758254 754481 751068 748761 747726 747582 747929 748488 748890 748909 749076 750406 753084 755862 757415 757955 758805
47807 758805 760636 762908 764930 766614 768168 769841 772109 775291 778855 781893 784427 787362 790965 794400
47793 794400 797165 799978 803597 807692 811701 816001 821312 827496 833887 840428 847605 855513 863805 872383
47779 872383 881390 890568 899273 907094 914079 920505 926828 933606 940942 948191 954682 960485 966037 971266
47765 971266 975642 978884 981134 982648 983805 985154 986895 988390 988641 987117 983828 978979 973097 967086
47751 967086 961380 955236 947613 938706 929894 922052 914604 906487 897537 888612 880553 873286 865872 857534
47737 857534 848673 840666 834452 829534 824705 819515 814690 811258 809648 809497 809977 810464 811162 812923 816199
47722 816199 820473 825125 830539 837794 847384 858776 871254 884751 899809 916964 936136 956479
47710 956479 976981 997395 1018324 1040088 1061887 1082424 1101022 1117629 1132042 1143783 1152631 1158713
47698 1158713 1162047 1162427 1159766 1154258 1146299 1136519 1125648 1113949 1100951 1086174 1069912 1052927 1035650
47685 1035650 1018288 1001468 986063 972314 959651 947482 935763 924883 915469 908291 903748 901285
47673 901285 899766 898657 898567 900458 904596 910392 917077 924384 932719 942610 954015 966309 979061 992578
47659 992578 1007440 1023750 1041116 1059122 1077421 1095507 1112819 1129035 1144046 1157739 1170066
47648 1170066 1181172 1191174 1199883 1206980 1212294 1215777 1217427 1217376 1215715 1212104 1205992 1197474 1187398 1176287
47634 1176287 1163771 1149650 1134866 1120615 1106851 1092580 1077480 1062363 1048007 1034253 1020444
47623 1020444 1006229 991792 977620 964111 951187 938447 925956 914516 904759 896391 888889 882511
47611 882511 877785 874262 870722 866556 862039 857259 851768 845569 839563 834491 829998 825235 819909 814294
47597 814294 808525 802379 795664 788485 781034 773191 764449 754411 743425 732407 721838 711214 699771
47584 699771 687376 674360 660966 647642 635517 625719 618174 611772 605739 600238 595638 591913 588950
47571 588950 586837 585525 584715 584331 584746 586277 588732 591567 594215 596225 597395 597878 597947 597662 597023 596376
47555 596376 596208 596457 596326 594904 591831 587422 582382 577356 572590 568034 563760 559914 556146 551586 545765
47540 545765 539151 532418 525679 518854 512222 505931 499500 492600 485910 480304 475502 470500 465196 460572
47526 460572 457223 454569 451638 447918 443410 438550 434107 430474 427123 423422 419853 417541 416678 416373 416025
47511 416025 415801 415635 414889 413483 412411 412617 414042 416119 418548 421159 423730 426418 429803 434125 438925
47496 438925 443788 448936 454818 461484 468535 475236 480667 484352 486828 488952 490574 490710 489154 487055
47482 487055 485570 484673 483579 481555 478025 472777 466627 461126 456964 453236 448764 443589 438722 435005
47468 435005 432738 431801 431566 431124 430227 429658 430319 432265 434901 437624 439992 441904 443985 447235 451867 457056
47452 457056 462117 467208 472476 477378 481534 485507 489962 494649 499002 503180 507617 512014 515694 518689
47438 518689 521643 524872 528351 532341 537137 542283 546971 551227 555908 561406 567174 572763 578561 585092
47424 585092 592137 599099 605917 613078 620792 628570 635813 642527 649219 656159 663120 669919 676782 683795
47410 683795 690435 696187 701458 707082 713007 718227 722186 725492 728938 732529 735821 738567 740575 741505
47396 741505 741302 740299 738481 735165 729979 723591 716857 709699 701522 692363 682919 673715 664921 656813
47382 656813 649703 643436 637523 631731 626083 620472 614835 609597 605376 602158 599293 596404 593905 592460
47368 592460 592275 593117 594812 597527 601519 606617 612073 617124 621761 626738 632788 640014 647993 656074 663588
47353 663588 670276 676671 683570 690824 697153 701373 703320 703266 701071 696535 690104 682602 674422 665557 656202
47338 656202 646722 637008 626392 614365 601233 588082 576114 565765 556271 546338 535413 524130
47326 524130 513486 503992 495677 488318 481362 474114 466491 459206 452923 447645 443235 439923 437751 436067
47312 436067 434274 432721 432137 432420 432704 432551 432436 433043 434652 437190 440379 443660 446415 448437 450011 451471
47296 451471 452809 453710 453855 453220 452133 450950 449737 448467 447402 446831 446480 445715 444416 443075 441892 440495
47280 440495 438857 437690 437407 437337 436693 435862 436060 437941 441069 444571 447907 451230 455330 460860 467331 473310
47264 473310 478007 482130 486841 492441 498610 505270 512447 519857 527362 535414 544217 552955 560704 567755
47250 567755 575138 583061 590772 597782 604172 609727 613807 616330 618114 619905 621636 622831 623241 622887 621886
47235 621886 620391 618434 615825 612434 608423 603888 598576 592468 586386 581366 577494 573945 570126 566204
47221 566204 562472 558864 555329 552288 550386 549927 550655 552021 553755 556153 559582 563703 567734 571653 576582
47206 576582 583517 592153 601434 610766 620223 629999 640297 651300 662659 673404 683016 692129 701474
47193 701474 710534 718042 723361 726590 727717 726749 724441 721744 718456 713357 705794 696443 686536 677090
47179 677090 668843 662020 656003 649957 643931 638783 635038 632506 630998 630639 631423 633171 636041 640413 646206
47164 646206 652947 660581 669575 680158 692026 704794 718160 731761 745551 760265 776710 794589
47152 794589 812708 830346 847659 864717 880957 895755 908871 920314 930339 939526 948051 954935
47140 954935 958875 959843 959028 957218 954231 949929 944628 938240 930181 920666 911084 902540 894819 887322 880196
47125 880196 873832 867958 861946 855691 849613 844119 839421 835540 832263 829442 827397 826485 826235 825646 824612
47110 824612 824271 825715 829103 834235 840987 848626 855652 861158 865795 870698 876048 881295 886126 890334
47096 890334 893151 893698 891999 888847 884691 879243 872172 863638 854066 843742 832678 820686 807598
47083 807598 793606 779351 765532 752448 739910 727497 714985 702719 691482 681713 673045 664939
47071 664939 657578 651592 647001 643088 639340 635949 633379 631984 632051 633544 635758 637919 640205 643490 648023
47056 648023 653111 658184 663309 668478 673298 677721 682225 686952 691509 695940 700949 706726 712486 717732
47042 717732 722969 728532 733711 737892 741633 745555 748973 750887 751831 753412 756215 759354 762104 764926
47028 764926 768651 773564 779608 786787 794909 803277 811018 817721 823756 830045 837383 845768 854449 862666
47014 862666 870107 876723 882649 888533 895311 903164 911069 917897 923629 929083 934895 941387 949121 958767
47000 958767 970296 982698 994563 1004786 1012944 1019375 1024826 1029748 1033977 1037209 1039498 1041078 1041999
46987 1041999 1042220 1041858 1040993 1039458 1037077 1033918 1030131 1025777 1021024 1016315 1012143 1008822 1006542 1005266 1004573
46972 1004573 1003973 1003526 1003758 1004969 1007081 1010146 1014303 1019210 1024296 1029802 1036643 1044875 1053263 1060939 1068569
46957 1068569 1077140 1086410 1095560 1104704 1114601 1125228 1135677 1145364 1154397 1162695 1169628 1174750 1178343
46944 1178343 1181074 1183466 1185662 1187437 1188412 1188463 1187758 1186288 1183781 1180305 1176400 1172322 1167761 1162822 1158610
46929 1158610 1156048 1154597 1152945 1150711 1148671 1147580 1147532 1148295 1149513 1150658 1151485 1152535 1154579 1157725 1161638
46914 1161638 1166375 1172249 1178966 1185709 1192123 1198514 1205100 1211842 1219150 1227932 1238479 1249803 1260522
46901 1260522 1270188 1279484 1289257 1299606 1309801 1318902 1326312 1331719 1334783 1335240 1333284 1329307 1323276 1314976
46887 1314976 1305049 1294997 1285704 1276637 1267130 1257770 1249803 1243795 1239787 1238215 1239556 1243233 1248029 1253671
46873 1253671 1261146 1271279 1283723 1297456 1311626 1325718 1339500 1353000 1366175 1378584 1389771
46862 1389771 1399893 1409432 1418365 1426183 1432722 1438359 1443335 1447436 1450534 1453066 1455762 1459157 1463371 1468237
46848 1468237 1473713 1480229 1488302 1497597 1506928 1515622 1524404 1534349 1545459 1556988 1568677 1580745 1592921
46835 1592921 1604449 1614964 1624516 1632825 1639372 1644229 1647948 1650621 1651841 1651636 1650555 1648739 1645799 1641814
46821 1641814 1637567 1633478 1629043 1623753 1618029 1612926 1609367 1607734 1607626 1607895 1607671 1607607 1609531 1614609 1622378
46806 1622378 1631809 1642548 1654812 1668709 1684205 1701306 1719822 1739234 1759139 1779607 1800812
46795 1800812 1822536 1844095 1864569 1883117 1899445 1913910 1926780 1937458 1945041 1949580 1952118 1953289
46783 1953289 1952531 1948932 1942350 1933472 1923199 1912189 1900565 1887969 1874322 1860474 1847574 1835748
46771 1835748 1824090 1812053 1800027 1788353 1776625 1764467 1752348 1741045 1730750 1721182 1712173 1703690
46759 1703690 1695618 1687931 1680815 1674313 1668107 1661899 1655739 1649819 1644302 1639543 1636053 1634039 1633365 1634101
46745 1634101 1636623 1640948 1646452 1652576 1659357 1667046 1675673 1685315 1696360 1709132 1723476 1738864 1754597
46732 1754597 1769868 1784204 1797910 1811483 1824520 1835976 1845762 1855097 1864786 1874040 1881727 1887980
46720 1887980 1893652 1898803 1902829 1905759 1908316 1910747 1912594 1913784 1915166 1917721 1921758 1927063 1933334 1940322
46706 1940322 1947983 1956659 1966802 1978341 1990544 2002555 2013898 2024463 2034254 2043117 2050544 2055747
46694 2055747 2058094 2057412 2053730 2046943 2036985 2024082 2008478 1990016 1968420 1943975 1917597 1890185
46682 1890185 1862233 1834039 1805888 1777875 1749834 1721655 1693492 1665536 1637802 1610321 1583407
46671 1583407 1557565 1533197 1510565 1489868 1471019 1453304 1435660 1417642 1399922 1383446 1368252
46660 1368252 1353608 1339340 1326314 1315208 1305401 1295693 1285838 1276676 1268964 1262840 1258511 1256690 1257959
46647 1257959 1262121 1268461 1276421 1285870 1296981 1309956 1324590 1340114 1355768 1371452 1387409 1403320
46635 1403320 1418262 1431566 1443109 1452606 1459349 1463071 1464514 1464718 1464023 1462119 1458667 1453595 1447263 1440792
46621 1440792 1435866 1433661 1434083 1436394 1440349 1446396 1455030 1466432 1480587 1497354 1516417 1537356 1559693
46608 1559693 1582803 1606072 1629362 1652904 1676339 1698186 1716737 1731306 1742182 1749563 1753112 1752584
46596 1752584 1748274 1740597 1729613 1715302 1698158 1679122 1658893 1637510 1614785 1591031 1567125 1543859
46584 1543859 1521490 1500037 1479733 1460832 1443202 1426471 1410495 1395324 1380837 1366808 1353264
46573 1353264 1340355 1327835 1315145 1301956 1288293 1274222 1259884 1245794 1232504 1220005 1208019
46562 1208019 1196782 1186739 1177530 1168262 1159034 1151124 1145161 1140109 1134740 1129245 1124526 1120676 1117233
46549 1117233 1114432 1112983 1112768 1112808 1112533 1112289 1112605 1113795 1116281 1120407 1125690 1131136 1136582 1143009 1151060
46534 1151060 1159965 1168593 1177079 1186544 1197273 1207978 1217263 1225389 1234107 1244829 1257417 1270854 1284657
46521 1284657 1299191 1314775 1331077 1347502 1363818 1380258 1397297 1415457 1434982 1455592 1476844
46510 1476844 1498865 1522254 1547050 1572273 1596918 1621094 1645758 1671550 1698212 1724840 1750222
46499 1750222 1773187 1793297 1811240 1828081 1843958 1857831 1868590 1876111 1881155 1884494 1886377 1886723
46487 1886723 1885618 1883485 1880811 1877853 1874714 1871510 1868196 1864349 1859478 1853568 1847042 1840186 1832968 1825350
46473 1825350 1817242 1808107 1797164 1784262 1770096 1755313 1739825 1723110 1704665 1683897 1660261 1633949
46461 1633949 1605985 1577135 1547178 1515775 1483559 1451762 1421115 1391669 1363380 1336261 1310206
46450 1310206 1285256 1261894 1240608 1221485 1204728 1191174 1181558 1175489 1171846 1170096 1170538 1173443 1178697
46437 1178697 1186229 1196002 1207482 1219847 1232862 1246913 1261980 1277195 1291642 1305098 1317738 1329597
46425 1329597 1340585 1350638 1359567 1366959 1372377 1375470 1376066 1374611 1372387 1370588 1369083 1366737 1363269 1360095
46411 1360095 1358819 1359461 1360784 1362062 1363814 1366899 1371649 1378094 1386597 1397827 1412248 1429849 1450353
46398 1450353 1473462 1498863 1526198 1555242 1586083 1618962 1653912 1690764 1729478 1770192 1812704
46387 1812704 1856131 1899302 1941373 1981879 2020354 2056202 2088912 2118206 2143875 2165536 2182559
46376 2182559 2194251 2200340 2201280 2197885 2190539 2179048 2163338 2143969 2121806 2097575 2071976 2045760
46364 2045760 2019307 1992474 1965351 1938821 1913892 1890827 1869566 1850722 1835301 1823459 1814342
46353 1814342 1807379 1803076 1802279 1805267 1811961 1822631 1837864 1857974 1882791 1911933 1945118 1982298
46341 1982298 2023654 2069452 2119804 2174454 2232674 2293304 2355138 2417482 2480082 2542176 2601819
46330 2601819 2656584 2704971 2746769 2782093 2810533 2831337 2843897 2847795 2842727 2828780 2806635 2777247
46318 2777247 2741354 2699490 2652387 2601123 2546781 2490067 2431417 2371551 2311890 2254249 2200140
46307 2200140 2150358 2105087 2064089 2026887 1993255 1963717 1939183 1919883 1905081 1894099 1887154
46296 1887154 1884777 1886850 1892860 1902751 1916810 1934823 1956027 1979940 2006656 2036223 2068275 2102369
46284 2102369 2138194 2175305 2213108 2251278 2289777 2328366 2366471 2403616 2439589 2474037 2506368
46273 2506368 2536246 2563733 2588657 2610212 2627551 2640436 2648952 2652878 2651829 2645990 2636246 2623454
46261 2623454 2607926 2589758 2569507 2548187 2526532 2504485 2481657 2458209 2435032 2412982 2392273
46250 2392273 2372802 2354823 2338975 2325732 2315111 2306902 2300907 2296913 2294612 2293682 2293962 2295496 2298253
46237 2298253 2301662 2304642 2306532 2307942 2310073 2313044 2315477 2316028 2314645 2311917 2307826 2301921 2294183 2284805
46223 2284805 2273394 2259332 2242912 2225312 2207356 2189088 2170607 2152489 2134959 2117266 2098306
46212 2098306 2077664 2055982 2034710 2015495 1999157 1984971 1971329 1957378 1943664 1931189 1920388
46201 1920388 1911269 1903932 1898514 1894939 1893069 1892895 1894341 1897145 1901176 1906671 1913852 1922494 1932032 1942074
46187 1942074 1952715 1964490 1977981 1993290 2009838 2026870 2044099 2061649 2079510 2097372 2114994
46176 2114994 2132309 2149117 2165006 2179677 2193135 2205583 2217355 2228905 2240474 2251864 2262814
46165 2262814 2273477 2284181 2294877 2305281 2315447 2325696 2336100 2346549 2357149 2368005 2378786
46154 2378786 2389235 2399867 2411286 2422884 2433343 2442636 2452406 2463878 2476323 2488089 2498296 2506907
46142 2506907 2514078 2520266 2526318 2532505 2537892 2541446 2543423 2544940 2546554 2548027 2549123 2549807 2549848 2548971 2547293
46127 2547293 2544948 2541565 2536874 2531595 2526790 2522322 2516900 2509838 2501960 2494430 2487391 2480203 2472501 2464542
46113 2464542 2456849 2449878 2443761 2438079 2432124 2425693 2419417 2414049 2409621 2405562 2401447 2397323 2393385 2389618
46099 2389618 2385839 2381959 2378127 2374577 2371263 2367712 2363518 2359010 2355134 2352406 2350186 2347335 2343572 2339839
$$ [...]
##END NTUPLES=NMR SPECTRUM
##END=
