
##TITLE=AC1201_HPAAH12051_5946609_BgOmYPCmiq
##JCAMPDX= 6.0         $$ Bruker NMR JCAMP-DX V2.0
##DATA TYPE= NMR SPECTRUM
##DATA CLASS= NTUPLES
##ORIGIN= BRUKER
##OWNER= Administrator
$$ 1.72 TOPSPIN		Version 2.1
$$ 2012-04-11 00:25:05.875 -0500  Administrator@TOPSPIN
$$ Compression mode = diff/dup
##.OBSERVE FREQUENCY= 400.13188235
##.OBSERVE NUCLEUS= ^1H
##.ACQUISITION MODE= SIMULTANEOUS (DQD)
##.ACQUISITION SCHEME= undefined
##.AVERAGES= 8
##.DIGITISER RES= 22
##SPECTROMETER/DATA SYSTEM= spect
##.PULSE SEQUENCE= zg30
##.SOLVENT NAME= COFFEE_meoh
##.SHIFT REFERENCE= INTERNAL, COFFEE_meoh, 1, 14.98061
##AUDIT TRAIL= $$ (NUMBER, WHEN, WHO, WHERE, PROCESS, VERSION, WHAT)
$$ ##TITLE= Audit trail, TOPSPIN		Version 2.1
$$ ##JCAMPDX= 5.01
$$ ##ORIGIN= Bruker BioSpin GmbH
$$ ##OWNER= Administrator
$$ $$ C:\Bruker\TOPSPIN/data/COFFEE/nmr/AC1201_HPAAH12051_5946609_BgOmYPCmiq/10/pdata/1/auditp.txt
$$ ##AUDIT TRAIL=  $$ (NUMBER, WHEN, WHO, WHERE, PROCESS, VERSION, WHAT)
(   1,<2012-04-11 00:24:59.093 -0500>,<Administrator>,<TOPSPIN>,<go>,<TOPSPIN 2.1>,
      <created by zg
	started at 2012-04-11 00:23:52.343 -0500,
	POWCHK enabled, PULCHK disabled,
       configuration hash MD5:
       1A 1E CE 29 27 FD 77 03 67 4E F0 E3 C4 B2 CB 90
       data hash MD5: 64K
       17 8C DA 07 01 78 F7 46 50 85 22 0E BF 4A 5C AE>)
(   2,<2012-04-11 00:25:01.718 -0500>,<Administrator>,<TOPSPIN>,<proc1d>,<TOPSPIN 2.1>,
      <Start of raw data processing
       efp LB = 0 FT_mod = 6 PKNL = 1 PHC0 = 0 PHC1 = 0 SI = 32K 
       data hash MD5: 32K
       12 6F CC A6 DA 58 F0 D0 AB E2 AE 7F 50 D7 8F 02>)
(   3,<2012-04-11 00:25:02.140 -0500>,<Administrator>,<TOPSPIN>,<proc1d>,<TOPSPIN 2.1>,
      <pk PHC0 = 208.5699 PHC1 = 0 
       data hash MD5: 32K
       7F 5F FE 8F ED 0C 63 69 8E 2F 94 1F 45 5A E5 BD>)
(   4,<2012-04-11 00:25:02.265 -0500>,<Administrator>,<TOPSPIN>,<proc1d>,<TOPSPIN 2.1>,
      <abs ABSG = 1 
       data hash MD5: 32K
       6A C2 7C 50 3A FE 8B 2A 3A 46 91 58 61 D8 D9 0F>)
(   5,<2012-04-11 00:25:02.296 -0500>,<Administrator>,<TOPSPIN>,<proc1d>,<TOPSPIN 2.1>,
      <abs ABSG = 2 
       data hash MD5: 32K
       30 30 72 BC DC 0C 9D 7B 63 78 9A 1E 26 66 65 37>)
(   6,<2012-04-11 00:25:02.328 -0500>,<Administrator>,<TOPSPIN>,<proc1d>,<TOPSPIN 2.1>,
      <abs ABSG = 3 
       data hash MD5: 32K
       16 E1 BD CE C8 55 C9 B6 55 DB A8 F7 8F E4 B2 AA>)
(   7,<2012-04-11 00:25:02.359 -0500>,<Administrator>,<TOPSPIN>,<proc1d>,<TOPSPIN 2.1>,
      <abs ABSG = 4 
       data hash MD5: 32K
       C7 34 D5 74 C5 8D 9B C3 AC 3D 03 EE 0D 4D A4 56>)
(   8,<2012-04-11 00:25:02.375 -0500>,<Administrator>,<TOPSPIN>,<proc1d>,<TOPSPIN 2.1>,
      <abs ABSG = 5 
       data hash MD5: 32K
       73 01 51 0E 18 11 81 03 33 C8 F8 48 24 E6 C5 D4>)
$$ ##END=
$$ 
$$ $$ hash MD5
$$ $$ 19 42 C1 4C 9B 3E AB 9D FC 38 C5 C3 B8 5A CE F3
##$RELAX= 
##$RELAX= 
##$RELAX= 
##$RELAX= 
##$RELAX= 
##$RELAX= 
##$RELAX= 
$$ Bruker specific parameters
$$ --------------------------
$$ [...]
##$TP= (0..7)
150 150 150 150 150 150 150 150
##$TP07= 0
##$TPNAME0= <>
##$TPNAME1= <>
##$TPNAME2= <>
##$TPNAME3= <>
##$TPNAME4= <>
##$TPNAME5= <>
##$TPNAME6= <>
##$TPNAME7= <>
##$TPOAL= (0..7)
0.5 0.5 0.5 0.5 0.5 0.5 0.5 0.5
##$TPOFFS= (0..7)
0 0 0 0 0 0 0 0
##$TUNHIN= 0
##$TUNHOUT= 0
##$TUNXOUT= 0
##$USERA1= <user>
##$USERA2= <user>
##$USERA3= <user>
##$USERA4= <user>
##$USERA5= <user>
##$V9= 5
##$VALIST= <valist>
##$VCLIST= <CCCCCCCCCCCCCCC>
##$VD= 0
##$VDLIST= <DDDDDDDDDDDDDDD>
##$VPLIST= <PPPPPPPPPPPPPPP>
##$VTLIST= <TTTTTTTTTTTTTTT>
##$WBST= 1024
##$WBSW= 4
##$XGAIN= (0..3)
0 0 0 0
##$XL= 0
##$YL= 0
##$YMAX_a= 517659
##$YMIN_a= -650917
##$ZGOPTNS= <>
##$ZL1= 120
##$ZL2= 120
##$ZL3= 120
##$ZL4= 120
##$ABSF1= 14.98061
##$ABSF2= -5.57192
##$ABSG= 5
##$ABSL= 3
##$ALPHA= 0
##$AQORDER= 0
##$ASSFAC= 0
##$ASSFACI= 0
##$ASSFACX= 0
##$ASSWID= 0
##$AUNMP= <proc_prof1d_extract_pilot.lims>
##$AXLEFT= 0
##$AXNAME= <>
##$AXNUC= <1H>
##$AXRIGHT= 0
##$AXTYPE= 0
##$AXUNIT= <>
##$AZFE= 0.1
##$AZFW= 0.1
##$BCFW= 0
##$BC_mod= 0
##$BYTORDP= 0
##$COROFFS= 0
##$CY= 15
##$DATMOD= 1
##$DC= 0
##$DFILT= <>
##$DTYPP= 0
##$F1P= 0
##$F2P= 0
##$FCOR= 0.5
##$FTSIZE= 32768
##$FT_mod= 6
##$GAMMA= 0
##$GB= 0
##$INTBC= 1
##$INTSCL= 1
##$ISEN= 128
##$LB= 0
##$LEV0= 0
##$LPBIN= 0
##$MAXI= 10000
##$MC2= 0
##$MEAN= 0
##$ME_mod= 0
##$MI= 0
##$NCOEF= 0
##$NC_proc= -8
##$NLEV= 6
##$NOISF1= 0
##$NOISF2= 0
##$NSP= 0
##$NTH_PI= 0
##$NZP= 0
##$OFFSET= 14.98061
##$PC= 1
##$PHC0= 208.5699
##$PHC1= 0
##$PH_mod= 1
##$PKNL= yes
##$PPARMOD= 0
##$PPDIAG= 0
##$PPIPTYP= 0
##$PPMPNUM= 2147483647
##$PPRESOL= 1
##$PSCAL= 4
##$PSIGN= 0
##$PYNMP= <proc.py>
##$REVERSE= no
##$SF= 400.13
##$SI= 32768
##$SIGF1= 0
##$SIGF2= 0
##$SINO= 400
##$SIOLD= 32768
##$SPECTYP= <>
##$SREGLST= <1H.CDCl3>
##$SSB= 0
##$STSI= 32768
##$STSR= 0
##$SW_p= 8223.68421052632
##$SYMM= 0
##$S_DEV= 0
##$TDeff= 65536
##$TDoff= 0
##$TI= <>
##$TILT= no
##$TM1= 0
##$TM2= 0
##$TOPLEV= 0
##$USERP1= <user>
##$USERP2= <user>
##$USERP3= <user>
##$USERP4= <user>
##$USERP5= <user>
##$WDW= 1
##$XDIM= 32768
##$YMAX_p= 460052627
##$YMIN_p= -679295
##$CURPLOT= <Network HP LaserJet P1505>
##$CURPRIN= <$Network HP LaserJet P1505>
##$DFORMAT= <normdp>
##$LAYOUT= <+/1D_H.xwp>
##$LFORMAT= <normlp>
##$PFORMAT= <normpl>
##$SURQMSG= 1
$$ End of Bruker specific parameters
$$ ---------------------------------
##NTUPLES= NMR SPECTRUM
##VAR_NAME=  FREQUENCY,     SPECTRUM/REAL,   SPECTRUM/IMAG
##SYMBOL=    X,             R,               I
##VAR_TYPE=  INDEPENDENT,   DEPENDENT,       DEPENDENT
##VAR_FORM=  AFFN,          ASDF,            ASDF
##VAR_DIM=   32768,         32768,           32768
##UNITS=     HZ,            ARBITRARY UNITS, ARBITRARY UNITS
##FACTOR=    0.250966925370066, 1,           1
##FIRST=     8223.43324360095, -50004,       12605
##LAST=      0,             63817,           -179827
##MIN=       0,             -679295,         0
##MAX=       8223.43324360095, 460052627,    0
$$ Real data points
##PAGE= N=1
##DATA TABLE= (X++(R..R)), XYDATA
$$ [...]
19485a09344A04911A7686i5645C7101a11699d4948k22876J23161H4240a17747
$$ -109344 104911 17686 -95645 37101 -111699 -44948 -267824 -144663 84240 -117747
19474d1335B98429o6222j14176c49839a55110A2472f0308k05133J07899A18772
$$ -41335 298429 232207 118031 -349839 -155110 12472 -60308 -265441 -157542 118772
19463a05115J2062A1528b74928A37654D2560a71225B8465a15539g170F6224J8891
$$ -105115 -93053 11528 -274928 137654 42560 -171225 28465 -115539 -7170 66224 85115
19452H5115c02902h4510C4374a25337j107G182N635K3814b45644c9764F669K4656
$$ 85115 -302902 -84510 34374 -125337 -126444 7182 12817 36631 -245644 -39764 6669 31325
19440C1325a51355m4972A39738a17693j59876B7002f2619k5549A6105c43251a13643
$$ 31325 -151355 -196327 139738 -117693 -277569 27002 -62619 -88168 16105 -343251 -113643
19428c48343g1044C6807L14379f9031r9582O3171A15102a26943o0631f527j88210
$$ -348343 -71044 36807 351186 -69031 -168613 -105442 115102 -126943 -187574 -6527 -194737
19417a94737j26440a43782K2485K2377l1739k17109i5330b9883p5933G1605a32359
$$ -194737 -321177 -143782 -121297 -98920 -130659 -347768 -95330 -29883 -105816 71605 -132359
19405c29405G7608A3548g1686B10853b3272l69884a7324A4382B424a6407k36674
$$ -329405 77608 13548 -71686 210853 -23272 -393156 -17324 14382 2424 -16407 -253081
19394b53081i5814A69906b0042E6519L4709d20797a88090i2636B07897p7829K7406
$$ -253081 -95814 169906 -20042 56519 91228 -420797 -188090 -92636 207897 130068 157474
19383A57474r434b3283r599F0394I355a21259j11777A98232F1826k7376p72a07625
$$ 157474 148040 -23283 -32882 60394 9355 -121259 -233036 198232 61826 34450 33678 -107625
19370a57761j0782P0968I2418c78625I8050K4304d4882j92062k194j37979J50092
$$ -157761 -168543 -97575 92418 -378625 98050 122354 -44882 -236944 -239138 -377117 -227025
19359b27025c9500n6131k22634g527l1990p7035q6273d6311n14024a98132L7493
$$ -227025 -39500 -95631 -318265 -7527 -39517 -116552 -202825 -46311 -560335 -198132 -160639
19348a60639K7404A51361F0503L9800e712D36308a6278j98595e2415j9157k8205
$$ -160639 -133235 151361 60503 100303 -5712 436308 -16278 -214873 -52415 -71572 -99777
19337i9777e393p8400d1267A59143G0320A4825b40580L4534B4756a0947k41910
$$ -99777 -5393 -83793 -41267 159143 70320 14825 -240580 -206046 24756 -10947 -252857
19326b52857J17679m5666L9060B74332g4757j05154l2220J8609j03633e9080I3793
$$ -252857 -135178 -180844 -141784 274332 -74757 -179911 -212131 -193522 -297155 -59080 93793
19314b26946n8819a02399m9125e6638l32287B86104c91996R1474N4928G9495h8929
$$ -226946 -285765 -102399 -151524 -56638 -388925 286104 -391996 -300522 -245594 79495 -88929
19302H5027p626J47652b59257g0563J7622o6523j1449H7166i4655l1680I2313
$$ 85027 77401 225053 -259257 -70563 -52941 -119464 -130913 87166 -94655 -126335 92313
19290a64125c2141Q699j31876d8196A6935g0052p9854n8464d7293o32002A52186
$$ -164125 -32141 -23442 -155318 -48196 16935 -70052 -149906 -208370 -47293 -679295 152186
19278b5323j0396G0262c15532a37108A97446G0524a86516C6628d2466M922A55526
$$ -25323 -35719 70262 -315532 -137108 197446 70524 -186516 36628 -42466 -37544 155526
19266a33481L5768G4581J3445a2456A53174a39147A46446e4320j34784a9289A69568
$$ -133481 -97713 74581 88026 -12456 153174 -139147 146446 -54320 -189104 -19289 169568
19254a24766a2698A65247a0163C9173b91624o2150a09390j28671e3602n4635k85623
$$ -124766 -12698 165247 -10163 39173 -291624 -353774 -109390 -238061 -53602 -108237 -393860
19243c93860a4916G5269b96630G3179b0479k27175j85679a15233j73651f9200
$$ -393860 -14916 75269 -296630 73179 -20479 -247654 -433333 -115233 -288884 -69200
19232e6655j3500R155F3537B4589a9195k84249a41221R163j48666C8188h2910
$$ -56655 -70155 -61000 63537 24589 -19195 -303444 -141221 -132058 -280724 38188 -82910
19220b08189C88189a79158C11862a3437k3549q2359d0502P570l31836e1419D4930
$$ -208189 388189 -179158 311862 -13437 -36986 -119345 -40502 -32932 -364768 -51419 44930
19208C3108c60492O979A52048a24717k39568A18725b59038A5774i462H6616b62599
$$ 33108 -360492 -353513 152048 -124717 -364285 118725 -259038 15774 -9462 86616 -262599
19196G5509B8115a51928a7771A04108a78775C710J9183c22676f3431A8682b26789
$$ 75509 28115 -151928 -17771 104108 -178775 3710 22893 -322676 -63431 18682 -226789
19184h7433A68286F9491a64154c4293j12776b8620k68113f069p1283n2164A50554
$$ -87433 168286 69491 -164154 -34293 -147069 -28620 -296733 -6069 -77352 -129516 150554
19172A19487j3127N4750d64582B95310F2350c23877A25032B5184a2365A45513
$$ 119487 106360 161110 -464582 295310 62350 -323877 125032 25184 -12365 145513
19161E0331K95826a68838G1404h7560l0720G262a42838p9882a06187B27880A08664
$$ 50331 346157 -168838 71404 -87560 -118280 7262 -142838 -222720 -106187 227880 108664
19149i1721j66818j05324e3738l33454A542a85380A14841e5886l40605E9939m476
$$ -91721 -258539 -363863 -53738 -387192 1542 -185380 114841 -55886 -396491 59939 55463
19138E5463a96458i5567d258j42493p8927O749D8258c0293F6243B7946b40393
$$ 55463 -196458 -95567 -4258 -146751 -225678 -218929 48258 -30293 66243 27946 -240393
19126a49458o3714d2392K0612B1408b26348C5687c2758C4636h5685A64430H223
$$ -149458 -213172 -42392 -21780 21408 -226348 35687 -32758 34636 -85685 164430 8223
19114A75073G4262L0679a34971e7680K7009H6695h1553j50513A2478L34916a28168
$$ 175073 74262 104941 -134971 -57680 -30671 86695 -81553 -232066 12478 347394 -128168
19102b14405F9159a81506J0121K5848l653j24160j72726a14689k38989a17588
$$ -214405 69159 -181506 -171385 -145537 -149190 -273350 -446076 -114689 -353678 -117588
19091e6575k05663A14418M6786a99671g288r9391d5006o2431L9764k0843j62636
$$ -56575 -262238 114418 161204 -199671 -7288 -106679 -45006 -107437 -67673 -88516 -251152
19080b51152A56857L54b8250k91260n219c4827J3681k23307A21592b51210B9337
$$ -251152 156857 157211 -28250 -319510 -324729 -34827 -21146 -244453 121592 -251210 29337
19068C56371b17350F2048L0913A4572M3506a18257a0468l44519D06145b90691
$$ 356371 -217350 62048 92961 14572 58078 -118257 -10468 -354987 406145 -290691
19057a58397E6437K3570e1631c550j94797B19857h3485K4614p1572J195A36575
$$ -158397 56437 80007 -51631 -3550 -198347 219857 -83485 -58871 -130443 -129248 136575
19045G0308c11764B20182b83193L5554a04358B23552b02035l02322e0834j40084
$$ 70308 -311764 220182 -283193 -247639 -104358 223552 -202035 -504357 -50834 -190918
19035a90918P9208c2271k27987b6665j32985b8937j09777A28327f4923n2010n0437
$$ -190918 -111710 -32271 -260258 -26665 -159650 -28937 -138714 128327 -64923 -116933 -167370
19024a67370o2459g519B93731a11770F1239a35490B6791Q066N0466b01578a00434
$$ -167370 -229829 -7519 293731 -111770 61239 -135490 26791 34857 85323 -201578 -100434
19012a43992e29l15819a11508A9094b03205B36582b36388R4479j9720C2210c82307
$$ -143992 -529 -316348 -111508 19094 -203205 236582 -236388 -141909 -161629 32210 -382307
19000C0843a81442C7668d16636c8376r2322B82079j09526g3851j70112k57754
$$ 30843 -181442 37668 -416636 -38376 -130698 282079 172553 -73851 -243963 -501717
18990e01717d4525j99920f4825p8055e5281l11171J76290j46337C98460H0435
$$ -501717 -44525 -244445 -64825 -142880 -55281 -366452 -190162 -336499 398460 80435
18979a68659J3864K434g1740j72312B41454b78883g8057I7341b28688B40030b1892
$$ -168659 -154795 -152361 -71740 -244052 241454 -278883 -78057 97341 -228688 240030 -21892
18967A17180c4268k26846J26671d4813A61712a06290d7905A45309N4231M16778
$$ 117180 -34268 -261114 -134443 -44813 161712 -106290 -47905 145309 199540 616318
18957F16318j34960A21556P0924J86917Q0756j81435f6436k2560K2956A59299
$$ 616318 481358 121556 192480 379397 460153 278718 -66436 -88996 -66040 159299
18946B98822b51522A58579f8979A51057N9387C4169d059A31967J40549a83011
$$ 298822 -251522 158579 -68979 151057 210444 34169 -4059 131967 272516 -183011
18935F6963b0503b855F5594k8889a95267j1432M788D5060b91473B0468c6725e760
$$ 66963 -20503 -2855 65594 36705 -195267 -206699 -201911 45060 -291473 20468 -36725 -5760
18922d9817n7982B1361P4613L5992j4000j7535J45860a06232H619h0120J7907
$$ -49817 -107799 21361 95974 131966 117966 100431 246291 -106232 8619 -80120 -62213
18911f2213B81218b91451L2867A25396b43599h9828L6364B40216b33024B38594
$$ -62213 281218 -291451 -258584 125396 -243599 -89828 -53464 240216 -233024 238594
18900e5891D1445a29990A19378K660K20776M7104J46958H3199N8358N9993J55645
$$ -55891 41445 -129990 119378 122038 342814 389918 536876 83199 141557 201550 357195
18889C57195G2604e3194A42633a39725m3899B9227k881K50264A31131J92419j44474
$$ 357195 72604 -53194 142633 -139725 -183624 29227 26346 276610 131131 323550 179076
18878A79076J3667i0117H4219c50021F3329a03051B8898a11456M8812B58440C7240
$$ 179076 192743 -90117 84219 -350021 63329 -103051 28898 -111456 -62644 258440 37240
18866A54382a24815e541k20447a6050j61599E2673a18381R427j08329C8336i5331
$$ 154382 -124815 -5541 -225988 -16050 -177649 52673 -118381 -108954 -217283 38336 -95331
18854b2221q5534p4049o3062B11348b00773r5225d7637B41412e2847j5330j680
$$ -22221 -107755 -181804 -244866 211348 -200773 -295998 -47637 241412 -52847 -68177 -69857
18843f9857p6062c8665k39954m9241g9891b6308D867K46341a46631A07046a4270
$$ -69857 -145919 -38665 -278619 -327860 -79891 -26308 4867 251208 -146631 107046 -14270
18831g2350C37636g1542J587j67714a09370c6706j62550i0553q8306j29278h6685
$$ -72350 337636 -71542 -69955 -237669 -109370 -36706 -199256 -90553 -178859 -308137 -86685
18819A26213b9621B3997g9186k454A78076K51151D883J55717A9739a00133M276
$$ 126213 -29621 23997 -79186 -81640 178076 429227 4883 160600 19739 -100133 -95857
18808i5857A17785O8618b2299k70170D1191a65276A517K8720a17220m5551b7934
$$ -95857 117785 186403 -22299 -292469 41191 -165276 1517 30237 -117220 -162771 -27934
18796d3055A13288l685K9692a37193A57801m0677f565j28376q9507A99149e1122
$$ -43055 113288 109603 139295 -137193 157801 117124 -6565 -134941 -224448 199149 -51122
18784b50794B8117K84242a708j80804f1978j34787P6077p9132h2058K6255h769
$$ -250794 28117 312359 -1708 -182512 -61978 -196765 -120688 -199820 -82058 -55803 -8769
18772i8541A16753a09426l8226n0135B45250p6267C8387K78126j31215o2417a12583
$$ -98541 116753 -109426 -147652 -197787 245250 168983 38387 316513 185298 122881 -112583
18760h1800G7058c1271l29802a55985f0328m049B5965b55068d4529D55837b48888
$$ -81800 77058 -31271 -361073 -155985 -60328 -64377 25965 -255068 -44529 455837 -248888
18748e4708G1707d4687o5219j06383M3431b102l2206m251j31722o2142A2238i9463
$$ -54708 71707 -44687 -109906 -216289 -172858 -2102 -34308 -38559 -170281 -232423 12238 -99463
18735g0063A38254c81824C16211A05340a78995p1975h0603j58912P834C4440L3210
$$ -70063 138254 -381824 316211 105340 -178995 -250970 -80603 -239515 -231681 34440 67650
18724F7650b88733C8222b13551E0520B1662J5627d20572i3942E275Q6655K7817
$$ 67650 -288733 38222 -213551 50520 21662 37289 -420572 -93942 5275 91930 119747
18713A19747N8726a73174E6350i7170J0878H1909J35850b8877l54254B81648h3448
$$ 119747 178473 -173174 56350 -97170 -86292 81909 217759 -28877 -383131 281648 -83448
18701A2906a08080A03209b97538e6934A33633g925j87209P4323E8109R4902a62135
$$ 12906 -108080 103209 -297538 -56934 133633 -7925 -195134 -120811 58109 153011 -162135
18689A42055D3224J151a96704c4769m34113h6398k68767B2304a4973A60306G6924
$$ 142055 43224 44375 -196704 -34769 -468882 -86398 -355165 22304 -14973 160306 76924
18677b84891J04744B2737a71093l8543j13748i6697P976l476B06026b8341C1891
$$ -284891 -180147 22737 -171093 -209636 -323384 -96697 -88721 -92197 206026 -28341 31891
18665a45706A26863O6300I3088a27087D5189O2577g3073M433A82548a06403D2620
$$ -145706 126863 193163 93088 -127087 45189 107766 -73073 -68640 182548 -106403 42620
18653b80029J13954A62600a01076j29524I438b259A28835f7393B60003b26739
$$ -280029 -166075 162600 -101076 -230600 9438 -2259 128835 -67393 260003 -226739
18642a11979M9720l4223j43130C04913A46430a34874j37169a7563E9280b56921
$$ -111979 -62259 -96482 -239612 304913 146430 -134874 -272043 -17563 59280 -256921
18631a74428D0744Q4494E5888g1799A3636c02945G7171J391g3562p8160n2142
$$ -174428 40744 125238 55888 -71799 13636 -302945 77171 78562 -73562 -151722 -203864
18620b03864K125A51051c62839o8445O3699L7106H9681b50224D273A765N2214
$$ -203864 -201739 151051 -362839 -431284 -367585 -330479 89681 -250224 4273 1765 53979
18609E3979M4233b90393a40067R400d4900A7756b79806j664C152a96840C4646
$$ 53979 98212 -290393 -140067 -130667 -44900 17756 -279806 -281470 3152 -196840 34646
18597B09230b56919K8192a03168d6852F7642a74914D5634L10427A01362B4082
$$ 209230 -256919 -228727 -103168 -46852 67642 -174914 45634 356061 101362 24082
18586b8716B70283e9844k0791q9495g9790d81j84541j28763G5618l6780a07381
$$ -28716 270283 -59844 -80635 -170130 -79790 -481 -185022 -313785 75618 38838 -107381
18574h0696k0414A64514d91472A77466b3668k87753C6859b9888C0517K4932a39836
$$ -80696 -101110 164514 -491472 177466 -23668 -311421 36859 -29888 30517 55449 -139836
18562a32380E669a5558l16158p7157B7111a70337a1638A808a70078M2506d2272
$$ -132380 5669 -15558 -331716 -408873 27111 -170337 -11638 1808 -170078 -127572 -42272
18550A44486a20876B28407k4869a01627C9764L6934a09774j44041K3996f1805
$$ 144486 -120876 228407 203538 -101627 39764 76698 -109774 -253815 -229819 -61805
18539c43826i4016A08324a18576B90969l5767A2934K1306M832b676E6742g7896
$$ -343826 -94016 108324 -118576 290969 255202 12934 34240 39072 -2676 56742 -77896
18527A7330M2873a92809A5197M6636K5074g6761L2626C56799M0601c25916B26831
$$ 17330 60203 -192809 15197 61833 86907 -76761 -44135 356799 397400 -325916 226831
18515c8604j76156L3156j40955n3764A7887P7905g8898F3131a53569G9755R5502
$$ -38604 -214760 -181604 -322559 -376323 17887 95792 -78898 63131 -153569 79755 175257
18504A75257E966b02807A08140j5884b1465j74130M9691D2850f6103k87875i0826
$$ 175257 5966 -202807 108140 92256 -21465 -195595 -145904 42850 -66103 -353978 -90826
18492A12374c7301A39021g8552J7022A09734b15161N6242K9389E4030a32010J6735
$$ 112374 -37301 139021 -78552 -61530 109734 -215161 -158919 -129530 54030 -132010 -115275
18481a15275p3955c7134k48769b9795j35660Q030g1056j93211e6491j85799b0687
$$ -115275 -189230 -37134 -285903 -29795 -165455 -157425 -71056 -264267 -56491 -242290 -20687
18469F2837b79421C3017K09207p7921o5109g443A80741o2970c1241P009j40544
$$ 62837 -279421 33017 242224 164303 99194 -7443 180741 117771 -31241 -24232 -164776
18458a64776B30007H952b74414B19873a71422q3354d2389o1708B0511J28194c2554
$$ -164776 230007 8952 -274414 219873 -171422 -254776 -42389 -104097 20511 148705 -32554
18446A10062m0002L9943l5999k1882L2327b8014k95582I6264b43788F3585k1370
$$ 110062 70060 110003 74004 52122 84449 -28014 -323596 96264 -243788 63585 42215
18435D2215a25123j21472J12627A26935R7185b6140I2732d7560a1801C38520E6788
$$ 42215 -125123 -246595 -133968 126935 224120 -26140 92732 -47560 -11801 338520 56788
18423a2677A287c03669G4844a25913A9844J73265J3551a27498j38684A8122c18414
$$ -12677 1287 -303669 74844 -125913 19844 193109 206660 -127498 -266182 18122 -318414
18411c4731A29158P6220C2898a48833A09169a03365e906A37259b18198g2775A89518
$$ -34731 129158 205378 32898 -148833 109169 -103365 -5906 137259 -218198 -72775 189518
18399A24204a60156M0509j39557A26353c30097A74644h3536A29619b06900B12309
$$ 124204 -160156 -119647 -259204 126353 -330097 174644 -83536 129619 -206900 212309
18388f1114j11455B20284i9350c878B9984K9658L3393a74077H8376d2172A06446
$$ -61114 -172569 220284 -99350 -3878 29984 59642 93035 -174077 88376 -42172 106446
18376b6503C5848Q6396a59138I4791K0151b40294f2076j65766g9056e968E6930
$$ -26503 35848 122244 -159138 94791 114942 -240294 -62076 -227842 -79056 -5968 56930
18364b9326q8348j5685b4555n1213I3621A8961b04308k23182A57883a84623A45789
$$ -29326 -117674 -133359 -24555 -75768 93621 18961 -204308 -427490 157883 -184623 145789
18352A43622a95417A52665E1808K35043p3391m3670A1340h5757A20742i509n8783
$$ 143622 -195417 152665 51808 286851 213460 169790 11340 -85757 120742 -9509 -68292
18341f8292B4199J42470k6095H80P2676J29711a42902P0239K8551l08891A91607
$$ -68292 24199 166669 140574 880 73556 203267 -142902 -72663 -44112 -353003 191607
18329a15561a2661j85757N0699A70145o3089a4157C02009A7466d73363C2480a65833
$$ -115561 -12661 -198418 -147719 170145 107056 -14157 302009 17466 -473363 32480 -165833
18317A35395a54751A13482K29596B1400a60098D4938L9772Q5319c07431a39529
$$ 135395 -154751 113482 343078 21400 -160098 44938 84710 170029 -307431 -139529
18306A42888d53087C8881c94550A52108g7838j70227h6977C2933a78152D819d8614
$$ 142888 -453087 38881 -394550 152108 -77838 -248065 -86977 32933 -178152 4819 -48614
18294a70843C04053H689L4864o726J86191d11062B18543F669J92831a2647E4596
$$ -170843 304053 8689 43553 36827 223018 -411062 218543 6669 199500 -12647 54596
18282a50265A49072b94397A79651d8729A4014b59153G2195B4977b64877f1989
$$ -150265 149072 -294397 179651 -48729 14014 -259153 72195 24977 -264877 -61989
18271C7604N3126a12367A33179B0237b93695l33P3279b0399j70697l4275d4546
$$ 37604 90730 -112367 133179 20237 -293695 -294028 -220749 -20399 -191096 -225371 -44546
18259A96604R921g0409G0000j5259P3104K69813j52982a43862j07143A85682B954
$$ 196604 206525 -70409 70000 54741 127845 397658 244676 -143862 -251005 185682 2954
18247C6015f5537B87534a35832g240c74j10492j71511A80701b29726D4444a44171
$$ 36015 -65537 287534 -135832 -7240 -374 -110866 -282377 180701 -229726 44444 -144171
18235c24762M6406c7167B1906R3495a72227K6528B98916b34968a2239E7658f2701
$$ -324762 -278356 -37167 21906 115401 -172227 -145699 298916 -234968 -12239 57658 -62701
18223D3678N6477b5190D5597g2437k0169m3293J4070I922K55454a57250r0370
$$ 43678 100155 -25190 45597 -72437 -92606 -135899 -121829 9922 265376 -157250 -247620
18212b47620B14106d532A77386O2179b1905j85792o4241H0984b21942j06050G912
$$ -247620 214106 -4532 177386 239565 -21905 -207697 -271938 80984 -221942 -327992 7912
18200g7239A83003b13103h598G332L0709M3240R3815L4942a46923o5083e5175
$$ -77239 183003 -213103 -8598 7332 38041 81281 175096 210038 -146923 -212006 -55175
18188b67255J05201n0572f4025a4188j10837j05769A50566o8759A3250a23413
$$ -267255 -162054 -212626 -64025 -14188 -125025 -230794 150566 81807 13250 -123413
18177A80756F4208Q7409a05632E1896b2348l26028A07810a99131B39462E5662
$$ 180756 64208 151617 -105632 51896 -22348 -348376 107810 -199131 239462 55662
18166a91201d5363B5045M9885O4107A7694M4139A2585P53a02550B3173K32507
$$ -191201 -45363 25045 74930 139037 17694 61833 12585 13338 -102550 23173 255680
18155B55680A12770c5501A37433i4928k18354a20478c4226J5894E0126g2611k0378
$$ 255680 112770 -35501 137433 -94928 -313282 -120478 -34226 -18332 50126 -72611 -92989
18144i2989O054l68117b3446j34965E0447J40276a95490h5178A49248L32523a51973
$$ -92989 -86935 -455052 -23446 -158411 50447 190723 -195490 -85178 149248 481771 -151973
18132B86611c49635A35765p713b1759j6607n0360r0791E5849a73858O4552A55642
$$ 286611 -349635 135765 128052 -21759 -38366 -88726 -179517 55849 -173858 -109306 155642
18120D642d8917j94291e2205B28006b2583C81675I0298a31324b0729A6650a34191
$$ 4642 -48917 -243208 -52205 228006 -22583 381675 90298 -131324 -20729 16650 -134191
18108i4996a6053j31731A0160f6705r5510f7075B44760A10303b4010J1416r2697
$$ -94996 -16053 -147784 10160 -66705 -162215 -67075 244760 110303 -24010 -12594 -105291
18097a05291A38967J43333e0055A26400f5362H8887k6468K1104a31475j2386B08480
$$ -105291 138967 282300 -50055 126400 -65362 88887 62419 83523 -131475 -143861 208480
18085b61432c1178C51471I5541b62098B46220a19204j23487A25104c3477k08498
$$ -261432 -31178 351471 95541 -262098 246220 -119204 -242691 125104 -33477 -241975
18075b41975B35166J19550j30210a27881E687b07447A14823a2759n3389L16C63371
$$ -241975 235166 354716 224506 -127881 5687 -207447 114823 -12759 -66148 -65832 363371
18063c12046A29501O1026H1506O4176J2507b42728J18423n9841j06760C31546
$$ -312046 129501 190527 81506 145682 158189 -242728 -124305 -184146 -290906 331546
18052D52d38976i0072B47730A10526N0436j9529a92022A09704a20014C4210Q7736
$$ 452 -438976 -90072 247730 110526 160962 141433 -192022 109704 -120014 34210 121946
18041A21946a53615d4954H2853B0713R4061J51372E8267b30621B10511p9081e0636
$$ 121946 -153615 -44954 82853 20713 114774 266146 58267 -230621 210511 131430 -50636
18029A70564L5101a62787L7549j24334a05025B0787K4956R9230a19407d1418F965
$$ 170564 205665 -162787 -125238 -249572 -105025 20787 45743 144973 -119407 -41418 6965
18017a95215L3920A20997J19195E6239N06431a27330C11158a16728C53668a20536
$$ -195215 -161295 120997 240192 56239 562670 -127330 311158 -116728 353668 -120536
18006B08932a29698C51198a51887J9983D7808K42952r2875a34188G6711A0856
$$ 208932 -129698 351198 -151887 -131904 47808 290760 197885 -134188 76711 10856
17995G7981a24868C60570b12190A32267K80341g1898E5066M2420J41793a24899
$$ 77981 -124868 360570 -212190 132267 412608 -71898 55066 97486 239279 -124899
17984f032F7514J80531c4221j11951A9224a14743J3058l5666j25098P43I5201
$$ -6032 67514 248045 -34221 -146172 19224 -114743 -101685 -137351 -262449 -261706 95201
17972H7961R7354e5244B51105b37620A82743e9961A51563J04272b57785a4117
$$ 87961 185315 -55244 251105 -237620 182743 -59961 151563 255835 -257785 -14117
17961D36998a01682k7446b2201j31940A64096a08650j1769D73093h4583A44095
$$ 436998 -101682 -129128 -22201 -154141 164096 -108650 -120419 473093 -84583 144095
17950I6038C3949a02590J2295k7829I5106O7083L817a84179k5422H4880r580j4989
$$ 96038 33949 -102590 -90295 -118124 95106 162189 166006 -184179 -209601 84880 75300 60311
17938F0311k9717a51217A7449L520b9720n6927G1653a67247E9988d5964j52768
$$ 60311 30594 -151217 17449 20969 -29720 -86647 71653 -167247 59988 -45964 -198732
17927a98732C77671a5385B60758e4690B2530R9758l8639h6598A00049K5388k9674
$$ -198732 377671 -15385 260758 -54690 22530 122288 83649 -86598 100049 125437 95763
17916I5763a2061K227G6209P2861J22682a36460B8994c26475g7629B4148a27530
$$ 95763 -12061 -9834 76209 149070 271752 -136460 28994 -326475 -77629 24148 -127530
17904A06602d7280a4005j48185E4806c726F8405i1149I5989J57473m0757D3971
$$ 106602 -47280 -14005 -162190 54806 -3726 68405 -91149 95989 253462 212705 43971
17892c91619J16224A978J576K76974F8240O4719e3706p7571D2337e7158k23063
$$ -391619 -275395 1978 3554 280528 68240 132959 -53706 -131277 42337 -57158 -280221
17881b80221B29122f9277I6539J43178D1990R4252B9423J00805J2122L44700A22694
$$ -280221 229122 -69277 96539 239717 41990 136242 29423 130228 142350 487050 122694
17869d2423B43818A05470h9156B18698J4404a49941A36272a49893j30702d876
$$ -42423 243818 105470 -89156 218698 233102 -149941 136272 -149893 -280595 -4876
17858A13121n3598d9427J2890G3468a13523b4816B13162d8566k06648J390B15366
$$ 113121 59523 -49427 -36537 73468 -113523 -24816 213162 -48566 -255214 -253824 215366
17846G5545K64943a26881c042E8606e1776A43243a07589B65653I7957J86930d3200
$$ 75545 340488 -126881 -3042 58606 -51776 143243 -107589 265653 97957 284887 -43200
17834d373C52066e9863A87449f9654B57642M2854p9335a23978A27961a84525f824
$$ -4373 352066 -59863 187449 -69654 257642 300496 221161 -123978 127961 -184525 -6824
17822c6300h499k57284C72189A7076J26669R6126c9496A13025M8957f5571j20164
$$ -36300 -8499 -265783 372189 17076 143745 239871 -39496 113025 161982 -65571 -185735
17811a85735A75875i0589J9874C19531I1645L4354O1399J62730k9539i2318j3046
$$ -185735 175875 -90589 -70715 319531 91645 125999 187398 350128 320589 -92318 -105364
17800a05364L2683C63664A44950J22509j9908E5924a14737b7036A37344Q3675
$$ -105364 -72681 363664 144950 267459 247551 55924 -114737 -27036 137344 221019
17790B21019a54282F8730h9646J2308D5642a02696l0591f4550D24048j80519G5575
$$ 221019 -154282 68730 -89646 -77338 45642 -102696 -133287 -64550 424048 243529 75575
17778H5648K7415g8447B06446f3706D2664f3847C6276l827a33025A99307B5323
$$ 85648 113063 -78447 206446 -63706 42664 -63847 36276 32449 -133025 199307 25323
17766B59188c0862l3859A31306J26251H5905P5245B4487Q4884a38580c1965C66576
$$ 259188 -30862 -64721 131306 257557 85905 161150 24487 109371 -138580 -31965 366576
17754I5265J82627C3592J54347a24542A44702J63991E7189M28782a02803M8959
$$ 95265 277892 33592 187939 -124542 144702 308693 57189 485971 -102803 -53844
17744e3844A53941J56466d0950n4177I4035R7297O3775m3143k2212a16075H06
$$ -53844 153941 310407 -40950 -95127 94035 191332 255107 211964 189752 -116075 806
17732a53314j26120J29543L0615j7942p1914A09978a225F6368J38400c65301a30204
$$ -153314 -279434 -149891 -119276 -137218 -209132 109978 -1225 66368 204768 -365301 -130204
17720d1414b0436B18019N6958A34094J39330O7929a07446D7937b4825A30249a76627
$$ -41414 -20436 218019 274977 134094 273424 341353 -107446 47937 -24825 130249 -176627
17708a4032c787p4818A70266a1708j44171N3999C6810P0893E94K64628d0318F6799
$$ -14032 -3787 -78605 170266 -11708 -155879 -101880 36810 107703 594 265222 -40318 66799
17695e5639B6798L78308A04611b07284A43170j6328K42327j27302h4977C52588
$$ -55639 26798 405106 104611 -207284 143170 126842 369169 241867 -84977 352588
17684a81256j07867J28356D62522e7311C2234K19461k6045p4137a08342j76903
$$ -181256 -289123 -160767 462522 -57311 32234 251695 225650 151513 -108342 -285245
17674b85245C08268A4737R8149q133O3401b8895a2694j35165G5381K29170A11540
$$ -285245 308268 14737 112886 104753 168154 -28895 -12694 -147859 75381 304551 111540
17662A78031g1636o710b6998C20251j54819A1397K55673r5962L9034o0620J17943
$$ 178031 -71636 -78346 -26998 320251 165432 11397 267070 171108 210142 149522 267465
17651B67465I7567b5841C4221a20091B78218j16707G0502a98451e2752B25512
$$ 267465 97567 -25841 34221 -120091 278218 161511 70502 -198451 -52752 225512
17640B28880A07118a0661A32766Q118L1422M0720p125r0365j5797N1460a57594
$$ 228880 107118 -10661 132766 140884 172306 213026 205901 115536 99739 151199 -157594
17628D00953A60557J80523A27185l9664l5263a87134C14305A02979c255l4302
$$ 400953 160557 341080 127185 87521 52258 -187134 314305 102979 -3255 -37557
17618c7557A73043l5499b05429C85094A80948n1318E6887A2362R2982o726K01341
$$ -37557 173043 137544 -205429 385094 180948 129630 56887 12362 105344 98618 299959
17607B99959a72976A87605J42333a74791A77656j9893F8788a2617A36919K07932
$$ 299959 -172976 187605 329938 -174791 177656 157763 68788 -12617 136919 344851
17597C44851j10235D822K04670o6654F770L23445a32872H8955K68262c4525C51941
$$ 344851 234616 4822 209492 142838 6770 330215 -132872 88955 357217 -34525 351941
17585C46798A59049p8374f2137C30490K69383A16322J19009l9636P211a06318
$$ 346798 159049 80675 -62137 330490 599873 116322 235331 195695 202906 -106318
17574a13475A18828b61698F5917e5040B9181L10242j24467E2673L15003j00087
$$ -113475 118828 -261698 65917 -55040 29181 339423 214956 52673 367676 267589
17564B67589p7625K36254F7467R7718a22259A0262g4811e219B29431K06698a41658
$$ 267589 189964 426218 67467 165185 -122259 10262 -74811 -5219 229431 436129 -141658
17552E188i555k39554B79136B8231M5609J956L56120l7027F7185K85619j62708
$$ 5188 -9555 -249109 279136 28231 73840 75796 431916 394889 67185 352804 190096
17541A90096D9102a9487H6450L75887A66978L59040C2515O4124J52973k5078p8087
$$ 190096 49102 -19487 86450 462337 166978 526018 32515 96639 249612 224534 146447
17530A46447L2544i9722C38409c58095A69160J87943L9478A40858c262B38627
$$ 146447 178991 -99722 338409 -358095 169160 357103 396581 140858 -3262 238627
17519A68586P7752L1945J23113D1566K85881O4902Q7928J57601k48737K48539
$$ 168586 246338 278283 401396 41566 327447 392349 480277 637878 389141 637680
17509F37680J41128p7192J54756C27012K02757k25937J55644n8895j03848j08870
$$ 637680 778808 701616 856372 327012 529769 303832 459476 400581 296733 187863
17499A87863L13705J00211L24240J72654m96009L09153L4517k11099j43478k11087
$$ 187863 501568 601779 926019 1098673 602664 911817 946334 735235 591757 380670
17489C80670K15021k69665I5117K28900j00403q8117L4476j8692K04896q0628
$$ 380670 595691 326026 95117 324017 223614 135497 169973 151281 356177 275549
17479B75549H0872J71627o5591K36338A61513P7678g0446C51738A53694G5447
$$ 275549 80872 252499 186908 423246 161513 239191 -70446 351738 153694 75447
17468C83245K5464h4033A58350L66055p2194k06194J53213K1396p6212j18721
$$ 383245 408709 -84033 158350 524405 452211 246017 399230 420626 344414 225693
17458B25693N6644j5935R3943r1291r0348n6417K09550j2164J4394o4529I5023
$$ 225693 282337 266402 360345 269054 178706 122289 331839 319675 334069 269540 95023
17446e7280F8263L97971j40410H6486M75766A26717K42465I0125L32588B10957
$$ -57280 68263 466234 325824 86486 562252 126717 369182 90125 422713 210957
17435C68075A02528O1142R3078J82936J02272j48912A96296J75536L7659j40637
$$ 368075 102528 163670 256748 439684 541956 393044 196296 371832 409491 268854
17425B68854L4056K4990J81449p3061L9958k03765j23527K18204B8679J65281
$$ 268854 302910 327900 509349 436288 476246 272481 148954 367158 28679 193960
17415A93960P795o2406J47541J75368J07110k66542J56198j94843a07891C34401
$$ 193960 201755 139349 286890 462258 569368 302826 459024 264181 -107891 334401
17404C47952j2757k6000J50247B28839o2125N1151f7657E43913B22951J3879P7930
$$ 347952 335195 309195 459442 228839 166714 217865 -67657 543913 222951 236830 314760
17393C14760K04665j75227A19444Q0118J81512A59357R0048O4657l9762j5304
$$ 314760 519425 344198 119444 199562 381074 159357 249405 314062 274300 258996
17383B58996J35704l3018J7192A87405J11795N66J45945E6528q630K3763J25302
$$ 258996 394700 361682 378874 187405 299200 299766 445711 56528 47898 71661 196963
17372A96963K94174j40863I8984l9533M2167Q504K94368e9882D3466P4790K38862
$$ 196963 491137 350274 98984 59451 101618 110122 404490 -59882 43466 118256 357118
17361C57118L9630A5598L22351q0837J70915A53755L97584j05025m5052o8102
$$ 357118 396748 15598 337949 257112 428027 153755 551339 446314 401262 333160
17351C33160n2347J12705N1253G6872N5787L07457A43314J85228n6503F4832J13172
$$ 333160 280813 393518 444771 76872 132659 440116 143314 328542 272039 64832 178004
17340A78004K99772j42272A17581q719J59825j25933L46315k18715J62246I1978
$$ 178004 477776 335504 117581 108862 268687 142754 489069 270354 432600 91978
17329A23999a396C56193j42707a74066B08620p8600C7134L11259m0425O3047j59799
$$ 123999 -1396 356193 213486 -174066 208620 130020 37134 348393 307968 371015 211216
17318B11216C4601O02287j5021k88795h2547B52939M9385j31019k5203N273K39728
$$ 211216 34601 636888 621867 333072 -82547 252939 302324 171305 146102 151375 391103
17307C91103k8164j36954K34263k26221F8693M66142H4355L88043A79541J42046
$$ 391103 362939 225985 460248 234027 68693 534835 84355 472398 179541 321587
17297C21587j53669J44770q0778J26736A20486O8025L3188n4566J35032r080L88549
$$ 321587 167918 312688 231910 358646 120486 188511 221699 167133 302165 293085 681634
17286F81634l04232A58137h129B03585L55412k68514J33844J12850j02358j5945
$$ 681634 377402 158137 -8129 203585 558997 290483 424327 537177 434819 418874
17276D18874D803K13306o2324J03136k0535J74665d853D88883J08589B64531e7390
$$ 418874 4803 218109 155785 258921 238386 413051 -4853 488883 597472 264531 -57390
17264B10303K20754k8887A50497K89984A74035K99509j74468j06064M95126A49083
$$ 210303 431057 402170 150497 440481 174035 473544 299076 193012 688138 149083
17253F37609j91119I1218N11406k73995k4124O4688q1975B4741L17151M3350A80927
$$ 637609 446490 91218 602624 328629 304505 369193 287218 24741 341892 385242 180927
17241D32249j67815a11589A55221K9162L52805I2296K25094P1668D5127K46248
$$ 432249 264434 -111589 155221 184383 537188 92296 317390 389058 45127 291375
17231B91375K03782A2811K24873J2963Q8043D7959K91625j03764l7397Q9943m9243
$$ 291375 495157 12811 237684 250647 338690 47959 339584 235820 198423 288366 239123
17220B39123J3528o6388l5080p0172B304L01919N17137m09957j9298j93859J85872
$$ 239123 252651 186263 151183 81011 2304 304223 821360 411403 392105 198246 384118
17209C84118j25444A11443L49454j03458K83844j83751r8052r9544A12603M76013
$$ 384118 258674 111443 460897 357439 641283 457532 359480 259936 112603 588616
17199E88616j15629j32489j36036R894K28538k01374o664J14779j58196J2877
$$ 588616 472987 340498 204462 214356 442894 241520 234856 349635 191439 204316
17189B04316J71671n5606P5522Q6836A57178P19171l80546A48792L58060n0764
$$ 204316 375987 320381 395903 482739 157178 876349 495803 148792 506852 456088
17179D56088O1393q5077J24805Q5546j75880P350J0430J54006o5002k4813k33831
$$ 456088 517481 432404 557209 642755 466875 474225 484655 638661 573659 548846 315015
17168C15015J99724B50641J19374J4016l4993J82039o175j66599J83270k08235
$$ 315015 514739 250641 370015 384031 349038 531077 524902 358303 541573 333338
17158C33338J48773m9914k06091K44847K33430j72774A44267Q4295K17972k12613
$$ 333338 482111 432197 226106 470953 704383 531609 144267 228562 446534 233921
17148B33921J5474M26422k94074J28042k09025K22515j46688L31083k23983K05228
$$ 233921 249395 675817 381743 509785 300760 523275 376587 707670 483687 688915
17138F88915A99584M21292p7551N2900K04937l90676A54799N24451o7965R079
$$ 688915 199584 620876 543325 596225 801162 410486 154799 679250 611285 620364
17128F20364n0194k27699Q6171K27755K2623k52108K99209J9703A61075M46238
$$ 620364 570170 342471 428642 656397 679020 426912 726121 745824 161075 607313
17118F07313A44242O17977k86763J92759j92103o0867o5876L01479B05210K20510
$$ 607313 144242 762219 475456 668215 476112 415245 349369 650848 205210 425720
17108D25720J5036L5269N84066j68831C62607L86304l52792p4472M54792j9356
$$ 425720 440756 476025 1060091 891260 362607 748911 396119 321647 776439 757083
17098G57083j63939Q6918m160o8998B77150M32116K0676k99674J73367M6464l07460
$$ 757083 593144 680062 675902 606904 277150 709266 729942 430268 603635 650099 342639
17087C42639K05042Q5706J39347j92114L17685l56229Q0551O3904J54738k60409
$$ 342639 547681 633387 772734 580620 898305 542076 622627 686531 841269 580860
17077E80860j14263L46246k45037L14024m9595k16215P4514k2595r7413J36791
$$ 580860 466597 812843 567806 881830 832235 616020 690534 667939 570526 707317
17067G07317N9788k42594J70621J04670j2200k27507K78418k65109m3597K57408
$$ 707317 767105 524511 695132 799802 787602 560095 838513 573404 529807 787215
17057G87215K7433k32889J30434L51854l36471k39342L07867k6697l5318K5054
$$ 787215 814648 581759 712193 1064047 727576 488234 796101 769404 734086 759140
17047G59140m6031j8429J45597N6837l26310K39191r8313K61125m79709N7696
$$ 759140 713109 694680 840277 897114 570804 809995 711682 972807 493098 550794
17037E50794M01761m19006N68065j51745k43940L58069k15564K52947j47359q9683
$$ 550794 952555 533549 1101614 949869 705929 1063998 848434 1101381 954022 864339
17027H64339l94441O50396r2592k72647r1287J65322P7002J38376l30724O31495
$$ 864339 469898 1120294 1027702 755055 663768 829090 906092 1044468 713744 1345239
17017A345239n12420l65023P83163k48644D65808M33716R6062K14128E32282M12152
$$ 1345239 832819 467796 1250959 1002315 465808 899524 995586 1209714 532282 944434
17007I44434J16273k83050M06276k81873R0385l12784K27222L07202N9329l81616
$$ 944434 1060707 777657 1183933 902060 992445 679661 906883 1214085 1273414 891798
16997H91798K989k03J73312J44362j20743j58343Q8647J64024l10024N42437l28548
$$ 891798 894787 894584 1067896 1212258 1091515 933172 1021819 1185843 875819 1418256 1089708
16986A089708k3491L18476l60317K64815j9945k47408N2538J26752M1846J02673
$$ 1089708 1066217 1384693 1024376 1289191 1269246 1021838 1074376 1201128 1242974 1345647
16976A345647k44374L94107r0517j8223j50402j67064K96287k26687P4990l43250
$$ 1345647 1101273 1495380 1404863 1386640 1236238 1069174 1365461 1138774 1213764 870514
16966H70514M52267k80818J18852j5258L68124l4075k4273j86838L00991k26306
$$ 870514 1322781 1041963 1160815 1145557 1513681 1479606 1455333 1268495 1569486 1343180
16956A343180q793q345K70383L5589m3288k98755L89437m11192L73397l8460O077
$$ 1343180 1334387 1326042 1596425 1632014 1588726 1289971 1679408 1268216 1641613 1603153 1609230
16945A609230O3043J6789j79803K87380l77920K59813k46495L07736j10190J42310
$$ 1609230 1672273 1689062 1509259 1796639 1418719 1678532 1432037 1739773 1629583 1771893
16935A771893n27590O61997L63040p10955L63776r009k87629J48090Q8913J15741
$$ 1771893 1244303 1906300 2269340 1558385 1922161 1913152 1625523 1773613 1862526 1978267
16925A978267l36573L04525l9984j52373J94119l5888M5906k61404K37854k20999
$$ 1978267 1641694 1946219 1906235 1753862 1947981 1912093 1957999 1696595 1934449 1713450
16915A713450N65089k15837P5385q7278k2944K77947k50867L26909O1888l06956
$$ 1713450 2278539 2062702 2138087 2050809 2027865 2305812 2054945 2381854 2443742 2136786
16905B136786J71377L5553k98249M47110k88253M07438k24267L21683j8755j65065
$$ 2136786 2308163 2343716 2045467 2492577 2204324 2611762 2387495 2709178 2690423 2525358
16895B525358k42566K94627n6457J86422N9415J83791l62610J6860R4528K2735
$$ 2525358 2282792 2577419 2520962 2707384 2766799 2950590 2587980 2604840 2699368 2722103
16885B722103K03162o5722J75508J05793K2374j88314L03164m81519P4962N64992
$$ 2722103 2925265 2859543 3035051 3140844 3163218 2974904 3278068 2796549 2871511 3436503
16875C436503m81788L68162J26677L653n1184j06770K29891k61998O3393K5533
$$ 3436503 2954715 3322877 3449554 3453207 3402023 3295253 3525144 3263146 3326539 3352072
16865C352072K52672k50511K02975J33322j19290L05616m33948M74118m29798
$$ 3352072 3604744 3354233 3557208 3690530 3571240 3876856 3442908 3917026 3487228
16856C487228J58996O43702m62357j16776M20832K49332r7215J31480j30679n1845
$$ 3487228 3646224 4289926 3827569 3710793 4131625 4380957 4283742 4415222 4284543 4232698
16846D232698K59634r0290J43805O5744M20152k05116K8176N3597M18437P8257
$$ 4232698 4492332 4402042 4545847 4611591 5031743 4826627 4854803 4908400 5326837 5405094
16836E405094n86697M61196N4019J5693K08193p1081Q0830L76791l32750J66530
$$ 5405094 4818397 5279593 5333612 5349305 5557498 5486417 5567247 5944038 5611288 5777818
16826E777818M19548J18397J08474k40520L76305l3756K73422l43110K20122K77670
$$ 5777818 6197366 6315763 6424237 6183717 6560022 6526266 6799688 6456578 6676700 6954370
16816F954370j5849M40630J22330K3614l6385J88299J46630L27854n567N72312
$$ 6954370 6938521 7379151 7501481 7525095 7488710 7677009 7823639 8151493 8145926 8718238
16806H718238n4557j82029M16456l9672L07279J93447K01842J84320K54919L50935
$$ 8718238 8663681 8481652 8898108 8858436 9165715 9359162 9561004 9745324 10000243 10351178
16796A0351178J44365L16856l49720P16226K50940K41851j49196M60463N07433
$$ 10351178 10495543 10812399 10462679 11178905 11429845 11671696 11522500 11982963 12490396
16787A2490396o0597N06425J75466L99901N74808M41000m66993P47776N14256
$$ 12490396 12429799 12936224 13111690 13511591 14086399 14527399 14060406 14808182 15322438
16778A5322438J10545N97371M65215L53953n4446Q95478N02181M30725O47379
$$ 15322438 15432983 16030354 16495569 16849522 16795076 17690554 18192735 18623460 19270839
16769A9270839M70686N69780N28917N74869M10226R21374M91558N47402R13241
$$ 19270839 19741525 20311305 20840222 21415091 21825317 22746691 23238249 23785651 24698892
16760B4698892Q82052Q08448R77792M11660R64811J282472N96532J402905J289153
$$ 24698892 25580944 26389392 27367184 27778844 28743655 30026127 30622659 32025564 33314717
16751C3314717J226488J193703P71048J306457J498534J186135J853635J314620
$$ 33314717 34541205 35734908 36505956 37812413 39310947 40497082 42350717 43665337
16743D3665337J816493J770024J612233J791872J783688K198877K256395J962052
$$ 43665337 45481830 47251854 48864087 50655959 52439647 54638524 56894919 58856971
16735E8856971K039813K203872K691068K665341K855034K351363K710569L007060
$$ 58856971 60896784 63100656 65791724 68457065 71312099 73663462 76374031 79381091
16727G9381091K988194K895687L250734L061085K982825L098016L035785L178426
$$ 79381091 82369285 85264972 88515706 91576791 94559616 97657632 100693417 103871843
16719A03871843K924009K900050K806012K548557K603204K253873K033367J753043
$$ 103871843 106795852 109695902 112501914 115050471 117653675 119907548 121940915 123693958
16711A23693958J418321J246019M70022Q62661n5501j02855n77249o28842j362004
$$ 123693958 125112279 126358298 126828320 127690981 127635480 127532625 126955376 126326534 124964530
16702A24964530j493054j915286j975324k299494k672390k485459l110338k425560
$$ 124964530 123471476 121556190 119580866 117281372 114608982 112123523 109013185 106587625
16694A06587625l428936k862205l393786k941314l300056l551774k946480k247515
$$ 106587625 103158689 100296484 96902698 93961384 90661328 87109554 84163074 81915559
16686H1915559l149338k851850k919195k595354k778957k653246k230406k695306
$$ 81915559 78766221 75914371 72995176 70399822 67620865 64967619 62737213 60041907
16678F0041907k181813k223934k175786j685047k070964k007894j515194j621491
$$ 60041907 57860094 55636160 53460374 51775327 49704363 47696469 46181275 44559784
16670D4559784j841181j081087j902575j237799j641753r47243j293516j004436
$$ 44559784 42718603 41637516 39734941 38497142 36855389 35908146 34614630 33610194
16662C3610194j150324r80031j455624q68763p71989r19418q91251m29601j232714
$$ 33610194 32459870 31479839 30024215 29155452 28383463 27464045 26572794 26143193 24910479
16653B4910479p37292n13052r20645o30212p47425k96287r58844l16855o14686
$$ 24910479 24173187 23660135 22739490 22109278 21361853 21065566 20106722 19789867 19175181
16644A9175181n58568j57010p37793n98712l36493j88546n71952m05561k85210
$$ 19175181 18616613 18459603 17721810 17123098 16786605 16598059 16026107 15620546 15335336
16635A5335336o52081j75179n09093k65238m46131P9013q88108l4314k88940k84109
$$ 15335336 14683255 14508076 13998983 13733745 13287614 13366627 12478519 12444205 12155265 11871156
16625A1871156j15382l05295o23477P6043k07685n46889M68942p75994j21985
$$ 11871156 11755774 11450479 10827002 10903045 10695360 10148471 10617413 9841419 9719434
16616I719434J56037m18664k10470j31634n17287J29759n98478N44518n36343
$$ 9719434 9875471 9456807 9246337 9114703 8597416 8727175 8128697 8673215 8136872
16607H136872O8543q7371l84388J03102n11763N8644j93394j10612j0132j75725
$$ 8136872 8205415 8118044 7733656 7836758 7324995 7383639 7190245 7079633 7069501 6893776
16597F893776P7562o70887L36520l63386r9161k82952M62530k59551o2751m8506
$$ 6893776 6971338 6300451 6636971 6273585 6174424 5891472 6354002 6094451 6031700 5983194
16587E983194l60423j06514k4136L60799n16159j07276k89289R7967j35817K60849
$$ 5983194 5622771 5516257 5492121 5852920 5336761 5229485 4940196 5038163 4902346 5163195
16577E163195J90257j80353k57776j44153j37185m18504L20058k37704K05440
$$ 5163195 5353452 5173099 4915323 4771170 4633985 4215481 4535539 4297835 4503275
16568D503275q0005j53858J22662p5784l42426J17954K35206o65817J07970j75086
$$ 4503275 4423270 4269412 4392074 4316290 3973864 4091818 4327024 3661207 3769177 3594091
16558C594091J87075J5859j41746J28199J04424q7185k15712L34305l94163k38221
$$ 3594091 3781166 3797025 3655279 3783478 3887902 3800717 3585005 3919310 3525147 3286926
16548C286926J33591o7376N5902k67207J34581J50324o66551K11575J04728k4524
$$ 3286926 3420517 3353141 3409043 3141836 3276417 3426741 2760190 2971765 3076493 3051969
16538C051969m02164J34161J64072n9841L0002R254j59888O6034n3572j36756
$$ 3051969 2649805 2783966 2948038 2888197 2918199 2927453 2767565 2833599 2780027 2643271
16528B643271M4332k16068J17446J67556m5149k09838N2840J64549m88293K15200
$$ 2643271 2687603 2471535 2588981 2756537 2711388 2501550 2554390 2718939 2230646 2445846
16518B445846j05227N8621p8089j6166K16291m50812J77109q8353M73880o20769
$$ 2445846 2340619 2399240 2321151 2304985 2521276 2070464 2247573 2159220 2633100 2012331
16508B012331M91524j53605k13165K65462k78099n8359P3603J30880l64863L18977
$$ 2012331 2503855 2350250 2137085 2402547 2124448 2066089 2139692 2270572 1905709 2224686
16498B224686j53250j41642q1066k27009L49144J8649l39796K12347N8001L1853
$$ 2224686 2071436 1929794 1848728 1621719 1970863 1989512 1649716 1862063 1920064 1951917
16488A951917j6883m51728L28678l86547N18597l49750M5746k84309N59943k06252
$$ 1951917 1935034 1483306 1811984 1425437 1944034 1594284 1640030 1355721 1915664 1709412
16478A709412k86457J66132K30249j14790K7826q9742k52129L90824m41005Q5217
$$ 1709412 1422955 1589087 1819336 1704546 1732372 1642630 1390501 1781325 1340320 1425537
16468A425537J52660P5455j90816N812n1525J73516n9343j42101J48183J24044
$$ 1425537 1578197 1653652 1462836 1468648 1417123 1590639 1531296 1389195 1537378 1661422
16458A661422k84301l51712N11089k75285M0543J62983j14622K43101k28482K37972
$$ 1661422 1377121 1025409 1536498 1261213 1301756 1464739 1350117 1593218 1364736 1602708
16448A602708k3208m85620j01719L54927J67151k41519R4203n3007p0652L61344
$$ 1602708 1579500 1093880 992161 1347088 1514239 1272720 1366923 1313916 1243264 1604608
16438A604608k52562n219j25254l24041O2603J63935p2853k38939M10094O7004
$$ 1604608 1352046 1346827 1221573 897532 960135 1124070 1051217 812278 1222372 1289376
16428A289376Q7888n8723j7157m31759J88189m488J14522m6220J76124K1211k21672
$$ 1289376 1377264 1318541 1301384 869625 1057814 1053326 1167848 1121628 1297752 1318963 1097291
16417A097291q8150M75794l81928K32295o32128J14012L61749l3567j66252J0244
$$ 1097291 1009141 1484935 1103007 1335302 703174 817186 1178935 1145368 979116 989360
16407I89360K37452k21278J17032k79116M49405k92016N6659J18529n24316N04708
$$ 989360 1226812 1005534 1122566 843450 1292855 1000839 1057498 1176027 651711 1156419
16397A156419k66027K1653J87602j09864Q888k97438K28727q2532J53825k43350
$$ 1156419 890392 912045 1099647 989783 998671 701233 929960 847428 1001253 757903
16387G57903M26510O3962l00174L5985k67186J25450J61422j48946j0254P0747
$$ 757903 1184413 1248375 948201 984186 717000 842450 1003872 854926 844672 915419
16377I15419j86111K79066l24555M01334k92931j3939R1702Q699r5368N4793l8651
$$ 915419 729308 1008374 683819 1085153 792222 778283 869985 878684 783316 838109 799458
16366G99458q4586L0327K95087q3348j24062r6825q3166M43826m29327J58783
$$ 799458 714872 745199 1040286 956938 832876 736051 652885 1096711 667384 826167
16356H26167K87181m52866K59502J70911D25860K39660j1677j914L2268J24472
$$ 826167 1113348 660482 919984 1090895 425860 665520 653843 651929 684197 808669
16346H08669k03406J46574o2188r795J26924l29817K23475k85404N14344l58467
$$ 808669 605263 751837 689649 679854 806778 476961 700436 415032 929376 570909
16336E70909n899J32264j2214p7161Q7752K24725n1090O0995k96280j85557K54312
$$ 570909 565010 697274 685060 607899 695651 920376 869286 930281 634001 448444 702756
16325G02756N2318K0834l6192l62367K34103p92B74275K68983K42243C69747L40786
$$ 702756 755074 775908 739716 377349 611452 610660 274275 543258 785501 369747 710533
16314G10533l40497L76049J3911k77778L1546o8743K49189j68319j05946K9557
$$ 710533 370036 746085 759996 482218 513764 445021 694210 525891 419945 449502
16304D49502R2729J40835k0636k7418L49268o9884D07104K71450m7178j41557
$$ 449502 542231 683066 662430 635012 984280 914396 407104 678554 631376 489819
16294D89819J31988l3743o7374M0941M4548k01523J002N4309A93677J61730L45293
$$ 489819 621807 588064 520690 561631 606179 404656 405658 459967 193677 355407 700700
16283G00700B53803K27364J48761j40356k34065M16757p0243K94750l25520L4706
$$ 700700 253803 481167 629928 489572 255507 672264 602021 896771 571251 605957
16273F05957k7532j6363l6476J09771k40149Q3670k26614M17331k44906J62720
$$ 605957 578425 562062 525586 635357 395208 478878 252264 669595 424689 587409
16263E87409j39301K2697r8541J25227A42589K62771J189K2056L24417B88835
$$ 587409 448108 470805 372264 497491 142589 405360 406549 428605 753022 288835
16252E11123J14297j86440J55988k49922J56592p0294A70993K20476J0291C4560
$$ 511123 625420 438980 594968 345046 501638 431344 170993 391469 401760 34560
16241D31380R1700k6054J18254j55024n6575J15731j44520j19605P0945J07818
$$ 431380 523080 497026 615280 460256 403681 519412 374892 255287 326232 434050
16231D34050j4068n2654q0431j15989L65517m7781K22345C40202j918n3854r2536
$$ 434050 419982 367328 286897 170908 536425 488644 710989 340202 338284 284430 191894
16220A91894M124J24520j7845M500n8816J07236Q6213j09824j26204J81047j48896
$$ 191894 196018 320538 302693 307193 248377 355613 441826 332002 205798 386845 237949
16209B37949J49027l7967l7114K93722j15515A24266M25182B02395L54719D8155
$$ 237949 386976 349009 311895 605617 490102 124266 549448 202395 557114 48155
16198A88004M28385q0637m6861a0833C40336l0786E8000Q8594K18871Q48K05892
$$ 188004 616389 535752 488891 -10833 340336 309550 58000 146594 365465 366313 572205
16187E72205B02839L29048c9812B45864J67660e563A70238J75173B255P53040
$$ 572205 202839 531887 -39812 245864 413524 -5563 170238 345411 2255 755295
16177G55295k31117c6006B55260K37303k33932p1842L0411J7385O7109J61500
$$ 755295 524178 -36006 255260 492563 258631 186789 217200 234585 301694 463194
16167D63194A96005P9260H0615a21599B97670P84L52849G6064J92172H1031L161
$$ 463194 196005 275265 80615 -121599 297670 298454 651303 76064 268236 81031 84192
16156H4192J52159n5044b6571F8777J932K28500A31567Q8801K13434m5981R4715
$$ 84192 236351 181307 -26571 68777 70709 299209 131567 220368 433802 387821 482536
16145D82536l3853i7565E50880B23354q2888M1026Q1510j12628n8297D1083R6217
$$ 482536 448683 -97565 550880 223354 140466 181492 263002 150374 92077 41083 137300
16134A37300Q885K29495G2883P5418L35692k30135a2456A7334K76148K03339A03507
$$ 137300 146185 375680 72883 148301 483993 253858 -12456 17334 293482 496821 103507
16122b47905A70551Q4740l0864L4954L5102N3830G9103d7963C15842r2985E2638
$$ -247905 170551 255291 224427 259381 294483 348313 79103 -47963 315842 222857 52638
16110A45095K99447j39861A30556b7837D32244A36983D9121L52051g4603D47140
$$ 145095 444542 304681 130556 -27837 432244 136983 49121 401172 -74603 447140
16099B35668K13991B20046Q9376E0749J51787J9468o8675K8742m4580n3603k493
$$ 235668 449659 220046 309422 50749 202536 222004 153329 182071 137491 83888 81395
16088H1395R0582a037A84358L010f1882B75216a66255D35020a16366B17338a3999
$$ 81395 171977 -1037 184358 187368 -61882 275216 -166255 435020 -116366 217338 -13999
16076C3168L23710b05036B1986L67919j20339h2321D6007K5639K22038A11413
$$ 33168 356878 -205036 21986 389905 269566 -82321 46007 71646 293684 111413
16065I7063c952j55134P0863E93749c49231F7931J4931R6964J36012a56928L7138
$$ 97063 -3952 -159086 -88223 593749 -349231 67931 82862 179826 315838 -156928 -119790
16054a19790H739K93313b09012e7170C06570j7547j4716j31222c5970A0790L04689
$$ -119790 8739 302052 -209012 -57170 306570 289023 274307 143085 -35970 10790 315479
16043C15479C5902J24066O2058A03848Q5233b153j07654A30010c38447C92757
$$ 315479 35902 159968 222026 103848 189081 -2153 -109807 130010 -338447 392757
16032A65897c4281B20762p9899L62353F8900J68091h4967E4211P0150J46907P0846
$$ 165897 -34281 220762 140863 503216 68900 236991 -84967 54211 124361 271268 342114
16021C42114A57822G8195a91761D7073K23496r852d88752B42010G7341B5090J87341
$$ 342114 157822 78195 -191761 47073 270569 260717 -488752 242010 77341 25090 212431
16010B12431H5952K47844b6639F7369F304P3919h1414c5766j80749C8510c453
$$ 212431 85952 333796 -26639 67369 6304 80223 -81414 -35766 -216515 38510 -3453
15998A38414J62853J0827l9711b01111A68387J62448A7963P4254O3139E4608p021
$$ 138414 301267 312094 272383 -201111 168387 330835 17963 92217 155356 54608 47587
15987D7587Q9618a99253b7133A51438a47835B42302M8393C1397J03143h4359C42465
$$ 47587 137205 -199253 -27133 151438 -147835 242302 290695 31397 134540 -84359 342465
15975I4127J28520J54124J45166J50773J53095N5463j17765R484n7264k00510
$$ 94127 222647 376771 521937 672710 825805 881268 763503 772987 715723 515213
15965E15213j12581j47389j9208D3041K35941j08213E8351b1148j06962L6999
$$ 515213 402632 255243 236035 43041 278982 170769 58351 -21148 -128110 -91111
15955i1111B33835f8550q5039C24892r3876l6739b87781j6397g6830A91713D6084
$$ -91111 233835 -68550 -153589 324892 231016 194277 -287781 -304178 -76830 191713 46084
15943b35068B05691A01459C4540a55614A3802L00282j09537C5013K41690b29157
$$ -235068 205691 101459 34540 -155614 13802 314084 204547 35013 276703 -229157
15932e3746j11051A16224C196b6276h173B60375o2778l8876e4311j12829N8295
$$ -53746 -164797 116224 3196 -26276 -8173 260375 197597 158721 -54311 -167140 -108845
15921a08845H6147a47340F7666b72628B49791I1967P0245b1923D4039j4848b00871
$$ -108845 86147 -147340 67666 -272628 249791 91967 162212 -21923 44039 29191 -200871
15909a9147A32975N5503J771n1794B057c1932k7637k8701j74701J13195a3741
$$ -19147 132975 188478 190249 138455 2057 -31932 -59569 -88270 -262971 -149776 -13741
15897a2140G3679a20015e3654A74245e0475A62895a24672A4607e57031d0247C152
$$ -12140 73679 -120015 -53654 174245 -50475 162895 -124672 14607 -557031 -40247 3152
15885A62327a97490A56374a4189j26962A56252F4695a81651d4219q348A42584
$$ 162327 -197490 156374 -14189 -141151 156252 64695 -181651 -44219 -52567 142584
15874B42924a10104A77159d3753j53515j44741J69004k8751N7476B43114d21808
$$ 242924 -110104 177159 -43753 -197268 -342009 -173005 -201756 -144280 243114 -421808
15863a97884i8436A3933a2596k78837B99460h0509A51877J0725J04404E356L18730
$$ -197884 -98436 13933 -12596 -291433 299460 -80509 151877 162602 267006 5356 324086
15852C24086f3488b2933C56878A23724c30586a61095B26978e6887p712l5751I7908
$$ 324086 -63488 -22933 356878 123724 -330586 -161095 226978 -56887 -64599 -100350 97908
15840a41210A16887F973M6109a6529j48668d795A90517f2068l5698l8356N2267
$$ -141210 116887 6973 53082 -16529 -165197 -4795 190517 -62068 -97766 -136122 -83855
15829h3855k7001b0003j27476A51291c59247a18652B0478b58l0287A18178i3169
$$ -83855 -110856 -20003 -147479 151291 -359247 -118652 20478 -258 -30545 118178 -93169
15817a09628F9410d3611b123j60942H347d4178n8205g636A65657F8920J84707
$$ -109628 69410 -43611 -2123 -163065 8347 -44178 -102383 -7636 165657 68920 253627
15806B53627D8738P930g5923B0342J1084a75952e0276H615L6247d7442O123m39988
$$ 253627 48738 56668 -75923 20342 31426 -175952 -50276 8615 44862 -47442 -41319 -481307
15794d81307E2997g1065m5791B62138b83361J36537c0298m0165I4207f0435g283
$$ -481307 52997 -71065 -116856 262138 -283361 -146824 -30298 -70463 94207 -60435 -7283
15782B03406b99514b3591E7880a52323B07162d3490j09402P5898L4925k16521
$$ 203406 -299514 -23591 57880 -152323 207162 -43490 -152892 -76994 -42069 -258590
15772b58590a27363b6320j34761A89851G551a93871B70J1533J11372b0092H7685
$$ -258590 -127363 -26320 -161081 189851 7551 -193871 270 11803 123175 -20092 87685
15760A97805J18021A0544J55127D1589a18988j12717A9344a39644J84j26446C23159
$$ 197805 315826 10544 165671 41589 -118988 -231705 19344 -139644 -139460 -265906 323159
15748B7471c31091H0794a035A3924K55898j20783b39072B22022f8359B83671F152
$$ 27471 -331091 80794 -1035 13924 269822 149039 -239072 222022 -68359 283671 6152
15736c10274A9446a30436C03763i2696A69343i8003j20248j26202a49760O1519
$$ -310274 19446 -130436 303763 -92696 169343 -98003 -218251 -344453 -149760 -88241
15726h8241B35967l9130L1726b32803C05856G2359a58224O6041A57476i7818L0434
$$ -88241 235967 196837 228563 -232803 305856 72359 -158224 -92183 157476 -97818 -67384
15715f7384b9288l6960j44413A943h0914A56718p1783g7695C10051j7251a44162
$$ -67384 -29288 -66248 -210661 1943 -80914 156718 84935 -77695 310051 292800 -144162
15703A34068b35465A18645i0875b5073A39832f4706k58539a33230B47629f8079
$$ 134068 -235465 118645 -90875 -25073 139832 -64706 -323245 -133230 247629 -68079
15692E4768K730J23996G6775h0352A32552C0197b47695l788Q3581J4300A11736
$$ 54768 57498 181494 76775 -80352 132552 30197 -247695 -251483 -167902 -153602 111736
15680i0952j37427R0277A89279b69116I2180K07511a60979g8950G0289c2488k25018
$$ -90952 -228379 -138102 189279 -269116 92180 299691 -160979 -78950 70289 -32488 -257506
15669b57506Q2886l33676g025k52870g1047E8465A2320M2506h5331A141b78156
$$ -257506 -174620 -508296 -7025 -259895 -71047 58465 12320 54826 -85331 1141 -278156
15657E450a33964b0673r4787b8995A28682b24530N7271C3762e13908a92688O3112
$$ 5450 -133964 -20673 -115460 -28995 128682 -224530 -167259 33762 -513908 -192688 -129576
15646a29576k38350g9985j59578B96750f8505A37150k1515d04780A612J36891
$$ -129576 -367926 -79985 -239563 296750 -68505 137150 115635 -404780 1612 138503
15636A38503a3055k03760j59228A50235m994k5542E3068A5797g5366M46B38026
$$ 138503 -13055 -216815 -376043 150235 145241 119699 53068 15797 -75366 -74920 238026
15624A78646P6716D152a01408A55080i6415j59896f0871q6203K3518r9899B6471
$$ 178646 255362 4152 -101408 155080 -96415 -256311 -60871 -147074 -123556 -223455 26471
15612b34679A08921d9330j98863D7556f472E0570a45558A77444C4426M6667a01166
$$ -234679 108921 -49330 -248193 47556 -6472 50570 -145558 177444 34426 81093 -101166
15600i7959K7989C27246j16212D3594K26306b2269p4724p2405H6423D0357a92179
$$ -97959 -69970 327246 211034 43594 269900 -22269 -96993 -169398 86423 40357 -192179
15588a24626l188A18345l8305a62807o6874G2797b3272A39468c2719k0152j91353
$$ -124626 -127814 118345 80040 -162807 -229681 72797 -23272 139468 -32719 -52871 -244224
15577b44224C47028e690j50043O1044C89198j15192K902h421k9506a2415B9102
$$ -244224 347028 -5690 -155733 -94689 389198 274006 276908 -8421 -37927 -12415 29102
15565c82978J09394a23068b9100j11074l2123b3787j30879D5342c6680A18399
$$ -382978 -273584 -123068 -29100 -140174 -172297 -23787 -154666 45342 -36680 118399
15554C12097a05077c1105A96366M9471G3297e5497A09936l4662J04229a16531
$$ 312097 -105077 -31105 196366 245837 73297 -55497 109936 75274 179503 -116531
15543A58249b80057a21950j71026a13418M0169G1321c73479B2392b719A56503
$$ 158249 -280057 -121950 -292976 -113418 -73249 71321 -373479 22392 -2719 156503
15532D22759c74296c0173G031g5031C0031J24173l3685Q3565P4881A5893a62825
$$ 422759 -374296 -30173 7031 -75031 30031 154204 120519 204084 278965 15893 -162825
15520c02113J20924G654Q58K7401J05700c4916B06179b01146j66605B61337a78096
$$ -302113 -181189 7654 8512 35913 141613 -34916 206179 -201146 -367751 261337 -178096
15508C5915f9549n6446D39440A52349G3920N8603L28626A71825K08573e6681B21833
$$ 35915 -69549 -125995 439440 152349 73920 132523 461149 171825 380398 -56681 221833
15496A60355M3396q7028B8840J70576B5488J01163B3924K62918B8036J32355J4232
$$ 160355 203751 116723 28840 199416 25488 126651 23924 286842 28036 160391 174623
15485A74623J24414G2890L583b17756B96974i8626B38948c1737A94001J6922C1441
$$ 174623 299037 72890 76473 -217756 296974 -98626 238948 -31737 194001 210923 31441
15473B87614H2484l3107A7143k951O8556M5834A2151J97510f7002F0224M78135
$$ 287614 82484 49377 17143 14192 82748 128582 12151 209661 -67002 60224 538359
15462E38359k36207A0886Q3841M10547N7278j5675k54751R6273j67252b05206
$$ 538359 302152 10886 94727 505274 562552 546877 292126 388399 221147 -205206
15451a0277B02563L1655L4906e11664A72899a16127h881l3545q494n7174B01221
$$ -10277 202563 234218 269124 -511664 172899 -116127 -8881 -42426 -50920 -108094 201221
15439f1157o280E522b54200B50874i7985p3582A2209g1428A58896K46863n905
$$ -61157 -67437 5522 -254200 250874 -97985 -171567 12209 -71428 158896 405759 399854
15428C99854j65495L40226L01817J61899m23717j27075j75102A43955Q8850o0384
$$ 399854 234359 574585 876402 1038301 614584 487509 312407 143955 232805 172421
15418A72421K64163H8484e0247a6473C37870C6739J42766D4087J04379b75929
$$ 172421 436584 88484 -50247 -16473 337870 36739 179505 44087 148466 -275929
15407H2573J32548a82348B27483A2507a17225k8244C657P4136a37037B08154f7883
$$ 82573 215121 -182348 227483 12507 -117225 -145469 3657 77793 -137037 208154 -67883
15395A28064b30034i2470B50428H6255e0413d612B78051C2140h6741G4477c16100
$$ 128064 -230034 -92470 250428 86255 -50413 -4612 278051 32140 -86741 74477 -316100
15383G4100J14272O1204c07038A7971j600b1412A19661b4827m9435B92739a20809
$$ 74100 188372 249576 -307038 17971 16371 -21412 119661 -24827 -74262 292739 -120809
15371A29511a33376A14106a01729a4601A45488J85799C674e8061I0234R0408J49673
$$ 129511 -133376 114106 -101729 -14601 145488 331287 3674 -58061 90234 180642 330315
15360C30315A53371K6762J27906j9667a43987I138L37561I8538a78564h3541B77900
$$ 330315 153371 180133 308039 288372 -143987 9138 346699 98538 -178564 -83541 277900
15348A786g898B8132d647C8546b9469A41907b28617a1238A81646k6876b28912
$$ 1786 -7898 28132 -4647 38546 -29469 141907 -228617 -11238 181646 154770 -228912
15336D38078A91065a80027I9782J67020m7793a29659A22497J19050o8301r558
$$ 438078 191065 -180027 99782 266802 219009 -129659 122497 241547 173246 163688
15326A63688k2398K46414j62745I8372J52307e5074B26813h7924p3667b5397D77073
$$ 163688 141290 387704 224959 98372 250679 -55074 226813 -87924 -161591 -25397 477073
15314a13835A14930r769E0052Q259M10193j02475J56462E3939K94717a63930A20315
$$ -113835 114930 105161 50052 58311 468504 366029 522491 53939 348656 -163930 120315
15302B0359J35996o8893N5317P0836N779g9896B88052A40153P4451J26196D5759
$$ 20359 156355 87462 142779 213615 219394 -79896 288052 140153 214604 340800 45759
15290A12843J85988j03980g8951G8479J96522E5715F424K23647B9904J62844J05649
$$ 112843 298831 194851 -78951 78479 275001 55715 6424 230071 29904 192748 298397
15279B98397D7792c45651B6503Q9699a71533d4404L421j33794j490M6138A54773
$$ 298397 47792 -345651 26503 116202 -171533 -44404 -40983 -174777 -176267 -130129 154773
15267c5043G7835h8901A01953M1060B7895b78096B11941a06763A78930K0566H9159
$$ -35043 77835 -88901 101953 143013 27895 -278096 211941 -106763 178930 199496 89159
15255a78889E79075c8292E0343D612J23223a1983j4372F5307c2672B32202a00821
$$ -178889 579075 -38292 50343 4612 127835 -11983 -26355 65307 -32672 232202 -100821
15243A14615b9596j20032d5061A89479C0679K07320E6232K13412O516n7371J9604
$$ 114615 -29596 -149628 -45061 189479 30679 237999 56232 269644 276160 218789 238393
15232B38393q0250K47558K08855L25625O64980k27664k65770J06698C18351G2192
$$ 238393 158143 405701 614556 940181 1605161 1377497 1111727 1218425 318351 72192
15221C89974A33154K64030A14843K6498M1578A7400d3129A97315N925J70166b50951
$$ 389974 133154 397184 114843 141341 182919 17400 -43129 197315 203240 373406 -250951
15209a23228E7768A7416a1640B03116a00148H2153M6009a26740A60906J40777
$$ -123228 57768 17416 -11640 203116 -100148 82153 128162 -126740 160906 301683
15199C01683d7184A25578D9457R6895M187J30926a10264A66332E3132Q3381a31532
$$ 301683 -47184 125578 49457 146352 150539 281465 -110264 166332 53132 136513 -131532
15187c3007O145H7549J54000D3800f6545G714J84461c5336k37558D72297k24491
$$ -33007 -26862 87549 241549 43800 -66545 7714 192175 -35336 -272894 472297 247806
15176B47806b61248a22044E60883A02854Q130a30143C46055A25357A9078J03803
$$ 247806 -261248 -122044 560883 102854 110984 -130143 346055 125357 19078 122881
15166A22881M2728a19943p0408A40262a7032A38757a25125b2608A87581L970M5858
$$ 122881 165609 -119943 -190351 140262 -17032 138757 -125125 -22608 187581 191551 237409
15155B37409A15435L4960c5653B04201g2726n0204A91530k0131H4951K6485d8861
$$ 237409 115435 150395 -35653 204201 -72726 -122930 191530 171399 84951 111436 -48861
15143a04115C15873n8706I2074O4945N6663a05323k26481I2908R668J06362h7304
$$ -104115 315873 257167 92074 157019 213682 -105323 -331804 92908 102576 208938 -87304
15131G7307b78683f168A12580P4550J58829B9629K07668m042l5873G3907b828
$$ 77307 -278683 -6168 112580 187130 345959 29629 237297 233255 197382 73907 -2828
15119B22625J87760j57437F5443L65847A50020i2673G0970L96040e2953C68565
$$ 222625 410385 252948 65443 431290 150020 -92673 70970 467010 -52953 368565
15108B9800J29818N8144K63392r1399n1785Q9565F8279J38393J01079B5360P1474
$$ 29800 159618 217762 481154 389755 337970 427535 68279 206672 307751 25360 96834
15097I6834C5839d8183I856N39081A66762K00616I0643l4604L27843j80823J96168
$$ 96834 35839 -48183 9856 548937 166762 367378 90643 56039 383882 203059 399227
15086C99227A85714q7593K0667K7803c6763j63016D6461K00314j16101E7013i9439
$$ 399227 185714 98121 118788 146591 -36763 -199779 46461 246775 130674 57013 -99439
15074A60081b6072B08865q27j03897e2309B17275J1078B2103K36242e8819B9031
$$ 160081 -26072 208865 208038 104141 -52309 217275 228353 22103 258345 -58819 29031
15062d9727C7347O601a59614B97898M993c9483C13348L1b45826H7965Q7550c8539
$$ -49727 37347 43948 -159614 297898 302891 -39483 313348 313379 -245826 87965 175515 -38539
15049B73669J91995H9072Q6703J22371k636j33740O7191L31751i5770A58098R7470
$$ 273669 465664 89072 175775 298146 295510 161770 228961 560712 -95770 158098 255568
15038B55568l0585K00377A03771M981J88155K97389k30363O4645A70456L5648
$$ 255568 224983 425360 103771 108752 296907 594296 363933 428578 170456 206104
15028B06104m4527J01990C616i4928I3627L68607q3112J00964K2069J16312j23174
$$ 206104 161577 263567 3616 -94928 93627 462234 379122 480086 502155 618467 495293
15017D95293A94087K91100L12171j47917J21275K6129J9358j45458k64056N7071
$$ 495293 194087 485187 797358 649441 770716 796845 816203 670745 406689 463760
15007D63760k3637J07342K12761C33413R1546j61358L06336k01712K87537k79657
$$ 463760 440123 547465 760226 333413 424959 263601 569937 368225 655762 376105
14997C76105O921J03183j40174K05581j17653K6900j39609m6850K28433j99259
$$ 376105 383026 486209 346035 551616 433963 460863 321254 274404 502837 303578
14987C03578j40656J88327j2759K28705q571j53197j18546R608J75938q1167A32026
$$ 303578 162922 351249 338490 567195 558624 405427 286881 296489 472427 391260 132026
14975C53730m1859K32723n6287K23582k8552k88914j5007M53177j52246j57920
$$ 353730 311871 544594 488307 711889 683337 394423 379416 832593 680347 522427
14965E22427J63984K23887B68631L89217J14377C71010p5671A30642L08074J25977
$$ 522427 686411 910298 268631 657848 772225 371010 295339 130642 438716 564693
14955E64693K99253C95686J12954j76438L51183B88118J64679k066A63033J80939
$$ 564693 863946 395686 508640 332202 683385 288118 452797 450731 163033 343972
14945C43972K0130J24176P4094j56496q0901j3401K66988E4170L53545M4205A56550
$$ 343972 364102 488278 562372 405876 324975 311574 578562 54170 407715 451920 156550
14933F78171k84417K35700k40055j41112J84063O7657K23089k3153r4523A0814
$$ 678171 393754 629454 389399 248287 432350 500007 723096 699943 605420 10814
14922E99755p4747P6455p1437r7291Q4583O6713L05971K16427j10844M67756k38682
$$ 599755 525008 601463 530026 432735 517318 584031 890002 1106429 995585 1463341 1224659
14911A224659M2127L46853p2672q2864O5096k66664J86773L84141l82209K77121
$$ 1224659 1266786 1613639 1540967 1458103 1523199 1256535 1443308 1827449 1445240 1722361
14901A722361M58668k10716m81381l04218J12923K4677m8510l75280k53076p0947
$$ 1722361 2181029 1970313 1488932 1184714 1297637 1322314 1273804 898524 645448 574501
14891E74501K3925M0192B08062K38933J13309o8500J75250C05213K62383j03138
$$ 574501 598426 638618 208062 446995 560304 491804 667054 305213 567596 464458
14881D64458Q605M0728R5310J15534p7286j66350j62647p8961K97455k6365J61990
$$ 464458 473063 513791 609101 724635 647349 480999 318352 239391 536846 510481 672471
14870F72471K0362j6339J77212P872P0405k44349C25772K79584p2744p0833K7760
$$ 672471 692833 676494 853706 861578 931983 687634 325772 605356 532612 461779 489539
14859D89539M02032D33016K06944A63548P59830k08753l27361K80699J61324k25121
$$ 489539 891571 433016 639960 163548 923378 714625 387264 667963 829287 604166
14849F04166K76875k77642B95628j8900l2401A12422M08597I8405M15842J48470
$$ 604166 881041 603399 295628 276728 244327 112422 521019 98405 514247 662717
14839F62717l23501L88923j53716j16051J73638j46645A55933M85668L36K77127
$$ 662717 339216 728139 574423 458372 632010 485365 155933 641601 641937 919064
14829I19064l63158J53902R6199N5423M13625k38550k23394K82743j48561R4450
$$ 919064 555906 709808 806007 861430 1275055 1036505 813111 1095854 947293 1041743
14819A041743E10493J42849M7786k16426K16990j95959Q0555j14157J28618K97124
$$ 1041743 510493 653342 701128 484702 701692 505733 586288 472131 600749 897873
14809H97873j62255j80769K31219j96131M12542m02374L55353l71680O68339o19176
$$ 897873 735618 554849 786068 589937 1002479 600105 955458 583778 1252117 632941
14799F32941N871j93876K78052J36854k12310l9775R3601l44377K52125L69389
$$ 632941 638812 444936 722988 859842 647532 607757 701358 356981 609106 978495
14789I78495j90389J92703K7728o5359j57769j76103J05850K06004D14667M36675
$$ 978495 788106 980809 1008537 943178 785409 609306 715156 921160 414667 851342
14779H51342m18217J50288j01613K12760L43306m95285n302K09320r4605l7366
$$ 851342 433125 583413 481800 694560 1037866 542581 537279 746599 651994 614628
14769F14628O2693J55132l79691N10112l65642K26342j26487j47881L16607j8425
$$ 614628 677321 832453 452762 962874 597232 823574 697087 549206 865813 847388
14759H47388j0134Q2873J26218r6270K73305m51431k69113J94232L96335l45221
$$ 847388 837254 920127 1046345 950075 1223380 771949 502836 697068 1093403 748182
14749G48182q6477r801K41345j42008B90923P59173m24069m5627j03603J51624
$$ 748182 661705 651904 893249 751241 290923 1050096 626027 580400 476797 628421
14739F28421k46591J97669J36699j90600m225J19193n1497M03648j05436J65269
$$ 628421 381830 579499 716198 525598 521373 640566 589069 992717 887281 1052550
14729A052550l65331K81563k1615k86511O6592K34105k64994l492N3175L63760
$$ 1052550 687219 968782 947167 660656 727248 961353 696359 692867 746042 1109802
14719A109802J61080m11669K68652k4416p0769K88372J87779k7011q7429N00155
$$ 1109802 1270882 859213 1127865 1103449 1032680 1321052 1508831 1481820 1394391 1894546
14709A894546o31541J34053j65959J60622p3485k54759m1090J87275j56441j49329
$$ 1894546 1263005 1397058 1231099 1391721 1318236 1063477 1022387 1209662 1053221 903892
14699I03892M12404l62390K8077k20023k5504L32870j26117K03923J03469K4061
$$ 903892 1316296 953906 981983 761960 736456 1069326 943209 1147132 1250601 1274662
14689A274662j97765K11034L69660k34528L8128K33575k1019l99705K00997j49531
$$ 1274662 1076897 1287931 1657591 1423063 1461191 1694766 1673747 1274042 1475039 1325508
14679A325508k23679k59490O3994K05953K6442n38071O10026k64368R4545j27565
$$ 1325508 1101829 842339 906333 1112286 1138728 600657 1210683 946315 1040860 913295
14669I13295K74878n16795J13282K07112j91097M20616p9688m16060L97436l77187
$$ 913295 1188173 671378 784660 991772 800675 1221291 1141603 725543 1122979 745792
14659G45792K29629q4136M78772j15770p0548j13111j91214O4903M45580j92309
$$ 745792 975421 891285 1370057 1254287 1183739 1070628 879414 944317 1389897 1197588
14649A197588K18947l99189O9242J38056o4670k51169L31351J62446k34750j55153
$$ 1197588 1416535 1017346 1086588 1224644 1159974 908805 1240156 1402602 1167852 1012699
14639A012699K8708L62769n379k03094J49505j61049L33178k7741k30252j72405
$$ 1012699 1041407 1404176 1398797 1195703 1345208 1184159 1517337 1489596 1259344 1086939
14629A086939P4158K25093r0279L1616m2681K15978J09946m34199L99643n76654
$$ 1086939 1161097 1386190 1295911 1327527 1284846 1500824 1610770 1176571 1576214 999560
14619I99560N74611n04885L81723m45565M35806j91727K47406j14859L08087l97449
$$ 999560 1574171 1069286 1451009 1005444 1441250 1249523 1496929 1382070 1690157 1292708
14609A292708J09722N9764j35869n741J44983r0301K51069K6737j98291j31085
$$ 1292708 1402430 1462194 1326325 1320584 1465567 1375266 1626335 1653072 1454781 1323696
14599A323696J77429K402J0210O0122m78255K55469L66624l81443L22004j89024
$$ 1323696 1501125 1503527 1513737 1573859 1095604 1351073 1717697 1336254 1658258 1469234
14589A469234L56406m11242l4572Q6222K84071M202j49904k5946l00447O86098
$$ 1469234 1825640 1414398 1379826 1466048 1750119 1754321 1604417 1578471 1278024 1964122
14579A964122k90549j08844J33266M30248l97856J92233o7877n18858P19041o7200
$$ 1964122 1673573 1564729 1697995 2128243 1730387 1922620 1854743 1335885 2054926 1987726
14569A987726k76068M77996k03973J94498l74293J94979J08941K53680k32494
$$ 1987726 1711658 2189654 1985681 2180179 1805886 2000865 2109806 2363486 2130992
14560B130992k22974O9626J10611J2457M207j8474O3758j5728K74045J70117J15019
$$ 2130992 1908018 1977644 2088255 2100712 2104919 2086445 2150203 2134475 2408520 2578637 2693656
14549B693656j66196l67896N63118M0510J33045j0324N69881p0681M17243L19560
$$ 2693656 2527460 2159564 2722682 2763192 2896237 2885913 3455794 3385113 3802356 4121916
14539D121916K04943N49879R63036Q85801J029742K488392M000851O447251R323971
$$ 4121916 4326859 4876738 5839774 6725575 7755317 10243709 14244560 20691811 30015782
14530C0015782k48143j2635780p277158k968418j566295k09053L1450o66678j025509
$$ 30015782 29767639 17131859 9854701 6886283 5319988 5110935 5142385 4475707 3450198
14521C450198o16870q4815q8571j95984J80334O6298k97470p0916K56293k31205
$$ 3450198 2833328 2748513 2659942 2463958 2644292 2710590 2413120 2342204 2598497 2367292
14511B367292r8753j79840J65429J38847O2997L30429k0615j81404J8013Q0698
$$ 2367292 2268539 2088699 2254128 2392975 2455972 2786401 2765786 2584382 2602395 2683093
14501B683093k37535M34013K0929k47343K00905O0960L11329m05751J07142K28022
$$ 2683093 2445558 2879571 2900500 2653157 2854062 2915022 3226351 2820600 2927742 3155764
14491C155764k84135K38507k48421K95890l3328J63388L6199Q2820j66319j65453
$$ 3155764 2871629 3110136 2861715 3157605 3124277 3287665 3323864 3406684 3240365 3074912
14481C074912N47928m2545N600r5471q6137l1673L7087K29092K14721N6615j54125
$$ 3074912 3622840 3580295 3585895 3490424 3404287 3372614 3409701 3638793 3853514 3910129 3756004
14470C756004k39669M65561k30047L71056k02441k26823L79141L3805L8480o8775
$$ 3756004 3516335 3981896 3751849 4122905 3920464 3693641 4072782 4106587 4145067 4076292
14460D076292J78805k75484L70261l9067k4530L55487l65498o0385M02355J69331
$$ 4076292 4255097 3979613 4349874 4310807 4286277 4641764 4276266 4215881 4618236 4787567
14450D787567m06123L20702j33228K78214j34114J37519P3736K9047M34268j27946
$$ 4787567 4381444 4702146 4568918 4847132 4713018 4850537 4924273 4953320 5387588 5259642
14440E259642j5896k36002M64214J36160O7305m7826j34379K72839J2819L8016
$$ 5259642 5243746 5007744 5471958 5608118 5675423 5627597 5493218 5766057 5778876 5816892
14430E816892R489K61461J58317j57986N1539M14573k12579K08883P1568M79165
$$ 5816892 5826381 6087842 6246159 6088173 6139712 6554285 6341706 6550589 6622157 7101322
14420G101322l46332K0785L81232M2329J09772P1974l96433K81370K52006l1932
$$ 7101322 6754990 6775775 7157007 7199336 7309108 7381082 6984649 7266019 7518025 7486093
14410G486093J98832N1277J09504N2011L92310j45460M79424J08863J39026J48167
$$ 7486093 7684925 7736202 7845706 7897717 8290027 8144567 8623991 8732854 8871880 9020047
14400I020047n6389K1198p6136K50716r739L32483N9780K34103J75685L48754
$$ 9020047 8963658 8984856 8908720 9159436 9149697 9482180 9541960 9776063 9951748 10300502
14390A0300502j17104M95841M1905O406J85815M32506j04306q7104N15299k66159
$$ 10300502 10183398 10679239 10721144 10727550 10913365 11345871 11241565 11154461 11669760 11403601
14380A1403601M28058M06212J76366J93200P1957j5043L47280N60637K24194K07787
$$ 11403601 11831659 12237871 12414237 12607437 12679394 12664351 13011631 13572268 13796462 14004249
14370A4004249J94014o9354M54924L31206L42380K90629L40299M26231j24604
$$ 14004249 14198263 14128909 14583833 14915039 15257419 15548048 15888347 16314578 16189974
14361A6189974N16846O9208N23996M65042K17784O32768M14127j58233O41275
$$ 16189974 16706820 16776028 17300024 17765066 17982850 18615618 19029745 18871512 19512787
14352A9512787M29409M90942M41117N22682M82007J64772N14568K58976M14047
$$ 19512787 19942196 20433138 20874255 21396937 21878944 22043716 22558284 22817260 23231307
14343B3231307N83023N46486M02263J127393L41659N31894Q55212O82349L31817
$$ 23231307 23814330 24360816 24763079 25890472 26232131 26764025 27619237 28301586 28633403
14334B8633403Q27609R12551P83453P38166J068577M91225J071605P09981J197625
$$ 28633403 29461012 30373563 31157016 31895182 32963759 33454984 34526589 35236570 36434195
14325C6434195P62447J481750Q69889J273392J389974Q77371J509074J608716
$$ 36434195 37196642 38678392 39548281 40821673 42211647 43089018 44598092 46206808
14317D6206808R49205J453532J607694J648964J733685K013655J757987J945445
$$ 46206808 47156013 48609545 50217239 51866203 53599888 55613543 57371530 59316975
14309E9316975K016104K164962K214151K429304K496144K701669K885039K987666
$$ 59316975 61333079 63498041 65712192 68141496 70637640 73339309 76224348 79212014
14301G9212014K906196L257272L791616L257578L727965M090356M307378M704148
$$ 79212014 82118210 85375482 89167098 92424676 96152641 100242997 104550375 109254523
14293A09254523M671310N100017N542381N875645O175457O081424O752617P746765
$$ 109254523 113925833 119025850 124568231 130443876 136619333 142700757 149453374 157200139
14285A57200139P632231P985521Q451129R107450R654808J0681240J0548352J1104655
$$ 157200139 164832370 172817891 181269020 190376470 200031278 210712518 221260870 232365525
14277B32365525J1627354J2697713J3262864J3678279J3983750J3974800J4468910
$$ 232365525 243992879 256690592 269953456 283631735 297615485 311590285 326059195
14270C26059195J4419691J3583733J3383390J3174194J1848674J1375527J0644334
$$ 326059195 340478886 354062619 367446009 380620203 392468877 403844404 414488738
14263D14488738R479925Q569797Q129217P492782N901418M114150J155832j84263
$$ 414488738 423968663 432538460 440667677 448160459 454061877 458176027 459331859 459147596
14255D59147596R05031l796338p741370q086199j0904776j1229621j2834228j3615998
$$ 459147596 460052627 456256289 448514919 440428720 429523944 418294323 405460095 391844097
14247C91844097j3720013j4189235j4121036j3747426j4212910j4007349j3386108
$$ 391844097 378124084 363934849 349813813 336066387 321853477 307846128 294460020
14240B94460020j3003960j3239504j1938464j2304121j0845506j0702305r806706
$$ 294460020 281456060 268216556 256278092 243973971 233128465 222426160 212619454
14233B12619454j0098787j0153888r626153r428648q406057p756516p472379p488641
$$ 212619454 202520667 192366779 182740626 173311978 164905921 157149405 149677026 142188385
14225A42188385o731020o051246n686160n411544n274950m827696m782884m090447
$$ 142188385 135457365 129406119 123719959 118308415 113033465 108205769 103422885 99332438
14217I9332438m146641l239668m019949l579948l065648l331975k579251k486611
$$ 99332438 95185797 91946129 87926180 84346232 81280584 77948609 75369358 72882747
14209G2882747l320317k262586k057960k406455j959476k314864j680175j840673
$$ 72882747 69562430 67299844 65241884 62835429 60875953 58561089 56880914 55040241
14201E5040241j779722j641414j468962j469311j517245j471445j105214j456876
$$ 55040241 53260519 51619105 50150143 48680832 47163587 45692142 44586928 43130052
14193D3130052q83482j262403j035495j192736j080892r52175j189339l75916
$$ 43130052 42246570 40984167 39948672 38755936 37675044 36722869 35533530 35157614
14185C5157614r23852r76855j335085n05220q05457r61811l89144r44062p68817
$$ 35157614 34233762 33256907 31921822 31416602 30611145 29649334 29260190 28316128 27547311
14176B7547311n54573n07145q68212m12961q23686o87155l15152o38668l70414
$$ 27547311 26992738 26485593 25617381 25204420 24380734 23693579 23378427 22739759 22369345
14167B2369345o13920k49348m05888p82629k11123l41470l75150n63448l17643
$$ 22369345 21755425 21506077 21100189 20317560 20106437 19764967 19389817 18826369 18508726
14158A8508726m52583p809m98700m91823l92588m1670l27549k38116o8148p13803
$$ 18508726 18056143 18048334 17549634 17057811 16665223 16623553 16296004 16057888 15989740 15275937
14148A5275937j53042p4160k78180n85192j15331K8989n87575j62011m74411K80791
$$ 15275937 15122895 15048735 14770555 14185363 14070032 14099021 13511446 13349435 12875024 13155815
14138A3155815o50813K40265k71479n50352j3506J078j58500l32867j70017j27412
$$ 13155815 12505002 12745267 12473788 11923436 11909930 11911008 11752508 11419641 11249624 11122212
14128A1122212m70895p9973j12273j96354J59435l75397p3539k05963m73119K24113
$$ 11122212 10651317 10571344 10459071 10262717 10422152 10046755 9973216 9767253 9294134 9518247
14118I518247j00276L7704j91688j29447l1991l93161j99426N9469m7731k9283
$$ 9518247 9417971 9455675 9263987 9134540 9102549 8709388 8509962 8569431 8521700 8492417
14108H492417p40733l2645O4215K07969l62534q3389q1089J6l96920L73887J31018
$$ 8492417 7751684 7719039 7783254 7991223 7628689 7545300 7464211 7464227 7067307 7441194 7572212
14097G572212l87806k98399K29858m51080j25922J60611l3060o8459l65015O9706
$$ 7572212 7184406 6886007 7115865 6664785 6538863 6699474 6666414 6597955 6232940 6302646
14087F302646L022q4637m72227K67966K2211k61753K70473j57759J08357k90682
$$ 6302646 6305668 6221031 5748804 6016770 6038981 5777228 6047701 5889942 5998299 5707617
14077E707617k41058N6313j60952R0836q0092L7218l05287m4574N0690j27028
$$ 5707617 5466559 5522872 5361920 5452756 5372664 5409882 5104595 5060021 5110711 4983683
14067D983683k16763K52003l8534k27876k51709K36599N9425k03761k67272K63515
$$ 4983683 4766920 5018923 4980389 4752513 4500804 4737403 4796828 4593067 4325795 4589310
14057D589310K916k58124q0578R8466J01512j41617l05896N767L44643j65760
$$ 4589310 4592226 4334102 4253524 4351990 4453502 4311885 4005989 4011756 4356399 4190639
14047D190639K5554P0289r3850K58172l54963l15472L07989j15671l58587J94500
$$ 4190639 4216193 4286482 4192632 4450804 4095841 3780369 4088358 3972687 3614100 3808600
14037C808600q820j33489j32996J75187k46428j30090K28402j75019j4781J58670
$$ 3808600 3799780 3666291 3533295 3708482 3462054 3331964 3560366 3385347 3370566 3529236
14027C529236j19592N9211m756j34253l85140K31047N4392j93518l4157j3669
$$ 3529236 3409644 3468855 3464099 3329846 2944706 3175753 3230145 3036627 3002470 2988801
14017B988801K6994K0435K52517L074l70803j69465M52820k70603l12409N20274
$$ 2988801 3015795 3036230 3288747 3291821 2921018 2751553 3204373 2933770 2621361 3141635
14007C141635l06953m7884k63599K26467J2928n8766o7319J573n98130L93946
$$ 3141635 2834682 2786798 2523199 2749666 2762594 2703828 2636509 2638082 2039952 2433898
13997B433898J43068n7091o2559R9899J82319L3659l07017j50360L53670l01608
$$ 2433898 2576966 2519875 2457316 2557215 2739534 2773193 2466176 2315816 2669486 2367878
13987B367878q0883n6495J3527K59388r8777J66791j16346O28759P801M7272J22618
$$ 2367878 2286995 2230500 2244027 2503415 2404638 2571429 2455083 3083842 3091643 3138915 3261533
13976C261533R65568P02129J612659L363623N670392R978177O269915j0705869
$$ 3261533 4227101 4929230 6541889 9905512 15575904 25554081 31823996 21118127
13968B1118127p517627m289271k465672r23359j084068m26243m28502j50910k73054
$$ 21118127 13600500 9311229 6845557 5922198 4838130 4411887 3983385 3832475 3559421
13959C559421n50472j5265k58217J21333j09520q6194j27112p594k48776Q7436
$$ 3559421 3008949 2993684 2735467 2856800 2747280 2661086 2533974 2526380 2277604 2365040
13949B365040J23481J10020k35326l0272J75156n79878N34254k21155j84169j17463
$$ 2365040 2488521 2598541 2363215 2332943 2508099 1928221 2462475 2241320 2057151 1939688
13939A939688N7906K13591j08363k71736K46756N3931j59203k89098q9945K62065
$$ 1939688 1997594 2211185 2102822 1831086 2077842 2131773 1972570 1683472 1593527 1855592
13929A855592k46254L01808J61078l25717j28480K31430k17737J85787n8946N1149
$$ 1855592 1609338 1911146 2072224 1746507 1618027 1849457 1631720 1817507 1758561 1809710
13919A809710j02158R3898n683j71254J27020J03060k10258R3853P310m29190
$$ 1809710 1707552 1801450 1795767 1624513 1751533 1854593 1644335 1738188 1745498 1316308
13909A316308K20860K30420l93505J11182j28941K35286m8488J12049J82386m43949
$$ 1316308 1537168 1767588 1374083 1485265 1356324 1591610 1543122 1655171 1837557 1393608
13899A393608J1976p4703M3918m0500o4129M08503l95122M35196l67938K61847
$$ 1393608 1405584 1330881 1374799 1334299 1270170 1678673 1283551 1718747 1350809 1612656
13889A612656o41108L26363L6010K246L60596k24749l39763L38267j58088j8357
$$ 1612656 971548 1297911 1333921 1336167 1696763 1472014 1132251 1470518 1312430 1294073
13879A294073p8330n0025J95339n5876k76822J9380M28704k0625j20782j17277
$$ 1294073 1215743 1165718 1361057 1305181 1028359 1047739 1476443 1455818 1335036 1217759
13869A217759j56451J30182J90536j07189O4603j28684l90515P29828j98076l11807
$$ 1217759 1061308 1191490 1382026 1274837 1339440 1210756 820241 1550069 1351993 1040186
13859A040186L10833k16393J58832M6907r7941J7440n13735J38306J50454K01068
$$ 1040186 1351019 1134626 1293458 1340365 1242424 1259864 746129 884435 1034889 1235957
13849A235957k18516K24561k98431M95293m64404K74188j09829j18493j926M0364
$$ 1235957 1017441 1242002 943571 1438864 974460 1248648 1138819 1020326 1018400 1058764
13839A058764k25937M82003n43861P5266L80448J24774r2859j66138K45079n48293
$$ 1058764 832827 1314830 770969 846235 1226683 1351457 1258598 1092460 1337539 789246
13829G89246O6873J43174Q2142j04150J37906l64563K50316k6724j53506j0094
$$ 789246 856119 999293 1081435 977285 1115191 750628 1000944 974220 820714 810620
13819H10620K30132m71680P4112P9807R4605Q6541O8843o7283j82884M39431k95840
$$ 810620 1040752 569072 643184 722991 817596 904137 972980 905697 722813 1162244 866404
13808H66404L8324r4041K52968l47115N65803l63096K19421k39586j46409o4787
$$ 866404 904728 810687 1063655 716540 1282343 919247 1138668 899082 752673 687886
13798F87886K27847q9022J53261K3802l3511k26898k59000O88153n19832M63M20888
$$ 687886 915733 826711 979972 1003774 970263 743365 484365 1172518 652686 653149 1074037
13787A074037k39413j33999J35091O2303k87912j38611M09256r1400p8210K17569
$$ 1074037 834624 700625 835716 898019 610107 471496 880752 789352 711142 928711
13777I28711k71741k6592j62899M79776j60335k4798k13867L7863K37987k97210
$$ 928711 656970 630378 467479 947255 786920 762122 548255 586118 824105 526895
13767E26895L20688k99176J95046k77953N6296N2447N56215m23284J16403j73589
$$ 526895 847583 548407 743453 465500 521796 574243 1130458 707174 823577 649988
13757F49988n3833n6522R2795m9769j04045K01947J68533l88484J87027R0950
$$ 649988 596155 539633 632428 582659 478614 680561 849094 460610 647637 738587
13747G38587l9152N5489K9906j71307R5077L6388k22862J32147j70747M96299
$$ 738587 699435 754924 784830 613523 708600 744988 522126 654273 483526 979825
13737I79825k61193L68280l86957k99705J4054N1035m9460J73792K02240n2174
$$ 979825 718632 1086912 699955 400250 414304 465339 415879 589671 791911 739737
13727G39737L9591o1746K24115o8190C15829J92259M3791j05121J67548o9608
$$ 739737 779328 717582 941697 873507 315829 508088 551879 446758 614306 544698
13717E44698Q8083R0284j44967J6455L7054k25930K01167J06471k48888M8322
$$ 544698 632781 723065 578098 594553 631607 405677 606844 713315 464427 512749
13707E12749j73286J65778R1248o6552n8635K84795p6027K79111m72517J82397
$$ 512749 339463 505241 596489 529937 471302 756097 680070 959181 486664 669061
13697F69061k07432L72291k92345J03590k16141Q5832o6109p6007J9667J42973
$$ 669061 461629 833920 541575 645165 429024 514856 448747 372740 392407 535380
13687E35380J18560k00637k3077N28393m76587J72091A56570M39247B89132M17706
$$ 535380 653940 453303 430226 958619 482032 654123 156570 595817 289132 706838
13677G06838k05055J8131m7136m3545j19235M85639l70949Q3298k214K6265I7534
$$ 706838 501783 519914 472778 429233 309998 795637 424688 507986 505772 532037 97534
13665G33644j95994n2650j6469j26132K38710J0189r0110m2295J83302j51516
$$ 733644 537650 485000 468531 342399 581109 591298 501188 458893 642195 490679
13655D90679k0046h133D43790j10763P3132j56772K2188M62301C28148O7728A90555
$$ 490679 470633 -8133 443790 333027 406159 249387 271575 733876 328148 395876 190555
13643D09346J13623K12356l59555J46144k10151M76482r6086l10570K91919C07990
$$ 409346 522969 735325 375770 521914 311763 788245 692159 381589 673508 307990
13632D95364A58816M78795j58254B4597M68272l5750o913j0605r3531P8440q895
$$ 495364 158816 637611 479357 24597 492869 457119 450206 439601 346070 424510 415615
13621D15615K40208l19278P7970k9513O8111p4092q9905J67589Q7925B09489J92176
$$ 415615 655823 336545 414515 385002 453113 379021 289116 456705 544630 209489 401665
13610D01665r3496M40551B83408K93825B73021d6380C22033q0875J2660K6591
$$ 401665 308169 748720 283408 577233 273021 -46380 322033 241158 253818 280409
13600B80409I4508K79418N8065o8620K21242J45086j54450j07280J878k22935
$$ 280409 94508 373926 431991 363371 584613 729699 575249 467969 469847 246912
13590B46912O32944l56468j77944J15123J43427K0721j15512J75843k87638A16082
$$ 246912 879856 523388 345444 460567 603994 624715 509203 685046 397408 116082
13579C14145J83740B41390A20084J5678N3104H5567L25879K30418A84879M52669
$$ 314145 497885 241390 120084 135762 188866 85567 411446 641864 184879 637548
13569F37548j59313A78281K27805j7033m9414j15748n879J63140o1181M4265L2337
$$ 637548 478235 178281 406086 389053 339639 223891 218012 381152 319971 364236 396573
13558C96573l2063j39133N8167M8255F9044J09942J19840l7831J56900O0721c3353
$$ 396573 364510 225377 283544 331799 69044 178986 298826 260995 417895 478616 -33353
13546B66087m2649A09210P6171m7228J28939M298o0556J56559p1173j16820m4942
$$ 266087 223438 109210 185381 138153 267092 271390 210834 367393 296220 179400 134458
13535A34458L63456B23943K2222d0463B42090J05605R7354A37975M2884l0955
$$ 134458 497914 223943 246165 -40463 242090 347695 445049 137975 180859 149904
13525A49904L40999K479j54429j36113m770a5921A77429R6386c1770B63507J61837
$$ 149904 490903 493382 338953 202840 198070 -15921 177429 273815 -31770 263507 425344
13514D25344j09129m5945j02482J70680m5742J09626K19836B65785J64894N0220
$$ 425344 316215 270270 167788 338468 292726 402352 622188 265785 430679 480899
13504D80899j77996J28956B00467l5219n7097R4048r4698m1205L24145A49686
$$ 480899 302903 431859 200467 165248 108151 202199 107501 66296 390441 149686
13493A00968M6039i0433C27183j1986L1289o4804J2206B8370N21206B30658a0102
$$ 100968 147007 -90433 327183 315197 346486 281682 293888 28370 549576 230658 -10102
13481B29657K24576I3672M47482B42833m3779g1173C75481L17397B24665N8419
$$ 229657 454233 93672 541154 242833 199054 -71173 375481 692878 224665 283084
13471B83084J13995A51106J2835J11481a11946B87648k3920k4370b0005A54559
$$ 283084 397079 151106 163941 275422 -111946 287648 263728 239358 -20005 154559
13460C02695M1072A9198K55597i0136B04441J81628j65168L3693P9472l0223r1354
$$ 302695 343767 19198 274795 -90136 204441 386069 220901 254594 334066 303843 212489
13449B12489m7437a8152A18268K0319J07363J49623A51422J58929P7753j50042
$$ 212489 165052 -18152 118268 138587 245950 395573 151422 310351 388104 238062
13439B38062J41516A43619J64526f7797a8126C23676l5345j39642K65142A05445
$$ 238062 379578 143619 308145 -67797 -18126 323676 288331 148689 413831 105445
13428E07818h1389B42243L9366R5213a38857C38412o0208E4350M7040J77738J34710
$$ 507818 -81389 242243 281609 376822 -138857 338412 278204 54350 101390 279128 413838
13417D13838p2499J38836l8178A66099n4003K64406a48858C59452O8184E8893
$$ 413838 341339 480175 441997 166099 112096 376502 -148858 359452 427636 58893
13406C13781C7821K26505D1979J45949K04988e4903A87818O804J76339A45207
$$ 313781 37821 264326 41979 187928 392916 -54903 187818 194622 370961 145207
13395A25848K25695b21021A77872F477K64752l8563N0216j30270M5471a63397
$$ 125848 351543 -221021 177872 6477 271229 232666 282882 152612 198083 -163397
13384A19835N2777n8874R7563K4608O5489B9416J28466N7568k4854r0417L32450
$$ 119835 172612 113738 211301 235909 301398 29416 157882 215450 190596 100179 432629
13373D32629a08456C1751a06873A60695J82665A50417K23979A48476j9413l4325
$$ 432629 -108456 31751 -106873 160695 343360 150417 374396 148476 129063 94738
13363I4738J97979n1649K47524A61360L24871d2964C42365e6164D48538B14578
$$ 94738 292717 241068 488592 161360 486231 -42964 342365 -56164 448538 214578
13352A15322M19996B32150I9746L3144K14508A59361J34128G5449J59069k4072
$$ 115322 535318 232150 99746 132890 347398 159361 293489 75449 234518 210446
13342B10446b345C60754A19940R3923K1402J74458A39167J45462M6292Q2054H9245
$$ 210446 -2345 360754 119940 213863 235265 409723 139167 284629 330921 412975 89245
13330b8831B61066P0365A54316G0283A8671N84730B45695C324a641B84071j3729
$$ -28831 261066 331431 154316 70283 18671 603401 245695 3324 -1641 284071 270342
13319B70342E6768b8899B69920A28058n5590J49717Q0578a9005B65384c2771C55330
$$ 270342 56768 -28899 269920 128058 72468 222185 302763 -19005 265384 -32771 355330
13307E04930a45598B07806o1348J38316G8314K02009j38040M39452B88404C6362
$$ 504930 -145598 207806 146458 284774 78314 280323 142283 581735 288404 36362
13296a004A99104K4974I8728K10342r6577E0886J71913M24429g4926B40365J0199
$$ -1004 199104 224078 98728 309070 212493 50886 222799 647228 -74926 240365 250564
13285B50564j13477K09473M8423A53327E3665J10734g7707A61173c2580D07088
$$ 250564 137087 346560 394983 153327 53665 164399 -77707 161173 -32580 407088
13274B37264a31214A25556N4504d160B04795Q7188A4758J49323a38453B03026
$$ 237264 -131214 125556 180060 -4160 204795 291983 14758 164081 -138453 203026
13263A22145f5111C15911q5775L3876a90594B5547K66923A39947h3022A00412
$$ 122145 -65111 315911 230136 264012 -190594 25547 292470 139947 -83022 100412
13252A04218L1891L8661a90254D8103J4931i9412C17110d3819A00285J46620M7327
$$ 104218 136109 174770 -190254 48103 63034 -99412 317110 -43819 100285 246905 294232
13241B94232q9906L2403A09756b51178B5027h8650B50751h3766A76958J47194
$$ 294232 204326 236729 109756 -251178 25027 -88650 250751 -83766 176958 324152
13231C24152o4298O1656j56859j3155l9136c6485F378K22323H7303h1219C22030
$$ 324152 259854 321510 164651 151496 112360 -36485 6378 228701 87303 -81219 322030
13219B6857j2677P8456c0408C17724c9845k44527A76896R0423m7968H2750b0615
$$ 26857 14180 92636 -30408 317724 -39845 -284372 176896 267319 219351 82750 -20615
13207a30007f262H2021J65062m8143B0223Q9136k4098J14295e1553D20026i6623
$$ -130007 -6262 82021 247083 198940 20223 109359 85261 199556 -51553 420026 -96623
13195A98648b65054J05551F1312f1626a0552n1157J9299A1858J67543m7167i8986
$$ 198648 -265054 -159503 61312 -61626 -10552 -61709 -42410 11858 179401 132234 -98986
13183C5291Q2131c21511A47182a22341C56007r7948j25469j095K69018a29326
$$ 35291 117422 -321511 147182 -122341 356007 258059 132590 131495 400513 -129326
13172A08559L93467C2297f0100l8652P158B67575J3261j26704P9171h9774k584
$$ 108559 502026 32297 -60100 -98752 -91594 267575 280836 154132 233303 -89774 -92358
13161i2358A26638N617n6389a3137C50731j21814o2350c1727F5076c1382C58053
$$ -92358 126638 132255 75866 -13137 350731 228917 166567 -31727 65076 -31382 358053
13149G1647K07763J52895G1484P2808a26549A6198b00722J3374H043K43159r1860
$$ 71647 279410 432305 71484 144292 -126549 16198 -200722 -187348 8043 251202 159342
13138A59342J53502A48002a97688A6819N2560L74198A53415d7849K020m0975C6387
$$ 159342 312844 148002 -197688 16819 69379 443577 153415 -47849 -45829 -86804 36387
13126C85622A2742Q5699l416f8949A10811d8183I5885J70796G6675b25865B33145
$$ 385622 12742 98441 95025 -68949 110811 -48183 95885 266681 76675 -225865 233145
13114E0279J73581d691B03893d7430a1369D87634A33971K06987p8993f2337k70425
$$ 50279 223860 -4691 203893 -47430 -11369 487634 133971 340958 261965 -62337 -332762
13103c32762G3880B5237O7772k8988q615K78043G1122a43520A25450J24270p7811
$$ -332762 73880 25237 93009 64021 55406 333449 71122 -143520 125450 249720 171909
13092A71909P4574H246L03623D9726K19000g5595j01420e5368B47689h4227q4123
$$ 171909 246483 8246 311869 49726 268726 -75595 -177015 -55368 247689 -84227 -168350
13081a68350H8859b57977D3371a20005A97983f9759A54951b94043B02163m2256
$$ -168350 88859 -257977 43371 -120005 197983 -69759 154951 -294043 202163 159907
13071A59907b78503N3114d8196F608K68782K828j24268J71017C4180M41492E2831
$$ 159907 -278503 -225389 -48196 6608 275390 278218 153950 324967 34180 475672 52831
13059b0088B08454M0969I1762J88769a6001k56517J23139N8171A05095e2693j41922
$$ -20088 208454 249423 91762 280531 -16001 -272518 -149379 -91208 105095 -52693 -194615
13048a94615A07919J8791a16185B5813K01558N3299D862e0845B66383j13458a32393
$$ -194615 107919 126710 -116185 25813 227371 280670 4862 -50845 266383 152925 -132393
13036A46061k1033R7515J42102o8532A11770c1864a033I3800J36741k0653c47739
$$ 146061 125028 222543 364645 296113 111770 -31864 -1033 93800 230541 209888 -347739
13024A77284a88482l984L2230B03213J28394G7432B6220K49259A08585J13150
$$ 177284 -188482 -192466 -160236 203213 331607 77432 26220 275479 108585 221735
13014B21735c27228A57251a0442k88444E6960J28869a7886j80586E3752K71841
$$ 221735 -327228 157251 -10442 -298886 56960 185829 -17886 -198472 53752 325593
13004C25593j62630K19417p8630J31022b15765B58216f9378B12990o1099J38246
$$ 325593 162963 382380 303750 434772 -215765 258216 -69378 212990 151891 290137
12994B90137b31234G9794a04469C84617r8514b06136P9927D9031L70878k06336
$$ 290137 -231234 79794 -104469 384617 286103 -206136 -126209 49031 419909 213573
12984B13573e4073C45443I3562a19369F5839K64257g279k47735A43129a0719A0881
$$ 213573 -54073 345443 93562 -119369 65839 330096 -7279 -255014 143129 -10719 10881
12972B40340A11888a23820C53765j69688b11215B18654E1091j180N5898h338B87563
$$ 240340 111888 -123820 353765 184077 -211215 218654 51091 49911 105809 -8338 287563
12960d3135H0641a85120E1105c2637q0315M3572n0057m0237B80794a71831A59362
$$ -43135 80641 -185120 51105 -32637 -112952 -69380 -119437 -159674 280794 -171831 159362
12948A75852f4226B70387a91915C12959A11111l9184d5123a840k39301A18570
$$ 175852 -64226 270387 -191915 312959 111111 71927 -45123 -1840 -241141 118570
12937A0235P6675a79894D0302L689b286B0129c3232Q106B36636l1626b99612a38249
$$ 10235 86910 -179894 40302 43991 -2286 20129 -33232 -25126 236636 205010 -299612 -138249
12924E46J52370a72104c0203j90426a4517A75363a31716I0707a22497d5661j48669
$$ 546 152916 -172104 -30203 -220629 -14517 175363 -131716 90707 -122497 -45661 -194330
12913a94330R4984B57642b3492j85316i3956F0675J33723B8012J07271F5686J28287
$$ -194330 -99346 257642 -23492 -208808 -93956 60675 194398 28012 135283 65686 193973
12902A93973f362A89302J08960A38184P7058j973n834A01507f6249l84321c6195
$$ 193973 -6362 189302 298262 138184 215242 213269 207435 101507 -66249 -450570 -36195
12890c2773A33577b76284A0057c77024B4039c4057B92529n6827h2013a5239j43058
$$ -32773 133577 -276284 10057 -377024 24039 -34057 292529 235702 -82013 -15239 -158297
12879a58297C18547c161A23232J51875p3740q7376i9145A87620m9291o637j6652
$$ -158297 318547 -3161 123232 275107 201367 113991 -99145 187620 138329 131692 115040
12868A15040a4652B4230b1101b148j6041C1272c4943B54477a91325A29415J28934
$$ 115040 -14652 24230 -21101 -2148 -18189 31272 -34943 254477 -191325 129415 258349
12857B58349A97L00902a17107A62036A1504L3572b94039A23773a46798K9611C84016
$$ 258349 197 301099 -117107 162036 11504 45076 -294039 123773 -146798 -117187 384016
12845b11206H0558b0451A27169g1015A1835Q6740j5955a16625D6411J57755l8400
$$ -211206 80558 -20451 127169 -71015 11835 98575 82620 -116625 46411 204166 165766
12834A65766b58583n421J05298a9958Q585A16057a02285G4657a53157A28162e7647
$$ 165766 -258583 -264004 -158706 -19958 -11373 116057 -102285 74657 -153157 128162 -57647
12822B08130A02687c3823p026A06079b83890A39918b7037j33789j68873a05668
$$ 208130 102687 -33823 -40849 106079 -283890 139918 -27037 -160826 -329699 -105668
12811a40721A67207d2464k9692C9031J24209c35620P2112B85276j09702M6956
$$ -140721 167207 -42464 -72156 39031 163240 -335620 -263508 285276 175574 222530
12801B22530d2340L153j0455a004p0646D7362K4835h914j26902b9929k39921J17575
$$ 222530 -42340 -39187 -49642 -1004 -71650 47362 72197 -8914 -135816 -29929 -269850 -152275
12789a52275C56189a80034A25069A0536b6038k88178A07141C4656a70635B01479
$$ -152275 356189 -180034 125069 10536 -26038 -314216 107141 34656 -170635 201479
12778A33406c6021F253c01963J17118f0380H6913A1207J30020l3886c30735D96381
$$ 133406 -36021 6253 -301963 -184845 -60380 86913 11207 141227 107341 -330735 496381
12766b80404g1302o5377f4006A35118J08667g0948A20640c16005a02211A84764
$$ -280404 -71302 -136679 -64006 135118 243785 -70948 120640 -316005 -102211 184764
12755C0733R3752D8630p487N0695J51619b8038j71603B7976c36384J36280C00972
$$ 30733 124485 48630 41143 91838 243457 -28038 -199641 27976 -336384 -200104 300972
12743b77864N2376P3869c3311n3687B41376F9241f6554F4971b13962A88210a11571
$$ -277864 -225488 -151619 -33311 -86998 241376 69241 -66554 64971 -213962 188210 -111571
12731g0512C05542j03374i4710A55733m9272J93301I6480A2418a32130b3958l8609
$$ -70512 305542 202168 -94710 155733 106461 299762 96480 12418 -132130 -23958 -62567
12720f2567K8386E154c839B88369A31234K2925G4583b5816j40534B85317a83898
$$ -62567 -34181 5154 -3839 288369 131234 154159 74583 -25816 -166350 285317 -183898
12708G5882c30265J38091B0637R1302d5144j06893H2777J99861j03837o8640a01058
$$ 75882 -330265 -192174 20637 111939 -45144 -152037 82777 282638 178801 110161 -101058
12696B73333n8542c0107j11524A61823E1093j5382b02340B30333p8361a6255l6385
$$ 273333 214791 -30107 -141631 161823 51093 35711 -202340 230333 151972 -16255 -52640
12685e2640A23933C1429P6170n2219J7875k1625a6096A78274k2621B5426L0694
$$ -52640 123933 31429 107599 55380 73255 51630 -16096 178274 155653 25426 56120
12674E6120a49884A80904c9571B61527J82a21891A77003Q366Q227E5794K74512
$$ 56120 -149884 180904 -39571 261527 261709 -121891 177003 185369 193596 55794 330306
12663C30306a6336F5852K28132g2417E274b54456k2363A3921a74899r6544a7522
$$ 330306 -16336 65852 293984 -72417 5274 -254456 -276819 13921 -174899 -271443 -17522
12651D5674J35754o5566a32616B46169G0611g0520E4491M2305b5682A77501b9839
$$ 45674 181428 115862 -132616 246169 70611 -70520 54491 96796 -25682 177501 -29839
12639B23577b43871D7991j3100J42848C4056J85824n8788P939d9895A43755l9649
$$ 223577 -243871 47991 34891 177739 34056 219880 161092 169031 -49895 143755 104106
12628A04106a57017H9147K5636N4381A8543a00421i812F5485a18088D6198K11012
$$ 104106 -157017 89147 114783 169164 18543 -100421 -9812 65485 -118088 46198 257210
12617B57210J00073h9953A47140k69M7298q3748J24331i7244B59948a41493D3253
$$ 257210 357283 -89953 147140 146871 194169 110421 234752 -97244 259948 -141493 43253
12605E1935J51425a09866G2036j4220K86335i1088b2618q1427J9D6183J05832
$$ 51935 203360 -109866 72036 57816 344151 -91088 -22618 -104045 -104026 46183 152015
12594A52015g0721E8250a63626M9125d1419l01570J42120C84699j92227k3477
$$ 152015 -70721 58250 -163626 -114501 -41419 -342989 -200869 384699 192472 168995
12584A68995e6819A13822b43115i8146B66J3228O1734j8623N0881J02350g2253
$$ 168995 -56819 113822 -243115 -98146 266 13494 75228 56605 107486 209836 -72253
12572F8894e8351B23478A1715J64139a90526A65094J557g2048l22723A64610c6884
$$ 68894 -58351 223478 11715 175854 -190526 165094 166651 -72048 -394771 164610 -36884
12560A76892q457D130a9849k52587g5771m3044C20206C4489a43279L8017F2655
$$ 176892 168435 4130 -19849 -272436 -75771 -118815 320206 34489 -143279 -105262 62655
12548F2390a67457A86148F3088L6517B5754Q5195J44675a97012P3137A42624a15827
$$ 62390 -167457 186148 63088 99605 25754 110949 255624 -197012 -123875 142624 -115827
12536a08915B62647A6171L90841i3426l57390A06310i4151o2900A79125f4065
$$ -108915 262647 16171 407012 -93426 -450816 106310 -94151 -157051 179125 -64065
12525C26129r8559I7564j6780a66896k2499N0387m9942D82067a15552H4371b48546
$$ 326129 227570 97564 80784 -166896 -189395 -139008 -188950 482067 -115552 84371 -248546
12513B60214a47592J1002j45419D4140K41007c1399j58542A74479a25657J0455
$$ 260214 -147592 -136590 -282009 44140 285147 -31399 -189941 174479 -125657 -115202
12503a15202A40006f3663A09535n1220j2229M68653b41027E8855a43480E8414
$$ -115202 140006 -63663 109535 58315 46086 514739 -241027 58855 -143480 58414
12492A6908J81009a80478a4227j23125D3684f8535m8754A7262M7224k6767a24596
$$ 16908 197917 -180478 -14227 -137352 43684 -68535 -117289 17262 64486 37719 -124596
12480c0788F453f3815o9397m519L7553C42853e762E9273a891C11570A45641K0270
$$ -30788 6453 -63815 -133212 -137731 -100178 342853 -5762 59273 -1891 311570 145641 165911
12468A65911e1807B89467d9117C16334h6739G0556K04817a55703L6007H4965d4236
$$ 165911 -51807 289467 -49117 316334 -86739 70556 275373 -155703 -119696 84965 -44236
12456f6043D9541b94976H85O6965L3463J02351b49608N6604B18280i2752B63600
$$ -66043 49541 -294976 885 67850 101313 203664 -249608 -193004 218280 -92752 263600
12444a81282I4014N4980b2507A64169a53831f3070A52930c13625d0155k53495
$$ -181282 94014 148994 -22507 164169 -153831 -63070 152930 -313625 -40155 -293650
12434b93650B9588b10209A43358f1993A22735b68991p5460B13849g5553j33226
$$ -293650 29588 -210209 143358 -61993 122735 -268991 -344451 213849 -75553 -208779
12424b08779b7533j10795j60296A20230b51267I2605D0422b1298k52038a35712
$$ -208779 -27533 -138328 -298624 120230 -251267 92605 40422 -21298 -273336 -135712
12413d2962A33017a69033A03218b08320A41192e9512D2519A6367b00372a6368
$$ -42962 133017 -169033 103218 -208320 141192 -59512 42519 16367 -200372 -16368
12402e18G8211J62183b30962A46824b62966A20768a16723A85285c24765C56720
$$ -518 78211 240394 -230962 146824 -262966 120768 -116723 185285 -324765 356720
12391A08803B1646F22J88235d0859m4082j2426B27224a55948E43K26382j13243
$$ 108803 21646 622 188857 -40859 -84941 -97367 227224 -155948 543 226925 113682
12380A13682b2944B28263f4710G8700N0111M045e5239o8858A49853b02723a7146
$$ 113682 -22944 228263 -64710 78700 128811 132856 -55239 -124097 149853 -202723 -17146
12368D3523b43758g6641j11442B55100D8009R4660O013p1448l8318J18498R2529
$$ 43523 -243758 -76641 -188083 255100 48009 142669 148682 77234 38916 157414 249943
12357B49943j17599a08869I459b77950M7604E8893J02521b36799R9663M127A31822
$$ 249943 132344 -108869 9459 -277950 -230346 58893 161414 -236799 -137136 -133009 131822
12345E5513a09086A78155a637B4829a62095B91515c24328b3890D9284p661L40978
$$ 55513 -109086 178155 -1637 24829 -162095 291515 -324328 -23890 49284 41623 382601
12334C82601a31187j01001F6981k8837J79256P5140a31490D5699a65941B89413
$$ 382601 -131187 -232188 66981 38144 217400 292540 -131490 45699 -165941 289413
12323b91328B39914a30523A19179K4578b64497d5622l4694j4441D48074j56531
$$ -291328 239914 -130523 119179 143757 -264497 -45622 -80316 -94757 448074 291543
12313B91543b73824B3442a13714A7829R5849a35097A99707K02277C7822K57379
$$ 291543 -273824 23442 -113714 17829 113678 -135097 199707 401984 37822 295201
12303B95201C0507J70496J24679b40956C54151r7864a3765B69267b4042F9993
$$ 295201 30507 201003 325682 -240956 354151 256287 -13765 269267 -24042 69993
12292I2529J7969D0629h3886B01479A912a60233A20398a90307l2947B66896I204
$$ 92529 110498 40629 -83886 201479 1912 -160233 120398 -190307 -223254 266896 9204
12280G1610K57800G0889P1637C2630K52480f4313C40221a22930C3633q230K50210
$$ 71610 329410 70889 142526 32630 285110 -64313 340221 -122930 33633 25403 275613
12269B75613I3085a96665G5879g2562B43748a3893A20416R8670K02095E4046J5426
$$ 275613 93085 -196665 75879 -72562 243748 -13893 120416 219086 421181 54046 69472
12258F9472b9304C25033I4830K95574A26445Q613e4080A52228K7848J30949n9668
$$ 69472 -29304 325033 94830 390404 126445 135058 -54080 152228 180076 311025 251357
12247B51357a51095F1855J85495A14346K10890A07062L8474a98278A09814P8570
$$ 251357 -151095 61855 247350 114346 325236 107062 145536 -198278 109814 188384
12237A88384f1193D3902A6287a27213L8984K576D29725o4401j26020H7870L04566
$$ 188384 -61193 43902 16287 -127213 -88229 -85653 429725 365324 239304 87870 392436
12226C92436d4289A87210i7804b4054C58288j13177k2462n3758D8679g1806B07247
$$ 392436 -44289 187210 -97804 -24054 358288 245111 222649 168891 48679 -71806 207247
12214g770B87072d1574p9717A81001m0672a20291D0720M6794M0927m3571a63519
$$ -7770 287072 -41574 -121291 181001 140329 -120291 40720 87514 128441 84870 -163519
12202C01151F6823a03607A2903L1654M63700H9769L98478h7472i904A73359D3046
$$ 301151 66823 -103607 12903 44557 508257 89769 488247 -87472 -9904 173359 43046
12190B76598c4549B81818a26047j36022K6670G08498A3138b34A59397P3964b3935
$$ 276598 -34549 281818 -126047 -262069 -235399 708498 13138 -234 159397 233361 -23935
12178B5494c1928A36468M98477A66985P1417d481F863f3377D22040B07327O2581
$$ 25494 -31928 136468 634945 166985 238402 -4481 6863 -63377 422040 207327 269908
12167B69908b72672B92820j00312A8893P6123M3053J39970p2209H8181a20065
$$ 269908 -272672 292820 192508 18893 95016 138069 278039 205830 88181 -120065
12156G7181M0587K93857j85831M0045m2791J06731A34365M1522d051B73347A4987
$$ 77181 117768 411625 225794 265839 223048 329779 134365 175887 -4051 273347 14987
12144A32856Q8865O1285g7302K9927j49239I1830b1051A77036a14157D39302j14674
$$ 132856 221721 283006 -77302 -47375 -196614 91830 -21051 177036 -114157 439302 324628
12133C24628j22039b4583C23105b01302H1105a38160A95219o7917n8466J17068
$$ 324628 202589 -24583 323105 -201302 81105 -138160 195219 127302 68836 185904
12123A85904B0410L9869J82444d6465m5399d2220A41602g820B04951i1172D8457
$$ 185904 20410 60279 242723 -46465 -91864 -42220 141602 -7820 204951 -91172 48457
12111b4091D7117M54068a74149A19066K15188A60361P3952a56783A85801p7636
$$ -24091 47117 501185 -174149 119066 334254 160361 234313 -156783 185801 108165
12101A08165J55565j22960P0195a29994A11408J67219J00734c1924j76695c5066
$$ 108165 263730 140770 210965 -129994 111408 278627 379361 -31924 -208619 -35066
12090D78400j23724b31678B1381b21827A11537a14993b8430C3474J98066I8696
$$ 478400 354676 -231678 21381 -221827 111537 -114993 -28430 33474 231540 98696
12079A01914k1665J40864d7570A29802l4449e7147A16252k272a0395j16497a2779
$$ 101914 80249 221113 -47570 129802 95353 -57147 116252 113980 -10395 -126892 -12779
12067e7349B5152K92725F7090b3733p1660a5004D69233C202J81817B256b17763
$$ -57349 25152 317877 67090 -23733 -95393 -15004 469233 3202 185019 2256 -217763
12055C15461M5069c9739B96723n3811Q0530H4136b35876I8126a87974A64104O1794
$$ 315461 360530 -39739 296723 242912 323442 84136 -235876 98126 -187974 164104 225898
12044B25898j01819d9012B80213H374P749d0681m4226B07908a57548L0985A90398
$$ 225898 124079 -49012 280213 8374 16123 -40681 -84907 207908 -157548 -126563 190398
12032d9237m6491k8299B5238K91851a59693e1347A08675C0687j2254J75901a6227
$$ -49237 -95728 -124027 25238 317089 -159693 -51347 108675 30687 18433 194334 -16227
12020b27402C31284A64397O405e5029r794A21435C6732A3509a40212D795b52395
$$ -227402 331284 164397 170802 -55029 -64823 121435 36732 13509 -140212 4795 -252395
12008D1926a01732j18536L767C03361f628k60620R4795E4841O2072K17900b4589
$$ 41926 -101732 -220268 -216501 303361 -6628 -267248 -172453 54841 116913 334813 -24589
11996a64225A76891l7616P0423q6926E915K77415O7616D9295L235J3762a64865
$$ -164225 176891 139275 209698 122772 5915 283330 350946 49295 52530 66292 -164865
11984a14520B16098a06497j25579b7123F3905j9372a13716j52809b3984K340D833
$$ -114520 216098 -106497 -232076 -27123 63905 44533 -113716 -266525 -23984 -21644 4833
11972B72735f6657c1212H0465B8485c6178C59840A30984h2747B09649J37571a29576
$$ 272735 -66657 -31212 80465 28485 -36178 359840 130984 -82747 209649 347220 -129576
11960A86953d2513k55889i8847l2246r5871H9869g0260g648L194r8693j25256
$$ 186953 -42513 -298402 -98847 -131093 -226964 89869 -70260 -7648 -4454 -103147 -228403
11949b28403d528j7099F6606a95616A17621a85118P0414j32791A4333J58102H742
$$ -228403 -4528 -21627 66606 -195616 117621 -185118 -114704 -247495 14333 172435 8742
11937c21758o4592D7170f6467n3352A74283c6523B13970A0867J37300C2536J49426
$$ -321758 -386350 47170 -66467 -119819 174283 -36523 213970 10867 148167 32536 181962
11926A81962n4305a28730D07811o8034b8893C91077g9600A71777d78481a07147
$$ 181962 127657 -128730 407811 339777 -28893 391077 -79600 171777 -478481 -107147
11915B34930h0123j35435c7520E5398f230H6017C5615b46342Q7251e7575A01140
$$ 234930 -80123 -215558 -37520 55398 -6230 86017 35615 -246342 -159091 -57575 101140
11903a14458q9771p7926c3329H2912j7416J13661B7464g3165D9670B1639N4630
$$ -114458 -204229 -282155 -33329 82912 65496 179157 27464 -73165 49670 21639 76269
11892G6269a14772j57240A67809D0136a85156A14573b01854C2582a47103j93235
$$ 76269 -114772 -272012 167809 40136 -185156 114573 -201854 32582 -147103 -340338
11882c40338a14314j25991J03307r1084N0633A93728a82135Q5676A3752b64809
$$ -340338 -114314 -240305 -136998 -228082 -177449 193728 -182135 -96459 13752 -264809
11871a62468N6045B665b09348j51003C36546F8101b34909k7973Q6482c6708N882
$$ -162468 -106423 2665 -209348 -360351 336546 68101 -234909 -262882 -176400 -36708 -30826
11860c0826B11135a31182j3518a1779H6737c13214a17393B20834o9471a51519
$$ -30826 211135 -131182 -144700 -11779 86737 -313214 -117393 220834 151363 -151519
11849B9560c7187j51861e0999A78641d7074j46250a9424D7539b59334b8657A89872
$$ 29560 -37187 -189048 -50999 178641 -47074 -193324 -19424 47539 -259334 -28657 189872
11837A66711L9978H2020i1779b344B23621a50389j82884J61041A92156k0119H688
$$ 166711 206689 82020 -91779 -2344 223621 -150389 -333273 -172232 192156 172037 8688
11825A40043b19785A31704b7042E976a90459J8858A58441a54432p3672h5655k33698
$$ 140043 -219785 131704 -27042 5976 -190459 -171601 158441 -154432 -228104 -85655 -319353
11814c19353b9460Q206K406j91740N1907e5744n2794H7911i2700a7922A24949
$$ -319353 -29460 -21254 -18848 -210588 -158681 -55744 -108538 87911 -92700 -17922 124949
11802D754a65725A27381B3499K11706k4010b6858j63954j9451G8167a43454f5490
$$ 4754 -165725 127381 23499 235205 211195 -26858 -190812 -210263 78167 -143454 -65490
11790B03880b68983h3356A024J23443d8254A62120H0749j5050J12136b46859H2853
$$ 203880 -268983 -83356 1024 124467 -48254 162120 80749 65699 177835 -246859 82853
11778f8361I7559e8783l1953C7092K53539k1231d20823f3848p9627k2360j48128
$$ -68361 97559 -58783 -90736 37092 290631 269400 -420823 -63848 -143475 -165835 -313963
11767c13963A72210b07294a00806b3148k0599a9078A69080a13140E3147a73558
$$ -313963 172210 -207294 -100806 -23148 -43747 -19078 169080 -113140 53147 -173558
11756b33778c6460A91550C6401b05711B57238A16236b64094J07814F6133K0743
$$ -233778 -36460 191550 36401 -205711 257238 116236 -264094 -156280 66133 86876
11746H6876J0932a33510G2160b09900d9404j946a5500B50881a23833A64359e5278
$$ 86876 97808 -133510 72160 -209900 -49404 -51350 -15500 250881 -123833 164359 -55278
11734A5541K58717b41365a0486C04220b4642B22317a24569p3454H1395N6881m2150
$$ 15541 274258 -241365 -10486 304220 -24642 222317 -124569 -198023 81395 138276 96126
11723I6126O0203A4712e0064D0060J60661a99991j92413H0928e9869k22972A8182
$$ 96126 156329 14712 -50064 40060 200721 -199991 -392404 80928 -59869 -282841 18182
11711a72246l6402D8670c6079j56660C1797J63444g8537q8679a7436H4219j1720
$$ -172246 -208648 48670 -36079 -192739 31797 195241 -78537 -167216 -17436 84219 72499
11700G2499J14361b15962f3028D9236J07229N1832F3613d402A56255a14368A04975
$$ 72499 186860 -215962 -63028 49236 156465 208297 63613 -4402 156255 -114368 104975
11688b31653A33991n1696i5413k9160k6588f377j36681A08442O21a9929H5901
$$ -231653 133991 82295 -95413 -124573 -151161 -6377 -143058 108442 109063 -19929 85901
11676B38804j04653D1378b67177J02410b4219j1636k4713A30606b722k5169B57248
$$ 238804 134151 41378 -267177 -164767 -24219 -35855 -60568 130606 -2722 -27891 257248
11664D9738K49790G9056a20002n3954A64314B4341f3275k78107A31241a26115
$$ 49738 299528 79056 -120002 -173956 164314 24341 -63275 -341382 131241 -126115
11653F3323b22556A43274l7383o030K5174I907l89A677a19615E5954g0877C94142
$$ 63323 -222556 143274 105891 99861 125035 9907 9518 1677 -119615 55954 -70877 394142
11640b01315a5019P466G1098a11579j87458A1834b92835B667g5733A47308K32218
$$ -201315 -15019 -7553 71098 -111579 -299037 11834 -292835 2667 -75733 147308 379526
11629C79526a29139N8948D2459a43401c64k97298H2496K45500i3339B63572F510
$$ 379526 -129139 -70191 42459 -143401 -364 -297662 82496 327996 -93339 263572 6510
11617F1138B9720a43755E1523f8236j743o9442k39578A78077i988k47670d6810
$$ 61138 29720 -143755 51523 -68236 -69979 -139421 -378999 178077 -9988 -257658 -46810
11605a09594A27065c50058a24988E983a25816C0431a11224k42902A43161F4691
$$ -109594 127065 -350058 -124988 5983 -125816 30431 -111224 -354126 143161 64691
11594B26998a51663E651K14747f418F0266k1377e4904g88k60704N1077k4858E0894
$$ 226998 -151663 5651 220398 -6418 60266 38889 -54904 -788 -261492 -210415 -235273 50894
11581a6231H0463J2146c9684A05079K1375K48752a94282c5868l1485B2977a19282
$$ -16231 80463 92609 -39684 105079 126454 375206 -194282 -35868 -67353 22977 -119282
11569A64816o4188N8395c2388B33908J23034j24091j02004C6481M6011L04680
$$ 164816 100628 159023 -32388 233908 356942 232851 130847 36481 82492 387172
11559C87172e5841j20758B38330H7303h3130k97998a01792A0758d5320A35948
$$ 387172 -55841 -176599 238330 87303 -83130 -381128 -101792 10758 -45320 135948
11548a12473E0981Q4437N9709M6409L8190F4741a77153f9571H1363J3993b0031
$$ -112473 50981 135418 195127 241536 279726 64741 -177153 -69571 81363 95356 -20031
11536I8445l9978h9063k05831i5061B10341a90817a4503A23059a03117H6710f899
$$ 98445 58467 -89063 -294894 -95061 210341 -190817 -14503 123059 -103117 86710 -6899
11524D8041b99344I9253J15391p0843j3681j7810K10270a56733e8722C843J26864
$$ 48041 -299344 99253 214644 143801 130120 112310 322580 -156733 -58722 3843 130707
11513A30707K50862C2952a03436C7680b7077A75065a22014p589F9812J57291J3127
$$ 130707 381569 32952 -103436 37680 -27077 175065 -122014 -129603 69812 227103 240230
11502B40230e9556C7237j5550Q9131J23537F1371l741a00002C85133A61903N5427
$$ 240230 -59556 37237 21687 110818 234355 61371 57630 -100002 385133 161903 217330
11491B17330i6067I4024h327A47396e8918A73928q1520b42213A1233J59632B1122
$$ 217330 -96067 94024 -8327 147396 -58918 173928 92408 -242213 11233 170865 21122
11479D2200J18318e343C2768J92823i0901K1731k42804c9436B20491C3364K33542
$$ 42200 160518 -5343 32768 225591 -90901 -69170 -311974 -39436 220491 33364 266906
11468B66906d2781B08391G7489J67346l4095F3823L10210A30781M7975a00068
$$ 266906 -42781 208391 77489 244835 210740 63823 374033 130781 178756 -100068
11457c7825j44712C90907D8942j7161j3548J74356b8484A1666K23799d4335A2084
$$ -37825 -182537 390907 48942 31781 18233 192589 -28484 11666 235465 -44335 12084
11445A93247A4309a41426A16932B3273J30054D7260J88324e8836A43945E551a81368
$$ 193247 14309 -141426 116932 23273 153327 47260 235584 -58836 143945 5551 -181368
11433A10194j5214f8846C26508f604A80785A2562C685c04074a045k5427A70361
$$ 110194 94980 -68846 326508 -6604 180785 12562 3685 -304074 -1045 -26472 170361
11421a9233k32218A24525B4650M8787d35775J75754C15762b15505e0731A47250
$$ -19233 -251451 124525 24650 73437 -435775 -260021 315762 -215505 -50731 147250
11410e2674D43686i3957l5936A82825K7253b27471j10158I0045c44703C4271b5252
$$ -52674 443686 -93957 -129893 182825 210078 -227471 -337629 90045 -344703 34271 -25252
11398b2963B41273a79698j83646B1014c34561A75438a57777H1106e9255G9482
$$ -22963 241273 -179698 -363344 21014 -334561 175438 -157777 81106 -59255 79482
11387c58734a48775C12375h2725j60629a6762C176K80335b2372k48536D5737b57710
$$ -358734 -148775 312375 -82725 -243354 -16762 3176 283511 -22372 -270908 45737 -257710
11375a27202j33609D1085P1320g3369B39547G2593a13541j16022q0117A77418
$$ -127202 -260811 41085 112405 -73369 239547 72593 -113541 -229563 -309680 177418
11364B33794a7423A92189e2846A76693F0880j8793J00296a61197A57532J27577
$$ 233794 -17423 192189 -52846 176693 60880 42087 142383 -161197 157532 285109
11354B85109a9378B60954H7141L0833d1267j12019F0137b019B1419b869C5833
$$ 285109 -19378 260954 87141 117974 -41267 -153286 60137 -2019 21419 -2869 35833
11342c94861a71336A63495h6608n0258r9936c3507g528q0863j60813g8136P679
$$ -394861 -171336 163495 -86608 -136866 -236802 -33507 -7528 -88391 -249204 -78136 -70457
11331g0457B03167a66514B85884j32668a18813C3974d2307A4446b60457D1378
$$ -70457 203167 -166514 285884 153216 -118813 33974 -42307 14446 -260457 41378
11320e9468C6031c072j53248A04589D6394f6248H5072a7280E7164h3115j71492
$$ -59468 36031 -3072 -156320 104589 46394 -66248 85072 -17280 57164 -83115 -254607
11309b54607c1979k4925f931j87252h0860A55469a71237c0052l2421l18078a31837
$$ -254607 -31979 -56904 -6931 -194183 -80860 155469 -171237 -30052 -62473 -380551 -131837
11297c45678c9027r9839D7705h9128k02196a34484j08508i1981M688C02517r9926
$$ -345678 -39027 -138866 47705 -89128 -291324 -134484 -242992 -91981 -87293 302517 202591
11286B02591f4420l02700h3410B34815o9377d5172j91301j36477J27881A41911
$$ 202591 -64420 -367120 -83410 234815 165438 -45172 -236473 -372950 -245069 141911
11275a10748I2223a70883D46976g2439e33j08702k25355Q825G6739K22005a38416
$$ -110748 92223 -170883 446976 -72439 -533 -109235 -334590 -325765 76739 298744 -138416
11263A7599R0675c3181l53866j9488f8519A41728E881a25544N7524B8126b50379
$$ 17599 108274 -33181 -387047 -406535 -68519 141728 5881 -125544 -68020 28126 -250379
11251b76384B55650H9266i0520j29768B0008J1746i8173H7921K22859a62524A32436
$$ -276384 255650 89266 -90520 -220288 20008 31754 -98173 87921 310780 -162524 132436
11239a18878k9073c3428j33888l70539a94569C24098q1301e1345k9458A94482
$$ -118878 -147951 -33428 -167316 -537855 -194569 324098 242797 -51345 -80803 194482
11228a91668d7505A48626K488O0105K890a63973g2554E7867e1007A39453J47292
$$ -191668 -47505 148626 151114 211219 214109 -163973 -72554 57867 -51007 139453 286745
11217B86745f0586A70060a20501d4693j08060A36331A0658J9080o583c74902R2012
$$ 286745 -60586 170060 -120501 -44693 -152753 136331 10658 29738 23155 -374902 -282890
11206b82890c0735o97O820l4051k62575f9186L4447j24457G2680a26968c0023
$$ -282890 -30735 -31432 -24612 -58663 -321238 -69186 -34739 -159196 72680 -126968 -30023
11194b05460B834b23953k9735a10265A63759d3277j41005k54823D6365c42580
$$ -205460 2834 -223953 -253688 -110265 163759 -43277 -184282 -439105 46365 -342580
11183B1847M3799f9506m0611B1595K11225c5579D7994d7719j24703j55581C13857
$$ 21847 65646 -69506 -110117 21595 232820 -35579 47994 -47719 -172422 -328003 313857
11171e0793D5848f709C66412a40932A93994b92484Q3645K9005O9579j84778E6080
$$ -50793 45848 -6709 366412 -140932 193994 -292484 -208839 -179834 -110255 -295033 56080
11159a31152r30B05994c63351A79857c9051j0096A10088b11449A32225a92110
$$ -131152 -132082 205994 -363351 179857 -39051 -49147 110088 -211449 132225 -192110
11148a79018J9450N2180e809q9037q0035p5981O8947o2617c880k0784A08617a89102
$$ -179018 -159568 -107388 -5809 -94846 -174881 -250862 -181915 -244532 -3880 -24664 108617 -189102
11135a90905C426a34758A07720f7478A90880J31124a34600A99739d7253I4363
$$ -190905 3426 -134758 107720 -67478 190880 322004 -134600 199739 -47253 94363
11124A19737a16383C3047a32890f4422j48712g1101j96337E7698a87550C02100
$$ 119737 -116383 33047 -132890 -64422 -213134 -71101 -267438 57698 -187550 302100
11113D3808d6265l0043F8844c51484J63640N2806l9533n763H9181R1320m5277
$$ 43808 -46265 -76308 68844 -351484 -187844 -135038 -174571 -180334 89181 180501 135224
11102A35224a74104D695Q5322b05576j46075A5036J52659a83001B20731n7799
$$ 135224 -174104 4695 90017 -205576 -351651 15036 167695 -183001 220731 162932
11092A62932a42595q9649J7584C9389A5056M023a37697A92696J29031j47480a87798
$$ 162932 -142595 -232244 -214660 39389 15056 19079 -137697 192696 321727 174247 -187798
11080A38688j5249J07930A0432c0862B74733o7647i1678j670A72812F5627a5345
$$ 138688 123439 231369 10432 -30862 274733 207086 -91678 -93348 172812 65627 -15345
11068e2483k38160B17046B6769J25258L78573A88533K2456D5314J89846N9907
$$ -52483 -290643 217046 26769 152027 530600 188533 210989 45314 235160 295067
11058B95067C6708M3034L9569J32245D7679L46614a38674A80308G6712N83496
$$ 295067 36708 79742 119311 251556 47679 394293 -138674 180308 76712 660208
11048F60208r1102j49519R1842K03277A88442M93469p7551k77085N9872j11226
$$ 660208 569106 419587 511429 714706 188442 681911 604360 327275 387147 275921
11038B75921M7748P3798L58028C43527O7982K9909l437l4480Q8810K59126o8556
$$ 275921 323669 397467 755495 343527 411509 441418 437981 403501 492311 751437 682881
11027F82881l02961J52994k13114K06365n8220o3978L35380j50091J00767j69884
$$ 682881 379920 532914 319800 526165 467945 403967 739347 589256 690023 520139
11017E20139K28764l10391A20501M96080k21152N3488K43704C38515K26786K22015
$$ 520139 748903 438512 120501 616581 395429 448917 692621 338515 565301 787316
11007G87316A48992M68289j36890J70324C03386j02151K23823K5740q3225A74685
$$ 787316 148992 617281 480391 650715 303386 201235 425058 450798 367573 174685
10996F64626q8566j16258j07743o4982M5319K84164r5486j24168J2874K0302j87736
$$ 664626 576060 459802 352059 287077 332396 616560 521074 396906 409780 430082 242346
10985B42346K20022L3883J44140B28179K93569J67886j49758n1580J41532k96341
$$ 242346 462368 496251 640391 228179 521748 689634 539876 488296 629828 333487
10975C33487J91423J1309J2893J67841j54814K31725k86552O8412M48768m12676
$$ 333487 524910 536219 549112 716953 562139 793864 507312 575724 1024492 611816
10965F11816J37317j50289L53961J315J04201k21007J01093J74736j85382P70195
$$ 611816 749133 598844 952805 954120 1058321 837314 938407 1113143 927761 1697956
10955A697956m30297O65200K3388j77765J77901j04971l83388n17k73618L65280
$$ 1697956 1267659 1932859 1956247 1778482 1956383 1851412 1468024 1467507 1193889 1559169
10945A559169j51691k2308p9575J43372j05632k49679K93230J24496l04027O1706
$$ 1559169 1407478 1385170 1305595 1448967 1343335 1093656 1386886 1511382 1207355 1269061
10935A269061n5620k57260j07072J86306m32115k07527K16919k53777o6032J2364
$$ 1269061 1213441 956181 849109 1035415 603300 395773 612692 358915 292883 305247
10925C05247K2760I3161L29171j2947c2324j06578C83825b6713l3695B31887I7540
$$ 305247 328007 93161 422332 409385 -32324 -138902 383825 -26713 -60408 231887 97540
10913a29573B27619c6491g82H2095K25204l1789a72586j09101a36246j32579c2453
$$ -129573 227619 -36491 -782 82095 307299 275510 -172586 -281687 -136246 -268825 -32453
10901h2565A27429m8717C1809b63925B32296a50231c6293k94819J02402A66130
$$ -82565 127429 78712 31809 -263925 232296 -150231 -36293 -331112 -228710 166130
10890b75091d3791H6221c9961j30043o9715I5831b37854A82713J27893F0069b28436
$$ -275091 -43791 86221 -39961 -170004 -239719 95831 -237854 182713 310606 60069 -228436
10878B43664c10683a38880A7990J26989a02929k01225b1825l26861A04090l7611
$$ 243664 -310683 -138880 17990 144979 -102929 -304154 -21825 -348686 104090 66479
10868F6479g1098A5353b26493j65362c5050A84010a47990j72157B5810R9370b39058
$$ 66479 -71098 15353 -226493 -391855 -35050 184010 -147990 -320147 25810 125180 -239058
10856b56054L8595B6477a37831F1332a81225J2187A80678d9764A88922f2551j46195
$$ -256054 -217459 26477 -137831 61332 -181225 -169038 180678 -49764 188922 -62551 -208746
10845b08746g664B2334A147e5156A78855a38875c0258j83377M710e1881m3063
$$ -208746 -7664 22334 1147 -55156 178855 -138875 -30258 -213635 -208925 -51881 -94944
10834i4944I0545K64062b48029B76585p2441l4346k7772g0014q3372r343M4863
$$ -94944 90545 354607 -248029 276585 204144 169798 142026 -70014 -153386 -162729 -117866
10823a17866C6644J91206dj59482B75655c5942A59342e1861B4046O8998a24547
$$ -117866 36644 227850 -4 -159486 275655 -35942 159342 -51861 24046 93044 -124547
10811I9701a90580B32636b39464A65070g5548k24351A18395E5041e1075p9784
$$ 99701 -190580 232636 -239464 165070 -75548 -299899 118395 55041 -51075 -130859
10801a30859k44505i5958H1330a30007r905j42397I126a6258p5662o7878r3154
$$ -130859 -375364 -95958 81330 -130007 -139912 -282309 9126 -16258 -91920 -159798 -252952
10790b52952L5913D59788B6118b56375a13502k05997B88523A28934B7968h9580
$$ -252952 -217039 459788 26118 -256375 -113502 -319499 288523 128934 27968 -89580
10779e7735H99J1420c24028A7461c30809O1211B22058c48422R5013f02k18094
$$ -57735 899 12319 -324028 17461 -330809 -269598 222058 -348422 -253409 -602 -218696
10768b18696A08222Q4867h5650J8868B96319b03670f8101a0931j27955D87709
$$ -218696 108222 193089 -85650 -66782 296319 -203670 -68101 -10931 -138886 487709
10757A16036b30010A3833R7118d4689j32674K1487A70127E4204J59550a71856
$$ 116036 -230010 13833 110951 -44689 -177363 -155876 170127 54204 213754 -171856
10746a46016K2924j65137N8346o6136J42280o8490A37605b99885F79d42664a60116
$$ -146016 -123092 -288229 -229883 -296019 -153739 -222229 137605 -299885 679 -442664 -160116
10734a12824A06822B6356K81566d3257G6512J31854a83868A67868Q1909a22976
$$ -112824 106822 26356 307922 -43257 76512 208366 -183868 167868 249777 -122976
10723f1830l02891J47481Q8012f4448n2657D0418a13339K0843A41985e6019n2865
$$ -61830 -364721 -217240 -129228 -64448 -117105 40418 -113339 -92496 141985 -56019 -108884
10712a08884n6113j3505A6869L4732F553Q69J32368a55951C9963a21904l00668
$$ -108884 -164997 -178502 16869 51601 6553 7422 139790 -155951 39963 -121904 -422572
10701d22572f7085n8154A88071A391d2732j59925B80414G0458f0767j43950a660
$$ -422572 -67085 -125239 188071 1391 -42732 -202657 280414 70458 -60767 -204717 -1660
10689a53483A24643B4395J5714c28441O7734I6667d7759E0482d2573H5293d12751
$$ -153483 124643 24395 40109 -328441 -260707 96667 -47759 50482 -42573 85293 -412751
10677b52027f8937I7679a17060A99119M0817a03481r811C8438e00630f4514E8907
$$ -252027 -68937 97679 -117060 199119 239936 -103481 -113292 38438 -500630 -64514 58907
10665c1291r5465Q850c5248l3539E679b42730j39895I7083m2438b39987I9203
$$ -31291 -126756 -117906 -35248 -68787 5679 -242730 -382625 97083 54645 -239987 99203
10653B4215g3010D9910a3436A4420a18103B66335A407M1023a84893G8366b8069
$$ 24215 -73010 49910 -13436 14420 -118103 266335 1407 42430 -184893 78366 -28069
10641G3831b46624a18880E3711a91900i1278j50305B38448f0422J6507k20589
$$ 73831 -246624 -118880 53711 -191900 -91278 -241583 238448 -60422 -43915 -264504
10631b64504c3175H047P3951b32213K6120A00606L6991Q6568E5323k7632b57230
$$ -264504 -33175 8047 81998 -232213 -206093 100606 137597 224165 55323 27691 -257230
10619i0032c1387r1210j05468F8776a62338J1243A58506a76623k97555A55062
$$ -90032 -31387 -122597 -228065 68776 -162338 -151095 158506 -176623 -474178 155062
10608A8042c23585J40319C41180e28683b02797A16150a39155b1691j32307j07884
$$ 18042 -323585 -183266 341180 -528683 -202797 116150 -139155 -21691 -153998 -261882
10598b61882g7378c4647l4608c340j30079j18755I1006a34975A05836a75937K7495
$$ -261882 -77378 -34647 -69255 -3340 -133419 -252174 91006 -134975 105836 -175937 -148442
10587a48442A16349d2129N167j80676B58540D3773i7068g898k49548O8972h1580
$$ -148442 116349 -42129 -36962 -217638 258540 43773 -97068 -7898 -257446 -188474 -81580
10575c17023d4252p2241j26677C76095i7711E51c43789A0961b77904J31398q9072
$$ -317023 -44252 -116493 -243170 376095 -97711 551 -343789 10961 -277904 -146506 -235578
10564b35578k4690O2968b1499j79333K477N2743C13965J06087a98335P2674L9347
$$ -235578 -260268 -197300 -21499 -200832 -198355 -145612 313965 420052 -198335 -125661 -86314
10553h6314A83283i8880d944B91240a03907B51388j03430a10462A13090a6514
$$ -86314 183283 -98880 -4944 291240 -103907 251388 147958 -110462 113090 -16514
10542A68046b46545e2107B10847f4341J9196b0085k52673H1462l1189c04005G7990
$$ 168046 -246545 -52107 210847 -64341 -45145 -20085 -272758 81462 50273 -304005 77990
10530e7110p58j3485C1695J9552A3177c5632A0942a79821j2782Q0475c759E3976
$$ -57110 -57868 -71353 31695 51247 13177 -35632 10942 -179821 -192603 -112128 -3759 53976
10517d394k95281J09542P6687P421H6478b84390b8553m58278a00032j09520i1300
$$ -4394 -299675 -190133 -113446 -106025 86478 -284390 -28553 -486831 -100032 -209552 -91300
10505b14241B3490h3910H8820f5740I513b09653b6607A6622a72062I3692M8456
$$ -214241 23490 -83910 88820 -65740 9513 -209653 -26607 16622 -172062 93692 142148
10494A42148b51160d4821k01476B78048d4385G342b40289h6215B37674a78215
$$ 142148 -251160 -44821 -246297 278048 -44385 7342 -240289 -86215 237674 -178215
10483a65311j72421A64886e6195B2799L4554b7428k02883Q1040P0876B6659b6730
$$ -165311 -337732 164886 -56195 22799 57353 -27428 -230311 -149271 -78395 26659 -26730
10471c23088e6212q1658A04239C5828b40685A1592b24418B13355a55378C84132
$$ -323088 -56212 -137870 104239 35828 -240685 11592 -224418 213355 -155378 384132
10460B93038Q9655J9174j78044i5451D6048b8624j34928e7629l1417Q661m1912
$$ 293038 382693 401867 223823 -95451 46048 -28624 -163552 -57629 -89046 -80385 -122297
10449a22297F6535f2326A8469K08144D144J25435C990a15125N1959k25452k6736
$$ -122297 66535 -62326 18469 226613 4144 129579 3990 -115125 -63166 -288618 -315354
10438c15354c0062j26032L6405b443j51032m8745D802g9317L4175o6280I0723
$$ -315354 -30062 -156094 -119689 -2443 -153475 -202220 4802 -79317 -45142 -111422 90723
10426a70327K4071I5761J11762B6043J49589H4203K50961A7229a76410E3813a5666
$$ -170327 -146256 95761 207523 26043 175632 84203 335164 17229 -176410 53813 -15666
10414I1063g1041r1125h207B90824J7969F5067l0426J3237j6557a88768B3675
$$ 91063 -71041 -162166 -8207 290824 308793 65067 34641 47878 31321 -188768 23675
10402A20677R3332f2829l8620j17743q6389d3090N706A70652A6470K17359a69808
$$ 120677 214009 -62829 -101449 -219192 -305581 -43090 -37384 170652 16470 233829 -169808
10390C9442b33843Q4017j02301h7060p8994n55A16455m0796J47973c4056m9465
$$ 39442 -233843 -149826 -252127 -87060 -166054 -166609 116455 75659 223632 -34056 -83521
10379h3521j27617k4342f6120C09423a16474p2809A79542H5472b8713B54733A21575
$$ -83521 -211138 -235480 -66120 309423 -116474 -189283 179542 85472 -28713 254733 121575
10367a7514j67856E6780K4919b12368C69985a75125A15036D2809j9805J39412
$$ -17514 -185370 56780 81699 -212368 369985 -175125 115036 42809 23004 162416
10357A62416J32420j46920A9037P1302N52165a2835A56175M41649j08407I2658
$$ 162416 294836 147916 19037 90339 642504 -12835 156175 597824 489417 92658
10346A55719K33413b1715B0961K0619J07378c297B00214a83555A10746J48772
$$ 155719 389132 -21715 20961 41580 148958 -3297 200214 -183555 110746 259518
10336B59518a32162A92008a1237B07879M1117J30559J67979k69459j02924J06611
$$ 259518 -132162 192008 -11237 207879 248996 379555 547534 278075 175151 281762
10326B81762A22856J90089n1405J2762M5397m4518r8701E6593J50618c6175D9495
$$ 281762 122856 312945 261540 274302 319699 275181 176480 56593 207211 -36175 49495
10314B15990r7035P5715B429J26924b10166M4961C9943J15757J75712K26453A78294
$$ 215990 118955 194670 2429 129353 -210166 -165205 39943 155700 331412 557865 178294
10302H6405J94765j09156K80595i3461A10978d9711C06314F3217J6451j1702i9596
$$ 86405 281170 172014 452609 -93461 110978 -49711 306314 63217 79668 67966 -99596
10290b80879i3552c7397m6487R266n6529A36031J4421A702a91391A15352b2435
$$ -280879 -93552 -37397 -83884 -74618 -131147 136031 150452 1702 -191391 115352 -22435
10278b9474G5415B916a32814N3725i395p5686l8974E7477b90169i4541L5377j24935
$$ -29474 75415 2916 -132814 -79089 -9395 -85081 -124055 57477 -290169 -94541 -59164 -184099
10266a84099p1394h0543D9423g2292B31561n9813E6944P6153b91085G567K18598
$$ -184099 -255493 -80543 49423 -72292 231561 171748 56944 133097 -291085 7567 226165
10255B26165c29254h4414b0483C6983A0363e0695B291c15067O4930j31606i4735
$$ 226165 -329254 -84414 -20483 36983 10363 -50695 2291 -315067 -250137 -381743 -94735
10243a15713G3933a38566K7716G9421l9179J48435E4292K69768d767I4140M6543
$$ -115713 73933 -138566 -110850 79421 40242 188677 54292 324060 -4767 94140 140683
10232A40683k8434R1225a34382B5833e4277A5468d13772B0985i9712j3600j53100
$$ 140683 112249 203474 -134382 25833 -54277 15468 -413772 20985 -99712 -113312 -266412
10221b66412C58447C5754K98223d6942C73973a53073a3279j51543j78844G1922
$$ -266412 358447 35754 333977 -46942 373973 -153073 -13279 -164822 -343666 71922
10210G8676a88124A79787b61310J3639J10298p0188j12376A5711P6054d2540l58174
$$ 78676 -188124 179787 -261310 -247671 -137373 -207561 -319937 15711 91765 -42540 -400714
10199d00714a8755j94148r0028a44739j8772O5120k3896a3897c461n4598A31619
$$ -400714 -18755 -212903 -302931 -144739 -163511 -98391 -122287 -13897 -3461 -58059 131619
10187a58621k6526B10021f9421k7171j33965d6496o895n8912A76926p5405m7860
$$ -158621 -185147 210021 -69421 -96592 -230557 -46496 -53391 -112303 176926 101521 53661
10176E3661a3225k2050l3176G7769K01671d30649J13861q02B05354a14510k95073
$$ 53661 -13225 -35275 -68451 77769 279440 -430649 -316788 -317590 205354 -114510 -409583
10165d09583a37364c8135l8437b2427l03230d5832r3993o8743A66518b60614J07431
$$ -409583 -137364 -38135 -76572 -22427 -325657 -45832 -139825 -208568 166518 -260614 -153183
10154a53183M0959O116r5960B6506M4816a72281l7552k3589L3779c8697C97483
$$ -153183 -112224 -106108 -202068 26506 71322 -172281 -209833 -233422 -199643 -38697 397483
10142H2562a05515H5405D2460Q8464b95527e8645m2516B16611a6315j64113P713
$$ 82562 -105515 85405 42460 130924 -295527 -58645 -101161 216611 -16315 -180428 -172715
10131a72715D7019b73934a6569k70476L352O1191B1420L74094b15512h3432B01447
$$ -172715 47019 -273934 -16569 -287045 -283693 -222502 21420 395514 -215512 -83432 201447
10119b77025C2306a43499B5589K01543a19128l8844G2049d02185d931E616a63724
$$ -277025 32306 -143499 25589 227132 -119128 -157972 72049 -402185 -4931 5616 -163724
10107b2641m8432k61579q4649J27740A29352a67610A63906b9403m3213L5639k64427
$$ -22641 -71073 -332652 -417301 -289561 129352 -167610 163906 -29403 -72616 -36977 -301404
10096c01404A89870b36105A0457b20883b8373j21379k71368A09750b71841A4545
$$ -301404 189870 -236105 10457 -220883 -28373 -149752 -421120 109750 -271841 14545
10085f0915j74504H4457d23093a28485B84399A30074J55400a87753G2299b73292
$$ -60915 -235419 84457 -423093 -128485 284399 130074 285474 -187753 72299 -273292
10074i6329d3931k52488f5038A64145b57132a01022I8638a39287A01823d79171
$$ -96329 -43931 -296419 -65038 164145 -257132 -101022 98638 -139287 101823 -479171
10063d6266j45180J8440A15308K19579a51274q3878A4583c66827h3086A13494
$$ -46266 -191446 -173006 115308 334887 -151274 -235152 14583 -366827 -83086 113494
10052d0768D6851J14433a24303c3898j02608p7728c2292j0359n8019D28006c01437
$$ -40768 46851 161284 -124303 -33898 -136506 -214234 -32292 -42651 -100670 428006 -301437
10040A4652b00143Q7820B54092b0507q8663M6574q8513L9870j6681e9162K3607
$$ 14652 -200143 -112323 254092 -20507 -109170 -62596 -151109 -111239 -127920 -59162 -35555
10029c5555l6868B9931J6319A3706L3236K02355f2768A79059c93676L2750a63123
$$ -35555 -72423 29931 46250 13706 46942 249297 -62768 179059 -393676 -360926 -163123
10017b04792n561a7166r3490j00874B6782h6246H1303e7663j62187g8665j93588
$$ -204792 -210353 -17166 -110656 -211530 26782 -86246 81303 -57663 -219850 -78665 -272253
10006b72253h9597o1910m3423H6260b23212l6233d1032p5782j08854j85374a43389
$$ -272253 -89597 -151507 -194930 86260 -223212 -259445 -41032 -116814 -225668 -411042 -143389
9994A05166g71A18396b34819A20492b83707A06423c34425A62642d60230a13092
$$ 105166 -771 118396 -234819 120492 -283707 106423 -334425 162642 -460230 -113092
9983a32284A1136a69777j44421a49525e4009B5712M7738a14211e5013j08167C6810
$$ -132284 11136 -169777 -314198 -149525 -54009 25712 73450 -114211 -55013 -163180 36810
9971b7505A04809J73844A08249i6743j3107k50778R4334a03295F7563J2141b92688
$$ -27505 104809 278653 108249 -96743 -109850 -360628 -266294 -103295 67563 79704 -292688
9959D4525d0614C08293a80455Q4376A16391m503i30I1620b0421j87975f4577O23
$$ 44525 -40614 308293 -180455 -96079 116391 111888 -930 91620 -20421 -208396 -64577 -63954
9947f3954j22300F1531Q6164a3942o701l35496d728I2963b83388A26463i5217
$$ -63954 -186254 61531 147695 -13942 -20643 -356139 -4728 92963 -283388 126463 -95217
9935c28488e7972j76772A21129C7272a6074n10092b06111A50233b69745B5610
$$ -328488 -57972 -234744 121129 37272 -16074 -526166 -206111 150233 -269745 25610
9924f5658E4942h9759c093E2176B2079L8790a6648I2829l4484c6920I9948b67248
$$ -65658 54942 -89759 -3093 52176 22079 60869 -16648 92829 58345 -36920 99948 -267248
9911e0891a5723j28926I1477b43102A70726d2254D6214N88L13176c30363b90A20614
$$ -50891 -15723 -144649 91477 -243102 170726 -42254 46214 46802 359978 -330363 -290 120614
9898A1650J51996A8563Q9237h1823K5410B9797h0533a0202n6896j91564j835O5465
$$ 11650 163646 18563 107800 -81823 -56413 29797 -80533 -10202 -67098 -258662 -260497 -195032
9886a95032B9039a21176B92104F6149c04954L4881f4915G0462M7378k4993O8610
$$ -195032 29039 -121176 292104 66149 -304954 -270073 -64915 70462 117840 92847 161457
9875A61457a8318C2153e764m38785b0252A05746J16055f1941j03367B9094c02096
$$ 161457 -18318 32153 -5764 -444549 -20252 105746 221801 -61941 -165308 29094 -302096
9863a08137H0642a84696h3826m5737o7189B33188b92542N6615N7645c6526A24758
$$ -108137 80642 -184696 -83826 -129563 -196752 233188 -292542 -235927 -178282 -36526 124758
9851B48967a25800d7355l15332f1387A38848B3340c44672a01478E9314a84680
$$ 248967 -125800 -47355 -362687 -61387 138848 23340 -344672 -101478 59314 -184680
9840b7674I7339b55418G1751h8278M0449e150l6135B72850b0900A68637d56129
$$ -27674 97339 -255418 71751 -88278 -47829 -5150 -41285 272850 -20900 168637 -456129
9828b4309j52874k09635A34491b33657a0009m9425m637F2559a95151m8441C1469
$$ -24309 -177183 -386818 134491 -233657 -10009 -59434 -64071 62559 -195151 -243592 31469
9816c29846b2655r0817H3987C605h5112F9956b08141A71818H649a84933l4311
$$ -329846 -22655 -113472 83987 3605 -85112 69956 -208141 171818 8649 -184933 -219244
9805b19244A15890a19574l25935J55744c5785q98p1439j14412G4554K71187G7397
$$ -219244 115890 -119574 -445509 -289765 -35785 -36683 -108122 -222534 74554 345741 77397
9793b69200J21821j79966E482K69853A28590k0122E746b6435k96589B65895k2142
$$ -269200 -147379 -327345 5482 275335 128590 108468 5746 -26435 -323024 265895 243753
9782B43753a02164p0723e042o4417r1752A39909L3882e6832n2318C7002a65553
$$ 243753 -102164 -172887 -5042 -69459 -161211 139909 173791 -56832 -109150 37002 -165553
9770b43106A94719a03704C7981P325a54730c5936A64822a16036A03614K98858
$$ -243106 194719 -103704 37981 45306 -154730 -35936 164822 -116036 103614 402472
9760D02472H7108J4956K0835d0789j62635R8956C0712b08446p402b300l81842
$$ 402472 87108 102064 122899 -40789 -203424 -104468 30712 -208446 -215848 -2300 -384142
9749c84142c0371C6773h2329B9746L76093a11642M7459A48520A4782h2334L4541
$$ -384142 -30371 36773 -82329 29746 405839 -111642 -64183 148520 14782 -82334 -47793
9738d7793j92073A2260b25124J0009k3964a1349j07022o8109e9634m9956A69524
$$ -47793 -239866 12260 -225124 -215115 -239079 -11349 -118371 -186480 -59634 -109590 169524
9726f2305j25266P8215j72188p074a16437I228J73812m6968a16328A68546a49843
$$ -62305 -187571 -109356 -281544 -288618 -116437 9228 183040 136072 -116328 168546 -149843
9714A46400a69350B02867J1293p5312a945B54237b09335E4902c85188a49850d3710
$$ 146400 -169350 202867 214160 138848 -1945 254237 -209335 54902 -385188 -149850 -43710
9702a5545j02035r7355j90645F9846a39446L4194L8552L2683k77735Q9260l189
$$ -15545 -117580 -214935 -405580 69846 -139446 -105252 -66700 -34017 -311752 -222492 -225681
9691b25681Q1717r4591J02648N7533j72095i7176j05165n1804a02640k27444a51904
$$ -225681 -143964 -238555 -135907 -78374 -250469 -97176 -202341 -254145 -102640 -330084 -151904
9679B53028a55599j6817j096D76617b16787J03487E3699A0220b50259E3044B3110
$$ 253028 -155599 -172416 -173512 476617 -216787 -113300 53699 10220 -250259 53044 23110
9667b94921C98586j71440b28513i5989j78533J9829h2369k6056a8128A14941b53309
$$ -294921 398586 227146 -228513 -95989 -274522 -254693 -82369 -108425 -18128 114941 -253309
9655a14893l885D9928K13149c2729I3537c81027b1128j35793J1025G2315L2487
$$ -114893 -118778 49928 263077 -32729 93537 -381027 -21128 -156921 -145896 72315 104802
9644A04802f0822A15177J36689f9733j35819P8349M5181j80321F4274b20214E5589
$$ 104802 -60822 115177 251866 -69733 -205552 -127203 -82022 -262343 64274 -220214 55589
9632a09453o9219j06287A58416L14l6834a35828A12561b80615f4440j20514A51759
$$ -109453 -178672 -284959 158416 158730 121896 -135828 112561 -280615 -64440 -184954 151759
9620B07454d5153k68737c5666E2016A4533i5878k5590j22284F1627a41373E0842
$$ 207454 -45153 -313890 -35666 52016 14533 -95878 -121468 -243752 61627 -141373 50842
9608B8878c66047d5274C3164O462a07153j9850B71379b53398q1284B25562i3299
$$ 28878 -366047 -45274 33164 39626 -107153 -127003 271379 -253398 -334682 225562 -93299
9596C23590j08791e07945E7596J03123e2582k7292j55094j83293A61560B5239
$$ 323590 214799 -507945 57596 160719 -52582 -79874 -234968 -418261 161560 25239
9585e0626r4464q7315B60391B9173J66359g1640g35l49761G5845J87196g8489
$$ -50626 -145090 -232405 260391 29173 195532 -71640 -735 -350496 75845 263041 -78489
9573d8823j41556b3196I1986K3307h3573J081k215m3806J2749C90464I3112d1391
$$ -48823 -190379 -23196 91986 115293 -83573 -82492 -84707 -128513 -115764 390464 93112 -41391
9560H3591c04584J09720H0338c332F2448M2283Q6826d2730A6511K18968B480e5161
$$ 83591 -304584 -194864 80338 -3332 62448 104731 191557 -42730 16511 235479 2480 -55161
9547b88018I8221e413k44133q8587D9457a27850j45030a20102o2227B35263A9904
$$ -288018 98221 -5413 -249546 -338133 49457 -127850 -272880 -120102 -182329 235263 19904
9535b48934B472a98835A35578a10694C69031A79394a3783A93863g2359J232A72379
$$ -248934 2472 -198835 135578 -110694 369031 179394 -13783 193863 -72359 -71127 172379
9523A53829a23591j2045B10858a99402j70142G0541l370a56179L502P5555j43644
$$ 153829 -123591 -135636 210858 -199402 -369544 70541 67171 -156179 -152677 -77122 -220766
9512b20766j06663a30521B54012b73420A37281a66650B5699P3951e0669G2646
$$ -220766 -327429 -130521 254012 -273420 137281 -166650 25699 99650 -50669 72646
9501g7279b438j48005M1067J1775A1745M8998J34839q6486l9786b4218p6228A7473
$$ -77279 -2438 -150443 -109376 -97601 11745 60743 195582 109096 69310 -24218 -100446 17473
9488A3798J73413a552A13607c82414A5265M3385a0255k80222H989l931b96752
$$ 13798 187211 -1552 113607 -382414 15265 58650 -10255 -290477 8989 5058 -296752
9476d00125H4577a04052j82714a3972k94755C31682f4810K4005r8131f2037k5351
$$ -400125 84577 -104052 -286766 -13972 -308727 331682 -64810 -40805 -138936 -62037 -87388
9465h7388b0200j75658h3501l21234J54707p5237h1735A60499a27919k24952b6780
$$ -87388 -20200 -195858 -83501 -404735 -250028 -325265 -81735 160499 -127919 -352871 -26780
9453g3734k14952K9614A21480i0593k96017h7387n400m3500o5817D8120j2247
$$ -73734 -288686 -259072 121480 -90593 -386610 -87387 -92787 -136287 -202104 48120 35873
9442C5873J36643a92941e2309j32004n825d8844A51581F7146K65965q0226c01983
$$ 35873 172516 -192941 -52309 -184313 -190138 -48844 151581 67146 333111 252885 -301983
9430h6845e771q6075B29583h9862l9509n9674k0145f2160A26825i3062j86882
$$ -86845 -5771 -91846 229583 -89862 -129371 -189045 -209190 -62160 126825 -93062 -279944
9419b79944o2993J02616a05874q8546L3464F5216J9248c1809A19690l8612R188
$$ -279944 -342937 -240321 -105874 -194420 -160956 65216 84464 -31809 119690 81078 90266
9408I0266a73251M3567k11611l0840B45080D136f4019k79193L1703b8736n6535
$$ 90266 -173251 -129684 -341295 -372135 245080 4136 -64019 -343212 -311509 -28736 -85271
9397h5271m63148i9383F086c4520r9069E4000a65343o0193J0242j22431n3314
$$ -85271 -548419 -99383 6086 -34520 -133589 54000 -165343 -225536 -215294 -337725 -391039
9386c91039A021g6004k76296A45437c52354Q0229J32993O0955A45945a13322C29846
$$ -391039 1021 -76004 -352300 145437 -352354 -272125 -139132 -78177 145945 -113322 329846
9374g0299r1532C431Q4964M393b25179N6724M4684j21226B10166d4487J2589C07522
$$ -70299 -161831 3431 88395 92788 -225179 -168455 -123771 -244997 210166 -44487 -31898 307522
9361g2626A61406E2503b8981j39068B01352a43996A18031K327J49485A02347m7986
$$ -72626 161406 52503 -28981 -168049 201352 -143996 118031 120358 269843 102347 54361
9350E4361b58729A16311a96367j0713i1426k66318a41241B3788J25055c9392p3789
$$ 54361 -258729 116311 -196367 -207080 -91426 -357744 -141241 23788 148843 -39392 -113181
9339a13181A79156c32128d6702o1445d5495l20617A79474a9216A00662b34301
$$ -113181 179156 -332128 -46702 -108147 -45495 -366112 179474 -19216 100662 -234301
9328D5767c7766B29915a9089A51361f4200A36518o3638a10376C1416d22728M9422
$$ 45767 -37766 229915 -19089 151361 -64200 136518 72880 -110376 31416 -422728 -373306
9317c73306a40387A03014D2838a65185M1032k54308H5848H607J08809a27610m14401
$$ -373306 -140387 103014 42838 -165185 -124153 -378461 85848 8607 117416 -127610 -542011
9306e42011A74442R1322j11722b05146O8577A34239b9803l65705a18396k37608
$$ -542011 174442 265764 154042 -205146 -136569 134239 -29803 -395508 -118396 -356004
9296c56004A70402F8773a79181J6797f5481C37879A5899J2670b83288D0767b9648
$$ -356004 170402 68773 -179181 -162384 -65481 337879 15899 28569 -283288 40767 -29648
9284G5913a88285M7351B5380O298a33826A16787d13511h5886B86793a89912A35653
$$ 75913 -188285 -140934 25380 31678 -133826 116787 -413511 -85886 286793 -189912 135653
9272a17595j94164d9510F6224h6651J0503B28886f3157k62961D1719J74381a90179
$$ -117595 -311759 -49510 66224 -86651 -76148 228886 -63157 -326118 41719 216100 -190179
9260B33096f1937l59521a88932D2583r69b68387I8927f8693j52727b9280k13850
$$ 233096 -61937 -421458 -188932 42583 41614 -268387 98927 -68693 -221420 -29280 -243130
9249b43130j57283a87506h4130m6681A80270R3317h5387j3123c5027k32358c0666
$$ -243130 -400413 -187506 -84130 -130811 180270 273587 -85387 -98510 -35027 -267385 -30666
9237c58984i646p3355A79670e0788A35387j059b6971q3982j20809j59341J11181
$$ -358984 -9646 -83001 179670 -50788 135387 134328 -26971 -110953 -231762 -391103 -279922
9226b79922d3506j58686R3089A05465e3103A36644c38774I0838c89477a70004
$$ -279922 -43506 -202192 -109103 105465 -53103 136644 -338774 90838 -389477 -170004
9215c74313i080A92920c17258k9833C4239K45019d4606k33792B3839a81540G2970
$$ -374313 -9080 192920 -317258 -347091 34239 279258 -44606 -278398 23839 -181540 72970
9203B28832C9598J35090c6431k19158g5071j92845H4601a32598H7860b74811a33478
$$ 228832 39598 174688 -36431 -255589 -75071 -267916 84601 -132598 87860 -274811 -133478
9191A9588d1515j9342p1296l5235a4453j87203b3A14479J31587b92565J02723
$$ 19588 -41515 -60857 -132153 -167388 -14453 -201656 -23 114479 246066 -292565 -189842
9180a89842l856R4563A15108d27902A60221K5896a51933j40481a39572F5072a27784
$$ -189842 -193698 -99135 115108 -427902 160221 186117 -151933 -292414 -139572 65072 -127784
9168a8265H3908f0297l37454a8473A08906l3210b8011l2027k54586J19915M6685
$$ -18265 83908 -60297 -397751 -18473 108906 75696 -28011 -60038 -314624 -194709 -148024
9157a48024c1744A36621j2740n9071b14666H0936c48535A60405C5845K54530G0883
$$ -148024 -31744 136621 123881 64810 -214666 80936 -348535 160405 35845 290375 70883
9145e0280F0084A8769a89668p5055G451R2378K13923b88531A93381k5271F0419
$$ -50280 60084 18769 -189668 -264723 7451 99829 313752 -288531 193381 168110 60419
9133B26975c8032A31431a5162j25806A58402e0506k34017J11081A82905b93218
$$ 226975 -38032 131431 -15162 -140968 158402 -50506 -284523 -173442 182905 -293218
9122c03711j72146a39907N9327B59111j08006C2674C951L1157c34008D5387I819
$$ -303711 -475857 -139907 -80580 259111 151105 32674 3951 35108 -334008 45387 9819
9110a01619p0688j01788A38146I922a72007D4628b20624N9797P1203A55901a15775
$$ -101619 -172307 -274095 138146 9922 -172007 44628 -220624 -160827 -89624 155901 -115775
9098a3682n4425A8008a98612R6189j17562o193H721a94562E3966b466k67388d4895
$$ -13682 -68107 18008 -198612 -102423 -219985 -226178 8721 -194562 53966 -2466 -269854 -44895
9085b24696h8475K0036l05705B2377g4845C9329c1884I9274L5812h0231p0807
$$ -224696 -88475 -68439 -374144 22377 -74845 39329 -31884 99274 135086 -80231 -151038
9074a51038O2777l15946d2650k40160E5007c09038H3143h1150E0545l096e9824
$$ -151038 -88261 -404207 -42650 -282810 55007 -309038 83143 -81150 50545 47449 -59824
9062C57640l6372B0805b01896p2103E5671c27263k9824J39513O8705D6843a881
$$ 357640 321268 20805 -201896 -273999 55671 -327263 -357087 -217574 -148869 46843 -1881
9050a74848c9023A4766a58823r8338E5110d34694A08983e9528j828j34856J7224
$$ -174848 -39023 14766 -158823 -257161 55110 -434694 108983 -59528 -61356 -196212 -178988
9039a78988k27736D4430Q5320a81198j10862A56470d9391j69809f6497j7479q9667
$$ -178988 -406724 44430 129750 -181198 -292060 156470 -49391 -219200 -66497 -83976 -173643
9028a73643D8648a05801A07536b5216A00497l7763j9053b06255g9718c4379H8209
$$ -173643 48648 -105801 107536 -25216 100497 62734 43681 -206255 -79718 -34379 88209
9016A42445a7798I4877c60892a32430N8520Q099j01692c9787j00865a8250F7412
$$ 142445 -17798 94877 -360892 -132430 -73910 -65811 -167503 -39787 -140652 -18250 67412
9004A44376a26659k11390e1940k02154d2912k59701A03680a7468O646j33173A26800
$$ 144376 -126659 -338049 -51940 -254094 -42912 -302613 103680 -17468 -10822 -143995 126800
8992g005r2644r9175Q0501J9364A75186n5223d2900l68516a47744j4495D7817
$$ -7005 -99649 -198824 -118323 -98959 175186 119963 -42900 -411416 -147744 -162239 47817
8980E2098L1140C125L8949a54874G9803J6939g7811E8017b01295g7174c981A53267
$$ 52098 83238 3125 42074 -154874 79803 96742 -77811 58017 -201295 -77174 -3981 153267
8967b966j44638k888H5039a58112c683j85735k08267A09672b92087a17138c1334
$$ -2966 -147604 -150492 85039 -158112 -3683 -189418 -397685 109672 -292087 -117138 -31334
8955b47049M196O3654A24061A0013a7643m5057l76171K07654h8062i202q4392
$$ -247049 -242853 -179199 124061 10013 -17643 -62700 -438871 -231217 -88062 -9202 -93594
8944i3594B8078K19182H9006b56152I3678M2926C3746a52746R758e1919p8493
$$ -93594 28078 247260 89006 -256152 93678 136604 33746 -152746 -142988 -51919 -130412
8933a30412o7063G7660A0939R160J32315b03649K942A10797b94356B02608a40934
$$ -130412 -197475 77660 10939 20099 152414 -203649 -200707 110797 -294356 202608 -140934
8921A25734a93177A97166a13644a2544B76141O0870j56986l2426J88184A01574
$$ 125734 -193177 197166 -113644 -12544 276141 337011 180025 147599 335783 101574
8910D54523l6542j62176N0394R4749N50279J319750J359530L950488l459252A727987
$$ 454523 417981 255805 306199 400948 951227 2270977 3630507 7580995 4121743 1727987
8899A283253F38655p9175A4977N0253Q4771M38507B47896Q5245A54701g4769A45582
$$ 1283253 638655 559480 14977 65230 150001 588508 247896 333141 154701 -74769 145582
8887h5507A0266O6039i5250k5810d9328j56819M8611E6531k2258r681a3823l169
$$ -85507 10266 76305 -95250 -121060 -49328 -206147 -157536 56531 34273 24592 -13823 -16992
8875a6992n6857o7130A02838b13520A69320l3531a09674A48436b08884c1191k953
$$ -16992 -73849 -140979 102838 -213520 169320 135789 -109674 148436 -208884 -31191 -34144
8864c4144B749b16134g8267j0413j27112P8551A68399Q8663m0833b95498A44628
$$ -34144 2749 -216134 -78267 -88680 -215792 -137241 168399 257062 216229 -295498 144628
8852a63322dn3418I376b37580A91112a44671N6523B83175C7563d6306B16080b08400
$$ -163322 -4 -53422 9376 -237580 191112 -144671 -88148 283175 37563 -46306 216080 -208400
8839A14914a15960H9568c0967j04274b0566l05489L1957c6086j047B19300C1774
$$ 114914 -115960 89568 -30967 -135241 -20566 -326055 -294098 -36086 -37133 219300 31774
$$ [...]
##END NTUPLES=NMR SPECTRUM
##END=
