
##TITLE=AC1201_HPAAH12051_5946609_BgOmYPCmiq
##JCAMPDX= 6.0         $$ Bruker NMR JCAMP-DX V2.0
##DATA TYPE= NMR SPECTRUM
##DATA CLASS= NTUPLES
##ORIGIN= BRUKER
##OWNER= Administrator
$$ 1.72 TOPSPIN		Version 2.1
$$ 2012-04-11 00:38:40.421 -0500  Administrator@TOPSPIN
$$ Compression mode = diff/dup
##.OBSERVE FREQUENCY= 400.13188235
##.OBSERVE NUCLEUS= ^1H
##.ACQUISITION MODE= SIMULTANEOUS (DQD)
##.ACQUISITION SCHEME= undefined
##.AVERAGES= 64
##.DIGITISER RES= 22
##SPECTROMETER/DATA SYSTEM= spect
##.PULSE SEQUENCE= noesygpps1d.comp
##.SOLVENT NAME= COFFEE_meoh
##.SHIFT REFERENCE= INTERNAL, COFFEE_meoh, 1, 14.96846
##AUDIT TRAIL= $$ (NUMBER, WHEN, WHO, WHERE, PROCESS, VERSION, WHAT)
$$ ##TITLE= Audit trail, TOPSPIN		Version 2.1
$$ ##JCAMPDX= 5.01
$$ ##ORIGIN= Bruker BioSpin GmbH
$$ ##OWNER= Administrator
$$ $$ C:\Bruker\TOPSPIN/data/COFFEE/nmr/AC1201_HPAAH12051_5946609_BgOmYPCmiq/12/pdata/1/auditp.txt
$$ ##AUDIT TRAIL=  $$ (NUMBER, WHEN, WHO, WHERE, PROCESS, VERSION, WHAT)
(   1,<2012-04-11 00:38:35.671 -0500>,<Administrator>,<TOPSPIN>,<go>,<TOPSPIN 2.1>,
      <created by zg
	started at 2012-04-11 00:27:04.078 -0500,
	POWCHK enabled, PULCHK disabled,
       configuration hash MD5:
       1A 1E CE 29 27 FD 77 03 67 4E F0 E3 C4 B2 CB 90
       data hash MD5: 64K
       74 88 6C D0 0D 60 AD 19 0D 78 BB EE D8 5F 2C AA>)
(   2,<2012-04-11 00:38:38.546 -0500>,<Administrator>,<TOPSPIN>,<proc1d>,<TOPSPIN 2.1>,
      <Start of raw data processing
       efp LB = 0.3 FT_mod = 6 PKNL = 1 PHC0 = 0 PHC1 = 0 SI = 128K 
       data hash MD5: 128K
       BB 35 60 23 D4 A9 79 77 71 2D 8E 04 DB B1 90 F7>)
(   3,<2012-04-11 00:38:39.671 -0500>,<Administrator>,<TOPSPIN>,<proc1d>,<TOPSPIN 2.1>,
      <pk PHC0 = 30.6134 PHC1 = 0 
       data hash MD5: 128K
       2D 18 58 72 E2 25 1B E7 ED E7 36 AA 92 1A 3C 9F>)
(   4,<2012-04-11 00:38:39.906 -0500>,<Administrator>,<TOPSPIN>,<proc1d>,<TOPSPIN 2.1>,
      <abs ABSG = 1 
       data hash MD5: 128K
       23 03 39 92 68 E7 D9 23 95 D1 1C 1F B3 AF 9C B5>)
(   5,<2012-04-11 00:38:39.984 -0500>,<Administrator>,<TOPSPIN>,<proc1d>,<TOPSPIN 2.1>,
      <abs ABSG = 2 
       data hash MD5: 128K
       F8 F6 6F BF 0A 7B 9F 71 C9 6B B1 88 82 A2 CC DB>)
(   6,<2012-04-11 00:38:40.218 -0500>,<Administrator>,<TOPSPIN>,<proc1d>,<TOPSPIN 2.1>,
      <abs ABSG = 3 
       data hash MD5: 128K
       99 EA DB 67 BE BE FE 6D 0E 39 87 0C C2 CB 5A 25>)
(   7,<2012-04-11 00:38:40.281 -0500>,<Administrator>,<TOPSPIN>,<proc1d>,<TOPSPIN 2.1>,
      <abs ABSG = 4 
       data hash MD5: 128K
       A3 CA 74 A4 6C 47 C4 94 98 ED 6D 99 A8 06 A3 EB>)
(   8,<2012-04-11 00:38:40.328 -0500>,<Administrator>,<TOPSPIN>,<proc1d>,<TOPSPIN 2.1>,
      <abs ABSG = 5 
       data hash MD5: 128K
       D3 BB C3 95 59 14 09 73 18 99 F9 52 C4 DD F6 87>)
$$ ##END=
$$ 
$$ $$ hash MD5
$$ $$ A4 C8 2B E3 86 C6 72 B3 9E 94 0D 8C 3A A5 EC 4B
##$RELAX= 
##$RELAX= 
##$RELAX= 
##$RELAX= 
##$RELAX= 
##$RELAX= 
##$RELAX= 
##$RELAX= 
$$ Bruker specific parameters
$$ [...]
##$TP07= 0
##$TPNAME0= <>
##$TPNAME1= <>
##$TPNAME2= <>
##$TPNAME3= <>
##$TPNAME4= <>
##$TPNAME5= <>
##$TPNAME6= <>
##$TPNAME7= <>
##$TPOAL= (0..7)
0.5 0.5 0.5 0.5 0.5 0.5 0.5 0.5
##$TPOFFS= (0..7)
0 0 0 0 0 0 0 0
##$TUNHIN= 0
##$TUNHOUT= 0
##$TUNXOUT= 0
##$USERA1= <user>
##$USERA2= <user>
##$USERA3= <user>
##$USERA4= <user>
##$USERA5= <user>
##$V9= 5
##$VALIST= <valist>
##$VCLIST= <CCCCCCCCCCCCCCC>
##$VD= 0
##$VDLIST= <DDDDDDDDDDDDDDD>
##$VPLIST= <PPPPPPPPPPPPPPP>
##$VTLIST= <TTTTTTTTTTTTTTT>
##$WBST= 1024
##$WBSW= 4
##$XGAIN= (0..3)
0 0 0 0
##$XL= 0
##$YL= 0
##$YMAX_a= 13116718
##$YMIN_a= -5476388
##$ZGOPTNS= <>
##$ZL1= 120
##$ZL2= 120
##$ZL3= 120
##$ZL4= 120
##$ABSF1= 14.96846
##$ABSF2= -5.58407
##$ABSG= 5
##$ABSL= 3
##$ALPHA= 0
##$AQORDER= 0
##$ASSFAC= 0
##$ASSFACI= 0
##$ASSFACX= 0
##$ASSWID= 0
##$AUNMP= <proc_prof1d_extract.lims>
##$AXLEFT= 0
##$AXNAME= <>
##$AXNUC= <1H>
##$AXRIGHT= 0
##$AXTYPE= 0
##$AXUNIT= <>
##$AZFE= 0.1
##$AZFW= 0.1
##$BCFW= 0
##$BC_mod= 0
##$BYTORDP= 0
##$COROFFS= 0
##$CY= 15
##$DATMOD= 1
##$DC= 0
##$DFILT= <>
##$DTYPP= 0
##$F1P= 0
##$F2P= 0
##$FCOR= 0.5
##$FTSIZE= 131072
##$FT_mod= 6
##$GAMMA= 0
##$GB= 0
##$INTBC= 1
##$INTSCL= 1
##$ISEN= 128
##$LB= 0.3
##$LEV0= 0
##$LPBIN= 0
##$MAXI= 10000
##$MC2= 0
##$MEAN= 0
##$ME_mod= 0
##$MI= 0
##$NCOEF= 0
##$NC_proc= -3
##$NLEV= 6
##$NOISF1= 0
##$NOISF2= 0
##$NSP= 0
##$NTH_PI= 0
##$NZP= 0
##$OFFSET= 14.96846
##$PC= 1
##$PHC0= 30.6134
##$PHC1= 0
##$PH_mod= 1
##$PKNL= yes
##$PPARMOD= 0
##$PPDIAG= 0
##$PPIPTYP= 0
##$PPMPNUM= 2147483647
##$PPRESOL= 1
##$PSCAL= 4
##$PSIGN= 0
##$PYNMP= <proc.py>
##$REVERSE= no
##$SF= 400.130004864075
##$SI= 131072
##$SIGF1= 0
##$SIGF2= 0
##$SINO= 400
##$SIOLD= 131072
##$SPECTYP= <>
##$SREGLST= <1H.CDCl3>
##$SSB= 0
##$STSI= 131072
##$STSR= 0
##$SW_p= 8223.68421052632
##$SYMM= 0
##$S_DEV= 0
##$TDeff= 65536
##$TDoff= 0
##$TI= <>
##$TILT= no
##$TM1= 0
##$TM2= 0
##$TOPLEV= 0
##$USERP1= <user>
##$USERP2= <user>
##$USERP3= <user>
##$USERP4= <user>
##$USERP5= <user>
##$WDW= 1
##$XDIM= 131072
##$YMAX_p= 467737425
##$YMIN_p= -297097932
##$CURPLOT= <Network HP LaserJet P1505>
##$CURPRIN= <$Network HP LaserJet P1505>
##$DFORMAT= <normdp>
##$LAYOUT= <+/1D_H.xwp>
##$LFORMAT= <normlp>
##$PFORMAT= <normpl>
##$SURQMSG= 1
$$ End of Bruker specific parameters
$$ ---------------------------------
##NTUPLES= NMR SPECTRUM
##VAR_NAME=  FREQUENCY,     SPECTRUM/REAL,   SPECTRUM/IMAG
##SYMBOL=    X,             R,               I
##VAR_TYPE=  INDEPENDENT,   DEPENDENT,       DEPENDENT
##VAR_FORM=  AFFN,          ASDF,            ASDF
##VAR_DIM=   131072,        131072,          131072
##UNITS=     HZ,            ARBITRARY UNITS, ARBITRARY UNITS
##FACTOR=    0.0627417313425165, 1,          1
##FIRST=     8223.62146879498, 2098,         -94737
##LAST=      0,             6708,            -95851
##MIN=       0,             -297097932,      0
##MAX=       8223.62146879498, 467737425,    0
$$ Real data points
##PAGE= N=1
##DATA TABLE= (X++(R..R)), XYDATA
$$ [...]
62965C677226Q197m449j7880l0785m2808n3899o3210o9614p3061p4502p4524p2905
$$ 3677226 3685423 3680974 3663094 3632309 3589501 3535602 3472392 3402778 3329717 3255215 3180691 3107786
62953C107786o9569o5153o0251n4659m7891m0090l1956k3953j5978p873J18P549
$$ 3107786 3038217 2973064 2912813 2858154 2810263 2770173 2738217 2714264 2698286 2690413 2690531 2698080
62941B698080J4244K0424K6427L2435L8364M3692M7330M8184M6341M3455M1261
$$ 2698080 2712324 2732748 2759175 2791610 2829974 2873666 2920996 2969180 3015521 3058976 3100237
62930C100237L9885L8278L6244L4847L4315L2729K7963K0437J2593N715j547j1173
$$ 3100237 3140122 3178400 3214644 3249491 3283806 3316535 3344498 3364935 3377528 3383243 3381696 3370523
62918C370523k3321l6415m8971o0535p1131q0482q8065r3565r7054r8711r8534
$$ 3370523 3347202 3310787 3261816 3201281 3130150 3049668 2961603 2868038 2770984 2672273 2573739
62907B573739r6603r3471q9929q6248q2106p7489p3084o9346o5697o1287n6115
$$ 2573739 2477136 2383665 2293736 2207488 2125382 2047893 1974809 1905463 1839766 1778479 1722364
62896A722364n0797m5602m0632l6581l4153l2725l0693k7393k3841k1291j9880
$$ 1722364 1671567 1625965 1585333 1548752 1514599 1481874 1451181 1423788 1399947 1378656 1358776
62885A358776j8933j7820j6162j4028j2284j1964j2918j3854j4075j4290j5172
$$ 1358776 1339843 1322023 1305861 1291833 1279549 1267585 1254667 1240813 1226738 1212448 1197276
62874A197276j6044j5852j4686j3412j2351j1288j0422j0289j0812j1211j0896
$$ 1197276 1181232 1165380 1150694 1137282 1124931 1113643 1103221 1092932 1082120 1070909 1060013
62863A060013r917q696p819p799q431q571p231m882l064k753l609m770n742o397
$$ 1060013 1050096 1041400 1033581 1025782 1017351 1008780 1001549 996667 993603 990850 987241 982471 976729 970332
62849I70332o609o167m967l239j673j069j635k738l470l430k933k706l289m323
$$ 970332 963723 957556 952589 949350 947677 946608 944973 942235 938765 935335 932402 929696 926407 922084
62835I22084m615l503j995j625k236k249j293r83k214l450l064j985k161l407
$$ 922084 917469 913966 911971 910346 908110 905861 904568 903585 901371 897921 894857 892872 890711 887304
62821H87304l909l262k810l026k810j701q52j113j800k071k129k328k470k637
$$ 887304 883395 880133 877323 874297 871487 869786 868934 867821 866021 863950 861821 859493 857023 854386
62807H54386l473m847n478m792l964m235n194n660n367m805m260l934m216m964
$$ 854386 850913 846066 840588 835796 831832 827597 822403 816743 811376 806571 802311 798377 794161 789197
62793G89197n281m699l833l148k203r82o15j621k638k398j694j701j488M90L199
$$ 789197 783916 779217 775384 772236 770033 769051 768436 766815 764177 761779 760085 758384 756896 757386 760585
62778G60585L924K274Q57J460K938L554L400L354L447L571M386O018O991N858
$$ 760585 764509 766783 767640 769100 772038 775592 778992 782346 785793 789364 793750 799768 806759 812617
62764H12617L280J122Q8m87r33o66O57K529M290N694O648P055P159P574Q573R589
$$ 812617 815897 817019 817107 816620 815687 815021 815678 818207 822497 828191 834839 841894 849053 856627 865200 874789
62748H74789R633Q511P490Q343J1304J4402J5579J5169J5377J7326J9857K1437
$$ 874789 884422 892933 900423 908766 920070 934472 950051 965220 980597 997923 1017780 1039217
62736A039217K1978K2282K2875K4222K6918L0695L4258L7098M0426M4999M9142
$$ 1039217 1061195 1083477 1106352 1130574 1157492 1188187 1222445 1259543 1299969 1344968 1394110
62725A394110N0833N1060N3027N7986O3897O8565P2370P7044Q3204R0097R6768
$$ 1394110 1444943 1496003 1549030 1607016 1670913 1739478 1811848 1888892 1972096 2062193 2158961
62714B158961J02419J06234J07759J07206J04907J00871R5084Q7691P8546O7212
$$ 2158961 2261380 2367614 2475373 2582579 2687486 2788357 2883441 2971132 3049678 3116890
62704C116890N3740L8863K3091O268j1459k8997m5151n9632p2726q4385r4137
$$ 3116890 3170630 3209493 3232584 3238852 3227393 3198396 3153245 3093613 3020887 2936502 2842365
62693B842365j01509j06206j08319j08563j07811j06186j03223r9020r4329q9295
$$ 2842365 2740856 2634650 2526331 2417768 2309957 2203771 2100548 2001528 1907199 1817904
62683A817904q3312p6617p0695o6221o1869n6380n0704m6534m3568m0032l5415
$$ 1817904 1734592 1657975 1587280 1521059 1459190 1402810 1352106 1305572 1262004 1221972 1186557
62672A186557l0886k7082k3321j9299j5920j3874j2603j1266r628p619n106k630
$$ 1186557 1155671 1128589 1105268 1085969 1070049 1056175 1043572 1032306 1022678 1015059 1009953 1007323
62660A007323j287j187q27J299N032Q907J1546J2546J2789J4123J7842K3005K7191
$$ 1007323 1006036 1004849 1004022 1005321 1010353 1019260 1030806 1043352 1056141 1070264 1088106 1111111 1138302
62647A138302K9353L0867L3252L6206L8922M2092M7022N3350N9237O3714O7591
$$ 1138302 1167655 1198522 1231774 1267980 1306902 1348994 1396016 1449366 1508603 1572317 1639908
62636A639908P1880P6484Q0705Q4310Q7588R0690R3092R3596R1065Q5494P8049
$$ 1639908 1711788 1788272 1868977 1953287 2040875 2131565 2224657 2318253 2409318 2494812 2572861
62625B572861O9683O0101M8496L4813J9654L428j3485l0009m4805n7469o8470
$$ 2572861 2642544 2702645 2751141 2785954 2805608 2809036 2795551 2765542 2720737 2663268 2594798
62614B594798p7920q5244r0238r3611r6096r7488r6975r4152q9623q4708q0444
$$ 2594798 2516878 2431634 2341396 2247785 2151689 2054201 1957226 1863074 1773451 1688743 1608299
62603A608299p6649p2267o6911o1671n7749n4882n1907m8496m5195m1977l8128
$$ 1608299 1531650 1459383 1392472 1330801 1273052 1218170 1166263 1117767 1072572 1030595 992467
62592I92467l3788l0294k8407k7294k5832k3965k2048j9782j6893j4207j2930
$$ 992467 958679 928385 899978 872684 846852 822887 800839 781057 764164 749957 737027
62581G37027j3130j3742j3907j3526j2706j1488j0100q763p287n481m004l902
$$ 737027 723897 710155 696248 682722 670016 658528 648428 639665 632378 626897 622893 618991
62569F18991n117o138n629l980k782k934l665l459j587J325M049N760O297N814
$$ 618991 613874 607736 602107 598127 595345 592411 588746 585287 583700 585025 589074 594834 601131 606945
62555F06945M702L780L935N238O822P994R041J0455J1875J2586J2898J4093J6842
$$ 606945 611647 615427 619362 624600 631422 639416 648457 658912 670787 683373 696271 710364 727206
62542G27206K0322K3220K5079K6371K7787K9828L2613L5696L8418M0777M3514
$$ 727206 747528 770748 795827 822198 849985 879813 912426 948122 986540 1027317 1070831
62531A070831M6949N0115N1773N2065N2450N3892N5563N5485N2139M5473L6774
$$ 1070831 1117780 1167895 1219668 1271733 1324183 1378075 1433638 1489123 1541262 1586735 1623509
62520A623509K7647J8850J0070Q58q526j7534k6046l3963m0303m3871m4947m5344
$$ 1623509 1651156 1670006 1680076 1680934 1672408 1654874 1628828 1594865 1554562 1510691 1465744 1420400
62508A420400m6319m7283m7112m5889m4512m3242m1553l9080l5884l2064k8001
$$ 1420400 1374081 1326798 1279686 1233797 1189285 1146043 1104490 1065410 1029526 997462 969461
62497I69461k4764k3270k3018k2505k0973j9019j7452j6425j5790j5377j4659
$$ 969461 944697 921427 898409 875904 854931 835912 818460 802035 786245 770868 756209
62486G56209j2980j0592q807q509r042r053q044o631n584m969m167k509m4K315
$$ 756209 743229 732637 723830 715321 706279 697226 689182 682551 676967 671998 667831 665322 665278 667593
62472F67593L677M145M543N340O406P636R115J0685J2232J4214J6926J9230J9496
$$ 667593 671270 675415 679958 685298 691704 699340 708455 719140 731372 745586 762512 781742 801238
62459H01238J8162J7907K0505K4698K8205L0570L2905L5857L9316M3345M7792
$$ 801238 819400 837307 857812 882510 910715 941285 974190 1010047 1049363 1092708 1140500
62448A140500N1307N2347N1132M9409M8177M6623M3439L8273L1768K4772J7631
$$ 1140500 1191807 1244154 1295286 1344695 1392872 1439495 1482934 1521207 1552975 1577747 1595378
62437A595378R858Q59q725j7212k3940l0084l6468m1663m3884m3785m3554m3830
$$ 1595378 1605236 1606095 1597370 1580158 1556218 1526134 1489666 1448003 1404119 1360334 1316780 1272950
62425A272950m3506m2172m0555l8639l5662l2185k9831k8460k5941k1595j7529
$$ 1272950 1229444 1187272 1146717 1108078 1072416 1040231 1010400 981940 955999 934404 916875
62414I16875j5375j3941j1684r499q997r539r194p654o100m856l216j147O09J988
$$ 916875 901500 887559 875875 866376 857379 847840 838646 830992 824892 820036 816820 815673 816282 818270
62400H18270L502M936N619N870O642P781Q135P505P010P340P908Q037P812P403
$$ 818270 821772 826708 832327 838197 844839 852620 860755 868260 875270 882610 890518 898555 906367 913770
62386I13770O691N951N890O458O401M489O35m292r056j2368j3604j3650j4274
$$ 913770 920461 926412 932302 938760 945161 949650 950285 945993 936937 924569 910965 897315 883041
62373H83041j6187j8283j9152j8632j7516j6389j5335j4294j3091j1392r088o656
$$ 883041 866854 848571 829419 810787 793271 776882 761547 747253 734162 722770 713682 707026
62361G07026m800l841l528l320k734j716n92M20J574L108M695N850O710P755Q932
$$ 707026 702226 698385 694857 691537 688803 687087 686495 686915 688489 691597 696292 702142 708852 716607 725539
62346G25539R820J0577J1833J3412J4078J3026J1030R616R496J0166J0593J0022
$$ 725539 735359 745936 757769 771181 785259 798285 809315 818931 828427 838593 849186 859208
62334H59208Q537P109O555O288M730J417j980l371k491q29K42N76P23J121J982
$$ 859208 867745 874854 881409 887697 892427 893844 891864 888493 886002 885173 885415 885991 886714 887835 889817
62319H89817L453N659Q509J1488J3878J5645J8001K2242K7798L2443L5018L6998
$$ 889817 893270 898929 907438 918926 932804 948449 966450 988692 1016490 1048933 1083951 1120949
62307A120949M0418M5099M9291N2479N5882O0111O4096O6822O8721P0413P1246
$$ 1120949 1161367 1206466 1255757 1308236 1364118 1424229 1488325 1555147 1623868 1694281 1765527
62296A765527P0060O6624O1239N3660M3691L2416K1523J1471J538q315j6972k3904
$$ 1765527 1835587 1902211 1963450 2017110 2060801 2093217 2114740 2126211 2127749 2119434 2102462 2078558
62284B078558l0137l6775m3403m8814n2670n5600n8022n9607n9770n8111n4676
$$ 2078558 2048421 2011646 1968243 1919429 1866759 1811159 1753137 1693530 1633760 1575649 1520973
62273A520973n0220m6007m2805m0409l8554l7637l7721l7407l5044l0974k7290
$$ 1520973 1470753 1424746 1381941 1341532 1302978 1265341 1227620 1190213 1155169 1124195 1096905
62262A096905k5147k3530k1077j7984j5287j3227j1262r213p404n924m487k952
$$ 1096905 1071758 1048228 1027151 1009167 993880 980653 969391 960178 952774 946850 942363 939411
62250I39411j507m20J7l98j376k202k547k846l505m243m723n219o006o516n975
$$ 939411 937904 937484 937501 937103 935727 933525 930978 928132 924627 920384 915661 910442 904436 897920 891945
62235H91945m508k841j219M99J969K594K518K501K881L608N086P656J0241J1049
$$ 891945 887437 884596 883377 883876 885845 888439 890957 893458 896339 899947 905033 912689 922930 933979
62221I33979J0185J0114J2584J6225J8427J8740J8983K0428K2363K3633K4354
$$ 933979 944164 954278 966862 983087 1001514 1020254 1039237 1059665 1082028 1105661 1130015
62210A130015K5601K8052L1407L4747L7132L8246L8780M0015M2876M7362N2724
$$ 1130015 1155616 1183668 1215075 1249822 1286954 1325200 1363980 1403995 1446871 1494233 1546957
62199A546957N7885O1672O3147O2048N8856N4399M9394M4141L8259L0831K1273
$$ 1546957 1604842 1666514 1729661 1791709 1850565 1904964 1954358 1998499 2036758 2067589 2088862
62188B088862J0234p85j0802j9927k8424l5834m1618m6276n0916n5743n9634o1410
$$ 2088862 2099096 2098311 2087509 2067582 2039158 2003324 1961706 1915430 1864514 1808771 1749137 1687727
62176A687727o0926n8614n4726m9677m4678m0958l8354l5383l1067k6101k1801
$$ 1687727 1626801 1568187 1513461 1463784 1419106 1378148 1339794 1304411 1273344 1247243 1225442
62165A225442j8440j5251j1916r254q106p921p078m689j657L56P43K41l94j099
$$ 1225442 1207002 1191751 1179835 1170581 1162475 1154554 1147476 1142787 1141130 1141486 1142229 1142470 1142076 1140977
62151A140977j769j728o98M11O02K28K73P65J224K405N690J0420J3715J3913J2623
$$ 1140977 1139208 1137480 1136782 1137193 1137795 1138023 1138296 1139061 1140285 1142690 1148380 1158800 1172515 1186428 1199051
62136A199051J2211J2638J2452J1763J2150J4048J6201J7735J9082K0572K1737
$$ 1199051 1211262 1223900 1236352 1248115 1260265 1274313 1290514 1308249 1327331 1347903 1369640
62125A369640K2457K3417K4745K5379K4590K3296K3051K4281K6127K7637K8782
$$ 1369640 1392097 1415514 1440259 1465638 1490228 1513524 1536575 1560856 1586983 1614620 1643402
62114A643402L0620L4420M0030M5280M8009M8773N0216N3379N5981N5252N1227
$$ 1643402 1674022 1708442 1748472 1793752 1841761 1890534 1940750 1994129 2050110 2105362 2156589
62103B156589M6102M1262L6318L0632K4437J8359J2799P858L296j329o025j0160
$$ 2156589 2202691 2243953 2280271 2310903 2335340 2353699 2366498 2374356 2377652 2376323 2370298 2360138
62091B360138j3407j6428j9911k3317k5372k5554k4209k1689j8387j5325j3418
$$ 2360138 2346731 2330303 2310392 2287075 2261703 2236149 2211940 2190251 2171864 2156539 2143121
62080B143121j2097r972p099n203n102n288m163k566k458l550l112L85M836O887
$$ 2143121 2131024 2121052 2113953 2108750 2103648 2098360 2094197 2091631 2089173 2085623 2082511 2082896 2087732 2094619
62066B094619O014N064O744J0727J4702J7317J9132K1043K2982K4476K5617K6784
$$ 2094619 2100633 2105697 2112441 2123168 2137870 2155187 2174319 2195362 2218344 2242820 2268437 2295221
62054B295221K7898K8629K9160L0095L1662L3557L5647L8220M1372M4534M7043
$$ 2295221 2323119 2351748 2380908 2411003 2442665 2476222 2511869 2550089 2591461 2635995 2683038
62043B683038M8977N1051N3660N6335N8319N9580O0868O2613O4000O3593O0944
$$ 2683038 2732015 2783066 2836726 2893061 2951380 3010960 3071828 3134441 3198441 3262034 3322978
62032C322978N7247N4345N3338N4203N6251N8559O0249O0869O0490N9292N7317
$$ 3322978 3380225 3434570 3487908 3542111 3598362 3656921 3717170 3778039 3838529 3897821 3955138
62021C955138N4856N2721N1702N1818N2616N4059N6591O0165O3713O6054O7157
$$ 3955138 4009994 4062715 4114417 4166235 4218851 4272910 4329501 4389666 4453379 4519433 4586590
62010D586590O8242P0464P3662P6581P8364P9394Q0341Q0649P8751P3963O7463
$$ 4586590 4654832 4725296 4798958 4875539 4953903 5033297 5113638 5194287 5273038 5347001 5414464
61999E414464O1049N5458N0455M5904M1878L8033L3877K9696K6314K3825K1315
$$ 5414464 5475513 5530971 5581426 5627330 5669208 5707241 5741118 5770814 5797128 5820953 5842268
61988E842268J8211J5174J3178J2220J1560J0880J0553J0827J1315J1444J1205
$$ 5842268 5860479 5875653 5888831 5901051 5912611 5923491 5934044 5944871 5956186 5967630 5978835
61977E978835J1216J2083J3739J5293J5617J4054J0892P273M562L391L040K071
$$ 5978835 5990051 6002134 6015873 6031166 6046783 6060837 6071729 6079002 6083564 6086955 6089995 6092066
61965F092066j55k735m369m956n602p070q842r849r699q898q200p967q042q059
$$ 6092066 6091911 6089176 6084807 6079851 6074249 6067179 6058337 6048488 6038789 6029891 6021691 6013724 6005682 5997623
61951E997623p900p671p113n562l009q97p94k186k687j017J277J872O45n94p90
$$ 5997623 5989723 5982052 5974939 5969377 5966368 5965471 5964677 5962491 5959804 5958787 5960064 5961936 5962581 5961987 5961197
61936E961197o69j098j855k564l695n788q366j0615j2673j5347j8691k1786k3958
$$ 5961197 5960528 5959430 5957575 5955011 5951316 5945528 5937162 5926547 5913874 5898527 5879836 5858050 5834092
61923E834092k5509k6975k8267k8945k8895k8475k8258k8880l0723l3413l5941
$$ 5834092 5808583 5781608 5753341 5724396 5695501 5667026 5638768 5609888 5579165 5545752 5509811
61912E509811l7670l8929m0200m1095m0791l9294l7607l6587l6332l6725l7734
$$ 5509811 5472141 5433212 5393012 5351917 5311126 5271832 5234225 5197638 5161306 5124581 5086847
61901E086847l8766l8445l5978l2480l0194l0208l1292l1146k8477k3960j9541
$$ 5086847 5048081 5009636 4973658 4941178 4910984 4880776 4849484 4818338 4789861 4765901 4746360
61890D746360j6946j6475j6837j6143j3313q782m043m50J742L327N272P964J1393
$$ 4746360 4729414 4712939 4696102 4679959 4666646 4657864 4653821 4653371 4655113 4658440 4663712 4671676 4683069
61877D683069J5546K0088K3933K6085K7256K9763L5175M2597M9944N6300O2200
$$ 4683069 4698615 4718703 4742636 4768721 4795977 4825740 4860915 4903512 4953456 5009756 5071956
61866E071956O8169P4228Q0728Q8390R7310J06958J17334J29121J42387J56399
$$ 5071956 5140125 5214353 5295081 5383471 5480781 5587739 5705073 5834194 5976581 6132980
61856F132980J71269J88531K09180K32186K56255K82147L11762L45474L82075
$$ 6132980 6304249 6492780 6701960 6934146 7190401 7472548 7784310 8129784 8511859
61847H511859M21163M63747N10133N58815O08082O57124P04425P46297P78329
$$ 8511859 8933022 9396769 9906902 10465717 11073799 11730923 12435348 13181645 13959974
61838A3959974P97252P99619P79080P27099O37483N10009L50131J66845k8554
$$ 13959974 14757226 15556845 16335925 17063024 17700507 18210516 18560647 18727492 18698938
61829A8698938k23008m03173n57723o79410p66084q20206q46675q50367q35402
$$ 18698938 18475930 18072757 17515034 16835624 16069540 15249334 14402659 13552292 12716890
61820A2716890q06014p66806p21608o72994o23299n75120n29846m86641m44252
$$ 12716890 11910876 11144070 10422462 9749468 9126169 8551049 8021203 7534562 7090310
61811G090310m03485l66542l34304l05704k79821k56902k36745k17701j98479
$$ 7090310 6686825 6320283 5985979 5680275 5400454 5143552 4906807 4689106 4490627
61802D490627j79907j63631j49741j36942j24655j13469j03591r4262q5191p7429
$$ 4490627 4310720 4147089 3997348 3860406 3735751 3622282 3518691 3424429 3339238 3261809
61792C261809p1949o7905o3081n6047m7588m0045l5371l3506l2436l0067k6181
$$ 3261809 3189860 3121955 3058874 3002827 2955239 2915194 2879823 2846317 2813881 2783814 2757633
61781B757633k2263j9370j6809j3343r069n345k966j352L27K048L475M969P231
$$ 2757633 2735370 2716000 2699191 2685848 2676779 2671434 2668468 2667116 2667443 2669491 2672966 2677935 2685166
61768B685166J0152J2765J4457J5632J7084J9202K2000K5312K8726L1776L4674
$$ 2685166 2695318 2708083 2722540 2738172 2755256 2774458 2796458 2821770 2850496 2882272 2916946
61757B916946L8205M2530M6725N0205N3961N9266O5578P1005P4908P8744Q4076
$$ 2916946 2955151 2997681 3044406 3094611 3148572 3207838 3273416 3344421 3419329 3498073 3582149
61746C582149R0990R8961J07925J17592J26788J34704J42269J51101J61541J72688
$$ 3582149 3673139 3772100 3880025 3997617 4124405 4259109 4401378 4552479 4714020 4886708
61736D886708J84047J96060K09177K23468K39037K55946K73727K91938L11208
$$ 4886708 5070755 5266815 5475992 5699460 5938497 6194443 6468170 6760108 7071316
61727G071316L32978L58117L86609M18502M54229M93927N37420N85031O37565
$$ 7071316 7404294 7762411 8149020 8567522 9021751 9515678 10053098 10638129 11275694
61718A1275694O95372P58343Q26841R01416R81248J063942J147241J229555J308036
$$ 11275694 11971066 12729409 13556250 14457666 15438914 16502856 17650097 18879652 20187688
61709B0187688J377204J430141J459649J456968J410632J309058J145139R18540
$$ 20187688 21564892 22995033 24454682 25911650 27322282 28631340 29776479 30695019
61701C0695019O35399L08547m1704l89647p10134r84539j202856j362123j464010
$$ 30695019 31330418 31638965 31597261 31207614 30497480 29512941 28310085 26947962 25483952
61692B5483952j513437j518081j487773j432909j362295j282105j196533j108827
$$ 25483952 23970515 22452434 20964661 19531752 18169457 16887352 15690819 14581992
61684A4581992j021473r36307q55244p80425p12911o51816n95599n43790m96629
$$ 14581992 13560519 12624212 11768968 10988543 10275632 9623816 9028217 8484427 7987798
61675G987798m53721m14338l78528l46518l17317k89683k64267k42814k24987
$$ 7987798 7534077 7119739 6741211 6394693 6077376 5787693 5523426 5280612 5055625
61666E055625k08098j90802j74805j61636j49800j37160j24635j15006j08770
$$ 5055625 4847527 4656725 4481920 4320284 4170484 4033324 3908689 3793683 3684913
61657C684913j03600r7688r1349q5108p8464p1435o5520o1892n9712n7303n4263
$$ 3684913 3581313 3483625 3392276 3307168 3228704 3157269 3091749 3029857 2970145 2912842 2858579
61646B858579n1475m9604m8444m7392m5933m3968m2091m1140m1060m0706l9235
$$ 2858579 2807104 2757500 2709056 2661664 2615731 2571763 2529672 2488532 2447472 2406766 2367531
61635B367531l7243l5912l5408l4849l3580l1898l0461k9570k8997k8274k7107
$$ 2367531 2330288 2294376 2258968 2224119 2190539 2158641 2128180 2098610 2069613 2041339 2014232
61624B014232k5599k4007k2253k0105j7989j7011j7591j8526j8149j6269j4232
$$ 2014232 1988633 1964626 1942373 1922268 1904279 1887268 1869677 1851151 1833002 1816733 1802501
61613A802501j3027j2125j0594q744p929q801j0405j1280j1044j0479j0255j0225
$$ 1802501 1789474 1777349 1766755 1758011 1750082 1741281 1730876 1719596 1708552 1698073 1687818 1677593
61601A677593j0074r961j0088j0131r650q680p391n676l857l160m305n992o202
$$ 1677593 1667519 1657558 1647470 1637339 1627689 1619009 1611618 1605942 1602085 1598925 1594620 1588628 1582426
61588A582426m951m172m721n285m791m024l776l261j741l22k83q78n99L87J082
$$ 1582426 1577475 1573303 1568582 1563297 1558506 1554482 1550706 1547445 1545704 1545382 1545099 1544221 1543622 1544009 1545091
61573A545091J890L687N340M955L371L502N797P204N548K430M03l05o66n46M17
$$ 1545091 1546981 1550668 1556008 1560963 1564334 1567836 1573633 1580837 1586385 1588815 1589218 1588913 1588247 1587701 1588118
61558A588118J183O78l68p77j086k452m383n516n942o713p696q037q267r665j1613
$$ 1588118 1589301 1589979 1589611 1588834 1587748 1585296 1580913 1575397 1569455 1562742 1555046 1547009 1538742 1529077 1517464
61543A517464j2063j0789r785r875r240o433k853p89n20q25j086j421j498q07
$$ 1517464 1505401 1494612 1484827 1474952 1465712 1459279 1456426 1455637 1455117 1454292 1453206 1451785 1450287 1449480
61529A449480L94J606L095N381Q018J0046J1265J2215J3198J4341J6270J9453
$$ 1449480 1449874 1451480 1454575 1459956 1467974 1478020 1489285 1501500 1514698 1529039 1545309 1564762
61517A564762K2977K5189K5779K6237K7964L0753L3601L6114L8521M0763M2364
$$ 1564762 1587739 1612928 1638707 1664944 1692908 1723661 1757262 1793376 1831897 1872660 1915024
61506A915024M3143M3597M4459M5962M7509M8082M7167M5224M3112M1152L9129
$$ 1915024 1958167 2001764 2046223 2092185 2139694 2187776 2234943 2280167 2323279 2364431 2403560
61495B403560L7036L5244L3790L2032K9434K6396K3858K2125K0305J7104J2189
$$ 2403560 2440596 2475840 2509630 2541662 2571096 2597492 2621350 2643475 2663780 2680884 2693073
61484B693073O746K470k00k466n340p952q592p397o628p748r394r301p286m917
$$ 2693073 2699819 2702289 2702089 2699623 2694283 2686331 2677739 2670342 2663714 2655966 2646572 2637271 2629985 2625068
61470B625068k860k02L513P324J0528J3967J8800K4899L1247L7176M2495M7257
$$ 2625068 2622208 2622006 2625519 2632843 2643371 2657338 2676138 2701037 2732284 2769460 2811955 2859212
61458B859212N2274N8972O7744P7103Q5629R4103J04351J16537J29164J41693
$$ 2859212 2911486 2970458 3038202 3115305 3200934 3295037 3399388 3515925 3645089 3786782
61448C786782J55304J70816J87428K04126K20992K38270K55360K71590K86936
$$ 3786782 3942086 4112902 4300330 4504456 4725448 4963718 5219078 5490668 5777604
61439E777604L00862L11147L15006L11007K99054K78933K49883K11509J64504
$$ 5777604 6078466 6389613 6704619 7015626 7314680 7593613 7843496 8055005 8219509
61430H219509J10819N3928j537n1612r4936j32347j64441j90064k07384k15973
$$ 8219509 8330328 8384256 8382719 8331107 8236171 8103824 7939383 7749319 7541935 7325962
61420G325962k17398k13858k06745j96656j84452j71387j57888j43039j26183
$$ 7325962 7108564 6894706 6687961 6491305 6306853 6135466 5977578 5834539 5708356
61411E708356j08431r1470p5293n8591m1360k5361j1518J326J4190K6262L6608
$$ 5708356 5599925 5508455 5433162 5374571 5333211 5307850 5296332 5297658 5311848 5338110 5374718
61400E374718M6022N5442O3695O8914P1502P3751P6709P9284Q0359Q0067P8761
$$ 5374718 5420740 5476182 5539877 5608791 5680293 5754044 5830753 5910037 5990396 6070463 6149224
61389F149224P6340P3000O9571O6687O4589O3683O4195O5240O5452O4621O3540
$$ 6149224 6225564 6298564 6368135 6434822 6499411 6563094 6627289 6692529 6757981 6822602 6886142
61378F886142O2232N9714N5651N0801M5408L8617L0169K1406J3823P557J889l736
$$ 6886142 6948374 7008088 7063739 7114540 7159948 7198565 7228734 7250140 7263963 7271520 7273409 7269673
61366G269673r760j6492k3383k9227l3691l7634m1337m3522m3020m0404l7014
$$ 7269673 7259913 7243421 7220038 7190811 7157120 7119486 7078149 7034627 6991607 6951203 6914189
61355F914189l3238k8780k3921j9353j5144j0933o878l657j758j326k343m342
$$ 6914189 6880951 6852171 6828250 6808897 6793753 6782820 6775942 6772285 6770527 6769201 6766858 6762516
61343F762516o403p998r474j1141j2370j2253j0704q163m667J78O701J5357K6981
$$ 6762516 6756113 6748115 6738641 6727500 6715130 6702877 6692173 6684010 6679343 6679521 6686222 6701579 6728560
61330F728560M1966N9362P7544R5652J13944J33061J53608J76156K00742K26269
$$ 6728560 6770526 6829888 6907432 7003084 7117028 7250089 7403697 7579853 7780595 8006864
61320H006864K50895K73088K92173L08053L20599L29029L31525L25799L10315
$$ 8006864 8257759 8530847 8823020 9131073 9451672 9780701 10112226 10438025 10748340
61311A0748340K84666K48880K03317J49797R1909L3353k3713p8158j28569j73401
$$ 10748340 11033006 11281886 11485203 11635000 11726909 11760262 11736549 11658391 11529822 11356421
61301A1356421k12027k44774k72085k94274l11700l24422l32033l34498l32873
$$ 11356421 11144394 10899620 10627535 10333261 10021561 9697139 9365106 9030608 8697735
61292H697735l28394l21171l10569k96672k80719k64130k47529k30507k12007
$$ 8697735 8369341 8048170 7737601 7440929 7160210 6896080 6648551 6418044 6206037
61283F206037j91527j70280j50412j32461j14726r6000p7813o2391m9370l6394
$$ 6206037 6014510 5844230 5693818 5561357 5446631 5350631 5272818 5210427 5161057 5124663
61273E124663k2565r251K413J2871K2642L1316L8771M5782N2609N8221O1759O3666
$$ 5124663 5102098 5092847 5095260 5108131 5130773 5162089 5200860 5246642 5299251 5357472 5419231 5482897
61261E482897O4619O4478O3065O0808N7726N2975M6576M0485L6478L3677K9827
$$ 5482897 5547516 5611994 5675059 5735867 5793593 5846568 5893144 5933629 5970107 6003784 6033611
61250F033611K4557J9611J5816J1661N463k516j0988j9482k8056l5926m1849m5864
$$ 6033611 6058168 6077779 6093595 6105256 6110719 6108203 6097215 6077733 6049677 6013751 5971902 5926038
61238E926038m9409n3400n7178n9952o2375o5785p0239p4333p6797p7314p5817
$$ 5926038 5876629 5823229 5766051 5706099 5643724 5577939 5507700 5433367 5356570 5279256 5203439
61227E203439p2198o7217o2547n8980n5311m9994m3438l7490l2913k8704k4083
$$ 5203439 5131241 5064024 5001477 4942497 4887186 4837192 4793754 4756264 4723351 4694647 4670564
61216D670564k0046j8255j9027k1117k3077k4237k4491k3830k2422k0908k0009
$$ 4670564 4650518 4632263 4613236 4592119 4569042 4544805 4520314 4496484 4474062 4453154 4433145
61205D433145j9620j8610j5992j2046p650k765L459J0990J8701K6352L5411M6842
$$ 4433145 4413525 4394915 4378923 4366877 4359227 4356462 4359921 4370911 4389612 4415964 4451375 4498217
61193D498217N9354P1255Q2941R5763J09110J20815J30077J37740J43457J44961
$$ 4498217 4557571 4628826 4711767 4807530 4916640 5037455 5167532 5305272 5448729 5593690
61183E593690J40812J31727J18138R8497P1574L8885L190l4073p2017j08125j39019
$$ 5593690 5734502 5866229 5984367 6082864 6154438 6193323 6196513 6162440 6090423 5982298 5843279
61172E843279j63155j81052j93149j99163j99529j95773j89149j80207j69809
$$ 5843279 5680124 5499072 5305923 5106760 4907231 4711458 4522309 4342102 4172293
61163D172293j59159j48501j37152j25301j14430j05383r7117q8274p9005p0392
$$ 4172293 4013134 3864633 3727481 3602180 3487750 3382367 3285250 3196976 3117971 3047579
61153C047579o2858n5992m9400m2833l6092k9468k3736j8882j3523o763r8M028
$$ 3047579 2984721 2928729 2879329 2836496 2800404 2770936 2747200 2728318 2714795 2708032 2707934 2711962
61141B711962N433O510R005J1937J3437J3309J2504J1025P968L524n87l076m509
$$ 2711962 2717395 2723905 2732910 2744847 2758284 2771593 2784097 2795122 2803090 2806614 2806027 2802951 2798442
61128B798442o287r066j2719j6955k1157k4150k5202k5179k5832k7888l0545l2863
$$ 2798442 2792155 2783089 2770370 2753415 2732258 2708108 2682906 2657727 2631895 2604007 2573462 2540599
61116B540599l4739l6183l6609l5609l3932l2860l2908l3627l4486l5227l5589
$$ 2540599 2505860 2469677 2433068 2397459 2363527 2330667 2297759 2264132 2229646 2194419 2158830
61105B158830l5441l5227l5559l6307l6679l6288l5417l4181l2389l0431k9392
$$ 2158830 2123389 2088162 2052603 2016296 1979617 1943329 1907912 1873731 1841342 1810911 1781519
61094A781519k9628l0146k9989k9528k9584l0178l1042l2472l4354l5131l3421
$$ 1781519 1751891 1721745 1691756 1662228 1632644 1602466 1571424 1538952 1504598 1469467 1436046
61083A436046l0197k7663k6191k4300k1609j9468j8109j5710j1497p610o054n676
$$ 1436046 1405849 1378186 1351995 1327695 1306086 1286618 1268509 1252799 1241302 1233692 1227638 1221962
61071A221962m115j346J028K836N132P554Q475P822P425Q370J0014J1751J3642
$$ 1221962 1217847 1216501 1217529 1220365 1225497 1233051 1241526 1249348 1256773 1265143 1275157 1286908 1300550
61058A300550J4979J4475J2607J1699J2739J3964J3682J2736J2845J3974J4753
$$ 1300550 1315529 1330004 1342611 1354310 1367049 1381013 1394695 1407431 1420276 1434250 1449003
61047A449003J4464J3205J0947P668L849p8m053p578r461r193p720o161m741l599
$$ 1449003 1463467 1476672 1487619 1495287 1499136 1499058 1495005 1487427 1477966 1468773 1461053 1454892 1450151 1446552
61033A446552l361m041m639m762n418p109q518q473p816p808p851o661m816m149
$$ 1446552 1443191 1439150 1434511 1429749 1424331 1417222 1408704 1400231 1392415 1384607 1376756 1370095 1365279 1361130
61019A361130n096o404p168p565p763p572p061o458n680m851m574m670l623p37
$$ 1361130 1356034 1349630 1342462 1334897 1327134 1319562 1312501 1306043 1300363 1295512 1290938 1286268 1282645 1281908
61005A281908K151K840J897J690K928M195M650N007N799O648P444Q625J0003J0822
$$ 1281908 1284059 1286899 1288796 1290486 1293414 1297609 1302259 1307266 1313065 1319713 1327157 1335782 1345785 1356607
60991A356607J1150J1790J2887J3955J5158J7044J9152K0484K1236K2416K3848
$$ 1356607 1367757 1379547 1392434 1406389 1421547 1438591 1457743 1478227 1499463 1521879 1545727
60980A545727K4371K4069K4500K6544K9493L2360L4606L5760L6170L7828M2435
$$ 1545727 1570098 1594167 1618667 1645211 1674704 1707064 1741670 1777430 1813600 1851428 1893863
60969A893863M8611N3165N5197N6895O0114O4460O8943P3186P6627P8813Q1085
$$ 1893863 1942474 1995639 2050836 2107731 2167845 2232305 2301248 2374434 2451061 2529874 2610959
60958B610959Q5592R2085R8049J02599J07796J15338J24505J34303J45003J56247
$$ 2610959 2696551 2788636 2886685 2989284 3097080 3212418 3336923 3471226 3616229 3772476
60948C772476J66219J74219J81991J91144K01333K12151K24637K39707K57362
$$ 3772476 3938695 4112914 4294905 4486049 4687382 4899533 5124170 5363877 5621239
60939E621239K78442L04444L34388L64852L94761M27359M66023N11618N65734
$$ 5621239 5899681 6204125 6538513 6903365 7298126 7725485 8191508 8703126 9268860
60930I268860O32324P13279Q06415R11119J031846J172427J332152J512522J721442
$$ 9268860 9901184 10614463 11420878 12331997 13363843 14536270 15868422 17380944 19102386
60921A9102386J962453K226110K503500K798684L097892L313552L287909K898725
$$ 19102386 21064839 23290949 25794449 28593133 31691025 35004577 38292486 41191211
60913D1191211K182351J339916O06291J11594j36827j76742m8518J58288K64739
$$ 41191211 43373562 44713478 45319769 45431363 45294536 45117794 45069276 45227564 45492303
60904D5492303P6044m73313j255828k041695k649392l016605l164977l139438
$$ 45492303 45568347 45095034 43839206 41797511 39148119 36131514 32966537 29827099
60896B9827099k985214k749734k477211k198405j931480j688706j476135j290924
$$ 29827099 26841885 24092151 21614940 19416535 17485055 15796349 14320214 13029290
60888A3029290j126626r81100q55871p50206o60520n84436n21268m69016m24290
$$ 13029290 11902664 10921564 10065693 9315487 8654967 8070531 7549263 7080247 6655957
60879F655957l85124l51273l22059k96071k72475k50817k30285k11005j94925
$$ 6655957 6270833 5919560 5597501 5301430 5028955 4778138 4547853 4336848 4141923
60870D141923j83364j74593j65880j57048j49755j44010j37865j30301j22229
$$ 4141923 3958559 3783966 3618086 3461038 3311283 3167273 3029408 2899107 2776878
60861B776878j14662j07799j01914r7271r2989q7561q0800p4053o8426o3934o0305
$$ 2776878 2662216 2554417 2452503 2355232 2262243 2174682 2093882 2019829 1951403 1887469 1827164
60850A827164n7316n4302n0516m6090m1818l8111l4892l2239l0186k8284k6358
$$ 1827164 1769848 1715546 1665030 1618940 1577122 1539011 1504119 1471880 1441694 1413410 1387052
60839A387052k5186k5246k5296k3616k0342j7177j4874j2600r896p749p126p582
$$ 1387052 1361866 1336620 1311324 1287708 1267366 1250189 1235315 1222715 1212819 1205070 1197944 1190362
60827A190362p803o829m513j601N24R92N01M54J136J680J805K305L500M329L717
$$ 1190362 1182559 1175730 1171217 1169616 1170140 1171132 1171633 1172087 1173223 1174903 1176708 1179013 1182513 1186842 1190559
60812A190559K002M01l76n40p19j421k568l347l067k248k247l524m933n086l837
$$ 1190559 1192561 1192962 1192586 1192046 1191327 1189906 1187338 1183991 1180924 1178676 1176429 1172905 1167972 1162886 1159049
60797A159049k091p35j17PL92J684L622N294O558Q377J1313J4326J5856J5604
$$ 1159049 1156958 1156223 1156106 1156113 1156505 1158189 1161811 1167105 1173663 1182040 1193353 1207679 1223535 1239139
60783A239139J4539J3522J2711J1995J1297J0532R905R985J0804J1281J0456R073
$$ 1239139 1253678 1267200 1279911 1291906 1303203 1313735 1323640 1333625 1344429 1355710 1366166 1375239
60771A375239Q635Q880P703M285R54O58L285N764N682L599J836J933L624N545
$$ 1375239 1383874 1392754 1400457 1404742 1405696 1406354 1409639 1415403 1421085 1424684 1426520 1428453 1432077 1437622
60757A437622O490O255N550N000M476L640K651J679J70k390n112o378o131o269
$$ 1437622 1444112 1450367 1455917 1460917 1465393 1469033 1471684 1473363 1473533 1471143 1466031 1459653 1453522 1447253
60743A447253q273j1293j3288j3338j2192j1182j1270j2553j4000j4128j2505
$$ 1447253 1438980 1427687 1414399 1401061 1388869 1377687 1366417 1353864 1339864 1325736 1313231
60732A313231j0226q488p298n999m359k590r93l2P1L53K448O128Q926R478R740
$$ 1313231 1303005 1294517 1287219 1281220 1276861 1274271 1273278 1273246 1273317 1273670 1276118 1282246 1291172 1300650 1310390
60717A310390J2002J4994J5582J3699J2681J4441J7101J8358J8704J9723K1086
$$ 1310390 1322392 1337386 1352968 1366667 1379348 1393789 1410890 1429248 1447952 1467675 1488761
60706A488761K1169J9673J7794J6231J4500J2204R924Q616Q551Q907Q367O360
$$ 1488761 1509930 1529603 1547397 1563628 1578128 1590332 1600256 1608872 1617423 1626330 1634697 1641057
60694A641057L806K186J937K348K901L761M845N466N276M740M245L510K152J64
$$ 1641057 1644863 1647049 1648986 1651334 1654235 1657996 1662841 1668307 1673583 1678323 1682568 1686078 1688230 1688394
60680A688394k271m650n886n425m650n720q595j0705j0243q303o984o853p328
$$ 1688394 1686123 1681473 1675587 1670162 1665512 1659792 1651197 1640492 1630249 1621946 1614962 1608109 1600781
60667A600781q131q999r095q168p411p811q464p816n789l386j070J015K049J427
$$ 1600781 1592650 1583651 1574556 1566388 1558977 1551166 1542702 1534886 1529097 1525711 1524641 1525656 1527705 1529132
60653A529132N6r43k163m676p386p864n975m437n249p422q919r069q180o485m661
$$ 1529132 1529188 1528245 1526082 1521406 1514020 1506156 1500181 1495744 1490495 1483073 1474154 1465085 1456905 1450420 1445759
60638A445759m071m982n593m278k050j227k086k595j625p29j914m762o894o921
$$ 1445759 1441688 1436706 1431113 1426835 1424785 1423558 1421472 1418877 1417252 1416523 1414609 1409847 1402953 1396032
60624A396032n812n431o649r189j2426j5542j7462j7610j6752j6235j6214j5498
$$ 1396032 1390220 1384789 1378140 1368951 1356525 1340983 1323521 1305911 1289159 1272924 1256710 1241212
60612A241212j3504j1475j1023j1949j2352j0802p789m975l449k869k111o98N87
$$ 1241212 1227708 1216233 1205210 1193261 1180909 1170107 1162318 1157343 1153894 1151025 1148914 1148216 1148803
60599A148803P66J42O9J160K562L330L656M088M264L450J998J224J792K915L276
$$ 1148803 1149569 1149711 1149780 1150940 1153502 1156832 1160488 1164576 1168840 1172290 1174288 1175512 1177304 1180219 1183495
60584A183495K429J193Q83J939L305L518K569K011K896M469N537O293P765R978
$$ 1183495 1185924 1187117 1188000 1189939 1193244 1196762 1199331 1201342 1204238 1208707 1214244 1220537 1228302 1238280
60570A238280J1818J2527J2474J2496J3163J4563J6203J7349J7993J9004K0776
$$ 1238280 1250098 1262625 1275099 1287595 1300758 1315321 1331524 1348873 1366866 1385870 1406646
60559A406646K2443K3311K4185K6013K7878K8030K6525K5119K4494K3481K1357
$$ 1406646 1429089 1452400 1476585 1502598 1530476 1558506 1585031 1610150 1634644 1658125 1679482
60548A679482J9052J7331J5383J2193Q012L482j551p181j2565j7023k1120k5280
$$ 1679482 1698534 1715865 1731248 1743441 1751453 1754935 1753384 1746203 1733638 1716615 1695495 1670215
60536A670215k8207k8323k6272k4251k3001k1201j8116j5093j3644j3259j2244
$$ 1670215 1642008 1613685 1587413 1563162 1540161 1518960 1500844 1485751 1472107 1458848 1446604
60525A446604r904o937m206k164j138j158j476j179n15q53l006n997p872p370
$$ 1446604 1436700 1429763 1425557 1423393 1422255 1421097 1419621 1418442 1417927 1417074 1414068 1408071 1400199 1392829
60511A392829m695j148J659K762K601K638L882O082Q487J0739J2444J2697J1193
$$ 1392829 1388134 1386986 1388645 1391407 1394008 1396646 1400528 1406610 1415097 1425836 1438280 1450977 1462170
60498A462170R401R331J1086J2866J3504J3712J4390J5125J5186J4914J5025J5401
$$ 1462170 1471571 1480902 1491988 1504854 1518358 1532070 1546460 1561585 1576771 1591685 1606710 1622111
60486A622111J5653J6284J8094K0876K3792K6767L0304L4103L7096L8887M0004
$$ 1622111 1637764 1654048 1672142 1693018 1716810 1743577 1773881 1807984 1845080 1883967 1923971
60475A923971M0351L8591L3704K6379J8169R688N52r093j7754k3700k6477k6901
$$ 1923971 1964322 2002913 2036617 2062996 2081165 2090853 2091405 2082312 2064558 2040858 2014381 1987480
60463A987480k5692k2745j7984j2227o459o55N703J2054J6953K0045K2599K5583
$$ 1987480 1961788 1939043 1921059 1908832 1902373 1901718 1907421 1919475 1936428 1956473 1979072 2004655
60451B004655K8415L0433L2376L5138L8083M0136M2045M5986N3017O2229P2441
$$ 2004655 2033070 2063503 2095879 2131017 2169100 2209236 2251281 2297267 2350284 2412513 2484954
60440B484954Q3397R5092J07147J19444J32572J47181J63283J80483J98514K17361
$$ 2484954 2568351 2663443 2770590 2890034 3022606 3169787 3333070 3513553 3712067 3929428
60430C929428K37009K57163K77302K97480L18933L42695L66869L86044L93973
$$ 3929428 4166437 4423600 4700902 4998382 5317315 5660010 6026879 6412923 6806896
60421F806896L85851L57613L05382K28234J30906K1833r0862j99574k94955l67654
$$ 6806896 7192747 7550360 7855742 8083976 8214882 8236715 8145853 7946279 7651324 7283670
60411G283670m13781m36596m41910m33667m14566l88092l57902l26532k96043
$$ 7283670 6869889 6433293 5991383 5557716 5143150 4755058 4397156 4070624 3774581
60402C774581k68357k43575k19491j94566j70392j49770j33505j20501j09747
$$ 3774581 3506224 3262649 3043158 2848592 2678200 2528430 2394925 2274424 2164677
60393B164677j00372r0857q0349p0279o2723n7580n3082m8566m4754m1568l7905
$$ 2164677 2064305 1973448 1893099 1822820 1760097 1702517 1649435 1600869 1556115 1514547 1476642
60382A476642l3734l0345k8130k6050k3868k2904k3619k4229k2996k0572j8643
$$ 1476642 1442908 1412563 1384433 1358383 1334515 1311611 1287992 1263763 1240767 1220195 1201552
60371A201552j7416j5909j3955j2339j1268j0190r033q404q331p790n956l302
$$ 1201552 1184136 1168227 1154272 1141933 1130665 1120475 1111442 1103038 1094707 1086917 1080961 1077659
60359A077659j169n06j094j763j373J31J856L293M959P163Q699P956N209K651
$$ 1077659 1076490 1075984 1074890 1073127 1071754 1071885 1073741 1077034 1081993 1089156 1097855 1105811 1111020 1113671
60345A113671J874K231K280J972K533M632P382R162R045P597O426O623P567P832
$$ 1113671 1115545 1117776 1120056 1122028 1124561 1129193 1136575 1145737 1154782 1162379 1168805 1175428 1182995 1190827
60331A190827P287P271Q235Q564O882M484L745M756N374M428K908J762N58r31
$$ 1190827 1198114 1205385 1213620 1222184 1229066 1233550 1237295 1242051 1247425 1251853 1254761 1256523 1257081 1256150
60317A256150j748j391r37j286j692j394j286k269l069j720J405M027N042N297
$$ 1256150 1254402 1253011 1252074 1250788 1249096 1247702 1246416 1244147 1241078 1239358 1240763 1244790 1249832 1255129
60303A255129N470N228M658M629N268N740O032P248R464J0971J0638R675R769
$$ 1255129 1260599 1265827 1270485 1275114 1280382 1286122 1292154 1299402 1308866 1319837 1330475 1340150 1349919
60290A349919J0727J1264J1231J1471J2036J2003J1058R988R348Q554O741M007
$$ 1349919 1360646 1371910 1383141 1394612 1406648 1418651 1429709 1439697 1449045 1457599 1464340 1468347
60278A468347J459J33R0N16O85P01J018J514J626J410J678K836M236N054N188
$$ 1468347 1469806 1469939 1470029 1470545 1471230 1471931 1472949 1474463 1476089 1477499 1479177 1482013 1486249 1491303 1496491
60263A496491M831L810J948m09k854n536q545j1037j1792j0694r033q190q396
$$ 1496491 1501322 1505132 1507080 1506671 1503817 1498281 1489736 1478699 1466907 1456213 1447180 1438990 1430594
60250A430594q789q341o718m567l012k626k801k376q68J072K521L293L984N088
$$ 1430594 1421805 1413464 1406746 1402179 1399167 1396541 1393740 1391364 1390496 1391568 1394089 1397382 1401366 1406454
60236A406454O319O922O450N107L425J953J196J346K018K687L584N413P908R470
$$ 1406454 1412773 1419695 1426145 1431252 1434677 1436630 1437826 1439172 1441190 1443877 1447461 1452874 1460782 1470252
60222A470252R056P749P490Q694J0218J1284J2067J2401J1491R451Q014Q734J1150
$$ 1470252 1479308 1487057 1494547 1503241 1513459 1524743 1536810 1549211 1560702 1570153 1578167 1586901 1598051
60209A598051J3441J4495J4854J5863J8305K1661K4551K6159K7200K9083L2260
$$ 1598051 1611492 1625987 1640841 1656704 1675009 1696670 1721221 1747380 1774580 1803663 1835923
60198A835923L6048L9829M3587M7238N0450N3378N6827O1325O6704P2681P9118
$$ 1835923 1871971 1911800 1955387 2002625 2053075 2106453 2163280 2224605 2291309 2363990 2443108
60187B443108Q5642R1940R8458J05840J13624J20819J27858J36402J46532J55751
$$ 2443108 2528750 2620690 2719148 2824988 2938612 3059431 3187289 3323691 3470223 3625974
60177C625974J61807J65193J67719J69830J70652J69601J66373J60032J49850
$$ 3625974 3787781 3952974 4120693 4290523 4461175 4630776 4797149 4957181 5107031
60168E107031J36636J21921J06010Q8301O9232N0530L3428J7808L308r837k1107
$$ 5107031 5243667 5365588 5471598 5559899 5629131 5679661 5713089 5730897 5734205 5724368 5703261
60157E703261k9930l5521l7582l7267l6227l4231k8964j8904n672P582J9720L2526
$$ 5703261 5673331 5637810 5600228 5562961 5526734 5492503 5463539 5444635 5438963 5446545 5466265 5498791
60145E498791M8012O5690Q3143R8782J13111J27034J39860J49894J56594J60973
$$ 5498791 5546803 5612493 5695636 5794418 5907529 6034563 6174423 6324317 6480911 6641884
60135F641884J63610J63352J58460J48311J33521J15134R4369P2419M9787K6140
$$ 6641884 6805494 6968846 7127306 7275617 7409138 7524272 7618641 7691060 7740847 7766987
60125G766987J482k3013m5820o6139q3591r7516j07356j13217j15193j12679j05321
$$ 7766987 7768469 7745456 7699636 7633497 7549906 7452390 7345034 7231817 7116624 7003945 6898624
60114F898624r4183q0940o6164m9384l0655j1039Q471K7625M6379O4354Q0856
$$ 6898624 6804441 6723501 6657337 6607953 6577298 6566259 6574730 6602355 6648734 6713088 6793944
60103F793944R4946J05652J12665J16424J16924J13037J04019R1228P7095O2650
$$ 6793944 6888890 6994542 7107207 7223631 7340555 7453592 7557611 7648839 7725934 7788584
60093G788584M7520L2278J9091R424K481l209p538q971o263Q61J2175K7237M5272
$$ 7788584 7836104 7868382 7887473 7896897 7899378 7896169 7888631 7879660 7873397 7874258 7886433 7913670 7958942
60080G958942O5431Q7215J10564J35654J62627J91146K20239K49134K78321L08963
$$ 7958942 8024373 8111588 8222152 8357806 8520433 8711579 8931818 9180952 9459273 9768236
60070I768236L40992L72516M01699M28534M53945M77495M96911N09913N15802
$$ 9768236 10109228 10481744 10883443 11311977 11765922 12243417 12740328 13250241 13766043
60061A3766043N15035N07828M93505M71005M39790M00199L53094K99162K38829
$$ 13766043 14281078 14788906 15282411 15753416 16193206 16593405 16946499 17245661 17484490
60052A7484490J72919J03217L1977l9101j09053j76738k40282k97701l47674l89127
$$ 17484490 17657409 17760626 17792603 17753502 17644449 17467711 17227429 16929728 16582054 16192927
60042A6192927m20361m39485m46048m41577m28123m06859l78482l44336l06124
$$ 16192927 15772566 15333081 14887033 14445456 14017333 13610474 13231992 12887656 12581532
60033A2581532k64909k21355j76992j34085r3854n5710j8922J5483M5168O8505
$$ 12581532 12316623 12095268 11918276 11784191 11690337 11634627 11615705 11631188 11676356 11744861
60023A1744861Q5493R6676J01776R9735R0106P4073N3813L0741M919k3534n2889
$$ 11744861 11830354 11927030 12028806 12128541 12218647 12292720 12346533 12377274 12382193 12358659 12305770
60012A2305770q0506j05053j27443j49366j71259j91739k08852k21824k31701
$$ 12305770 12225264 12120211 11992768 11843402 11672143 11480404 11271552 11049728 10818027
60003A0818027k39814k45657k47026k42728k34059k22764k08678j90862j70048
$$ 10818027 10578213 10332556 10085530 9842802 9608743 9385979 9177301 8986439 8816391
59994H816391j48032j25299j01249p6412n2042k7640j480K5927N1605P4198R5577
$$ 8816391 8668359 8543060 8441811 8365399 8313357 8285717 8284237 8310164 8361769 8435967 8531544
59983H531544J16857J35364J47705J53906J56212J55181J49255J37347J19854
$$ 8531544 8648401 8783765 8931470 9085376 9241588 9396769 9546024 9683371 9803225
59974I803225R7721P2194M4877J6612j3031m3935p4209j02075j27578j50713j69434
$$ 9803225 9900946 9973140 10018017 10034629 10021598 9977663 9903454 9801379 9673801 9523088 9353654
59963I353654j81784j88791j92737j93289j88097j76792j61660j44373j24646
$$ 9353654 9171870 8983079 8790342 8597053 8408956 8232164 8070504 7926131 7801485
59954G801485j02562p9796n7603l5367j1911J2895L8306O3391Q7395J10395J33400
$$ 7801485 7698923 7619127 7561524 7526157 7514246 7527141 7565447 7628838 7716233 7826628 7960028
59943G960028J56820J79285J99180K16425K31178K41683K45564K42598K33963
$$ 7960028 8116848 8296133 8495313 8711738 8942916 9184599 9430163 9672761 9906724
59934I906724K19415J97851J70359J39783J07173P1466L2934o004m3853q0932
$$ 9906724 10126139 10323990 10494349 10634132 10741305 10812771 10845705 10839701 10795848 10714916
59924A0714916j16388j47327j71993j90863k03325k06525j99629j86540j71844
$$ 10714916 10598528 10451201 10279208 10088345 9885020 9678495 9478866 9292326 9120482
59915I120482j55991j36689j13218q7013n9534l1880n304J9919M5026P0255R3208
$$ 9120482 8964491 8827802 8714584 8627571 8568037 8536157 8530853 8550772 8595798 8666053 8759261
59904H759261J11709J26882J41092J54096J63654J69028J71112J69795J63978
$$ 8759261 8870970 8997852 9138944 9293040 9456694 9625722 9796834 9966629 10130607
59895A0130607J54138J42404J30042J16958J03712R1762Q1493P2124O4024N9087
$$ 10130607 10284745 10427149 10557191 10674149 10777861 10869623 10951116 11023240 11087264 11146351
59885A1146351N8385O1366O7992P9730R7459J20057J46152J75882K09775K47026
$$ 11146351 11204736 11266102 11334094 11413824 11511283 11631340 11777492 11953374 12163149 12410175
59875A2410175K86177L26597L68038M09133M47449M80846N07969N27487N37375
$$ 12410175 12696352 13022949 13390987 13800120 14247569 14728415 15236384 15763871 16301246
59866A6301246N34898N17081M81691M28201L57808K72506J74807O8719l9892j44976
$$ 16301246 16836144 17353225 17834916 18263117 18620925 18893431 19068238 19136957 19097065 18952089
59856A8952089k42359l29581m04097m62655n02908n24975n30944n23310n04413
$$ 18952089 18709730 18380149 17976052 17513397 17010489 16485514 15954570 15431260 14926847
59847A4926847m76883m43433m05866l64908l21250k76165k30729j85160j39588
$$ 14926847 14449964 14006531 13600665 13235757 12914507 12638342 12407613 12222453 12082865
59838A2082865r4785n1405r212L1701O9364J01141J26564J47549J65296J78108
$$ 12082865 11988080 11936675 11927463 11959164 12028528 12129669 12256233 12403782 12569078 12747186
59828A2747186J82800J77217J60746J33444R5776M8820n856o6031j28262j88404
$$ 12747186 12929986 13107203 13267949 13401393 13497169 13545989 13540133 13474102 13345840 13157436
59818A3157436k43506k92584l34952l68782l92293m05664m10609m08452l99730
$$ 13157436 12913930 12621346 12286394 11917612 11525319 11119655 10709046 10300594 9900864
59809I900864l85326l66718l45096l21207k96114k71066k46352k21327j96059
$$ 9900864 9515538 9148820 8803724 8482517 8186403 7915337 7668985 7447658 7251599
59800G251599j72339j52342j36616j23882j12654j02665r4611q8898q4964q1755
$$ 7251599 7079260 6926918 6790302 6666420 6553766 6451101 6356490 6267592 6182628 6100873
59790F100873p8519p4902p0636o5603o0144n4810m9733m4666l9811l6189l4935
$$ 6100873 6022354 5947452 5876816 5811213 5751069 5696259 5646526 5601860 5562049 5525860 5490925
59779E490925l6378l9964m4816n0212n5575o0014o2251o1511n8657n5488n2362
$$ 5490925 5454547 5414583 5369767 5319555 5263980 5203966 5141715 5080204 5021547 4966059 4913697
59768D913697m7443l9393l0153k3368k0142j7925j3853p736j112N364J2458K0995
$$ 4913697 4866254 4826861 4796708 4773340 4753198 4735273 4721420 4713684 4712572 4717936 4730394 4751389
59756D751389L0750M0568M9156N5963O1332O5708O9185P2328P6422Q1640Q5693
$$ 4751389 4782139 4822707 4871863 4927826 4989158 5054866 5124051 5196379 5272801 5354441 5440134
59745E440134Q6227Q4114Q2151Q0495P6126O7700N8309N1719M7864M4107L9571
$$ 5440134 5526361 5610475 5692626 5773121 5849247 5916947 5975256 6026975 6074839 6118946 6158517
59734F158517L6135L5902L9506M6447N5702O6439P9112R5155J14646J35324J55326
$$ 6158517 6194652 6230554 6270060 6316507 6372209 6438648 6517760 6612915 6727561 6862885 7018211
59723G018211J75912J99843K27785K57977K88960L20862L54037L87913M21204
$$ 7018211 7194123 7393966 7621751 7879728 8168688 8489550 8843587 9231500 9652704
59714I652704M51947M77140M92939M94885M77370M34169L61816K63219J47602
$$ 9652704 10104651 10581791 11074730 11569615 12046985 12481154 12842970 13106189 13253791
59705A3253791K7135q6279j82891k56810l06744l34420l42405l33906l13493k85935
$$ 13253791 13280926 13194647 13011756 12754946 12448202 12113782 11771377 11437471 11123978 10838043
59695A0838043k53992k18510j80543j42169j05251p0538l8062p284K3111N4301
$$ 10838043 10584051 10365541 10184998 10042829 9937578 9867040 9828978 9821694 9844805 9899106
59685I899106Q5872J16129J44123J70761J97896K26779K57229K87904L17703L47357
$$ 9899106 9984978 10101107 10245230 10415991 10613887 10840666 11097895 11385799 11703502 12050859
59675A2050859L79052M14050M51548M90527N31341N74364O18508O62864P08767
$$ 12050859 12429911 12843961 13295509 13786036 14317377 14891741 15510249 16173113 16881880
59666A6881880P57988Q09493Q60139R08171R53635R95331J029836J054128J067129
$$ 16881880 17639868 18449361 19309500 20217671 21171306 22166637 23196473 24250601 25317730
59657B5317730J068185J056275J031910R98179R58851R16900Q75760Q40283Q14710
$$ 25317730 26385915 27442190 28474100 29472279 30431130 31348030 32223790 33064073 33878783
59648C3878783Q00317P95967P99958Q10027Q22190Q31011Q31186Q18601P90405
$$ 33878783 34679100 35475067 36275025 37085052 37907242 38738253 39569439 40388040 41178445
59639D1178445P44909O81449O00291N03204L94341K79810J65858N7729l9733j21472
$$ 41178445 41923354 42604803 43205094 43708298 44102639 44382449 44548307 44606036 44566303 44444831
59629D4444831j83134k22352k38844k33677k08673j65890j06963l3129N3808J50814
$$ 44444831 44261697 44039345 43800501 43566824 43358151 43192261 43085298 43052169 43105977 43256791
59619D3256791K54386L62008M72680N85915P00053Q11392R14897J005513J078305
$$ 43256791 43511177 43873185 44345865 44931780 45631833 46443225 47358122 48363635 49441940
59610D9441940J127426J145924J127111J065630R57042P97950N88251L33430M4431
$$ 49441940 50569366 51715290 52842401 53908031 54865073 55663023 56251274 56584704 56629135
59601E6629135k63940n74035q66864j125638j339206j502292j613645j675198
$$ 56629135 56365195 55791160 54924296 53798658 52459452 50957160 49343515 47668317
59593D7668317j692038j671188j620212j547777j464344j380334j303912j242105
$$ 47668317 45976279 44305091 42684879 41137102 39672758 38292424 36988512 35746407
59585C5746407j202785j192019j208430j242260j280762j313384j332468j332758
$$ 35746407 34543622 33351603 32143173 30900913 29620151 28306767 26974299 25641541
59577B5641541j312631j274449j222113j159004j088598j015041r41631q69851
$$ 25641541 24328910 23054461 21832348 20673344 19584746 18569705 17628074 16758223
59569A6758223q00733p35681o74978o17201n61729n10487m65586m26269l89842
$$ 16758223 15957490 15221809 14546831 13929630 13367901 12857414 12391828 11965559 11575717
59560A1575717l54833l21586k90588k62020k36598k15087j96935j80682j65850
$$ 11575717 11220884 10899298 10608710 10346690 10110092 9895005 9698070 9517388 9351538
59551I351538j53306j43882j37676j34674j34867j37469j41064j44893j49309
$$ 9351538 9198232 9054350 8916674 8782000 8647133 8509664 8368600 8223707 8074398
59542H074398j54563j59593j62375j61400j56790j50153j43242j36545j29212
$$ 8074398 7919835 7760242 7597867 7436467 7279677 7129524 6986282 6849737 6720525
59533F720525j20389j10264r9629q8838p7612o5701n3441m1674l1120k1614j2117
$$ 6720525 6600136 6489872 6390243 6301405 6223793 6158092 6104651 6062977 6031857 6010243 5998126
59522E998126j914Q270J7039K4147L0740L7508M3571M7841N0740N3743N7564O1672
$$ 5998126 5996212 6004482 6021521 6045668 6076408 6113916 6157487 6205328 6256068 6309811 6367375 6429047
59510F429047O5509O9492P4598Q1380Q9600R8646J08116J18061J28861J40952
$$ 6429047 6494556 6564048 6638646 6720026 6809626 6908272 7016388 7134449 7263310 7404262
59500G404262J54451J68871J83406J98032K14042K32663K53252K73919K93957
$$ 7404262 7558713 7727584 7910990 8109022 8323064 8555727 8808979 9082898 9376855
59491I376855L14203L34564L53116L68804L83150L97372M09310M15551M15584
$$ 9376855 9691058 10025622 10378738 10747542 11130692 11528064 11937374 12352925 12768509
59482A2768509M11199M02605L88325L68792L46664L22629K93936K58633K19071
$$ 12768509 13179708 13582313 13970638 14339430 14686094 15008723 15302659 15561292 15780363
59473A5780363J79636J42891J09339P9177N2571K9540J1075p72n161l516K882
$$ 15780363 15959999 16102890 16212229 16291406 16343977 16373517 16384592 16383820 16378659 16375143 16378025
59462A6378025J4907L3719N8063Q4958J11976J37235J58157J71896J76428J70024
$$ 16378025 16392932 16426651 16484714 16569672 16681648 16818883 16977040 17148936 17325364 17495388
59452A7495388J50555J16834O9976J2195n4816j28882k05915k81413l52833m18712
$$ 17495388 17645943 17762777 17832753 17844948 17790132 17661250 17455335 17173922 16821089 16402377
59442A6402377m76042n20638n50053n64629n65865n55535n36335n11334m82079
$$ 16402377 15926335 15405697 14855644 14291015 13725150 13169615 12633280 12121946 11639867
59433A1639867m48566m11401l72686l34350k96871k60275k25249j92404j61283
$$ 11639867 11191301 10779900 10407214 10072864 9775993 9515718 9290469 9098065 8936782
59424H936782j31030j01609p3484m6290j8709R866L8176O4254Q7908J11183J35945
$$ 8936782 8805752 8704143 8630659 8584369 8565660 8575526 8613702 8677956 8765864 8877047 9012992
59413I012992J61732J86896K11037K34523K55967K72413K82797K89133K92860
$$ 9012992 9174724 9361620 9572657 9807180 10063147 10335560 10618357 10907490 11200350
59404A1200350K91579K81161K59964K29192J90086J43001Q9082L0691l0321r3210
$$ 11200350 11491929 11773090 12033054 12262246 12452332 12595333 12684415 12715106 12684785 12591575
59394A2591575j56486k16518k68952l11272l43651l67711l84763l95142l98812
$$ 12591575 12435089 12218571 11949619 11638347 11294696 10926985 10542222 10147080 9748268
59385I748268l96071l87298l72743l53611l32859l13342k94914k75099k53163
$$ 9748268 9352197 8964899 8592156 8238545 7905686 7592344 7297430 7022331 6769168
59376F769168k31672k13128j96848j80579j63577j46394j29200j12345r7424q5478
$$ 6769168 6537496 6324368 6127520 5946941 5783364 5636970 5507770 5395425 5298001 5212523
59366E212523p4933o3506n1500m0879l1587k1591j0586r38N881J1458J7995K5624
$$ 5212523 5137590 5074084 5022584 4981705 4950118 4928527 4917941 4917003 4922884 4934342 4952337 4977961
59354D977961L3430M1392M9648N6670N9808N7803N2253M6734M4625M7101N2967
$$ 4977961 5011391 5052783 5102431 5159101 5218909 5276712 5328965 5375699 5420324 5467425 5520392
59343E520392O0654P0256Q2959R8590J14809J28751J38738J44550J47485J50571
$$ 5520392 5581046 5651302 5734261 5832851 5947660 6076411 6215149 6359699 6507184 6657755
59333F657755J57434J69803J86453K05027K24638K46321K71471L00315L31825
$$ 6657755 6815189 6984992 7171445 7376472 7601110 7847431 8118902 8419217 8751042
59324H751042L64864L99184M35123M72551N10996N50972N93860O39584O85231
$$ 8751042 9115906 9515090 9950213 10422764 10933760 11484732 12078592 12718176 13403407
59315A3403407P27281P64349P96250Q20911Q34191Q32935Q16830P87412P46865
$$ 13403407 14130688 14895037 15691287 16512198 17346389 18179324 18996154 19783566 20530431
59306B0530431O98048O43870N85770N24074M60448L98682L41993K90190K40252
$$ 20530431 21228479 21872349 22458119 22982193 23442641 23841323 24183316 24473506 24713758
59297B4713758J89069J35099P8176J8599m3734j09603j79524k52367l25415l95850
$$ 24713758 24902827 25037926 25116102 25134701 25090967 24981364 24801840 24549473 24224058 23828208
59287B3828208m61716n21569n74222o19298o57234o88360p12366p28856p37906
$$ 23828208 23366492 22844923 22270701 21651403 20994169 20305809 19593443 18864587 18126681
59278A8126681p40000p35909p26527p12011o91392o63950o31156n96103n60869
$$ 18126681 17386681 16650772 15924245 15212234 14520842 13856892 13225736 12629633 12068764
59269A2068764n25340m88827m51600m14484l78180l43545l11432k81594k52775
$$ 12068764 11543424 11054597 10602997 10188513 9810333 9466788 9155356 8873762 8620987
59260H620987k24661j98671j75797j54697j33312j11796r2289p5816o0871m5500
$$ 8620987 8396326 8197655 8021858 7867161 7733849 7622053 7529764 7453948 7393077 7347577
59250G347577k9794j5459l305Q004K0470L4477M8357O0215O9739P7992Q5892R3434
$$ 7347577 7317783 7302324 7299019 7307023 7327493 7361970 7410327 7470542 7540281 7618273 7704165 7797599
59238G797599J00187J05843J10164J12834J13673J12790J10433J06817J02035
$$ 7797599 7897786 8003629 8113793 8226627 8340300 8453090 8563523 8670340 8772375
59229H772375R6197Q9969Q4866Q2283Q1902Q1956Q1731Q2987Q7795R5796J04853
$$ 8772375 8868572 8958541 9043407 9125690 9207592 9289548 9371279 9454266 9542061 9637857 9742710
59218I742710J13860J23149J32290J39282J42354J41067J35144J23887J07570
$$ 9742710 9856570 9979719 10112009 10251291 10393645 10534712 10669856 10793743 10901313
59209A0901313Q8033O6660M2814J5540j3919m2703o9061r3092j14733j32401j44250
$$ 10901313 10989346 11056006 11098820 11114360 11100441 11057738 10988677 10895585 10780852 10648451 10504201
59198A0504201j50055j51065j48281j41736j31555j19008j05698r1919p6722n9796
$$ 10504201 10354146 10203081 10054800 9913064 9781509 9662501 9556803 9464884 9388162 9328366
59188I328366m2422k6165j1540J396J2062K0145K6697L2994L8610M2043M3278
$$ 9328366 9285944 9259779 9248239 9249635 9261697 9281842 9308539 9341533 9380143 9422186 9465464
59177I465464M4356M7240N2289N9034O7143P6327Q6638R9390J16504J38367J63461
$$ 9465464 9509820 9557060 9609349 9668383 9735526 9811853 9898491 9997881 10114385 10252752 10416213
59166A0416213J90743K20900K54301K89026L22430L53743L83472M10433M30880
$$ 10416213 10606956 10827856 11082157 11371183 11693613 12047356 12430828 12841261 13272141
59157A3272141M40684M37259M19327L86071L37258K73617J96610J08176J1138
$$ 13272141 13712825 14150084 14569411 14955482 15292740 15566357 15762967 15871143 15882281
59148A5882281r0412j91702k88473l77520m56088n21081n69470n99760o12927
$$ 15882281 15791869 15600167 15311694 14934174 14478086 13957005 13387535 12787775 12174848
59139A2174848o11738n99417n79039n53372n24275m92357m58008m22765l88792
$$ 12174848 11563110 10963693 10384654 9831282 9307007 8814650 8356642 7933877 7545085
59130G545085l57016l26740k97566k70610k47145k26664k07338j88127j69581
$$ 7545085 7188069 6861329 6563763 6293153 6046008 5819344 5612006 5423879 5254298
59121E254298j52620j37282j23070j09930r8319q8397p9642p1430o3590n6074
$$ 5254298 5101678 4964396 4841326 4731396 4633077 4544680 4465038 4393608 4330018 4273944
59111D273944m8431m0230l1928k4565j8399j2497n932J260Q692J6293K3666K9619
$$ 4273944 4225513 4185283 4153355 4128790 4110391 4097894 4091962 4093222 4101914 4118207 4141873 4171492
59099D171492L3415L6144L9858M5459N2243N9189O5732P1483P6279Q0690Q5689
$$ 4171492 4204907 4241051 4280909 4326368 4378611 4437800 4503532 4575015 4651294 4731984 4817673
59088D817673R1604R7919J03974J09171J12749J14233J14235J14028J14188J14229
$$ 4817673 4909277 5007196 5111170 5220341 5333090 5447323 5561558 5675586 5789774 5904003
59078E904003J13435J11315J07304J00871R2155Q2025P1400O0945N1111M1965
$$ 5904003 6017438 6128753 6236057 6336928 6429083 6511108 6582508 6643453 6694564 6736529
59068F736529L3208K5035J8671J5295J4736J5957J8357K1950K6821L3383M2562
$$ 6736529 6769737 6794772 6813443 6828738 6843474 6859431 6877788 6899738 6926559 6959942 7002504
59057G002504N4455O7430P9895R2481J06766J22316J36991J50241J63984J79597
$$ 7002504 7056959 7124389 7204284 7296765 7403531 7525847 7662838 7813079 7977063 8156660
59047H156660J95883K10894K24166K36135K46443K53953K57684K56901K50769
$$ 8156660 8352543 8563437 8787603 9023738 9270181 9524134 9781818 10038719 10289488
59038A0289488K38399K18816J90919J54302J10305O1479J0157m1531r0659j34342
$$ 10289488 10527887 10746703 10937622 11091924 11202229 11263708 11273865 11232334 11141675 11007333
59028A1007333j71830k04234k31737k52717k66315k74347k79615k83400k85439
$$ 11007333 10835503 10631269 10399532 10146815 9880500 9606153 9326538 9043138 8757699
59019H757699k85283k82882k78682k73886k69810k66454k62465k56845k49733
$$ 8757699 8472416 8189534 7910852 7636966 7367156 7100702 6838237 6581392 6331659
59010F331659k41318k31461k20830k10973k02428j94024j84781j75278j66375
$$ 6331659 6090341 5858880 5638050 5427077 5224649 5030625 4845844 4670566 4504191
59001D504191j57918j49513j41387j33500j25233j16806j09711j04555r9789r3809
$$ 4504191 4346273 4196760 4055373 3921873 3796640 3679834 3570123 3465568 3365779 3271970
58991C271970q7122q1074p5667p0269o5478o2359o0344n7674n3849n0205m7955
$$ 3271970 3184848 3103774 3028107 2957838 2892360 2830001 2769657 2711983 2658134 2607929 2559974
58980B559974m6787m5522m3359m0449l7646l5539l3518l0417k6358k2968k1098
$$ 2559974 2513187 2467665 2424306 2383857 2346211 2310672 2277154 2246737 2220379 2197411 2176313
58969B176313j9428j6308j2100q532o410n134m019k955k023j378j277j546j400
$$ 2176313 2156885 2140577 2128477 2119945 2113535 2108401 2104382 2101427 2099404 2098026 2096749 2095203 2093803
58956B093803m07Q79J829K655L754M868N642O265O791O706O034O065P797J0289
$$ 2093803 2093396 2094275 2096104 2098759 2102513 2107381 2113023 2119288 2126079 2132785 2138819 2144884 2152681 2162970
58942B162970J1693J1522J0794J0480J0854J1988J3741J5379J6071J5763J5068
$$ 2162970 2174663 2186185 2196979 2207459 2218313 2230301 2244042 2259421 2275492 2291255 2306323
58931B306323J4631J4989J6351J7936J8397J7758J8011K0634K4255K6113K5480
$$ 2306323 2320954 2335943 2352294 2370230 2388627 2406385 2424396 2445030 2469285 2495398 2520878
58920B520878K4287K4566K6413K8515K9693K9766K9556L0262L2420L5497L8594
$$ 2520878 2545165 2569731 2596144 2624659 2654352 2684118 2713674 2743936 2776356 2811853 2850447
58909B850447M1265M3561M5847M8648N1954N4693N5937N6638N8755O2311O5184
$$ 2850447 2891712 2935273 2981120 3029768 3081722 3136415 3192352 3248990 3307745 3370056 3435240
58898C435240O6522O8254P1794P5314P6453P6264P7878Q2029Q6616R0398R4593
$$ 3435240 3501762 3570016 3641810 3717124 3793577 3869841 3947719 4029748 4116364 4206762 4301355
58887D301355J00364J07027J13588J20471J28558J37601J46549J55026J63762
$$ 4301355 4401719 4508746 4622334 4742805 4871363 5008964 5155513 5310539 5474301
58878E474301J73730J85079J96899K08223K19418K32018K46898K63231K79797
$$ 5474301 5648031 5833110 6030009 6238232 6457650 6689668 6936566 7199797 7479594
58869G479594K96627L14616L34249L55647L79229M05310M33437M63019M94227
$$ 7479594 7776221 8090837 8425086 8780733 9159962 9565272 9998709 10461728 10955955
58860A0955955N27529N62869O00050O39136O79653P20292P60623Q02057Q45433
$$ 10955955 11483484 12046353 12646403 13285539 13965192 14685484 15446107 16248164 17093597
58851A7093597Q88168R25458R54133R73713R83752R81718R63753R26186Q66051
$$ 17093597 17981765 18907223 19861356 20835069 21818821 22800539 23764292 24690478 25556529
58842B5556529P81558O72854N41948L91705K25724M9501j29055l01032m58947
$$ 25556529 26338087 27010941 27552889 27944594 28170318 28219819 28090764 27789732 27330785
58833B7330785n98371p17713q16294q92649r45116r74095r82776r75288r55048
$$ 27330785 26732414 26014701 25198407 24305758 23360642 22386547 21403771 20428483 19473435
58824A9473435r25182q89017q48900q05406p58817p10783o63623o18843n77245
$$ 19473435 18548253 17659236 16810336 16004930 15246113 14535330 13871707 13252864 12675619
58815A2675619n39427n04970m72166m39956m09446l82174l57633l34086l11113
$$ 12675619 12136192 11631222 11159056 10719100 10309654 9927480 9569847 9235761 8924648
58806H924648k89616k69675k50143k30467k11504j94296j78846j64240j49306
$$ 8924648 8635032 8365357 8115214 7884747 7673243 7478947 7300101 7135861 6986555
58797F986555j33549j17973j04343r2957q1997o9906n7305m5504l4316k2836j1321
$$ 6986555 6853006 6735033 6630690 6537733 6455736 6385830 6328525 6283021 6248705 6225869 6214548
58786F214548o01R682K0586L2184M3850N5682O8095Q0566R2296J03621J15364
$$ 6214548 6213947 6223629 6244215 6276399 6320249 6375931 6444026 6524592 6616888 6720509 6835873
58775F835873J27449J39487J52013J65643J79848J94094K09241K26094K43644
$$ 6835873 6963322 7102809 7254822 7420465 7600313 7794407 8003648 8229742 8473386
58766H473386K60730K78437K98552L20548L42741L65692L91679M21024M51855
$$ 8473386 8734116 9012553 9311105 9631653 9974394 10340086 10731765 11152789 11604644
58757A1604644M83564N17743N55293N95232O36846O80507P25574P69785Q11489
$$ 11604644 12088208 12605951 13161244 13756476 14393322 15073829 15799403 16569188 17380677
58748A7380677Q50499Q85809R14449R33247R39921R31715R04940Q56794P86152
$$ 17380677 18231176 19116985 20031434 20964681 21904602 22836317 23741257 24598051 25384203
58739B5384203O91973N73223M31583K72723J03653o9882k42553m07752n58513
$$ 25384203 26076176 26649399 27080982 27353705 27457358 27387476 27144923 26737171 26178658
58730B6178658o89653p98283q83107r44191r82975j001787j003373r90747r66784
$$ 26178658 25489005 24690722 23807615 22863424 21880449 20878662 19875289 18884542 17917758
58721A7917758r33927q94721q52105q08158p63150p17061o71498o28642n88850
$$ 17917758 16983831 16089110 15237005 14428847 13665697 12948636 12277138 11648496 11059646
58712A1059646n51126n15472m82855m53028m24594l97214l71737l48043l25013
$$ 11059646 10508520 9993048 9510193 9057165 8632571 8235357 7863620 7515577 7190564
58703G190564l02830k83036k65777k49271k32572k16678k02172j88079j74065
$$ 7190564 6887734 6604698 6338921 6089650 5857078 5640400 5438228 5250149 5076084
58694E076084j61541j51243j41612j31078j20330j10892j02826r5406q8828q3653
$$ 5076084 4914543 4763300 4621688 4490610 4370280 4259388 4156562 4061156 3972328 3888675
58684C888675p9303p4574o9345o4699o1556n9695n7908n4968n0849m7022m4903
$$ 3888675 3809372 3734798 3665453 3600754 3539198 3479503 3421595 3366627 3315778 3268756 3223853
58673C223853m4233m3783m3215m3009m2989m2448m1600m1357m1637m1567m1325
$$ 3223853 3179620 3135837 3092622 3049613 3006624 2964176 2922576 2881219 2839582 2798015 2756690
58662B756690m2122m4120m6066m7209m8042m8914m9422m9367m8906m7829m6179
$$ 2756690 2714568 2670448 2624382 2577173 2529131 2480217 2430795 2381428 2332522 2284693 2238514
58651B238514m5129m5369m5082m1989l7135l3953l3412l3017l1099k9056k8372
$$ 2238514 2193385 2148016 2102934 2060945 2023810 1989857 1956445 1923428 1892329 1863273 1834901
58640A834901k8309k7965k8007k8706k8544k6517k3989k2640k2209k1633k0788
$$ 1834901 1806592 1778627 1750620 1721914 1693370 1666853 1642864 1620224 1598015 1576382 1555594
58629A555594j9748j7922j5308j3140j2092j1250r874q529p446n490k073J504
$$ 1555594 1535846 1517924 1502616 1489476 1477384 1466134 1456260 1447731 1440285 1434795 1432722 1434226
58617A434226L779M848N348N377N350O090O968N869K332j046j866r31n58j435
$$ 1434226 1438005 1442853 1448201 1453578 1458928 1465018 1471986 1477855 1480187 1479141 1477275 1476344 1475786 1474351
58603A474351k568l007k233j49K020K159j34k614l113j856o7K072M822P749J0359
$$ 1474351 1471783 1468776 1466543 1466394 1468414 1470573 1470439 1467825 1464712 1462856 1462789 1464861 1469683 1477432 1487791
58588A487791J2746J4722J5824J6864J9589K3843K7159K8304K9186L1819L5513
$$ 1487791 1500537 1515259 1531083 1547947 1567536 1591379 1618538 1646842 1676028 1707847 1743360
58577A743360L8631M1183M3896M6620M9422N3487N9061O4168O7395P0369P5473
$$ 1743360 1781991 1823174 1867070 1913690 1963112 2016599 2075660 2139828 2207223 2277592 2353065
58566B353065Q2452Q9353R5655J02425J10304J19216J29334J40768J52917J65299
$$ 2353065 2435517 2524870 2620525 2722950 2833254 2952470 3081804 3222572 3375489 3540788
58556C540788J78248J91926K05785K19842K34883K50406K63942K73584K79491
$$ 3540788 3719036 3910962 4116747 4336589 4571472 4821878 5085820 5359404 5638895
58547E638895K81779K78673K68000K48739K20020J80883J32623P9321K4339l1655
$$ 5638895 5920674 6199347 6467347 6716086 6936106 7116989 7249612 7328933 7353272 7321617
58537G321617q7580j39282j82304k15544k40129k56438k64475k65500k61141k52195
$$ 7321617 7234037 7094755 6912451 6696907 6456778 6200340 5935865 5670365 5409224 5157029
58527E157029k39949k26856k14160k00684j85733j71046j57849j44514j29627
$$ 5157029 4917080 4690224 4476064 4275380 4089647 3918601 3760752 3616238 3486611
58518C486611j15080j03295r3428q3301p3282o5196n9100n4253n1599n2041n3498
$$ 3486611 3371531 3268236 3174808 3091507 3018225 2953029 2893929 2839676 2788077 2736036 2682538
58507B682538n3015n0763m8947m7882m6230m4129m2784m1814m0199l9115m0612
$$ 2682538 2629523 2578760 2529813 2481931 2435701 2391572 2348788 2306974 2266775 2227660 2187048
58496B187048m3886m5932m5568m4035m2204m0033l8387l8290l8607l7159l4058
$$ 2187048 2143162 2097230 2051662 2007627 1965423 1925390 1887003 1848713 1810106 1772947 1738889
58485A738889l1310k9525k7596k5341k3650k2230j9899j7050j5296j4710j3917
$$ 1738889 1707579 1678054 1650458 1625117 1601467 1579237 1559338 1542288 1526992 1512282 1498365
58474A498365j2772j2472j3052j3194j2562j2019j1579j0430q977q590r181r160
$$ 1498365 1485593 1473121 1460069 1446875 1434313 1422294 1410715 1400285 1391308 1382718 1373537 1364377
58462A364377p863o242n169m825n464p049q540r209r945j1478j2351j0998q822
$$ 1364377 1356514 1350272 1345103 1340278 1334814 1327765 1319225 1310016 1300071 1288593 1276242 1265244 1256422
58449A256422q552j0198j1389j1303j1338j2029j2083j0892r486q600p881p306
$$ 1256422 1247870 1237672 1226283 1214980 1203642 1191613 1179530 1168638 1159152 1150552 1142671 1135365
58437A135365p489q230q387p369n538l391j620j322k690m240m698m681n058n031
$$ 1135365 1127876 1119646 1111259 1103890 1098352 1094961 1093341 1092019 1089329 1085089 1080391 1075710 1070652 1065621
58423A065621l816k723l243m399m432l906m457n540n338m072l598m183m344l513
$$ 1065621 1061805 1059082 1055839 1051440 1047008 1043102 1038645 1033105 1027767 1023695 1020097 1015914 1011570 1008057
58409A008057k460j534o96o76j911l110k939k216k318k615j659L01K270M467P027
$$ 1008057 1005597 1004063 1003367 1002691 1000780 997670 994731 992515 990197 987582 985923 986224 988494 992961 999988
58394I99988Q510Q199P897Q797Q880O609M544N289O376L960m37k092o84k43k259
$$ 999988 1008498 1016697 1024594 1033391 1042271 1048880 1053424 1058713 1065089 1069049 1068612 1066520 1065836 1065593 1063334
58379A063334m298n339p039r333r811q305p445p843p165m926l755m788n797n259
$$ 1063334 1059036 1053697 1046658 1037325 1027514 1019209 1011764 1003921 996756 991830 988075 983287 977490 972231
58365I72231m458m294l585j807k77N93K129M500N904N620N041N029M934M772N543
$$ 972231 967773 963479 959894 958087 957810 958403 960532 965032 970936 976556 981597 986626 991560 996332 1001875
58350A001875O980P676P681Q300R378R568R120R424J0079R638Q835R709J1780
$$ 1001875 1008855 1016531 1024212 1032512 1041890 1051458 1060578 1070002 1080081 1089719 1098554 1108263 1120043
58337A120043J2649J2042J1765J1908J0901R130Q621R268R068P990P729P800N882
$$ 1120043 1132692 1144734 1156499 1168407 1179308 1188438 1197059 1206327 1215395 1223385 1231114 1238914 1244796
58324A244796K084q09j440p26Q93L391N051M270K694K659K875J020j045J45L257
$$ 1244796 1246880 1246071 1244631 1243905 1244798 1248189 1253240 1257510 1260204 1262863 1265738 1266758 1265713 1265858 1269115
58309A269115M076K834L498O367P721O653N975O330N714M872O552R129P943L630
$$ 1269115 1273191 1276025 1279523 1285890 1293611 1300264 1306239 1312569 1318283 1323155 1329707 1338836 1346779 1350409
58295A350409J995M639O787N864N024O197O701N150M247N238N752N288O644R783
$$ 1350409 1352404 1357043 1363830 1369694 1374718 1380915 1387616 1392766 1397013 1402251 1408003 1413291 1419935 1429718
58281A429718J0634Q177O455P416Q209P712Q996J2755J5039J4266J3949J5732
$$ 1429718 1440352 1448529 1454984 1462400 1470609 1478321 1487317 1500072 1515111 1529377 1543326 1559058
58269A559058J6442J4900J4750J7404J8964J7573J6959J9223K0875J9803J9357
$$ 1559058 1575500 1590400 1605150 1622554 1641518 1659091 1676050 1695273 1716148 1735951 1755308
58258A755308K1558K2924K1266K0128K2147K4199K3571K2931K4752K6644K6396
$$ 1755308 1776866 1799790 1821056 1841184 1863331 1887530 1911101 1934032 1958784 1985428 2011824
58247B011824K6056K7107K7307K5973K6469K9920L2586L2860L4317L8325M0637
$$ 2011824 2037880 2064987 2092294 2118267 2144736 2174656 2207242 2240102 2274419 2312744 2353381
58236B353381L9105L7806L9496M1054M0465M0932M3990M6017M5749M7482N2442
$$ 2353381 2392486 2430292 2469788 2510842 2551307 2592239 2636229 2682246 2727995 2775477 2827919
58225B827919N5292N3870N3805N8271O1947O1045O0465O4584O9482P1113P2891
$$ 2827919 2883211 2937081 2990886 3049157 3111104 3172149 3232614 3297198 3366680 3437793 3510684
58214C510684P8167Q3207Q4752Q6835R3025R9588J03158J07323J14889J21776
$$ 3510684 3588851 3672058 3756810 3843645 3936670 4036258 4139416 4246739 4361628 4483404
58204D483404J25410J30617J40262J48874J52782J57369J66785J76030J81243
$$ 4483404 4608814 4739431 4879693 5028567 5181349 5338718 5505503 5681533 5862776
58195E862776J88021K00889K14460K24011K34923K52225K70782K85625L01869
$$ 5862776 6050797 6251686 6466146 6690157 6925080 7177305 7448087 7733712 8035581
58186H035581L24177L46471L62689L77728L97247M17049M33411M53143M81954
$$ 8035581 8359758 8706229 9068918 9446646 9843893 10260942 10694353 11147496 11629450
58177A1629450N13578N41812N72093O09451O47053O79155P13182P55953Q00820
$$ 11629450 12143028 12684840 13256933 13866384 14513437 15192592 15905774 16661727 17462547
58168A7462547Q41774Q86856R43282J003546J061182J125294J203324J285198
$$ 17462547 18304321 19191177 20134459 21138005 22199187 23324481 24527805 25813003
58160B5813003J361895J443529J540422J643252J741962J846828J969338K100414
$$ 25813003 27174898 28618427 30158849 31802101 33544063 35390891 37360229 39460643
58152C9460643K230640K373458K544051K734817K937717L170109L451083L774945
$$ 39460643 41691283 44064741 46608792 49343609 52281326 55451435 58902518 62677463
58144F2677463M138334M569254N096675N717709O429700P264639Q253706R394033
$$ 62677463 66815797 71385051 76481726 82199435 88629135 95893774 104147480 113541513
58136A13541513J0695221J2214653J3987933J5964728J8071615K0287984K2612050
$$ 113541513 124236734 136451387 150439320 166404048 184475663 204763647 227375697
58129B27375697K5062735K7793410L0936190L3904416L4847057L1365955K2353218
$$ 227375697 252438432 280231842 311168032 345072448 379919505 411285460 433638678
58122D33638678R226466m805474j6738804k5138116l0014387l1999203l1820008
$$ 433638678 442865144 438059670 421320866 396182750 366168363 334169160 302349152
58115C02349152l0187721k7732784k4911653k2019485j9265125j6774164j4561121
$$ 302349152 272161431 244428647 219516994 197497509 178232384 161458220 146897099
58108A46897099j2577766j0789816r180445p715035o352791n082813l921458k890975
$$ 146897099 134319333 123529517 114349072 106634037 100281246 95198433 91276975 88386000
58100H8386000k021184j351621r15944p46248q94587j398611k193338l092143
$$ 88386000 86364816 85013195 84097251 83351003 82456416 81057805 78864467 75772324
58092G5772324l891629m478366m822670m919928m787075m488712m111896l713856
$$ 75772324 71880695 67402329 62579659 57659731 52872656 48383944 44272048 40558192
58084D0558192l318802k949169k625267k343268k086125j853322j655991j490077
$$ 40558192 37239390 34290221 31664954 29321686 27235561 25382239 23726248 22236171
58076B2236171j339876j203195j089688r98393r18413q47947p92539p47943p03386
$$ 22236171 20896295 19693100 18603412 17605019 16686606 15838659 15046120 14298177 13594791
58067A3594791o58506o19802n84394n44283n02763m69770m44192m16687l86705
$$ 13594791 12936285 12316483 11732089 11187806 10685043 10215273 9771081 9354394 8967689
58058H967689l61357l40739l19580l00519k90707k87549k81783k72444k65288
$$ 8967689 8606332 8265593 7946013 7645494 7354787 7067238 6785455 6513011 6247723
58049F247723k59115k47408k31518k18791k09319j97232j83490j74567j69853
$$ 6247723 5988608 5741200 5509682 5290891 5081572 4884340 4700850 4526283 4356430
58040D356430j62739j53150j46817j42988j35079j23329j15196j12647j09784
$$ 4356430 4193691 4040541 3893724 3750736 3615657 3492328 3377132 3264485 3154701
58031C154701j03662r7479r2555q6584q0340p7307p6367p3057o7833o4990o4225
$$ 3154701 3051039 2953560 2861005 2774421 2694081 2616774 2540407 2467350 2399517 2334527 2270302
58020B270302o1473n7244n5659n5990n3586m8589m5395m4143m0972l6203l3898
$$ 2270302 2208829 2151585 2095926 2039936 1986350 1937761 1892366 1848223 1807251 1771048 1737150
58009A737150l3672l1132k6245k3300k2773k1113j8348j7962j9293j7975j4185
$$ 1737150 1703478 1672346 1646101 1622801 1600028 1578915 1560567 1542605 1523312 1505337 1491152
57998A491152j2665j4309j5276j4718j5731j8212j8308j5753j4454j5068j4135
$$ 1491152 1478487 1464178 1448902 1434184 1418453 1400241 1381933 1366180 1351726 1336658 1322523
57987A322523j1426j0808j2740j3096j0808r714j1075j1031p672m448m134m856
$$ 1322523 1311097 1300289 1287549 1274453 1263645 1253931 1242856 1231825 1224153 1219705 1215571 1210715
57975A210715m345l340k779k049j405k111l316k875j607k325m663n537m689m780
$$ 1210715 1206370 1203030 1200251 1198202 1196797 1194686 1191370 1188495 1186888 1184563 1179900 1174363 1169674 1164894
57961A164894o018o016n150o446r714j1244j0102r358j0301j0708r791r525j0164
$$ 1164894 1158876 1152860 1147710 1141264 1131550 1120306 1110204 1100846 1090545 1079837 1070046 1060521 1050357
57948A050357r610q281r408j3204j5747j5016j3171j1729r398o163m602n390n836
$$ 1050357 1040747 1032466 1023058 1009854 994107 979091 965920 954191 944793 938630 934028 928638 922802
57935I22802m455k874k062q87L68l56k536k780k99J724J608J581L086M110L144
$$ 922802 918347 915473 913411 912524 912892 912536 910000 907220 906921 908645 910253 911834 914920 919030 922174
57920I22174J762J295O29q29j544r57q27j936k770k865m056o904r182r306q272
$$ 922174 923936 925231 925860 925031 923487 922530 921703 919767 916997 914132 910076 903172 893990 884684 876412
57905H76412p137n708m620n261o769o551m668m014n303n700l674j356p32j082
$$ 876412 869275 863567 858947 853686 846917 840366 835698 831684 826381 820681 817007 815651 814919 813837
57891H13837j556k739m278m273k349k60J309L155M371K892j38q77J187K259N84
$$ 813837 812281 809542 805264 800991 798642 798382 799691 802846 807217 810109 809971 809094 810281 812540 813124
57876H13124r76m82k60k340m912o006o825q675j0213j0331j0394j1170j0961r064
$$ 813124 812148 811666 811406 809066 804154 798148 791323 782648 772435 762104 751710 740540 729579 720515
57862G20515p634p594o412k590J188K272K034K657L321K735K428M122O536P957
$$ 720515 712881 705287 698875 696285 697473 699745 701779 704436 707757 710492 712920 717042 723578 731535
57848G31535R269J1294J1894R291N838M864N856O158N495N238M953L280R31m58
$$ 731535 740804 752098 763992 773283 779121 783985 789841 795999 801494 806732 811685 814965 815896 815438
57834H15438j333k967m550m638m417o154r246j0947j0536r792r693r437q638p881
$$ 815438 814105 811138 806588 801950 797533 791379 782133 771186 760650 750858 741165 731728 723090 715209
57820G15209p017n165k753j567k357l781l962k122J231M773P093P701P285O799
$$ 715209 708192 703027 700274 698707 696350 692569 688607 686485 687716 692489 699582 707283 714568 721367
57806G21367O758P343Q151P922N920L595L107M125M136K215J0j527l521o247p815
$$ 721367 728125 735468 743619 751541 757461 761056 764163 768288 772424 774639 774649 773122 769601 763354 755539
57791G55539p426p207q734j0217r441p413o519o864p009o959p772r114r529q700
$$ 755539 748113 740906 732172 721955 712514 705101 698582 691718 684709 677750 669978 660864 651335 642635
57777F42635p585o840o532o736p189p049o053n009m419l905l729n131q070j0460
$$ 642635 635050 628210 621678 614942 607753 600704 594651 589642 585223 581318 577589 572458 564388 553928
57763E53928j0873j0346j0256j0210r421q321p325n863m117l789n430o919o371
$$ 553928 543055 532709 522453 512243 502822 494501 487176 481313 477196 473407 467977 461058 454687
57750D54687m700l502k318j12K321L624M056M372M069K817K081L176N065O112
$$ 454687 449987 446485 444167 444055 446376 450000 454056 458428 462497 465314 467395 470571 475636 481748
57736D81748O528P007O663M666K537K250L131L069J871J122J494K324L086L474
$$ 481748 488276 495283 501946 506612 509149 511399 514530 517599 519470 520592 522086 524410 527496 530970
57722E30970K826J198j4j18n59k640n288o811p342p635p206n848n147o017o393
$$ 530970 533796 534994 534980 534862 534303 531663 526375 519564 512222 504587 497381 491533 486386 480369 473976
57707D73976m111n91J149Q64N52Q85J128J541K809L911L450K380K486L208K948
$$ 473976 469865 469274 470423 471287 471839 472724 473852 475393 478202 482113 485563 487943 490429 493637 496585
57692D96585K533L952O330O858N500N130O848Q569Q769Q377Q288P960P293P266
$$ 496585 499118 503070 509400 516258 521758 526888 533736 542305 551074 559451 567739 575699 582992 590258
57678E90258P952Q237P949P963P972O785N230N752Q484J0510J0173R440J0576
$$ 590258 598210 606447 614396 622359 630331 637116 642346 648098 656582 667092 677265 686705 697281
57665F97281J2922J4569J5286J5886J6311J6088J5816J6680J8916K1646K3868
$$ 697281 710203 724772 740058 755944 772255 788343 804159 820839 839755 861401 885269
57654H85269K5170K5880K6682K7659K8098K7818K8031K9807L2440L4746L7191
$$ 885269 910439 936319 963001 990660 1018758 1046576 1074607 1104414 1136854 1171600 1208791
57643A208791M0920M5318M8524N0117N1365N3107N5354N8712O4031P0728P7319
$$ 1208791 1249711 1295029 1343553 1393670 1445035 1498142 1553496 1612208 1676239 1746967 1824286
57632A824286Q3529Q9917R6029J01284J07323J16663J28967J41449J53225J66278
$$ 1824286 1907815 1997732 2093761 2195045 2302368 2419031 2547998 2689447 2842672 3008950
57622C008950J81622J97531K12538K27211K41508K53099K60032K62809K62077
$$ 3008950 3190572 3388103 3600641 3827852 4069360 4322459 4582491 4845300 5107377
57613E107377K56208K43100K22917J97352J67288J32382R1700M3703j2714p5426
$$ 5107377 5363585 5606685 5829602 6026954 6194242 6326624 6418324 6462027 6449313 6373887
57603F373887j38212j93866k37607k67266k82243k83876k75699k61626k44231
$$ 6373887 6235675 6041809 5804202 5536936 5254693 4970817 4695118 4433492 4189261
57594D189261k25179k06001j87362j68771j50138j32657j17216j03016q8983p5627
$$ 4189261 3964082 3758081 3570719 3401948 3251810 3119153 3001937 2898921 2809938 2734311
57584B734311o4367n5466m7641l9332k9876j9882j0819l568K707R476J6776K3458
$$ 2734311 2669944 2614478 2566837 2527505 2497629 2477747 2466928 2463360 2466067 2475543 2492319 2515777
57572B515777K9428L6078M4180N2982O1819P1031Q0651Q9900R8679J08064J18523
$$ 2515777 2545205 2581283 2625463 2678445 2740264 2811295 2891946 2981846 3080525 3188589 3307112
57561C307112J29261J39948J51204J62408J70952J74920J74794J71055J61903
$$ 3307112 3436373 3576321 3727525 3889933 4060885 4235805 4410599 4581654 4743557
57552D743557J45223J21389R2321N8874K1185j9159n9178r6368j29111j55944
$$ 4743557 4888780 5010169 5102490 5161364 5182549 5163390 5104212 5007844 4878733 4722789
57542D722789j75956j89588j97782k00833j99158j94438j88443j81186j71742
$$ 4722789 4546833 4357245 4159463 3958630 3759472 3565034 3376591 3195405 3023663
57533C023663j60576j49606j39898j30601j20462j09532r9154r0755q4560p9326
$$ 3023663 2863087 2713481 2573583 2442982 2322520 2212988 2113834 2023079 1938519 1859193
57523A859193p3534o7077o1077n5994n1069m6087m2282m0408l9057l6274l1974
$$ 1859193 1785659 1718582 1657505 1601511 1550442 1504355 1462073 1421665 1382608 1346334 1314360
57512A314360k7475k3404j9659j6781j5511j5098j3720j0876q041o497n711m482
$$ 1314360 1286885 1263481 1243822 1227041 1211530 1196432 1182712 1171836 1163795 1157298 1151587 1147105
57500A147105k709j274n39L21K407N853R644J2677J4778J6481J8017J9165K0008
$$ 1147105 1144396 1143122 1142583 1142904 1145311 1151164 1160808 1173485 1188263 1204744 1222761 1241926 1261934
57487A261934K1110K2730K4594K6660K9423L2980L6569L9584M2501M6161N0587
$$ 1261934 1283044 1305774 1330368 1357028 1386451 1419431 1456000 1495584 1538085 1584246 1634833
57476A634833N5068N9219O3443O8429P4400Q0794Q6820R2513R8842J06248J13691
$$ 1634833 1689901 1749120 1812563 1880992 1955392 2036186 2123006 2215519 2314361 2420609 2534300
57465B534300J20030J25762J31955J37772J40698J39279J33945J24897J11121
$$ 2534300 2654330 2780092 2912047 3049819 3190517 3329796 3463741 3588638 3699759
57456C699759R2141O8972M2493J2681j9360n0269p6814r8335j15626j28727j37163
$$ 3699759 3791900 3860872 3903365 3916046 3896686 3846417 3769603 3671268 3555642 3426915 3289752
57445C289752j41278j41704j38490j32078j24318j16947j09735j01585r2755q4473
$$ 3289752 3148474 3006770 2868280 2736202 2611884 2494937 2385202 2283617 2190862 2106389
57435B106389p6945o9311o1363n3767m6850m0375l4409k9158k4199j8930j3647
$$ 2106389 2029444 1960133 1898770 1845003 1798153 1757778 1723369 1694211 1670012 1651082 1637435
57424A637435r086n098q13M005Q828J3419J8145K3271K8838L4973M1567M7860
$$ 1637435 1628349 1623251 1622438 1626443 1635271 1648690 1666835 1690106 1718944 1753917 1795484 1843344
57412A843344N3231N8250O4193P1684Q0326Q9312R7698J04601J09994J14933J20122
$$ 1843344 1896575 1954825 2019018 2090702 2171028 2260340 2358038 2462639 2572633 2687566 2807688
57401B807688J24596J26471J24505J18122J06618Q9583O7910M3199J6154j3450
$$ 2807688 2932284 3058755 3183260 3301382 3408000 3497583 3565493 3608692 3624846 3611396
57391C611396m4999p5996j03079j24007j38794j48985j55620j58121j55877j50506
$$ 3611396 3566397 3490401 3387322 3263315 3124521 2975536 2819916 2661795 2505918 2355412
57381B355412j45063j40572j35093j26857j16812j07003r8105q9984q3218p8115
$$ 2355412 2210349 2069777 1934684 1807827 1691015 1584012 1485907 1395923 1312705 1234590
57371A234590p3330o7374o0929n5874n2555m9588m5963m1731l7167l2776k9744
$$ 1234590 1161260 1093886 1032957 977083 924528 874940 828977 787246 750079 717303 687559
57360F87559k8734k8551k7472k5414k3412k1520j9091j6591j5270j5119j5011
$$ 687559 658825 630274 602802 577388 553976 532456 513365 496774 481504 466385 451374
57349D51374j4675j4769j5068j4567j3392j2755j2776j2215j0724r471r022q352
$$ 451374 436699 421930 406862 392295 378903 366148 353372 341157 330433 320962 311940 303588
57337C03588o730n017m244m143l873l234k524k009j926k294k499k013j491k044
$$ 303588 296858 291841 287597 283454 279581 276347 273823 271814 269888 267594 265095 263082 261591 259547
57323B59547l340l768k731j481j226j697k089k294k458k308j697j169j369k275
$$ 259547 256207 252439 249708 248227 247001 245304 243215 240921 238463 236155 234458 233289 231920 229645
57309B29645l324l989m121m052m221m389l652j777M2N53J6n33q70j312j536j073
$$ 229645 226321 222332 218211 214159 209938 205549 201897 200120 200162 200715 200731 200198 199328 198016 196480 195407
57293A95407m35l44m25j26k93k013m303m984l674k022j134o89n19q78j020L23
$$ 195407 194972 194628 194203 194077 193784 191771 187468 182484 178810 176788 175654 174965 174446 173568 172548 172871
57277A72871K657L931L500K848K887K624J322N7Q4J101K093K647K822K842L276
$$ 172871 175528 179459 182959 185807 188694 191318 192640 192697 192781 193882 195975 198622 201444 204286 207562
57262B07562M324M931M130L151M178O912Q577P865O655P045Q781J0475J1460J1553
$$ 207562 211886 216817 220947 224098 228276 235188 243765 251630 258285 265330 274111 284586 296046 307599
57248C07599J0811J0341J1486J3600J4482J3652J2976J3425J3743J3337J3808
$$ 307599 318410 328751 340237 353837 368319 381971 394947 408372 422115 435452 449260
57237D49260J6061J8297J8700J8122J8388J9751K1674K4223K7055K8851K9453
$$ 449260 465321 483618 502318 520440 538828 558579 580253 604476 631531 660382 689835
57226F89835L0765L3823L6840L7986L8237L9347M0733M0580L8631L5670L1503
$$ 689835 720600 754423 791263 829249 867486 906833 947566 988146 1026777 1062447 1093950
57215A093950K5565J8514J1288L677m440j1558j6169j8923k1470k4191k6510k8255
$$ 1093950 1119515 1138029 1149317 1152994 1148554 1136996 1120827 1101904 1080434 1056243 1029733 1001478
57203A001478k9236k8707k6755k4814k3469k1354j7682j3994j1729j0021p684
$$ 1001478 972242 943535 916780 891966 868497 847143 829461 815467 803738 793717 786033
57192G86033n269l192j53M232P462P547O189N756N286K881Q4N6K677M997N556
$$ 786033 780764 777572 777419 781651 789113 796660 802849 808605 813891 816772 816856 816912 819589 824586 830142
57177H30142N072M019K939L897P940J2240J3475J3032J4886J9272K2737K3952
$$ 830142 835214 839233 842172 846069 854009 866249 879724 892756 907642 926914 949651 973603
57165I73603K4965K6713K7800K8197K9843L2752L4392L3898L3473L4672L6595
$$ 973603 998568 1025281 1053081 1081278 1111121 1143873 1178265 1212163 1245636 1280308 1316903
57154A316903L8442M0607M2665M3614M4605M7859N2414N4781N4567N5325N8595
$$ 1316903 1355345 1395952 1438617 1482231 1526836 1574695 1627109 1681890 1736457 1791782 1850377
57143A850377O1177O0152N6870N3874N1292M8521M6446M5639M4798M3113M1973
$$ 1850377 1911554 1971706 2028576 2082450 2133742 2182263 2228709 2274348 2319146 2362259 2404232
57132B404232M2635M4405M6637N0151N5022N9365O1841O3319O4708O5461O5425
$$ 2404232 2446867 2491272 2537909 2588060 2643082 2702447 2764288 2827607 2892315 2957776 3023201
57121C023201O5748O6657O6726O5374O3532O0901N5666M8176M1661L7829L4990
$$ 3023201 3088949 3155606 3222332 3287706 3351238 3412139 3467805 3515981 3557642 3595471 3630461
57110C630461L2090L1012L2707L4654L4767L4741L6558L8616L8499L7240L7461
$$ 3630461 3662551 3693563 3726270 3760924 3795691 3830432 3866990 3905606 3944105 3981345 4018806
57099D018806L9031L9544L7741L4076K9091K3384J7855J2395N848j442p119j0120
$$ 4018806 4057837 4097381 4135122 4169198 4198289 4221673 4239528 4251923 4257771 4256329 4249210 4239090
57087D239090j2228j4837j6783j7157j7663k0270k4886l1093l9722n1048o3939
$$ 4239090 4226862 4212025 4195242 4178085 4160422 4140152 4115266 4084173 4044451 3993403 3929464
57076C929464p8155r4720j12836j29938j46244j65401j88825k13497k37488k63300
$$ 3929464 3851309 3756589 3643753 3513815 3367571 3202170 3013345 2799848 2562360 2299060
57066B299060k93214l25787l59952l98329m43170a4498n46951o06464o72330p41836
$$ 2299060 2005846 1680059 1320107 921778 478608 -14498 -561449 -1167913 -1840243 -2582079
57056b582079q13880q91664r77207j068515j165826j275025j400643j541146j695306
$$ -2582079 -3395959 -4287623 -5264830 -6333345 -7499171 -8774196 -10174839 -11715985 -13411291
57047a3411291j867072k059683k272121k507055k775368l087198l446158l858640
$$ -13411291 -15278363 -17338046 -19610167 -22117222 -24892590 -27979788 -31425946 -35284586
57039c5284586m340174m904750n555835o294415p124465q040111r017474j0029497
$$ -35284586 -39624760 -44529510 -50085345 -56379760 -63504225 -71544336 -80561810 -90591307
57031i0591307j1058309j2083616j3071853j3982750j4763819j5336061j5644319
$$ -90591307 -101649616 -113733232 -126805085 -140787835 -155551654 -170887715 -186532034
57024a86532034j5769387j5925179j6213631j6342199j5676412j3669208j0253376
$$ -186532034 -202301421 -218226600 -234440231 -250782430 -266458842 -280128050 -290381426
57017b90381426n820662q95844M102918Q856061J3060125J6443713J8842919K0230361
$$ -290381426 -296202088 -297097932 -292995014 -284138953 -271078828 -254635115 -235792196 -215561835
57009b15561835K0692161K0396710J9554436J8361163J6961251J5456651J3929273
$$ -215561835 -194869674 -174472964 -154918528 -136557365 -119596114 -104139463 -90210190
57002i0210190J2440942J1026769R706743Q499627P417212O454625N598632M840930
$$ -90210190 -77769248 -66742479 -57035736 -48536109 -41118897 -34664272 -29065640 -24224710
56994b4224710M175953L593275L082209K639323K263402J947123J680280J456378
$$ -24224710 -20048757 -16455482 -13373273 -10733950 -8470548 -6523425 -4843145 -3386767
56986c386767J269614a006783c6099H13865P48978O62263N82757N09745M46028
$$ -3386767 -2117153 -1006783 -36099 813865 1562843 2225106 2807863 3317608 3763636
56977C763636L90940L42288L01543K70546K45863K22531K00845J83647J69451
$$ 3763636 4154576 4496864 4798407 5068953 5314816 5537347 5738192 5921839 6091290
56968F091290J54164J37518J22048J07551R2201P7607O7079N9782N1811M2344
$$ 6091290 6245454 6382972 6505020 6612571 6704772 6782379 6849458 6909240 6961051 7003395
56958G003395L3904K7271K0779J4339R856P797O892O791P766Q672Q332P785Q296
$$ 7003395 7037299 7064570 7085349 7099688 7109544 7117341 7124233 7131024 7138790 7147462 7155794 7163579 7171875
56945G171875R403J2290K1662L7916M8872L6315p549p3991j47405k15772k71623
$$ 7171875 7181278 7193568 7215230 7253146 7302018 7338333 7330784 7256793 7109388 6893616 6621993
56934F621993l09937l29528l33879l27879l15204k99214k83234k68383k53472
$$ 6621993 6312056 5982528 5648649 5320770 5005566 4706352 4423118 4154735 3901263
56925C901263k38098k23637k10558j97575j84574j73779j66632j61689j56855
$$ 3901263 3663165 3439528 3228970 3031395 2846821 2673042 2506410 2344721 2187866
56916B187866j51717j46482j40513j33220j24822j15305j04186r1987q0274o9412
$$ 2187866 2036149 1889667 1749154 1615934 1491112 1375807 1271621 1179634 1099360 1029948
56906A029948n8126m6138l5347k7262k0922j4699q654l750J20L669O499P183M854
$$ 1029948 971822 925684 890337 863075 842153 827454 818800 815050 815170 818839 825338 832521 837375
56893H37375L9n960j1979j7517k2536k6628k8781k8486k6541k3974k0817j6966
$$ 837375 837414 831454 819475 801958 779422 752794 724013 695527 668986 645012 624195 607229
56881F07229j3594j2017j1605j0474q014n031j623L096Q861J3874J6952J8314
$$ 607229 593635 581618 570013 559539 551525 546494 544871 547967 556828 570702 587654 605968
56869F05968J7753J3891O193l701j3458k1630k7431l0386l1034l0670k9699k7382
$$ 605968 623721 637612 643805 640104 626646 605016 577585 547199 516165 485495 455796 428414
56857D28414k3587j9449j5751j2147q708o528n806m761j902J758M007M148L187
$$ 428414 404827 385378 369627 357480 348772 342244 336438 331677 329775 331533 335540 339688 342875
56844C42875K038R00J8r2P58K274L994N336N780N479N427O559Q877J1619J3987
$$ 342875 344913 345813 345831 345739 346497 348771 352765 358101 363881 369360 374787 381346 390223 401842 415829
56829D15829J5645J6875J8315K0096K1396K1255J9528J6424J1715N509o89n101
$$ 415829 431474 448349 466664 486760 508156 529411 548939 565363 577078 582587 581898 576797
56817E76797p633r236r655p728m028j051K1Q49L303O943J0376J3636J7673K2504
$$ 576797 569164 559928 550273 542545 538517 537466 537487 538336 541639 548582 558958 572594 590267 612771
56803F12771K7217L1345L5193L9061M2620M4373M1733L3043K0117P301k801j1188
$$ 612771 639988 671333 706526 745587 788207 832580 874313 907356 927473 934774 931973 920785
56791I20785j9181k5229k6868k4508k1020j8107j5022j0620m862J801R042J6282
$$ 920785 901604 876375 849507 824999 803979 785872 770850 760230 755368 757169 766211 782493
56779G82493K2804K8528L4052L9885M6252N3160N9635O3067O0407N0364L4005
$$ 782493 805297 833825 867877 907762 954014 1007174 1066809 1129876 1190283 1240647 1274652
56768A274652J3640p966k7509m1804m9419n1468n0411m8101m4853m0085l3597
$$ 1274652 1288292 1280326 1252817 1211013 1161594 1110126 1059715 1011614 966761 926676 893079
56757H93079k6132j8642j1390m218K592Q502J3708J9062K4935L0773L5722L8550
$$ 893079 866947 848305 836915 832697 835289 843791 857499 876561 901496 932269 967991 1006541
56745A006541L7180K9929J7763L964q991k0895l1717l9940m4238m5272m4337m1420
$$ 1006541 1043721 1073650 1091413 1095377 1086386 1065491 1033774 993834 949596 904324 859987 818567
56733H18567l6173k9775k4146j9873j6245j2732r117m992l76L815P171J0667J4802
$$ 818567 782394 752619 728473 708600 692355 679623 670506 665514 665138 668953 676124 686791 701593
56720G01593J7850J7655J4240Q927J930o918j5907k2542k6635k9914l2574l2880
$$ 701593 719443 737098 751338 760265 762195 755277 739370 716828 690193 660279 627705 594825
56708E94825l0522k7738k6092k4473k1449j7740j4856j2810j0639q282o570n927
$$ 594825 564303 536565 510473 486000 464551 446811 431955 419145 408506 400224 393654 387727
56696C87727n924n736m639k681j061j013k106k658j958q64r5O68J499J652J000
$$ 387727 381803 376067 371428 368747 367686 366673 364567 361909 359951 359087 358992 359660 361159 362811 363811
56681C63811O26J102J461P63n19j636k795m058m283k691o77m28k025l414l097
$$ 363811 364437 365539 367000 367763 367244 365608 362813 358755 354472 351781 351104 350676 348651 345237 342140
56666C42140j581k91q7r16k036k375j473j61K77l38q88m15P41J397O91j175l090
$$ 342140 340559 340268 340181 339265 337229 334854 333381 333220 333497 333159 332271 331856 332597 333994 334685 333510 330420
56649C30420l823l039j600o87n63m32L60J226Q49j083l109l485k226r54o48o05
$$ 330420 326597 323558 321958 321271 320708 320276 320636 321862 322711 321628 318519 315034 312808 311854 311206 310601
56633C10601lN52K4j344k483l135l843m670n105n062m817m227l122k117j837j655
$$ 310601 310598 311150 311174 309830 307347 304212 300369 295699 290594 285532 280715 276488 273366 271249 269412 267757
56617B67757o78M18L04n09j57J497K496J944J280J515J495K66p35K33K416L597
$$ 267757 267079 267497 267801 267292 267135 268632 271128 273072 274352 275867 277362 277628 276893 277126 279542 283139
56601B83139L070J940J215R78R79Q48J31j021j695j403o33L12J827L645M221K646
$$ 283139 286209 288149 289364 290342 291321 292169 292300 291279 289584 288181 287548 287860 289687 293332 297553 300199
56585C00199O7j939l203m067m034k809j460r48n86L19M93j532m518n734m567k779
$$ 300199 300266 298327 295124 291057 287023 284214 282754 281806 281220 281539 282032 280500 275982 270248 265681 262902
56569B62902j547n52J38k71j370j479j49J081J102P49J112J924K479K803L004
$$ 262902 261355 260803 260941 260670 259300 257821 257672 258753 259855 260604 261716 263640 266119 268922 271926
56554B71926K670J844J618K635L787L442J564k79q57m58j44k53j2J312L086L712
$$ 271926 274596 276440 278058 280693 284480 287922 289486 289207 288350 287892 287748 287495 287483 288795 291881 295593
56538B95593K620J173R86J895K473K108J503J297J382J543J833K006J494J99j156
$$ 295593 298213 299386 300372 302267 304740 306848 308351 309648 311030 312573 314406 316412 317906 318105 316949
56523C16949j724j161K61J778K612K719K729K759K135J005J043L173N454N124
$$ 316949 315225 314064 314325 316103 318715 321434 324163 326922 329057 330062 331105 334278 339732 344856
56509C44856K504Q93K315N158O662O245N377N315O043O950P591P867P814P335
$$ 344856 347360 348253 350568 355726 362388 368633 374010 379325 385368 392318 399909 407776 415590 422925
56495D22925O251M819L808L669L945M041M013L991L478K099N82q7N4L12M16K26
$$ 422925 429176 433995 437803 441472 445417 449458 453471 457462 460940 463039 463621 463534 463588 463900 464316 464542
56479D64542q59k868m419m369l653l812m508m395l773m071m998m795l356k554
$$ 464542 463683 460815 456396 452027 448374 444562 440054 435659 431886 427815 422817 418022 414666 412112
56465D12112k992l001j579L4O10N54K13j128l293m333l168j464j277k394l449
$$ 412112 409120 406119 404540 404574 405184 405738 405951 404823 401530 397197 394029 392565 391288 388894 385445
56450C85445m119m565m113k379o94o46j877k832k912k541j895j071q45j743k871
$$ 385445 381326 376761 372648 370269 369575 368929 367052 364220 361308 358767 356872 355801 354956 353213 350342
56435C50342k876j719l64O59J351J539J246J154J521J363n5j538j310M57J947
$$ 350342 347466 345747 345383 346042 347393 348932 350178 351332 352853 354216 354161 352623 351313 351770 353717
56420C53717K399K896M288N766O020M937L506K560K122J898K030L122N272P421
$$ 353717 356116 359012 363300 369066 375086 380023 383529 386089 388211 390109 392139 395261 400533 407954
56406D07954Q328Q078P775P794P422O397N603N618N740N173M154L168K116J089
$$ 407954 416282 424360 432135 439929 447351 453748 459351 464969 470709 475882 480036 483204 485320 486409
56392D86409Q58J580J993J039n31j303j197j183j576j946k282l037m113m703m182
$$ 486409 487267 488847 490840 491879 491348 490045 488848 487665 486089 484143 481861 478824 474711 470008 465826
56377D65826k694j036k57p47j563j394n00m85j731k543j737o03q87k103k511j924
$$ 465826 463132 462096 461839 461092 459529 458135 457635 457150 455419 452876 451139 450536 449649 447546 445035 443111
56361D43111j672k311l025l160k854k129p36R49J964J958J529J251R92L11q95
$$ 443111 441439 439128 436103 432943 430089 427960 427224 428173 430137 432095 433624 434875 435867 436178 435283
56346D35283k207k997l047k850k782k246m91J722K700K263K081K924L225J518
$$ 435283 433076 430079 427032 424182 421400 419154 418663 420385 423085 425348 427429 430353 433578 435096
56332D35096j076k179j023J261L308M344M028K686J149l29k125l752l613j171
$$ 435096 434020 431841 430818 432079 435387 439731 443759 446445 447594 447265 445140 441388 437775 436604
56318D36604J950M110N453O612P129O533N513M512K708m0j741p23J875L924N155
$$ 436604 438554 442664 448117 454729 461858 468391 473904 478416 481124 481084 479343 478620 480495 484419 489574
56303D89574O116N859L327R2j083K04K082L410M271M297L134K150K963M574M534
$$ 489574 495690 501549 504876 504968 503885 504089 506171 509581 513852 518149 521283 523433 526396 530970 535504
56288E35504K855J993K866L606K816J547J307K243L909N910P230O789N315M912
$$ 535504 538359 540352 543218 546824 549640 551187 552494 554737 558646 564556 571786 578575 583890 588802
56274E88802O265P860Q386Q161P744O969O036N991P341R343J1127J2353J2702
$$ 588802 595067 602927 611313 619474 627218 634187 640223 646214 653555 662898 674025 686378 699080
56261F99080J2040J1278J1573J2544J2728J1985J1850J3169J4946J5939J6027
$$ 699080 711120 722398 733971 746515 759243 771228 783078 796247 811193 827132 843159
56250H43159J5505J4388J2816J1308J0209R643R746J0083R435P433N671N755O892
$$ 843159 858664 873052 885868 897176 907385 917028 926774 936857 946292 953725 959396 965151 972043
56237I72043P253O938P398Q554R114R504J1630J5333J7887J7889J7266J8350K0927
$$ 972043 979296 986234 993632 1002186 1011300 1020804 1032434 1047767 1065654 1083543 1100809 1119159 1140086
56224A140086K3399K5252K7140K9667L2869L6187L8691M0318M2636M7055N2574
$$ 1140086 1163485 1188737 1215877 1245544 1278413 1314600 1353291 1393609 1436245 1483300 1535874
56213A535874N6935N9770O2775O6981P2016P7853Q5017R2871J00041J06980J15739
$$ 1535874 1592809 1652579 1715354 1782335 1854351 1932204 2017221 2110092 2210133 2317113 2432852
56202B432852J26757J38154J48728J59312J70399J80846J90027J99084K08704
$$ 2432852 2559609 2697763 2846491 3005803 3176202 3357048 3547075 3746159 3954863
56193C954863K17376K23103K25455K24792K20814K12876K00728J84293J63619
$$ 3954863 4172239 4395342 4620797 4845589 5066403 5279279 5480007 5664300 5827919
56184E827919J39401J12539Q3292N2104K0872q263l5005n9818q1252r6920j07171
$$ 5827919 5967320 6079859 6163151 6215255 6236127 6227864 6192859 6133041 6051789 5954869 5847698
56173E847698j15231j23240j30554j36303j40987j44866j47288j48481j49866
$$ 5847698 5732467 5609227 5478673 5342370 5201383 5056517 4909229 4760748 4610882
56164D610882j51767j52966j53104j53294j53715j52929j50316j47006j43736
$$ 4610882 4459115 4306149 4153045 3999751 3846036 3693107 3542791 3395785 3252049
56155C252049j40031j36048j32681j29169j23236j14674j06298j00118r4870q8495
$$ 3252049 3112018 2975970 2843289 2714120 2590884 2476210 2369912 2269794 2174924 2086429
56145B086429q0979p3562o7095o2054n8392n4685m9367m3214l8467l5302l1776
$$ 2086429 2005450 1931888 1864793 1802739 1744347 1689662 1640295 1597081 1558614 1523312 1491536
56134A491536k7498k4455k3512k2962k1421j9347j7026j3891j0637q988q573p026
$$ 1491536 1464038 1439583 1416071 1393109 1371688 1352341 1335315 1321424 1310787 1301799 1293226 1286200
56122A286200l888j145Q11L994Q530J1477J1363J0259R790R003Q002R546J4476
$$ 1286200 1282312 1281167 1281978 1285972 1294502 1305979 1317342 1327601 1337391 1346394 1354396 1363942 1378418
56109A378418J9192K0531J9979K0369K1514K1937K2133K3205K4504K5119K5558
$$ 1378418 1397610 1418141 1438120 1458489 1480003 1501940 1524073 1547278 1571782 1596901 1622459
56098A622459K6027K5355K3463K2296K2615K2796K2360K3475K6951L0227L1561
$$ 1622459 1648486 1673841 1697304 1719600 1742215 1765011 1787371 1810846 1837797 1868024 1899585
56087A899585L2938L6645M2321M9471N9175P0875Q1393Q9812R9491J12334J25210
$$ 1899585 1932523 1969168 2011489 2060960 2120135 2191010 2272403 2362215 2461706 2574040 2699250
56076B699250J35223J44302J54547J62830J64551J59665J50954J39171J24170
$$ 2699250 2834473 2978775 3133322 3296152 3460703 3620368 3771322 3910493 4034663
56067D034663J08291R4503Q3062P2973O4115N4871M1140K1458K32j7614l2111
$$ 4034663 4142954 4237457 4320519 4393492 4457607 4512478 4553618 4575076 4575308 4557694 4525583
56056D525583m5096n5682o3258p1330q3477r8220j12341j26032j39962j50499
$$ 4525583 4480487 4424805 4361547 4290217 4206740 4108520 3996179 3870147 3730185 3579686
56046C579686j53360j49707j43558j35407j23467j09022r5349q2952p0599n9334
$$ 3579686 3426326 3276619 3133061 2997654 2874187 2765165 2669816 2586864 2516265 2456931
56036B456931n0873m3921l6406k9531k5293k2293j8325j4810j4171j5198j5434
$$ 2456931 2406058 2362137 2325731 2296200 2270907 2248614 2230289 2215479 2201308 2186110 2170676
56025B170676j5551j6768j6887j3870j0428r797r865o992k721p05K26L608Q318
$$ 2170676 2155125 2138357 2121470 2107600 2097172 2087375 2077510 2070518 2067797 2067092 2067318 2070926 2079244
56012B079244J0506J0652J2295J5364J6952J7314J9028K1686K3216K4884K8984
$$ 2079244 2089750 2100402 2112697 2128061 2145013 2162327 2181355 2203041 2226257 2251141 2280125
56001B280125L3209L3528L1272L1272L4195L6611L7334L7901L8208L7439L7758
$$ 2280125 2313334 2346862 2378134 2409406 2443601 2480212 2517546 2555447 2593655 2631094 2668852
55990B668852M1397M5777M7095M6659M8009N0333N0887N1223N4335N8193N9036
$$ 2668852 2710249 2756026 2803121 2849780 2897789 2948122 2999009 3050232 3104567 3162760 3221796
55979C221796N8667O1447O6447O9696P1689P5505Q0047Q2662Q5681R2568J00394
$$ 3221796 3280463 3341910 3408357 3478053 3549742 3625247 3705294 3787956 3873637 3966205 4066599
55968D066599J04264J06356J12179J20766J27345J32872J41730J52469J60170
$$ 4066599 4170863 4277219 4389398 4510164 4637509 4770381 4912111 5064580 5224750
55959E224750J65538J72481J79565J83391J87337J96820K09004K17813K25864
$$ 5224750 5390288 5562769 5742334 5925725 6113062 6309882 6518886 6736699 6962563
55950F962563K40284K59728K77258K93080L12362L33325L50156L65045L84443
$$ 6962563 7202847 7462575 7739833 8032913 8345275 8678600 9028756 9393801 9778244
55941I778244M06232M23893M40428M64115M93442N20950N48850N84998O26227
$$ 9778244 10184476 10608369 11048797 11512912 12006354 12527304 13076154 13661152 14287379
55932A4287379O62415O94779P33003P76500Q16608Q55559R04272R62677J021486
$$ 14287379 14949794 15644573 16377576 17154076 17970684 18826243 19730515 20693192 21714678
55923B1714678J082043J154144J235497J314700J393681J485002J587769J689688
$$ 21714678 22796721 23950865 25186362 26501062 27894743 29379745 30967514 32657202
55915C2657202J792117J908298K037674K168613K306389K470230K662655K871717
$$ 32657202 34449319 36357617 38395291 40563904 42870293 45340523 48003178 50874895
55907E0874895L103612L380808L708212M077077M503608N025084N655956O388591
$$ 50874895 53978507 57359315 61067527 65144604 69648212 74673296 80329252 86717843
55899H6717843P237880Q238365R397276J0705518J2198889J3948678J5988684
$$ 86717843 93955723 102194088 111591364 122296882 134495771 148444449 164433133
55892A64433133J8316963K0959743K3935670K7154805L0458086L3687607L6393104
$$ 164433133 182750096 203709839 227645509 254800314 285258400 318946007 355339111
55885C55339111L7306984L4478571K6535422J4077337l17160j3606877k3855937
$$ 355339111 392646095 427124666 453660088 467737425 467420265 453813388 429957451
55878D29957451l0583144l4137014l5102717l4136849l1922653k9042363k5908275
$$ 429957451 399374307 365237293 330134576 295997727 264075074 235032711 209124436
55871B09124436k2816124j9975443j7470699j5275825j3347458j1672237j0230471
$$ 209124436 186308312 166332869 148862170 133586345 120238887 108566650 98336179
55864I8336179q978777p888217o956582o170500n493451m900649m390577l954178
$$ 98336179 89357402 81469185 74512603 68342103 62848652 57948003 53557426 49603248
55856D9603248l565797l212437k901505k632643k390142k168967j980290j824434
$$ 49603248 46037451 42825014 39923509 37290866 34900724 32731757 30751467 28927033
55848B8927033j684110j550841j433701j335568j244164j153225j070640r99120
$$ 28927033 27242923 25692082 24258381 22922813 21678649 20525424 19454784 18455664
55840A8455664r29554q59741p99899p53183p09513o64524o26296n97187n66915
$$ 18455664 17526110 16666369 15866470 15113287 14403774 13739250 13112954 12515767 11948852
55831A1948852n30466m96227m69713m44862m17949l94929l78215l60444l37964
$$ 11948852 11418386 10922159 10452446 10007584 9589635 9194706 8816491 8456047 8118083
55822H118083l17502l03249k89942k74374k61352k52697k42417k28377k17049
$$ 8118083 7800581 7497332 7207390 6933016 6671664 6418967 6176550 5948173 5731124
55813E731124k11283k04776j94029j84491j79356j73184j62365j51557j44170
$$ 5731124 5519841 5315065 5121036 4936545 4757189 4584005 4421640 4270083 4125913
55804D125913j36405j26246j18546j15531j11635j03498r6401r5200r7116r8598
$$ 4125913 3989508 3863262 3744716 3629185 3517550 3414052 3317651 3222451 3125335 3026737
55794C026737j01029j04604j04587r8973r2487q8418q3862p7210p2366p0858o7608
$$ 3026737 2925708 2821104 2716517 2617544 2525057 2436639 2352777 2275567 2203201 2132343 2064735
55783B064735n9558n1156m6481m2991l7941l3848l2528l0561k5845k2247k2614
$$ 2064735 2005177 1954021 1907540 1864549 1826608 1792760 1760232 1729671 1703826 1681579 1658965
55772A658965k3343k0917j8009j8071j9377j9355j9516k1420k2926k2848k4284
$$ 1658965 1635622 1614705 1596696 1578625 1559248 1539893 1520377 1498957 1476031 1453183 1428899
55761A428899k8857l2693l2447l0439k9619k8439k5246k2819k3699k5218k3787
$$ 1428899 1400042 1367349 1334902 1304463 1274844 1246405 1221159 1198340 1174641 1149423 1125636
55750A125636k0530j8492j7633j6332j4617j2694r617o036m577n181m332j133
$$ 1125636 1105106 1086614 1068981 1052649 1038032 1025338 1015721 1009685 1005108 999927 995595 994462
55738I94462O76q26k426j861j824m463p090p263p267r479j1847j1982j1415j1834
$$ 994462 995138 994312 991886 990025 988201 983738 976648 969385 962118 952639 940792 928810 917395 905561
55724I05561j1460r246q258j0410j1984r149m428l044n904j0454j5331j9833k1699
$$ 905561 894101 884855 876597 866187 854203 845054 840626 837582 831678 821224 805893 786060 764361
55711G64361j9853j7107j6481j7087j6866j6501j7116j7106j4943j2554j2318
$$ 764361 744508 727401 710920 693833 676967 660466 643350 626244 611301 598747 586429
55700E86429j3151j2939j2287j2556j2789j1934j1516j2803j3912j3018j1732
$$ 586429 573278 560339 548052 535496 522707 510773 499257 486454 472542 459524 447792
55689D47792j1875j1660q815n044l481l814l627k780k855l782m349m759n699o221
$$ 447792 435917 424257 415442 410398 406917 403103 399476 396696 393841 390059 385710 380951 375252 369031
55675C69031n165l301j823m10J125J354l59k104k304k161l079m074m030m008m975
$$ 369031 363866 360565 358742 358332 359457 360811 360452 358348 356044 353883 350804 346730 342700 338692 333717
55660C33717n775n650o072p613p883n297k061o47j13J138J977J133L12J374K941
$$ 333717 327942 322292 316220 308607 300724 295427 293366 292719 292606 293744 295721 296854 297166 298540 301481
55645C01481L132L056M138M660K725K32N0J385J720J252J500J613J40j306l45
$$ 301481 304613 307669 311807 316467 319192 319424 319474 320859 322579 323831 325331 326944 327084 325778 325433
55630C25433J725J912P20J217L944O719Q663J0499J1437R672N927L103K318K143
$$ 325433 327158 329070 329790 331007 334951 341670 350333 360832 372269 381941 387868 390971 393289 395432
55616C95432J561R96O23P4m42o49j179k169k123k26J673J747J253K269M003M274
$$ 395432 396993 397989 398612 398686 398244 397595 396416 394247 392124 391898 393571 395318 396571 398840 402843 407117
55600D07117L299K907L172K853K227K381K618J490k77p02K97J257J736J946Q76
$$ 407117 410416 413323 416495 419348 421575 423956 426574 428064 427787 427085 427382 428639 430375 432321 433197
55585D33197k356o117p985q073q051q011p140o371p203q687q744p887q489j0767
$$ 433197 430841 424724 416739 408666 400615 392604 385464 379093 371890 363203 354459 346572 338083 327316
55571C27316j2535j2694j2127j1323r842q133p368p539p731p885q261p958o318
$$ 327316 314781 302087 289960 278637 268795 260662 253294 245755 238024 230139 221878 213920 207602
55558B07602m902n535p136p082n061l038k054j704j885k526k274l39J241R0k522
$$ 207602 202700 197165 190029 182947 177886 174848 172794 171090 169205 166679 164405 164066 165307 165397 162875
55543A62875l307j987j285k245l004k438j685j603j636j736k730m174m362l006
$$ 162875 159568 157581 156296 154051 151047 148609 146924 145321 143685 141949 139219 135045 130683 127677
55529A27677j735j519j632j478j355j211n96p6p30k202l008k684j887p85P67J972
$$ 127677 125942 124423 122791 121313 119958 118747 118151 118075 117345 115143 112135 109451 107564 106779 107546 109518
55513A09518K066J942K589K802J023j306j284R02K142J180j0P2M96M49Q23K071
$$ 109518 111584 113526 116115 118917 119940 118634 117350 118252 120394 121574 121564 121636 122132 122581 123404 125475
55497A25475K829K050O04k36n12r07j659k627l372l099j629j83J50K04J418L365
$$ 125475 128304 130354 130958 130722 130210 129303 127644 125017 121645 118546 116917 116734 116884 117088 118506 121871
55481A21871M394M228L815L244J969O89N93J013L11j149j264O22L115N165O701
$$ 121871 126265 130493 134308 137552 139521 140210 140803 141816 142127 140978 139714 140336 143451 148616 155317
55466A55317P005N172K278N87M63L68j8N74K111K745J735L57o48k016l721m348
$$ 155317 162322 167494 169772 170359 170822 171190 171172 171746 173857 176602 178337 178694 178046 176030 172309 167961
55450A67961l562k974l632m583m759m401m017l610l551m485n901o493o171o013
$$ 167961 164399 161425 157793 153210 148451 144050 140033 136423 132872 128387 122486 115993 109822 103809
55436A03809o156n681m703m434m916m696l135j167L17J033M48j480l005k403q86
$$ 103809 97653 91972 87269 82835 77919 73223 70088 68921 69238 70271 70719 69239 66234 63831 62945
55421F2945j061k733l215j708j62M78J326K243J154k044m290l772k419k287k387
$$ 62945 61884 59151 55936 54228 54066 54544 55870 58113 59267 57223 52933 49161 46742 44455 42068
55406D2068j214K23K44o54r79o72m10j06L43K71l26k00R07J243k76k089k379j684
$$ 42068 40854 41077 41321 40667 39688 39016 38606 38500 38843 39114 38788 38588 39495 40738 40462 38373 35994 34310
55388C4310j533j932k032j971k246k320j426P5J440K649L678L769K590J066R8
$$ 34310 32777 30845 28813 26842 24596 22276 20850 20925 22365 25014 28692 32461 35051 36117 36215
55373C6215m59p32j61J085J553N41o80q05l10j49p3L48M80k06q79p20m81j129
$$ 36215 35756 35024 34863 35948 37501 38042 37362 36557 36247 36098 36025 36373 36853 36647 35768 35048 34567 33438
55355C3438j995j679j90J211J671J279O09N51J774L519L935K470Q46P04J372J219
$$ 33438 31443 29764 29574 30785 32456 33735 34344 34895 36669 40188 44123 46593 47439 48143 49515 50734
55339E0734J84m04L5O51K85j424l692m912l938j455N85J131P86L27k30q23r49
$$ 50734 50918 50514 50549 51200 51485 50061 46369 41457 37519 36064 36649 37780 38566 38893 38663 37840 36891
55322C6891o61p48j391j824j764j763j838j268k65j25r95j189K63J945K038O24
$$ 36891 36230 35482 34091 32267 30503 28740 26902 25634 25369 25244 24249 23060 23323 25268 27306 27930
55306B7930r60j823j649n13O16M38p34r56O88K760L612L324K631J516p7j468k132
$$ 27930 26970 25147 23498 22985 23601 24039 23305 22349 23037 25797 29409 32733 35364 36880 36803 35335 33203
55289C3203k168j315Q26L048L035O00j657j974j525j621j291M68K175J910K38
$$ 33203 31035 29720 30546 33594 36629 37229 35572 33598 32073 30452 29161 29629 31804 33714 33952
55274C3952j066j783k600l102k547j505o58P72L264M981L942J303r7K98O61J09
$$ 33952 32886 31103 28503 25401 22854 21349 20691 21463 24727 29708 33650 34953 34856 35154 35815 35924
55258C5924m34m80o14p69j51Q53P18p05j549n66J069J389R3j422j906j465j033
$$ 35924 35490 35010 34396 33627 33476 34329 35047 34342 32793 32227 33296 34685 34778 33356 31450 29985 28952
55241B8952r70n57P75K132K161J239J105K006K069M12j046l66J457K154J456P03
$$ 28952 27982 27425 28200 30332 32493 33732 34837 36843 38912 39324 38278 37912 39369 41523 42979 43682
55225D3682K52n61j483j530r22r07j737k342k136j733j814k325k681k033J40K804
$$ 43682 43934 43373 41890 40360 39438 38531 36794 34452 32316 30583 28769 26444 23763 21730 21870 24674
55209B4674L688K043J30L97K094K618J511P11J072J140Jq53L11K783M142K967
$$ 24674 28362 30405 30535 30932 33026 35644 37155 37866 38938 40078 40079 39226 39537 42320 46462 49429
55193D9429O5k558l426k541j034J12P93J193J087L21n29p92p09j013j670j763
$$ 49429 49494 46936 43510 40969 39935 40047 40840 42033 43120 43441 42912 42120 41411 40398 38728 36965
55177C6965o01J469L263L613K372P20p6k40r91k357k726j170J048K126J857J123
$$ 36965 36364 37833 41096 44709 47081 47801 47725 47485 46494 44137 41411 40241 41289 43415 45272 46395
55161D6395K80p89j790k243k108j518n37L43M57K30Q98K306K575J010l65L60K157
$$ 46395 46675 45886 44096 41853 39745 38227 37690 38033 38490 38720 39618 41924 44499 45509 45144 45504 47661
55144D7661K812K076J130J63j256k298j727j66O22M39O53J642K214J614L83q42
$$ 47661 50473 52549 53679 53842 52586 50288 48561 48395 49017 49456 50109 51751 53965 55579 55962 55120
55128E5120j870k211j364P4Q68O60o4j172k648l525k725q49L92N36O88J432J956
$$ 55120 53250 51039 49675 49749 50617 51277 51213 50041 47393 43868 41143 40294 40686 41222 41910 43342 45298
55111D5298J462J43j382k497k485j228Q0P6r73j754j927k113k130j034R27K167
$$ 45298 46760 46903 45521 43024 40539 39311 39391 39467 38494 36740 34813 32700 30570 29536 30463 32630
55095C2630J939J138M80n17j991k712j693O0P35J04l22N80K050K424J221k92o30
$$ 32630 34569 35707 36187 35670 33679 30967 29274 29334 30069 30173 29851 30431 32481 34905 36126 35834 35204
55078C5204K76J460K407L179L442K637J244M12P3q85k175j881L50K085J625N96
$$ 35204 35480 36940 39347 42526 45968 48605 49849 50261 50334 49449 47274 45393 45743 47828 49453 50049
55062E0049J033J959J476N51J405L262L209J058j55J067K623K392J088K20l18
$$ 50049 51082 53041 54517 55068 56473 59735 62944 64002 63847 64914 67537 69929 71017 71237 70919
55047G0919j120j508o20R33J831J662R76M20M88J194J669R27n88j292o36K06K90
$$ 70919 69799 68291 67671 68604 70435 72097 73073 73493 73981 75175 76844 77771 77183 75891 75255 75461 75751
55030G5751K86J224K760L652L319K286J415J127J207J237J293J830K476J811p21
$$ 75751 76037 77261 80021 83673 86992 89278 90693 91820 93027 94264 95557 97387 99863 101674 100953
55015A00953l354l783k070l30J69O4O8j52q12j187o59L29R79J054P80M57L30K95
$$ 100953 97599 93816 91746 91416 91585 91649 91717 91565 90753 89566 88907 89236 90215 91269 92049 92506 92836 93131
54997I3131j91j251j886j065P22J885J612M16q57j569j257j65M45j84q64O2K077
$$ 93131 92940 91689 89803 88738 89460 91345 92957 93373 92516 90947 89690 89525 89970 89786 88922 88984 91061
54980I1061K945J811J79m71n29j095k142k586j640L15J861J796O43L45J791L467
$$ 91061 94006 95817 95996 95525 94996 93901 91759 89173 87533 87848 89709 91505 92148 92493 94284 97751
54964I7751L496K083N92o98k159k894j523J355L514L905L366K720J921J094N35
$$ 97751 101247 103330 103922 103224 101065 98171 96648 98003 101517 105422 108788 111508 113429 114523 115058
54949A15058k47j671k431p47K660M945M719L217J802M60q57j525j500j370q30
$$ 115058 114811 113140 110709 109962 112622 117567 122286 125503 127305 127765 126908 125383 123883 122513 121683
54934A21683P81K226J161k104m145k935m62M16m33j519k415l393l908l360k441
$$ 121683 122464 124690 125851 123747 119602 116667 116205 116621 116188 114669 112254 108861 104953 101593 99152
54919I9152k055j748n60J178K244K240J839J722J980K292K138J315L79L6J66L24
$$ 99152 97097 95349 94789 95967 98211 100451 102290 104012 105992 108284 110422 111737 112116 112152 112318 112642
54903A12642R26K655M765N571M856M189M568N329N838O599Q045R699J1133J2439
$$ 112642 113568 116223 120988 126559 131415 135604 140172 145501 151339 157938 165983 175682 186815 199254
54889A99254J3391J3534J3314J3626J4128J3830J3290J3949J5015J3707R399M788
$$ 199254 212645 226179 239493 253119 267247 281077 294367 308316 323331 337038 346437 351225
54877C51225J800r77n120r286j1470j2271j3512j5116j5636j4844j3682j2458
$$ 351225 353025 352048 346928 337642 326172 313901 300389 285273 269637 254793 241111 228653
54865B28653j0948r601r031q881q419p537o143l668l88J853J755L93k92J03R00
$$ 228653 217705 208104 199073 190192 181773 174236 168093 164425 164037 165890 167645 168038 167746 167849 168749
54850A68749K108M217O872R153J0594J1089J0607R870J0253J1898J3078J2468
$$ 168749 170857 175074 181946 191099 201693 212782 223389 233259 243512 255410 268488 280956
54838B80956J0886R637Q402O120K857o70m318p982j0844j2511j3782j5048j5190
$$ 280956 291842 301479 309881 316001 318858 318188 313870 305888 295044 282533 268751 253703 238513
54825B38513j3602j1884j1646j1824j0403p907o809p756q642p651n404l665l181
$$ 238513 224911 213027 201381 189557 179154 171247 164438 156682 148040 140389 134985 131320 128139
54812A28139l359l288k711k210k393k869k744k062j668j485m57J255J849O29n48
$$ 128139 124780 121492 118781 116571 114178 111309 108565 106503 104835 103350 102893 104148 105997 106626 106078
54797A06078N5J541J992J228K59p20j988k903k666j775j371j671k266k946l261
$$ 106078 106133 107674 109666 110894 111153 110433 108445 105542 102876 101101 99730 98059 95793 92847 89586
54782H9586k362m97O71M02J6L70Q4j861l592k746k5J994K422K056J037q74k442
$$ 89586 87224 86727 87398 87800 87816 88186 88270 86409 82817 80071 80046 82040 84462 86518 87555 86681 84239
54765H4239k062k44J185J836K536L078K607J609J246J177M34j13J243L970N712
$$ 84239 82177 81933 83118 84954 87490 90568 93175 94784 96030 97207 97641 97528 98771 102741 108453
54750A08453N561M603L477J999R27J456K915L512L348M143N953O997P040P979
$$ 108453 114014 118617 122094 124093 125020 126476 129391 132903 136251 140394 146347 153344 160384 168363
54736A68363J0422J2424J2672J2407J3088J4351J5385J6320J7072J6553J4259
$$ 168363 178785 191209 203881 216288 229376 243727 259112 275432 292504 309057 323316
54725C23316J1226Q525O109L771J683n51l753p514j0111j0732j0227r361q036
$$ 323316 334542 343067 349176 352947 354630 354079 350326 342812 332701 321969 311742 302381 294345
54712B94345o700o538p505p924o797m887k948p71J280J791L75j442k307k307j403
$$ 294345 287645 281107 273602 265678 258881 253994 251046 250275 251555 253346 253721 252279 249972 247665 246262
54697B46262J250N206Q091Q582Q344R393J1282J2705J4193J6944K0090K1526K1067
$$ 246262 247512 252718 260809 269391 277735 287128 298410 311115 325308 342252 362342 383868 404935
54684D04935K0576K1074K1436K0128J6863J2345P487L078o09l999p585j1149j4129
$$ 404935 425511 446585 468021 488149 505012 517357 524844 527922 527313 523314 515729 504580 490451
54671D90451j6456j8460k0129k1049k0996k0234j9260j8441j7765j6933j5860
$$ 490451 473995 455535 435406 414357 393361 373127 353867 335426 317661 300728 284868
54660B84868j4866j4057j2874j0952r006p944p426o438n061m341m471m538m167
$$ 284868 270002 255945 243071 232119 223113 215169 207743 201305 196244 191903 187432 182894 178727
54647A78727l889l616k524r00l11j083j378N4J701J431l72j476q60M39J246J477
$$ 178727 174838 171222 168698 167798 167487 166404 165026 165080 166781 168212 167840 166364 165504 165943 167189 168666
54631A68666J445J040J5j383k377k254j242o02j168j839n88K666N362N171K701
$$ 168666 170111 171151 171166 169783 167406 165152 163910 163308 162140 160301 159713 162379 167741 172912 175613
54616A75613M77PQ35J911K715L059K822K245K082L008M805O310O495N650N056
$$ 175613 176090 176097 176932 178843 181558 184617 187439 189684 191766 194774 199579 205889 212384 218034 223090
54601B23090N301N646N516N604O478P016N820L600K385K582K660J841J222J819
$$ 223090 228391 234037 239553 245157 251635 258651 264471 268071 270456 273038 275698 277539 278761 280580
54587B80580L354N404P936J0067J0211Q519P467Q856J1646J3819J5017J6091J7431
$$ 280580 283934 289338 297274 307341 317552 326071 333538 342394 354040 367859 382876 398967 416398
54574D16398J9109K1489K4282K5964K5447K3560K1624J9418J5818J0652M667j554
$$ 416398 435507 456996 481278 507242 532689 556249 577873 597291 613109 623761 628428 626874
54562F26874p460j2130j5297j8070k1373k4358k5656k5436k4807k3905k2104j9679
$$ 626874 619414 607284 591987 573917 552544 528186 502530 477094 452287 428382 406278 386599
54550C86599j7626j6125j4610j3090j1948j0724q722o639n928o463o528n428m481
$$ 386599 368973 352848 338238 325148 313200 302476 293754 287115 281187 274724 268196 262768 258287
54537B58287m799n635n807n549n838o611o821n936m591l744l834m646n591o103
$$ 258287 253488 247853 242046 236497 230659 224048 217227 211291 206700 202956 199122 194476 188885 182782
54523A82782n973n338m380l206k063j389j479k216l210m059m384l922k710j232
$$ 182782 176809 171471 167091 163885 161822 160433 158954 156738 153528 149469 145085 141163 138453 137221
54509A37221j06M12O24R72J487J793J616J069L60m04r87j020n50j34J1M53J531
$$ 137221 137115 137527 138151 139123 140610 142403 144019 145088 145448 145044 144057 143037 142487 142353 142364 142817 144348
54492A44348K397J987O25k84q2O38J250J802K385K823L112L317K995J831Q14J460
$$ 144348 146745 148732 149357 149073 148991 149629 150879 152681 155066 157889 161001 164318 167313 169144 169958 171418
54476A71418L482M684L899K677L080M964O665P518Q218R128R658R434R044R228
$$ 171418 174900 179584 183483 186160 189240 194204 200869 208387 216605 225733 235391 244825 253869 263097
54462B63097R975J0734J1127J1130J0604Q964N773J678j797l867n342p268r304
$$ 263097 273072 283806 294933 306063 316667 325631 331404 333082 331285 327418 322076 314808 305504
54449C05504j0451j0796j1230j1716j1423j0568j0389j0941j0665q834o816n967
$$ 305504 295053 284257 273027 261311 249888 239320 228931 217990 207325 198491 191675 185708
54437A85708n716m928l971m008m935n277l932j292J057J460k84k309k499j096
$$ 185708 179992 175064 171093 167085 162150 156873 152941 151649 152706 154166 153882 151573 149074 147978
54423A47978k08n87o02Q34K252J875K62q28r64p33m6J376K588K401J318Q31J203
$$ 147978 147770 147183 146581 147415 149667 151542 151804 150976 150012 149279 149233 150609 153197 155598 156916 157747 158950
54406A58950J452J266J288J649J668J096L58m37j512k445k304r44O63J457J046
$$ 158950 160402 161668 162956 164605 166273 167369 167727 167290 165778 163333 161029 160085 160748 162205 163251
54391A63251l19j786k346j882j401j622k008k019k321l541m768m801m193m247
$$ 163251 162932 161146 158800 156918 155517 153895 151887 149868 147547 144006 139238 134437 130244 125997
54377A25997m544l456j008P71P34Q2L77J488K232J937P64p03j701j793j336p98
$$ 125997 121453 117997 116989 117760 118494 118576 118953 120441 122673 124610 125374 124671 122970 121177 119841 119043
54361A19043J78K005L631L231P55j543j748k99J085J537J313R26P73J118J732
$$ 119043 119221 121226 124857 128088 128843 127300 125552 125253 126338 127875 129188 130114 130887 132005 133737
54346A33737J969J670J580K341L492L952L324K370K298L608N500O484N913M737
$$ 133737 135706 137376 138956 141297 144789 148741 152065 154435 156733 160341 165841 172325 178238 182975
54332A82975M310M581M246K633O47m62n57m15n93r91j339j670k197k842l085k509
$$ 182975 187285 191866 196112 198745 199392 198930 198373 197958 197365 196374 195035 193365 191168 188326 185241 182732
54316A82732j578j399k470l982m839m963m991m990m202k124O40K716K985J465
$$ 182732 181154 179755 177285 173303 168464 163501 158510 153520 149318 147194 147834 150550 153535 155000
54302A55000n07j273m53P19Q88k3j239k210k600j914j12J781K633K568K504K654
$$ 155000 154493 153220 152767 153486 154374 154351 153112 150902 148302 146388 146276 148057 150690 153258 155762 158416
54286A58416K472J873J417J264J050R20J546K837L595L036J945J693K569L589
$$ 158416 160888 162761 164178 165442 166492 167412 168958 171795 175390 178426 180371 182064 184633 188222
54272A88222L732K844J483J81r59k039k886l176k985k835k980l182l348l786m404
$$ 188222 191954 194798 196281 196462 195503 193464 190578 187402 184417 181582 178602 175420 172072 168286 163882
54257A63882m348l198j925j871l081m455n319n931o448o237m516j426J643K827
$$ 163882 159534 156336 154411 152540 149459 145004 139685 133754 127306 121069 116553 115127 116770 119597
54243A19597J322j673m028m851m868m617l565j618q2J30L3Q58J750J007j028k307
$$ 119597 120919 119246 115218 110367 105499 100882 97317 95699 95617 95747 95780 96638 98388 99395 98367 96060
54227I6060k106j728k002k020r48N54J518J959K174J834P68j94j66N24Q70O74
$$ 96060 93954 92226 90224 88204 87256 87810 89328 91287 93461 95295 96063 95869 95703 96227 97097 97771
54211I7771P37J573K599K829K105J211P61M00m03j185j000p4K51m02p76q0N77
$$ 97771 98508 100081 102680 105509 107614 108825 109586 109986 109583 108398 107398 107324 107575 107173 106397 106317 106894
54194A06894N0p60k62J141J547L33j154j579q49M27J428J226j54r83M09L177M768
$$ 106894 106944 106184 105922 107063 108610 108943 107789 106210 105361 105788 107216 108442 108288 107305 107714 110891 115659
54177A15659M125K573J578J198Q99L30r69k996m299l198l39J660J591R01R93J263
$$ 115659 119784 122357 123935 125133 126032 126362 125393 122397 118098 114900 114561 116221 117812 118713 119706 120969
54161A20969P90J90K80L08q42k618l453k907j890j135n88o5M22Q56J073O92k65
$$ 120969 121759 121949 122229 122537 121695 119077 115624 112717 110827 109692 109104 109039 109461 110317 111390 112082 111817
54144A11817r87p59L0K35p46k312l133k282j80J540J550J66j166j534j075k82
$$ 111817 110830 110071 110101 110336 109590 107278 104145 101863 101683 103223 104773 104939 103773 102239 101164 100882
54128A00882L16L3j239k244j619O3Q14K7p34k15P75R35M78M09P08N06l60j009
$$ 100882 101198 101231 99992 97748 96129 96192 97006 97033 96299 96084 96859 97794 98272 98681 99389 99895 99535 98526
54110I8526o04P27J954J984P19n93n86O76J927K250J622J81j801l224k876j154
$$ 98526 97922 98649 100603 102587 103306 102713 102127 102803 104730 106980 108602 108783 106982 103758 100882 99728
54094I9728J84L31J34K13j0p66j098n52k83j220k419k528j906j774k026j412M51
$$ 99728 99912 100243 100377 100590 100580 99814 98716 98164 97881 96661 94242 91714 89808 88034 86008 84596 85047
54077H5047K466L410K940J487j47j277j854k263k350j497o3L38j164l207l749
$$ 85047 87513 90923 93863 95350 95203 93926 92072 89809 87459 85962 85899 86237 85073 81866 78117
54062G8117k443m74J251K556L077K280N25q68r58n2R26J507J873K224K265J618
$$ 78117 75674 75200 76451 79007 82084 84364 84889 84021 83063 83011 83937 85444 87317 89541 91806 93424
54046I3424O83M33Q88O03j335l463l529j609J13N39P07J303J375M72O0J339L137
$$ 93424 94107 94540 95428 96031 94696 91233 87704 86095 86208 86747 87454 88757 90132 90604 90664 92003 95140
54029I5140L536K507J467J116J078R46N05l76j106n86J054K015J351N68J212K166
$$ 95140 98676 101183 102650 103766 104844 105790 106295 105919 104813 104227 105281 107296 108647 109215 110427 112593
54013A12593J213j542l813m255l532k546j374j2J294K523L511L437K006P22J393
$$ 112593 113806 112264 108451 104196 100664 98118 96744 96732 98026 100549 104060 107497 109503 110225 111618
53998A11618L440M441L411J994J967K953L224J888k42j413m22K098M023M063L275
$$ 111618 115058 119499 122910 124904 126871 129824 133048 134936 134694 133281 132859 134957 138980 143043 146318
53983A46318L419M356M434L155J914J979L025M038M426M038L219L207N296R020
$$ 146318 149737 154093 158527 161682 163596 165575 168600 172638 177064 181102 184321 187528 192824 201844
53969B01844J2073J2549J0803Q725P770Q039Q628Q543P548O305N525N207N006
$$ 201844 213917 226466 237269 245994 253764 261803 270431 278974 286522 292827 298352 303559 308565
53956C08565M812M434L320J511K21L20P41j54k021k989k606k448l402m185l574
$$ 308565 313377 317811 321131 322642 322863 323183 323924 323770 321749 318760 316154 313706 310304 306119 302545
53941C02545k467k514l756m968n512n573n135m108l264l749n448o791o567n277
$$ 302545 300078 297564 293808 288840 283328 277755 272620 268512 265248 261499 256051 249260 242693 237416
53927B37416m285m186m483m555m350m065l620k792j686p46l28m47r10j343j237
$$ 237416 233131 228945 224462 219907 215557 211492 207872 205080 203394 202648 202320 201873 200963 199620 198383
53912A98383l37R38J883K383K852L344L314K519J469O41j12q86j176o06K78O22
$$ 198383 198046 198984 200867 203250 206102 209446 212760 215279 216748 217389 217277 216391 215215 214609 214887 215509
53896B15509K84k63o88q83p12k08K85O17J046J556J686J509J999L519M794M384
$$ 215509 215793 215530 214842 213959 213247 213039 213324 213941 214987 216543 218229 219738 221737 225256 230050 234434
53880B34434K770J816K541M443O638Q520R438Q947P572O459O118O091N769M906
$$ 234434 237204 239020 241561 246004 252642 261162 270600 279547 287119 293578 299696 305787 311556 316462
53866C16462L524K022J160J206J404J056P31J490L213M752N518N818N828N383
$$ 316462 319986 322008 323168 324374 325778 326834 327565 329055 332268 337020 342538 348356 354184 359567
53852C59567M823M957N955P180Q100Q600Q425P421O189N571N459N034M172L413
$$ 359567 364390 369347 375302 382482 390582 399182 407607 415028 421217 426788 432247 437281 441453 444866
53838D44866K659J148j020k687l232l206l123k787k359k733m149n564o248o965
$$ 444866 447525 448673 447653 444966 441734 438528 435405 432618 430259 427526 423377 417813 411565 404600
53824D04600q507r953r789q264p312q031r383r711q743p480o642n989n260n010
$$ 404600 396093 386140 376351 368087 360775 352744 343361 333650 324907 317427 310785 304796 299536 294526
53810B94526n956p669q646p915o012m181l077k637k724l311m272n327o024n721
$$ 294526 288570 280901 272255 264340 258328 254147 251070 248433 245709 242398 238126 232799 226775 221054
53796B21054m183k413k005l222m488m419l484k844k555k041j513j575j943j940
$$ 221054 216871 214458 212453 209231 204743 200324 196840 193996 191441 189400 187887 186312 184369 182429
53782A82429j856k498l620m105l512k349j066N3M24j15m83L63J630J701N37n15
$$ 182429 180573 178075 174455 170350 166838 164489 163423 163476 163900 163785 163302 163665 165295 166996 167533 167018
53766A67018r41j309j473o68N64P07p7J69K004L409K847J480J079J468J526J306
$$ 167018 166077 164768 163295 162627 163191 163898 163821 163990 165994 169403 172250 173730 174809 176277 177803 179109
53750A79109J509J945K058K224L080M173M557M281M208M714N488O173O488O086
$$ 179109 180618 182563 184621 186845 189925 194098 198655 202936 207144 211858 217346 223519 230007 236093
53736B36093N075M192L881L728L425L581M774O386P183O677N313L793K836K998
$$ 236093 241168 245360 249241 252969 256394 259975 264749 271135 278318 284995 290308 294101 296937 299935
53722B99935M013M753M402L283K044O70j072k817l886m090l721l212l139l991
$$ 299935 303948 308701 313103 316386 318430 319100 318028 315211 311325 307235 303514 300302 297163 293172
53708B93172n339n872m836k991j672j366j692k131k359k314k336k703k860j941
$$ 293172 287833 281961 277125 274134 272462 271096 269404 267273 264914 262600 260264 257561 254701 252760
53694B52760m05J6j418l203l449k180q21j71J32N58J031J144N43o05j303n93R41
$$ 252760 252355 252371 250953 247750 244301 242121 241300 241129 241261 241819 242850 243994 244537 243932 242629 242036 242977
53677B42977J489L70j046j467j490k152k847k258p03P6o66j890k352j888j036
$$ 242977 244466 244836 243790 242323 240833 238681 235834 233576 232873 232949 232283 230393 228041 226153 225117
53662B25117m37o97k052l851m884m311k125R24L508M377L500K237J809K019J922
$$ 225117 224680 223983 221931 218080 213196 208885 206760 207684 211192 215569 219069 221306 223115 225134 227056
53647B27056J260M76o4k38l9J47k55q45k09K117M534N366N037M865M654L343J595
$$ 227056 228316 228792 228728 228490 228451 228598 228343 227498 227289 229406 233940 239306 244343 249208 253862 257205 258800
53630B58800J497L480N457N674M743M158M282M725N371N813M858K150m11m77J491
$$ 258800 260297 263777 269234 274908 279651 283809 288091 292816 298187 304000 308858 311008 310597 310120 311611
53615C11611K380L42k705l475j531K87m35k852m360l868k389r88L28J540J872
$$ 311611 313991 314333 311628 308153 306622 306909 306474 303622 299262 295394 293005 292017 292345 293885 295757
53600B95757Q87n47j225r34k87J96K24m05j373j779j293r43j851l480l899j923
$$ 295757 296644 296097 294872 293938 293651 293847 294071 293666 292293 290514 289221 288278 286427 282947 279048 277125
53584B77125J557M305M519K256o06k050j811j086m25R53L242M812M158K215J233
$$ 277125 278682 282987 287506 289762 289156 287106 285295 284209 283784 284737 287979 292791 296949 299164 300397
53569C00397J827K676K778K446J971R53m78j108j56J494K489K846L682N264O227
$$ 300397 302224 304900 307678 310124 312095 313048 312570 311462 311306 312800 315289 318135 321817 327081 333308
53554C33308N260L102K130L630O085O934N715M368M417N158N240M757M657N064
$$ 333308 338568 341670 343800 347430 353515 360449 366164 370532 374949 380107 385347 390104 394761 399825
53540C99825N432N679N901N551M209K861K947M339N515N708N586N814O230O555
$$ 399825 405257 410936 416837 422388 426597 429458 432405 436744 442259 447967 453553 459367 465597 472152
53526D72152O663N958L871J255l1N73J573J613J261J716K687K671R45j554l090
$$ 472152 478815 484773 488644 489899 489868 490441 492014 493627 494888 496604 499291 501962 502907 501353 498263
53511D98263k430L02L454M899L849J619K55O20J997L179L522L180K736K612K560
$$ 498263 495833 496135 499589 504488 508337 509956 510211 510831 512828 516007 519529 522709 525445 528057 530617
53496E30617J898L85j234j752n64J708L615L991K924J644J317K091L376M679N776
$$ 530617 532515 532900 531666 529914 529350 531058 534673 538664 541588 543232 544549 546640 550016 554695 560471
53481E60471O406O332N671M775M031M024N379P841R940J0430R849R719J0414J0943
$$ 560471 566877 573209 578880 583655 587686 591710 597089 604930 614870 625300 635149 644868 655282 666225
53467F66225J0786J0696J1245J1687J1127J0108J0110J1797J4378J6580J7762
$$ 666225 677011 687707 698952 710639 721766 731874 741984 753781 768159 784739 802501
53456H02501J8134J8300J8661J9195J9711K0095K0112J9431J8328J8070J9756
$$ 802501 820635 838935 857596 876791 896502 916597 936709 956140 974468 992538 1012294
53445A012294K2808K5461K6857K7853K9431L1302L2582L3004L2883L2487L2272
$$ 1012294 1035102 1060563 1087420 1115273 1144704 1176006 1208588 1241592 1274475 1306962 1339234
53434A339234L2993L4699L6032L5619L4028L3310L4498L6332L6733L4821L1312
$$ 1339234 1372227 1406926 1442958 1478577 1512605 1545915 1580413 1616745 1653478 1688299 1719611
53423A719611K7723K5609K5849K7939L0247L1494L1717L1501L0791K9278K7518
$$ 1719611 1747334 1772943 1798792 1826731 1856978 1888472 1920189 1951690 1982481 2011759 2039277
53412B039277K6595K6619K6610K6157K6049K6672K6706K4512K0391J6427J4186
$$ 2039277 2065872 2092491 2119101 2145258 2171307 2197979 2224685 2249197 2269588 2286015 2300201
53401B300201J3345J2447J0268O513J953k049m789o902r242j1418j2401j2438
$$ 2300201 2313546 2325993 2336261 2342774 2344727 2342678 2337889 2330987 2321745 2310327 2297926 2285488
53389B285488j3167j5499j8422k0370k0966k0983k1337k2469k4018k4821k4030
$$ 2285488 2272321 2256822 2238400 2218030 2197064 2176081 2154744 2132275 2108257 2083436 2059406
53378B059406k2516k2286k4075k6290k6792k4973k1845j9085j8198j9436k0941
$$ 2059406 2036890 2014604 1990529 1964239 1937447 1912474 1890629 1871544 1853346 1833910 1812969
53367A812969k0125j6617j2700j0282q813p064n329m391l671k117l1J671L232
$$ 1812969 1792844 1776227 1763527 1753245 1744432 1737368 1732039 1727648 1723977 1721860 1721829 1723500 1726732
53354A726732N311P229P877P914R117J1654J3944J5244J6600J8898K1610K3975
$$ 1726732 1732043 1739272 1747149 1755063 1764180 1775834 1789778 1805022 1821622 1840520 1862130 1886105
53342A886105K5960K7651K8918L0167L2200L4879L7067L8378L9898M2606M5973
$$ 1886105 1912065 1939716 1968634 1998801 2031001 2065880 2102947 2141325 2181223 2223829 2269802
53331B269802M8796N0764N2636N5180N8228O0553O0957N9902N9586O1494O4382
$$ 2269802 2318598 2369362 2421998 2477178 2535406 2595959 2656916 2716818 2776404 2837898 2902280
53320B902280O5809O5324O4676O4990O5356O4518O2450N9745N6737N3904N1908
$$ 2902280 2968089 3033413 3098089 3163079 3228435 3292953 3355403 3415148 3471885 3525789 3577697
53309C577697N0474M8233M4378L9656L4992L0068K4213J7995J2855R318O257J991
$$ 3577697 3628171 3676404 3720782 3760438 3795430 3825498 3849711 3867706 3880561 3889879 3896136 3898127
53297C898127m154j1339j8063k3614k8617l4009l9759m4959m8815n1069n1922
$$ 3898127 3893973 3882634 3864571 3840957 3812340 3778331 3738572 3693613 3644798 3593729 3541807
53286C541807n2247n3407n5848n8149n8510n6962n5119n3959n3136n2304n1754
$$ 3541807 3489560 3436153 3380305 3322156 3263646 3206684 3151565 3097606 3044470 2992166 2940412
53275B940412n1466n0732m9128m7031m5135m4132m4632m6244m7163m5934m3293
$$ 2940412 2888946 2838214 2789086 2742055 2696920 2652788 2608156 2561912 2514749 2468815 2425522
53264B425522m0867l8466l4744l0233k7252k6333k5295k2745k0148j9117j8824
$$ 2425522 2384655 2346189 2311445 2281212 2253960 2227627 2202332 2179587 2159439 2140322 2121498
53253B121498j7922j7124j7769j9091j9198j8027j7310j7777j8198j7186j4697
$$ 2121498 2103576 2086452 2068683 2049592 2030394 2012367 1995057 1977280 1959082 1941896 1927199
53242A927199j1592q784o818n591m440k907j184N52K570M872O767P845Q714J0131
$$ 1927199 1915607 1906823 1900005 1894414 1889974 1887067 1885883 1886435 1889005 1893877 1900644 1908489 1917203 1927334
53228A927334J2004J3906J5839J7844J9574K1002K2783K5112K6945K7236K6371
$$ 1927334 1939338 1953244 1969083 1986927 2006501 2027503 2050286 2075398 2102343 2129579 2155950
53217B155950K5580K5513K6109K7044K7541K6463K3641K0423J7989J5829J2867
$$ 2155950 2181530 2207043 2233152 2260196 2287737 2314200 2337841 2358264 2376253 2392082 2404949
53206B404949R365O465M420K487K40k189m851p864j0714j2755j4232j5936j8015
$$ 2404949 2414314 2420779 2425199 2427686 2427926 2425737 2420886 2413022 2402308 2389553 2375321 2359385 2341370
53193B341370j9982k1744k3687k5874k7861k9200k9587k8943k8034k8325l0220
$$ 2341370 2321388 2299644 2275957 2250083 2222222 2193022 2163435 2134492 2106458 2078133 2047913
53182B047913l1968l1526k9249k7503k7597k8407k8305k7270k6486k6531k6767
$$ 2047913 2015945 1984419 1955170 1927667 1900070 1871663 1843358 1816088 1789602 1763071 1736304
53171A736304k6334k5233k4229k3867k3762k3167k1968k0750j9846j9012j8025
$$ 1736304 1709970 1684737 1660508 1636641 1612879 1589712 1567744 1546994 1527148 1508136 1490111
53160A490111j6970j5775j4189j2430j1088j0254r651r647j0924j2870j3813j3451
$$ 1490111 1473141 1457366 1443177 1430747 1419659 1409405 1399754 1390107 1379183 1366313 1352500 1339049
53148A339049j3508j5064j6815j7231j6999j7654j8926j9206j8018j6360j5067
$$ 1339049 1325541 1310477 1293662 1276431 1259432 1241778 1222852 1203646 1185628 1169268 1154201
53137A154201j4362j4521j5512j6335j6080j5286j4976j4876j4048j2863j2720
$$ 1154201 1139839 1125318 1109806 1093471 1077391 1062105 1047129 1032253 1018205 1005342 992622
53126I92622j4046j5928j7503j8406j8267j7256j6687j7517j8580j8079j6403
$$ 992622 978576 962648 945145 926739 908472 891216 874529 857012 838432 820353 803950
53115H03950j5528j5795j5438j3568j1521j0675j0783j1103j1495j1732j1176
$$ 803950 788422 772627 757189 743621 732100 721425 710642 699539 688044 676312 665136
53104F65136j0007r443j0038j0989j1517j1604j0982r094o737n985p366q725q220
$$ 665136 655129 645686 635648 624659 613142 601538 590556 581462 574725 568740 561374 552649 544429
53091E44429o924o941q113q466p293n907n419n317m586l232k150k019k637l279
$$ 544429 537505 530564 522451 513985 506692 500785 495366 490049 485463 482231 480081 478062 475425 472146
53077D72146l646m213n298o118n658m394l966m792n329m426l184l278m323m374
$$ 472146 468500 464287 458989 452871 447213 442819 438853 434061 428732 424306 421122 417844 413521 409147
53063D09147k734q98n89j877l471m202l872l078k538k502k700k875l026l132k958
$$ 409147 406413 405515 404926 403049 399578 395376 391504 388426 385888 383386 380686 377811 374785 371653 368695
53048C68695k375j658j211j200j492j796j774j404j110j220j379j012k31M60J159
$$ 368695 366320 364662 363451 362251 360759 358963 357189 355785 354675 353455 352076 351064 350833 351293 352452
53033C52452K307L403L184J584K90O27J789K089J192J9q97j729k351k320j966
$$ 352452 354759 358162 361346 362930 363220 363847 365636 367725 368917 368936 368039 366310 363959 361639 359673
53018C59673k427m178o189o992o225m775l649l000k379j717j709k915m753o025
$$ 359673 357246 353068 346879 339887 333662 328887 325238 322238 319859 318142 316433 313518 308765 302740
53004C02740o393o514o551n640l480j577j645l263m284l555k052j257j399j768
$$ 302740 296347 289833 283282 277642 274162 272585 270940 267677 263393 259838 257786 256529 255130 253362
52990B53362j885j704j204m51J15p6j208k973m762n886n957n228m302l337j984
$$ 253362 251477 249773 248569 248118 248233 248157 246949 243976 239214 233328 227371 222143 217841 214504 212520
52975B12520l82N32K45l75k17M13K94o55j250j034r80j600j745m57J197J605J068
$$ 212520 212138 212670 212915 212540 212323 212736 213030 212375 211125 210091 209111 207511 205766 205309 206506 208111 209179
52958B09179J033J443Q48p94j577n05R52J047j1j028j608j691o75J494L270L066
$$ 209179 210212 211655 212503 211709 210132 209627 210579 211626 211615 210587 208979 207288 206613 208107 211377 214443
52942B14443J280o12k302m288n873n400k699K79J684J519R09P01J082J735K008
$$ 214443 215723 215111 212809 208521 202648 197248 194549 194828 196512 198031 198940 199641 200723 202458 204466
52927B04466J520O66j21j167k683l495k073J080L532L738K565J555J040O56O27
$$ 204466 205986 206652 206531 205364 202681 199186 197113 198193 201725 205463 208028 209583 210623 211279 211906
52912B11906J352K329K442J302k17p95M2J420J961J402R84J797L240L920L655
$$ 211906 213258 215587 218029 219331 219114 218319 218361 219781 221742 223144 224128 225925 229165 233085 236740
52897B36740L474L890M377M544M557M338L570K647K466L038L564L928M721N571
$$ 236740 240214 244104 248481 253025 257582 261920 265490 268137 270603 273641 277205 281133 285854 291425
52883B91425N256M015L872N582O894N403J909o93j057l12R8j27o85j373j971k283
$$ 291425 296681 300696 304568 310150 317044 322447 324356 323663 322606 322294 322392 322265 321580 320207 318236 315953
52867C15953k359k242j706q04k13l85p71o23k08m15j381k295k457j942j235p22
$$ 315953 313594 311352 309646 308842 308629 308244 307473 306850 306642 306227 304846 302551 300094 298152 296917 296195
52851B96195m83k99l6j00j024k292k416o97J652K845K434J233Nr42j282q17K6
$$ 296195 295712 295413 295377 295277 294253 291961 289545 288848 290500 293345 295779 297012 297017 296075 294793 293976 294002
52834B94002N95Q21R95R98M30o39j655k223k215j483n6J441K222K170J875J845
$$ 294002 294597 295418 296413 297411 297841 297202 295547 293324 291109 289626 289570 291011 293233 295403 297278 299123
52818B99123K041K134J942J731K052K997L673L094J593N64N55O85L62K24O34N64
$$ 299123 301164 303298 305240 306971 309023 312020 315693 318787 320380 320944 321499 322184 322546 322770 323404 323968
52802C23968o60j634o40J549K368Q54j359k495k450j878r81J42J059J571J935
$$ 323968 323308 321674 321034 322583 324951 325805 324446 321951 319501 317623 316642 316784 317843 319414 321349
52787C21349K139J752Q30M7l02n65o30K61K055L352L185K446K459K920K553J246
$$ 321349 323488 325240 326070 326117 325815 325250 324620 324881 326936 330288 333473 335919 338378 341298 343851 345097
52771C45097K29N4r0p21r31K35K055K830K024P90L18M64L12m82j364j646j194
$$ 345097 345326 345380 345290 344569 343638 343873 345928 348758 350782 351572 351890 352354 352666 352184 350820 349174 347980
52754C47980n61n64j536k820l396l226l364m253m763l874k672l178n250o387n108
$$ 347980 347419 346855 345319 342499 339103 335877 332513 328260 323497 319623 316951 313773 308523 302136 297028
52739B97028k959k129k421k101r01l84j446l073l929l970l876l756l257k467k085
$$ 297028 294069 291940 289519 287418 286517 286133 284687 281614 277685 273715 269839 266083 262826 260359 258274
52724B58274k634l860m929n149m474l366k285j468j105j254j537j366p84o02j304
$$ 258274 255640 251780 246851 241702 237228 233862 231577 230109 229004 227750 226213 224847 224063 223461 222157
52709B22157k315k843k891k753j987j02J910J951p36m299o185n767m475l651l272
$$ 222157 219842 216999 214108 211355 209368 209266 211176 213127 212391 208092 201907 196140 191665 188014 184742
52694A84742k809k407k536k906k683j810j306j841k705k736j813p37j9L03Nj110
$$ 184742 181933 179526 176990 174084 171401 169591 168285 166444 163739 161003 159190 158453 158434 158737 158742 157632
52678A57632k389k858k680k916l538l044p13J941K942K268J422J301J604J848
$$ 157632 155243 152385 149705 146789 143251 140207 139494 141435 144377 146645 148067 149368 150972 152820
52664A52820J838J294j0j667k935l519l606l342k861k511k433k168j387o66p62
$$ 152820 154658 155952 155942 154275 151340 147821 144215 140873 138012 135501 133068 130900 129513 128847 128085
52649A28085j376j468p01J92M66J51k30r9Q37K287L347L332K457J392M48l62q95
$$ 128085 126709 125241 124540 124732 125198 125349 125119 125020 125857 128144 131491 134823 137280 138672 139120 138758 137863
52632A37863j065j073q48J42J873L137K990K232K293L045L129K294J890K730L897
$$ 137863 136798 135725 134877 135019 136892 140029 143019 145251 147544 150589 153718 156012 157902 160632 164529
52617A64529M215L799L354K848J754K53o85l98O42J213O08n06p95j0N16l74j900
$$ 164529 168744 172543 175897 178745 180499 180752 180067 179669 180311 181524 182132 181626 180831 180821 181337 180963 179063
52600A79063k347j447o21q50j477j454q36m48p86j655k561l022k864k343j759
$$ 179063 176716 175269 174648 173798 172321 170867 170031 169583 168797 167142 164581 161559 158695 156352 154593
52585A54593j062k68j8r89k750l917l584k062l12P21L84j119k361j852J71J892
$$ 154593 153531 153263 153245 152256 149506 145589 142005 139943 139631 140352 140736 139617 137256 135404 135575 137467
52569A37467J960P47n56j182r92l38J4m16j007q02j14k64j426k075j209J29N10
$$ 137467 139427 140174 139618 138436 137444 137106 137120 136704 135697 134895 134781 134517 133091 131016 129807 129936 130446
52552A30446J62K72R02J068M00m17p55o32j39Q01J931K583K339J449M86n3P7P60
$$ 130446 130608 130880 131782 132850 133250 132833 132078 131446 131307 132108 134039 136622 138961 140410 140896 140843 140920 141680
52534A41680J520J848J589R89N10O74J610K674K897K161J467J617K099J888R92
$$ 141680 143200 145048 146637 147626 148136 148810 150420 153094 155991 158152 159619 161236 163335 165223 166215
52519A66215M68Q94J578J531O44l91r52q17J31J795L381L667K304N82K45J550
$$ 166215 166683 167577 169155 170686 171330 170939 169987 169170 169301 171096 174477 178144 180448 181030 181275 182825
52503A82825L115L699L409K885K236J380P11N85N91K06j97O7P74J096J013J309
$$ 182825 185940 189639 193048 195933 198169 199549 200260 200845 201436 201642 201445 201512 202286 203382 204395 205704
52487B05704K206K990L130K793K127R80m04j364j687j672j236J35K291M275N526
$$ 205704 207910 210900 214030 216823 218950 219930 219526 218162 216475 214803 213567 213702 215993 220268 225794
52472B25794O170N932M179J599L43J319K439J103k188m166k662J030L791L859
$$ 225794 231964 237896 242075 243674 244017 245336 247775 248878 246690 242524 239862 240892 244683 248542
52458B48542K077O21Q58K335L614L813L112K055J031M20M31O48L68l22o13l27
$$ 248542 250619 251240 252098 254433 258047 261860 264972 267027 268058 268478 268909 269557 269925 269603 268990 268663
52442B68663l48j346k844l902m017l025j123O84J177M89J2K38J35p12j021m5P50
$$ 268663 268315 266969 264125 260223 256206 253181 252058 252742 253919 254408 254420 254658 254793 254081 253060 253015 253765
52425B53765Kr94k36J526J835N78K33J906L646L579K458J822J422J17j795k715
$$ 253765 253767 252773 252537 254063 255898 256476 256709 258615 262261 265840 268298 270120 271542 271659 269864 267149
52409B67149j875j89Q78O79j61j91J440L711M447K764J82j141o58O17J574J713
$$ 267149 265274 265085 265963 266642 266481 266290 267730 271441 275888 278652 278834 277693 277035 277652 279226 280939
52393B80939R06n04j475r52J061L421M773M482K987J493R65J070N78r42k342k359
$$ 280939 281845 281341 279866 278914 279975 283396 288169 292651 295638 297131 298096 299166 299744 298802 296460 294101
52377B94101j278l76k24l17k56k39l14K4J057K232K695K166J050j6n76n54j62
$$ 294101 292823 292447 292223 291906 291650 291411 291097 291121 292178 294410 297105 299271 300321 300305 299729 299175 299013
52360B99013M46J373K557L319K865J315k48r10p29l15r4j08j40J78R38J495J026
$$ 299013 299459 300832 303389 306708 309573 310888 310640 309730 309001 308686 308592 308484 308344 308522 309460 310955 311981
52343C11981j40o15J75J020P18M9O77K485L604L139K288K281K642K412J828J581
$$ 311981 311841 311226 311401 312421 313139 313188 313865 316350 319954 323093 325381 327662 330304 332716 334544 336125
52327C36125J363M57p78j410j465j581j395J4K041K554P40j527k026q56K73M79
$$ 336125 337488 337945 337167 335757 334292 332711 331316 331330 333371 335925 336665 335138 333112 332256 332529 333008
52311C33008K24oj26K59J675L614M615L972K726K342K992L659L639L304L336L720
$$ 333008 333232 333226 333100 333359 335034 338648 343263 347235 349961 352303 355295 358954 362593 365897 369233 372953
$$ [...]
##END NTUPLES=NMR SPECTRUM
##END=
