
##TITLE=AC1201_HPAAH12051_6666938_tDdsjLugX6
##JCAMPDX= 6.0         $$ Bruker NMR JCAMP-DX V2.0
##DATA TYPE= NMR SPECTRUM
##DATA CLASS= NTUPLES
##ORIGIN= BRUKER
##OWNER= Administrator
$$ 1.72 TOPSPIN		Version 2.1
$$ 2012-08-14 11:16:06.875 -0500  Administrator@TOPSPIN
$$ Compression mode = diff/dup
##.OBSERVE FREQUENCY= 400.02188249412
##.OBSERVE NUCLEUS= ^1H
##.ACQUISITION MODE= SIMULTANEOUS (DQD)
##.ACQUISITION SCHEME= undefined
##.AVERAGES= 8
##.DIGITISER RES= 22
##SPECTROMETER/DATA SYSTEM= spect
##.PULSE SEQUENCE= zg30
##.SOLVENT NAME= COFFEE_meoh
##.SHIFT REFERENCE= INTERNAL, COFFEE_meoh, 1, 14.98509
##AUDIT TRAIL= $$ (NUMBER, WHEN, WHO, WHERE, PROCESS, VERSION, WHAT)
$$ ##TITLE= Audit trail, TOPSPIN		Version 2.1
$$ ##JCAMPDX= 5.01
$$ ##ORIGIN= Bruker BioSpin GmbH
$$ ##OWNER= Administrator
$$ $$ C:\Bruker\TOPSPIN/data/COFFEE/nmr/AC1201_HPAAH12051_6666938_tDdsjLugX6/10/pdata/1/auditp.txt
$$ ##AUDIT TRAIL=  $$ (NUMBER, WHEN, WHO, WHERE, PROCESS, VERSION, WHAT)
(   1,<2012-08-14 11:15:57.734 -0500>,<Administrator>,<TOPSPIN>,<go>,<TOPSPIN 2.1>,
      <created by zg
	started at 2012-08-14 11:14:50.906 -0500,
	POWCHK enabled, PULCHK disabled,
       configuration hash MD5:
       6B 1B 68 BB D9 2E 58 E2 7F 35 AD 54 07 DF 0E 41
       data hash MD5: 64K
       F5 4F E7 AE DF 60 F3 61 AF 2F 79 89 65 06 91 A6>)
(   2,<2012-08-14 11:16:02.062 -0500>,<Administrator>,<TOPSPIN>,<proc1d>,<TOPSPIN 2.1>,
      <Start of raw data processing
       efp LB = 0 FT_mod = 6 PKNL = 1 PHC0 = 0 PHC1 = 0 SI = 32K 
       data hash MD5: 32K
       3F 3F CE 70 75 E4 72 87 2E 35 A7 A2 D0 32 39 E0>)
(   3,<2012-08-14 11:16:02.671 -0500>,<Administrator>,<TOPSPIN>,<proc1d>,<TOPSPIN 2.1>,
      <pk PHC0 = 182.807 PHC1 = 0 
       data hash MD5: 32K
       50 9E A8 47 0A B8 D1 14 E0 B7 EB 31 0D 75 D9 D8>)
(   4,<2012-08-14 11:16:02.890 -0500>,<Administrator>,<TOPSPIN>,<proc1d>,<TOPSPIN 2.1>,
      <abs ABSG = 1 
       data hash MD5: 32K
       A6 D9 A8 3E 13 AF DE 1E 19 A1 B6 E2 3F 5C 2B EA>)
(   5,<2012-08-14 11:16:02.937 -0500>,<Administrator>,<TOPSPIN>,<proc1d>,<TOPSPIN 2.1>,
      <abs ABSG = 2 
       data hash MD5: 32K
       EB B1 4E 55 7C 79 C5 71 EE 4F 28 4B 1B AB 70 3C>)
(   6,<2012-08-14 11:16:02.953 -0500>,<Administrator>,<TOPSPIN>,<proc1d>,<TOPSPIN 2.1>,
      <abs ABSG = 3 
       data hash MD5: 32K
       60 E4 FF A8 0E 30 CE 53 62 7A 81 4A C6 9F B6 F5>)
(   7,<2012-08-14 11:16:03.000 -0500>,<Administrator>,<TOPSPIN>,<proc1d>,<TOPSPIN 2.1>,
      <abs ABSG = 4 
       data hash MD5: 32K
       7A FF 5D F0 32 83 00 6A 1E D1 08 94 E9 6E 7D 82>)
(   8,<2012-08-14 11:16:03.015 -0500>,<Administrator>,<TOPSPIN>,<proc1d>,<TOPSPIN 2.1>,
      <abs ABSG = 5 
       data hash MD5: 32K
       FB 1D CB 1A F2 42 57 18 97 B4 DB A5 0E FB 88 D1>)
$$ ##END=
$$ 
$$ $$ hash MD5
$$ $$ 2A 71 0F E6 3A D5 76 D2 2F 43 D0 93 B0 EF 53 9A
##$RELAX= 
##$RELAX= 
##$RELAX= 
##$RELAX= 
##$RELAX= 
##$RELAX= 
##$RELAX= 
$$ Bruker specific parameters
$$ --------------------------
$$ [...]
##$TP= (0..7)
150 150 150 150 150 150 150 150
##$TP07= 0
##$TPNAME0= <>
##$TPNAME1= <>
##$TPNAME2= <>
##$TPNAME3= <>
##$TPNAME4= <>
##$TPNAME5= <>
##$TPNAME6= <>
##$TPNAME7= <>
##$TPOAL= (0..7)
0.5 0.5 0.5 0.5 0.5 0.5 0.5 0.5
##$TPOFFS= (0..7)
0 0 0 0 0 0 0 0
##$TUNHIN= 0
##$TUNHOUT= 0
##$TUNXOUT= 0
##$USERA1= <user>
##$USERA2= <user>
##$USERA3= <user>
##$USERA4= <user>
##$USERA5= <user>
##$V9= 5
##$VALIST= <valist>
##$VCLIST= <CCCCCCCCCCCCCCC>
##$VD= 0
##$VDLIST= <DDDDDDDDDDDDDDD>
##$VPLIST= <PPPPPPPPPPPPPPP>
##$VTLIST= <TTTTTTTTTTTTTTT>
##$WBST= 1024
##$WBSW= 4
##$XGAIN= (0..3)
0 0 0 0
##$XL= 0
##$YL= 0
##$YMAX_a= 482075
##$YMIN_a= -614132
##$ZGOPTNS= <>
##$ZL1= 120
##$ZL2= 120
##$ZL3= 120
##$ZL4= 120
##$ABSF1= 14.98509
##$ABSF2= -5.573092
##$ABSG= 5
##$ABSL= 3
##$ALPHA= 0
##$AQORDER= 0
##$ASSFAC= 0
##$ASSFACI= 0
##$ASSFACX= 0
##$ASSWID= 0
##$AUNMP= <proc_prof1d_extract_pilot.lims>
##$AXLEFT= 0
##$AXNAME= <>
##$AXNUC= <1H>
##$AXRIGHT= 0
##$AXTYPE= 0
##$AXUNIT= <>
##$AZFE= 0.1
##$AZFW= 0.1
##$BCFW= 0
##$BC_mod= 0
##$BYTORDP= 0
##$COROFFS= 0
##$CY= 15
##$DATMOD= 1
##$DC= 0
##$DFILT= <>
##$DTYPP= 0
##$F1P= 0
##$F2P= 0
##$FCOR= 0.5
##$FTSIZE= 32768
##$FT_mod= 6
##$GAMMA= 0
##$GB= 0
##$INTBC= 1
##$INTSCL= 1
##$ISEN= 128
##$LB= 0
##$LEV0= 0
##$LPBIN= 0
##$MAXI= 10000
##$MC2= 0
##$MEAN= 0
##$ME_mod= 0
##$MI= 0
##$NCOEF= 0
##$NC_proc= -8
##$NLEV= 6
##$NOISF1= 0
##$NOISF2= 0
##$NSP= 0
##$NTH_PI= 0
##$NZP= 0
##$OFFSET= 14.98509
##$PC= 1
##$PHC0= 182.807
##$PHC1= 0
##$PH_mod= 1
##$PKNL= yes
##$PPARMOD= 0
##$PPDIAG= 0
##$PPIPTYP= 0
##$PPMPNUM= 2147483647
##$PPRESOL= 1
##$PSCAL= 4
##$PSIGN= 0
##$PYNMP= <proc.py>
##$REVERSE= no
##$SF= 400.02
##$SI= 32768
##$SIGF1= 0
##$SIGF2= 0
##$SINO= 400
##$SIOLD= 32768
##$SPECTYP= <>
##$SREGLST= <1H.CDCl3>
##$SSB= 0
##$STSI= 32768
##$STSR= 0
##$SW_p= 8223.68421052631
##$SYMM= 0
##$S_DEV= 0
##$TDeff= 65536
##$TDoff= 0
##$TI= <>
##$TILT= no
##$TM1= 0
##$TM2= 0
##$TOPLEV= 0
##$USERP1= <user>
##$USERP2= <user>
##$USERP3= <user>
##$USERP4= <user>
##$USERP5= <user>
##$WDW= 1
##$XDIM= 32768
##$YMAX_p= 470630343
##$YMIN_p= -737250
##$CURPLOT= <Network HP LaserJet P1505>
##$CURPRIN= <$Network HP LaserJet P1505>
##$DFORMAT= <normdp>
##$LAYOUT= <+/1D_H.xwp>
##$LFORMAT= <normlp>
##$PFORMAT= <normpl>
##$SURQMSG= 1
$$ End of Bruker specific parameters
$$ ---------------------------------
##NTUPLES= NMR SPECTRUM
##VAR_NAME=  FREQUENCY,     SPECTRUM/REAL,   SPECTRUM/IMAG
##SYMBOL=    X,             R,               I
##VAR_TYPE=  INDEPENDENT,   DEPENDENT,       DEPENDENT
##VAR_FORM=  AFFN,          ASDF,            ASDF
##VAR_DIM=   32768,         32768,           32768
##UNITS=     HZ,            ARBITRARY UNITS, ARBITRARY UNITS
##FACTOR=    0.250966925370066, 1,           1
##FIRST=     8223.43324360094, -25160,       22788
##LAST=      0,             -43729,          -32471
##MIN=       0,             -737250,         0
##MAX=       8223.43324360094, 470630343,    0
$$ Real data points
##PAGE= N=1
##DATA TABLE= (X++(R..R)), XYDATA
$$ [...]
19572B6816a61026l4136h2718k5264a8084n2530k62671A64178a85735E7418a45031
19560H7610M5762M0924i5343j45171A42669p298B6747K57330F6632c61548D700
19548c89m0530m1873n4808e9920j47411f9824l2831D07431D5545h853H9154a88053
19535A41422E0611b47365H475a69931M8169A60978b06358D88270a41246j10812
19525b52058A72460b21328j29353M0611e6793m1079j4868B21043a95672a8011
19514a30215k6643A04381J25767A05126J55974F2641a09858C20826j50177b20269
19503b0279D911b91239a7820G1807J01142B5566g5484C6682J41766C9728c88342
19491I196g4080L4941C4915f427m49613d5089B26209i4712D3015b02283A8363
$$ plain form
19572 26816 -161026 -195162 -82718 -107982 -18084 -70614 -333285 164178 -185735 57418 -145031
19560 87610 133372 174296 -95343 -240514 142669 135371 26747 284077 66632 -361548 4700
19548 -389 -40919 -82792 -137600 -59920 -207331 -69824 -102655 407431 45545 -8853 89154 -188053
19535 141422 50611 -247365 8475 -169931 -121762 160978 -206358 488270 -141246 -252058
19525 -252058 172460 -221328 -350681 -310070 -56793 -97872 -112740 221043 -195672 -18011
19514 -130215 -156858 104381 230148 105126 261100 62641 -109858 320826 170649 -220269
19503 -20279 4911 -291239 -17820 71807 172949 25566 -75484 36682 178448 39728 -388342
19491 9196 -74080 -39139 34915 -6427 -456040 -45089 226209 -94712 43015 -202283 18363
19479f4840j17815j2013m5372K5295e0658o7771k7856F3589a37490D5077a35096
19467e0176J7532j99412K2359F1366g6833G862O4823B0484a66748c2178o1495
19456i3673k67987J25482J11637e8895I6889d9310C1243a24448j71785a41658
19445B28622g031G64J9848c86466a6584q1549M3061j5284j49751A21380a30937
19433F6206k8673b5279B25865c54452J06625J01108e3963r355p1152k2827p034
19422a64331E9648a82832A6153a51254A13427a75065A3794b9047G6784d8615j38041
19411a86656L2490O8983n6366C34278A41286m1057a6997k44826g9706B388c5770
19399b92853i8097F8591J02959d2028B04906d52400B545c55331a41379q9763A01939
$$ plain form
19479 -64840 -182655 -194668 -240040 -214745 -50658 -118429 -146285 63589 -137490 45077 -135096
19467 -50176 -32644 -232056 -209697 61366 -76833 7862 72685 20484 -166748 -32178 -93673
19456 -93673 -361660 -236178 -124541 -58895 96889 -49310 31243 -124448 -296233 -141658
19445 228622 -7031 764 20612 -386466 -16584 -98133 -55072 -70356 -220107 121380 -130937
19433 66206 37533 -25279 225865 -354452 -247827 -146719 -53963 -63318 -134470 -157297 -164331
19422 -164331 59648 -182832 16153 -151254 113427 -175065 13794 -29047 76784 -48615 -186656
19411 -186656 -154166 -85183 -141549 334278 141286 100229 -16997 -261823 -79706 2388 -35770
19399 -292853 -98097 68591 171550 -42028 204906 -452400 2545 -355331 -141379 -231142 101939
19387I9631d18366F4625K4343c5764k41543f8450l36834i7393l41k34943c3788
19375b05821f7161I1458l2516B4155a35185B88068a07104k29562e7302C02644
19364d4152J1302B0692R1122b55150E8235K78229A02055P043c20766D5906J61517
19353B07423e5695j17866n4735A63530a50504E1038J510J94489f5025J7574C5427
19341G9724a4234B07961b52981L5194a2655A00835d7175K792j02618B847R9516
19330A02363b40284f5270A30613i0834j8037A82988a40720I180e7335k05503R8227
19319a64611k43612f0940A64582g4645r7865C57009D8577a47713j01521A58873
19308B59946A7386a17265L0725L6006F7123b24480A12085Q13i8751k27033J06054
$$ plain form
19387 99631 -418366 64625 88968 -35764 -277307 -68450 -405284 -97393 -97734 -332677 -33788
19375 -205821 -67161 91458 58942 24155 -135185 288068 -107104 -336666 -57302 302644
19364 -44152 -32850 20692 111814 -255150 58235 336464 102055 109098 -320766 45906 207423
19353 207423 -55695 -173561 -228296 163530 -150504 51038 52548 247037 -65025 -47451 35427
19341 79724 -14234 207961 -252981 -217787 -12655 100835 -47175 -44383 -147001 2847 102363
19330 102363 -240284 -65270 130613 -90834 -108871 182988 -140720 9180 -57335 -262838 -164611
19319 -164611 -408223 -60940 164582 -74645 -172510 357009 48577 -147713 -249234 158873
19308 259946 17386 -117265 -86540 -50534 67123 -224480 112085 112898 -98751 -325784 -219730
19297b19730j3383N622A37626a3910k4883p2380B43518F2270j2573A3017J6911
19286B9928R0326d0379l34984b4715m5336j03841A39595d6618j03972j96025A46766
19274c401m03826C3316h8245j4485K7949G4009c1959E4111a99207k17765a57472
19262g8341H1981b01529q0466L7122B58387a09181G0081a22528M608H2156b97368
19250B16747H4799C1032O1476m0534d431I3065N5233a57697A29016L7431a85581
19238d3117H2053b79548F8914f9646j25759h2587D1995J15744b07873R1707p9587
19227a95753b5375n0184j22827j1176F2341B3816I733b7136q2907l8052j44063
19216b92158J37830p3816a09985B29547d5280l3624k53641F2331a01323k7895
$$ plain form
19297 -219730 -233113 -227491 137626 -13910 -38793 -111173 243518 62270 49697 13017 29928
19286 29928 120254 -40379 -375363 -24715 -70051 -173892 139595 -46618 -150590 -346615 146766
19274 -3401 -407227 33316 -88245 -102730 -74781 74009 -31959 54111 -199207 -416972 -157472
19262 -78341 81981 -201529 -281995 -244873 258387 -109181 70081 -122528 -117920 82156 -297368
19250 216747 84799 31032 92508 51974 -4431 93065 148298 -157697 129016 166447 -185581
19238 -43117 82053 -279548 68914 -69646 -195405 -82587 41995 157739 -207873 -116166 -195753
19227 -195753 -25375 -75559 -198386 -209562 62341 23816 9733 -27136 -110043 -148095 -292158
19216 -292158 -154328 -228144 -109985 229547 -45280 -78904 -332545 62331 -101323 -129218
19206a29218B35256i7754b7753B6454a1556A37936m8166N0095c8582a2863j43311
19195a56174m7289k733C240b56271a9110H4457a28358r9490N2555I0193m1438
19184D8755a54193O7855G1979a31955l5561k0066c9460m475r5229A02681d3258
19172A23471b68776Q1962B3612J15708d3504j08274n8341F6992b76292J7794j53509
19161d12007B24574J856i8853c727E8870a57533O4658a1294j25566A9405c26297
19149b36176A81155i4661j94684C07774F9985J17970b78577d1799A20778C7000
19138c79211d23o2541K5467D22307a74957a6114j55315A8905i8177l0882b0878
19126B05362h1019J7727l3476K9602j44696j22183e8133E5856P0292k9433Q8175
$$ plain form
19206 -129218 235256 -97754 -27753 26454 -11556 137936 89770 139865 -38582 -12863 -156174
19195 -156174 -203463 -206196 3240 -256271 -19110 84457 -128358 -227848 -175293 90193 48755
19184 48755 -154193 -86338 71979 -131955 -167516 -187582 -39460 -43935 -139164 102681 -43258
19172 123471 -268776 -186814 23612 139320 -43504 -151778 -210119 66992 -276292 -258498 -412007
19161 -412007 224574 226430 -98853 -3727 58870 -157533 -92875 -11294 -136860 19405 -326297
19149 -236176 181155 -94661 -289345 307774 69985 187955 -278577 -41799 120778 37000
19138 -379211 -423 -62964 -37497 422307 -174957 -16114 -171429 18905 -98177 -129059 -20878
19126 205362 -81019 -63292 -96768 -67166 -211862 -334045 -58133 55856 126148 96715 184890
19115A84890H1873K32247A02217e5206K5391o9435n5525A00472N9854a91228L5234
19104a55994j66206J42943e1860A19255b88550e5581k2656k11087a15241M9895
19094f5346A17212J23469b20995a1748p4334J297k47460a61764Q0035D42590A26580
19082H7770b1699j92674G4915A574J50144c78729a83712L3534k16619K9242A4082
19070A23644a0788A37365e9591l17871a55947A69579i9877K4598p1856B45853
19059a63948J6475G5571a34751j11173f4328j52351I8015a19140A77600c8581
19048F1055f1986l3838r1664B31937c41790F1113a79689D4330L4043P1230a83657
19036a31247E1818i7095G9644c00102B21921b76714c9270k3441a9979m7164C00210
$$ plain form
19115 184890 81873 314120 102217 -55206 -29815 -99250 -154775 100472 160326 -191228 -155994
19104 -155994 -322200 -179257 -51860 119255 -288550 -55581 -78237 -289324 -115241 -65346
19094 -65346 117212 240681 -220995 -11748 -86082 -84785 -332245 -161764 -81729 442590 126580
19082 87770 -21699 -214373 74915 1574 151718 -378729 -183712 -150178 -366797 -337555 14082
19070 123644 -10788 137365 -59591 -377462 -155947 169579 -99877 -75279 -147135 245853
19059 -163948 -147473 75571 -134751 -245924 -64328 -216679 98015 -119140 177600 -38581
19048 61055 -61986 -95824 -187488 231937 -341790 61113 -179689 44330 78373 149603 -183657
19036 -131247 51818 -97095 79644 -300102 221921 -276714 -39270 -62711 -19979 -67143 300210
19024A13034C1600a30721r9679a15071j18558B45447d246j48440o346A53402h4181
19012a65350q0470e4985B4426b71138B13824E09a88297N0250E3064b21513G1829
19000A54548b44208F9487c03876a20788j5567l6792J5639P7376A9787K52456a29591
18988a45330o8876p7070D52751b94315h601k03368H9912c35943i5771C09048i3625
18976b98006a20298B8694D727Q6219b16180J1649f4651m39917b9043k5620G2417
18964e7356q9600M0177a8178B30443I49b15919A1490f6507B48918J30219A45401
18952d4241k7725C26298a47660L1682q2139c4697B71054g0958A32891l55J76800
18941C09336a67042d5294r0297k02195B52919q7829b5528I3727O6152d8532K2249
$$ plain form
19024 113034 31600 -130721 -230400 -115071 -233629 245447 -4246 -152686 -159032 153402 -84181
19012 -165350 -245820 -54985 24426 -271138 213824 509 -188297 -138047 53064 -221513 71829
19000 154548 -244208 69487 -303876 -120788 -136355 -173147 -157508 -80132 19787 272243 -129591
18988 -145330 -214206 -291276 452751 -294315 -8601 -211969 89912 -335943 -95771 309048 -93625
18976 -298006 -120298 28694 4727 90946 -216180 -204531 -64651 -504568 -29043 -54663 72417
18964 -57356 -146956 -106779 -18178 230443 949 -215919 11490 -66507 248918 379137 145401
18952 -44241 -71966 326298 -147660 -115978 -198117 -34697 271054 -70958 132891 132536 309336
18941 309336 -167042 -45294 -135591 -337786 252919 165090 -25528 93727 159879 -48532 -26283
18930b6283E9639O9766a07884j09765D4819J32972j9917R9468H3626i2932L9605
18919e3327A20835J6919f0076k77822a62401o4092A35709d7509A40625n9397f6843
18907A61021j6287K85514A12784a9307A67013D8667b00119f6718i600q6605C9120
18895A1530K17134c10554A38200a24005K8414B63641H6955J9535N7247c12785
18884b76597F2183l0596d18814C6967f1496j37660f78G9891A5239L703l157b00783
18871f9731d392A92991Q3998b83669A3037e0025o3013C9104Q2219J10119l4112
18860A97330e1198A07551f6320j4047m9107a1412B30710b96184g9723B06081b8905
18848D61116b45924A91043H5534b99826J9938O2782A56181B407c3073j23856I7778
$$ plain form
18930 -26283 59639 129405 -107884 -217649 44819 177791 157874 257342 83626 -92932 -53327
18919 -53327 120835 137754 -60076 -337898 -162401 -226493 135709 -47509 140625 81228 -66843
18907 161021 144734 430248 112784 -19307 167013 48667 -200119 -66718 -9600 -96205 39120
18895 11530 228664 -310554 138200 -124005 -95591 263641 86955 106490 163737 -312785
18884 -276597 62183 31587 -418814 36967 -61496 -199156 -678 79891 15239 18942 15785 -200783
18871 -69731 -4392 192991 276989 -283669 13037 -50025 -113038 39104 121323 231442 197330
18860 197330 -51198 107551 -66320 -80367 -129474 -11412 230710 -296184 -79723 206081 -28905
18848 461116 -245924 191043 85534 -299826 -279888 -217106 156181 2407 -33073 -156929 97778
18836A41422a32426D7295Q2682d9220k75445C42547i1321j67728j4043B41756
18825C17L38192a82563A6907b29896G9682P9721l9012c21352D1175J68309O0234
18814B69718H9938J75618J33819a29420C83264e4413A87243a49675b1739C30298
18803A40721b12128A64168D9933c75678a16036A87679j7166a25341L6741k7292
18793a15892B25698a01071L1834D3883K9998f7550k3287m6476B32733b68938f6769
18781d52922A9867i5844j37884j33377a39437D4468c50003a54144L936C83977
18770b46449f5204n5972P912M2193k122H837a29468D5780J57335b76213j01425
18759c77638a75744l3340A02622A3188e4960j97492a23752j57186g3625m22814
$$ plain form
18836 141422 -132426 47295 129977 -49220 -324665 342547 -91321 -259049 -273092 241756
18825 317 338509 -182563 16907 -229896 79682 159403 120391 -321352 41175 209484 269718
18814 269718 89938 265556 399375 -129420 383264 -54413 187243 -149675 -21739 330298
18803 140721 -212128 164168 49933 -375678 -116036 187679 170513 -125341 -88600 -115892
18793 -115892 225698 -101071 -69237 43883 73881 -67550 -90837 -137313 232733 -268938 -66769
18781 -452922 19867 -95844 -233728 -367105 -139437 44468 -350003 -154144 -150208 383977
18770 -246449 -65204 -121176 -113264 -71071 -73193 8837 -129468 45780 203115 -276213 -377638
18759 -377638 -175744 -209084 102622 13188 -54960 -252452 -123752 -280938 -73625 -496439
18749d96439a06220B86004o0785b64806A24561f6749l19517J45421D4230d2466
18738a62324G4330F192c43614B35949G9758a30086e6779a5673o7493m6551k5367
18727a55084m2715M4409G5466N1020a63610p2640C713b51260J804A87737c28458
18715A49901g7325j60661B91678a23937C04068a68717M2294n3775N9403k75793
18705c96588C15990b09904Q0620A24586a60127c1809k04908E2888b19831b0769
18694b02207j08701M8135i4575j42533L0525c1291k04864A44844l99F5244J62938
18683B28182j00149J32098j28577h6552M248j45484B27246o3130e6814B61888
18672D5045J09709b02035M1104o1293P2541d9107j58234E0740a65398j943A317
$$ plain form
18749 -496439 -106220 286004 225219 -264806 124561 -66749 -386266 -240845 44230 -42466
18738 -162324 74330 6192 -343614 235949 79758 -130086 -56779 -15673 -83166 -129717 -155084
18727 -155084 -197799 -153390 75466 126486 -163610 -236250 3713 -251260 -249456 187737 -328458
18715 149901 -77325 -237986 291678 -123937 304068 -168717 -126423 -180198 -120795 -396588
18705 -396588 315990 -209904 -129284 124586 -160127 -31809 -236717 52888 -219831 -20769
18694 -202207 -310908 -262773 -94575 -237108 -206583 -31291 -236155 144844 144445 65244 228182
18683 228182 128033 260131 131554 -86552 -82304 -227788 227246 164116 -56814 261888
18672 45045 154754 -202035 -160931 -222224 -149683 -49107 -207341 50740 -165398 -167341 1317
18660C13004H4463a81790A97777c27673a32111H2608B2152a39605A1106a28412
18649g5070g413k51247C51692B9422b27908k15740a24766a3585q2097j5203r0033
18638b00918B3977c52501J38870c9136j06038C6251c9126A88778a68166c0962
18627h7991K2823j80692e4556C3716K82955a94610m8398L0812f0729b7279j6951
18616d4230k4433B40943a24264e1795A75923c0150m8524K1040J0870A26366d97411
18604a75132r9904R8839m4573f0814B14918a10526l48962H7573I334b08841E1614
18592a59390B37354b9457a2866q531B07974Q8499g8182o3625E8660e9558k38640
18581b98198A30353A9333K01934a12282F1709R2160a16771j10130e2666l18401
$$ plain form
18660 313004 84463 -181790 197777 -327673 -132111 82608 22152 -139605 11106 -128412
18649 -75070 -7413 -258660 351692 29422 -227908 -443648 -124766 -13585 -95682 -110885 -200918
18638 -200918 23977 -352501 -213631 -39136 -145174 36251 -39126 188778 -168166 -30962
18627 -87991 -65168 -245860 -54556 33716 316671 -194610 -243008 -212196 -60729 -27279 -44230
18616 -44230 -68663 240943 -124264 -51795 175923 -30150 -78674 -57634 -46764 126366 -497411
18604 -175132 -275036 -176197 -220770 -60814 214918 -110526 -459488 87573 9334 -208841 51614
18592 -159390 237354 -29457 -12866 -21397 207974 296473 -78182 -141807 58660 -59558 -298198
18581 -298198 130353 19333 221267 -112282 61709 153869 -116771 -226901 -52666 -371067
18571c71067C4030K06648a66276n2197E1O5112j8808a95921j45731R9914B70765
18559c4927k68908a33562k13327D7740R8732n2129a03334A44835k0332b81468
18548a95937H2937c60807b5932k59254a39559o1341b8712G1805B0788a47947A17748
18536A01559M7729c8269j77605q8593a0261j2091B18964e5485m872L496r3820
18525a50681L2140A1535c54916B95837b1740l44182a11729M721c0932o8810B3508
18513A01431a28422A31389F4772B1209J55519a28691c4197r2795F0849J70184
18503B31033E703b15098d1700A23026a73140A03493k1632c33601A80261b31838
18492a49039O7946A32667k297P4465c03709J29280J4946J707O906f4513K113B48034
$$ plain form
18571 -371067 34030 240678 -166276 -218473 51 65163 46355 -195921 -341652 -241738 270765
18559 -34927 -303835 -133562 -346889 47740 146472 94343 -103334 144835 124503 -281468
18548 -195937 82937 -360807 -25932 -285186 -139559 -200900 -28712 71805 20788 -147947 117748
18536 101559 149288 -38269 -215874 -304467 -10261 -22352 218964 -55485 -60357 -56861 -150681
18525 -150681 -118541 11535 -354916 295837 -21740 -365922 -111729 -107008 -30932 -99742 23508
18513 101431 -128422 131389 64772 21209 176728 -128691 -34197 -126992 60849 231033
18503 231033 5703 -215098 -41700 123026 -173140 103493 81861 -333601 180261 -231838
18492 -149039 -81093 132667 130370 204835 -303709 -174429 -159483 -157776 -150870 -64513 -62400 248034
18479B10756D6009J55538M4840o5034c9834j25134P1095j56206A44233c85857
18468C804J31332e2039A44605b76760g4049l4989D8879b68108A54560r065c1291
18456a01473D0891d3089B24567n2431a04290A32461n4994a97923P0376e3563p3012
18445a26575d0067j71026h8090b7188A47711J03885c48092M4111L9989o4407D5275
18433C60609a19108A92610a89717P2462k02224C92307c61689f2082b0632p9600
18423a00232B22f6071A49767a44029A55616E9345J68219e2120j88904M8534E372
18411A5201F587b25882B02812a91354j81562m4150G8935c575j5154D6484b68690
18399b5561j48936J3884A4844a87427B72205b25189F6002J47398d9873H334a01386
$$ plain form
18479 210756 46009 201547 246387 181353 -39834 -164968 -93873 -250079 144233 -385857
18468 3804 135136 -52039 144605 -276760 -74049 -109038 48879 -268108 154560 145495 -31291
18456 -101473 40891 -43089 224567 172136 -104290 132461 77467 -197923 -127547 -53563 -126575
18445 -126575 -40067 -211093 -88090 -27188 147711 251596 -348092 -303981 -263992 -328399 45275
18433 360609 -119108 192610 -189717 -117255 -319479 392307 -361689 -62082 -20632 -100232
18423 -100232 222 -66071 149767 -144029 155616 59345 227564 -52120 -241024 -192490 5372
18411 15201 6587 -225882 202812 -191354 -372916 -417066 78935 -3575 -18729 46484 -268690
18399 -25561 -174497 -160613 14844 -187427 272205 -225189 66002 213400 -49873 8334 -101386
18387a77108c879l464k71714F0265J90407i3014I4883D0112j5013a58837A1690
18375H1877e8159D9027b31288A56318i0598q5881H1059J73707d1828E4830j6286
18364C8544J44632c91394I1241a10613A00419k1322b69611J18219B2777K18619
18354B41396A3774J52709f5370a1887B2978J9008J1446e3014I6355a72067E3022
18342a30891n7206A19158p315a70085K1908B23486B6138J40785F9955M9016i1963
18330a53810f3581A25750a7111o4629C0205b35200a04120j36568c9130E2622i009
18318A4163b12574k2900g6301j04397a8797E9607i7269L6082p0054O4041j8668
18307h5868B0694J79931H447a66711A7060c3777A12031R7895b01610D0267a97617
$$ plain form
18387 -177108 -3879 -7343 -279057 60265 250672 -93014 94883 40112 25099 -158837 11690
18375 81877 -58159 49027 -231288 156318 -90598 -176479 81059 254766 -41828 54830 38544
18364 38544 183176 -391394 91241 -110613 100419 79097 -269611 -151392 22777 241396
18354 241396 13774 166483 -65370 -11887 22978 41986 53432 -53014 96355 -172067 53022
18342 -130891 -188097 119158 111843 -170085 -148177 223486 26138 166923 69955 118971 -91963
18330 -153810 -63581 125750 -17111 -81740 30205 -235200 -104120 -240688 -39130 52622 -9009
18318 14163 -212574 -235474 -76301 -180698 -18797 59607 -97269 -61187 -131241 -67200 -85868
18307 -85868 20694 200625 8447 -166711 17060 -33777 112031 209926 -201610 40267 -197617
18295F8735a31109A99776d4127F9468J2065a82927D13173H3685a19997B54803
18284a38036A84342d8535j0762H0625a82559l5815m0241a20309N3018j59719I319
18272A39559F5729b35866C35547g2900j12526j37848D89920F342K39382a98714
18261A51403b66352R3281J1627D79862c532k51598A93268a09565j74444F3118
18250G3680k3404b2558E9930c43215a65801b5391j20025p2542K6588f6062A81462
18238f4507F42105A82732j6802J76723C6253J27128h4193k8452B83983F7367b36583
18226C6622F197P3472h5498C26407b03738H5922i3062k14923a09611C03114b87567
18214a33294B7157K20012b4290j49151h2386A7590A696L27655e0136k20188A68326
$$ plain form
18295 68735 -131109 199776 -44127 69468 81533 -182927 413173 83685 -119997 254803
18284 -138036 184342 -48535 -59297 80625 -182559 -218374 -258615 -120309 -67291 -227010 9319
18272 139559 65729 -235866 335547 -72900 -185426 -323274 489920 6342 245724 -198714
18261 151403 -266352 -173071 -161444 479862 -3532 -255130 193268 -109565 -284009 63118
18250 73680 50276 -22558 59930 -343215 -165801 -25391 -145416 -217958 -191370 -66062 181462
18238 -64507 642105 182732 165930 342653 36253 163381 -84193 -112645 283983 67367 -236583
18226 36622 6197 79669 -85498 326407 -203738 85922 -93062 -307985 -109611 303114 -287567
18214 -133294 27157 247169 -24290 -173441 -82386 17590 1696 329351 -50136 -270324 168326
18202a90994A59689A0432e4305k93719A08196B5142K67371e1065n64095A31308
18191e9849q9378B96808a07647A53340e2519G516J02033C0074a8243j30030G6902
18179G955K2645e2161j14400C7350e1089B45491M5898b57129a20255B14729a63529
18167f5906j04614k51404A47912c21463B01597k8429a38282p3346P6843N7423
18157g7362n2064F0509b62875g9872A00686K886l3876j3640b95599a19396A96356
18145a3687j08574I4059a60551l90157a09191A38801J66643b37265B93026b56445
18134D2477i8415d2618p8506E6429A6812K19645f2405b9071j8859m01266C96002
18122A6938J25035L03726a92846L5697f4699I3308h2698A98617d0644k33093E6130
$$ plain form
18202 -190994 159689 10432 -54305 -348024 108196 25142 292513 -51065 -615160 131308
18191 -59849 -149227 296808 -107647 153340 -52519 7516 109549 30074 -18243 -148273 76902
18179 7955 30600 -52161 -166561 37350 -51089 245491 291389 -257129 -120255 214729 -163529
18167 -65906 -170520 -421924 147912 -321463 201597 173168 -138282 -211628 -134785 -77362
18157 -77362 -129426 60509 -262875 -79872 100686 103572 69696 56056 -295599 -119396 196356
18145 -13687 -122261 94059 -160551 -550708 -109191 138801 305444 -237265 293026 -256445
18134 42477 -98415 -42618 -121124 56429 16812 236457 -62405 -29071 -47930 -449196 396002
18122 16938 141973 445699 -192846 -157149 -64699 93308 -82698 198617 -40644 -273737 56130
18110f4402K2477j45082b5499j80939C05450C8443g1487f157A58127a05322A98705
18098A96053J08665A12903M0379i4j56707C26127o5912C4018d365k36167R4496
18087a46036f4898F2255N5321g1972B8810a05926j14458m1505k5760D767J81591
18076A86358c16357e2629J0258H8864e191B96655e5004I9689K2144K1375q937
18065A34271b1454m19644B64729a07395B47787F8808B1566M5779b69494L3206
18055b36288o6284a21755r5322A98467J2080k6942a83183F8314a60501n9951d6934
18043B42492h5158K0030C0931a27541C48895L6222c53718C8341c01061d3520B72184
18031a59582m3772H7087a63836B37403B8037b11059A05588c3623G3968a25039
$$ plain form
18110 -64402 -41925 -187007 -25499 -206438 305450 38443 -71487 -6157 158127 -105322 198705
18098 196053 304718 112903 153282 -94 -156801 326127 260215 34018 -4365 -240532 -146036
18087 -146036 -64898 62255 117576 -71972 28810 -105926 -220384 -261889 -287649 4767 186358
18076 186358 -316357 -52629 -42371 88864 -5191 296655 -55004 99689 121833 143208 134271
18065 134271 -21454 -441098 264729 -107395 247787 68808 21566 67345 -269494 -236288
18055 -236288 -302572 -121755 -217077 198467 210547 183605 -183183 68314 -160501 -220452 -46934
18043 242492 -85158 -65128 30931 -127541 348895 385117 -353718 38341 -301061 -43520 272184
18031 -159582 -203354 87087 -163836 237403 28037 -211059 105588 -33623 73968 -125039
18020c07980A22744J66063A12264D2574K93745b45893a9790H7573a69873e4437
18009a77535j11006F0704c54954B8641q44g989A37028b70252G5262M4673Q197
17998A28132a50309O1652L0891n0100o0112A7865a04251j72519B02471K87922
17988D90393c71764A69385b50411A40728a14936q244A46957c9280j51709j33734
17978c24723G7948a47849L4400G3747B3435J05649K52771q1053b72935Q3191A38624
17966A2396J95653a12375C93089G4824c20171B34039a82201e8432C29537a06056
17955B03794J22438C0263J42805a20226F0694a54420p110A26527b63279A57780
17944B52939J5693m1680d6422k4938A67166l9129B8795a41595j8566q485A63197
$$ plain form
18020 -307980 122744 288807 112264 42574 336319 -245893 -19790 87573 -169873 -54437
18009 -177535 -288541 60704 -354954 28641 27797 -7989 137028 -270252 75262 119935 128132
17998 128132 -150309 -88657 -57766 -107866 -167978 17865 -104251 -276770 202471 490393
17988 490393 -371764 169385 -250411 140728 -114936 -123180 146957 -39280 -190989 -324723
17978 -324723 77948 -147849 -113449 73747 23435 129084 381855 300802 -272935 -189744 138624
17966 12396 208049 -112375 393089 74824 -320171 234039 -182201 -58432 329537 -106056
17955 203794 326232 30263 173068 -120226 60694 -154420 -161530 126527 -263279 157780
17944 252939 268632 226952 -46422 -71360 167166 128037 28795 -141595 -160161 -168646 163197
17932G5103b53702B17598J36341e732A83387a78574A18178l5776a00352d5778
17921b34923N7683p283b579k22103h4068j00232A71379a95130j7801H0235b87218
17909a31567m14727a06681C5627J02194B0353b53443P7848c6425A2467d38575
17898B1172e29921E9974a33338p8803f5067H3071J14027b79954b692l02730L2515
17887b72907J4220j2633J24302B0806a72655e8560l31295a18586L521k0826B23670
17875A31482K42403I7171a8331B2523b60834Q2011N0639a9981F4917k38g1149
17863c66235i7128D8684b39676C1698c8998A05304b09313h3350j49504p6581A67505
17851b27317B49947J22852d4313A06554a70764k00983A70343c7321h510B22092
$$ plain form
17932 75103 -253702 217598 353939 -5732 183387 -178574 118178 82402 -100352 -45778
17921 -234923 -177240 -184523 -2579 -224682 -84068 -184300 171379 -195130 -212931 80235 -287218
17909 -131567 -546294 -106681 35627 137821 20353 -253443 -175595 -36425 12467 -438575
17898 21172 -529921 59974 -133338 -212141 -65067 83071 197098 -279954 -2692 -305422 -272907
17887 -272907 -258687 -271320 -147018 20806 -172655 -58560 -389855 -118586 -115065 -135891 223670
17875 131482 373885 97171 -18331 22523 -260834 -178823 -128184 -19981 64917 64679 -71149
17863 -366235 -97128 48684 -239676 31698 -38998 105304 -209313 -83350 -232854 -309435 167505
17851 -227317 249947 372799 -44313 106554 -170764 -371747 170343 -37321 -8510 222092
17840A932P8288K8643K986a49444B73959I9594b28701H0586O4994L2114C3369
17828e8742m2415B91367A22955J32131a82013c81l32347A57973O7865a76726C88261
17816A42292b01739A7719P8819m1971J64527K76639c1145k16555e6137E3566L1791
17805H5357l2577Q3682J29763o9254J1643a64564a4735k93421J23456f3730B9773
17793a66356b7669n9632p688A60282b03127f096B99432r0498l182E7306a2381
17781B3864J77896b07873p3198B8234a17986A28866c5908k11548B3441O4272J41014
17770B28727d3196A50912B2681a37047a6156k12816e3651m8931a9259H3705a11710
17758A03281m2318J3487P9700b75581a04950o2609A35452P8581b60754E68916
$$ plain form
17840 1932 80220 108863 111849 -149444 273959 99594 -228701 80586 145580 177694 33369
17828 -58742 -101157 291367 122955 255086 -182013 -381 -332728 157973 225838 -176726 388261
17816 142292 -201739 17719 96538 54567 219094 495733 -31145 -247700 -56137 53566 85357
17805 85357 52780 136462 266225 196971 208614 -164564 -14735 -308156 -184700 -63730 29773
17793 -166356 -27669 -87301 -94989 160282 -203127 -6096 299432 208934 205752 57306 -12381
17781 23864 201760 -207873 -281071 28234 -117986 128866 -35908 -247456 23441 87713 228727
17770 228727 -43196 150912 22681 -137047 -16156 -228972 -53651 -102582 -19259 83705 -111710
17758 103281 60963 74450 154150 -275581 -104950 -167559 135452 214033 -260754 568916
17747a49103a1399k63018B13016G2080L0608f9731j71984c9224B47058B8776b47502
17735D8388a30269K3600A59818a057k31248R4005L4084E9525a90814A46641L04
17724A46945m854J33561P9381k4549e634q343B70501M1185f8008k7414B28477
17712e577A49679h3362j2563q2196A76733l6422n4571K7413K8172h221m8764B2597
17699a54893e5492B2266f9538A45241C5977Q9690a20209H6712a90370P9837N5142
17688e5391B57450b2660j39331f7948c1615B07177F4833b62055B02760C3528P588
17677D1116a28115O1380k80401j43777h9938J4517b6191H3547M5034O7931K10787
17666D07299A28446o3621a95840F4008c67337H6787b07357A5544O3772l1065J5607
$$ plain form
17747 -149103 -11399 -274417 213016 72080 102688 -69731 -241715 -39224 247058 28776 -247502
17735 48388 -130269 -106669 159818 -1057 -232305 -138300 -104216 59525 -190814 146641 146945
17724 146945 142091 275652 355033 330484 -5634 -13977 270501 311686 -68008 -95422 228477
17712 -5577 149679 -83362 -95925 -178121 176733 140311 85740 113153 141325 -8221 -56985 22597
17699 -154893 -55492 22266 -69538 145241 35977 125667 -120209 86712 -190370 -110533 -55391
17688 -55391 257450 -22660 -161991 -67948 -31615 207177 64833 -262055 202760 33528 41116
17677 41116 -128115 -66735 -347136 -490913 -89938 -75421 -26191 83547 128581 196512 407299
17666 407299 128446 64825 -195840 64008 -367337 86787 -207357 15544 79316 48251 63858
17655F3858K35117b13516G5654a83652A09765l0610b33952A02877a4794A61334
17644A67708l0067a10326G606J90636a0173G868r2b02104A15192k4038c9981j379
17632d1360k30313C78820a21462R495F1451p006Q357i4731A87240G829J7970K60708
17620B86507a5515A1523g7628H7617l6436i0487A47604a33359D5268a40424A27471
17608C35055c5236o7895B50294j08352K6121j3868f1090A26111a02561J5596C6926
17596A74414c46806C79385A28726a10047b6474l77972H7361h2934B00422c2905
17585f3347j41527A53140o7491R0705m4108b27707k4966D71239a01883F7386a77071
17573a60526K1823C88466D8592M51970k43409o8525A4949O3157K04302c73595
$$ plain form
17655 63858 298975 -213516 75654 -183652 109765 79155 -233952 102877 -14794 161334
17644 167708 137641 -110326 7606 198242 -10173 7868 7776 -202104 115192 91154 -39981 -41360
17632 -41360 -271673 378820 -121462 -111967 61451 54445 62802 -94731 187240 7829 25799 286507
17620 286507 -15515 11523 -77628 87617 51181 -90487 147604 -133359 45268 -140424 127471
17608 335055 -35236 -103131 250294 141942 168063 154195 -61090 126111 -102561 -86965 36926
17596 174414 -346806 379385 128726 -110047 -26474 -404446 87361 -82934 200422 -32905
17585 -63347 -204874 153140 85649 176354 132246 -227707 -252673 471239 -101883 67386 -177071
17573 -160526 -138703 388466 48592 500562 257153 188628 14949 78106 282408 -373595
17562c3829j0433G8096a26659B61286A06447a53767J3234E7092o911b44076B06855
17550c7126A25781a48040a1265j65517k62774a38341D635N1895b1258A55076l8211
17539A16865e8116j21673b9866A57621K7150K21291a55361a1669r6193B5141n253
17528A9888a93643C24893I5056c12827B38442I9802A6765i1035B9990j0077a47031
17516i5915A84754b50812E6351b37224M15F168L60587A06131e39676B10782b31324
17504e36A55383J28877a00186A88956q8560a52315C15976n371m6483K49185a51433
17492A02509Q5160H5008J12865F7339M6022A1459a63031C93695e5322B21536K4000
17481B45536b2744A85759q2330O212K10886H2312J50926f4532E2189A5474O6803
$$ plain form
17562 -33829 -44262 78096 -126659 261286 106447 -153767 -140533 57092 50181 -244076 206855
17550 -37126 125781 -148040 -11265 -176782 -439556 -138341 4635 56530 -21258 155076 116865
17539 116865 -58116 -179789 -29866 157621 184771 406062 -155361 -11669 -107862 25141 19888
17528 19888 -193643 324893 95056 -312827 238442 99802 16765 -91035 29990 19913 -147031
17516 -95915 184754 -250812 56351 -237224 -236809 6168 366755 106131 -539676 210782 -231324
17504 -536 155383 284260 -100186 188956 100396 -152315 315976 310605 264122 513307 -151433
17492 102509 187669 85008 197873 67339 113361 11459 -163031 393695 -55322 221536 245536
17481 245536 -22744 185759 103429 109641 320527 82312 233238 -64532 52189 15474 82277
17470H2277R8492O3272K34417j72262I3817j3322c3692A25951f8051n0610A41445
17458I9265m1460a69854P6056A89041J14110j15542l4002A3535K95929l6494q9959
17447A83011J80544r8368j02394J82103J6360I9936C6797L41716K7871r3591k9567
17436B83226J26643a87693B82401F8864R7666l373j1289L25807B3197J54723J45786
17425C23706j51349J66666B7688A0296O60191I0643R6846P8267I0311J21313J37375
17414C48999k501M5568M0176J65780H9361a57594H8134K19973A04712J29433q3956
17403A50189C606K22222D2789K80586A51131n5766b04476C42066k9471a74611
17392a11601c6114A23483J66096A03832a05999J0778D576K48634L7653g243q8485
$$ plain form
17470 82277 180769 244041 478458 306196 93817 80495 -33692 125951 -68051 -118661 141445
17458 99265 57805 -169854 -93798 189041 303151 187609 153607 13535 309464 272970 183011
17447 183011 363555 265187 162793 344896 361256 99936 36797 378513 406384 312793 283226
17436 283226 409869 -187693 282401 68864 166530 163157 151868 477675 23197 177920 323706
17425 323706 172357 339023 27688 10296 670487 90643 187489 265756 90311 211624 348999
17414 348999 346498 392066 432242 598022 89361 -157594 88134 308107 104712 234145 150189
17403 150189 3606 225828 42789 323375 151131 95365 -204476 342066 312595 -174611
17392 -111601 -36114 123483 289579 103832 -105999 -95221 4576 253210 290863 -7243 -95728
17381i5728B44524b00837A39345i289A0197J41683a14351I4481b73866C53635
17370a67643p9119R6619k7690C59865A52472J53865H3343K07102e2942k04218
17360b57160P4372L6518C6046R6461a61838d3702A49870a0957j13323B08450f1200
17348C34924A35281a16528C4718M21870o0575E8063Q592J0833K36767a41249G17644
17336a12348B07090J4436o5787L8611K00380q0554o0426E2793J71071M780G3876
17324D35716d5101j4331j72669E5819J92178j03118K0408R3230J16406Q0834A2445
17312B45528g1838c5580B02550J28208a34725B07100A1027M3884J47045o1295
17302A40661B5213K37734A07713l5761k1203R9775h4281k62982C7625J92231F0601
$$ plain form
17381 -95728 244524 -200837 139345 -9289 10197 151880 -114351 94481 -273866 353635
17370 -167643 -246762 -150143 -177833 359865 152472 306337 83343 290445 -52942 -257160
17360 -257160 -182788 -146270 36046 132507 -161838 -43702 149870 -10957 -124280 208450 -61200
17348 334924 135281 -116528 34718 456588 396013 58063 66655 77488 314255 -141249 717644
17336 -112348 207090 221526 155739 194350 394730 314176 253750 52793 223864 228644 73876
17324 435716 -45101 -59432 -232101 55819 247997 144879 165287 258517 374923 455757 12445
17312 245528 -71838 -35580 202550 330758 -134725 207100 11027 54911 201956 140661
17302 140661 25213 262947 107713 71952 50749 150524 -84281 -347263 37625 229856 60601
17290c00027A89708i7179B94492j30484M29263B34646M3513H9415R6887c08649
17279A39211l1961J87056q5067j7657E7584d8727C51894B755d3057o6217F1156
17267C72409K1859a13575B8010N4605R4882K39861I0357K25209A29468K70068
17257C99536A97250a38229B32670A05010o761m6004K33237G5650H733N4302h2461
17245A92686m0824k264K47857d3234D40654j87960G4598j5952L69942k08625p958
17234B12005K83091R8686k41368j61759H1284L01539D2544K12814N1668j26160
17224A80866M23811A2965K02708k1855J64975j11599j438o5882K58844A99120
17213B28817Q3076j7402a35433C66908J36682A28824b13981J01337C66493j36330
$$ plain form
17290 -300027 189708 -97179 294492 164008 593271 234646 278159 89415 186302 -308649
17279 139211 107250 294306 209239 191582 57584 -48727 351894 2755 -43057 -109274 61156
17267 372409 394268 -113575 28010 82615 177497 417358 90357 315566 129468 399536
17257 399536 197250 -138229 232670 105010 98249 52245 285482 75650 8733 63035 -82461
17245 192686 151862 149598 397455 -43234 440654 252694 74598 58646 428588 219963 212005
17234 212005 495096 593782 352414 190655 81284 382823 42544 255358 307026 180866
17224 180866 604677 12965 215673 193818 358793 247194 245756 179874 438718 199120
17213 228817 311893 294491 -135433 366908 503590 128824 -213981 -112644 366493 230163
17203B30163b2878B21678J57509K81975k97130P9173P3390e316B13841J73331
17193C87172r1046O557c270B58198n4857J38770B1892J68641J84679j56263P3144
17182B92093R7940j17452J27758a84057A01958J29084r1735M0000A977K41698
17172B43675a9413C52966O9415A37275J66532j632I1552j988N7747R6866m5919
17161A98258a61054C76524j33981P456k6074J48721K776j29468J2910p7499N0559
17150B31924O4312G7350M19184A98252J08645R8272J540A81946J97790j19657
17140B60079J91954j35958K00751b29961g2752D17878B07687L85230D7529R6236
17130A43765N04704k54000L17364B08723N703J25800j01964R294J61311A61174
$$ plain form
17203 230163 -22878 221678 379187 661162 364032 443205 516595 -5316 213841 387172
17193 387172 296126 302683 -3270 258198 203341 342111 21892 190533 375212 218949 292093
17182 292093 390033 272581 400339 -184057 101958 231042 139307 179307 1977 243675
17172 243675 -19413 352966 422381 137275 303807 302175 91552 89564 147311 244177 198258
17161 198258 -161054 376524 242543 249999 223925 372646 375422 245954 258864 181365 231924
17150 231924 296236 77350 496534 198252 306897 405169 406709 181946 379736 260079
17140 260079 452033 316075 516826 -229961 -72752 417878 207687 592917 47529 143765
17130 143765 648469 394469 711833 208723 214426 340226 238262 247556 408867 161174
17119E36408B27994J1751L23032A77072p353J96994J07335A28384N8580N4215
17109B41179M5632L4517j8856K15633J98120B91148K21727A36531J49611J71832
17099D57974A76010L04304A90113M49609j47940j34192j77471K5094L65623j56388
17089D14448R2294k07368J88934B05678K11777Q9528A88502J2306P5891K44435
17079E21134L6207A95231J56840L5047j25170n7521m3140J32717K18590J42110
17069F54704B91798L49443C18705j05877j1995L84916R9536k63560r2256K0507
17059C49976J81129k0838o0365K28209k70837A41224L41851k764q2215K97167
17049F95263B32938J27887J83965j21214n6163J94835O9186P9687m68q882R0674
$$ plain form
17119 536408 227994 239745 562777 177072 169719 366713 474048 128384 186964 241179
17109 241179 286811 321328 302472 518105 716225 291148 512875 136531 286142 457974
17099 457974 176010 480314 190113 639722 491782 357590 180119 205213 570836 414448
17089 414448 506742 299374 488308 205678 417455 506983 188502 200808 276699 521134
17079 521134 557341 195231 352071 387118 261948 204427 161287 294004 512594 654704
17069 654704 291798 641241 318705 212828 200833 585749 685285 421725 329469 349976
17059 349976 531105 510267 449902 678111 407274 141224 483075 480311 398096 695263
17049 695263 232938 360825 544790 423576 367413 562248 631434 711121 710653 701771 792445
17038G92445j19405k909j74763R2659k51802K4300K32241j27006M82874m36022
17028E12612L03151l66369J54082k07923L6731j56172L04520B74345M99312j8503
17018G55154l51033L51042l15454K59516j90311K94952j22840m5909L04986l71701
17008E68402N8516P3038N5100j87144J26393J80752q973q5462k62670K04953l33505
16997C89400K25594J88565k06307l55N7234K27230q4348p0187J50540j22137K95202
16986A050431j93382r3321j05029m1241J89315k84159M65009k58895j6462p3793
16976F38473K10117Q1191o382j36561L38420m27234P9382J26675k39283K30531
16966H95329o439J71600j23348j69256J83482J53473j82763k09431q8692L29182
$$ plain form
17038 792445 673040 670131 495368 588027 336225 360525 592766 465760 948634 512612
17028 512612 815763 449394 603476 395553 432284 276112 580632 274345 773657 755154
17018 755154 404121 755163 439709 699225 508914 803866 681026 635117 940103 568402
17008 568402 626918 699956 755056 567912 694305 875057 866084 780622 517952 722905 389400
16997 389400 614994 803559 597252 596897 654131 881361 797013 726826 877366 755229 1050431
16986 1050431 857049 763728 658699 617458 806773 522614 987623 728728 712266 638473
16976 638473 848590 929781 923399 786838 1125258 698024 777406 904081 664798 895329
16966 895329 888890 1060490 937142 767886 951368 1104841 922078 712647 623955 953137
16956I53137l1383k5287K95094k8356l23469J02231J69230q8194j05532J32786
16946A050257J13569j32880N3613l69175J63657K42781l8302j98487O3596L75122
16936A323751j99939k02347J26053O2272K51008k43537J46795k15288L92446j27429
16926A313785j70617K03068j44795Q6494R5234k0811J65914m48375M57212j54429
16916A382680m415o1340M2039M3145j17504J47296L8177k22216M7578J83443K37102
16905A715985j25818K66334j65581Q5950j76858k1705J04542J38383l73755N64466
16895B011943J05174j96690j88914L09391j61126p9957j3657k15124O3427K18041
16885A852508K68670m8592l02638J95024Q276l230l6055K35137j05023J84820
$$ plain form
16956 953137 921754 896467 1191561 1163205 839736 941967 1111197 1023003 917471 1050257
16946 1050257 1163826 1030946 1084559 715384 879041 1121822 1083520 885033 948629 1323751
16936 1323751 1123812 921465 1047518 1109790 1360798 1117261 1264056 1048768 1441214 1313785
16926 1313785 1143168 1346236 1201441 1287935 1383169 1362358 1528272 1079897 1537109 1382680
16916 1382680 1378265 1316925 1358964 1402109 1284605 1431901 1470078 1247862 1295440 1478883 1715985
16905 1715985 1590167 1856501 1690920 1776870 1600012 1578307 1682849 1821232 1447477 2011943
16895 2011943 2117117 1920427 1731513 2040904 1879778 1799821 1786164 1571040 1634467 1852508
16885 1852508 2121178 2072586 1769948 1964972 1973248 1970018 1933963 2169100 2064077 2248897
16875B248897j00611J534j09366N3227q0598L07741K7316j17410K8569J28701
16865B388000Q8694K35600o00753L43775K01721k56329M41795J6455k05568P8402
16855B731792K17340r6229j4432P3625R5048L25434m30405J58430K43486K83619
16845C587708K2713k00217n1506J0765n1240K65836K36210l15096L36975m5292
16835C796856J10405j37148K18714J08163Q941k74153L47170N9126J49254K72301
16825D659629j78171J35104L33136k90455J68150L01725j95932K83594K02948
16816E419728L36120K2798J1543j31313J33502N4680L59500k75708M28627J38892
16806F498369k43638L97208J55101Q1207M20542R153J49561L3018K30986L58971
$$ plain form
16875 2248897 2148286 2149820 2040454 2093681 2013083 2320824 2348140 2230730 2259299 2388000
16865 2388000 2476694 2712294 2111541 2455316 2657037 2400708 2842503 2858958 2653390 2731792
16855 2731792 2949132 2852903 2838471 2912096 3007144 3332578 2902173 3060603 3304089 3587708
16845 3587708 3610421 3410204 3358698 3369463 3318223 3584059 3820269 3505173 3842148 3796856
16835 3796856 3907261 3770113 3988827 4096990 4105931 3831778 4178948 4238074 4387328 4659629
16825 4659629 4481458 4616562 4949698 4659243 4827393 5129118 4933186 5216780 5419728
16816 5419728 5755848 5778646 5790189 5658876 5792378 5847058 6206558 5930850 6359477 6498369
16806 6498369 6254731 6651939 6807040 6888247 7308789 7317942 7467503 7500521 7731507 8090478
16796H090478J16405L32529M85884r171K30621M39572j5422J04524O3042K65472
16786A0103934N74645N07885K18699M55372K82215M08419L70424L04321L59492
16777A3585406J41705O20927L47567Q37227K82882K69484O64528N25924O72034
16768A7947684Q47010M79802N72354O77276J077474N47857R43054P53688J027346
16759B4873545J163242R70934J223534J105492J251016J454524J099146J567999
16751C4709432J896267J443810K388636J510269J790276K627839K549512K256933
16743E1172974K583171L212403L200569L155689L599541L688715M399476M348580
16735G9361118M998727M505100N876308N259160N920340O330153O093561O844028
$$ plain form
16796 8090478 8206883 8539412 9025296 9016125 9246746 9686318 9670896 9775420 9838462 10103934
16786 10103934 10678579 11186464 11405163 11860535 12142750 12551169 12921593 13225914 13585406
16777 13585406 13727111 14348038 14695605 15532832 15815714 16085198 16749726 17275650 17947684
16768 17947684 18794694 19274496 19846850 20524126 21601600 22149457 23092511 23846199 24873545
16759 24873545 26036787 27007721 28231255 29336747 30587763 32042287 33141433 34709432
16751 34709432 36605699 38049509 40438145 41948414 43738690 46366529 48916041 51172974
16743 51172974 53756145 56968548 60169117 63324806 66924347 70613062 75012538 79361118
16735 79361118 84359845 88864945 94741253 100000413 105920753 112250906 118344467 125188495
16727A25188495P243195O970920O991708O771532P103849O426063N650679M550340
16719A76896781M385223L015264J639357P76646n75628j897502k719456m308055
16711A77212630m998448n716019o704619o612758p422420p054687p310856p174071
16703A24218752p017007o886535o094234o342154n448264n813929m706340m848421
16695G7061868m558279m101326m080448l382359l623998k974037k984272k722465
16687D8634684k212468k597213k415593k044872j818095j580263j744699j405217
16679C2816264j842589j238501j419525j112481j070500j207895j216591j090015
16671B2618167q67382o58206p19890r90135l63393p54947n42208o24908p52466
$$ plain form
16727 125188495 132431690 139402610 146394318 153165850 160269699 166695762 172346441 176896781
16719 176896781 181282004 184297268 185936625 186713271 186137643 184240141 181520685 177212630
16711 177212630 172214182 166498163 159793544 153180786 145758366 138703679 131392823 124218752
16703 124218752 117201745 110315210 104220976 97878822 92430558 86616629 81910289 77061868
16695 77061868 72503589 68402263 64321815 60939456 57315458 54341421 51357149 48634684
16687 48634684 46422216 43825003 41409410 39364538 37546443 35966180 34221481 32816264
16679 32816264 30973675 29735174 28315649 27203168 26132668 24924773 23708182 22618167
16671 22618167 21750785 21092579 20372689 19382554 19019161 18264214 17722006 17097098 16344632
16662A6344632m24083n32674q21011m77383l57168n58113l99094o29525J38981
16653A2284562o25520j67671m83174n16428r7021o56269j19940K27121p95339
16644I050321k994m58841j84648J512n20170K04498n57805m28881L50483l66049
16634G087426k8999m87443m4490p6739k7701m42098l9975N554j04734l58681J24851
16623E606971k46351r1832l89964N5332M475N9733k59550l0233k36378J50012
16613D622215j96364l02043j00474L06702m71638K17092l38145J45813k67109
16604C616049J88392N4921o4686m37212q8863M6662K91284l06033M21j38301j28859
16593C033775R8274k9837J22201j42651k83930K40135k40883O0198m45277K27922
$$ plain form
16662 16344632 15920549 15387875 14566864 14089481 13732313 13174200 12775106 12145581 12284562
16653 12284562 11659042 11491371 11008197 10491769 10394748 9738479 9618539 9845660 9050321
16644 9050321 9047327 8588486 8403838 8405350 7885180 8089678 7531873 7102992 7453475 7087426
16634 7087426 7058427 6570984 6526494 6449755 6422054 5979956 5939981 5945535 5840801 5482120 5606971
16623 5606971 5360620 5268788 4878824 4934156 4938631 4998364 4738814 4708581 4472203 4622215
16613 4622215 4425851 4123808 4023334 4330036 3858398 4075490 3737345 3883158 3616049
16604 3616049 3804441 3859362 3794676 3357464 3268601 3315263 3606547 3300514 3300935 3162634 3033775
16593 3033775 3132049 3102212 3224413 3081762 2797832 3037967 2797084 2857282 2412005 2639927
16583B639927m68620L29792o9842J97775l10520J50827j58982N2685k43009J32251
16573B252284j45852K2987L4278j57797J5314k5032j31086L91266l97238K34518
16563B093642r8576k32608m9347J10120q8059p4364k3644m7276M07619j38013
16553A859494j82138j30160M02133m22539J29346r7371l1796J51844k4369l40830
16543A313614J58326j27123j92951J95980P7800j39647M00894j9358m2796o6657
16533A558082J14031j36603j36735j42809K22987k78111j46411j12660M9816K48308
16523A239895l42220K64617j12089J14757j25444l15994O9584J64472J00622l5778
16513A022422J64405j36236J22893l39595q9248J18485Q1098K51448k89184L1953
$$ plain form
16583 2639927 2171307 2501099 2431257 2629032 2318512 2469339 2310357 2363042 2120033 2252284
16573 2252284 2106432 2129419 2163697 2005900 2021214 1996182 1865096 2256362 1859124 2093642
16563 2093642 1995066 1762458 1713111 1823231 1735172 1660808 1637164 1589888 1997507 1859494
16553 1859494 1677356 1547196 1949329 1526790 1656136 1558765 1526969 1678813 1654444 1313614
16543 1313614 1471940 1344817 1151866 1347846 1425646 1285999 1686893 1667535 1624739 1558082
16533 1558082 1672113 1535510 1398775 1255966 1478953 1200842 1054431 941771 991587 1239895
16523 1239895 897675 1162292 1050203 1164960 1039516 723522 793106 957578 1058200 1022422
16513 1022422 1186827 1050591 1173484 833889 744641 863126 944224 1195672 906488 938441
16503I38441K1075l7319l6170k8857R1519m05940N13168l62440J88729J97045
16493A079251o5464l80743j24642K31198K03227k09908L1694K2313N4745j97267
16483F44404k67288J56833K14025j82208M54075k63300k76116J01545Q6426l14467
16473C53929M32052m3647k26400n1251O45417m71092L1801O6455l30655K18321
16463F24930M4607L76289D82374M05567l60177l9309J23626p4648K27650m8138
16453G16945l00374K96475B62063K93998j77914J95328J368j16680J28781j59239
16443D27705q0732J43005n3663A63511J58116J50157Q2307j66864n386J0355L63064
16432G55260M5604B87406m7003K14973Q509l0517j84451O459L52207L9742j57741
$$ plain form
16503 938441 959516 922197 886027 857170 948689 542749 1055917 693477 882206 1079251
16493 1079251 1013787 633044 508402 739600 942827 732919 764613 786926 841671 644404
16483 644404 377116 533949 747974 565766 1019841 756541 480425 581970 668396 353929
16473 353929 785981 742334 515934 464683 1110100 639008 670809 737264 406609 624930
16463 624930 669537 1045826 482374 887941 527764 488455 612081 537433 765083 716945
16453 716945 416571 713046 262063 556061 378147 573475 574843 458163 586944 427705
16443 427705 346973 489978 436315 163511 321627 471784 554091 387227 381841 392196 755260
16432 755260 800864 287406 240403 455376 463885 433368 248917 255376 607583 647325 489584
16421D89584o8594L5406j07009A60816J28146L71218B66709N5207j26487M28628
16411F24057k79489K06286J15263l09219l7195I5107M31610m3188J92127A69373
16400C77184k9083A16790d9482C23018J73524J32152k07021B08876Q9289K19902
16390E18067j57541I8531J86543n0204K85804A41104M42962k58565p9212P6256
16380C22545A57260K75816D3339M98680B53495O3166r4548J58899a0252B21462
16369C18206m2181j5853J07140L1825j14080j33646N1191k6331K60717A61341
16358B16180J51538M4770Q5854A25652L47328j37547j59717l7022n1230N14684
16348F02148B05512L106J61445n8891A37378J28354E0486K4988O8901K59450A64929
$$ plain form
16421 489584 420990 456396 349387 160816 288962 660180 266709 321916 195429 624057
16411 624057 344568 550854 666117 356898 319703 95107 526717 483529 675656 169373
16400 377184 348101 116790 -49482 323018 496542 628694 421673 208876 298165 518067
16390 518067 360526 98531 285074 234870 520674 141104 584066 325501 246289 322545
16380 322545 157260 433076 43339 542019 253495 316661 222113 381012 -10252 221462
16369 318206 276025 260172 367312 399137 285057 151411 202602 176271 436988 161341
16358 216180 367718 412488 498342 125652 472980 335433 175716 138694 87464 602148
16348 602148 205512 208618 370063 311172 137378 265732 50486 75474 144375 403825 164929
16336B19621r0295j3395L44857j64571J06232o0464j57782M2610L2248j07008
16326A52053K25876b35414A24918J61291K15642a98983A34930E4853J08263C6681
16315A05046a34256F2126K92610j1368O0689F6737M81470A97573J06304b6559
16304C91816g3716C11283j28498J83307A7577L62205j79930J74391f4799F7913
16293d7895B44643a98384A84295J40270l4034d0064G7855K33201l2143o3534L225
16282B18604m5964l2288J83106q8537p3698J79789A23852k6130K19583A52381
16271a09102A60477J05326A29592D0417a57055C23356M9341F6137j8856J4113
16261F1394J58820H5337R4196q5441J59398m2259L065C8724a8324j24244A93500
$$ plain form
16336 219621 129326 115931 460788 296217 402449 341985 184203 226813 259061 152053
16326 152053 377929 -235414 124918 286209 501851 -198983 134930 54853 163116 36681
16315 105046 -134256 62126 354736 343368 404057 66737 548207 197573 303877 -26559
16304 391816 -73716 311283 182785 366092 17577 379782 199852 374243 -64799 67913
16293 -47895 244643 -198384 184295 324565 290531 -40064 77855 311056 278913 215379 218604
16282 218604 172640 140352 323458 234921 161223 341012 123852 97722 317305 152381
16271 -109102 160477 265803 129592 40417 -157055 323356 372697 66137 47281 61394
16261 61394 220214 85337 179533 94092 253490 211231 214296 38724 -18324 -142568 193500
16249A54016P2699g8699a0643A40174f9500C75438b19366c6902I1818D0288J60538
16238B00826e9735j3292B54589J8008D2430g2900p8133A77187H1387L79315a31304
16226a6549k55706i5735m2630d8791A23687m2506i5298J9861C06484p5660N7092
16215B87916h499F7740J77297k6631O0221D2835P4732P6996D9163K55257C95M04315
16203D04710A08132i518B8914L02147e5988A22247N4256b98388B05172b08050
16192G1214J25440r3827J21373D0650N236M5287a9089B47106a18849k8874a4933
16180G52b11227a6365o2266B41398q0404a86081B1778J5747d6341k00690A26078
16168a9245H4953K22442F2437K1900L1240d6141n5638A41431i4106k11690B24880
$$ plain form
16249 154016 226715 -78699 -10643 140174 -69500 375438 -219366 -36902 91818 40288 200826
16238 200826 -59735 -73027 254589 272597 42430 -72900 -151033 177187 81387 460702 -131304
16226 -16549 -272255 -95735 -138365 -48791 123687 81181 -95298 -75437 306484 230824 287916
16215 287916 -8499 67740 245037 218406 278627 42835 117567 194563 49163 304420 395 404710
16203 404710 108132 -9518 28914 331061 -55988 122247 176503 -298388 205172 -208050
16192 71214 196654 102827 224200 40650 45886 91173 -19089 247106 -118849 -147723 -14933
16180 752 -211227 -16365 -78631 241398 160994 -186081 21778 37525 -46341 -247031 126078
16168 -19245 84953 307395 62437 84337 115577 -46141 -101779 141431 -94106 -305796 224880
16156d0908J9224k38452a7542A63714b89276J22746C30191H0070M1701a46552
16145A14223k251N34358a57005A41214b57898C54673I6897J05483A5116K55544
16135B70660p5976M8066A10064a48026e1306C73855A9109c66340a2552D7042d6383
16123A63612b9788A5935J66382J0836a77370B45329k6545A6461e7244q8807O6689
16112g9362r835J2954K7493g990A90792K26558i9713G5433a00867B37518A06201
16100A79308a1878I3979D1749d3040l9184k5139B54343m3568D8100Q7488a67488
16088C88920a60163P4471j00335b0090A3881L40565c30282a26799p8716j01477
16078c06992A96826O1090F8080J48510b06275h3823a4076k26691N4085G786M4124
$$ plain form
16156 -40908 -21684 -260136 -17542 163714 -289276 -166530 330191 80070 121771 -146552
16145 114223 111972 646330 -157005 141214 -257898 354673 96897 202380 15116 270660
16135 270660 194684 242750 110064 -148026 -51306 373855 19109 -366340 -12552 47042 -46383
16123 163612 -29788 15935 182317 193153 -177370 245329 218784 16461 -57244 -146051 -79362
16112 -79362 -89197 -76243 -48750 -7990 190792 417350 -99713 75433 -100867 237518 106201
16100 179308 -11878 93979 41749 -43040 -82224 -107363 254343 210775 48100 135588 -167488
16088 388920 -160163 -85692 -186027 -20090 13881 354446 -330282 -126799 -205515 -306992
16078 -306992 196826 257916 68080 216590 -206275 -83823 -14076 -240767 -186682 7786 51910
16067E1910P5069a79770G8746a08702b1755j90229l372C8850a59602P1325A3016
16055C14965a60751D6661h4955L5006j56436A10110a28C63602b81038k2770a05874
16043a55740C5835J03810K8887b86744C81282d11580a74485D1995b72698B98707
16032A74327g620B96747N84d5342H3334l2294h1057j5614m1041C7153h9964Q120
16020h1844j60216n021Q3240o2804Q0063l9034n7104h5443r3275k192A64812J11129
16008B75941B2069a75005A38746A4467L42620e2133R755J7188B51183a42255j2492
15997a54747E1187a58619l8654H4652j720l9610J80617b67901A14847J03932f8188
15985a39121F673a71886A36500e6679A64997J62568j33031a2380A26387K0198
$$ plain form
16067 51910 126979 -179770 78746 -108702 -21755 -211984 -215356 38850 -159602 -88277 13016
16055 314965 -160751 46661 -84955 -49949 -206385 110110 -128 363602 -281038 -303808 -105874
16043 -155740 35835 139645 168532 -286744 381282 -411580 -174485 41995 -272698 298707
16032 174327 -7620 296747 297331 -45342 83334 51040 -81057 -96671 -137712 37153 -89964 -81844
16020 -81844 -242060 -247081 -163841 -226645 -146582 -185616 -242720 -85443 -178718 -180910 164812 275941
16008 275941 22069 -175005 138746 14467 357087 -52133 -42378 -25190 251183 -142255 -154747
15997 -154747 51187 -158619 -197273 84652 82932 43322 223939 -267901 114847 218779 -68188
15985 -139121 6673 -171886 136500 -56679 164997 327565 194534 -12380 126387 146585
15975A46585D1342a31183H2828i9608c0195F7925a34465H1284a24226H4903j6239
15964F8664r290j9640J90035n1230c2557A32409J12541B852b9052l7668F8586
15952a85673n0247f9002k2k18386C4321L04174a12960p0075B13187G4852K15280
15941B90132I949b50609O7126F4856a46266m3618p219j58552B27083a56368A35858
15929G9507K8202i1268j18713B17516A8710a66549k73774a5547d436k06573D7259
15917h833H6162c79174B09196e507j99279b974m02809B03670G9115R5928a90884
15905f1316I5947j456a46817j08595a02743l6445H9900K35316a72073p728B12179
15893a39684D0615a75219L1348l04248A31939F4872i2883d4382D8363c3488B18701
$$ plain form
15975 146585 41342 -131183 82828 -99608 -30195 67925 -134465 81284 -124226 84903 68664
15964 68664 59374 39734 229769 178539 -32557 132409 244950 2852 -29052 -66720 68586
15952 -185673 -235920 -69002 -69024 -287410 34321 338495 -112960 -183035 213187 74852 290132
15941 290132 9949 -250609 -183483 64856 -146266 -189884 -197103 -355655 227083 -156368 135858
15929 79507 107709 -91268 -209981 217516 18710 -166549 -440323 -15547 -4436 -211009 47259
15917 -8833 86162 -379174 209196 -5507 -204786 -2974 -405783 203670 79115 175043 -190884
15905 -61316 95947 94491 -146817 -255412 -102743 -139188 89900 325216 -172073 -179801 212179
15893 -139684 40615 -175219 -143871 -448119 131939 64872 -92883 -44382 48363 -33488 218701
15881D4946I87O0328a74643Q3358q2516G7323K12096j18806a76755A5760R1748
15870A07508g6824A57989a66798k9450I3272a17879a8837j89922A59687a80215
15859c5456a0563I7559d4997E763J37938k1315a05264k1397C80178n6197f216
15847b5190l2844k41369d2676j04576a8924B05593c1732C8883J4958K71876A6898
15835B0701L05008E6009f4428B808b10003b8821n45661J93577a54723E6599a19301
15823b1251A229P8527g5094J3370B5098J26151g9603B47489E3032g3582r2916
15812a66498I7914a98416L4930F774J00261f673b54B56481c1680F5189k9888a50470
15799h4347G7065a56592A49078b54120C3109g7732J2351o9351K5809B5376a14545
$$ plain form
15881 44946 987 61315 -174643 -91285 -173801 77323 289419 170613 -176755 15760 107508
15870 107508 -76824 157989 -166798 -196248 93272 -117879 -18837 -208759 159687 -180215
15859 -35456 -10563 97559 -44997 5763 143701 122386 -105264 -126661 380178 323981 -6216
15847 -25190 -58034 -299403 -42676 -147252 -18924 205593 -31732 38883 53841 325717 16898
15835 20701 325709 56009 -64428 2808 -210003 -28821 -574482 -380905 -154723 56599 -119301
15823 -21251 1229 79756 -75094 -61724 25098 151249 -79603 247489 53032 -73582 -166498
15812 -166498 97914 -198416 -163486 6774 107035 -6673 -254 256481 -31680 65189 35301 -150470
15799 -84347 77065 -156592 149078 -254120 33109 -77732 -65381 -134732 -108923 25376 -114545
15787A14569g2073A14427a537A98061h9457M1716k1940I3695a33639d4063c262
15775c60085A09578B7195b10252A1199a42350C2197d634n1562I1621b81391A68841
15763h6607C63855a01505j09925a7554A782b84965Q7271A18285D9492a97619A01756
15751a39313A03543h9735a7747A60363F7645J03108e4910a792B12506b93154f9435
15739B3000N0824f072A04396n2110L8417M2510m2999a45089M7919C27275f6727
15727a82208i0974k19693a06042F5808Q0797J09737b72613f0893A38685b31786
15716g1612A33752O2842F5992M0296J7515c08572C0072a16520L1897l738C3657
15704d38637b10559g6263A8160N7377H62L69624j39625a48637M7708C27692n4783
$$ plain form
15787 114569 -72073 114427 -1537 198061 -89457 -47741 -69681 93695 -133639 -44063 -3262
15775 -360085 109578 27195 -210252 11199 -142350 32197 -4634 -56196 91621 -281391 168841
15763 -86607 363855 -101505 -211430 -17554 1782 -284965 -197694 118285 49492 -197619 101756
15751 -139313 103543 -89735 -17747 160363 67645 170753 -54910 -1792 212506 -293154 -69435
15739 23000 73824 -6072 104396 52286 90703 133213 90214 -145089 -97170 327275 -66727
15727 -182208 -90974 -310667 -106042 65808 146605 256342 -272613 -60893 138685 -231786
15716 -71612 133752 196594 65992 106288 123803 -308572 30072 -116520 -84623 -88361 33657
15704 -438637 -210559 -76263 18160 75537 862 370486 230861 -148637 -100929 327692 272909
15693B72909C0397K4797J88788c62116A38409n6345c2722r7434B32168b51122
15682A44520d05812c894k34066m2115A04680a36420C3272a92775O2191B2721A19
15670a9783F5756B8062m464c5365B22185I3227a96362L9124H2142J7573a70767
15658a18377A22755D0722Q2408a3262B11038b26032l3119p4577A25750N7910m7622
15647A36038N9650K0503H9896J22394L9397q6099J13738F189f5868G2843J14277
15636A87120a8511q0212J5498C49891a57021B43150b14672O6043f7770F2683d6416
15624a78479B86239A30915n6458a50278A40417K54086A2177b33554G3880J92676
15614B66556I0868a8127k72877A01243g8494m4941c4939n74596b24411F4579a25948
$$ plain form
15693 272909 30397 55194 243982 -362116 138409 82064 -32722 -130156 232168 -251122
15682 144520 -405812 -3894 -237960 -280075 104680 -136420 33272 -192775 -130584 22721 119
15670 -19783 65756 28062 23598 -35365 222185 93227 -196362 -157238 82142 99715 -170767
15658 -118377 122755 40722 123130 -13262 211038 -226032 -259151 -333728 125750 183660 136038
15647 136038 195688 216191 89896 212290 251687 165588 279326 6189 -65868 72843 187120
15636 187120 -18511 -98723 -83225 349891 -157021 243150 -214672 -148629 -67770 62683 -46416
15624 -178479 286239 130915 74457 -150278 140417 394503 12177 -233554 73880 266556
15614 266556 90868 -18127 -291004 101243 -78494 -123435 -34939 -609535 -224411 64579 -125948
15602A1739i3385L075B08774d3601m8477L2558B9515b51653d9846L735A20726
15590I8642L09401i6688L4117j54751A09202m4557c79641e5555C72c87j81852
15579a82239j0301e0249E5239O6476C6227c84623g204j70221E6946b72920H3710
15567a73000g0398A69385a41661L5223B0603L8661M416b49224d063C32645A5856
15555A54381b39833L1143e4283o4929A44925F9694N9076J29470b53699A7459b29343
15543a63941I4325D5999a25960A30583P2699m1267j6822b3963C49815b35313A16270
15531G378g2384F4608J25099b56676R2099r4703A31803i9324j68777I4975P8637
15520A73612R3237b63476N6536K6037c5751A18864m5580P2727m4379a23561q0565
$$ plain form
15602 11739 -93385 -90310 208774 -43601 -92078 -59520 29515 -251653 -49846 -46111 120726
15590 98642 408043 -96688 -62571 -217322 109202 64645 -379641 -55555 372 -387 -182239
15579 -182239 -192540 -50249 55239 121715 36227 -384623 -7204 -177425 56946 -272920 83710
15567 -173000 -70398 169385 -141661 -106438 20603 59264 63680 -249224 -4063 332645 15856
15555 154381 -239833 -208690 -54283 -119212 144925 69694 128770 258240 -253699 17459 -229343
15543 -163941 94325 45999 -125960 130583 203282 162015 145193 -23963 349815 -235313 116270
15531 7378 -72384 64608 189707 -256676 -164577 -259280 131803 -99324 -268101 94975 173612
15520 173612 266849 -263476 -206940 -180903 -35751 118864 73284 146011 101632 -123561 -204126
15509b04126h851l08265b3303I5980a96791J592D4522a16446B56685a66649G1091
15497a2966A85132c2498l4345o5383M4454I0983a3418A66106b95234B55559A14105
15485a84598e0475A68932B5453p983a69011J7476B36593k3744F2005A0744d4752
15473d71043f2936j25065D7236I580a36536B05380a95707R5198j92089J7147a1528
15461H8885k2246L3718i4166A51396Q4257a82522F5516l0984b06076G2948k7402
15450D5546R8784o8628J26691q9180l452a56304a6062A82299P511o2967f1894
15438D33542a23122C2226a66183L0176H9466e35427B21658q8224Q2234e6004q1849
15427a37853C3954a11472j09702A51818J08440G4012J06041h4679n1765B08485
$$ plain form
15509 -204126 -8851 -317116 -23303 95980 -196791 -195199 44522 -116446 256685 -166649 71091
15497 -12966 185132 -32498 -66843 -132226 -87772 90983 -13418 166106 -295234 255559 114105
15485 -184598 -50475 168932 25453 17470 -169011 -151535 236593 212849 62005 10744 -44752
15473 -471043 -62936 -188001 47236 9580 -136536 205380 -195707 -100509 -292598 -275451 -11528
15461 88885 66639 100357 -94166 151396 235653 -182522 65516 34532 -206076 72948 45546
15450 45546 144330 75702 202393 113213 109761 -156304 -16062 182299 189810 126843 -61894
15438 433542 -123122 32226 -166183 -136007 89466 -535427 221658 133434 215668 -56004 -137853
15427 -137853 33954 -111472 -221174 151818 260258 74012 180053 -84679 -136444 208485
15416E8304b66418C4801e7230b6990k80602a36395e0370l17232G3559P4248b14115
15404e30948A18036c25430J12066j03338A15648l4900g0392b930G742K25480h6117
15392b3170l72928f9751a3079j28052B03156o749p4753b57150A25614a07237j84933
15381b92170A66081i2340m735A16733b51934H6687i9762C72314a51806C1035a58255
15369b067A03173a44326D97723b66139E4130Q4802D1698b5666j4610r1685B04601
15357a78088B10506a28791A44601A7714g3661j47175c5108J3275B57528h9204
15346B1068K4994J13589d3064j12215o8222p77O7388A26061J58696A6072i3227
15334F0543h570m0430C39210A38661m3829R5243m8694l7579J46301g4884j4045
$$ plain form
15416 58304 -266418 34801 -57230 -26990 -307592 -136395 -50370 -367602 73559 147807 -214115
15404 -530948 118036 -325430 -213364 -316702 115648 80748 -70392 -2930 7742 233222 -86117
15392 -23170 -396098 -69751 -13079 -141131 203156 196407 121654 -257150 125614 -107237 -292170
15381 -292170 166081 -92340 -97075 116733 -251934 86687 -99762 372314 -151806 31035 -158255
15369 -2067 103173 -144326 497723 -266139 54130 138932 41698 -25666 -40276 -131961 204601
15357 -178088 210506 -128791 144601 17714 -73661 -220836 -35108 -21833 257528 -89204
15346 21068 46062 159651 -43064 -155279 -223501 -224278 -156890 126061 284757 16072 -93227
15334 60543 -8570 -49000 339210 138661 94832 190075 141381 103802 250103 -74884 -88929
15323h8929j28703i2914q615F858J16268b84906a24791A62260f1079A17668A4331
15311B00184G1144e0606C13129l0248i5022j01328A06191C7862a10732E6816b61668
15299G5035J19131C7422M9237J6325b07761A12474Q8415l1847a92873I9678D7555
15287A28761a11851B14921a44525k5952E729J47368a05839B17911K3277a21989
15276G0729b9765l1622a5000B48923a57852A40824L4587m0859c70875a5497B05832
15264A6865P7305J25606I1439N7392R2814A708a11314E38277k58094A0630h1922
15252A02028J93517C9360K51354N58057Q89083o97111k33295Q17832o00746B71485
15241i0984k52933B14595b83492B02632D8109b13283B71658b20798C14568D5256
$$ plain form
15323 -88929 -217632 -92914 -101529 6858 123126 -284906 -124791 162260 -61079 117668 14331
15311 200184 71144 -50606 313129 282881 -95022 -196350 106191 37862 -110732 56816 -261668
15299 75035 194166 37422 86659 102984 -207761 112474 200889 169042 -192873 99678 47555
15287 128761 -111851 214921 -144525 -170477 5729 153097 -105839 217911 241188 -121989
15276 70729 -29765 -61387 -15000 248923 -157852 140824 175411 134552 -370875 -15497 205832
15264 16865 94170 219776 91439 148831 241645 1708 -111314 538277 280183 10630 -81922
15252 102028 295545 39360 290714 848771 1737854 1040743 807448 1625280 1024534 271485
15241 -90984 -343917 214595 -283492 202632 48109 -213283 271658 -220798 314568 45256
15230d0805A94716m7061f2340A6657M5156K32251G7811J1804K98012j50979q0697
15219A55951L1810c54486i6012D9133Q7292Q2920H9357K53789b89567A64243a56834
15207D4469c92264E0625a7191H9375O0427Q5847J5169D6633K21207F5536B8471
15195D04583H3614a36967I2512R1414m0337a22171n9637F6136a14733B06556L4484
15184B41040D9629C460i5468A27416b13213A25805o1687c6348A16648L1044J97265
15173C44957G7052K97299j78613A1501d2598C13707b15314B75955e8876B87537
15162i5456C85337j85962A7499N3623k1170R6212a2744j3625k7098q611n7190
15151a19268A73033e840C91154J9155E5601L928J66427j4702c09122a02822E4119
$$ plain form
15230 -40805 194716 147655 -62340 16657 61813 294064 77811 89615 387627 236648 155951
15219 155951 187761 -354486 -96012 49133 136425 219345 89357 343146 -289567 164243 -156834
15207 44469 -392264 50625 -17191 89375 149802 235649 250818 46633 267840 65536 28471
15195 404583 83614 -136967 92512 183926 143589 -122171 -181808 66136 -114733 206556 241040
15184 241040 49629 3460 -95468 127416 -213213 125805 64118 -36348 116648 147692 344957
15173 344957 77052 374351 195738 11501 -42598 313707 -215314 275955 -58876 287537
15162 -95456 385337 199375 17499 71122 49952 146164 -12744 -26369 -53467 -62078 -119268
15151 -119268 173033 -5840 391154 410309 55601 59529 225956 211254 -309122 -102822 54119
15139c268B65542q7367a7629B23507J08070F77c27512d5380B76335O6468O581
15128C49384F7101P9595h178B49986a95186m1798F0823a11828q538A89254J318
15117A90572N3089p8380J75663p9905c4701C34054B0643K30996f4353l7957R841
15106i2469q5776A93537O9929l6916o6259b28213B99531a4792k2535p3460l04705
15095d15492a01424B44289K2959B7328J00016O4366K7432E5586A2773J40479L06500
15084D59752j12741E8265K79288a4599F5610J10737P2118G4935C0083J58617c000
15072C35720j758j48721B7707L24876j58024E9781J20149k4404R853e2893A19735
15060G31567C31993b50490A36634Q4663r5278K38832E9124J96990B810J66386
$$ plain form
15139 -3268 265542 178175 -17629 223507 331577 677 -327512 -45380 276335 342803 349384
15128 349384 67101 146696 -8178 249986 -195186 -236984 60823 -111828 -120366 189254 190572
15117 190572 243661 165281 340944 261039 -34701 334054 20643 251639 -64353 -102310 -92469
15106 -92469 -178245 193537 263466 226550 160291 -228213 299531 -14792 -37327 -110787 -415492
15095 -415492 -101424 244289 267248 27328 127344 191710 219142 55586 12773 153252 459752
15084 459752 347011 58265 337553 -14599 65610 176347 248465 74935 30083 188700 -3000
15072 335720 333962 185241 27707 352583 194559 59781 179930 155526 165379 -52893 119735
15060 731567 331993 -250490 136634 221297 126019 364851 59124 256114 2810 169196
15050A69196H0218A3018K31655g0633B5086g7686m4684e3893A17543Q9274D8797
15038b3907D45503A38014j9151N6427q4175K29908G2619J56444k9594B4691J43809
15027A68500J27865P1426C3402L66050H1259K91083M1302r4081j9902j32358K38574
15016D05877q0889a62839A87218K8696F0700J38358M7184G3874K40979j4026j35070
15005A65757P2151j34J12872A13637D4317j6538M8324K18028p6133O3748L21005
14994F02751B8995R8818a27059A39982N3533P4970R4994R4501a96318D16690j51505
14983B65185j14682L29402H3945h1141C11225J97181b7601B98724l2208N5285
14973C21801i3586E39840B04168E5794A5939J93867J79353j49655f481B37305
$$ plain form
15050 169196 80218 13018 244673 -70633 25086 -77686 -122370 -53893 117543 206817 48797
15038 -23907 445503 138014 118863 175290 91115 321023 72619 229063 199469 24691 168500
15027 168500 296365 367791 33402 399452 81259 372342 413644 319563 299661 167303 405877
15016 405877 324988 -162839 187218 215914 60700 199058 246242 73874 314853 300827 165757
15005 165757 237908 237774 350646 113637 44317 27779 76103 294131 217998 281746 602751
14994 602751 28995 127813 -127059 139982 193515 268485 363479 457980 -196318 416690 265185
14983 265185 150503 479905 83945 -81141 311225 508406 -27601 298724 266516 321801
14973 321801 -93586 539840 204168 55794 15939 209806 389159 239504 -6481 237305
14962C71533j74655J56576j19536K52895A67327n0272d8043B76523g0995I3967
14951A53280M6959a19239I502K49471J14434p3817O7111A77677a71617D76030
14940I1435M9885K63977j93533k2796C3815L10094j65841M67430k64468A17823
14929D05645j52675K37660p5218B1260J59881K36477L8042B14832L5921J33462
14919C84215A09662b52836E92281j71352G0327L28504A09453J04287K07355j12540
14909C08555K8917A58847G3584J67089o7462J65116K043A08520K3109L61037A24920
14897B86728K86633j04003j76656J32812M9598r1159J07979A58940M37270k77174
14887C19036J46445J60084k19588A86976J25434A06272M56159j53664N1959j98547
$$ plain form
14962 371533 196878 353454 233918 486813 167327 117055 -48043 276523 -70995 93967
14951 153280 200239 -119239 9502 258973 373407 299590 366701 177677 -171617 476030
14940 91435 141320 405297 211764 188968 33815 343909 178068 645498 381030 117823
14929 405645 252970 490630 415412 21260 181141 417618 455660 214832 250753 384215
14919 384215 109662 -252836 592281 420929 70327 398831 109453 213740 421095 308555
14909 308555 337472 158847 73584 240673 173211 338327 340370 108520 131629 492666 124920
14897 286728 573361 469358 292702 425514 475112 383953 491932 158940 596210 319036
14887 319036 465481 625565 405977 186976 312410 106272 562431 408767 460726 262179
14877B62179o9703M8259a05920B39332k5478J51951j66312L6383M21032d2159
14866F05725B27661M2797K28174j60126j40131J18334L3108o0290L5921Q8115
14856D13563J56420l6209B18248M295N5350M21809A60840K42418k5858N40242
14846I17642B30779K56260j6462j08525j1682M16238l48376A91039J19219L78107
14836F88365B24642L10721B21717o8114O9224J71247J52319B60443J40625J50356
14826E51424J901k30289a97158D48652k00629L06487J78015k53743j09649J55566
14816E24699B38796J87422J58464R4867j93928k21165K44032k3691n1466J7789
14806D51120O4915O012O4308j33716j10178m807N3854Q9006B02191P602M30704
$$ plain form
14877 262179 192476 240735 -105920 239332 213854 365805 199493 235876 656908 -42159
14866 605725 227661 270458 498632 338506 198375 316709 349817 289527 325448 413563
14856 413563 569983 533774 218248 222543 277893 699702 160840 403258 377400 917642
14846 917642 230779 487039 470577 362052 350370 766608 418232 191039 310258 688365
14836 688365 224642 535363 221717 153603 222827 394074 546393 260443 401068 551424
14826 551424 553325 323036 -197158 448652 248023 554510 732525 478782 369133 524699
14816 524699 238796 426218 584682 679549 485621 264456 508488 484797 433331 451120
14806 451120 516035 522047 586355 452639 342461 337654 391508 480514 202191 209793 640497
14795F40497A78060J89428R4752L45862k95346P4556k47470M0962K57406j5158
14785F23052k49644j7511A56659M90249O5469k27773K2903k13439J83928L91924
14775H69920l31679L48010l85114J8874k47185L75125K13844k27244A41922M91868
14765F33790K15017B83084K90620L8632N589M7178J20729B68264M80158r7027
14755F51395k8687l0561O8465k80289N894K10083J69892k3165k73270K00008n6668
14744F13097r1724o3101R3764J44827K37144k61023j18058r7032J08701j32862
14734D33733M64371j57277n3369M2928o7870j84257J54480o3185Q3509K546k56422
14723C99187L60642k2191R7605J2923o4052Q4475r0878L7467J62253M2476m89088
$$ plain form
14795 640497 178060 367488 462240 808102 512756 587312 339842 380804 638210 623052
14785 623052 373408 355897 156659 646908 712377 484604 507507 294068 477996 869920
14775 869920 538241 886251 501137 520011 272826 647951 861795 634551 141922 633790
14765 633790 848807 283084 573704 612336 617925 665103 785832 268264 748422 651395
14755 651395 622708 592147 660612 380323 386217 596300 766192 743027 469757 669765 613097
14744 613097 521373 458272 552036 696863 934007 672984 554926 457894 566595 433733
14734 433733 898104 740827 687458 730386 662516 478259 632739 569554 653063 655609 399187
14723 399187 759829 737638 835243 848166 784114 868589 777711 815178 977431 1019907 530819
14712E30819L46839j76961N9672l2039j38012K53860k99377K19260J28775k91162
14702F01674L13912l63810k869J00572j06175K10856K60215q1172q5868o0509
14692G86826j03969O5233Q866j07119K8390m8193J51582K12253p679j29448j97649
14681F59093L30948j32195J08562j17132k27001M02027p9952M871j78360K04345
14671I75206j17447q9503J7237J04634J20051q1075k06197N21928m06302L70715
14661A209247l38007N9675L56043j79088k55961K21521M1045k77213J79318J16809
14651A133389o2726m65524N64384k45009j0726O7790J47764L4461J18153j78230
14641A103726j01148K67436l8994j19644P5522r1673J50226k65928M33713o275
$$ plain form
14712 530819 877658 700697 760369 728330 590318 844178 544801 764061 892836 601674
14702 601674 915586 551776 548907 649479 543304 754160 1014375 933203 847335 786826
14692 786826 682857 748090 756956 649837 678227 630034 781616 993869 986190 856742 659093
14681 659093 990041 857846 966408 849276 622275 1024302 944350 949221 770861 975206
14671 975206 857759 768256 785493 890127 1010178 929103 722906 1244834 838532 1209247
14661 1209247 871240 930915 1286958 1107870 851909 1073430 1114475 837262 1016580 1133389
14651 1133389 1070663 605139 1169523 924514 913788 981578 1129342 1163803 1281956 1103726
14641 1103726 1002578 1270014 1231020 1111376 1186898 1095225 1245451 979523 1413236 1406961
14631A406961n61835K78088j27533K95438j29590J1756j14426J05089p5693J89233
14621A277488P9667k73382J35343O063J21264K25043q3472j26471M0497L634J05192
14610A510866k26246K40150j04210K06704n27264M63874k8467K30061m09932J16485
14600A472021j23254j92953M02543k38020Q8491O5195K85525p2437m4937J23873
14590A766047n7102J99600k61238J89225j47844j16641K76404j98157j57078L82672
14580A875888k65464J60961K70587q1903J74228l87594Q9212Q739j71932K64513
14570A937235L10211l1619o1530R3500j37601k1586K75653l9360k90342L73610
14560B408171k85596N54477j67553l2345L68016L24710K33427p3880O17937M65469
$$ plain form
14631 1406961 845126 1123214 995681 1291119 1161529 1173285 1058859 1163948 1088255 1277488
14621 1277488 1357155 1083773 1219116 1225179 1346443 1571486 1488014 1361543 1402040 1405674 1510866
14610 1510866 1284620 1524770 1420560 1627264 1100000 1563874 1535407 1765468 1355536 1472021
14600 1472021 1348767 1155814 1558357 1320337 1408828 1474023 1759548 1687111 1642174 1766047
14590 1766047 1708945 1908545 1647307 1836532 1688688 1572047 1848451 1650294 1493216 1875888
14580 1875888 1610424 1771385 2041972 1960069 2134297 1746703 1835915 1844654 1672722 1937235
14570 1937235 2247446 2215827 2154297 2247797 2110196 2088610 2364263 2324903 2034561 2408171
14560 2408171 2122575 2677052 2509499 2477154 2845170 3169880 3403307 3329427 3947364 4412833
14550D412833J206118J628516L226051P303856J5350731J3402985j9665410I679020
14541C833381j296509r20939K68434m6867r5320j76520R3024K6012J75114J97520
14531B057330P6733j94470K3282j76715K41537R5491K34401n80061K89168J54551
14521B221247j52571Q6413J45599r5939J09054j61470P08487k55985j64480k09312
14511B231043K79266l27349K47388K16713M0728L1078j09728J41341m4147p5921
14501B630412J24803o817n891L75480r4876m3134J4021M0509o2533M1970R9828
14490C113772K15850k35598K27444l0216K38035K7955m03488J74553R8050o5525
14480C360832J57819K87773J00920o99483L15444k8385L03709J51206j49328k5600
$$ plain form
14550 4412833 5618951 7247467 10473518 17777374 33128105 46531090 26865680 9679020
14541 3833381 2536872 1615933 1884367 1837500 1742180 1565660 1658684 1684696 1859810 2057330
14531 2057330 2134063 1939593 1962875 1786160 2027697 2123188 2357589 1777528 2066696 2221247
14521 2221247 2068676 2155089 2300688 2204749 2313803 2152333 2860820 2604835 2440355 2231043
14511 2231043 2510309 2182960 2430348 2647061 2687789 2718867 2609139 2750480 2706333 2630412
14501 2630412 2755215 2748398 2742507 3117987 3023111 2979977 2993998 3034507 2971974 3013944 3113772
14490 3113772 3329622 3094024 3321468 3291252 3529287 3557242 3153754 3328307 3426357 3360832
14480 3360832 3518651 3806424 3907344 3207861 3523305 3494920 3798629 3949835 3800507 3774907
14470C774907L41997l44700L78773n4214Q1545q2509Q5379K3855k30307K71909
14460D246635L60644n89146N80140P5217j93625q4975N8312L80222j40473L98282
14450E091233j60888L9006K43847j96128M2245p2070K53673K31026l27758L54028
14440E498214k81312J85804K63762J66904m9026n854k15845L38568o4603M25534
14430F262146l37090K36650L27705J09614j57431L30059J0961L7854O9043M18333
14420G307844r414k75252J02757J74566J55159J71376J70366L06770p2974K17907
14410H249105k63251K61197K63498K35532j7083J8492J36414l870L74956M21r5205
14399I160206L66818M76136j79454N78627j64061m8330K33232L70952L25536M5368
$$ plain form
14470 3774907 4116904 3772204 4150977 4096763 4178308 4095799 4181178 4205033 3974726 4246635
14460 4246635 4607279 4018133 4598273 4673490 4479865 4394890 4453202 4833424 4692951 5091233
14450 5091233 4930345 4969351 5213198 5017070 5059315 4987245 5240918 5471944 5144186 5498214
14440 5498214 5216902 5402706 5666468 5833372 5784346 5778492 5562647 5901215 5836612 6262146
14430 6262146 5925056 6161706 6489411 6599025 6441594 6771653 6782614 6820468 6889511 7307844
14420 7307844 7298430 7023178 7125935 7300501 7455660 7627036 7797402 8104172 8031198 8249105
14410 8249105 7985854 8247051 8510549 8746081 8728998 8747490 8883904 8880034 9254990 9255411 9160206
14399 9160206 9527024 10003160 9823706 10402333 10238272 10189942 10423174 10794126 11119662 11165030
14389A1165030R0150J46857M53202j21606N8162J92515O94610m158J07232L46330
14379A3128324M83102J52254Q4118L75395N59809P1754O0524Q19971j54104K90350
14369A5871497M56461N78266L45795K77345M5654M63823L86563M42511K75851
14360A9143766N23963M89128M10598M86923L59755N89774R38076M31570K47507
14351B3621060Q21583O39549J91783P46083Q79664O73080Q51330M98451R16793
14342B9839376M20006J073139O20703J112408Q62461Q53277J446862N91449J070497
14333C7890178J566414Q05607J212278J363199J274786J606756J582724R61419
14325D8263361J862806J815360J725054K132396J472732K219156K273316K102010
$$ plain form
14389 11165030 11255180 11402037 11855239 11733633 11791795 11984310 12678920 12674762 12781994 13128324
14379 13128324 13611426 13763680 13847798 14223193 14783002 14854756 14915280 15735251 15581147 15871497
14369 15871497 16327958 16906224 17252019 17529364 17575018 18038841 18425404 18867915 19143766
14360 19143766 19667729 20156857 20567455 21054378 21414133 22003907 22941983 23373553 23621060
14351 23621060 24442643 25082192 25273975 26020058 26899722 27572802 28424132 28922583 29839376
14342 29839376 30259382 31332521 31953224 33065632 33928093 34781370 36228232 36819681 37890178
14333 37890178 39456592 40262199 41474477 42837676 44112462 45719218 47301942 48263361
14325 48263361 50126167 51941527 53666581 55798977 57271709 59490865 61764181 63866191
14317F3866191K593822K622713K617142K822074K855669K952978L620983L198025
14309H7149597M179759L616085M218507L933647N055645M748254N420521N602067
14301A23924082N832869O292246O839256P078881P680444Q208789Q613984R359397
14293A83829948R243843J0417654J0855781J1594934J2351630J2628766J3496026
14286B64418582J4199205J4872554J5105042J5596422J6016585J6279501J6143821
14279C72631712J5799784J5850454J4983877J3933111J2628859R319223N581330
14272D60728350M829467L157121J262208N57788j043101J138510o099262j0206191
14264D54324890j2520610j4233798j5455077j6376957j7001464j7602880j6970868
$$ plain form
14317 63866191 66460013 69082726 71699868 74521942 77377611 80330589 83951572 87149597
14309 87149597 91329356 94945441 99163948 103097595 108153240 112901494 118322015 123924082
14301 123924082 129756951 136049197 142888453 149967334 157647778 165856567 174470551 183829948
14293 183829948 193073791 203491445 214347226 225942160 238293790 250922556 264418582
14286 264418582 278617787 293490341 308595383 324191805 340208390 356487891 372631712
14279 372631712 388431496 404281950 419265827 433198938 445827797 455147020 460728350
14272 460728350 465557817 468714938 469977146 470534934 469491833 470630343 464531081 454324890
14264 454324890 441804280 427570482 412115405 395738448 378736984 361134104 344163236
14257C44163236j7268942j6257416j5562921j4835290j4910146j4122798j3376387
14250B37829336j2823512j1911146j1009585j0421264j0312928r106512q233494
14243A64010895q136316p699896p539657o538321o609584n564647n676159m938322
14235A11307993m908667m973860m499294l880931l486340l876869l653098l591728
14227G8437206k773745k798837l045471k329181k792079k414613k299486j603105
14219E8380689k165002k172448j857547j527448j746087j472964j286376j594426
14211D4558391j315919j557662j231230j224569l39230j373342j359523q36030
14203C5320886q81701r99447j017452n01680q49107j418657o03002p19970n85311
$$ plain form
14257 344163236 326894294 310636878 295073957 280238667 265328521 251205723 237829336
14250 237829336 225005824 213094678 202085093 191663829 181350901 172244389 164010895
14243 164010895 155874579 148174683 140635026 134096705 127487121 121922474 116246315 111307993
14235 111307993 106399326 101425466 96926172 93045241 89558901 85682032 82028934 78437206
14227 78437206 75663461 72864624 69819153 67489972 64697893 62283280 59983794 58380689
14219 58380689 56215687 54043239 52185692 50658244 48912157 47439193 46152817 44558391
14211 44558391 43242472 41684810 40453580 39229011 38889781 37516439 36156916 35320886
14203 35320886 34439185 33439738 32422286 31920606 31071499 29652842 29049840 28329870 27744559
14194B7744559o06571o13037p39413n46230r34139l31468r00850m15310o49688
14185B2007853l93101p62433o8224k17095n77832n77210p39892j49934m73267
14176A8048865n07572j57730k45806m96120k54374l77822J08237q86133J4758
14167A5246303m04253j82287l11895j40334l14219k59600k94559K43180p99903
14158A2782433L7848o27184L7338m97515L02749m26178m28775K14678m47851J08541
14148A1056084j05299j97938k90113k29394n9666l35389J70193k56393m29582
14139I322503j15315o5318l4778p2747k76978k84229J74242l18575k4458k5279
14129H279068l02502l964k57453j17096K32077m53887j45335L707L9956l14211
$$ plain form
14194 27744559 27137988 26524951 25785538 25239308 24305169 23973701 23072851 22657541 22007853
14185 22007853 21614752 20852319 20784095 20567000 19989168 19411958 18672066 18522132 18048865
14176 18048865 17541293 17383563 17137757 16641637 16387263 16009441 16117678 15231545 15246303
14167 15246303 14842050 14659763 14347868 14207534 13893315 13633715 13339156 13582336 12782433
14158 12782433 12820281 12193097 12230435 11732920 12035669 11609491 11180716 11395394 10947543 11056084
14148 11056084 10950785 10752847 10462734 10233340 10173674 9838285 10008478 9752085 9322503
14139 9322503 9207188 9141870 9107092 9034345 8757367 8473138 8647380 8328805 8304347 8279068
14129 8279068 7976566 7972602 7715149 7598053 7830130 7376243 7230908 7234615 7274571 6960360
14119F960360Q1297j30407k00560K27934l88042J28237j67307j04557m6191j17583
14109F243181L02913n26208K1151J77604l91898n02129m0396J78678N8755Q2917
14099E604568q785j37567k59785M5470J83293n8906k86459o2043j58827L8608
14089D899567j10105J22045r1584J12245k2341l79390J25102m22832m4933L84030
14079D571804k46213J29429k3624l56313K2086j6910J03123k07360j54902K25143
14069D046263j29491J35081j24965m10588P2136K72699p5005j75267J98691l59085
14059C450469N31675k77739N9849m20733l0339m0720r449J37082k63238P155J50926
14048C294938k66027K72443o110k62210M0969j75624L79894n02071K82789j81957
$$ plain form
14119 6960360 7041657 6911250 6710690 6938624 6550582 6678819 6511512 6406955 6360764 6243181
14109 6243181 6546094 6019886 6041037 6218641 5826743 5324614 5284218 5462896 5521651 5604568
14099 5604568 5595783 5458216 5198431 5243901 5427194 5368288 5081829 5019786 4860959 4899567
14089 4899567 4789462 4911507 4819923 4932168 4909827 4530437 4655539 4232707 4187774 4571804
14079 4571804 4325591 4455020 4431396 4075083 4097169 4080259 4183382 3976022 3821120 4046263
14069 4046263 3916772 4051853 3926888 3516300 3588436 3861135 3786130 3610863 3809554 3450469
14059 3450469 3982144 3704405 3764254 3343521 3313182 3272462 3263013 3400095 3136857 3144012 3294938
14048 3294938 3028911 3301354 3295244 3033034 3074003 2898379 3278273 2776202 3058991 2877034
14038B877034Q0057K2213q0961j28478Q7119j32693J51377M5655j01240k85351
14028B534732K13261K06431p02715K27180L37803k5195M2939n26250j14456P4950
14018B268680j64321J55588J82941j85306l39808N71507j42183J45722l37760
14009B155060O1341j55295K68808j9482k05829j19664L02284k56870o3267K74642
13999B241728l24422L7617n13759N42582J28288J57896m94459J78497J9743P54447
13989B728158J243362K170101N432105J4241043K0052514j5123585A3757454o545354
13981G212100j897466j530923k95372j8022k86404m81114q4950j57833P5208p7380
13971B457844j49136n8540L4414n0015k19887K57850n22717K05974K21875P4349
$$ plain form
14038 2877034 2957091 2979304 2898343 2769865 2856984 2724291 2875668 2921323 2820083 2534732
14028 2534732 2747993 2954424 2251709 2478889 2816692 2791497 2834436 2308186 2193730 2268680
14018 2268680 2104359 2259947 2442888 2257582 1917774 2489281 2347098 2492820 2155060
14009 2155060 2216401 2061106 2329914 2310432 2104603 1984939 2287223 2030353 1967086 2241728
13999 2241728 1917306 1954923 1441164 1983746 2112034 2269930 1775471 1953968 1973711 2728158
13989 2728158 3971520 6141621 11573726 25814769 45867283 30743698 13757454 7212100
13981 7212100 5314634 3783711 3488339 3470317 3183913 2702799 2617849 2460016 2535224 2457844
13971 2457844 2308708 2250168 2284582 2234567 2014680 2272530 1749813 1955787 2177662 2252011
13961B252011k49616Q7017l73513J03738K8331k31630K70631l15372M57253L3383
13951B062233l84143J92390K35883n13997J63766k2430J18794k54846m05353K56329
13941A448626L0900J14319M3129J95619j99765J94962l83373L01770j05054j48523
13931A492610L85149m72503K4451j89805k99477N81247j5005j83223j46139r7574
13921A079731J85117Q5590J71721k43289N3513J75024j26568J26149l54756P8071
13911A230303N00404k37885J4876l24621L93985n49009L56375l84531K6506P6971
13901A103374J56112L5465p8056K53585l08757K889k8126J46562k15499L30124
13891A397673k82223J92886j57784k41954K62676J51659n04163N29676j32416
$$ plain form
13961 2252011 2002395 2089412 1715899 1819637 1847968 1616338 1886969 1571597 2028850 2062233
13951 2062233 1678090 1870480 2106363 1592366 1756132 1733702 1852496 1597650 1192297 1448626
13941 1448626 1479526 1593845 1636974 1832593 1632828 1827790 1444417 1746187 1641133 1492610
13931 1492610 1877759 1405256 1429707 1239902 940425 1521672 1506667 1323444 1177305 1079731
13921 1079731 1264848 1350438 1522159 1278870 1332383 1507407 1380839 1506988 1152232 1230303
13911 1230303 1730707 1492822 1507698 1183077 1577062 1028053 1384428 999897 1026403 1103374
13901 1103374 1259486 1294951 1216895 1470480 1161723 1164612 1136486 1283048 1067549 1397673
13891 1397673 1115450 1308336 1150552 908598 1171274 1322933 818770 1348446 1216030
13882A216030k06020j53259J10225J12422R4953j29821k98265N41276l01229j09632
13872H76680L26123l61716M5942k50312M02474p3042m37J21133J08814j37660
13862A057999n6189j21991q7960R3239K90016j56549k21852N94737o85581J59847
13852H65716L40476k74524k5092P023K8984N5063j87175L37630k72062j5527J3832
13841H74344L9265l4110l38327K49976K51407k29398L17513k21047J74275J3701
13831A097599j00430L06219k26222k60585L19603m19639K72179k45313P8888B93183
13820A165516n53030K57375J16625C28504K96040K06739N4145J461k69884K63111
13810H80116l21118M40700k68128K464J93256l42650J54180O0936k38473K91849
$$ plain form
13882 1216030 1010010 856751 966976 1079398 1174351 1044530 746265 1287541 986312 876680
13872 876680 1202803 841087 887029 636717 1039191 966149 965712 1086845 1195659 1057999
13862 1057999 1001810 879819 791859 885098 1175114 1018565 796713 1391450 705869 865716
13852 865716 1206192 931668 906576 913599 942583 997646 810471 1148101 876039 860512 874344
13841 874344 913609 879499 541172 791148 1042555 813157 1130670 909623 1083898 1097599
13831 1097599 997169 1303388 1077166 816581 1136184 716545 988724 743411 822299 293183
13820 1165516 612486 869861 986486 328504 624544 831283 885428 886889 617005 880116
13810 880116 558998 999698 731570 734034 927290 584640 738820 799756 561283 853132
13800H53132J86636E09713J69432J8314M9191k9478j23750M52683k45401j05433
13790F95271k22039J44421K51955l62611J98558K09553j51065l6382k3822B97658
13779H04126k43274k15558O63450m05035j41066K57935A61269L69773J47544k5560
13769F53026n1390r4016L18973q2229B31823L11615j46732R3477l492L21901j85701
13758F22891k3425L3482l04231j1695K44145B06219K42124q4684J16585o4802
13748D15442Q1955N2767M01739k31808j92741J95273K8627p7243C00965P7189
13738C78154L89622l62817q7049J92270J4992L1785k23944K28085J91808l34365
13728D18541m5511K97023M6212C32642J73144j88817K57387j25375J2806K14265
$$ plain form
13800 853132 1039768 509713 679145 697459 746650 717172 593422 1046105 800704 695271
13790 695271 473232 617653 869608 506997 705555 915108 764043 727661 703839 297658
13779 804126 560852 345294 1008744 603709 462643 720578 161269 531042 678586 653026
13769 653026 601636 507620 826593 744364 231823 543438 396706 490183 486691 808592 622891
13758 622891 599466 632948 328717 317022 561167 206219 448343 363659 480244 415442
13748 415442 497397 550164 951903 720095 527354 722627 751254 674011 300965 378154
13738 378154 767776 404959 317910 510180 525172 556957 333013 561098 752906 418541
13728 418541 373030 670053 716265 332642 505786 316969 574356 448981 461787 676052
13718F76052E1950N76552k64317J61418M1290j98695K41122J14879k15221J49154
13708F58132j01605L73770D06217m4716N8018A83781M29357j08910L1271k08442
13698C27057A62560L83891B68647L81221B37264L43649j86378m6734J92862k41309
13688B99354K49796k45935K48725J456L5916p3408j92702N1861K3619J83629J62452
13677G44763l0878B59769n7939J64731l5936l0505p6316K89830j64970M76966
13667H25630A79959M09118k62720J96402m4883k787k14929P8713K72233B83999
13656E59190J23576j24544l1594A51388J62490j55605N88360C16795J85206j01346
13646D00655j22660H6076L85579B14482j4371K76084A78443K61546M9823J36909
$$ plain form
13718 676052 51950 628502 364185 525603 566893 368198 609320 724199 508978 658132
13708 658132 556527 930297 406217 361501 419519 183781 613138 504228 535499 327057
13698 327057 162560 546451 268647 649868 237264 580913 394535 347801 540663 299354
13688 299354 549150 303215 551940 553396 589312 515904 323202 375063 398682 582311 744763
13677 744763 713885 259769 201830 366561 330625 300120 223804 513634 348664 825630
13667 825630 179959 589077 326357 522759 477876 475089 260160 338873 611106 283999
13656 559190 682766 558222 526628 151388 313878 158273 746633 316795 502001 400655
13646 400655 277995 86076 471655 214482 200111 476195 178443 439989 489812 626721
13636F26721k92227L2362j77993L29656j18183J45434k57921L54008A19085K54632
13626C73717K98192C20159A15421L46475j39114n8205M4140k6930J47128N3681
13616D82596B00274R5067I3144J95538O6925L7710J06438o0560n6447L6331J8838
13605D37917B06303J45681A55960M56346A61825J10166q1754R2920L72371A32639
13594B08463J1896n4155L85669J754k02651j25636l7977E8248M34703K7903l8804
13583D82050p1042J43238k4582a83950G24055C55968l6256A28155Q1238M2505
13573B51898L6306A03615J86345a35757E0083J91074M77457B25674r0920J07957
13563B42711p9227J13865L096J3336j08777J84983L7255j27672A11277l6547d7381
$$ plain form
13636 626721 334494 366856 188863 518519 400336 545770 287849 641857 119085 373717
13626 373717 671909 320159 115421 461896 322782 264577 308717 281787 428915 482596
13616 482596 200274 295341 93144 288682 355607 393317 499755 439195 382748 419079 437917
13605 437917 206303 351984 155960 612306 161825 271991 190237 283157 655528 132639
13594 208463 220359 166204 551873 553627 350976 225340 187363 58248 492951 520854 482050
13583 482050 411008 554246 529664 -183950 724055 355968 319712 128155 209393 251898
13573 251898 288204 103615 289960 -135757 50083 241157 718614 225674 134754 242711
13563 242711 163484 277349 280445 293781 185004 369987 407242 279570 111277 74730 -47381
13551B69774J14301Q3699h998o3826C02206a52846B69945j19682m9506M59641
13541E60398j30733j38411g3127A98642q9924L69637A88593K24716j86883J94067
13531D20493j09254L65237A47307j25J33374B1375L48465A18897O49638d4056
13520B18828K5625j2358O6623l916j33987Q035B3678J04965M47398A84053G3778
13508I584d4121C26919F1605J76483P6487J04248C3168K13043M2519A6782N01662
13497E18444j24012r5599K8919M7964j9371m2508b8732A66224K61265g1278B14409
13485a8146C79859d1772I5744K24629J02032P217k6718A81018J32130A13071j8130
13474I4941h5116A70088L95640B25582J8137P793A07747J05902M3726j0914F6000
$$ plain form
13551 269774 384075 467774 -8998 -72824 302206 -152846 269945 150263 100757 560398
13541 560398 429665 291254 -73127 198642 108718 478355 188593 413309 226426 420493
13531 420493 311239 676476 147307 147182 280556 21375 369840 118897 768535 -44056
13520 218828 244453 232095 298718 294802 160815 168850 23678 128643 576041 184053 73778
13508 9584 -44121 326919 61605 238088 314575 418823 33168 246211 288730 16782 518444
13497 518444 394432 298833 327752 375716 356345 313837 -28732 166224 427489 -71278 214409
13485 -18146 379859 -41772 95744 320373 422405 429622 402904 181018 313148 113071 94941
13474 94941 -85116 170088 565728 225582 243719 251512 107747 213649 257375 246461 66000
13462h7942C05139Q8311j94582j6437J13776L0841M369q2906D1953J39539D5348
13450B48471o1883n4947j5884J27088K35208D807d38C32100G8390K73720q6522
13439B65588R5603A12415J67030r9933a18305A76808p2865L6835e4919G9714J5912
13428I5626N4130N81176c8693j17190E20833A01337K00104l2168a94813A15935
13417B07963K97780B20338J18115k9730A04096c16332A01784K70999E4824P5302
13407A30126O1951J73467a09808A87316K43931F342g151A66929o208e278A14885
13395a87336C6990K20625o4885R7782j06894h4439A2694L3562J1735A1497K98330
13384C09827G0847L11180a67410B00995D6120H576L70608F5096k4370M8002j2301
$$ plain form
13462 -87942 305139 393450 198868 182431 296207 327048 331417 248511 41953 181492 45348
13450 248471 186588 131641 115757 242845 478053 4807 -438 332100 78390 352110 265588
13439 265588 361191 112415 279445 179512 -118305 176808 103943 140778 -54919 79714 95626
13428 95626 149756 730932 -38693 -155883 520833 101337 301441 269273 -194813 115935
13417 207963 505743 220338 338453 308723 104096 -316332 101784 372783 54824 130126
13407 130126 192077 365544 -109808 187316 431247 6342 -7151 166929 160721 -5278 114885
13395 -187336 36990 257615 192730 290512 183618 -84439 12694 46256 57991 11497 309827
13384 309827 70847 382027 -167410 200995 46120 8576 379184 65096 40726 88728 76427
13373G6427P1948j990R1762A11882K14404N7757J74776k49532H2075a76754F2248
13361F6950j0860N4459D1047h1558J8069C94232h7642d2549B89255j4914q0892
13350A93449n9471D4166K43757J58807a000F00353B91804E4757j3208P26142c6915
13338C42849K5871Q8678r3364n0803j20529K88680f1176b9237D7565K3042J79838
13327B50445c1983l29426A35333J80278M3812j09434j03347j4408J0036K6428
13317A68698J7894C7484L62690A51371P6726a4380H6523e0811E82245b8029B37509
13305A27702M7989d4262b437B0743M11968c1344C3609a48576G0111a92172A33163
13293a41752C91148E9475N32845B5144R4725l2468J08006h039E0925J06687b69968
$$ plain form
13373 76427 148375 146385 238147 111882 326286 384043 558819 309287 82075 -176754 62248
13361 66950 56090 110549 41047 -81558 -63489 394232 -87642 -42549 289255 274341 193449
13350 193449 133978 44166 287923 446730 -1000 600353 291804 54757 41549 767691 -36915
13338 342849 368720 457398 364034 313231 192702 481382 -61176 -29237 47565 70607 250445
13327 250445 -31983 -361409 135333 315611 359423 249989 146642 132234 142270 168698
13317 168698 186592 37484 400174 151371 228097 -14380 86523 -50811 582245 -28029 237509
13305 127702 175691 -44262 -2437 20743 432711 -31344 33609 -148576 70111 -192172 133163
13293 -141752 391148 59475 592320 25144 119869 87401 195407 -8039 50925 157612 -269968
13281A84096f1525B47240J73403a25945r6928A40407j2380E157g1655C3L39527
13270C39560b46144A02540K33383j05010b65678e687B31298a33199A72295d44161
13259b0753B90228i4187A86783p5963b58780C45155j55708K23954E4249A2224
13248i1101b8695B01344J24769A07768J43706J7694f52F6787M7466m5679d07973
13236B28258J21435D3217a28223j9233E2141J80313p3212i165B73542A33838J61181
13225B95019j22244J5020M9937j11922J55877O1081j11072D8910J45728a25472
13214B18605k9168b1027q8423C8043B215K87649q4091I7086J57398j22456J07704
13203B39732J58766H9293J81627B6737J73757J96029q9115a30349B32219b29952
$$ plain form
13281 184096 -61525 247240 420643 -125945 -222873 140407 128027 5157 -71655 33 339560
13270 339560 -246144 102540 335923 230913 -265678 -5687 231298 -133199 172295 -444161
13259 -20753 290228 -94187 186783 110820 -258780 345155 189447 413401 54249 12224
13248 -91101 -28695 201344 326113 107768 251474 269168 -652 66787 114253 68574 -407973
13236 228258 349693 43217 -128223 -147456 52141 232454 159242 -9165 273542 133838 295019
13225 295019 172775 187795 237732 125810 281687 342768 231696 48910 194638 -125472
13214 218605 189437 -21027 -109450 38043 2215 289864 205773 97086 254484 132028 239732
13203 239732 398498 89293 270920 26737 200494 396523 307408 -130349 232219 -229952
13192g6512F36214e8549E4356B5846J99143c8413C06305J09365O5835B11680k5746
13181A85934F2326a47175A8275e5318j03973D2758a50401b913E3771f2655A64651
13169d0312B21915b22419P6800j77411A34839D1912a7284H4547K40050r6058k3973
13158B04566E5476Q6449D8672J56848f4614J4171a0194A45541B0610J40008a19362
13146B61288a1500A43468E1370K95282c29343A12565b7233C2727r249i1872A15149
13134c1137F4071c51727a21620G7162A4686L03846A09593h5398B15141a48125
13123B9602K33652n3720p6429j9736d0020B17247F2835a00246i351D76025a1859
13111a5991N116A59375C9187J27282d4214B68152c25545A75807q2126K11652h6752
$$ plain form
13192 -76512 636214 -58549 54356 25846 224989 -38413 306305 415670 481505 211680 185934
13181 185934 62326 -147175 18275 -55318 -159291 42758 -150401 -2913 53771 -62655 164651
13169 -40312 221915 -222419 -145619 -323030 134839 41912 -17284 84547 324597 228539 204566
13158 204566 55476 141925 48672 205520 -64614 -50443 -10194 145541 20610 160618 -119362
13146 261288 -11500 143468 51370 346652 -329343 112565 -27233 32727 23478 -91872 115149
13134 -31137 64071 -351727 -121620 77162 14686 318532 109593 -85398 215141 -148125
13123 29602 263254 209534 133105 113369 -40020 217247 62835 -100246 -9351 476025 -11859
13111 -15991 -10875 159375 39187 166469 -44214 268152 -325545 175807 93681 305333 -86752
13099c9276p2368D52388H8880a87950b5238A40301b68849J16932A8666i7775H3779
13087h5515a2645l19585C10256D316F09R4237a32742B17574M0519r6300K6857
13076A88650o4165C6109K09646j16353m6329i868D34731a46367L1964c8148D8012
13064D5385O0057C6905e6699n9922F9699C1592K3435a76404B10917b08396A33627
13052B04494D2660M2314O2996e8703l67974G5470K99265k5290a03044D37573b56079
13040g1073D3352N9436f0401K4660B09576b6935j01759C37407B6958e3779j405
13029e5184C00153A20547b07254f4036B62061j28445n5828J37910J15119l9014
13019B91803K52552B00051I7742D669b623B4062L97722j62287m614a4343D4721
$$ plain form
13099 -39276 -111644 452388 88880 -187950 -25238 140301 -268849 -151917 18666 -97775 83779
13087 -85515 -12645 -332230 310256 4316 609 94846 -132742 217574 258093 161793 188650
13076 188650 124485 36109 245755 129402 83073 -9868 434731 -146367 -114403 -38148 48012
13064 45385 105442 36905 -56699 -116621 69699 31592 55027 -176404 210917 -208396 133627
13052 204494 42660 84974 147970 -58703 -426677 75470 374735 349445 -103044 437573 -256079
13040 -71073 43352 102788 -60401 -35741 209576 -26935 -128694 337407 26958 -53779 -55184
13029 -55184 300153 120547 -207254 -64036 262061 133616 77788 215698 330817 291803
13019 291803 544355 200051 97742 4669 -2623 24062 421784 259497 254883 -14343 44721
13007E616a95423b390B31887C7677a70640H6352L32706b9958k3902C45905F8551
12995I7480k6457Q630b97617C03519a804A40900f5020C4389J27566B0499K60230
12984B80729G3907a78427Q4606A32544b15173R0387E233b27680g9153D33776a48728
12972B25724b60103K3413A26578J24363H7710R3610O2005H9980J45797n3885p777
12961A74115L0312L4534D725J4403c14606J28666c5372j49905D70744h9519B69493
12949a85843B27929B7479O8568J93573j30122L3830G1545F956d27044A32769J60585
12938B93354c4345D6294N7199a59590A41309c06842M9933B2717a18450A47691
12927H8384L9274J6050a16434j53288c5040k2649k72772B45699L4779A39006J97126
$$ plain form
13007 5616 -195423 -2390 231887 37677 -170640 86352 419058 -29958 -53860 345905 68551
12995 97480 71023 79653 -297617 303519 -1804 140900 -65020 34389 161955 20499 280729
12984 280729 73907 -178427 -93821 132544 -215173 -124786 5233 -227680 -79153 433776 -148728
12972 225724 -260103 -236690 126578 250941 87710 181320 243325 89980 235777 181892 174115
12961 174115 204427 238961 4725 19128 -314606 -185940 -35372 -185277 470744 -89519 269493
12949 -185843 227929 27479 96047 289620 159498 193328 71545 6956 -427044 132769 293354
12938 293354 -34345 46294 103493 -159590 141309 -306842 -256909 22717 -118450 147691
12927 88384 127658 143708 -116434 -269722 -35040 -57689 -330461 245699 280478 139006 336132
12916C36132o0666f4498A87102a84898A45726o6781R089d30778a79653I467Q9457
12905I8924c8587A50377a61023f676A17269N604f8754A56593b7025A56913j6393
12894A40520a10629A13371P352Q6656j5354B2347O4845O4247a55845A96260r274
12883A86986a50560B64593e8751m0618B6419a42712A03315P8669C5434b2258A61173
12871a68911C279J7975J40744c43796A6523R1465a10994b8402j01623E0537a13211
12859E8605e8420H9039L7107J97118j36257a39693k592D3895J4991K07401a3388
12847A28185c72249C37581a20368G7590N9676c35637d9338D04716b03709c4850
12836a70609B07917a92345C40194a14059A93130k8157E340R8304J45937a55025
$$ plain form
12916 336132 275466 -64498 187102 -184898 145726 78945 88034 -430778 -179653 9467 98924
12905 98924 -38587 150377 -161023 -6676 117269 122873 -68754 156593 -27025 156913 140520
12894 140520 -110629 113371 120723 207379 192025 22347 87192 151439 -155845 196260 186986
12883 186986 -150560 264593 -58751 -99369 26419 -142712 103315 181984 35434 -22258 161173
12871 -168911 3279 21254 161998 -343796 16523 107988 -110994 -28402 -130025 50537 -113211
12859 58605 -58420 89039 126146 323264 187007 -139693 -142285 43895 58886 266287 -13388
12847 128185 -372249 337581 -120368 77590 137266 -335637 -49338 404716 -203709 -34850
12836 -170609 207917 -192345 340194 -114059 193130 164973 5340 103644 249581 -155025
12825C36760j59624D5022J43870b22131d6941j08262A82708G7057b08225l1145
12815b39370P6963A64682J35494g5965a3034B21566H9658L3378O133a13096c875
12803a90746A41503a77309B49713j704n7833d30203b11254j41926J62147E2093
12792b47267A74237F9046a4135r5112B57694a40402A80218H0439Q4494L1806e3924
12780a38007f7884A20933k8457a70936D8504a74427B82120a87957E6888c4250
12769A59700a6692H3048C6267G480c01051E9520D698f1482G0794a43661j7719
12758a61380D00481j95230b18732E0310c39409d1119k27714e0323l2063B02488
12747b34999J10982B2239e0324A46483j7242o3107J57415e4223a7417B39396a32565
$$ plain form
12825 336760 177136 45022 188892 -222131 -46941 -155203 182708 77057 -208225 -239370
12815 -239370 -162407 164682 300176 -75965 -13034 221566 89658 123036 129169 -113096 -3875
12803 -190746 141503 -177309 249713 248009 190176 -430203 -211254 -353180 -191033 52093
12792 -247267 174237 69046 -14135 -109247 257694 -140402 180218 80439 164933 196739 -53924
12780 -138007 -67884 120933 92476 -170936 48504 -174427 282120 -187957 56888 -34250
12769 159700 -16692 83048 36267 7480 -301051 59520 4698 -61482 70794 -143661 -161380
12758 -161380 400481 205251 -218732 50310 -339409 -41119 -268833 -50323 -82386 202488
12747 -234999 -124017 22239 -50324 146483 129241 66134 223549 -54223 -17417 239396 -132565
12735i9700D40457H347i3692C7720a73023A62523R8065a00371b7565k97556a11174
12723C71513A19905C8503a65806c4497A44199b25026c9629A6307J42120c5161
12712a24001c4138E0005R2788J15602i4615l5920C46200i1922q9406F82216G9793
12700C9843K67846a12918A42748a08743o6530A20098Q7735o9125m5468b06296
12689G5395c9469A08757a95237R230f5369q7331C12849a53840D4154M9626B8957
12677c1995B41330q1009a4441B2526L35053d0379k8271A3134b76119g481j11566
12666a19047M0294A12397n0662C0238a780A05238n2158J53349p7438B8418n668
12655B2750L23728j10073r9659b44648B87594m1953d3728j88082A95156B2033
$$ plain form
12735 -99700 440457 8347 -93692 37720 -173023 162523 260588 -100371 -27565 -325121 -111174
12723 371513 119905 38503 -165806 -34497 144199 -225026 -39629 16307 158427 -35161
12712 -124001 -34138 50005 142793 258395 -94615 -130535 346200 -91922 -181328 682216 79793
12700 39843 307689 -112918 142748 -108743 -175273 120098 207833 138708 93240 -206296
12689 75395 -39469 108757 -195237 -186007 -65369 -152700 312849 -153840 44154 93780 28957
12677 -31995 241330 160321 -14441 22526 357579 -40379 -68650 13134 -276119 -7481 -119047
12666 -119047 -78753 112397 61735 30238 -1780 105238 53080 206429 128991 28418 22750
12655 22750 346478 236405 136746 -244648 287594 245641 -43728 -231810 195156 22033
12644C43739b9294B17738a1852B36537I0117e6853A37145a49653b5992j3145G5150
12632B88069I9929K01402r7340K42861A87493R6146K3672A17508M7210J61398
12622C26116A06059M1935j1790J20250b18368A54933g1234m33276b18120c5718
12611A18823k5332J09006q722K8129j08298i1784r6169R0145j65078A706K01141
12600B02847J48899A1015R6475L33898a10260A37060D7160J46595a27860n9912
12590a87772C22990C6304b00623B95817g5972C1066a96732O468B92357j13868
12580A78489C4725c1558A26026o1653e3556o1732j98960H8086d35512I1770i2924
12568I272Q5423c10527A8196a20358I8266P9814F4246J09069J06356A28166b2481
$$ plain form
12644 343739 -29294 217738 -11852 236537 90117 -56853 137145 -149653 -25992 -39137 75150
12632 288069 99929 301331 203991 446852 187493 283639 307311 117508 164718 326116
12622 326116 106059 147994 136204 256454 -218368 154933 -71234 -504510 -218120 -35718
12611 118823 93491 202497 193775 221904 113606 -91784 -187953 -97808 -262886 1706 202847
12600 202847 351746 11015 107490 441388 -110260 137060 47160 193755 -127860 -187772
12590 -187772 322990 36304 -200623 295817 -75972 31066 -196732 -190264 292357 178489
12580 178489 34725 -31558 126026 64373 -53556 -115288 -314248 88086 -435512 91770 -92924
12568 9272 94695 -310527 18196 -120358 98266 178080 64246 173315 279671 128166 -22481
12556a1797A9805a91056G8127R5050b95608D9879J49409D5969a19962q7781c9650
12544D1074h8703I7735a20245A6423b60465a24480j56374c8553A15360K00646
12534C16006C7632a39067K2265M6586a1990A4082R9437h2296l10127A06143b38525
12522a56844k8333F8017a12173C58470G6145l1235r507J45716J20836g1617k0926
12511i2543A42927F3952M6197e4541I1903b39543B37236b9867k0513B03399a54664
12499g1902n67K4405D8507L13890b36295m3148C27370a87104P1277A89451m482
12488A84969b16116h6534E4357b7375j74854N8391E4662a4481k07997B30466C2149
12476D5857j6710D594b74872G5634g540c324A31149i0283o8397K9650A37973a14636
$$ plain form
12556 -11797 19805 -191056 78127 173177 -295608 49879 199288 45969 -119962 -207743 -39650
12544 41074 -88703 97735 -120245 16423 -260465 -124480 -280854 -38553 115360 316006
12534 316006 37632 -139067 -116802 -70216 -11990 14082 113519 -82296 -392423 106143 -238525
12522 -156844 -185177 68017 -112173 358470 76145 44910 35403 181119 301955 -71617 -92543
12511 -92543 142927 63952 110149 -54541 91903 -239543 237236 -29867 -50380 203399 -154664
12499 -71902 -72469 -48064 48507 362397 -236295 -279443 327370 -187104 -115827 189451 184969
12488 184969 -216116 -86534 54357 -27375 -202229 -143838 54662 -14481 -222478 230466 32149
12476 45857 29147 4594 -274872 75634 -7540 -3324 131149 -90283 -158680 -129030 137973 -114636
12463e1281n3427A44299J41433G7118O6200a44475B7179L5337L04275j79161a14744
12451h4053k1130k317G6289P0513c41828E2142a53295O1543A2233a99616A02962
12439A8547K01616J25785A69828f8322k9654d6948n2680A54516f6216A83276f7228
12427D3646K34489g7664q1217g0044c3790n9807d857A62503a75746B47757I2593
12415I5316g7096J3544I9439J06232a78970A92078l0696E2020M47048a7411r6745
12404a14156F8622a38866k69903E7138J62700A3907f6595G3525c19267B34508
12393a6902k57037b1129m3901k04297B54726F0305A3191i1522p5917B93817a0190
12381D30398g1417A18812j2385a58967c2201B00310p1420a81236J1630E1698K95563
$$ plain form
12463 -51281 -104708 144299 285732 77118 143318 -144475 27179 62516 366791 187630 -114744
12451 -84053 -105183 -107500 76289 146802 -341828 52142 -153295 -91752 12233 -199616 102962
12439 18547 220163 345948 169828 -68322 -97976 -46948 -99628 154516 -66216 183276 -67228
12427 43646 278135 -77664 -158881 -70044 -33790 -93597 -4857 162503 -175746 247757 92593
12415 95316 -77096 -63552 99439 205671 -178970 192078 161382 52020 499068 -17411 -114156
12404 -114156 68622 -138866 -408769 57138 219838 13907 -66595 73525 -319267 234508
12393 -16902 -273939 -21129 -65030 -269327 254726 60305 13191 -91522 -167439 293817 -10190
12381 430398 -71417 118812 106427 -158967 -32201 200310 128890 -181236 -169606 51698 347261
12370C47261e4372I968a01748n8578F0968J30450b67035B42127a90851J7383j19843
12359b93311a35546e6418B20294a05303k07666e4913A27441d2867r8436A06690
12348a0296B53631a14155I1558d9828B5073b40615e088a768B56245e3540B86006
12336a33966A70660d7687j99035J02461A5035c09561c0570A55045i8480C2600
12325C6268i8249J2973j23472F4047A3341d83128B25935G9778j0092J0381j2594
12314F7473L6433J6901g8916q3118A13298c01175J48439D9827R5710K06924c823
12302A87401D3179i5074j15153A05251A5267K61852d4286A25832e1129D02788
12291E4992d5011n8480D4410f6669B54243G2090a94106J1527G2706b2318j82419
$$ plain form
12370 347261 -54372 9968 -101748 -160326 60968 191418 -267035 242127 -190851 -173468 -293311
12359 -293311 -135546 -56418 220294 -105303 -312969 -54913 127441 -42867 -141303 106690
12348 -10296 253631 -114155 91558 -49828 25073 -240615 -5088 -1768 256245 -53540 286006
12336 -133966 170660 -47687 -246722 -144261 15035 -309561 -30570 155045 -98480 32600
12325 36268 -98249 -85276 -208748 64047 13341 -483128 225935 79778 69686 80067 67473
12314 67473 103906 120807 -78916 -162034 113298 -301175 -152736 49827 145537 352461 -3823
12302 187401 43179 -95074 -210227 105251 15267 277119 -44286 125832 -51129 402788
12291 54992 -45011 -103491 44410 -66669 254243 72090 -194106 -182579 72706 -22318 -204737
12280b04737A1800M0469K30674p4730a39906A1820J59723o0659k5087J73874A04633
12268A52373B8804J64855a44024F2885b0673B61998g7698L2093k92981C01476
12257e3256A58738D7347a30046L8076B64573C3025J28045N39733A59656Q700M8835
12246B17191J9155E1680Q3605l7248K3437J21053c5820B56433a18355C8548j7541
12235B1007O2794K7602l2511K78914c7879B3294g6603A17053f4461A1699J75503
12224A87202K2081J71233h8071C92895j10097a7700l1398D04270B02060j00325
12214A01735f2708C49237b01175A09954J36819J44872j08548g2466B07654o1018
12204A46636J10709h6189C96898I022L02569A02919K93471p3673K57567F3694
$$ plain form
12280 -204737 11800 52269 282943 208213 -139906 11820 171543 110884 85797 259671 104633
12268 152373 28804 193659 -144024 62885 -20673 261998 -77698 -45605 -338586 301476
12257 -53256 158738 47347 -130046 -91970 264573 33025 161070 700803 159656 168356 217191
12246 217191 236346 51680 135285 98037 121474 242527 -35820 256433 -118355 38548 21007
12235 21007 83801 111403 78892 357806 -37879 23294 -76603 117053 -64461 11699 187202
12224 187202 209283 380516 -88071 392895 282798 -17700 -49098 404270 202060 101735
12214 101735 -62708 349237 -201175 109954 246773 391645 283097 -72466 207654 146636
12204 146636 257345 -86189 396898 9022 311591 102919 396390 322717 580284 63694
12193D62660A79104a908D7419a36692L2291A25803a9470j45190F1104J60899a60539
12181C53796A20755m1025a45430E24201B40281G2130c6857A02311M9939a90069
12170D6228K26501H5334A4251R5378K15738j58916d76229C14216e6737r5214A11847
12158B13916I9608J34404b76440A38758l529j7680D791J69265R9136b9429C17951
12146a9632j79396R3417L2681k44161a4834m1480A18287J77821j47987K18375
12136C66496D5277a406D3677J6155a18532D8580N273M4945J28801F3722r11R990
12124G2801a76545J571I9682j8663f3864a0916k00085B14995b958j61782j5165
12113a79905Q2528K6181C16000c07396C3939b61628J02133o8991j64377A06585
$$ plain form
12193 462660 179104 -1908 47419 -136692 -104401 125803 -19470 -164660 61104 222003 -160539
12181 353796 120755 79730 -145430 524201 240281 72130 -36857 102311 152250 -190069
12170 46228 272729 85334 14251 109629 325367 166451 -476229 314216 -56737 -151951 111847
12158 213916 99608 234012 -276440 138758 135229 117549 4791 174056 273192 -29429 317951
12146 -19632 -199028 -105611 -72930 -317091 -14834 -56314 118287 296108 148121 366496
12136 366496 45277 -1406 43677 59832 -118532 48580 53853 98798 227599 63722 62811 72801
12124 72801 -176545 -174974 99682 81019 -63864 -10916 -211001 214995 -2958 -164740 -179905
12113 -179905 -97377 -71196 316000 -307396 33939 -261628 -159495 -228486 -392863 106585
12102i2972n4369b7002k31974A20997b17726i6949H0526j5347J39215b47224N8041
12091a89183k5582d4443j68855h7235l2966C02813b70504E6892J17882c90687
12080A2607L82793G8022j3860K31254L94719O62756J18503D17832o982A81772
12069c5227C8682L9462J97656a54430A48044L5800O1601a00250E9600K65301F5150
12057a47150j24893E1080O6606J09583o8248D7820J63227H9283b17781A55247
12046A5272b85293A87462a59773O8911c1072Q226A88034b07338B65522e3283A73764
12034E7874B7481L36095a53946A08585D0531a18597F0107b01901b7079j60187
12024a87266N1884K650k87768A63977J77049b04696a0376j72622M9289f2165n8113
$$ plain form
12102 -92972 -147341 -27002 -258976 120997 -217726 -96949 80526 65179 204394 -247224 -189183
12091 -189183 -214765 -44443 -213298 -87235 -120201 302813 -270504 56892 174774 -390687
12080 12607 395400 78022 64162 295416 690135 1352891 1471394 417832 410850 181772
12069 -35227 38682 78144 275800 -154430 148044 183844 245445 -100250 59600 324901 65150
12057 -147150 -272043 51080 117686 227269 159021 47820 211047 89283 -217781 155247
12046 15272 -285293 187462 -159773 -90862 -31072 -22846 188034 -207338 265522 -53283 173764
12034 57874 27481 363576 -153946 108585 40531 -118597 60107 -201901 -27079 -187266
12024 -187266 -135382 -132732 -420500 163977 341026 -204696 -10376 -182998 -133709 -62165 -120278
12013a20278C0634r499e2739b2418A35625a40013M0191c3457A2174J24543g1324
12001b85475J42083j480c7959j6515B35576e5670E31i6807k48892a01590C59168
11989A11018i6325b6374J26l9768A89449R092g2567E1439c0612E9N699J7518a1125
11975A67689K28150e0480m4999F3818a23153A47587a29829C46524b8576q1972
11965a10548c4967I0994K15772c14160A95580b63748a24249l2780e0219j344j45462
11954a97025f8238k55195C74218F3615c2726o1780E7796h4142A9448b84645C4802
11942D42451j44834h2836j81681F3615a42007B55840A9827b67922a4211B09796
11931a75550B00100q8042a03348A96511A9556a91140B16338a75934R022E4326
$$ plain form
12013 -120278 30634 21135 -52739 -22418 135625 -140013 -99822 -33457 12174 136717 -71324
12001 -285475 -143392 -144872 -37959 -54474 235576 -55670 531 -96807 -345699 -101590 359168
11989 111018 -96325 -26374 -26248 -66016 189449 198541 -72567 51439 -30612 59 5758 23276 -11125
11975 167689 395839 -50480 -95479 63818 -123153 147587 -129829 346524 -28576 -110548
11965 -110548 -34967 90994 306766 -314160 195580 -263748 -124249 -157029 -50219 -51563 -197025
11954 -197025 -68238 -323433 374218 63615 -32726 -94506 57796 -84142 19448 -284645 34802
11942 442451 297617 -82836 -264517 63615 -142007 255840 19827 -267922 -14211 209796
11931 -175550 200100 112058 -103348 196511 19556 -191140 216338 -175934 -166912 54326
11920A21719b63137E5865B0854b20463b147l71211a47277D127b35256a9184k4188
11909d3372j05272o8362C01364G5253j1382b05480j12883a7195A4088K20372A1373
11897b80266o9131f8256j68667h9425a3101j46665g4726k85925C3810c77592H8989
11885e0640e91k09217q6996b9959k98167c0801D8777g2291A62352b44319I1280
11873b55367a6506A53844P7064f6562J8699j94665a04708B52875F467a77781q8745
11862b66526j51404a65798B6701Q1929d3446B27487l4346c56712N4998J5670b7729
11850a10380k16116A31701b37999G3629f2859k02867B0369D82L13734c58744L6395
11839c22349J12635N6913j50104M5730i259E2386J73566a69786a8096G4192J58454
$$ plain form
11920 121719 -263137 55865 20854 -220463 -2147 -373358 -147277 4127 -235256 -19184 -43372
11909 -43372 -148644 -217006 301364 75253 63871 -205480 -318363 -17195 14088 234460 11373
11897 -280266 -349397 -68256 -236923 -89425 -13101 -159766 -74726 -360651 33810 -377592 88989
11885 -50640 -591 -209808 -296804 -29959 -328126 -30801 48777 -72291 162352 -244319 91280
11873 -255367 -16506 153844 230908 -66562 -47863 -242528 -104708 252875 6467 -177781 -266526
11862 -266526 -417930 -165798 26701 108630 -43446 227487 193141 -356712 -301714 -286044 -27729
11850 -110380 -326496 131701 -237999 73629 -62859 -265726 20369 482 314216 -358744 -322349
11839 -322349 -209714 -152801 -302905 -257175 -9259 52386 225952 -169786 -18096 74192 232646
11828B32646H2714a1660q4661b8586k28316p9301M0952a39032e4328C84609d2099
11816b2202m239A60484a17251J4155C74038c91793d2713r7752f9368C4586c4184
11804a07509j38342a7024o9298k2209k27840j31061B56762D5616d65246a12473
11793a08718D7678j8102E531J49475b60875A0089J93259a05946A9543J2694b20620
11781b57413I9076a10474A95753b31929D8194i8451a4785l62048A5809d4168j57628
11770b01796f5056j9218B60717g9845I5998a20808A34099J5786Q1424a5986m504
11759b0490A17724i5919K6451j55250A28286a54056a0437B27938C2498E793d06203
11747a49912A46725m4534a06077k23990F6448M3497C021J03448h9552k29414a35873
$$ plain form
11828 232646 82714 -11660 -96321 -28586 -256902 -336203 -295251 -139032 -54328 384609 -42099
11816 -22202 -26441 160484 -117251 -103096 374038 -391793 -42713 -140465 -69368 34586 -34184
11804 -107509 -245851 -17024 -86322 -108531 -336371 -467432 256762 45616 -465246 -112473
11793 -108718 47678 29576 5531 155006 -260875 10089 203348 -105946 19543 32237 -220620
11781 -257413 99076 -110474 195753 -231929 48194 -98451 -14785 -376833 15809 -44168 -201796
11770 -201796 -65056 -84274 260717 -79845 95998 -120808 134099 149885 231309 -15986 -20490
11759 -20490 117724 -95919 -69468 -224718 128286 -154056 -10437 227938 32498 5793 -406203
11747 -149912 146725 102191 -106077 -330067 66448 109945 3021 106469 -89552 -318966 -135873
11735B01441K1047J44140G3946k2886N3015a58867A31270Q1216b5892q4231d480
11723B4163a15453D50902b6153r3623G4675b43108B51759A0217a02189K1526H3333
11711a87364E3277g6603b4079A06853a62787A30697o2988P8609j5834k3090N71
11700A07965L56262A37862K50451H2266l3504a11562a1056A94326B9767K54034
11690B83801A10627a58457C06710b2520d613l495A74643B5166g3783C51969A74088
11678c01763A15130R085N7096K7172e5209B02446c13301a24169J8732k14775A37316
11666A59684N5588m7457c3266r6881c7171E0924O2328a14148c6388H4148a54460
11654C0576d0032k59137h5895j63773A2898d9783B23934I4578a27317o0984A47842
$$ plain form
11735 201441 222488 366628 73946 51060 104075 -158867 131270 212486 -25892 -110123 -4480
11723 24163 -115453 450902 -26153 -119776 74675 -243108 251759 10217 -102189 -80663 83333
11711 -187364 53277 -76603 -24079 106853 -162787 130697 67709 146318 130484 107394 107965
11700 107965 464227 137862 388313 82266 48762 -111562 -11056 194326 29767 283801
11690 283801 110627 -158457 306710 -22520 -4613 -8108 174643 25166 -73783 351969 174088
11678 -301763 115130 124215 181311 208483 -55209 202446 -313301 -124169 -105437 -320212 137316
11666 159684 215272 167815 -33266 -130147 -37171 50924 113252 -114148 -36388 84148 -154460
11654 30576 -40032 -299169 -85895 -249668 12898 -49783 223934 94578 -127317 -188301 147842
11642c24264J42963g8729o7984A75593F100i6262J5252j93473A56173E7952i3845
11630i5719B82881c59104A65155a75494M737O3386j2783C8291a88042I2911a48270
11618A80776d1776j31031B76998D6102c1655I1964e8181A509a63280A26094m0776
11607H5318A9125N27105b16606d5750B8157a07059b4413j75958I6082J62133F5390
11595D2211a4571B40802G2829J1426a29302j6498I1276J0686f7637A24359J4363
11584A38722A7890e2217A26228B7381a35035a6035C79566F2670L33882a40549
11573I5050f083l2781B36227c14219B46166c81560B28053b37442B23387F6028
11562A19513L17595c2937j2308C0898b0640A72386b52641f5973k64903A4172K2857
$$ plain form
11642 -324264 -181301 -78729 -146713 175593 6100 -96262 -81010 -274483 156173 57952 -93845
11630 -95719 282881 -359104 165155 -175494 -170757 -107371 -120154 38291 -188042 92911 -148270
11618 180776 -41776 -172807 276998 46102 -31655 91964 -58181 1509 -163280 126094 85318
11607 85318 19125 546230 -216606 -45750 28157 -107059 -24413 -200371 96082 258215 65390
11595 42211 -14571 240802 72829 84255 -129302 -145800 91276 101962 -67637 124359 138722
11584 138722 17890 -52217 126228 27381 -135035 -16035 379566 62670 396552 -140549
11573 95050 -6083 -38864 236227 -314219 246166 -381560 228053 -237442 223387 66028
11562 119513 437108 -32937 -45245 30898 -20640 172386 -252641 -65973 -330876 14172 37029
11551C7029a1141B05406a48191k1039C13001n9829b85312I2999m0931K18612a02715
11539A05117c1501l37162A55263a46404G1644J23610M4041E8253g1554n682j70117
11528b47353A45437F9547K2256L0773j7139J67302a02182A75136o290o0592A4504
11516A61485j2525a14131D2860J43800J01o338D2911K68921A38867a01545I3552
11504I3416g4177b6243A5615f7188A90293e4271A26292g6235K3281A34948a24324
11492I6242M658L27969F9477d0818E3325K52886A41596K46908L2479I0499M71992
11481E62491k78127C9570K23188a37148J6653E31685c64239d7870A15290L54450
11471D69740A77925d1387H4928a9491B02507K9708q1372a10163l3885a7871D62110
$$ plain form
11551 37029 -11141 205406 -148191 -169230 313001 253172 -285312 92999 52068 270680 -102715
11539 105117 -31501 -368663 155263 -146404 71644 195254 239295 58253 -71554 -77236 -247353
11528 -247353 145437 69547 91803 122576 105437 272739 -102182 175136 168846 108254 14504
11516 161485 148960 -114131 42860 186660 186761 180423 42911 311832 138867 -101545 93552
11504 93416 -74177 -26243 15615 -67188 190293 -54271 126292 -76235 -52954 134948 -124324
11492 96242 100900 428869 69477 -40818 53325 306211 141596 388504 420983 90499 562491
11481 562491 284364 39570 262758 -137148 -120495 531685 -364239 -47870 115290 469740
11471 469740 177925 -41387 84928 -19491 202507 232215 150843 -110163 -144048 -17871 462110
11459B57297A28500b07699B07069n0480l5646k615C9574e8125J549A83374P7150
11448B60524K49264k29988I1366k3194K47703a03386j65797P5778A50818a61864
11437a46232O8562j607e183B00397d31688A4161K02214c32725N5373O0940f9852
11425a54165e132j1974A34979a80374D3509j1371L17485a41395I1550N4290a73938
11413a39093D7838i1239A51531f4550H9705k1696e9273a6146j99013B21140E3003
11401A68176P636f9662D82407A80844M5740h4749A26460h7235r1233H238a78966
11389b51216A80277G8373a26425A43843a74530r9977E0554Q0907R9087H5536c8252
11377A86153b97548B71792q5299a330A7019N13325F5979I647a41592G8152C4055
$$ plain form
11459 257297 128500 -207699 207069 156589 120943 118328 39574 -58125 -56576 183374 260524
11448 260524 509788 279800 91366 68172 315875 -103386 -269183 -193405 150818 -161864
11437 -146232 -77670 -79277 -5183 200397 -431688 14161 216375 -332725 -277352 -216412 -69852
11425 -154165 -5132 -17106 134979 -180374 43509 32138 349623 -141395 91550 145840 -173938
11413 -139093 47838 -91239 151531 -64550 89705 68009 -59273 -16146 -215159 221140 53003
11401 168176 175812 -69662 482407 180844 226584 -84749 126460 -87235 -178468 8238 -178966
11389 -251216 180277 78373 -126425 143843 -174530 -274507 50554 131461 230548 85536 -38252
11377 186153 -297548 271792 186493 -1330 17019 530344 65979 9647 -141592 78152 34055
11365a98736a3427o1631e268o2341a7825B51926b17653L4192a3683o3256j51371
11354b28310g5966j48666j25618R0437B91276b36A4673J30638h4980J4547C06702
11342b42091K342M0176F4554A3817J42440a83646b0753k37486N0479A99213C3391
11330d44928d6886C49557q7685b20838B83215j08878a4267A00443J12297e4872
11319a37237B63531c57683C6156a16163j39827A21847a24482B250K40257d16695
11308a92861C4034J53411j8703D0118L5683J78332b43922a11271L4316E6542a08051
11296A07310i1811F7603a04544l0407B0820c0048C7692a50874H0581b3665I5666
11284b20543c432A96107J35192A4195K6920g84n1076p4981o2051k44162A0579
$$ plain form
11365 -198736 -13427 -75058 -5268 -67609 -17825 251926 -217653 -183461 -13683 -76939 -228310
11354 -228310 -75966 -224632 -350250 -259813 291276 -236 14673 145311 -84980 -70433 306702
11342 -242091 -239749 -199573 64554 13817 156257 -183646 -20753 -258239 -207760 199213 33391
11330 -444928 -46886 349557 261872 -220838 283215 174337 -14267 100443 212740 -54872
11319 -137237 263531 -357683 36156 -116163 -255990 121847 -124482 2250 242507 -416695
11308 -192861 34034 187445 168742 40118 75801 254133 -243922 -111271 -76955 56542 -108051
11296 107310 -91811 67603 -104544 -134951 20820 -30048 37692 -150874 80581 -23665 95666
11284 -220543 -3432 196107 331299 14195 41115 -784 -51860 -126841 -188892 -433054 10579
11272a1245k718B56057i8093r8249f9892C7218b43134J3026F8757B8143a06865
11260E409R743J9975J19513a19761j22115B85776c53797A25866j2536f3642B0489
11248g2371k86069A01524c66091H8196Q4028m3588h2309E3309G250f2143r94b8401
11235A64550a93539d0377o56p6578B01118g7875J1335A36323c79778a75421A78416
11223B5556J5859a79607c4846C7443a9510B78318O4262i6394l13240C9207d3444
11211A24416E1548j4457c1286C2939e7018r8660L2706j19474G1367a32474q8314
11200b20788E9775a59552G994M9026P9356a42245B03976H9179N778K72039D1901
11188a35168j61711E7789a38748f8471R354j11961D3053d33271a08351j12158
$$ plain form
11272 -11245 -13963 256057 -98093 -196342 -69892 37218 -243134 -230108 68757 28143 -106865
11260 5409 15152 35127 154640 -119761 -241876 285776 -353797 125866 113330 -63642 20489
11248 -72371 -358440 101524 -366091 88196 172224 128636 -82309 53309 7250 -62143 -63137 -28401
11235 164550 -193539 -40377 -41033 -117611 201118 -77875 -66540 136323 -379778 -175421 178416
11223 25556 41415 -179607 -34846 37443 -19510 278318 342580 -96394 -409634 39207 -43444
11211 124416 51548 37091 -31286 32939 -57018 -155678 -122972 -242446 71367 -132474 -220788
11200 -220788 59775 -159552 7994 57020 136376 -142245 203976 89179 94957 366996 41901
11188 -135168 -296879 57789 -138748 -68471 -59117 -171078 43053 -433271 -108351 -220509
11178b20509n9530A49847d2619m55096g1093B69095f4486D7287J24327D9729J20476
11167A70205q3709b60383b1997m28400R7462a05612E2494b3288A70891i0822l2701
11156a23523k33495E20148E9311J11634F0387b31589d7811A71667i3071E0558
11145b4108m8733A6797L10882c4707n3366k63204b0515k3163N222J3961E4930
11133B61843H9566l3836O0032a05074k5147A11097e9373A60821b6648A69173c31203
11121F2942J95378D9119d2842a5999A7886a40427l801A43358j2045K54388b68212
11109b25721P8101B77055J01769R6891j89640A11785K21175B5012J95499H1151
11098B87413p0278P4197k183C2738K98555J38129I968a14263a5851B28526e4241
$$ plain form
11178 -220509 -280039 149847 -42619 -497715 -71093 269095 -64486 47287 171614 49729 170205
11167 170205 86496 -260383 -21997 -450397 -352935 -105612 52494 -23288 170891 -90822 -123523
11156 -123523 -357018 520148 59311 170945 60387 -231589 -47811 171667 -93071 50558
11145 -24108 -72841 16797 327679 -34707 -88073 -351277 -20515 -43678 -38456 -24495 54930
11133 261843 89566 55730 115762 -105074 -130221 111097 -59373 160821 -26648 169173 -331203
11121 62942 258320 49119 -42842 -15999 17886 -140427 -144228 143358 131313 385701 -268212
11109 -225721 -147620 277055 378824 475715 286075 111785 332960 25012 220511 81151
11098 287413 217135 291332 289149 32738 331293 469422 9968 -114263 -15851 228526 -54241
11086B01434J17285d9140D50229D0714J15121o8559J61259r0940J33770K77811
11076E69176D22L72125j69153J31378k930A06011Q0352J17120O4448k7367A40723
11064D60246j42273p5832I3550L60032L64319B79684L28515k71351L16284j20136
11054E32996A29393O02418P8764q4604k04328K02221j41832j2239K42614l14264
11044D98143J18069l2609M0093N6976k39491K40054P5605L2829k87421K46583
11034G48831k89186K32313j4156C34778L23162K08644m05527M15610k43400R2040
11024G25307j32692l351l4510K30432C61988K70757J73230j85721k73561K38582
11014E85275k5850B47964M07680p2176K36371j84339r8430K57919B64456L09147
$$ plain form
11086 201434 318719 -49140 450229 40714 155835 87276 248535 157595 291365 569176
11076 569176 422 372547 203394 334772 331842 106011 186363 303483 367931 340564 140723
11064 460246 317973 242141 93550 453582 817901 279684 608199 336848 653132 532996
11054 532996 129393 731811 810575 725971 521643 723864 582032 569793 812407 498143
11044 498143 616212 583603 623696 680672 441181 681235 756840 789669 502248 748831
11034 748831 459645 691958 677802 334778 657940 866584 461057 876667 633267 725307
11024 725307 592615 589264 554754 785186 361988 632745 805975 620254 346693 585275
11014 585275 559425 247964 655644 583468 819839 635500 537070 794989 264456 573603
11004E73603B10556L02884L17203j76421M4906J15763l09610M57429m23683J26086
10994F65113j38283k36773P6958L13072m482j28509M24525K1045l31956J96233
10984H56943o3874R1268L01742l99383J96249J06720Q2698K34354J86022J81526
10974A774265M18756J20999K16551k16996K26445k22039q3760l06293q3956k51128
10964A592844k01737J63742l00811P9778J57340J78251l76984L36249J25498K0352
10954A774522k10864k63352k48958k73262j66201J49480k26808A88927N2169J26667
10944C67763o5361e8538B7448J57846J42103F7285N4122K43452M403A23481a62495
10932A38727m233J60247j25526J83450E1235J43103A2686c6396k43506E7435a1737
$$ plain form
11004 573603 210556 513440 830643 654222 699128 814891 505281 962710 539027 665113
10994 665113 526830 290057 367015 680087 675605 547096 971621 992666 660710 856943
10984 856943 793069 884337 1186079 786696 982945 1089665 1172363 1406717 1592739 1774265
10974 1774265 2193021 2314020 2530571 2313575 2540020 2317981 2234221 1927928 1843972 1592844
10964 1592844 1391107 1554849 1254038 1333816 1491156 1669407 1292423 1628672 1754170 1774522
10954 1774522 1563658 1300306 1051348 778086 611885 761365 534557 188927 241096 367763
10944 367763 302402 -58538 27448 185294 327397 67285 121407 364859 369262 123481 -162495
10932 138727 134494 294741 169215 352665 51235 194338 12686 -36396 -279902 57435 -11737
10920A05377K1977h4709L6911m250j725A82056a26520j6262B86342F9509J62897
10909B32406a06027j80734b489j25398C58947B4821J60439r724H6809M4933j4084
10898A17658a22783j3817m1389r2886O1623L7187N205A27162l9101d1716D06287
10886i3432F4093N666M8379f5797K1283l03397Q8115a11970r3049a5001q2988
10875i7989A1794a8210P811c910B87295c03601i5665J1402I3868i842A28684a2599
10862C52713A39856r52f5048r5952E2170a875A53335L6696e040A09127b68185
10850C04156L3421a43911n1404j23612I848b63574A96133d41947a6709j73386
10840a90095b0076A45020i3553A62063g234H6650N0187J07509h694k50219n6077
$$ plain form
10920 105377 127354 -84709 -47798 -52048 -53773 182056 -126520 -142782 286342 69509 232406
10909 232406 -106027 -286761 -2489 -127887 358947 24821 185260 175536 86809 131742 117658
10898 117658 -122783 -136600 -177989 -270875 -209252 -172065 -166860 127162 88061 -41716 406287
10886 -93432 64093 69759 118138 -65797 -44514 -347911 -259796 -111970 -205019 -15001 -97989
10875 -97989 11794 -18210 -10399 -3910 287295 -303601 -95665 -84263 93868 -9842 128684 -12599
10862 352713 139856 138904 -65048 -161000 52170 -1875 153335 190031 -5040 109127 -268185
10850 304156 337577 -143911 -195315 -318927 9848 -263574 196133 -441947 -16709 -190095
10840 -190095 -20076 145020 -93553 162063 -7234 86650 136837 244346 -8694 -258913 -314990
10829c14990D2900a44474E6570Q0766k5605C8961a62535d1382l13245D4147f1525
10817c0748n8061k40786f9894n4290A1239a19035D7936L5392A0842R0902H489
10805b72680Q7742B37839A08530a83861O7681H4629L1188K5820a14676A06077
10794a67022P3904C3846c8292j13225j7095a4065q6904j91345N4586J7662I6574
10782b92896N6916a06363d7886C4433j4349L6353L3068B2083a77834B27121b26978
10770A61722F1968B4670k396J16570K75734b27695A93797b87427F4976K52051
10760C17027b1962q521C4457b37090q8892f6734j89281A77014G4378a63355I981
10748a03891c8352A4207e5457l38249J2571a9840n045F1196K11562a93977H3498
$$ plain form
10829 -314990 42900 -144474 56570 137336 111731 38961 -162535 -41382 -354627 44147 -61525
10817 -30748 -88809 -329595 -69894 -124184 11239 -119035 47936 83328 10842 101744 8489
10805 -272680 -184938 237839 108530 -183861 -116180 84629 115817 141637 -114676 106077
10794 -167022 -93118 33846 -38292 -151517 -168612 -14065 -100969 -292314 -237728 -220066 96574
10782 -292896 -235980 -106363 -47886 34433 20084 56437 89505 22083 -177834 227121 -226978
10770 161722 61968 24670 22274 138844 414578 -227695 193797 -287427 64976 317027
10760 317027 -21962 -30483 34457 -237090 -325982 -66734 -256015 177014 74378 -163355 9981
10748 -103891 -38352 14207 -55457 -393706 -381135 -19840 -24885 61196 272758 -193977 83498
10736b36826e179B42009e4211A45001O3967b318B5623a80670A29822i4516A63710
10724b55092k09566F6153m484K96871a44546k1286g9501a0736B02195I598d7189
10712d9473B56533j11919a30900e7368K5784l1665j0955k83484j56532a66540
10701G2436d0432l18063c4336H2967B4970a10505K0002m4237M9136q0424m0817
10690b06845c1840j85365J02381b6797m850D8326a39703a6472B09063I1460b87485
10678b7479A17408a41445j61679J20564Q1953K488A58107a50296e7087k3603L8178
10667d2512D9227e0382B43045a23694q4556B51377A04714d6607K2953I0443a91983
10655C18457b92926c3081I9669L9555C3314b22529b5710A54914J81236j43141
$$ plain form
10736 -236826 -5179 242009 -54211 145001 208968 -2318 25623 -180670 129822 -94516 163710
10724 -255092 -464658 66153 61669 358540 -144546 -165832 -79501 -10736 202195 9598 -47189
10712 -49473 256533 144614 -130900 -57368 -31584 -63249 -74204 -357688 -514220 -166540
10701 72436 -40432 -358495 -34336 82967 24970 -110505 -90503 -134740 -85604 -166028 -206845
10690 -206845 -31840 -217205 -114824 -26797 -31647 48326 -139703 -16472 209063 91460 -287485
10678 -27479 117408 -141445 -303124 -182560 -100607 -98119 158107 -150296 -57087 -80690 -42512
10667 -42512 49227 -50382 243045 -123694 -208250 251377 104714 -46607 -23654 90443 -191983
10655 318457 -292926 -33081 99669 139224 33314 -222529 -25710 154914 336150 193009
10645A93009b35219B52546B5513K2483K25746F6379c46710D31680f8534b1251
10634C5834k737P0146Q7864F5782b11270R0986f598j59651H9106b85468J36741
10623a48727k31592K4157L8966a43609k1174j39652i4938F2486e735n3441p9842
10612a39018B63526h5028A07789C5397M5830J44155a31955d030G9526C7299a06648
10600f5570K6572q9068I4704c454n6984k08271a03722B17062r2205J6630e3376
10588B41262b90040M8328a20276n3904B31550L0631c3204m3706A08540a78447
10577d08272e9199k19255I131g7195k3113j2344A15742C2734g7224j96322H3665
10565I1911A0785a87621b801l154q6360c8903j88983A86071a73091A95903c42803
$$ plain form
10645 193009 -235219 252546 25513 47996 273742 66379 -346710 431680 -68534 -21251
10634 35834 33097 103243 191107 65782 -211270 -120284 -6598 -166249 89106 -285468 -148727
10623 -148727 -380319 -356162 -317196 -143609 -164783 -304435 -94938 62486 -5735 -59176 -139018
10612 -139018 263526 -85028 107789 35397 81227 225382 -131955 -4030 79526 37299 -106648
10600 -65570 -38998 -128066 94704 -3454 -60438 -268709 -103722 217062 124857 141487 -53376
10588 241262 -290040 -241712 -120276 -174180 231550 262181 -33204 -76910 108540 -178447
10577 -408272 -59199 -278454 9131 -77195 -100308 -112652 115742 32734 -77224 -273546 83665
10565 91911 10785 -187621 -2801 -5955 -92315 -38903 -227886 186071 -173091 195903 -342803
10553A37966b60050D81426C8152i9970k1270j05520C4241K7266c8820j14021B74101
10541a35543K0305A34097g162j53141P5289B25765i0191L8650q617p6657D7348
10529B41528J25607e5558k5609R348k18069B22804e9073A61697h9169o6983k7290
10518a83442L9595F806b16658A74706k2737g7998j01190j01860b2895D0990a07853
10506a78418k8285c7553B00599b00196g4766k6981K0079A01769a11721j02198
10496b13919A61373a72666g8670m0014A3487c3285j22312k8258o2650R9709B23500
10484a25395B29082G6912R9073J13924o337d5862B99731D7582N9923D1770J56663
10473A98433o4340b38528g7896A37782b3193k50556A90788a86728B30103a86168
$$ plain form
10553 137966 -260050 481426 38152 -99970 -121240 -226760 34241 61507 -38820 -152841 274101
10541 -135543 -115238 134097 -7162 -160303 -85014 225765 -90191 -51541 -60158 -136815 47348
10529 241528 367135 -55558 -81167 -71819 -289888 222804 -59073 161697 -89169 -156152 -183442
10518 -183442 -143847 6806 -216658 174706 151969 -77998 -179188 -281048 -22895 40990 -107853
10506 -178418 -206703 -37553 200599 -200196 -74766 -101747 -81668 101769 -111721 -213919
10496 -213919 161373 -172666 -78670 -118684 13487 -33285 -155597 -183855 -246505 -146796 223500
10484 -125395 229082 76912 175985 289909 283572 -45862 299731 47582 107505 41770 198433
10473 198433 134093 -238528 -77896 137782 -23193 -273749 190788 -186728 230103 -186168
10462a13948l4114F5506a98477A38310h3953k13073A24287J34559D4945a23088
10451a06741B91113a29576A47589b65665A39656b09751A49725C7030a36845A83364
10440B15287B6378f9433B8545a56744I7236J22175D464i960j1183q462A68463
10428g7973j14199g6906o4355A65462D2205c92732a95924K02A8913J87462a7764
10416f2096D28166A34325h9833l62894A03881K7171a12347m2042d2024j48136
10406a90160D3313J3320a51861e7309J2283B37102c7663n9191c7348J4496p5182
10395i8034A75626b26706C81275j52812f2125b2974B74699a65573A02016a1191
10384B05125M241n7311R2935n1407a49513B4000J5844J74001C5260N8404P6510
$$ plain form
10462 -113948 -148062 65506 -198477 138310 -83953 -297026 124287 258846 44945 -123088
10451 -106741 291113 -129576 147589 -265665 139656 -209751 149725 37030 -136845 183364
10440 215287 26378 -69433 28545 -156744 97236 219411 4464 -9960 -21143 -29605 168463
10428 -77973 -192172 -76906 -141261 165462 42205 -392732 -195924 -195722 18913 206375 -17764
10416 -62096 428166 134325 -89833 -452727 103881 131052 -112347 -154389 -42024 -190160
10406 -190160 43313 56633 -151861 -57309 -45026 237102 -37663 -96854 -37348 -22852 -98034
10395 -98034 175626 -226706 381275 228463 -62125 -22974 274699 -165573 102016 -11191
10384 205125 209366 152055 244990 193583 -149513 24000 39844 213845 35260 93664 170174
10373A70174k6675Q7646Q8651J1477q259N782M3794L65771B01458a01720B19283
10361A79599N5426j10634l4621K98218I5190L55748a26995C86962L12153j67386
10351E31729n8191m6593B10077K25787A90244r2970a09542B89566L82935A83774
10340A33200j8812J52636K8840J09053F1371K91420A58874o9468A3455P8937D1193
10328b93339A70840j5897A5708b06965e7243A38736J70870N0304a32680A04106
10317b1697A42483C3577a24051r5894D2682L34486G9894g1357d367k84416A5520
10305a33163r155B4560P7777l5746J97377g8412G5784K29170c18313B9735a57403
10293F4572A7999M5952M4124b66979B21796b71234b8802B15893j5092r2943A9543
$$ plain form
10373 170174 143499 231145 319796 331273 323014 328796 372590 738361 201458 -101720 219283
10361 179599 235025 124391 89770 387988 95190 450938 -126995 386962 699115 531729
10351 531729 473538 426945 210077 435864 190244 97274 -109542 289566 672501 183774
10340 133200 114388 267024 295864 404917 61371 352791 158874 89406 13455 92392 41193
10328 -293339 170840 154943 15708 -206965 -57243 138736 309606 359910 -132680 104106
10317 -21697 142483 33577 -124051 -219945 42682 377168 79894 -71357 -4367 -288783 15520
10305 -133163 -142318 24560 102337 66591 263968 -78412 75784 304954 -318313 29735 -157403
10293 64572 17999 63951 108075 -266979 221796 -271234 -28802 215893 200801 107858 19543
10281a05844A46313m5654c52928J65988c5585A16327P1541a00880I5564D1874
10270B7803D255Q0311I906a09229B01253O5155b39087a047n4007B14465B2171
10258a73336B29849A03956K52537j47930M7583E9221d44339a9310i346j57108
10248a66454A754a91229N5640A26917a46261L5533L0072H8390m3104a1022j75261
10237a86283B8506K2974M5371a01316b5472m3544d310A99993a06987p3528b795
10225C10991a83978j88829e2834A63688c78531N8436M088A48792K4048b90032
10214A46638c4025o3197C3593J73508i1529r571G461a92373r2881g2208B30905
10202c03964A55788M290F0252a3898A47691i3325A05750a54963e0580A62679a6949
$$ plain form
10281 -105844 146313 100659 -352928 -186940 -35585 116327 187868 -100880 95564 41874
10270 27803 4255 84566 9906 -109229 201253 266408 -239087 -1047 -55054 214465 22171
10258 -173336 229849 103956 356493 208563 256146 59221 -444339 -19310 -9346 -166454
10248 -166454 1754 -191229 -135589 126917 -146261 -110728 -80656 88390 45286 -11022 -186283
10237 -186283 28506 51480 96851 -101316 -25472 -69016 -4310 199993 -106987 -180515 -2795
10225 310991 -183978 -372807 -52834 163688 -378531 -320095 -316007 148792 172840 -290032
10214 146638 -34025 -97222 33593 207101 -91529 -101100 7461 -192373 -285254 -72208 230905
10202 -303964 155788 160078 60252 -13898 147691 -93325 105750 -154963 -50580 162679 -16949
10190a9224B00606b12694R9996j06084L9965B49438a79612Q4213j02246M5440
10180a52205A28044b06359Q6778A04715a62016H0793d87k39475A34419c63723
10169a3666A2767i4858E0982b0687I4309J08399e53829K65159A05161a38989A02165
10157c54343M2121A0403J28456m4911c83400A42468E3315a39108M8424G745a6875
10145a95966p9352E4588c12731A15849g8950A53567m2928C6164b56058b2747C78939
10133A22435a71148h0674j89307j30436J75908R1121I2000a29651A7229a50026
10122a56382d1293B15222b19455a08955I1861g8258D17880f4326G7927J8323b86073
10110a91858C60225i0455k81410a65137D030c88533a48187A90986e2342A3691
$$ plain form
10190 -19224 200606 -212694 -112698 -218782 -178817 249438 -179612 -95399 -197645 -152205
10180 -152205 128044 -206359 -119581 104715 -162016 80793 -487 -239962 134419 -363723
10169 -13666 12767 -94858 50982 -20687 94309 202708 -553829 -288670 105161 -138989 102165
10157 -354343 -312222 10403 138859 93948 -383400 142468 53315 -139108 -90684 7745 -16875
10145 -195966 -275318 54588 -312731 115849 -78950 153567 110639 36164 -256058 -22747 378939
10133 122435 -171148 -80674 -269981 -400417 -224509 -133388 92000 -129651 17229 -150026
10122 -156382 -41293 215222 -219455 -108955 91861 -78258 417880 -64326 77927 96250 -286073
10110 -191858 360225 -90455 -371865 -165137 4030 -388533 -148187 190986 -52342 13691
10099A6323b64082B40491R4933A12444e308D7199d0186J8558B09644o484c7858
10087B34588b27436B84361A37327o2725b8899B4547g0784j40534j88726a46756
10076b53382J11055A66978b6912j22544F4832c46811B79415a22290l5794H541
10065b01717i8495A98841K6357J30093M2533b27677d5430k83073c4252A6410a0484
10053A66687R5832e7790j29749A4980h4778K1079j12618J9726E0968I55a30136
10041F2617b67471g044n5205j92462b4465A11476a02548k61857h6569q7018M2664
10030a30923l4472j51904A25812F1691d123r646k38104F8237L37643G1991b02837
10018h6483j4782j05544C3164a5932l82416M4191e3810n7700j77564h3813p574
$$ plain form
10099 16323 -264082 240491 335424 112444 -5308 47199 -40186 -21628 209644 203160 -37858
10087 234588 -227436 284361 137327 74602 -28899 24547 -70784 -211318 -400044 -146756
10076 -253382 -142327 166978 -26912 -149456 64832 -346811 279415 -122290 -158084 8541
10065 -201717 -98495 198841 225198 355291 397824 -227677 -45430 -328503 -34252 16410 -10484
10053 166687 262519 -57790 -187539 14980 -84778 -63699 -176317 -156591 50968 955 -130136
10041 62617 -267471 -7044 -62249 -254711 -24465 111476 -102548 -364405 -86569 -173587 -130923
10030 -130923 -165395 -317299 125812 61691 -4123 -13769 -251873 68237 405880 71991 -202837
10018 -86483 -101265 -206809 33164 -15932 -398348 -354157 -53810 -111510 -289074 -83813 -91387
10007i1387j27656n4595P0749A07693P357f2782K2200j91584h1336E1605c25495
9995a74040A13697c012l00296J33174e723q4499j83365F3812B3152K73311g410
9983c48774C5857a05513F1693Q1561D3108j0708L7144L6578i0486I5968a48345
9971A0645a0897q1174A37109A7178f7852k27470A47876p2385c6378C0338a85913
9959d77687a18740r7572c9189p6338b7754k098A31246a4075k90792j4276m322
9948c23465A49630b14600B72674i97j02904D5876h4850j33221A09676a5653C7545
9936I2682m0990B1389b05733P6433C00118a52347B9907c14948H7256a15085B8062
9924G3764b86152K6671E227O5697L51278A24300c96207a64129k54099J08452A03365
$$ plain form
10007 -91387 -219043 -273638 -202889 107693 115050 -62782 -40582 -232166 -81336 51605 -325495
9995 -174040 113697 -3012 -303308 -170134 -5723 -90222 -273587 63812 23152 296463 -7410
9983 -348774 35857 -105513 61693 143254 43108 32400 69544 106122 -90486 95968 -148345
9971 10645 -10897 -92071 137109 17178 -67852 -295322 147876 75491 -36378 30338 -185913
9959 -477687 -118740 -216312 -39189 -115527 -27754 -29852 131246 -14075 -304867 -319143 -323465
9948 -323465 149630 -214600 272674 -997 -103901 45876 -84850 -218071 109676 -15653 37545
9936 92682 51692 21389 -205733 -129300 300118 -152347 29907 -314948 87256 -115085 28062
9924 73764 -286152 -259481 5227 70924 422202 124300 -396207 -164129 -418228 -309776 103365
9912I4559C4102b69832H4937f0022j7661j26906b2739j79476G2230G331b50514
9900D01375A95653n3921F812b79390O3203d6806H3039J29777D9375j8381Q5330
9889A16324b569k62870J26488l87874c293G7254h5944l04422f1398K4505D9850
9877A05386f3379H1148a15786k04162G1955M9815Q3869O6142d58144a96848o710
9866b03558C2223a10140B52341e0172j5977q4855M6259E2972M274a5643j7910
9855c3553l40746J83656K6333p9349A96007A618e8726A81065L3761o5326c79365
9843A96838a05960B58133g6260l71045o9311e1080j35684j22950A20782C7262
9832e7318F9035c97136H5660J150a36158D1213c67467i2884A28739J6431E4961
$$ plain form
9912 94559 34102 -269832 84937 -60022 -77683 -204589 -22739 -202215 72230 7331 -250514
9900 401375 195653 141732 6812 -279390 -216187 -46806 83039 212816 49375 30994 116324
9889 116324 -2569 -265439 -138951 -526825 -3293 77254 -85944 -390366 -61398 -36893 49850
9877 105386 -63379 81148 -115786 -319948 71955 121770 205639 271781 -458144 -196848 -203558
9866 -203558 32223 -110140 252341 -50172 -66149 -151004 -104745 52972 57246 -15643 -33553
9855 -33553 -374299 -190643 -164310 -243659 196007 1618 -58726 181065 214826 149500 -379365
9843 196838 -105960 258133 -76260 -447305 -516616 -51080 -186764 -309714 120782 37262
9832 -57318 69035 -397136 85660 86810 -136158 41213 -367467 -92884 128739 145170 54961
9820A06347c05698a16136j54387J30017k68718J17613b726A1972a19252d6870
9809a16812n8365e0952j73583J09093C9747b04905B66521e8502r8858E0015a67935
9797b057j57970g7492H871c61750I0825c96773A52881e8665B00176H2728A764
9785a53046D7485O8408n2286b37186A2631i1970A15840f9743n3132n2298k17046
9774c92219P8096j27305h4688c0547j70422B86499c89485a43885A21985i4363
9763e9921j8170k72770a03236G9214A0379a46785F3500b2097j13613f1089d851
9751A16115C1562g0476a9343C75465G1975J3317J0239C9115K0489K13959c06531
9739a96510I8768B121a89037g3660b5765D5028K38784a08460j13457H2405B0297
$$ plain form
9820 106347 -305698 -116136 -270523 -140506 -409224 -291611 -2726 11972 -119252 -46870
9809 -116812 -175177 -50952 -224535 -115442 39747 -204905 266521 -58502 -157360 50015 -167935
9797 -2057 -160027 -77492 8871 -361750 90825 -396773 152881 -58665 200176 82728 1764
9785 -153046 47485 115893 63607 -237186 12631 -91970 115840 -69743 -122875 -175173 -392219
9774 -392219 -314123 -441428 -84688 -30547 -200969 286499 -389485 -143885 121985 -94363
9763 -59921 -78091 -350861 -103236 79214 10379 -146785 63500 -22097 -135710 -61089 -4851
9751 116115 31562 -70476 -19343 375465 71975 85292 95531 39115 59604 273563 -306531
9739 -196510 98768 2121 -189037 -73660 -25765 45028 283812 -108460 -221917 82405 20297
9727e5655A69798b7375B21786H2850c50752A28010a91742k74237h1113J1593J6955
9716e2565j10883q1416d8919A0668a5517l61466a06039o0128A27684b28413B74105
9704b59264G356e5754l3580G0317F192a86201O8558l7284B38589b2971l1316c860
9691a00394k79319a17685A83243b13019f3890j23506g8326c2500j13652N4711
9681i1441I2496j5145b47785G5317a38879H4017a38311B9121b154B42368I9689
9669a12550D5025c6699j73803P5010D0422d13272a23133j2594o2488I2900D0683
9657b8491B53916m1863a82102A487M631a58812d3031C3372d3011k00373i9715
9645F5141a48838I7280N6476R0300H3376a43108A03597J36383a59449g4118L4965
$$ plain form
9727 -55655 169798 -27375 221786 82850 -350752 128010 -191742 -465979 -81113 -69520 -52565
9716 -52565 -163448 -244864 -48919 10668 -15517 -376983 -106039 -166167 127684 -228413 274105
9704 -259264 7356 -55754 -89334 70317 6192 -186201 -117643 -154927 238589 -22971 -54287 -3860
9691 -100394 -379713 -117685 183243 -213019 -63890 -187396 -78326 -32500 -146152 -91441
9681 -91441 92496 77351 -247785 75317 -138879 84017 -138311 29121 -2154 242368 99689
9669 -112550 45025 -36699 -210502 -135492 40422 -413272 -123133 -135727 -198215 92900 40683
9657 -28491 253916 212053 -182102 1487 6118 -158812 -43031 33372 -43011 -243384 -99715
9645 65141 -148838 97280 153756 244056 83376 -143108 103597 239980 -159449 -74118 -39153
9634c9153g567m19106a80086J6097m1392d0514G194e0051C40189C9263N49A602
9621a24162C45708b66528K8457J06285H3371O3581a79716B92072k7559d147m5937
9610e0084k67019P4372l4501H7595L29857b67083B765K03336p7776j3349j9450
9599I5526b40859A7132c44684p7642d7517I7326f2364B7996a41172j56896a37848
9587C35207b21452K7032j08708j7119H5920j5965a02654B51853a11854B55089
9576b15663O0832j36314e7787k40947J45598k24307H3663j3064d35A74418e8554
9564a8849r150I3977j0421b41927k2574Q8394a9626k1400A3409b20769b7711A07813
9551B2191L15615b47378I3624a43143B17391d5712C49170c98890P6809A26489
$$ plain form
9634 -39153 -7567 -426673 -180086 -163989 -205381 -40514 7194 -50051 340189 39263 39812 1602
9621 -124162 345708 -266528 -238071 -131786 83371 146952 -179716 292072 264513 -4147 -50084
9610 -50084 -317103 -242731 -277232 87595 417452 -267083 2765 206101 128325 114976 95526
9599 95526 -240859 17132 -344684 -422326 -47517 97326 -62364 27996 -141172 -298068 -137848
9587 335207 -221452 -194420 -303128 -320247 85920 69955 -102654 251853 -111854 255089
9576 -215663 -154831 -291145 -57787 -298734 -153136 -377443 83663 70599 -435 174418 -58554
9564 -18849 -27999 93977 83556 -241927 -264501 -176107 -19626 -41026 13409 -220769 -27711 107813
9551 22191 337806 -247378 93624 -143143 217391 -45712 349170 -398890 -322081 126489
9540a93264r7587P1565j48909a56833A04665e8410k06569q1280D3188J82753b81419
9528b46843f2078A7980d7055j50605D7328Q1648b65177A21464a55703j48845A89401
9516b95249m1025a15967j78227N7576C07819g6488m346B5074a69569g0107k61751
9505c31858B63708B418J67676L49759b10641o2471K7401B984c30300b4056B23498
9493e7569b1144D6318L35148a29897m7691K4391m3020m1100L7672i0983k305F0587
9480e5737C69974i6798k59332e7190B58497m6801o8185B4648O6882k5105I953
9468A5886M85451i4582q5444D1259a25684j33889C7362b42154G6962B6369J91193
9457B17562b14847j33397a0430B571a22005j02142J04727C87843A6250a47849
$$ plain form
9540 -193264 -290851 -219286 -368195 -156833 104665 -58410 -264979 -346259 43188 225941 -281419
9528 -246843 -62078 17980 -47055 -197660 47328 128976 -265177 121464 -155703 -304548 189401
9516 -295249 -336274 -115967 -294194 -236618 307819 -76488 -80834 25074 -169569 -70107 -331858
9505 -331858 263708 2418 170094 519853 -210641 -273112 -245711 2984 -330300 -24056 223498
9493 -57569 -21144 46318 381466 -129897 -177588 -153197 -196217 -237317 -199645 -90983 -93288 60587
9480 -55737 369974 -96798 -356130 -57190 258497 211696 143511 24648 91530 66425 9953
9468 15886 501337 -94582 -180026 41259 -125684 -259573 37362 -242154 76962 26369 217562
9457 217562 -214847 -348244 -10430 2571 -122005 -224147 -119420 387843 16250 -147849
9446c28848A20277n8908L01311c43400B8495b7594k98174J26228A08444a05711
9435G1013R7771d1500I5787b08365Q4085k72982H4250a51449I9050a37517A56860
9423c46099a08176M3229k1772l0078A55729i005B9495J63347d7194b3385B25368
9411b45146b1020F7510J7428i0862B3022d04010i0698A47687E1792b47659J10044
9400a37615H14a09877A02340b02556M1939k20500E205f0184J1290I5652M3374
9389A39026F8598a41636d9453r4388L2543a1493k65936a14602o7396j1585G2167
9377D9059b50335L8954g4451j17089B15071b57235f5616k65647f543B59305E2285
9365a8588k74766J39270b1174k05116Q349g8159A90219n7077F3853a02403c6391
$$ plain form
9446 -328848 120277 61369 362680 -343400 28495 -27594 -325768 -199540 108444 -105711
9435 71013 168784 -41500 95787 -208365 -124280 -397262 84250 -151449 99050 -137517 156860
9423 -346099 -108176 -64947 -86719 -116797 155729 -9005 29495 192842 -47194 -23385 225368
9411 -245146 -21020 67510 84938 -90862 23022 -404010 -90698 147687 51792 -247659 -137615
9400 -137615 814 -109877 102340 -202556 -160617 -381117 5205 -60184 -48894 95652 139026
9389 139026 68598 -141636 -49453 -143841 -111298 -11493 -277429 -114602 -181998 -193583 72167
9377 49059 -250335 -211381 -74451 -191540 215071 -257235 -65616 -331263 -6543 259305 52285
9365 -18588 -293354 -154084 -21174 -226290 -217941 -78159 190219 133142 63853 -102403 -36391
9353A64135k4747b4755j76352A70777A3638a0356a607E4009K20252g3492A14928
9341b18170H2027a05445B71811E2486a35577C80891A76907e8117C657K16748a08234
9329a26468C3471f1108n1633A22602R0667a01886l5255j7076A142J40559L9706
9318A81407D7936a09148K119b8801A82462f091k53819J23029f4685a100o1690
9307f2790m421A49668E672h7558a9160r4373j26957a03852m75781E7481d7910
9295a41301A71999c00018G8772C9167b49414C17564g37250c26142J51117A5011
9284i5891h640j51006J437j22565j21794c7887C82052A89562b46051C75326b9642
9272b2994m2693d662A14316q781b2597E2488b75039I0686i7167j05754i0961j61588
$$ plain form
9353 164135 139388 -24755 -201107 170777 13638 -10356 -1607 54009 274261 -73492 114928
9341 -218170 82027 -105445 271811 52486 -135577 380891 176907 -58117 3657 220405 -108234
9329 -126468 33471 -61108 -112741 122602 213269 -101886 -137141 -154217 1142 141701 181407
9318 181407 47936 -109148 -107029 -28801 182462 -6091 -259910 -136881 -64685 -1100 -62790
9307 -62790 -67211 149668 5672 -87558 -19160 -113533 -240490 -103852 -579633 57481 -47910
9295 -141301 171999 -300018 78772 39167 -249414 317564 -737250 -326142 -175025 15011
9284 -95891 -8640 -159646 -158209 -280774 -402568 -37887 382052 189562 -246051 375326 -29642
9272 -22994 -65687 -4662 114316 105535 -22597 52488 -275039 90686 -97167 -202921 -90961 -252549
9260b52549A34460h3037l4986B3080K70837a13173F8602C710J42699a93334C18629
9248g2085A60893a41430p8095R4092I0903c50513A07183D4811a37169q151A91128
9236a44646B0694d9762j36857P3916B30599a76874j51295B6303c14492f2638k00928
9225b63566R8686j02625B82714A38856a72516P2847b0797B44002q4333E5585c60215
9213A99684a6100o3839j3817D7264K47444j3230d62070g7296l94721Q3292h1866
9201A28816f863c191A08668i0434p8433O679q2149c4279D81114i0210D1050a92359
9188A69012k2603b8438B0304a12406l1131B41002Q7300b62537h6783q7505A5302
9176b48297A69610a43968A04007a26280l0631b054j44892I8918h5672j2892B41747
$$ plain form
9260 -252549 134460 -83037 -118023 23080 293917 -113173 68602 3710 146409 -193334 318629
9248 -72085 160893 -141430 -219525 -125433 90903 -350513 107183 44811 -137169 -145320 191128
9236 -144646 20694 -49762 -186619 -112703 230599 -176874 -328169 26303 -314492 -62638 -263566
9225 -263566 -164880 -267505 282714 138856 -172516 -99669 -20797 244002 159669 55585 -360215
9213 199684 -16100 -79939 -93756 47264 294708 281478 -462070 -77296 -472017 -388725 -81866
9201 128816 -6863 -3191 108668 -90434 -168867 -162188 -244337 -34279 481114 -90210 41050 -192359
9188 169012 146409 -28438 20304 -112406 -143537 241002 328302 -262537 -86783 -174288 15302
9176 -248297 169610 -143968 104007 -126280 -156911 -2054 -146946 98918 -85672 -98564 241747
9164H981c8232k20034B8209b09975P0255O629k33205f1534k12496B54376Q5094
9153C39470H4554C7196J81583h5133A45961b298k0537C9850J55055o8013i4996
9141A01356a29034k71274J69810A09247a2706B0473J58805b11439D21654J20738
9131E42392b15168e6012o0640F9684B1829M82544b39136a01165j2653j30922D4406
9119A18465b36004p8765B7419e9046l91388B22673c54008a01533D28039A54483
9108I777a66606j85126P4349N9142D3604a24493A04388A5946h5729L2490j54111
9097b07350o8218g1936d65A4664M4087c8079B55519E5001N2082m1388b3835k32733
9085b56568O4902E2549J1711d31266h8569O633C8638j8516O2039c83714C29a5032
$$ plain form
9164 8981 -38232 -258266 28209 -209975 -139720 -133091 -366296 -61534 -274030 254376 339470
9153 339470 84554 37196 218779 -85133 145961 -2298 -22835 39850 194905 126892 -94996
9141 101356 -129034 -400308 -230498 109247 -12706 20473 179278 -211439 421654 542392
9131 542392 -215168 -56012 -116652 69684 21829 504373 -239136 -101165 -113818 -244740 44406
9119 118465 -236004 -314769 27419 -59046 -450434 222673 -354008 -101533 428039 154483
9108 9777 -166606 -351732 -277383 -218241 43604 -124493 104388 15946 -85729 -53239 -207350
9097 -207350 -275568 -71936 -465 14664 58751 -38079 255519 55001 107083 65695 -23835 -256568
9085 -256568 -191666 52549 64260 -431266 -88569 -81936 38638 20122 82161 -383714 329 -15032
9072d85136D9104e0826C633c65245i9908j45343k8544J12963J4235C9443a63897
9060D54657b61420I9871N2995b47765d214k76255e1395C8220h6228j31310H2417
9048B85681a00546I3460c03141a06322d7231m0199A47277a04829F0433g675r0033
9037i7708q874A41106c0865j09676C5518c71075I910a87764B97320E0104A2321
9025a68149c59j67298I2513O0876b48805A83023e6604A66114c11761C85959H7800
9013a05547j69734B7861c89910E9267k3061d1126A35802o2008A9388a27880E4017
9001B2602a35780L1191o2838B22709q4394m3810J2968O6818H4083c5685j77749
8990b13434m3299e6450j02181d4305C1037d3214F5618g7981J5912l314k0592p4774
$$ plain form
9072 -485136 49104 -50826 3633 -365245 -99908 -245251 -273795 -160832 -146597 39443 -163897
9060 454657 -261420 99871 152866 -247765 -4214 -280469 -51395 38220 -86228 -217538 82417
9048 285681 -100546 93460 -303141 -106322 -47231 -87430 147277 -104829 60433 -7675 -97708
9037 -97708 -106582 141106 -30865 -140541 35518 -371075 9910 -187764 297320 50104 12321
9025 -168149 -359 -167657 92513 153389 -248805 183023 -56604 166114 -311761 385959 87800
9013 -105547 -275281 27861 -389910 59267 36206 -41126 135802 73794 19388 -127880 54017
9001 22602 -135780 -104589 -167427 222709 138315 94505 107473 174291 84083 -35685 -213434
8990 -213434 -256733 -56450 -158631 -44305 31037 -43214 65618 -77981 -62069 -65383 -85975 -160749
8978a60749A49589f1444F2074K6438g3116c1934j37175D9506e4926j65046m5183
8967b65155q1946J7653B26770E1678b57019P5595f6142k88692D1659b9583l2614
8956f2197B68048H0298g2003I5030L35803A71544a55779n9233M4604A84395h6737
8944b226A86692a39934j19494B37903c84868f8384A8188K4642b13577N4878A67156
8932g6848a5818j85906g6237B1831J36427J11235O0904M05069L56278J316091
8922B407835N909218N628527E150534I69849A07941K08759L49830l27641A53790
8912D6455K04890a58336j0813C2765M25538J12316k54160a66525a5536k82127
8902b97663B17112g9045j56368O714D57871b6387l5069A48238J16425a77074j30668
$$ plain form
8978 -160749 149589 -61444 62074 88512 -73116 -31934 -169109 49506 -54926 -219972 -265155
8967 -265155 -347101 -329448 226770 51678 -257019 -181424 -66142 -354834 41659 -29583 -62197
8956 -62197 268048 80298 -72003 95030 430833 171544 -155779 -215012 -170408 184395 -86737
8944 -2226 186692 -139934 -259428 237903 -384868 -68384 18188 42830 -213577 -158699 167156
8932 -76848 -15818 -201724 -76237 21831 158258 269493 330397 735466 1091744 2407835
8922 2407835 8317053 13945580 5150534 969849 107941 316700 666530 338889 153790
8912 46455 251345 -158336 -169149 32765 458303 570619 316459 -166525 -15536 -297663
8902 -297663 217112 -79045 -235413 -228699 457871 -26387 -61456 148238 264663 -177074 -307742
8891c07742i078E5054L23293F04e39949b23430a4312A79853a78046p3238Ba79360
8878a2396J660F9231O9492b27387Q8874b3616j42545f9087m06309b0699j83578
8867b04277M3094A18089h5152K379p1891j2670A11309d865j35680j40674E08a50908
8854C8644J60274a79028I8384L6361A9338i4344j55287Q7582n1845j478D2619
8842f2232C3191c49176a31244j46653D4167a19852d2725a6526n440D5829c15820
$$ plain form
8891 -307742 -9078 55054 378347 604 -539949 -223430 -14312 179853 -178046 -251284 2 -179360
8878 -12396 -10736 69231 138723 -227387 -138513 -23616 -166161 -69087 -475396 -20699 -204277
8867 -204277 -161183 118089 -85152 -82773 -154664 -167334 111309 -4865 -140545 -281219 508 -150908
8854 38644 198918 -179028 98384 134745 19338 -94344 -249631 -162049 -213894 -215372 42619
8842 -62232 33191 -349176 -131244 -277897 44167 -119852 -42725 -16526 -21966 45829 -315820
$$ [...]
##END NTUPLES=NMR SPECTRUM
##END=
