
##TITLE=AC1201_HPAAH12051_6666938_tDdsjLugX6
##JCAMPDX= 6.0         $$ Bruker NMR JCAMP-DX V2.0
##DATA TYPE= NMR SPECTRUM
##DATA CLASS= NTUPLES
##ORIGIN= BRUKER
##OWNER= Administrator
$$ 1.72 TOPSPIN		Version 2.1
$$ 2012-08-14 11:29:15.953 -0500  Administrator@TOPSPIN
$$ Compression mode = diff/dup
##.OBSERVE FREQUENCY= 400.02188249412
##.OBSERVE NUCLEUS= ^1H
##.ACQUISITION MODE= SIMULTANEOUS (DQD)
##.ACQUISITION SCHEME= undefined
##.AVERAGES= 64
##.DIGITISER RES= 22
##SPECTROMETER/DATA SYSTEM= spect
##.PULSE SEQUENCE= noesygpps1d.comp
##.SOLVENT NAME= COFFEE_meoh
##.SHIFT REFERENCE= INTERNAL, COFFEE_meoh, 1, 14.96108
##AUDIT TRAIL= $$ (NUMBER, WHEN, WHO, WHERE, PROCESS, VERSION, WHAT)
$$ ##TITLE= Audit trail, TOPSPIN		Version 2.1
$$ ##JCAMPDX= 5.01
$$ ##ORIGIN= Bruker BioSpin GmbH
$$ ##OWNER= Administrator
$$ $$ C:\Bruker\TOPSPIN/data/COFFEE/nmr/AC1201_HPAAH12051_6666938_tDdsjLugX6/12/pdata/1/auditp.txt
$$ ##AUDIT TRAIL=  $$ (NUMBER, WHEN, WHO, WHERE, PROCESS, VERSION, WHAT)
(   1,<2012-08-14 11:29:08.421 -0500>,<Administrator>,<TOPSPIN>,<go>,<TOPSPIN 2.1>,
      <created by zg
	started at 2012-08-14 11:17:37.937 -0500,
	POWCHK enabled, PULCHK disabled,
       configuration hash MD5:
       6B 1B 68 BB D9 2E 58 E2 7F 35 AD 54 07 DF 0E 41
       data hash MD5: 64K
       8C 6A 9A 55 7A 40 97 7C FF BB 79 09 33 62 BF 3A>)
(   2,<2012-08-14 11:29:13.640 -0500>,<Administrator>,<TOPSPIN>,<proc1d>,<TOPSPIN 2.1>,
      <Start of raw data processing
       efp LB = 0.3 FT_mod = 6 PKNL = 1 PHC0 = 0 PHC1 = 0 SI = 128K 
       data hash MD5: 128K
       B5 FE FC 4E A8 71 39 79 75 43 63 39 CB 12 C9 40>)
(   3,<2012-08-14 11:29:14.937 -0500>,<Administrator>,<TOPSPIN>,<proc1d>,<TOPSPIN 2.1>,
      <pk PHC0 = 5.119629 PHC1 = 0 
       data hash MD5: 128K
       C6 1D 78 6C D4 49 36 75 40 A8 43 D0 C5 E5 79 70>)
(   4,<2012-08-14 11:29:15.500 -0500>,<Administrator>,<TOPSPIN>,<proc1d>,<TOPSPIN 2.1>,
      <abs ABSG = 1 
       data hash MD5: 128K
       8E 58 DA FE 3B 83 4B 18 5C C0 D1 0D 0F 19 03 47>)
(   5,<2012-08-14 11:29:15.562 -0500>,<Administrator>,<TOPSPIN>,<proc1d>,<TOPSPIN 2.1>,
      <abs ABSG = 2 
       data hash MD5: 128K
       05 95 BF 09 CB 1F AC 61 51 F0 94 7B 5C EB 8F BE>)
(   6,<2012-08-14 11:29:15.625 -0500>,<Administrator>,<TOPSPIN>,<proc1d>,<TOPSPIN 2.1>,
      <abs ABSG = 3 
       data hash MD5: 128K
       91 F0 EA 66 08 B7 98 01 E1 D3 1D 9F 6A 01 8D A6>)
(   7,<2012-08-14 11:29:15.703 -0500>,<Administrator>,<TOPSPIN>,<proc1d>,<TOPSPIN 2.1>,
      <abs ABSG = 4 
       data hash MD5: 128K
       65 05 13 55 60 C3 6E 78 D5 DC 89 95 98 11 F4 4C>)
(   8,<2012-08-14 11:29:15.765 -0500>,<Administrator>,<TOPSPIN>,<proc1d>,<TOPSPIN 2.1>,
      <abs ABSG = 5 
       data hash MD5: 128K
       53 5F DA 5E 5F 95 00 89 BC E1 9A BF 5B 64 DE 4F>)
$$ ##END=
$$ 
$$ $$ hash MD5
$$ $$ 17 6D BC ED 40 9E EB 1B 51 75 F6 95 CF E6 B0 BE
##$RELAX= 
##$RELAX= 
##$RELAX= 
##$RELAX= 
##$RELAX= 
##$RELAX= 
##$RELAX= 
##$RELAX= 
$$ Bruker specific parameters
$$ [...]
150 150 150 150 150 150 150 150
##$TP07= 0
##$TPNAME0= <>
##$TPNAME1= <>
##$TPNAME2= <>
##$TPNAME3= <>
##$TPNAME4= <>
##$TPNAME5= <>
##$TPNAME6= <>
##$TPNAME7= <>
##$TPOAL= (0..7)
0.5 0.5 0.5 0.5 0.5 0.5 0.5 0.5
##$TPOFFS= (0..7)
0 0 0 0 0 0 0 0
##$TUNHIN= 0
##$TUNHOUT= 0
##$TUNXOUT= 0
##$USERA1= <user>
##$USERA2= <user>
##$USERA3= <user>
##$USERA4= <user>
##$USERA5= <user>
##$V9= 5
##$VALIST= <valist>
##$VCLIST= <CCCCCCCCCCCCCCC>
##$VD= 0
##$VDLIST= <DDDDDDDDDDDDDDD>
##$VPLIST= <PPPPPPPPPPPPPPP>
##$VTLIST= <TTTTTTTTTTTTTTT>
##$WBST= 1024
##$WBSW= 4
##$XGAIN= (0..3)
0 0 0 0
##$XL= 0
##$YL= 0
##$YMAX_a= 11671753
##$YMIN_a= -8485063
##$ZGOPTNS= <>
##$ZL1= 120
##$ZL2= 120
##$ZL3= 120
##$ZL4= 120
##$ABSF1= 14.96108
##$ABSF2= -5.597102
##$ABSG= 5
##$ABSL= 3
##$ALPHA= 0
##$AQORDER= 0
##$ASSFAC= 0
##$ASSFACI= 0
##$ASSFACX= 0
##$ASSWID= 0
##$AUNMP= <proc_prof1d_extract.lims>
##$AXLEFT= 0
##$AXNAME= <>
##$AXNUC= <1H>
##$AXRIGHT= 0
##$AXTYPE= 0
##$AXUNIT= <>
##$AZFE= 0.1
##$AZFW= 0.1
##$BCFW= 0
##$BC_mod= 0
##$BYTORDP= 0
##$COROFFS= 0
##$CY= 15
##$DATMOD= 1
##$DC= 0
##$DFILT= <>
##$DTYPP= 0
##$F1P= 0
##$F2P= 0
##$FCOR= 0.5
##$FTSIZE= 131072
##$FT_mod= 6
##$GAMMA= 0
##$GB= 0
##$INTBC= 1
##$INTSCL= 1
##$ISEN= 128
##$LB= 0.3
##$LEV0= 0
##$LPBIN= 0
##$MAXI= 10000
##$MC2= 0
##$MEAN= 0
##$ME_mod= 0
##$MI= 0
##$NCOEF= 0
##$NC_proc= -2
##$NLEV= 6
##$NOISF1= 0
##$NOISF2= 0
##$NSP= 0
##$NTH_PI= 0
##$NZP= 0
##$OFFSET= 14.96108
##$PC= 1
##$PHC0= 5.119629
##$PHC1= 0
##$PH_mod= 1
##$PKNL= yes
##$PPARMOD= 0
##$PPDIAG= 0
##$PPIPTYP= 0
##$PPMPNUM= 2147483647
##$PPRESOL= 1
##$PSCAL= 4
##$PSIGN= 0
##$PYNMP= <proc.py>
##$REVERSE= no
##$SF= 400.020009605363
##$SI= 131072
##$SIGF1= 0
##$SIGF2= 0
##$SINO= 400
##$SIOLD= 131072
##$SPECTYP= <>
##$SREGLST= <1H.CDCl3>
##$SSB= 0
##$STSI= 131072
##$STSR= 0
##$SW_p= 8223.68421052631
##$SYMM= 0
##$S_DEV= 0
##$TDeff= 65536
##$TDoff= 0
##$TI= <>
##$TILT= no
##$TM1= 0
##$TM2= 0
##$TOPLEV= 0
##$USERP1= <user>
##$USERP2= <user>
##$USERP3= <user>
##$USERP4= <user>
##$USERP5= <user>
##$WDW= 1
##$XDIM= 131072
##$YMAX_p= 412913003
##$YMIN_p= -14438
##$CURPLOT= <Network HP LaserJet P1505>
##$CURPRIN= <$Network HP LaserJet P1505>
##$DFORMAT= <normdp>
##$LAYOUT= <+/1D_H.xwp>
##$LFORMAT= <normlp>
##$PFORMAT= <normpl>
##$SURQMSG= 1
$$ End of Bruker specific parameters
$$ ---------------------------------
##NTUPLES= NMR SPECTRUM
##VAR_NAME=  FREQUENCY,     SPECTRUM/REAL,   SPECTRUM/IMAG
##SYMBOL=    X,             R,               I
##VAR_TYPE=  INDEPENDENT,   DEPENDENT,       DEPENDENT
##VAR_FORM=  AFFN,          ASDF,            ASDF
##VAR_DIM=   131072,        131072,          131072
##UNITS=     HZ,            ARBITRARY UNITS, ARBITRARY UNITS
##FACTOR=    0.0627417313425164, 1,          1
##FIRST=     8223.62146879497, 2323,         -55386
##LAST=      0,             3323,            -56681
##MIN=       0,             -14438,          0
##MAX=       8223.62146879497, 412913003,    0
$$ Real data points
##PAGE= N=1
##DATA TABLE= (X++(R..R)), XYDATA
$$ [...]
61681C99643m084k742j934k274k802k603j762q22k62m29j174j739j588j120r58
$$ 399643 395559 392817 390883 388609 385807 383204 381442 380620 380358 379929 378755 377016 375428 374308 373350
61666C73350j017q89o64n93l94K64J000J209R55O48K72k63l91M61J826K637K555
$$ 373350 372333 371444 370780 370187 369793 370057 371057 372266 373221 373869 374141 373878 373487 373948 375774 378411 380966
61649C80966K085J615J135P57P84J206J704K034K038J604R98Q81J480K129K122
$$ 380966 383051 384666 385801 386558 387342 388548 390252 392286 394324 395928 396926 397807 399287 401416 403538
61634D03538J590J058O15R7m40r93j844k953l646l539l178l170l284l044k636
$$ 403538 405128 406186 406801 406898 406458 405465 403621 400668 397022 393483 390305 387135 383851 380807 378171
61619C78171k402k107j495j036j226j621j440p58l03m45j067k033l075l700l843
$$ 378171 375769 373662 372167 371131 369905 368284 366844 366086 365783 365338 364271 362238 359163 355463 351620
61604C51620m119m740m894l984k769k324k480k348j859j688k060k634l181l480
$$ 351620 347501 342761 337867 333883 331114 328790 326310 323962 322103 320415 318355 315721 312540 309060
61590C09060k957j428J56O39jr79j807k209j688l38N17k20j724k255j472n01m7
$$ 309060 306103 304675 304831 305470 305469 304490 302683 300474 298786 298448 298965 298745 297021 294766 293294 292793 292746
61573B92746J67L20K35J98P17J414J384O78L08O42R54O79J41k15l02o2N49J052
$$ 292746 292913 293233 293468 293666 294383 295797 297181 297859 298167 298809 299763 300442 300583 300368 300066 300004 300553 301605
61555C01605Q34J49q8M42J143J498J613J662J493R30L4q47j062j32J327J821Q56
$$ 301605 302439 302588 302500 302942 304085 305583 307196 308858 310351 311281 311315 310468 309406 309274 310601 312422 313278
61538C13278j50K20J425K075K184K702L400L066J705P38P83R00M23M2M33J019
$$ 313278 313128 313348 314773 316848 319032 321734 325134 328200 329905 330643 331426 332326 332749 332791 333224 334243
61522C34243Q45j74j359k019j822j078p36j404k396k547j770r09k97L92R93Q25
$$ 334243 335088 334914 333555 331536 329714 328636 327900 326496 324100 321553 319783 318874 318577 318969 319962 320787
61506C20787m7p20q18q30j024j085j018j225j522j235m64o1j75l1O11J039R12
$$ 320787 320740 320020 319202 318372 317348 316263 315245 314020 312498 311263 310799 310738 310563 310532 311143 312182 313094
61489C13094P39O91K42n33o39K28R37O17p9j06M60Q97J041J144J189J062R41R95
$$ 313094 313833 314524 314766 314233 313594 313822 314759 315376 315297 315191 315651 316548 317589 318733 319922 320984 321925 322920
61471C22920J147J390J776J920J269J79k78J48M47q7q10p95j21N20Q19Q26O09
$$ 322920 324067 325457 327233 329153 330422 330601 330323 330471 330918 330831 330021 329226 329105 329625 330444 331270 331879
61454C31879M20O29J049R89L08k17J0O62J142J197O75m45j401j030O40K097K276
$$ 331879 332299 332928 333977 334966 335274 335057 335067 335729 336871 338068 338743 338298 336897 335867 336507 338604 340880
61437C40880J847J955K561K847K534J958J430J225J615K230K043P49n18o21M8
$$ 340880 342727 344682 347243 350090 352624 354582 356012 357237 358852 361082 363125 363874 363356 362735 362783
61422C62783L52J77L56J094J501Q91k95r98o42M38J419J772J676J491J048n3j503
$$ 362783 363135 363312 363668 364762 366263 367154 366859 365861 365219 365657 367076 368848 370524 372015 373063 373010 371507
61405C71507k369k307j964j927j945j651j267j116j079j068j400k064k219j229
$$ 371507 369138 366831 364867 362940 360995 359344 358077 356961 355882 354814 353414 351350 349131 347902
61391C47902K46R59O68K11K13M20M02K69M59J090J694J676R72K58K94J097J957
$$ 347902 348148 349107 349775 349986 350199 350619 351021 351290 351749 352839 354533 356209 357181 357439 357733 358830 360787
61374C60787K281K091J694J282R42P44P20R11J379J984K289K078J709J561J475
$$ 360787 363068 365159 366853 368135 369077 369821 370541 371452 372831 374815 377104 379182 380891 382452 383927
61359C83927J270J438K513L993M828M861M906N400N964O322O708P174P414P442
$$ 383927 385197 386635 389148 393141 397969 402830 407736 413136 419100 425422 432130 439304 446718 454160
61345D54160P584P620O843N151L294J847Q78O02J315K397K573J607O52M82M79
$$ 454160 461744 469364 476207 481358 484652 486499 487377 487979 489294 491691 494264 495871 496523 497005 497484
61330D97484o2o94o76k84m18j448k931m065m114l062j986k000k683k510r93P44
$$ 497484 497422 496728 496052 495768 495350 493902 490971 486906 482792 479730 477744 475744 473061 470551 469558 470302
61314D70302J846K759L894M638M581M508N174O130O781P591R131J0777J1542J1459
$$ 470302 472148 474907 478801 483439 488020 492528 497702 503832 510613 518204 527335 538112 549654 561113
61300E61113J1089J0272Q553O245L977J685q36k884l627l563l996n156o079o269
$$ 561113 572202 582474 591027 597272 601249 602934 602098 599214 595587 592024 588028 582872 576793 570524
61286E70524o393o974p476p135o099n190m847m678m000k628j023K98J281K086
$$ 570524 564131 557157 549681 542546 536447 531257 526410 521732 517732 515104 514081 514379 515660 517746
61272E17746K638K849L029L465L752L310K474K137K371K404K116K387L670N217
$$ 517746 520384 523233 526262 529727 533479 536789 539263 541400 543771 546175 548291 550678 554348 559565
61258E59565O266O942P537P816P604P153O430M989L073J769J503J414Q03N3n29
$$ 559565 565831 572773 580310 588126 595730 602883 609313 614302 617375 619144 620647 622061 622864 622917 622388
61243F22388j530l151m384m581m726n774o743n942l539j383o90j108j818k256
$$ 622388 620858 617707 613323 608742 604016 598242 591499 585557 582018 580635 579945 578837 577019 574763
61229E74763j961p66P62J876K511L004L362L436L450L679L982M177M428M733M651
$$ 574763 572802 572036 572798 574674 577185 580189 583551 586987 590437 594116 598098 602275 606703 611436 616087
61214F16087M142L971M583N318N410M990M387L355J915J014J263J891K057K328
$$ 616087 620229 624200 628783 634101 639511 644501 648888 652243 654158 655172 656435 658326 660383 662711
61200F62711L563N185O090O627Q056J0457J2732J4499J6417J8541J9775J9212
$$ 662711 666274 671459 677549 684176 692232 702689 715421 729920 746337 764878 784653 803865
61188H03865J7025J3966J0848Q478P119O019M284K166O57L3l31r28j810l092m799
$$ 803865 820890 834856 845704 854182 861301 867320 871604 873770 874427 874460 874129 873201 871391 868299 863500
61173H63500o339p005p019p266q106r169j0119j0908j1460j1830j2460j3528j4420
$$ 863500 857161 850156 843137 835871 827765 818596 808477 797569 786109 774279 761819 748291 733871
61160G33871j4450j3818j3141j2503j1758j1179j0951j0441q980o968n292m064
$$ 733871 719421 705603 692462 679959 668201 657022 646071 635630 626650 619682 614390 610326
61148F10326k811j429k1J581L083L132P85k843n633o854p242p208o452n191m233
$$ 610326 607515 606086 606065 607646 610729 613861 614646 611803 606170 599316 592074 584866 578414 573223 568990
61133E68990l682k770j157O70K363M062N738P106Q231R392J0451J1149J1873J3280
$$ 568990 565308 562538 561381 562051 564414 568476 574214 581320 589551 598943 609394 620543 632416 645696
61119F45696J5375J7784K0489K3363K5438K5907K5431K5305K5635K5698K5627
$$ 645696 661071 678855 699344 722707 748145 774052 799483 824788 850423 876121 901748
61108I01748K6168K6894K6311K3983K1172J9026J7369J5549J3296J0362O378J515
$$ 901748 927916 954810 981121 1005104 1026276 1045302 1062671 1078220 1091516 1101878 1108256 1109771
61096A109771l350p472j0664j3002j4820j6819j9347k1716k2992k3275k3336k3358
$$ 1109771 1106421 1098949 1088285 1075283 1060463 1043644 1024297 1002581 979589 956314 932978 909620
61084I09620k2957k2156k1306k0328j9002j7641j6491j4923j2369r632q007p434
$$ 909620 886663 864507 843201 822873 803871 786230 769739 754816 742447 732815 724808 717374
61072G17374o822n755m578l108q39J734L434M010M253M683N279O142P242P957
$$ 717374 710552 704797 700219 697111 696272 698006 701440 705450 709703 714386 719665 725807 733049 741006
61058G41006Q089Q696J0537J2501J3241J3578J5177J7638J9143J9596K0618K2611
$$ 741006 749095 757791 768328 780829 794070 807648 822825 840463 859606 879202 899820 922431
61046I22431K4354K5604K7490L0018L1624L1829L2098L3430L5168L6748L8610
$$ 922431 946785 972389 999879 1029897 1061521 1093350 1125448 1158878 1194046 1230794 1269404
61035A269404M0812M2660M4198M6164M8158M8948M8863M9654N1569N2951N3193
$$ 1269404 1310216 1352876 1397074 1443238 1491396 1540344 1589207 1638861 1690430 1743381 1796574
61024A796574N3586N4689N5503N5990N7785O1580O6487P2774Q2325R5238J08957
$$ 1796574 1850160 1904849 1960352 2016342 2074127 2135707 2202194 2274968 2357293 2452531 2561488
61013B561488J21986J35677J51310J68848J89929K18281K55361K99536L51528
$$ 2561488 2683474 2819151 2970461 3139309 3329238 3547519 3802880 4102416 4453944
61004D453944M16126M96338N92031P08400Q58369J048996J271137J510198J755146
$$ 4453944 4870070 5366408 5958439 6666839 7525208 8574204 9845341 11355539 13110685
60995A3110685J973522K077569J950232J542020R46067L56093o2975k61424k75640
$$ 13110685 15084207 17161776 19112008 20654028 21600095 21956188 21893213 21631789 21356149
60986B1356149j53160N9172K66083L17878R9585l68603r35797j429279j755404
$$ 21356149 21202989 21262161 21528244 21846122 21945707 21577104 20641307 19212028 17456624
60977A7456624j909660j925293j835773j673335j473029j264027j062523q76994
$$ 17456624 15546964 13621671 11785898 10112563 8639534 7375507 6312984 5435990
60969E435990p14619n79425m69505l80520l09872k55552k13938j81334j55946
$$ 5435990 4721371 4141946 3672441 3291921 2982049 2726497 2512559 2331225 2175279
60960B175279j36589j21209j08124r7125q8072p9782p1347o3016n4954m6674l8602
$$ 2175279 2038690 1917481 1809357 1712232 1624160 1544378 1473031 1410015 1355061 1308387 1269785
60949A269785l2584k9746k9201k9590l0471l1328l0919k8830k6443k5192k4839
$$ 1269785 1237201 1207455 1178254 1148664 1118193 1086865 1055946 1027116 1000673 975481 950642
60938I50642k4429k3770k3019k1865k0274j9104j8938j9091j8672j7859j7172
$$ 950642 926213 902443 879424 857559 837285 818181 799243 780152 761480 743621 726449
60927G26449j6310j4813j3213j2374j2051j1186r481p768o902o885p099o916o116
$$ 726449 710139 695326 682113 669739 657688 646502 637021 629253 622351 615466 608367 601451 595335
60914E95335m972l869k782j469j52N45N00M01Q42J616K160K206J751R28J60m2
$$ 595335 590363 586494 583712 582243 582091 582636 583136 583537 584379 585995 588155 590361 592112 593040 593200 593158
60898E93158K25K95j13n37p04j144k406m111n347n691n420m983m710m822n269
$$ 593158 593383 593678 593565 593028 592324 591180 588774 584663 579316 573625 568205 563222 558512 553690 548421
60883E48421n694n851n879o006o175o309o626p293p881p635o406n026m455m662
$$ 548421 542727 536876 530997 524991 518816 512507 505881 498588 490707 483072 476666 471640 467185 462523
60869D62523m651l666k110r85n88k93M36J367K045K444K755K977L083L195L213
$$ 462523 457872 454206 452096 451111 450523 450230 450666 452033 454078 456522 459277 462254 465337 468532 471745
60854D71745K739J819J183J266J546J486J531K263L071K748J246k72j036j359
$$ 471745 474484 476303 477486 478752 480298 481784 483315 485578 488649 491397 492643 492371 491335 489976
60840D89976j550j311n73p8n24j680k825l671m419n255o092o600o346n114l281
$$ 489976 488426 487115 486542 486464 485940 484260 481435 477764 473345 468090 461998 455398 449052 443938 440657
60825D40657j593m80J40M08K06n87j756k772l094k528j525r65j337k263l052l532
$$ 440657 439064 438584 438724 439132 439338 438751 436995 434223 431129 428601 427076 426111 424774 422511 419459 415927
60809D15927m026m659n170n276m915m203l458l081l101l006k367j427p21m17m20
$$ 415927 411901 407242 402072 396796 391881 387678 384220 381139 378038 375032 372665 371238 370517 370100 369680
60794C69680p69j384j730j345n35JM9j97o78j304j509q27K20O79N38O76J361J789
$$ 369680 368911 367527 365797 364452 363917 363918 363967 363770 363092 361788 360279 359452 359672 360351 360889 361565 362926 364715
60776C64715J397P68P04J062J154Q70P69J176J742J983J890J814J883J868J634
$$ 364715 366112 366880 367584 368646 369800 370670 371439 372615 374357 376340 378230 380044 381927 383795 385429
60761C85429J476J625J692J117K12k6O63J240P38m40j254j510j819k344k468j716
$$ 385429 386905 388530 390222 391339 391551 391525 392188 393428 394166 393726 392472 390962 389143 386799 384331 382615
60745C82615l68R12J596J455O46l31j091j740k579l613m547n084n027m405l690
$$ 382615 382247 383159 384755 386210 386856 386525 385434 383694 381115 377502 372955 367871 362844 358439 354749
60730C54749l445l597l540l093k700k420j691n55p1o94j280p73O5o8p31l84J049
$$ 354749 351304 347707 344167 341074 338374 335954 334263 333708 333637 332943 331663 330890 330955 330887 330156 329772 330821
60713C30821J962J423K55n05p86p50j05J130K108K131J576J310J625K164K536
$$ 330821 332783 334206 334461 333956 333170 332420 332315 333445 335553 337684 339260 340570 342195 344359 346895
60698C46895K699K882L248L528L133J927N98r7j50J5K59N73O73N18P11J589K321
$$ 346895 349594 352476 355724 359252 362385 364312 364910 364813 364663 364678 364937 365510 366183 366701 367412 369001 371322
60681C71322J860N43l14j76L90R12J440J787J571J009P63Q32O27J00k08l15q42
$$ 371322 373182 373725 373411 373235 373625 374537 375977 377764 379335 380344 381107 381939 382566 382666 382458 382143 381301
60664C81301j804k418k375k184k059j641j154j524k766l416k454q64l02q46j026
$$ 381301 379497 377079 374704 372520 370461 368820 367666 366142 363376 359960 357506 356642 356340 355494 354468
60649C54468J93K285L927M317L686K857K397K203J853J169K26q80j855k199j880
$$ 354468 354661 356946 360873 365190 368876 371733 374130 376333 378186 379355 379581 378701 376846 374647 372767
60634C72767j699k273k992k787j677o63k74k19l15p09j093q19J1M73J41l75m12
$$ 372767 371068 368795 365803 363016 361339 360676 360402 360183 359868 359159 358066 357247 357258 357731 357872 357497 357085
60617C57085LN31R24R03M18M0L23Q06O24k3j10M46N79j14o26j25Q26J272J113
$$ 357085 357088 357619 358543 359446 359864 359904 360227 361033 361657 361634 361524 361970 362549 362435 361809 361684 362510 363782 364895
60598C64895P22K12l23m93j30M64J096J867K569K666K161J691J501J176N78J47
$$ 364895 365617 365829 365506 365013 364883 365347 366443 368310 370879 373545 375706 377397 378898 380074 380652 380799
60582C80799n8n86j503k017j673q95j8J179K526L186L012L021L835M690M853M928
$$ 380799 380741 380155 378652 376635 374962 374067 374049 375228 377754 380940 383952 386973 390808 395498 400351 405279
60566D05279N771P080Q132R100J0387J1288J0645Q576O392M871L484J418j340
$$ 405279 411050 418130 426262 435362 445749 457037 467682 476258 482650 487521 491005 492423 491083
60553D91083m028n768o200n699m933m150l177k076j162l20R80K746M293N345O467
$$ 491083 487055 481287 475087 469388 464455 460305 457128 455052 453890 453570 454550 457296 461589 466934 473401
60538D73401Q022R494J0359J0946J1812J2889J3753J4160J3890J2666J0651Q351
$$ 473401 481423 490917 501276 512222 524034 536923 550676 564836 578726 591392 602043 610394
60526F10394N725K182k070n571p207p442p425p576p773q079q376p952o351m221
$$ 610394 616119 618301 616231 610660 603453 596011 588586 581010 573237 565158 556782 548830 542479 538258
60512E38258k507j259K5J316K084K190K106K406L421N139P213R378J1927J5215
$$ 538258 535751 534492 534517 535833 537917 540107 542213 544619 548040 553179 560392 569770 581697 596912
60498E96912J8761K1702K4217K7375L1333L4944L7572L9860M1936M2351L9898
$$ 596912 615673 637375 661592 688967 720300 755244 792816 832676 874612 916963 956861
60487I56861L5307K9909K3694J6015P213j847j1074k0487k8958l5145l9199m2111
$$ 956861 992168 1022077 1045771 1061786 1068999 1067152 1056078 1035591 1006633 971488 932289 890178
60475H90178m3875m3792m2173m0123l7788l4421l0171k6275k3341k0750j8082
$$ 890178 846303 802511 760338 720215 682427 648006 617835 591560 568219 547469 529387
60464E29387j5832j4353j3198j1912j0557r159p515n848m763m245l580k535j809
$$ 529387 513555 499202 486004 474092 463535 454376 446861 441013 436250 432005 428425 425890 424081
60451D24081j931k453k724k755k858k935k754k546k720l090k875j595K01J337
$$ 424081 422150 419697 416973 414218 411360 408425 405671 403125 400405 397315 394440 392845 393046 394383
60437C94383J202L90o7k8k49j044j666j420p88p23j254j488q35M11J547K010J570
$$ 394383 395585 395975 395908 395880 395631 394587 392921 391501 390713 389990 388736 387248 386413 386824 388371 390381 391951
60420C91951N21l64n03l9N59J131J695K040J971J723J634J567J225P46N15N06
$$ 391951 392472 392108 391605 391566 392125 393256 394951 396991 398962 400685 402319 403886 405111 405857 406372 406878
60404D06878L75J46K51R35J928K753L126L124L058L074K868K146J305J147J786
$$ 406878 407253 407399 407650 408585 410513 413266 416392 419516 422574 425648 428516 430662 431967 433114 434900
60389D34900K497K798K993L360L639L746M136M842M991M033K766K313K550K485
$$ 434900 437397 440195 443188 446548 450187 453933 458069 462911 467902 471935 474701 477014 479564 482049
60375D82049J763R81P78J281K236L137L545L661M119M811M674L219J506Q61J297
$$ 482049 483812 484793 485571 486852 489088 492225 495770 499431 503550 508361 513035 516254 517760 518621 519918
60360E19918K033K755L471L811L639L763M947O613P666Q190R097J0417J1187J0906
$$ 519918 521951 524706 528177 531988 535627 539390 544337 550950 558616 566806 575903 586320 597507 608413
60346F08413R960Q617O746M496K291P2k566n431p801r383j0419j0834j0214q618
$$ 608413 618373 626990 633736 638232 640523 640595 638029 632598 624797 615414 604995 594161 583947 575329
60332E75329o740n154m025l448l397l468l368l466m187n086n337m959m675m686
$$ 575329 568589 563435 559410 555962 552565 549097 545729 542263 538076 532990 527653 522694 518019 513333
60318E13333m426l516k199q27M61J643K963M916P557J0102J1920J3458J5440J7565
$$ 513333 508907 505391 503192 502365 502826 504469 507432 512348 519905 530007 541927 555385 570825 588390
60304E88390J8913J9255J8980J8095J6316J3885J1268Q239M258m78n297j0061
$$ 588390 607303 626558 645538 663633 679949 693834 705102 713341 717599 717121 711824 701763
60292G01763j4813j8782k0975k1545k1347k0310j7744j4102j0963q985p316n358
$$ 701763 686950 668168 647193 625648 604301 583991 566247 552145 541182 532197 524881 519523
60280E19523l720l017k864k718k677k904l092l058l077l217l012k223j330r49
$$ 519523 515803 512786 509922 507204 504527 501623 498531 495473 492396 489179 486167 483944 482614 481665
60266D81665j196j810k335k270j541q68j022j839k614l101l340k863j307M43J065
$$ 481665 480469 478659 476324 474054 472513 471645 470623 468784 466170 463069 459729 456866 455559 456002 457067
60251D57067O47M87R78J202Q34Q72J904K965K914J958R85L28j02j69K17O49O17
$$ 457067 457714 458201 459179 460381 461215 462087 463991 466956 469870 471828 472813 473141 473039 472870 473087 473736 474353
60234D74353O2o86j176r96j98M94N41M50R80J797J989J747K126L147L569K910
$$ 474353 474415 473729 472553 471557 471359 471853 472394 472844 473824 475621 477610 479357 481483 484630 488199 491109
60218D91109K270K637L640M562N441O387O956O887O666O719O904P237Q086R131
$$ 491109 493379 496016 499656 504218 509659 516046 523002 529889 536555 543274 550178 557415 565501 574632
60204E74632R235Q068O820O549O763O472N668M934M419M099M208M529M016K126
$$ 574632 583867 591935 598755 605304 612067 618539 624207 629141 633560 637659 641867 646396 650412 652538
60190F52538j48j520k047k595l257l497l420l764m654n398n526n335n238n192
$$ 652538 652390 650870 648823 646228 642971 639474 636054 632290 627636 622238 616712 611377 606139 600947
60176F00947m943m471m044l896l842l389k455j767j965k504k308j459j175j863
$$ 600947 596004 591533 587489 583593 579751 576362 573907 572140 570175 567671 565363 563904 562729 560866
60162E60866k413j957j176j008j090n40L91O94K23j32J56O32O70K69j45k50p2
$$ 560866 558453 556496 555320 554312 553222 552682 553073 553767 553990 553858 554014 554646 555316 555585 555440 555190 555118
60145E55118J16J73L98J148K137K654K657L011M298N923O874O849O270N587N122
$$ 555118 555234 555407 555805 556953 559090 561744 564401 567412 571710 577633 584507 591356 597626 603213 608335
60130F08335N136N565N877N581M693L531K352J386Q39O78P49J120J870K563K645
$$ 608335 613471 619036 624913 630494 635187 638718 641070 642456 643295 643973 644722 645842 647712 650275 652920
60115F52920K397K690L602M165L766K855J880N72j118k301k274j669j640k358
$$ 652920 655317 658007 661609 665774 669540 672395 674275 674847 673729 671428 669154 667485 665845 663487
60101F63487l099l422l474l495l696m372n482o343o271n313l972k590j425q37
$$ 663487 660388 656966 653492 649997 646301 641929 636447 630104 623833 618520 614548 611958 610533 609696
60087F09696q06o08L48J558J919J052l55j458k035k307k410k228j763j510k120
$$ 609696 608890 608282 608630 610188 612107 613159 612804 611346 609311 607004 604594 602366 600603 599093 596973
60072E96973l452m377m099l342l544m903o189o476o170o037o171o233o010n363
$$ 596973 593521 589144 585045 581703 578159 573256 567067 560591 554421 548384 542213 535980 529970 524607
60058E24607m301l334l061l163k725j678r84j059j098m20N53J352K330L739M848
$$ 524607 520306 516972 513911 510748 508023 506345 505361 504302 503204 502784 503337 504689 507019 510758 515606
60043E15606M966M559M458M621M536M278M244M358M368M426M556M077K519O69
$$ 515606 520572 525131 529589 534210 538746 543024 547268 551626 555994 560420 564976 569053 571572 572241
60029E72241l02m59r20k143l395l916l936m251n288o705p758q059p989q209q762
$$ 572241 571939 571480 570560 568417 565022 561106 557170 552919 547631 540926 533168 525109 517120 508911 500149
60014E00149r097q923q494p926o963n642m465l597k618j420o12o04r79j220j351
$$ 500149 491052 482129 473635 465709 458746 453104 448639 445042 442424 441004 440392 439788 438809 437589 436238
59999D36238j375q87J99J192J478J303J156J053Q82Q63J134J418J608K048K841
$$ 436238 434863 433976 434175 435367 436845 438148 439304 440357 441239 442102 443236 444654 446262 448310 451151
59984D51151L519L784L885L924L587K884K203J307o08l320n243n386m615m076
$$ 451151 454670 458454 462339 466263 469850 472734 474937 476244 475636 472316 467073 461687 457072 452996
59970D52996l608k643j603j167j019n18L6j7m58o14m49l25j86J42M38O19J104
$$ 452996 449388 446745 445142 443975 442956 442438 442474 442457 441999 441385 440936 440611 440425 440567 441005 441624 442728
59953D42728J818J767N67n12j65J062J724J511J084O69J71M5O69J291R84K02P9
$$ 442728 444546 446313 446880 446368 446203 447265 448989 450500 451584 452253 452424 452469 453138 454429 455413 455615 455694
59936D55694N58N61l10j463k440l112l062j943l00J080K268L654M775M969M659
$$ 455694 456252 456813 456503 455040 452600 449488 446426 444483 444183 445263 447531 451185 455960 460929 465588
59921D65588M775N170M998M208L385K382O79j189k059j930j845k033j646m64N85
$$ 465588 470363 475533 480531 484739 488124 490506 491185 489996 487937 486007 484162 482129 480483 480019 480604
59906D80604Q86R01J196J732K332K857K919K385K058K762L897M101L242K455K267
$$ 480604 481490 482391 483587 485319 487651 490508 493427 495812 497870 500632 504529 508630 511872 514327 516594
59891E16594K162K110K891M546N897O242O257O601O805O263N392N014N227N555
$$ 516594 518756 520866 523757 528303 534200 540442 546699 553300 560105 566368 571760 576774 582001 587556
59877E87556N685N514M948M093L358K993K712J929K47k151m369n408n271n079
$$ 587556 593241 598755 603703 607796 611154 614147 616859 618788 619035 616884 612515 607107 601836 596757
59863E96757n604o331o475o164n763m801k832p57R8j28j73M29J242K415M610P374
$$ 596757 591153 584822 578347 572183 566420 561619 558787 558030 558128 558000 557827 558256 559498 561913 566523 573897
59847E73897R217R658R727J0034R712P918N214K798J225L70m6l45o28n40Q8M77
$$ 573897 583114 592772 602499 612533 622245 630163 635377 638175 639400 639770 639724 639379 638751 638211 638299 638776
59831F38776l38k053l477m253m993n730n654m697l976m130m382l917l153k987
$$ 638776 638438 636385 632908 628655 623662 617932 612278 607581 603605 599475 595093 591176 588023 585036
59817E85036l614m622n594o078n662m554l571l209l222l305l542l993m356m290
$$ 585036 581422 576800 571206 565128 559466 554912 551341 548132 544910 541605 538063 534070 529714 525424
59803E25424l621k392j144q16j643k500k278j450j217j504j233l27J71k8j10J24
$$ 525424 521803 519411 518267 517451 515808 513308 511030 509580 508363 506859 505626 505299 505470 505442 505332 505456
59787E05456j53j073j503q29N5K31L7J14K76J06k27l94l97k10K38M67j67j168
$$ 505456 505303 504230 502727 501898 501953 502184 502221 502335 502611 502717 502490 502096 501699 501489 501727 502194 502027 500859
59769E00859j151K39J724K196J924J516R48L23L98J480K699L190L174L196L206
$$ 500859 499708 499947 501671 503867 505791 507307 508255 508578 508976 510456 513155 516345 519519 522715 525921
59754E25921L043L008L265L503L688M361N551O340O132N572N450N561N278M535
$$ 525921 528964 531972 535237 538740 542428 546789 552340 558680 564812 570384 575834 581395 586673 591208
59740E91208L632K784K331K668L492L934L774L568L291K146K70q29l39N94O93
$$ 591208 594840 597624 599955 602623 606115 610049 613823 617391 620682 622828 623098 622269 621930 622524 623217
59725F23217L91O82J208R27j11r88j333j401j231q35p14j186j638j434j050j310
$$ 623217 623608 624290 625498 626425 626314 625326 623993 622592 621361 620526 619812 618626 616988 615554 614504 613194
59709F13194j996k240j923j577j320r25o56r26j295q85K80J269J612J723J993
$$ 613194 611198 608958 607035 605458 604138 603213 602557 601631 600336 599451 599731 601000 602612 604335 606328
59694F06328K326K735L568M823N763N570M091J892k08j639k380k791l055k996
$$ 606328 608654 611389 614957 619780 625543 631113 635204 637096 636888 635249 632869 630078 627023 624027
59680F24027k564k143k085k257k429k859m010n759p237p546o623n344m693m741
$$ 624027 621463 619320 617235 614978 612549 609690 605680 599921 592684 585138 578515 573171 568478 563737
59666E63737m681m014l264l051k978k289j247p83q92n58N82J725K338K935L823
$$ 563737 559056 555042 551778 548727 545749 543460 542213 541430 540538 539980 540562 542287 544625 547560 551383
59651E51383M201L378K030J372J616J994J918J379N20n65j715k747l536l999m187
$$ 551383 555584 558962 560992 562364 563980 565974 567892 569271 569791 569226 567511 564764 561228 557229 553042
59636E53042m412m780m769l839k402j398r82n07J88M37l0o10q75j207k014l073
$$ 553042 548630 543850 539081 535242 532840 531442 530460 529953 530141 530578 530548 529938 529063 527856 525842 522769
59620E22769m013m678m840m320l549l140k887k206j503j748k580k385o79J186
$$ 522769 518756 514078 509238 504918 501369 498229 495342 493136 491633 489885 487305 484920 484241 485427
59606D85427K194K886L692L758K651J652J934K646K359J365J006J459J711J342
$$ 485427 487621 490507 494199 497957 500608 502260 504194 506840 509199 510564 511570 513029 514740 516082
59592E16082R00Q32J069J509J931J797R11r4o67j142j891k386k112j746k317l544
$$ 516082 516982 517814 518883 520392 522323 524120 525031 524937 524270 523128 521237 518851 516739 514993 512676 509132
59576E09132m145l579k531j810j594j627j499r25k70l57j201j522l35J516K311
$$ 509132 504987 501408 498877 497067 495473 493846 492347 491422 491152 490795 489594 488072 487737 489253 491564
59561D91564J659Q05Q80J635K015J405J69p51q05l73j56j58J24O81R79J117J925
$$ 491564 493223 494028 494908 496543 498558 499963 500132 499381 498576 498203 498047 497889 498013 498694 499673 500790 502715
59544E02715L566N001N388N244N637O958Q932J1247J3693J6195J8745K0526J9438
$$ 502715 506281 511282 516670 521914 527551 534509 543441 554688 568381 584576 603321 623847 643285
59531F43285J3958N664j593n562p181p984p841o247l993k097m20J303K265J856
$$ 643285 657243 662907 661314 655752 648571 640587 632746 626499 622506 620409 619989 621292 623557 625413
59517F25413J046J021J292N23j512m001o314q018q562q120p942q665r241q642
$$ 625413 626459 627480 628772 629295 627783 623782 617468 609450 600888 592768 584826 576161 566920 558278
59503E58278p536o970o497n275l943l622l809l164j876j338j738j759o93O78J491
$$ 558278 550742 543772 537275 532000 528057 524435 520626 517462 515586 514248 512510 510751 510058 510736 512227
59488E12227J722J639J377J172J220J362J533K157L422M730N605O411P388P880
$$ 512227 513949 515588 516965 518137 519357 520719 522252 524409 527831 532561 538166 544577 551965 559845
59474E59845P514P250Q031R169R265Q097O342M297K109M81k34r04k194l078k239
$$ 559845 567359 574609 582640 591809 601074 609171 615513 619810 621919 622400 622166 621262 619068 615990 613751
59459F13751j77J653L066M790O579P480P635P960Q431Q347Q029Q470R431R653
$$ 613751 613574 615227 618293 623083 629662 637142 644777 652737 661168 669515 677544 686014 695445 705098
59445G05098Q911Q146P528N998K947r36m750q010j0199j0857j0327r461q589p565
$$ 705098 714009 722155 729683 735681 738628 737692 732942 724932 714733 703876 693549 684088 675499 667934
59431F67934o559n866n270m525m001l920l559k299o99N35J959M413P423R986J2269
$$ 667934 661375 655509 650239 645714 641713 637793 634234 631935 631236 631771 633730 638143 645566 655552 667821
59416F67821J5084J8343K1314K3790K5797K7159K8440L0647L2312K8782J7270
$$ 667821 682905 701248 722562 746352 772149 799308 827748 858395 890707 919489 936759
59405I36759J421j1936j9627k2945k3069j9559j3196o343J65P023J2584J2533
$$ 936759 938180 926244 906617 883672 860603 841044 827848 821505 821670 828693 841277 853810
59393H53810N109o033j5778k2135k5675k6886k6024k3890k1008j7205j2979r837
$$ 853810 858919 852886 837108 814973 789298 762412 736388 712498 691490 674285 661306 651469
59381F51469q237o731m256j722k89M66J373K063J808R65L33Nj74J44J140K171
$$ 651469 643232 636501 632245 630523 630234 630700 632073 634136 635944 636909 637242 637247 637073 637217 638357 640528
59365F40528K500K086J228K67l4J044K962M236M394M485N288O367P363Q807J0910
$$ 640528 643028 645114 646342 646609 646575 647619 650581 654817 659211 663696 668984 675351 682714 691521 702431
59350G02431J2811J3859J4585J5670J6915J7873J8549J8898J8540J7486J6261
$$ 702431 715242 729101 743686 759356 776271 794144 812693 831591 850131 867617 883878
59339H83878J4886J2712R607O289L175jl233o002q353j0952j3806j6113j7654
$$ 883878 898764 911476 921083 927372 930547 930546 927313 921311 912958 902006 888200 872087 854433
59326H54433j8985k0040k0003j8875j7700j6770j5202j2821j0895j0208r933r213
$$ 854433 835448 815408 795405 776530 758830 742060 726858 714037 703142 692934 683001 673788
59314F73788q508q403q377p690o573n617m904m357m020l531k173N2K338M285O165
$$ 673788 665280 656877 648500 640810 634237 628620 623716 619359 615339 611808 609635 609687 612025 616310 622475
59299F22475P916R262J0678J2560J3248J0020K805m981j0180j2763j4087j4360
$$ 622475 630391 639653 650331 662891 676139 686159 688964 683983 673803 661040 646953 632593
59287F32593j3267j1434r652p671n121k616p70Q67K678L935M044L913M774O446
$$ 632593 619326 607892 598240 590569 585448 582832 582062 582929 585607 589542 593586 597499 602273 608719
59273F08719P957R217J0861J2888J4532J5170J4720J3558J2451J2031J1840J0682
$$ 608719 616676 625893 636754 649642 664174 679344 694064 707622 720073 732104 743944 754626
59261G54626Q239N438K961M62k265m564o072p466r232j0670j0900j0093q944p732
$$ 754626 762865 768303 771264 771726 769461 764897 758825 751359 742127 731457 720557 710464 701520 693788
59247F93788o521n546m785l775k293o33R71K469L563M050M512N584O661O670N984
$$ 693788 687267 681721 676936 673161 670868 670235 671206 673675 677238 681288 685800 691384 698045 704715 710699
59232G10699N919O355N753L825K158J627J048p54l319n794q158j0282j1382j1332
$$ 710699 716618 722973 728726 732551 734709 736336 737384 736630 733311 727517 719359 709077 697695 686363
59218F86363j1125j1275j1133j0402r785r420q442o767n644n559n425m595l903
$$ 686363 675238 663963 652830 642428 632643 623223 614781 608014 602370 596811 591386 586791 582888
59205E82888l755l150j656m77m14n74k30n3l30L7J366K095J390Q63J946L419L483
$$ 582888 579133 575983 574327 573850 573436 572862 572632 572579 572249 572286 573652 575747 577137 578000 579946 583365 586848
59188E86848K574K163K221J965J822K570L605L863L603L619L757L664L884M655
$$ 586848 589422 591585 593806 595771 597593 600163 603768 607631 611234 614853 618610 622274 626158 630813
59174F30813M879L823K666K666L070K630J891K193L408M479N248N976O088N115
$$ 630813 635692 639515 642181 644847 647917 650547 652438 654631 658039 662518 667766 673742 679830 684945
59160F84945L886L209K370O09j161j888k464m320o948q784r653j0353j0676r891
$$ 684945 688831 692040 694410 695019 693858 691970 689506 685186 678238 669454 659801 649448 638772 628881
59146F28881q549p875p803p402o737o628p028p176o917o519n791m626l723l522
$$ 628881 620332 612457 604654 597252 590515 583887 576859 569683 562766 556247 550456 545830 542107 538585
59132E38585l348k715k344k621k430j009M60Q32J118K651M585N291N086N324N903
$$ 538585 535237 532522 530178 527557 525127 524118 524578 525410 526528 529179 533764 539055 544141 549465 555368
59117E55368N993O261P908J0238J1488J1513J1453J1420J0740R893R846J0024
$$ 555368 561361 567622 575530 585768 597256 608769 620222 631642 642382 652275 662121 672145
59105F72145R073P322O227N868N122L972L416L351K670J278O8r00k226l489l687
$$ 672145 681218 688540 694767 700635 705757 709729 713145 716496 719166 720444 720512 719612 717386 713897 710210
59090G10210l068k625k184r82K84J36j188k051k117k637m063n371n878o042o279
$$ 710210 707142 704517 702333 701351 701635 701771 700583 698532 696415 693778 689715 684344 678466 672424 666145
59075F66145o580p131p955q252p486o624o696o878n786m002l301l885m474m579
$$ 666145 659565 652434 644479 636227 628741 622117 615421 608543 602757 598755 595454 591569 587095 582516
59061E82516m656m410l182j665j162j410j174n92q11j612j692r96o13n80j8P48
$$ 582516 577860 573450 570268 568603 567441 566031 564857 564265 563454 561842 560150 559154 558541 557961 557943 558691
59045E58691N05n30r30n42m64p14k39P26P43k31o18J65J010J294J637K200K308
$$ 558691 559196 558666 557736 557194 556730 556016 555777 556503 557246 557015 556397 556562 557572 558866 560503 562703 565011
59028E65011K083K463L427M041M451N764P862R325R816J0513J1945J3194J3469
$$ 565011 567094 569557 572984 577025 581476 587240 595102 604427 614243 624756 636701 649895 663364
59015F63364J2773J0962P984M909K945J564n09k778l634l123k741k693j872l88
$$ 663364 676137 687099 695083 699992 702937 704501 703992 701214 697580 694457 691716 689023 687151 686763
59001F86763M95R42K376M623N927O054O618P931Q327P174N880N157M035K316J391
$$ 686763 687258 688200 690576 695199 701126 707180 713798 721729 730056 737230 743110 748267 752302 754618 756009
58986G56009J644J589N52j92j8j76j279j979j417p65r31q12O69K667L962M892
$$ 756009 757653 759242 759794 759602 759584 759408 758129 756150 754733 753968 753037 752225 752894 755561 759523 764415
58970G64415O309Q019R415J0502J1389J1868J2130J2648J2975J2096J0301R026
$$ 764415 770724 778743 788158 798660 810049 821917 834047 846695 859670 871766 882067 891093
58958H91093Q559P664N864M073K543K21l200o526r049j1405j3831j5531j6408
$$ 891093 899652 907316 913180 917253 919796 920017 916817 910291 901242 889837 876006 860475 844067
58945H44067j7437j8545j8169j5808j3110j1498j0458r078p582o477n661n175
$$ 844067 826630 808085 789916 774108 760998 749500 739042 729964 722382 715905 710244 705069
58933G05069n252n258m226k760k528l456l597k247j018j115j729j920j996k143
$$ 705069 699817 694559 690333 687573 685045 681589 677992 675745 674727 673612 671883 669963 667967 665824
58919F65824j710p35k92n92n55Q4K72j62J6J129J920J930K328L611M724N275O332
$$ 665824 664114 663379 663087 662495 661940 662024 662296 662134 662150 663279 665199 667129 669457 673068 677792 683067 689399
58902F89399Q192R687J0548J2069J4407J5756J5342J4772J5199J5524J4742J3766
$$ 689399 697591 707278 717826 729895 744302 760058 775400 790172 805371 820895 835637 849403
58890H49403J3536J3555J3689J5089J7925K0331K1041K0968K0797J9403J6149
$$ 849403 862939 876494 890183 905272 923197 943528 964569 985537 1006334 1025737 1041886
58879A041886J2541R901P398L992L03k969o460j0459j3811j5983j8081k0331k0847
$$ 1041886 1054427 1064328 1071726 1075718 1076021 1073052 1066592 1056133 1042322 1026339 1008258 987927 967080
58866I67080j8648j5723j4204j3476j1986j0016q677p962p698q683j0983j2727
$$ 967080 948432 932709 918505 905029 893043 883027 874350 866388 858690 850007 839024 826297
58854H26297j2542j1651j1769j2432j2242j1370j0885j0868j0725j0289r371p518
$$ 826297 813755 802104 790335 777903 765661 754291 743406 732538 721813 711524 702153 694635
58842F94635n345m559n541o615o714o850p772q296p501o507o486o709o143n191
$$ 694635 689290 684731 679190 672575 665861 659011 651239 642943 635442 628935 622449 615740 609597 604406
58828F04406m413l271j600m22n7O24J950K562K034J951L021L637K880K284K946
$$ 604406 599993 596722 595122 594700 594643 595267 597217 599779 601813 603764 606785 610422 613302 615586 618532
58813F18532L530L062K900L861M119K360L49p0n7j218k448k137j221j290j663
$$ 618532 622062 625124 628024 631885 636004 638364 638713 638643 638586 637368 634920 632783 631562 630272 628609
58798F28609j303j424l267n205n111l872l609m090l891l490m164n156m872l686
$$ 628609 627306 625882 622615 617410 612299 608427 604818 600728 596837 593347 589183 584027 579155 575469
58784E75469k817j808J83J996K208J912K951M621M936L991L339L095K413J701
$$ 575469 572652 570844 571027 573023 575231 577143 580094 584715 589651 593642 596981 600076 602489 604190
58770F04190J702J422m28k928m256m482m662m523l424k389k619l227k840k116
$$ 604190 605892 607314 606886 603958 599702 595220 590558 586035 582611 580222 577603 574376 571536 569420
58756E69420k240k370j174N12J118J030J375J609R86P38K025L408L166K500L357
$$ 569420 567180 564810 563636 564148 565266 566296 567671 569280 570266 571004 573029 576437 579603 582103 585460
58741E85460M863N140M932N897O885N750L644L502N179N954N308N260O235O422
$$ 585460 590323 595463 600395 606292 613177 618927 622571 626073 631252 637206 642514 647774 654009 660431
58727F60431N334M619N055N639N798N914N756M893M284N067O325O483O129O838
$$ 660431 665765 670384 675439 681078 686876 692790 698546 703439 707723 712790 719115 725598 731727 738565
58713G38565Q125Q367P881Q055Q262O778M105K249J193q19l929o627q705j1269
$$ 738565 746690 755057 762938 770993 779255 786033 790138 792387 793580 792761 788832 782205 773500 762231
58699G62231j4116j5972j7002j8365j9729j9857j9065j8503j7717j5691j3428
$$ 762231 748115 732143 715141 696776 677047 657190 638125 619622 601905 586214 572786
58688E72786j2526j2074j0035o948n044m451l532k379k582l961m750m687m782
$$ 572786 560260 548186 538151 531203 526159 521708 518176 515797 513215 509254 504504 499817 495035
58675D95035m605k925n66N94R24K173L971M531M256N176P232Q621R321J0816J2664
$$ 495035 490430 487505 486939 487533 488457 490630 494601 499132 503388 508564 515796 524417 533738 544554 557218
58660E57218J2969J1885J1062J0015O791K082j155k264l365n234o357o371o763
$$ 557218 570187 582072 593134 603149 609940 612022 610867 608603 605238 600004 593647 587276 580513
58647E80513p732p726o554n768n695n126m093l844m061l199j549p63n61Q35L168
$$ 580513 572781 565055 558501 552733 547038 541912 537819 533975 529914 526715 525166 524403 523842 524677 527845
58632E27845M401M328M497M812L773J928J390K027J729M19J6N78K27j078j540
$$ 527845 532246 536574 541071 545883 549656 551584 552974 555001 556730 557149 557165 557743 557970 556892 555352
58617E55352j227j823k673j208K495N507O693P640Q713Q325O528N287M718L038
$$ 555352 554125 552302 549629 548421 550916 556423 563116 570756 579469 587794 594322 599609 604327 607365
58603F07365N30n08j90j111l488m540l438k608l231l580k798k275k317j400L13
$$ 607365 607895 607387 607197 606086 602598 598058 594620 592012 588781 585201 582403 580128 577811 576411 576724
58588E76724O78l01PK402M737O070P818J0080J0890J0121J0024J0996J0881R290
$$ 576724 577402 577101 577108 579510 584247 590317 598135 608215 619105 629226 639250 650246 661127 670417
58574F70417Q477Q967Q601O930O304P511Q558Q839J0250J3176J5616J7261K0049
$$ 670417 678894 687861 696462 703392 709696 717207 725765 734604 744854 758030 773646 790907 810956
58561H10956K3807K5939K6332K7673K9835K9174K4803K0292J7372J3307O629K55
$$ 810956 834763 860702 887034 914707 944542 973716 998519 1018811 1036183 1049490 1056119 1056374
58549A056374l557o422r514j0823r419p955q175q266p201p324r964j2822j4438
$$ 1056374 1052817 1046395 1036881 1026058 1016639 1008684 1000509 992243 985042 977718 967754 954932 940494
58536I40494j6890k1194k4347k4031k2269k1367k0110j7126j4157j2832j1554
$$ 940494 923604 902410 878063 854032 831763 810396 790286 773160 759003 746171 734617
58525G34617q756n969m798l994k290r93j207j501q22o79k141l692m126m460n121
$$ 734617 725861 719892 715094 711100 708810 707817 706610 705109 704287 703608 701467 697775 693649 689189 684068
58510F84068m618k828k078l092l520k266j473k322k790j511o7M04R67J711Q90
$$ 684068 679450 676622 674544 671452 667932 665666 664193 661871 659081 657570 657503 657907 658874 660585 661475
58495F61475j149j627l49l27j947j774J048K820J908J614L756N340M639M807P879
$$ 661475 660326 658699 658350 658023 656076 654302 655350 658170 660078 661692 665448 670788 675427 680234 688113
58480F88113J0701J0734J0598J2852J5310J5652J5735J7159J7275J3826R133N667
$$ 688113 698814 709548 720146 732998 748308 763960 779695 796854 814129 827955 837088 842755
58468H42755J951l191o961p340o991q334r160p273m884m189l174p3K571K721L165
$$ 842755 844706 841515 834554 827214 820223 811889 802729 795456 790572 786383 783209 783136 785707 788428 791593
58453G91593O487J0209J1385J1602J2872J2995R786N567K873m7m902r019r949
$$ 791593 798080 808289 819674 831276 844148 857143 866929 872496 875369 875322 870420 861401 851452
58440H51452j0018j1562j2268r965p425p347p254m456j499j325j667L16K444K101
$$ 851452 841434 829872 817604 807639 800214 792867 785613 781157 779658 778333 776666 776982 779426 781527
58426G81527J818M510P594P733P110Q921J0940R680O932N922M926J025l608n344
$$ 781527 783345 787855 795449 803182 810292 819213 830153 839833 846765 852687 857613 858638 855030 849686
58412H49686n525p202r094q755q042r431j0573q555n827n903o987n927m438n190
$$ 849686 844161 836959 827865 819110 811068 801637 791064 782509 776682 770779 763792 757865 753427 748237
58398G48237n764l006N12R75K87K010M277L619J947K785M269K899O56J274K999
$$ 748237 742473 739467 739979 740954 741241 743251 747528 751147 753094 755879 760148 763047 763703 764977 767976
58383G67976K117K18Q78K605K119J242L349O459O863O168P704R610Q628O941P989
$$ 767976 770093 770311 771189 773794 775913 777155 780504 786963 793826 799994 807698 817308 825936 832877 840866
58368H40866R425P638N288O661R540R571Q636J0820J4045J4058J2764J4176J5943
$$ 840866 850291 857929 863217 869878 879418 888989 897625 908445 922490 936548 949312 963488 979431
58355I79431J3593R400Q251Q496N755K045J974L527J946p76L18L426L511K141
$$ 979431 993024 1002424 1010675 1019171 1024926 1026971 1028945 1032472 1034418 1033642 1033960 1037386 1040897 1043038
58341A043038M140P818Q241O956Q708J1811J1677J0442J3038J7074J6990J4848
$$ 1043038 1047178 1054996 1063237 1070193 1078901 1090712 1102389 1112831 1125869 1142943 1159933 1174781
58329A174781J6432J9903J9147J5281J3953J4227J1217O685N900O848L918p02
$$ 1174781 1191213 1211116 1230263 1245544 1259497 1273724 1284941 1291626 1297526 1304374 1308292 1307590
58317A307590o95K362K254K59K151O207O385M509O896J1699J2254J0093J1857
$$ 1307590 1306895 1309257 1311511 1311770 1313921 1320128 1326513 1331022 1337918 1349617 1361871 1371964 1383821
58304A383821J6096J6311J4165J6200K0278J9220J5175J6074K0272J9452J4562
$$ 1383821 1399917 1416228 1430393 1446593 1466871 1486091 1501266 1517340 1537612 1557064 1571626
58293A571626J3953J7467J7543J4447J5300J9438J9920J8017K0896K6536K6637
$$ 1571626 1585579 1603046 1620589 1635036 1650336 1669774 1689694 1707711 1728607 1755143 1781780
58282A781780K2757K3651K8420K8705K5722K8039L4168L4909L1510L3484L9760
$$ 1781780 1804537 1828188 1856608 1885313 1911035 1939074 1973242 2008151 2039661 2073145 2112905
58271B112905M0543L6696L8304M4919M6683M4315M7920N6388N8614N5044N7034
$$ 2112905 2153448 2190144 2228448 2273367 2320050 2364365 2412285 2468673 2527287 2582331 2639365
58260B639365O4632O6546O2707O4737P2964P5413P1056P1375P7311P7678P2247
$$ 2639365 2703997 2770543 2833250 2897987 2970951 3046364 3117420 3188795 3266106 3343784 3416031
58249C416031P2967Q0393Q2819Q0453Q5771R8091J03392J01315J06010J18138
$$ 3416031 3488998 3569391 3652210 3732663 3818434 3916525 4019917 4121232 4227242 4345380
58239D345380J23640J22537J30228J47221J57385J59633J70541J91667K06106
$$ 4345380 4469020 4591557 4721785 4869006 5026391 5186024 5356565 5548232 5754338
58230E754338K11918K25935K49633K65550K72931K91191L22149L46016L61199
$$ 5754338 5966256 6192191 6441824 6707374 6980305 7271496 7593645 7939661 8300860
58221H300860L89076M32220M68832M96540N38767N98951O53659P00843P67390
$$ 8300860 8689936 9122156 9590988 10087528 10626295 11225246 11878905 12579748 13347138
58212A3347138Q58154R47857J035445J153110J308646J476277J659577J902088
$$ 13347138 14205292 15153149 16188594 17341704 18650350 20126627 21786204 23688292
58204B3688292K217811K574540K963263L414781L931210M480976N084040N816909
$$ 23688292 25906103 28480643 31443906 34858687 38789897 43270873 48354913 54171822
58196E4171822O711361P746474Q966464J0495568J2414490J4763414J7689863
$$ 54171822 60883183 68629657 77596121 88091689 100506179 115269593 132959456
58189A32959456K1384301K5771291L0451123L4987591L8846624M0745381L8517994
$$ 132959456 154343757 180115048 210566171 245553762 284400386 325145767 363663761
58182C63663761L0473482J7185512J590248j2915831k4341097l2246378l6800015
$$ 363663761 394137243 411322755 412913003 399997172 375656075 343409697 306609682
58175C06609682l8269973l7194527l4411860l0700884k6570236k2402430j8555338
$$ 306609682 268339709 231145182 196733322 166032438 139462202 117059772 98504434
58168I8504434j5236301j2443843j0117677q243636o781396n619064m665077l902544
$$ 98504434 83268133 70824290 60706613 52462977 45681581 40062517 35397440 31494896
58160C1494896l313657k832937k414284k070658j809543j592765j392257j225408
$$ 31494896 28181239 25348302 22934018 20863360 19053817 17461052 16068795 14843387
58152A4843387j103615r99546q93889q04383p41623o82450o12255n50141n08496
$$ 14843387 13739772 12740226 11846337 11041954 10300331 9617881 9005626 8455485 7946989
58143G946989m68464m17767l73877l48035l23196k88582k61017k51519k43749
$$ 7946989 7478525 7060758 6686881 6338846 6015650 5727068 5466051 5214532 4970783
58134D970783k25357k09364k05385j99689j82586j67375j63874j59790j45643
$$ 4970783 4745426 4536062 4330677 4130988 3948402 3781027 3617153 3457363 3311720
58125C311720j32679j29371j24803j11478j00866j00628r9331q8901q0051q0537
$$ 3311720 3179041 3049670 2924867 2813389 2712523 2611895 2512564 2423663 2343612 2263075
58115B263075p9834p0087o1312o1221o0255n1132m3651m5699m8260m3372l8913
$$ 2263075 2183241 2113154 2051842 1990621 1930366 1879234 1835583 1789884 1741624 1698252 1659339
58104A659339m1795m3916l8494l3572l5980l8060l3286k9288l2568l5590l1585
$$ 1659339 1617544 1573628 1535134 1501562 1465582 1427522 1394236 1364948 1332380 1296790 1265205
58093A265205k7278k8743k9276k3459j8755k1070k2846j7550j2311j4103j6781
$$ 1265205 1237927 1209184 1179908 1156449 1137694 1116624 1093778 1076228 1063917 1049814 1033033
58082A033033j3852j1141j4714j8631j6721j4612j8251k2088k0158j7641k0097
$$ 1033033 1019181 1008040 993326 974695 957974 943362 925111 903023 882865 865224 845127
58071H45127k2187j8484j4651j6619j9036j5689j1294j1885j3216r742n645o222
$$ 845127 822940 804456 789805 773186 754150 738461 727167 715282 702066 692324 686679 680457
58059F80457p395m379j742m481p860o494m758p942j1600j0023o935p593q468n033
$$ 680457 673062 668683 666941 662460 654600 648106 643348 635406 623806 613783 606848 599255 590787 585754
58045E85754j779m054p557o241l341m423o659n128k834m381o353m077j408l759
$$ 585754 583975 579921 572364 566123 562782 558359 551700 546572 543738 539357 533004 528927 527519 523760
58031E23760p563o756l872m742p697p768o485p909r818q089n226n675p249n748
$$ 523760 516197 509441 505569 500827 493130 485362 478877 470968 461150 453061 447835 442160 434911 429163
58017D29163l358m047n370l364p71k002m484l481j092j952m263l444p33j38o52
$$ 429163 425805 421758 416388 413024 412253 410251 405767 402286 401194 399242 394979 391535 390802 390664 390012
58002C90012P44K242Q51j020KJ537K47j104J174M095L258J144K253M347K715q77
$$ 390012 390756 392998 393849 392829 392831 394368 394615 393511 394685 398780 402038 403182 405435 409782 412497 411620
57986D11620j686p33j929m075l702k568m354p063o414l831l480m502l656k475
$$ 411620 409934 409201 407272 403197 399495 396927 392573 385510 379096 375265 371785 367283 363627 361152
57972C61152m161o449n175k028j326k070p76Q96p77l708l131j54O26l02R89L719
$$ 361152 356991 350542 345367 343339 342013 339943 339167 340063 339286 335578 332447 332293 332919 332617 333606 337325
57956C37325L735J359M03Q87j04j939j762p52k085m349l753j251o67j471k12K466
$$ 337325 341060 342419 342822 343709 343605 341666 339904 339152 337067 332718 328965 327714 327047 325576 325364 327830
57940C27830L157K451L595N878O097N137O399R096R722Q797R432J0649Q916N066
$$ 327830 330987 333438 337033 342911 349008 354145 360544 369640 379362 388159 397591 408240 417156 422222
57926D22222K969K515N12k670m127m802p908j2000j2645j0235r264j0388j0069
$$ 422222 425191 427706 428218 425548 421421 416619 408711 396711 384066 373831 364567 354179 344110
57913C44110p756o574o949o021l535k190k142r84J012J416R24K304M614M429K276
$$ 344110 336354 329780 322831 316810 313275 311085 308943 307959 308971 310387 311311 313615 318229 322658 324934
57898C24934J789L039K890J465J846L641L350J115O95K553L269K112J984L360
$$ 324934 326723 329762 332652 334117 335963 339604 342954 344069 344764 347317 350586 352698 354682 358042
57884C58042L472K058J991L487L532J660O05P65l67k718l423k573l335n714o108
$$ 358042 361514 363572 365563 369050 372582 374242 374847 375612 375245 372527 369104 366531 363196 357482 351374
57869C51374l942k793l947m593l609l382m463m025j254R38J215J780L614M635
$$ 351374 347432 344639 340692 336099 332490 329108 324645 320620 319366 320304 321519 323299 326913 331548
57855C31548M138M261N571N852M656M360N441N336L397K262K874K762Q16p07n41
$$ 331548 335686 339947 345518 351370 356026 360386 365827 371163 374560 376822 379696 382458 383274 382567 382026
57840C82026m46j330j497l51J80o50j105o17q61k121k512j827k158l650l785j964
$$ 382026 381580 380250 378753 378402 378582 377932 376827 376210 375349 373228 370716 368889 366731 363081 359296 357332
57824C57332o84j022j115k14j07j259j600m88P1n97o09N36P21q97k653l983o359
$$ 357332 356648 355626 354511 354297 354190 352931 351331 350843 350914 350317 349708 350244 350965 350068 347415 343432 337073
57807C37073r488j0742r591q604q875q479o658n357n312m708l077k458l275l223
$$ 337073 327585 316843 307252 298648 289773 281294 274636 269279 263967 259259 256182 253724 250449 247226
57793B47226j685j043k086k258k49J714J978K001K963L646L439L850N235N660
$$ 247226 245541 244498 242412 240154 239905 241619 243597 245598 248561 252207 255646 259496 264731 270391
57779B70391M634M343N583O218N344N192O976Q629Q450P525O676M657J355q69
$$ 270391 275025 279368 284951 291169 296513 301705 308681 317310 325760 333285 339961 344618 345973 345104
57765C45104r85j143k801m413m720m919n717n658m219l260l479k925p90O26k79
$$ 345104 344119 342976 340175 335762 331042 326123 320406 314748 310529 307269 303790 300865 300075 300701 300422
57750C00422j939k819l769n238n567l976k283j712j130O1M53k57j39J417K336
$$ 300422 298483 295664 291895 286657 281090 277114 274831 273119 271989 272050 272503 272246 272107 273524 275860
57735B75860J727J477K446K764J673J156J861J431r28k240o27J482J623J065J650
$$ 275860 277587 279064 281510 284274 285947 287103 288964 290395 289467 287227 286600 288082 289705 290770 292420
57720B92420K430K297K468L601L793K207J312K680L977L066J681J858K071L40
$$ 292420 294850 297147 299615 303216 307009 309216 310528 313208 317185 320251 321932 323790 325861 326201
57706C26201j877k330j862k228k628j672m23l42m80L50R98M15J64J581K838J806
$$ 326201 324324 321994 320132 317904 315276 313604 313181 312839 312359 312709 313707 314122 314286 315867 318705 320511
57690C20511m87k136l603n861p671p693p000o660n323k107P44J216J036K617N029
$$ 320511 320024 317888 314285 308424 300753 293060 286060 279400 274077 271970 272714 273930 274966 277583 282612
57675B82612O380P759J1144J5577J9133K2755K8498L5650M2262M8772N6256O2183
$$ 282612 288992 296751 307895 323472 342605 365360 393858 429508 471770 520542 576798 638981
57663F38981O1562N1746L3670R899j5429l6478m9260n4802n6400n5011n0003m2688
$$ 638981 700543 752289 785959 795858 780429 743951 694691 639889 583489 528478 478475 435787
57651D35787l5712k9854k4392j9625j6278j3474r977o530m474l288j907j096j895
$$ 435787 400075 370221 345829 326204 309926 296452 286475 279945 275471 272183 270276 269180 267285
57638B67285l057k747j522j028j031l84M17K61k40PL14k71o88L07J521J215J29
$$ 267285 264228 261481 259959 258931 257900 257516 257933 258194 257954 257961 258275 258004 257316 257623 259144 260359 260488
57621B60488j47k30j494l061l227k595k754l144k291r74r89j826j666p73p50j299
$$ 260488 260341 260111 258617 255556 252329 249734 246980 243836 241545 240571 239582 237756 236090 235317 234567 233268
57605B33268q07N59J254J202J509J970J583P88O53O17m44j789k034j737k255l031
$$ 233268 232461 233020 234274 235476 236985 238955 240538 241326 241979 242596 242152 240363 238329 236592 234337 231306
57589B31306k765k072k279k683j878p23r57j943j839j051j302k148j680p7P36
$$ 231306 228541 226469 224190 221507 219629 218906 217949 216006 214167 213116 211814 209666 207986 207909 208645
57574B08645M45L06L14n83j811j808r07p86j440j541j229j625k131j290J59J06
$$ 208645 209090 209396 209710 209127 207316 205508 204601 203815 202375 200834 199605 197980 195849 194559 194718 194824
57558A94824j314k024j586j430j724j155J82O93K18K26R86J181M61j92o30j595
$$ 194824 193510 191486 189900 188470 186746 185591 185773 186466 186684 186910 187896 189077 189538 189346 188716 187121
57542A87121k618k435j397j080j591j669j190j145j382q95o1j70r86j235j052
$$ 187121 184503 182068 180671 179591 178000 176331 175141 173996 172614 171719 171658 171488 170502 169267 168215
57527A68215j470j932j026Q17J989K496L381M000K984J321J285K594K881J796
$$ 168215 166745 164813 163787 164604 166593 169089 172470 176470 179454 180775 182060 184654 187535 189331
57513A89331J364K259K968K747K401J950N74j019j221n04p78j809j566p3M53m13
$$ 189331 190695 192954 195922 198669 201070 203020 203594 202575 201354 200850 200072 198263 196697 196624 197077 196664
57497A96664p32K6J69p12q52K49Q36K65L8N74J72j621k734j931o25j29J01L48
$$ 196664 195932 195958 196127 195415 194563 194812 195648 195913 195951 196525 196697 195076 192342 190411 189786 189657 189758 190106
57479A90106m48k317l429k914k151k154k148j778k111l275l615k525j671k114
$$ 190106 189658 187341 183912 180998 178847 176693 174545 172767 170656 167381 163766 161241 159570 157456
57465A57456k623k094j330j117p75J6J44q12j459q97j55j28r9M52N58l61j210
$$ 157456 154833 152739 151409 150292 149517 149533 149677 148865 147406 146509 146354 146226 146127 146579 147137 146776 145566
57448A45566j054m99j90K89J002J011K10m9Q32J599J337Q82J046J176N97j10l24
$$ 145566 144512 144013 143823 144112 145114 146125 146335 146286 147118 148717 150054 150936 151982 153158 153755 153645 153321
57431A53321l34l26R2O41L30p12j119n45j96n73o59qL89N7j32J43o0r89j503j062
$$ 153321 152987 152661 152753 153394 153724 153012 151893 151348 151152 150579 149920 149912 150301 150358 150226 150369 150309 149320 147817 146755
57411A46755m71p0Q37K061K301J490J165J754J815P68o6j8j86j026j286n01q4
$$ 146755 146284 146214 147051 149112 151413 152903 154068 155822 157637 158405 158339 158321 158135 157109 155823 155322 155238
57394A55238o63p67M45J535J352R25J268J507Q21J85M91R12O74N87J219J498P29
$$ 155238 154575 153808 154253 155788 157140 158065 159333 160840 161661 161846 162337 163249 163923 164510 165729 167227 167956
57377A67956J13O70J467J475J377J858J924O55r80j718j933k403k663k056j078
$$ 167956 168069 168739 170206 171681 173058 174916 176840 177495 176515 174797 172864 170461 167798 165742 164664
57362A64664k34R05K310K794J944J095J168J284Q33Q68J910K398J165k94QJ639
$$ 164664 164430 165335 167645 170439 172383 173478 174646 175930 176763 177631 179541 181939 183104 182810 182818 184457
57346A84457K810K980K619J720K80q53j125j245j784k053j548j022r51m80Q33
$$ 184457 187267 190247 192866 194586 194866 194013 192888 191643 189859 187806 186258 185236 184285 183805 184638
57331A84638J866J785J408J440J127R1l96M38J265Q74K29N73J242J161R03J298
$$ 184638 186504 188289 189697 191137 192264 192355 191959 192397 193662 194536 194765 195338 196580 197741 198644 199942
57315A99942J575P89k29k72K55N07R36K063K962K798K517L156L810L266K308K423
$$ 199942 201517 202306 202077 201805 202060 202567 203503 205566 208528 211326 213843 216999 220809 224075 226383 228806
57299B28806L333L756L560L381L085K395K041K699L710M311M907N806O150N609
$$ 228806 232139 235895 239455 242836 245921 248316 250357 253056 256766 261077 265984 271790 277940 283549
57285B83549N605P091Q696Q911Q668R663J1562J2900J3524J4066J4215J3607J3310
$$ 283549 289154 296245 304941 313852 322520 332183 343745 356645 370169 384235 398450 412057 425367
57272D25367J4315J5607J5756J5370J5932J7191J7749J7322J6594J5708J4786
$$ 425367 439682 455289 471045 486415 502347 519538 537287 554609 571203 586911 601697
57261F01697J4812J6149J7228J6647J5449J5356J5965J5816J5117J5077J5509
$$ 601697 616509 632658 649886 666533 681982 697338 713303 729119 744236 759313 774822
57250G74822J5344J4776J4627J4387J3083J1428J1001J1829J2823J3902J5629
$$ 774822 790166 804942 819569 833956 847039 858467 869468 881297 894120 908022 923651
57239I23651J7460J8481J9261K0884K2671K3019K2044K1353K1518K1691K1412
$$ 923651 941111 959592 978853 999737 1022408 1045427 1067471 1088824 1110342 1132033 1153445
57228A153445K1029K0544J9740J9047J8932J8977J8884J9553K1637K4044K5506
$$ 1153445 1174474 1195018 1214758 1233805 1252737 1271714 1290598 1310151 1331788 1355832 1381338
57217A381338K6631K8583L0760L1823L2096L2806L3721L3651L2747L2215L2298
$$ 1381338 1407969 1436552 1467312 1499135 1531231 1564037 1597758 1631409 1664156 1696371 1728669
57206A728669L2371L2536L3234L3896L3739L3318L3570L4001L3645L3055L3491
$$ 1728669 1761040 1793576 1826810 1860706 1894445 1927763 1961333 1995334 2028979 2062034 2095525
57195B095525L4858L6155L7193L8193L8683L8527L8993M0785M2212M1466L9628
$$ 2095525 2130383 2166538 2203731 2241924 2280607 2319134 2358127 2398912 2441124 2482590 2522218
57184B522218L9046L9724L9819L8888L8097L7843L7606L7628L8432L9135L8555
$$ 2522218 2561264 2600988 2640807 2679695 2717792 2755635 2793241 2830869 2869301 2908436 2946991
57173B946991L7361L6971L6962L5950L4286L3423L3199L2361L1177L0962L1396
$$ 2946991 2984352 3021323 3058285 3094235 3128521 3161944 3195143 3227504 3258681 3289643 3321039
57162C321039L1015L0035L0016L0929L1216L0649L0546L1069L0894K9755K8901
$$ 3321039 3352054 3382089 3412105 3443034 3474250 3504899 3535445 3566514 3597408 3627163 3656064
57151C656064K8781K8502K7897K7914K8764K9566L0109L1041L2203L2613L2282
$$ 3656064 3684845 3713347 3741244 3769158 3797922 3827488 3857597 3888638 3920841 3953454 3985736
57140C985736L2339L3222L4304L5194L5950L6324L6273L6704L8283M0152M1381
$$ 3985736 4018075 4051297 4085601 4120795 4156745 4193069 4229342 4266046 4304329 4344481 4385862
57129D385862M2764M5327M8070M9315M9443N0152N1883N4085N7047O0902O3732
$$ 4385862 4428626 4473953 4522023 4571338 4620781 4670933 4722816 4776901 4833948 4894850 4958582
57118D958582O3306O0348N7728N7125N8759O3486P2227Q3630R4980J05327J15645
$$ 4958582 5021888 5082236 5139964 5197089 5255848 5319334 5391561 5475191 5570171 5675498 5791143
57107E791143J26550J38228J52190J70741J95127K26188K66173L17710L81529
$$ 5791143 5917693 6055921 6208111 6378852 6573979 6800167 7066340 7384050 7765579
57098G765579M56913N43565O41617P51366Q74848J016125J178591J364036J575514
$$ 7765579 8222492 8766057 9407674 10159040 11033888 12050013 13228604 14592640 16168154
57089A6168154J817654K091963K394277K716391L043531L349162L602092L781744
$$ 16168154 17985808 20077771 22472048 25188439 28231970 31581132 35183224 38964968
57081C8964968L870777L820698L543791K973819K145705J198293K85719n10637
$$ 38964968 42835745 46656443 50200234 53174053 55319758 56518051 56803770 56293133
57073E6293133j189503j778451k294785k742240l117467l410066l605263l692652
$$ 56293133 55103630 53325179 51030394 48288154 45170687 41760621 38155358 34462706
57065C4462706l671120l547687l337421l064108k755276k434498k119254j823184
$$ 34462706 30791586 27243899 23906478 20842370 18087094 15652596 13533342 11710158
57057A1710158j555662j319889j115034r39999p93115o70223n66624m79991m08961
$$ 11710158 10154496 8834607 7719573 6779574 5986459 5316236 4749612 4269621 3860660
57048C860660l50438l01126k60142k27351k00659j77566j57883j42095j28676
$$ 3860660 3510222 3209096 2948954 2721603 2520944 2343378 2185495 2043400 1914724
57039A914724j15772j04054r4941q7355p9007o9742o0905n2441m3240l3378k3626
$$ 1914724 1798952 1694898 1599957 1512602 1433595 1363853 1302948 1250507 1207267 1173889 1150263
57028A150263j3648k766Q335J8277K5791K8148K1070L200k0549m2664n9081o9765
$$ 1150263 1136615 1133849 1142184 1160461 1186252 1214400 1235470 1238670 1218121 1175457 1116376 1046611
57016A046611p5232p5594p2044o6403n9379n1146m2862l5762k9550k3444j7871
$$ 1046611 971379 895785 823741 757338 697959 646813 603951 568189 538639 515195 497324
57005D97324j3513r841o299l707k799k624k085j684k105k629k643l177m976o731
$$ 497324 483811 473970 467671 463964 461165 458541 456456 454772 452667 450038 447395 444218 439242 432511
56991D32511p157p212q169r112q475o587m506j852K049O132Q807R837R187N758
$$ 432511 425354 418142 409973 400861 392386 385799 381293 379441 381490 387622 396429 406266 415453 421211
56977D21211m79o810j0582j2297j3700j4541j3648j1617r811q023n612l569k899
$$ 421211 420732 413922 403340 391043 377343 362802 349154 337537 327726 319703 314091 310522 307623
56964C07623k340k86K383M069N623Q915J3386J6902J8998K0405K0305J7008J0733
$$ 307623 305283 304997 307380 311449 317072 325987 339373 356275 375273 395678 415983 432991 443724
56951D43724L224m762j2928j9393k2003k1346j9872j8519j6504j3733j1023q344
$$ 443724 446948 442186 429258 409865 387862 366516 346644 328125 311621 297888 286865 278521
56939B78521n155j939O59L445P355J1425J4321J6893K0876K5898K9871L1286K8952
$$ 278521 273366 271427 272086 275531 282886 294311 308632 325525 346401 372299 402170 433456 462408
56926D62408K1185Q163o103j7114k4314k9594l2877l2659k9815k7056k4908k1666
$$ 462408 483593 491756 485653 468539 444225 414631 381754 349095 319280 292224 267316 245650
56914B45650j7215j3504j1157q844o244m675m399m067l145k417j893p09P79J341
$$ 245650 228435 214931 203774 194930 188686 184011 179612 175545 172400 169983 168090 167381 168160 169501
56900A69501J265K025L512M190L955M355N849P259Q129R233J0723J2073J3836
$$ 169501 170766 172791 176303 180493 184448 188803 194652 201911 210040 219273 229996 242069 255905
56887B55905J7077K1113K4123K5717K6409K4942J9235J0079J038n745j0947j5112
$$ 255905 272982 294095 318218 343935 370344 395286 414521 424600 425638 419893 408946 393834
56875C93834j7243j6992j5597j3738j0750o636k636Q25M699R306J3783J8092K3378
$$ 393834 376591 359599 344002 330264 319514 312878 310242 311067 315766 325072 338855 356947 380325
56862C80325K9916L6558M2703M8822N4459N7377N5155M6389L0766J0048j1170
$$ 380325 410241 446799 489502 538324 592783 650160 705315 751704 782470 792518 781348
56851G81348k7910l8412m3869m5231m2520l6771k9904k2548j4255n762J503Q019
$$ 781348 753438 715026 671157 625926 583406 546635 516731 494183 479928 474166 475669 483688
56839D83688J5689K4792L4034M3508N4614O6945P8147Q6977R3036R3012Q1049
$$ 483688 499377 524169 558203 601711 656325 723270 801417 888394 981430 1074442 1155491
56828A155491N4965J9795j6094m6465o8334q0867q5206q3715p7893o8227n6200
$$ 1155491 1210456 1230251 1214157 1167692 1099358 1018491 933285 849570 771677 703450 647250
56817F47250m4354l3737k3416j3132m148L260J0876K0071L0225M0441N0675O0187
$$ 647250 602896 569159 545743 532611 528463 531723 542599 562670 592895 633336 684011 744198
56805G44198O6578O7178N9992M3462J7949j1791l8251n6573o6882p1159p0383
$$ 744198 810776 877954 937946 981408 999357 987566 949315 892742 825860 754701 684318
56794F84318o5497n8376n0253m1074l1447k3206j6979j1212m726J701P318J2959
$$ 684318 618821 560445 510192 469118 437671 414465 397486 386274 381548 383249 390567 403526
56782D03526J9382K5809L1190L5199L6918L4233K5823J2710k740j7996l0434l8189
$$ 403526 422908 448717 479907 515106 552024 586257 612080 624790 622050 604054 573620 535431
56770E35431m1662m2656m1793l8547l3742k9444k6023k1934j7019j3347j1823
$$ 535431 493769 451113 409320 370773 337031 307587 281564 259630 242611 229264 217441
56759B17441j0685q584o602n840n363m148l013k970l464l585l480l358k714j612
$$ 217441 206756 198172 191570 185730 180367 176219 173206 170236 166772 163187 159707 156349 153635 152023
56745A52023j067j255j112m36l92j144j194p4O28M8l72N20J553J324M11OR1K54
$$ 152023 150956 149701 148589 148153 147761 146617 145423 145349 145977 146025 145653 146173 147726 149050 149461 149467 149558 149812
56727A49812O98J225Q40m14j004k33P05R33J168J836K012J381J179K002K653K326
$$ 149812 150510 151735 152575 152161 151157 150924 151629 152562 153730 155566 157578 158959 160138 162140 164793 167119
56711A67119J830J598P38p25j102O6P84j27r36n8J116N73j134k255k667l220l654
$$ 167119 168949 170547 171285 170560 169458 169524 170308 170181 169245 169187 170303 170876 169742 167487 164820 161600 157946
56694A57946l243k362j741j201n83o16j548k277k000j400j072m30P23J283P17
$$ 157946 154703 152341 150600 149399 148816 148200 146652 144375 142375 140975 139903 139473 140196 141479 142196
56679A42196R7J48M5o98j104o56l67p49p75k9L32j5L97J936K603J317o7J02O31
$$ 142196 142293 142441 142486 141788 140684 140028 139661 138912 138137 138108 138440 138425 138822 140758 143361 144678 144611 144713 145344
56660A45344N7o27j67K89p63k428l133l334m149n002m892m376m219l776k763k702
$$ 145344 145401 144774 144607 144896 144133 141705 138572 135238 131089 126087 121195 116819 112600 108824 106061 103359
56644A03359m405n933n433m105l910m273l719k913l205l681k624o42M53Q01J761
$$ 103359 98954 93021 87588 83483 79573 75300 71581 68668 65463 61782 59158 58516 58969 59770 61531
56629F1531L021L159K281J653J392Q17L58R64K249L153L636M068M055L567L950
$$ 61531 64552 67711 69992 71645 73037 73854 74212 75176 77425 80578 84214 88282 92337 95904 99854
56614I9854N883P714P713O590N831N178L882K797K900L180K386J455J781K535
$$ 99854 105737 113451 121164 127754 133585 138763 142645 145442 148342 151522 153908 155363 157144 159679
56600A59679K191J335J337J586O85p73j236r31j080j395r65m58r64j675j291n42
$$ 159679 161870 163205 164542 166128 166813 166040 164804 163873 162793 161398 160433 159975 159011 157336 156045 155503
56584A55503q07j385p79L59L64l76k73M67M50n2L36J368J631J145R97J107P17
$$ 155503 154696 153311 152532 152891 153255 152879 152606 153073 153523 153471 153807 155175 156806 157951 158948 160055 160772
56567A60772L71J011J977K285K849M821O877O982N960O297Q040Q844P666N596
$$ 160772 161143 162154 164131 166416 169265 174086 180963 187945 193905 200202 208242 217086 224752 230348
56553B30348L445J229l16l15L31k5j157j596j222j053j144r82j179k410l537l170
$$ 230348 233793 235022 234706 234391 234722 234697 233540 231944 230722 229669 228525 227543 226364 223954 220417 217247
56537B17247k128j998k274j550m64o26j592j729j162j083j080j06R47O28r9N69
$$ 217247 215119 213121 210847 209297 208833 208207 206615 204886 203724 202641 201561 201455 202402 203030 202931 203500
56521B03500J728J192n00j033n77j352l304m022k967k222k806l492l540l573l572
$$ 203500 205228 206420 205920 204887 204310 202958 199654 195632 192665 190443 187637 184145 180605 177032 173460
56506A73460k835j982k230k794j831K56J291Q24K96O9p00j532j068K27P63Q00
$$ 173460 170625 168643 166413 163619 161788 162044 163335 164159 164455 164524 163824 162292 161224 161451 162214 163014
56490A63014J648K543J682j07l49P74P65o82j312m75J00l6N88J945K127R55N03
$$ 163014 164662 167205 168887 168780 168431 169205 169970 169288 167976 167501 167601 167565 168153 170098 172225 173180 173683
56473A73683J379J792R98M17P79J162J316J912K278J012r85j366k43J60k99L48
$$ 173683 175062 176854 177852 178269 179048 180210 181526 183438 185716 186728 185743 184377 184134 184294 183995 184343
56457A84343J939J957O4j184q68q89j838j746o3J027N55L20J207J648J030J018
$$ 184343 186282 188239 188303 187119 186251 185362 183524 181778 181715 182742 183297 183617 184824 186472 187502 188520
56441A88520K017J962J94j029n42k78j465k210r01R87J544J241J182J099P60R87
$$ 188520 190537 192499 192693 191664 191122 190844 189379 187169 186268 187255 188799 190040 191222 192321 193081 194068
56425A94068J759J627K97m93J68J023J107J095J358J233J014J931L507L777K717
$$ 194068 195827 197454 197751 197258 197426 198449 199556 200651 202009 203242 204256 206187 209694 213471 216188
56410B16188K391L093K791J142M00J244J444P2o22P73K286J970P33L2l15m65M20
$$ 216188 218579 221672 224463 225605 226005 227249 228693 228765 228143 228916 231202 233172 233905 233937 233622 233157 233577
56393B33577J964K270J212J082K673L831L237K431K654K859K385K371K999K452
$$ 233577 235541 237811 239023 240105 242778 246609 249846 252277 254931 257790 260175 262546 265545 267997
56379B67997K29j667k224k842l975l836j989o00n22K08K249L178J844O25J118
$$ 267997 268226 266559 264335 261493 257518 253682 251693 251093 250571 250779 253028 256206 258050 258675 259793
56364B59793J373j12j389p49N7q48k074j769r02q93p94M69J623J417R80J482J958
$$ 259793 261166 261054 259665 258916 258973 258125 256051 254282 253380 252487 251693 252162 253785 255202 256182 257664 259622
56347B59622J630J656K468K233J47j585j301m46m98l90P45J414Q16Q47K536L615
$$ 259622 261252 262908 265376 267609 267756 266171 264870 264424 263926 263536 264281 265695 266511 267358 269894 273509
56331B73509K289L85N1L41j20j37J428K878K525J724K241L179L184L104L704L476
$$ 273509 275798 276183 276234 276575 276455 276318 277746 280624 283149 284873 287114 290293 293477 296581 300285 303761
56315C03761J467k99LR21M97m28k97L30N57J182K574L174K445K469M309N844N603
$$ 303761 305228 304929 304932 305853 306350 305922 305625 305955 306512 307694 310268 313442 315887 318356 322665 328509 334112
56298C34112N454O825P708O329M531M416M729L749K685L123L904L655L521M560
$$ 334112 339566 346391 354099 360428 364959 369375 374104 377853 380538 383661 387565 391220 394741 399301
56284C99301N345M917M982O431P136N954N305O789Q147P755P978J0535J2697J2079
$$ 399301 404646 409563 414545 420976 428112 434066 439371 446160 454307 462062 470040 480575 493272 505351
56270E05351J1174J2799J4981J4964J4554J6567J9366K0049J9945K1920K5026
$$ 505351 516525 529324 544305 559269 573823 590390 609756 629805 649750 671670 696696
56259F96696K6805K8317L1966L6787M0640M4643N0769N7560O2911O8550P7021
$$ 696696 723501 751818 783784 820571 861211 905854 956623 1014183 1077094 1145644 1222665
56248A222665Q6585R4045J00204J07725J15772J21644J25556J29001J30508J27747
$$ 1222665 1309250 1403295 1503499 1611224 1726996 1848640 1974196 2103197 2233705 2361452
56238B361452J21794J14697J05033R0506P2628N4158L4327J1420j2272l3107n1322
$$ 2361452 2483246 2597943 2702976 2793482 2866110 2920268 2954595 2966015 2953743 2920636 2869314
56227B869314o8780q3961r4395j01684j08787j14483j15872j14184j12645j10700
$$ 2869314 2800534 2716573 2622178 2520494 2411707 2297224 2181352 2067168 1954523 1843823
56217A843823j05838r9242r4018q9533q3054p5336o9225o4371n8687n3223n0204
$$ 1843823 1737985 1638743 1544725 1455192 1372138 1296802 1227577 1163206 1104519 1051296 1001092
56206A001092m8050m3838l8887l6282l4776l0945k5639k2406k1007j8442j4969
$$ 1001092 953042 909204 870317 834035 799259 768314 742675 720269 699262 680820 665851
56195F65851j3238j2761j1054q871q611q974p031m136l781n077m411k218j894
$$ 665851 652613 639852 628798 619927 611316 602342 595311 591175 587394 582317 577906 575688 573794
56182E73794l194l000j563j756l082k546n80n2m30R78L097K624N04N05K369K605
$$ 573794 570600 567600 566037 564281 561199 558653 558073 558021 557591 558569 561666 564290 564794 565299 567668 570273
56166E70273J293J701L931N184N504P108Q927Q163O236O847R147R442Q451J0095
$$ 570273 571566 573267 577198 582382 587886 594994 603921 612084 618320 625167 634314 643756 652207 662302
56152F62302J3977J6120J6375J8160K1431K3052K3609K6936L3174L9058M4560
$$ 662302 676279 692399 708774 726934 748365 771417 795026 821962 855136 894194 938754
56141I38754N2535O2499P1558Q0601R2435J04600J11277J11603J08880J02827
$$ 938754 991289 1053788 1125346 1205947 1298382 1402982 1514259 1625862 1734742 1837569
56131A837569R0504P4227O0460N1101M3359L7340L5458L4939K9582J9082Q675
$$ 1837569 1928073 2002300 2062760 2113861 2157220 2194560 2230018 2264957 2294539 2313621 2322296
56120B322296r9r939j9754k5230k7606l3093m3160n3818o4417p7968r2440j01093
$$ 2322296 2322197 2312258 2292504 2267274 2239668 2206575 2163415 2109597 2045180 1967212 1874772 1773679
56108A773679j02478j01303r8791r1306p9306o8357o0026n0691m0268l3040k8916
$$ 1773679 1671201 1569898 1471107 1379801 1300495 1232138 1172112 1121421 1081153 1048113 1019197
56097A019197k3045j5251j0569r475o988k503q57k432j933J605L328K380L383
$$ 1019197 996152 980901 970332 960857 953869 951366 950509 948077 946144 947749 951077 953457 956840
56084I56840O741P446N040M820P640Q532O875P567J0770J1069Q292Q372J1936
$$ 956840 963581 971027 976067 980887 988527 997059 1003934 1011501 1022271 1033340 1041632 1050004 1061940
56071A061940J3101J1112J1736J5433J6006J2919J2851J6799J8090J5555J5916
$$ 1061940 1075041 1086153 1097889 1113322 1129328 1142247 1155098 1171897 1189987 1205542 1221458
56060A221458K0282K1360J7401J5735J8805J9831J6310J4598J6851J6673J2309
$$ 1221458 1241740 1263100 1280501 1296236 1315041 1334872 1351182 1365780 1382631 1399304 1411613
56049A411613J0905J4897J7340J5496J5770K0349K2526K0278K0745K6016K8455
$$ 1411613 1422518 1437415 1454755 1470251 1486021 1506370 1528896 1549174 1569919 1595935 1624390
56038A624390K5471K4765K9375L1935K9570K9698L4996L7580L4498L3906L9251
$$ 1624390 1649861 1674626 1704001 1735936 1765506 1795204 1830200 1867780 1902278 1936184 1975435
56027A975435M2650M0721M1379M7828N1728M9589M9768N5686N8659N5175N4441
$$ 1975435 2018085 2058806 2100185 2148013 2199741 2249330 2299098 2354784 2413443 2468618 2523059
56016B523059O0656O5065O3830O6011P5063Q0714P8423P8316Q5318Q9593Q6708
$$ 2523059 2583715 2648780 2712610 2778621 2853684 2934398 3012821 3091137 3176455 3266048 3352756
56005C352756Q7441R6982J04541J04604J07843J19477J28175J28550J32693J46653
$$ 3352756 3440197 3537179 3641720 3746324 3854167 3973644 4101819 4230369 4363062 4509715
55995D509715J58037J60303J66006J82000J95617K00257K09703K31388K51096
$$ 4509715 4667752 4828055 4994061 5176061 5371678 5571935 5781638 6013026 6264122
55986F264122K60653K74279L00362L24774L40156L62755M01166M38640M66538
$$ 6264122 6524775 6799054 7099416 7424190 7764346 8127101 8528267 8966907 9433445
55977I433445N03239N58514O13194O57453P13462P94930Q82150R64343J066708
$$ 9433445 9936684 10495198 11108392 11765845 12479307 13274237 14156387 15120730 16187438
55968A6187438J206084J362968J530204J743867K029457K364366K730832L154083
$$ 16187438 17393522 18756490 20286694 22030561 24060018 26424384 29155216 32309299
55960C2309299L648191M184534M762177N446318O286083P267744Q408541R813696
$$ 32309299 35957490 40142024 44904201 50350519 56636602 63904346 72312887 82126583
55952H2126583J1578066J3740509J6413901J9801133K3921433K8441629L2903891
$$ 82126583 93704649 107445158 123859059 143660192 167581625 196023254 228927145
55945B28927145L6825442L9163374L7902315L1006833J8342166K473624j2794792
$$ 228927145 265752587 304915961 342818276 373825109 392167275 394640899 381846107
55938C81846107k4698008l2420574l6366176l7219326l5710922l2672514k8865292
$$ 381846107 357148099 324727525 288361349 251142023 215431101 182758587 153893295
55931A53893295k4793052k0783503j7123016j3999118j1418085r297725p590554
$$ 153893295 129100243 108316740 91193724 77194606 65776521 56478796 48888242
55924D8888242o257891n207998m347525l648248l103364k666317k287814j968133
$$ 48888242 42630351 37422353 33074828 29426580 26323216 23656899 21369085 19400952
55916A9400952j720127j518529j331729j167010j040616r35851q30782p36374
$$ 19400952 17680825 16162296 14830567 13663557 12622941 11687090 10856308 10119934
55908A0119934o69204o14813n53560m95948m58493m29615l91735l53758l30805
$$ 10119934 9450730 8835917 8282357 7786409 7327916 6898301 6506566 6152808 5822003
55899E822003l13512k86901k59257k44163k33024k12333j90117j79554j73387
$$ 5822003 5508491 5221590 4962333 4718170 4485146 4272813 4082696 3903142 3729755
55890C729755j59253j43978j38907j36663j25497j11834j06491j02937r0885p7766
$$ 3729755 3570502 3426524 3287617 3150954 3025457 2913623 2807132 2704195 2613310 2535544
55880B535544p5477p8607p6191p2535p6429q1621p7796o9915o7849o7493o0526
$$ 2535544 2460067 2381460 2305269 2232734 2156305 2074684 1996888 1926973 1859124 1791631 1731105
55869A731105n2369n2222n5069n1268m4761m4412m6261m1422l3353l0800l1391
$$ 1731105 1678736 1626514 1571445 1520177 1475416 1431004 1384743 1343321 1309968 1279168 1247777
55858A247777k8114k4294k6655l0904k9280k5239k6066k8197k4428j8594j8554
$$ 1247777 1219663 1195369 1168714 1137810 1108530 1083291 1057225 1029028 1004600 986006 967452
55847I67452k1311j9398j5638j7301k1698k1545j9006k0684k4070k2381j7869
$$ 967452 946141 926743 911105 893804 872106 850561 831555 810871 786801 764420 746551
55836G46551j7273j8860j6668j2906j3626j6592j5609j2479j2729j3974j0543
$$ 746551 729278 710418 693750 680844 667218 650626 635017 622538 609809 595835 585292
55825E85292n318m999p581o368k718l059o651p689o602q115j0962j0238p317p184
$$ 585292 579974 574975 567394 561026 558308 555249 548598 540909 534307 526192 515230 504992 497675 490491
55811D90491q663p187m315m614o144l864M35J361J00J724N309O359O133Q873J2458
$$ 490491 481828 474641 470326 465712 459568 455704 456139 457500 457600 459324 464633 470992 477125 485998 498456
55796D98456J1598P780O469O907M206p30k946k958n175q686q891o551o219p378
$$ 498456 510054 517834 524303 531210 535416 534686 531740 528782 523607 514921 506030 499479 493260 485882
55782D85882n938k940k967n451o076n111n911o852l411L228Q134J1659J7949K5720
$$ 485882 479944 477004 474037 468586 462510 457399 451488 444636 441225 444453 452587 464246 482195 507915
55768E07915K9042K6345K0627J2139q06j4834k3740k7158k9452l1147k9303k5072
$$ 507915 536957 563302 583929 596068 595262 580428 556688 529530 500078 468931 439628 414556
55756D14556k2601k1304j7267j1575r115r729q670n408m006m915m428k255j987
$$ 414556 391955 370651 353384 341809 332694 322965 314295 308887 304881 299966 295538 293283 291296
55743B91296l778l958k067j222j492jK485K157p39k349k443m144o801o557l989
$$ 291296 287518 283560 281493 280271 278779 278778 281263 283420 282681 280332 277889 273745 266944 260387 256398
55728B56398l685o028o711m866m270n790n952l933l064m120l890j513P2R8J227
$$ 256398 252713 246685 239974 235108 230838 225048 219096 215163 212099 207979 204089 202576 202648 202746 203973
55713B03973L899N536O117Q431J1988J2814J0098P106M847R88m166p006o924p296
$$ 203973 207872 213408 219525 227956 239944 252758 262856 269962 274809 275797 271631 264625 257701 250405
55699B50405r117r648q305p904q940q580o430n432n976n029k248j005k062k209
$$ 250405 241288 231640 223335 215431 206491 197911 191481 186049 180073 175044 172796 171791 169729 167520
55685A67520m73K33q42n61K112M059L744L524M491M429K670J727K306J906j2p19
$$ 167520 167047 167280 166438 165877 167989 172048 175792 179316 183807 188236 190906 192633 194939 196845 196833 196114
55669A96114L23J25k045k903j199n9j111j525N65K721K843K590L605M560M358
$$ 196114 196437 196562 194517 191614 190415 190356 189245 187720 188285 191006 193849 196439 200044 204604 208962
55654B08962M291M881M467K826K210L180L424K210J701K370J697q91k454j801
$$ 208962 213253 218134 222601 225427 227637 230817 234241 236451 238152 240522 242219 241328 238874 237073
55640B37073j740l998o341o952p280q227p947n828m549n591o612n700m429m313
$$ 237073 235333 231335 224994 218042 210762 202535 194588 188760 184211 178620 172008 166308 161879 157566
55626A57566m052k692j852k348k206l99Q67L7j036o01qp77j781j631j115j205
$$ 157566 153514 150822 148970 146622 144416 144017 144884 144921 143885 143284 143276 142499 140718 139087 137972 136767
55610A36767j310j253k131l749m063k644j555j637j245P3L78q13j254j12L89q25
$$ 136767 135457 134204 132073 128324 124261 121617 120062 118425 117180 117253 117631 116818 115564 115452 115841 115016
55594A15016j634p63o7p96j247j93Q36P34Q20J783K163J578J886L320L371J381
$$ 115016 113382 112619 112552 111756 110509 110316 111152 111886 112706 114489 116652 118230 120116 123436 126807 128188
55578A28188K91J676L141K949L075N011O664O387O312Q457J0975J1402J0443R604
$$ 128188 128479 130155 133296 136245 139320 144331 150995 157382 163694 172151 183126 194528 204971 214575
55564B14575Q196N646L622K914J320k472o013p027p115q480j0054j0098r643j0057
$$ 214575 222771 228417 232039 234953 236273 233801 227788 220761 213646 205166 195112 185014 175371 165314
55550A65314r962p922n547m670m008j948q8n20j927j824o40k29l12L17R15L10
$$ 165314 155352 147430 141883 137213 133205 131257 131169 130649 128722 126898 126258 126029 125717 126034 126949 127259
55534A27259m23J53R89N08l94j62L49m43j782k058j753k197k899k842k820l913
$$ 127259 126836 126989 127978 128486 128092 127930 128279 127836 126054 123996 122243 120046 117147 114305 111485 107572
55518A07572n074m828l780l132k360p92L13k17j162j124j181k715m381m098k469
$$ 107572 102498 97670 93890 90758 88398 87606 87919 87702 86540 85416 84235 81520 77139 73041 70572
55503G0572j405q39M37J955K298J643J239J364J720K528L480L174J440L17Q81
$$ 70572 69167 68328 68765 70720 73018 74661 75900 77264 78984 81512 84992 88166 89606 89923 90804
55488I0804J252k11k096k648k774l729m276l135j977k724l923l172j307o76r04
$$ 90804 92056 91845 89749 87101 84327 80598 76322 73187 71210 68486 64563 61391 60084 59408 58504
55473E8504J6J664J879O38p1L39P56Q59J196J404Q17K02N80J225R72L73M12M56
$$ 58504 58520 60184 62063 62701 62630 62969 63725 64584 65780 67184 68001 68203 68783 70008 70980 71353 71765 72221
55455G2221k24n23N18J405N46p35l61R01J028M07O96J437J090L03P40J677J120
$$ 72221 71997 71474 71992 73397 73943 73208 72847 73748 74776 75183 75879 77316 78406 78709 79449 81126 82246
55438H2246m64q37J58O94L27K16M88L53K76J106J734O30r24m19J630K325J005
$$ 82246 81782 80945 81103 81797 82124 82340 82828 83181 83457 84563 86297 86927 86003 85584 87214 89539 90544
55421I0544j22J00M93M15P90J899K834L526M780O074N838M132K667J989J013n60
$$ 90544 90422 90522 91015 91430 92220 94119 96953 100479 105259 111333 117171 121303 123970 125959 126972 126412
55405A26412j742k352l300m584n073m542l860l253k297j495j695k126j242N23
$$ 126412 124670 122318 119018 114434 109361 104819 100959 97706 95409 93914 92219 90093 88851 89374
55391H9374J114J5j134j176o63k43J92N70N19L12M83O48J25p18j207j633k285
$$ 89374 90488 90503 89369 88193 87530 87287 87479 88049 88568 88880 89363 90011 90136 89418 88211 86578 84293
55374H4293k162o10Q50N64m98l90M38J44r64r68J32M73k68n39R6M22J71M26J174
$$ 84293 82131 81521 82371 82935 82437 82047 82485 82629 81665 80697 80829 81302 81034 80495 80591 81013 81184 81610 82784
55355H2784J186M67L43Q32N20o41r91l0P86N92J97J98J97K14P77J281M26j402
$$ 82784 83970 84437 84780 85612 86132 85491 84500 84470 85256 85848 86045 86243 86440 86654 87431 88712 89138 87736
55337H7736k382k067j809k128j959r42j83j96j32L89O11L04K71P47J004P86N65
$$ 87736 85354 83287 81478 79350 77391 76449 76266 76070 75938 76327 76938 77242 77513 78260 79264 80050 80615
55320H0615K63n59j320j018l0N10P47J463J881O16j468j974o29M38J57l74l94
$$ 80615 80878 80319 78999 77981 77951 78461 79208 80671 82552 83168 81700 79726 79097 79535 79692 79318 78924
55303G8924m62n07L74J706J805O79K05Q86J021j68j233j095n40j84N41J485J239
$$ 78924 78462 77955 78329 80035 81840 82519 82724 83610 84631 84463 83230 82135 81595 81411 81952 83437 84676
55286H4676l97j604j198j18O09J170J539R04m31q90k20r1j086j507l36Q68N27
$$ 84676 84279 82675 81477 81359 81968 83138 84677 85581 85150 84260 84040 83949 82863 81356 81020 81888 82415
55269H2415n99j054q99q21o34j01J91p7k31J16M03M32P97J372J094q1p93n18k90
$$ 82415 81816 80762 79863 79042 78408 78307 78498 78421 78190 78306 78709 79141 79938 81310 82404 82323 81530 81012 80722
55250H0722n38l40M01L15q22j148K87J688J290k0m57K2M39O11O80K45o35q58k2
$$ 80722 80184 79844 80245 80560 79738 78590 78877 80565 81855 81835 81378 81400 81839 82450 83130 83375 82740 81882 81860
55231H1860O79M43K40R15J559J165M07K68L02k25p94p18n50q93r92m0J158J350
$$ 81860 82539 82982 83222 84137 85696 86861 87268 87536 87838 87613 86819 86101 85551 84658 83666 83626 84784 86134
55213H6134P09K02rk68m13l09n29j373j998j607o77k8M06R41J270J142J038J270
$$ 86134 86843 87045 87036 86768 86355 86046 85517 84144 82146 80539 79862 79834 80240 81181 82451 83593 84631 85901
55195H5901J313Q46L63J16l29q41m77O87J035j97j568j647j042r00q51j22O53
$$ 85901 87214 88060 88423 88539 88210 87369 86892 87579 88614 88417 86849 85202 84160 83260 82409 82287 82940
55178H2940M72k04l03j1j78n95m34J59L55J36J82O26J030J253J418J384J040P30
$$ 82940 83412 83208 82905 82894 82716 82121 81687 81846 82201 82337 82519 83145 84175 85428 86846 88230 89270 90000
55160I0000P06P12O16P67J193J277Q11M36M89M03j41n50m63m03o52o32j69q7p45
$$ 90000 90706 91418 92034 92801 93994 95271 96082 96518 97007 97410 97269 96719 96256 95853 95201 94569 94400 94313 93568
55141I3568j222r06n76r36j314r23k42J9K25R19J633J667J208O95J6q18j203r85
$$ 93568 92346 91440 90864 89928 88614 87691 87449 87468 87693 88612 90245 91912 93120 93815 93831 93013 91810 90825
55123I0825q98j160r49l1N25J99O2Q01J275M54o85p29k1K87J90K76L26j3j55L30
$$ 90825 89927 88767 87818 87787 88312 88511 88573 89374 90649 91103 90418 89689 89668 89955 90145 90421 90747 90734 90579 90909
55103I0909N91k9n10K92J683K312K270K339K144R33o17j239j082j111j187n16
$$ 90909 91500 91471 90961 91253 92936 95248 97518 99857 102001 102934 102317 101078 99996 98885 97698 97182
55087I7182N25Q62O08P64J313J301O22J45J83K18J1k14n01r53j095n79o8l29q95
$$ 97182 97707 98569 99177 99941 101254 102555 103177 103322 103505 103723 103734 103520 103019 102066 100971 100392 100324 99995 99100
55068I9100p85o3N43R57J461J622Q97j08l43J12L49J79J10J94R0p2pn2n96j159
$$ 99100 98315 98252 98795 99752 101213 102835 103732 103624 103281 103393 103742 103921 104031 104225 104315 104243 104236 104184 103588 102429
55048A02429j125q04p39o24q9J77n69j627j761j011k84J98O86P61l1r14q03p0
$$ 102429 101304 100500 99761 99137 99048 99225 98656 97029 95268 94257 93973 94171 94857 95618 95587 94673 93870 93800
55030I3800Q5l67m52J4L28L56O23J073J183J064J158J101K67q43j182q92r97j561
$$ 93800 93885 93518 93066 93080 93408 93764 94387 95460 96643 97707 98865 99966 100233 99390 98208 97316 96319 94758
55012I4758j602q06N9M51N83O50O33P22R43P26j24n59L59J779K161J562J180J148
$$ 94758 93156 92350 92409 92860 93443 94093 94726 95448 96391 97117 96993 96434 96793 98572 100733 102295 103475 104623
54994A04623N32n95j032m90p5m01p24l68K73N56L49k08q06q05K6P75M65l93n04
$$ 104623 105155 104560 103528 103038 102963 102562 101838 101470 101743 102299 102648 102440 101634 100829 100855 101630 102095 101702 101198
54975A01198J71M85J02j6P47J848K545K555J738K93p94o16K99O74L23O0Kn24j360
$$ 101198 101369 101854 101956 101940 102687 104535 107080 109635 111373 111666 110872 110256 110555 111229 111552 111612 111614 111090 109730
54956A09730j370j94J150J746J648J114J33j005j742k040k197j918p34P28J173
$$ 109730 108360 108166 109316 111062 112710 113824 113957 112952 111210 109170 106973 105055 104321 105049 106222
54941A06222M55k73l32j80j63R8P08J066Q29L83J40J70O05J482K205K169J762
$$ 106222 106677 106404 106072 105892 105729 105827 106535 107601 108430 108813 108953 109123 109728 111210 113415 115584 117346
54924A17346J830K293K504K655L431M512M939M913N560O797P145O038M560L425
$$ 117346 119176 121469 123973 126628 130059 134571 139510 144423 149983 156780 163925 169963 174523 177948
54910A77948J884n70k913m039m309m701n342n745n746n394m580l377k263j500
$$ 177948 179832 179262 176349 172310 168001 163300 157958 152213 146467 141073 136493 133116 130853 129353
54896A29353q61l12l19j058j884j990j237j52N38M01k67n86r6O97J288K014L186
$$ 129353 128492 128180 127861 126803 124919 122929 121692 121540 122078 122479 122212 121626 121530 122227 123515 125529 128715
54879A28715M023L723L051L447M812N678N500N202N307N020L583J361q75k738
$$ 128715 132738 136461 139512 142959 147771 153449 158949 164151 169458 174478 178061 179422 178547 175809
54865A75809m001m514m619m839n091m937m486m150l776l051k391k289k163j247
$$ 175809 171808 167294 162675 157836 152745 147808 143322 139172 135396 132345 129954 127665 125502 124255
54851A24255j66k19j307k245k756l380l704k740j064m85j211j495m82O43R21R31
$$ 124255 124089 123870 122563 120318 117562 114182 110478 107738 106674 106189 104978 103483 103001 103644 104565 105496
54835A05496J124Q52K6j79O44J154M61l71j94L56K13k71k43R1O9j46j11km1J90
$$ 105496 106620 107472 107498 107319 107963 109117 109578 109207 109013 109369 109582 109311 109068 109159 109228 109082 108971 108969 108928 109118
54815A09118Q57J253Q69K42j1j3J30P81J681J714O45j67K12Q79Q15O71J354K041
$$ 109118 109975 111228 112097 112339 112328 112315 112445 113226 114907 116621 117266 117099 117311 118190 119005 119676 121030 123071
54797A23071J296n23j638j307m45j4%J2J47K54N3n36j006p06J02M01J1J3J024
$$ 123071 124367 123844 122206 120899 120454 120440 120440 120452 120599 120853 120906 120370 119364 118658 118760 119161 119172 119185 120209
54778A20209K088K088J343Q56Q49J017J463K301K982K987K769L125M037M943N702
$$ 120209 122297 124385 125728 126584 127433 128450 129913 132214 135196 138183 140952 144077 148114 153057 158759
54763A58759O491P151P372P169O672N774M398K721P83j491l705n160n927o782
$$ 158759 165250 172401 179773 186942 193614 199388 203786 206507 207290 205799 202094 196934 191007 184225
54749A84225p805q045p069n697m706l929l252l169l558l221j642k2M76L16L41
$$ 184225 176420 168375 161306 155609 150903 146974 143722 140553 136995 133774 132132 132110 132586 132902 133243
54734A33243J54q57j908j840r11j98J41N82R09P20P34K019M142N558N694N343
$$ 133243 133397 132540 130632 128792 127881 127683 127824 128406 129315 130035 130769 132788 136930 142488 148182 153525
54718A53525N110M715L913K924J871O96l24q24j104j862l203m577n552n955n533
$$ 153525 158635 163350 167263 170187 172058 172754 172430 171606 170502 168640 165437 160860 155308 149353 143820
54703A43820m269k819j914j460r17l38k42o24q69o33k13q8n09j423k366k702k299
$$ 143820 139551 136732 134818 133358 132441 132103 131861 131237 130368 129735 129522 129434 128925 127502 125136 122434 120135
54686A20135j706j352j039n31o9J51L80P29P41J50n78r63j142j243r05o9N57N24
$$ 120135 118429 117077 116038 115507 115438 115589 115969 116698 117439 117589 117011 116048 114906 113663 112758 112689 113246 113770
54668A13770L98O30N81l89j527j622p74j30j72m10m75n41o93p32n61k05L23P56
$$ 113770 114168 114798 115379 114990 113463 111841 111067 110937 110765 110355 109880 109339 108646 107914 107353 107148 107471 108227
54650A08227N48k61p36k03P53J170R92P01L46k07m97J5R72J474J199N50m1k86
$$ 108227 108775 108514 107778 107575 108328 109498 110490 111191 111537 111330 110833 110848 111820 113294 114493 115043 115002 114716
54632A14716M5P87J250J009M07n9l52m92l38j25m10r96r48j89J57k86k75R08J914
$$ 114716 114761 115548 116798 117807 118214 118155 117803 117311 116973 116848 116438 115442 114494 114305 114462 114176 113901 114809 116723
54613A16723J357J49L8Q39J008K99j16J82L95J35p6lj4j89k54l17o16q03n42l49
$$ 116723 118080 118229 118267 119106 120114 120413 120297 120479 120874 121009 120933 120930 120916 120727 120473 120156 119540 118737 118195 117846
54593A17846p35j053m92K97J05p60r28k28J70j78m59k30L7J68O10J274J441J054
$$ 117846 117111 116058 115566 115863 115968 115208 114280 114052 114222 114044 113585 113355 113392 113560 114170 115444 116885 117939
54575A17939Q54J048R98M71m7m37j130j971k105j278k20M66Q15Q36L91j19j6O68
$$ 117939 118793 119841 120839 121310 121263 120826 119696 117725 115620 114342 114122 114588 115403 116239 116630 116511 116495 117163
54557A17163J320J743K000J575M3j637j963j007k00j4M09J219J344N46J65R80
$$ 117163 118483 120226 122226 123801 123844 122207 120244 119237 119037 119023 119432 120651 121995 122541 122706 123686
54541A23686J873J624P11L39O74J107J326J280P65j08o60m86l1Q0k77r65j787
$$ 123686 125559 127183 127894 128233 128907 130014 131340 132620 133385 133277 132617 132131 132100 132180 131903 130938 129151
54524A29151k156j513l10K93J6k66j02j54p87j232q60k50j62l63k81j7J38M05
$$ 129151 126995 125482 125172 125465 125481 125215 125113 124959 124172 122940 122080 121830 121668 121305 121024 121007 121145 121550
54506A21550Q90R54N0j262j972j801j129k36P30J455J759J838J739J115Rp95p66
$$ 121550 122440 123394 123444 122182 120210 118409 117280 117044 117774 119229 120988 122826 124565 125680 125689 124894 124128
54489A24128m45m79m68L18J510J919J162J21k96r3K75O40J024J236J042O80P32
$$ 124128 123683 123204 122736 123054 124564 126483 127645 127766 127470 127377 127652 128292 129316 130552 131594 132274 133006
54472A33006J358J886J569O25N4L40Q76R79Q39R76J202R14J19n76q13p12m02p2
$$ 133006 134364 136250 137819 138444 138498 138838 139714 140693 141532 142508 143710 144624 144743 144167 143354 142642 142240 142168
54454A42168j78q96j519j236m01j32p05j238j040m51j69m48j126j738j630o46
$$ 142168 141990 141094 139575 138339 137938 137806 137101 135863 134823 134372 134203 133755 132629 130891 129261 128615
54438A28615L47L43m38q85n74q1J76L87N28J88n33q99n76j0M73R95J389J087J66
$$ 128615 128962 129305 128867 127982 127408 127327 127503 127890 128418 128606 128073 127174 126598 126588 127061 128056 129445 130532 130698
54419A30698m20n7P32J163J138J030J082J305J494J261N83J54N17J029O26n46
$$ 130698 130278 130221 130953 132116 133254 134284 135366 136671 138165 139426 140009 140163 140680 141709 142335 141789
54403A41789j315j238r40o77J04J424K296K084J322P01K30j31m6N01R19Q92O51
$$ 141789 140474 139236 138296 137619 137723 139147 141443 143527 144849 145550 145780 145649 145603 146104 147023 147915 148566
54386A48566K29o34j475j233J35J289J270O30K09k3l43n02l80l85n59j66J049
$$ 148566 148795 148161 146686 145453 145588 146877 148147 148777 148986 148963 148620 148118 147738 147353 146794 146628 147677
54369A47677K123K187J671J440J569J705J856K043J988J792K173L277M066L623
$$ 147677 149800 151987 153658 155098 156667 158372 160228 162271 164259 166051 168224 171501 175567 179190
54355A79190K320R31n22k141l259l244k608k316k408k211j530q73o85j044j771
$$ 179190 181510 182441 181919 179778 176519 173275 170667 168351 165943 163732 162202 161329 160644 159600 157829
54340A57829k388k361j787j361j348j236p18k17m9R6L18J06n91q97l53K01j12
$$ 157829 155441 153080 151293 149932 148584 147348 146630 146413 146364 146460 146778 146884 146293 145396 145043 145244 145132
54323A45132q14r11l48K11M28K75l85j303j589p98K33M34j15n37m21K9N12O88
$$ 145132 144318 143407 143059 143270 143698 143973 143588 142285 140696 139898 140131 140565 140450 139913 139492 139521 140033 140721
54305A40721K46m97o84j16L77K54K6J28P3n02r60p46l28j30L72J402J894J044
$$ 140721 140967 140470 139786 139670 140047 140301 140327 140455 140528 140026 139066 138320 137992 137862 138234 139636 141530 142574
54287A42574j24k30L24K21m55m99K98R69J049R77R07N38J4k01k64o04q90m64L85
$$ 142574 142450 142220 142544 142765 142310 141811 142109 143078 144127 145104 146011 146549 146563 146362 146098 145494 144604 144140 144525
54268A44525P95P75J013J400J118K09k39K74R71J053P17O50J143J882K208J631
$$ 144525 145320 146095 147108 148508 149626 149835 149596 149870 150841 151894 152611 153261 154404 156286 158494 160125
54252A60125N31l4K94N27k05j269j533j066o82m23J35N39l2j131j425p19j69m01
$$ 160125 160656 160622 160916 161443 161238 159969 158436 157370 156688 156265 156400 156939 156907 155776 154351 153632 153463 153062
54234A53062p55o08k37l6M0K1k30n11m41j18J81O85J648K421K227J468J108R57
$$ 153062 152307 151699 151462 151426 151466 151487 151257 150746 150305 150187 150368 151053 152701 155122 157349 158817 159925 160882
54216A60882O9j320j942j657j692k394k486j317j84m18j438j811j254m88J01O40
$$ 160882 160951 159631 157689 156032 154340 151946 149460 148143 147959 147541 146103 144292 143038 142550 142651 143291
54200A43291J041J054P57M44K89L79P10R00N24p2k2P23J149O30j57l74k73n85
$$ 143291 144332 145386 146143 146587 146876 147255 147965 148865 149389 149317 149295 150018 151167 151797 151640 151266 150993 150408
54182A50408j173j127o2J306J912J430N63K56N67N79l11j373j437m88L89M65m2
$$ 150408 149235 148108 148046 149352 151264 152694 153257 153513 154080 154659 154348 152975 151538 151050 151439 151904 151862
54165A51862o69j055o91O10J898J833M82o19m64M05J122J568J781J415N34k9R4
$$ 151862 151193 150138 149447 150057 151955 153788 154270 153651 153187 153592 154714 156282 158063 159478 160012 159983 160077
54148A60077J01p55j949k467k131j328j95J064J659J058o2o14n74p00j087j045
$$ 160077 160178 159423 157474 155007 152876 151548 151353 152417 154076 155134 155072 154458 153884 153184 152097 151052
54132A51052l64K54K32j54m17n27o29n11J45J166J915J933J395Q65O89P41P25
$$ 151052 150688 150942 151174 151020 150603 150076 149447 148936 149081 150247 152162 154095 155490 156355 157044 157785 158510
54115A58510O37O91R61J230J273J084P93N67N94R77J562J979J926J432Q71P39
$$ 158510 159147 159838 160799 162029 163302 164386 165179 165746 166340 167317 168879 170858 172784 174216 175087 175826
54099A75826J260K115K761L038L205L410L564L891M921O474P162N675K301j359
$$ 175826 177086 179201 181962 185000 188205 191615 195179 199070 203991 210465 217627 223302 225603 224244
54085B24244l995n350n753n585n226m864m325l491k749k517k518k082j143l17
$$ 224244 220249 214899 209146 203561 198335 193471 189146 185655 182906 180389 177871 175789 174646 174329
54071A74329p6k46l20J23J196K526L481L824L927M058L959L450K877K442J760
$$ 174329 174253 174007 173687 173810 175006 177532 181013 184837 188764 192822 196781 200231 203108 205550 207310
54056B07310O80j72l77n60j285j922j676r90o90m50M52J479J606J307J939L360
$$ 207310 207990 207818 207441 206881 205596 203674 201998 201008 200318 199868 200320 201799 203405 204712 206651 210011
54040B10011M012L462K912L025L186L317M454O711Q445Q399P259O159N125L968
$$ 210011 214023 217485 220397 223422 226608 229925 234379 241090 249535 257934 265193 271352 276477 280445
54026B80445L279L310L123K054J038J200K000K088J357Q09Q56Q50J58j149k565
$$ 280445 283724 287034 290157 292211 293249 294449 296449 298537 299894 300703 301559 302409 302567 301418 298853
54011B98853l535l826l889m413n301n740n523n392n665n619m812l992l846l796
$$ 298853 295318 291492 287603 283190 277889 272149 266626 261234 255569 249950 245138 241146 237300 233504
53997B33504l034j924j372j450j629j823k212k536k453k205k177k157j832j491
$$ 233504 230470 228546 227174 225724 224095 222272 220060 217524 215071 212866 210689 208532 206700 205209
53983B05209j538j751j686j309o57M57J686J909O11j115j823j389o04J90J029
$$ 205209 203671 201920 200234 198925 198268 198725 200411 202320 202931 201816 199993 198604 198000 198190 199219
53968A99219J534J350R64J067J444J486J351J658K383L032L550M135M591M822
$$ 199219 200753 202103 203067 204134 205578 207064 208415 210073 212456 215488 219038 223173 227764 232586
53954B32586N488P096Q980J0274J1252J2384J2579J0139N367N36k785m895o292
$$ 232586 238074 245170 254150 264424 275676 288060 300639 310778 316145 316681 313896 309001 302709
53941C02709o589n681m498l775l120k059r98m28NQ14J728K173K168K102K128K347
$$ 302709 296120 290439 285941 282166 279046 276987 275989 275561 275566 276380 278108 280281 282449 284551 286679 289026
53925B89026L100M390N402N329M496M098M783N996O725O587O124O207P194Q590
$$ 289026 292126 296516 301918 307247 311743 315841 320624 326620 333345 339932 346056 352263 359457 368047
53911C68047R570R674Q978P710O065M365K984J976J025j13j355k449l195l495
$$ 368047 377617 387291 396269 403979 410044 414409 417393 419369 420394 420281 418926 416477 413282 409787
53897D09787l415l278l411l794m132m322m637n373o451p472q104q382q650r041
$$ 409787 406372 403094 399683 395889 391757 387435 382798 377425 370974 363502 355398 347016 338366 329325
53883C29325r137q404p004n809n366n286m969m554m603n082n245m576l446k661
$$ 329325 320188 311784 304780 298971 293605 288319 283350 278796 274193 269111 263866 259290 255844 253183
53869B53183k620l008l221l098l071l480l872l498k455j727j789j902j296m00
$$ 253183 250563 247555 244334 241236 238165 234685 230813 227315 224860 223133 221344 219442 218146 217746
53855B17746j59o29j034j002q61q22o58l69l90r26j483j482r79n49n62p62n54
$$ 217746 217587 216958 215924 214922 214061 213239 212581 212212 211822 210896 209413 207931 206952 206403 205841 205079 204525
53838B04525K85J220J382M77r20j985k335k009j208k55N03R62J235J265R06M83
$$ 204525 204810 206030 207412 207889 206969 204984 202649 200640 199432 199177 199680 200642 201877 203142 204048 204531
53822B04531N74J041R57k7r36p17L63J261J637J925K331K589K633K677K715K580
$$ 204531 205105 206146 207103 207076 206140 205423 205786 207047 208684 210609 212940 215529 218162 220839 223554 226134
53806B26134K455K752L460M149M549M706M704M694N017N777O466O479N810M888
$$ 226134 228589 231341 234801 238950 243499 248205 252909 257603 262620 268397 274863 281342 287152 292040
53792B92040L960L204L007L461L869L463K352J194K48n21p99l57J00m55j944l318
$$ 292040 296000 299204 302211 305672 309541 313004 315356 316550 316798 316277 315478 315121 315221 314766 312822 309504
53776C09504m106m835n798o489o544o313o108n657m777l889l371k969k362j838
$$ 309504 305398 300563 294765 288276 281732 275419 269311 263654 258877 254988 251617 248648 246286 244448
53762B44448j935k625l304l391k785j908j420j641k208k522k490k473k575k467
$$ 244448 242513 239888 236584 233193 230408 228500 227080 225439 223231 220709 218219 215746 213171 210704
53748B10704j948j211n08N8L27J22l73p31q11q38q77o74j02N89J048J067O46J42
$$ 210704 208756 207545 207037 207095 207422 207544 207171 206440 205629 204791 203914 203240 203138 203727 204775 205842 206488 206630
53730B06630K14J118K167K405J798J185J045J012O72K71L18R31J799K410K321
$$ 206630 206844 207962 210129 212534 214332 215517 216562 217574 218246 218517 218835 219766 221565 223975 226296
53715B26296J538O66K98L05K36K01P37J745K425K428K300K493K709K614K544K843
$$ 226296 227834 228500 228798 229103 229339 229540 230277 232022 234447 236875 239175 241668 244377 246991 249535 252378
53699B52378L083K660J948K030L247M601M821L706K160J133Q22R28J230J554J434
$$ 252378 255461 258121 260069 262099 265346 269947 274768 278474 280634 281767 282589 283517 284747 286301 287735
53684B87735M60r39j684j363q07q84j323j313q41o01q35j073r90p78o51o16p25
$$ 287735 288195 287256 285572 284209 283402 282518 281195 279882 279041 278440 277605 276532 275542 274764 274113 273497 272772
53667B72772j003j173r57o22n51n04k6N53M54j74k56N26J086N07o11j073p29l62
$$ 272772 271769 270596 269639 269017 268466 267962 267936 268489 268943 268769 268513 269039 270125 270632 270021 268948 268219 267857
53649B67857k93m2O50J208R79J60l65p4O95J271J454J467J446J365J422J889K496
$$ 267857 267564 267522 268172 269380 270359 270519 270154 270080 270775 272046 273500 274967 276413 277778 279200 281089 283585
53632B83585K617K225K001K213K347K246K610L671M339L702K644K730L997N146
$$ 283585 286202 288427 290428 292641 294988 297234 299844 303515 307854 311556 314200 316930 320927 326073
53618C26073N532N642N760N461M507L191J825P87P76J886K836K431J464J562K562
$$ 326073 331605 337247 343007 348468 352975 356166 357991 358778 359554 361440 364276 366707 368171 369733 372295
53603C72295K831K174K130L075L295J903N22O79J404J023j18m92O5M18J06l46
$$ 372295 375126 377300 379430 382505 385800 387703 388225 388904 390308 391331 391213 390721 390786 391204 391310 390964
53587C90964o85j119j552j780k101k751l135k716k099k151k450j933q02m18j324
$$ 390964 390279 389160 387608 385828 383727 380976 377841 375125 373026 370875 368425 366492 365690 365272 363948
53572C63948k525k890k318j383o00j97j9M04J151J500Q97K1k0O59Q34Qr31j045
$$ 363948 361423 358533 356215 354832 354232 354035 354016 354420 355571 357071 357968 357989 357969 358628 359462 359470 358539 357494
53554C57494m62K36R05J635K138J955J065oo25n02J08O68R67J336K006K597K671
$$ 357494 357032 357268 358173 359808 361946 363901 364966 364960 364335 363833 363941 364609 365576 366912 368918 371515 374186
53537C74186K611L286M782O164O658O557O662P210P785Q017Q039Q255Q884R831
$$ 374186 376797 380083 384865 391029 397687 404244 410906 418116 425901 433918 441957 450212 459096 468927
53523D68927J0812J1640J2348J3065J3773J4222J4150J3701J3534J4357J6151
$$ 468927 479739 491379 503727 516792 530565 544787 558937 572638 586172 600529 616680
53512F16680J8059J9252J9814K0506K1794K3443K4871K5543K5198K4118K3164
$$ 616680 634739 653991 673805 694311 716105 739548 764419 789962 815160 839278 862442
53501H62442K2999K3306K3287K2831K2501K2360K1640J9904J7835J6427J5991
$$ 862442 885441 908747 932034 954865 977366 999726 1021366 1041270 1059105 1075532 1091523
53490A091523J6249J6873J7512J7793J7737J7757J7950J7854J7272J6687J6515
$$ 1091523 1107772 1124645 1142157 1159950 1177687 1195444 1213394 1231248 1248520 1265207 1281722
53479A281722J6452J6090J5539J4937J3866J2015R983Q672Q105P459O092L933
$$ 1281722 1298174 1314264 1329803 1344740 1358606 1370621 1380604 1389276 1397381 1404840 1410932 1414865
53467A414865J044k513o364r869j2595j4511j5716j6305j6449j6400j6423j6725
$$ 1414865 1415909 1413396 1407032 1397163 1384568 1370057 1354341 1338036 1321587 1305187 1288764 1272039
53455A272039j7300j7863j8179j8441j9007j9773k0314k0544k0676k0548j9746
$$ 1272039 1254739 1236876 1218697 1200256 1181249 1161476 1141162 1120618 1099942 1079394 1059648
53444A059648j8520j7710j7458j6862j5275j3177j1230r313p164n270m269l982
$$ 1059648 1041128 1023418 1005960 989098 973823 960646 949416 940103 932939 927669 923400 919418
53432I19418l744l308k723j697J33K519M670O013O610P059Q121R937J1627J2312
$$ 919418 915674 912366 909643 907946 908079 910598 915268 921281 927891 934950 943071 953008 964635 976947
53418I76947J2555J3823J6351J8759K0186K1434K3272K4949K5610K5953K7150
$$ 976947 989502 1003325 1019676 1038435 1058621 1080055 1103327 1128276 1153886 1179839 1206989
53407A206989K8978L0468L1633L3118L4753L6029L7486M0036M3164M5375M6370
$$ 1206989 1235967 1266435 1298068 1331186 1365939 1401968 1439454 1479490 1522654 1568029 1614399
53396A614399M7292M8736N0030N0672N1195N2142N3294N4227N4847N5074N4752
$$ 1614399 1661691 1710427 1760457 1811129 1862324 1914466 1967760 2021987 2076834 2131908 2186660
53385B186660N3976N2848N1056M8481M5929M4235M2819M0334L6621L2759K9150
$$ 2186660 2240636 2293484 2344540 2393021 2438950 2483185 2526004 2566338 2602959 2635718 2664868
53374B664868K4950J9710J4295R639N595J539k806p627j3199j9353k5458l1301
$$ 2664868 2689818 2709528 2723823 2733462 2739057 2740596 2737790 2730163 2716964 2697611 2672153 2640852
53362B640852l7234m3166m8194n1645n3750n5010n5591n5614n5269n4413n2767
$$ 2640852 2603618 2560452 2512258 2460613 2406863 2351853 2296262 2240648 2185379 2130966 2078199
53351B078199n0746m9191m8055m6369m3915m1888m1277m1486m1297m0504l9724
$$ 2078199 2027453 1978262 1930207 1883838 1839923 1798035 1756758 1715272 1673975 1633471 1593747
53340A593747l9140l8267l6713l4623l2479l0734k9400k7873k5589k2871k0535
$$ 1593747 1554607 1516340 1479627 1445004 1412525 1381791 1352391 1324518 1298929 1276058 1255523
53329A255523j8627j6381j3672j1513j0672j0627j0587j0692j1407j2327j2568
$$ 1255523 1236896 1220515 1206843 1195330 1184658 1174031 1163444 1152752 1141345 1129018 1116450
53318A116450j2011j1291j0742j0027q825p257n646m199k902j500K81K248L711
$$ 1116450 1104439 1093148 1082406 1072379 1063554 1056297 1050651 1046452 1043550 1042050 1042331 1044579 1048290
53305A048290M305M586N484P279R342J0861J1626J2281J3822J6618J9836K2109
$$ 1048290 1052595 1057181 1062665 1069944 1079286 1090147 1101773 1114054 1127876 1144494 1164330 1186439
53293A186439K2864K2816K3083K4169K5801K7300K7972K7518K6298K4924K3592
$$ 1186439 1209303 1232119 1255202 1279371 1305172 1332472 1360444 1387962 1414260 1439184 1462776
53282A462776K2043K0167J8144J6041J3755J1349Q886O006K290j819n172p290
$$ 1462776 1484819 1504986 1523130 1539171 1552926 1564275 1573161 1579167 1581457 1579638 1574466 1567176
53270A567176q935j1048j3651j6175j8290k0065k1703k3412k5226k6800k7789
$$ 1567176 1558241 1547193 1533542 1517367 1499077 1479012 1457309 1433897 1408671 1381871 1354082
53259A354082k8401k9045k9440k8967k8008k7932k9233l0574l0425k8875k7117
$$ 1354082 1325681 1296636 1267196 1238229 1210221 1182289 1153056 1122482 1092057 1063182 1036065
53248A036065k5778k4666k3779k3512k3901k4391k4464k4039k3313k2562k2085
$$ 1036065 1010287 985621 961842 938330 914429 890038 865574 841535 818222 795660 773575
53237G73575k1893k1558k0601j9050j7385j5964j4731j3378j1720r956q608p998
$$ 773575 751682 730124 709523 690473 673088 657124 642393 629015 617295 607339 598731 590733
53225E90733p844p632p252o936o750o671p089q462j0394j1860j2512j2952j3431
$$ 590733 582889 575257 568005 561069 554319 547648 540559 532097 521703 509843 497331 484379 470948
53212D70948j3253j1987j0412r454q891p948o741o125o339o642o326n446m503
$$ 470948 457695 445708 435296 425842 416951 409003 402262 396137 389798 383156 376830 371384 366881
53199C66881l931l945m466n163n737o143o384o331n973n574n269m776l841k752
$$ 366881 362950 359005 354539 349376 343639 337496 331112 324781 318808 313234 307965 303189 299348 296596
53185B96596k076k103k756l780m674m816m052l016k517k740l325l907m222l970
$$ 296596 294520 292417 289661 285881 281207 276391 272339 269323 266806 264066 260741 256834 252612 248642
53171B48642l046j806p65p1M63Q88J028P85L53O1R1K82J98l99j232j822k030j959
$$ 248642 245596 243790 243025 242954 243417 244305 245333 246118 246471 246532 246623 246905 247103 246704 245472 243650 241620 239661
53153B39661j522n68N33J057P80J70l36p24j011j066r71r33p62r4P18P90M8m58
$$ 239661 238139 237571 238104 239161 239941 240111 239775 239051 238040 236974 236003 235070 234308 234214 234932 235722 235770 235312
53135B35312j6Q27J290J450J635J592J086P39J244K184K443J653M86k42j35P93
$$ 235312 235296 236123 237413 238863 240498 242090 243176 243915 245159 247343 249786 251439 251925 251683 251548 252341
53119B52341K068K790K401J232J3q75j242p65M90J611J675Q20j11p37j258j752
$$ 252341 254409 257199 259600 260832 260845 259970 258728 257963 258453 260064 261739 262559 262448 261711 260453 258701
53103B58701k066k272k575k836k756k413k017j426n12J92qr06j501j238n20M7
$$ 258701 256635 254363 251788 248952 246196 243783 241766 240340 239828 240020 240012 239106 237605 236367 235847 235894
53087B35894L16M51N86Q04J071J183R86O08J93l76j161j781j760j178n88l98n87
$$ 235894 236210 236661 237247 238051 239122 240305 241291 241899 242092 241716 240555 238774 237014 235836 235248 234850 234263
53070B34263q54p41j9Q15P62m77j902k331j694p60nN86R09O77p2r73j719k083
$$ 234263 233409 232668 232649 233464 234226 233749 231847 229516 227822 227062 227057 227643 228552 229229 229157 228184 226465 224382
53052B24382j850j153n12q3O14J722K419K045J211R26J053P56M1l07j61j36l12
$$ 224382 222532 221379 220867 220784 221398 223120 225539 227584 228795 229721 230774 231530 231571 231264 231103 230967 230655
53035B30655p9N51P00K1p35r37r27j188j511j524j319j060n20M61J493K058K023
$$ 230655 230576 231127 231827 231848 231113 230176 229249 228061 226550 225026 223707 222647 222127 222588 224081 226139 228162
53018B28162J536Q20K96L44P30P78L96L09Q70J352R48N5k39L32R15P60J60j05
$$ 228162 229698 230518 230814 231158 231888 232666 233062 233371 234241 235593 236541 236596 236357 236689 237604 238364 238524 238419
53000B38419R2O7p14j829k323j873j111p16o01k97J92L89N1n18p83m06N04J410
$$ 238419 238511 238578 237864 236035 233712 231839 230728 230012 229411 229114 229306 229695 229746 229228 228445 228039 228543 229953
52982B29953J803J864K198K819K959K285J590J590J776J330O13O29J339J718J361
$$ 229953 231756 233620 235818 238637 241596 243881 245471 247061 248837 250167 250780 251409 252748 254466 255827
52967B55827Q85O74L52k94q71j072r52m03P39J813J714M76n50n72m17j073k113
$$ 255827 256712 257386 257738 257444 256573 255501 254549 254146 254885 256698 258412 258888 258338 257766 257349 256276 254163
52950B54163k479k097j792j930k085j887j533j369j447j551j424j018n60k93j42
$$ 254163 251684 249587 247795 245865 243780 241893 240360 238991 237544 235993 234569 233551 232991 232698 232556
52935B32556M1P1k74o30l79L31N83n5r09j159q20m47l72n95q84p52J62J274J351
$$ 232556 232597 232668 232394 231764 231385 231716 232299 232244 231335 230176 229356 228909 228537 227942 227058 226306 226468 227742 229093
52916B29093N4j383j581o01M88J113J487J767J744J332P26N6o08r48o57oL24Q6
$$ 229093 229147 227764 226183 225582 226070 227183 228670 230437 232181 233513 234239 234295 233687 232739 232082 232076 232400 232486
52898B32486k88l61k53l30n96p05m41K9M07N92O83P14N95L26J15K00O21J211J642
$$ 232486 232198 231837 231584 231254 230658 229953 229512 229541 229948 230540 231223 231937 232532 232858 232973 233173 233794 235005 236647
52879B36647J510O24o24j488j622j320r07l20M17R00R17R10J244J571J513J501
$$ 236647 238157 238781 238157 236669 235047 233727 232820 232500 232917 233817 234734 235644 236888 238459 239972 241473
52863B41473K077K754K554J515O75O38J036J353J379Q54l73j722k345k346k620
$$ 241473 243550 246304 248858 250373 251048 251686 252722 254075 255454 256308 255935 254213 251868 249522 246902
52848B46902l391l934l869l631l417k834j960j597j919j977j190l02j12k08Q6
$$ 246902 243511 239577 235708 232077 228660 225826 223866 222269 220350 218373 217183 216881 216769 216561 216647
52833B16647M73L35j6J50O98Q68M76N5K3M03J082J682J524L80r71j581j440j177
$$ 216647 217120 217455 217439 217589 218287 219155 219631 219686 219709 220112 221194 222876 224400 224780 223809 222228 220788 219611
52815B19611r75m80M37J462K309K863K997K672K119J608J210Q87N40j94j593l104
$$ 219611 218636 218156 218593 220055 222364 225227 228224 230896 233015 234623 235833 236720 237260 237066 235473 232369
52799B32369l619k878j880j493j419j108q30r75j072n58N9r0p92j059o80l28l10
$$ 232369 228750 225872 223992 222499 221080 219972 219142 218167 217095 216537 216596 216506 215714 214655 213975 213647 213337
52782B13337k04K02N91Q01J039J311J360J231J217J235Q83J76m07n99n06j53N51
$$ 213337 213133 213335 213926 214727 215766 217077 218437 219668 220885 222120 223003 223179 222772 222173 221667 221514 222065
52765B22065J265J325N03p42j775k140j625m82M66N51Q3p2L86R99J349J407J191
$$ 222065 223330 224655 225158 224416 222641 220501 218876 218394 218860 219411 219494 219422 219808 220807 222156 223563 224754
52748B24754P21L65N79J275J924K245K308K113J615J078P96N77J61j32J61P59
$$ 224754 225475 225840 226419 227694 229618 231863 234171 236284 237899 238977 239773 240350 240511 240379 240540 241299
52732B41299J024J051J428J960J797R12K97L81L38n05j581k033j867j486q83j46
$$ 241299 242323 243374 244802 246762 248559 249471 249768 250149 250487 249982 248401 246368 244501 243015 242132 241986
52716B41986L7p35j642j557n36M11P78Q34O43j34j326k016j581l66R39K006K644
$$ 241986 242023 241288 239646 238089 237553 237964 238742 239576 240219 240085 238759 236743 235162 234796 235735 237741 240385
52699B40385K470J432K60k00jO2m06q99p91j14O04R66Q88M08k78p36o66k33J44
$$ 240385 242855 244287 244547 244347 244346 244408 244002 243103 242312 242198 242802 243768 244656 245064 244786 244050 243384 243151 243295
52680B43295L25M04K88k65j167j946k215j923j194l18J76k6m84m40J21M73K94
$$ 243295 243620 244024 244312 244047 242880 240934 238719 236796 235602 235284 235460 235434 234950 234510 234631 235104 235398
52663B35398M2L6j4k24q2O14J217J265J356K157L163L459L123K871K676J927P42
$$ 235398 235440 235476 235462 235238 235156 235770 236987 238252 239608 241765 244928 248387 251510 254381 257057 258984 259726
52646B59726m8k86o81j512k174k221j972j681j131m51m29j360k293k146j072j1
$$ 259726 259678 259392 258711 257199 255025 252804 250832 249151 248020 247569 247140 245780 243487 241341 240269 240258
52630B40258O43J214J886K365K511K614K869K902K168O88q51j767j992j921j806
$$ 240258 240901 242115 244001 246366 248877 251491 254360 257262 259430 260118 259267 257500 255508 253587 251781
52615B51781j608j369j323j454j375r02l93j41J32P15J189R27J02m53l71m4J58
$$ 251781 250173 248804 247481 246027 244652 243750 243357 243216 243348 244063 245252 246179 246281 245828 245457 245413 245571
52598B45571L03M22K57k13n27k50N33J411J988J983J350N05J09M28J076J452J307
$$ 245571 245874 246296 246553 246340 245813 245563 246096 247507 249495 251478 252828 253333 253442 253870 254946 256398 257705
52581B57705Q53N43O67J016J054N32k30q51j337j671j473n71L70M11n54j784k594
$$ 257705 258558 259101 259768 260784 261838 262370 262140 261289 259952 258281 256808 256237 256607 257018 256464 254680 252086
52564B52086k712k057q09L50P89O91O69P54M94o1l31j96k52q74j696k155k018
$$ 252086 249374 247317 246508 246858 247647 248338 249007 249761 250255 250194 249863 249667 249415 248541 246845 244690 242672
52547B42672j221J08J346J754J266M79j89o58o96k3R21J245P95L69N26R74J299
$$ 242672 241451 241559 242905 244659 245925 246404 246215 245557 244861 244838 245759 247004 247799 248168 248694 249668 250967
52530B50967J518J616J364Q90O68O22J18q27j263p24l5l6l38j22M97Q20P73Q91
$$ 250967 252485 254101 255465 256355 257023 257645 257763 256936 255673 254949 254914 254878 254540 254418 254915 255735 256508 257399
52512B57399J347J760J902J969K231K715L240L502L282K617J603R5j893l600m045
$$ 257399 258746 260506 262408 264377 266608 269323 272563 276065 279347 281964 283567 283662 281769 278169 274124
52497B74124l295k487k338k447k292k035j881j485o44J27L02Q4r6j42L7P17J632
$$ 274124 270829 268342 266004 263557 261265 259230 257349 255864 255220 255347 255649 255733 255637 255495 255532 256249 257881
52480B57881J900J351J036J694K507K319J360O64M47K13j6J90O37P39O20Q90J473
$$ 257881 259781 261132 262168 263862 266369 268688 270048 270712 271159 271372 271356 271546 272183 272922 273542 274432 275905
52463B75905J696J517J551J939K153K028J944J873J177k69j644k177k036j864
$$ 275905 277601 279118 280669 282608 284761 286789 288733 290606 291783 291514 289870 287693 285657 283793
52449B83793k017k488l121l609l610l084k314j636j305j394j510r71K57J190R77
$$ 283793 281776 279288 276167 272558 268948 265864 263550 261914 260609 259215 257705 256734 256991 258181 259158
52434B59158P4m38l45k66l81k05M08J002J306J485J502J093M90K85M62L96j3j32
$$ 259158 259232 258794 258449 258183 257802 257597 258005 259007 260313 261798 263300 264393 264883 265168 265630 266026 266013 265881
52416B65881K36M53J95J56J027K476L707M430M831N149N792P290R550J1523J2113
$$ 265881 266117 266570 266765 266921 267948 270424 274131 278561 283392 288541 294333 301623 311173 322696 334809
52401C34809J1074Q728N314J187k787n697p332q083q286q014p275o094m568l089
$$ 334809 345883 354611 359925 361112 358325 352628 345296 337213 328927 320913 313638 307544 302976 299887
52387B99887k231k128k286k169j681r11P5R41J128O55L59Q59J680K039K033K383
$$ 299887 297656 295528 293242 291073 289392 288481 288556 289497 290625 291280 291639 292498 294178 296217 298250 300633
52371C00633L256M094M494M594M590M475M293M060L383J857n4j211j159p37q97
$$ 300633 303889 307983 312477 317071 321661 326136 330429 334489 337872 339729 339675 338464 337305 336568 335671
52356C35671j421j379n95O4q9n93m25P00J943K253J465M23J16P60J718K238K187
$$ 335671 334250 332871 332276 332340 332251 331658 331233 331933 333876 336129 337594 338017 338133 338893 340611 342849 345036
52339C45036K097K533L502M510N127N464N981O896P861Q366Q405Q596R457J0721
$$ 345036 347133 349666 353168 357678 362805 368269 374250 381146 389007 397373 405778 414374 423831 434552
52325D34552J1641J2061J2761J4375J6269J7099J6494J5545J5318J5538J5243
$$ 434552 446193 458254 471015 485390 501659 518758 535252 550797 566115 581653 596896
52314E96896J4340J3728J3961J4514J4600J4158J3706J3585J3732J4011J4360
$$ 596896 611236 624964 638925 653439 668039 682197 695903 709488 723220 737231 751591
52303G51591J4570J4270J3318J2121J1266J0816J0193R008P702O881O173M491
$$ 751591 766161 780431 793749 805870 817136 827952 838145 847153 854855 861736 867909 872400
52291H72400J613j316l252m563o035p326p524o879o646p065o847n215l258k408
$$ 872400 874013 872697 869445 864882 858847 851521 843997 837118 830472 823407 816560 811345 808087 805679
52277H05679k400j840k89J330K352L253M659O270P302P627P955Q908J0144J0594
$$ 805679 803279 801439 801150 802480 804832 808085 812744 819014 826316 833943 841898 850806 860950 871544
52263H71544R683Q244P868R166J1003J1790J1273J0550J0520J0993J1371J1536
$$ 871544 881227 889471 897339 906505 917508 929298 940571 951121 961641 972634 984005 995541
52251I95541J1635J1488J0685R097O994M726K573P65o94k145l879n623o782p226
$$ 995541 1007176 1018664 1029349 1038446 1045440 1050166 1052739 1053504 1052810 1050665 1046786 1041163 1034381 1027155
52237A027155p521q183r033r545r584r436r235q808q105p442p079o868o533o063
$$ 1027155 1019634 1011451 1002418 992873 983289 973853 964618 955810 947705 940263 933184 926316 919783 913720
52223I13720n574m932l866k432j119m11l19m25k59L85J317K192K867L556M511
$$ 913720 908146 903214 899348 896916 895797 895386 895067 894642 894383 894768 896085 898277 901144 904700 909211
52208I09211N594O335O382N829N048M355L895L736L937M446M967N109M799M490
$$ 909211 914805 921140 927522 933351 938399 942754 946649 950385 954322 958768 963735 968844 973643 978133
52194I78133M765N613O337O278N529M741M364M259L937L022J532r7j346k172l135
$$ 978133 982898 988511 994848 1001126 1006655 1011396 1015760 1020019 1023956 1026978 1028510 1028413 1027067 1024895 1021760
52179A021760m703o596q071q835r222r482r327q474p221o132n378m680l858l002
$$ 1021760 1017057 1010461 1002390 993555 984333 974851 965524 957050 949829 943697 938319 933639 929781 926779
52165I26779k160j237l14L30P18J383K691M119M688M172L407L176L217K730J560
$$ 926779 924619 923382 923068 923398 924116 925499 928190 932309 936997 941169 944576 947752 950969 953699 955259
52150I55259M30LK29O18Q03O69L37J29L43Q36J083P52L4o92j194j254o23N84J731
$$ 955259 955689 955692 955921 956539 957342 958011 958348 958477 958820 959656 960739 961491 961525 960833 959639 958385 957762 958346 960077
52131I60077K281K516L268N000P420R894J2067J4089J6365J9067K1792K3811K4782
$$ 960077 962358 964874 968142 973142 980562 990456 1002523 1016612 1032977 1052044 1073836 1097647 1122429
52118A122429K5019K5042K5045K4913K4457K3498K1956K0117J8471J7081J5444
$$ 1122429 1147448 1172490 1197535 1222448 1246905 1270403 1292359 1312476 1330947 1348028 1363472
52107A363472J3294J1219R981R415Q565O881M838L350K802K778K530J661M47n68
$$ 1363472 1376766 1387985 1397966 1407381 1415946 1422827 1427665 1431015 1433817 1436595 1439125 1440786 1441233 1440665
52093A440665j361k571m791p954j1529j4926j7474j8546j8165j7179j6347j5543
$$ 1440665 1439304 1436733 1431942 1423988 1412459 1397533 1380059 1361513 1343348 1326169 1309822 1294279
52081A294279j4246j2526j0868r269p191m495j770K81J534K408L583N571Q192
$$ 1294279 1280033 1267507 1256639 1247370 1240179 1235684 1233914 1234195 1235729 1238137 1241720 1247291 1255483
52068A255483J0481J1565J1549J1228J1118J1178J1358J1737J2169J2264J1833
$$ 1255483 1265964 1277529 1289078 1300306 1311424 1322602 1333960 1345697 1357866 1370130 1381963
52057A381963J1014R987Q976Q275P936P465O316M456K168m48l214n535p086q476
$$ 1381963 1392977 1402964 1411940 1420215 1428151 1435616 1441932 1446388 1448556 1448108 1444894 1439359 1432273 1423797
52043A423797j0477j2794j4583j5909j7538j9325k0065j9228j7772j6729j6007
$$ 1423797 1413320 1400526 1385943 1370034 1352496 1333171 1313106 1293878 1276106 1259377 1243370
52032A243370j5092j4014j2973j1780j0345r179q820r167r804j0486j0950j0880
$$ 1243370 1228278 1214264 1201291 1189511 1179166 1169987 1161167 1152000 1142196 1131710 1120760 1109880
52020A109880j0493j0544j1250j1800j1422j0363r245q112o835n926o105p253
$$ 1109880 1099387 1088843 1077593 1065793 1054371 1044008 1034763 1026651 1019816 1013890 1007785 1000532
52008A000532q484r146r268r232r525j0572j2359j4304j5847j6928j7656j7802
$$ 1000532 992048 982902 973634 964402 954877 944305 931946 917642 901795 884867 867211 849409
51996H49409j7080j5594j3731j1800j0054q711p751p048o861p624r054j0195j0661
$$ 849409 832329 816735 803004 791204 781150 772439 764688 757640 750779 743155 734101 723906 713245
51983G13245j1076j1800j2137j1615j1132j1836j3320j4126j3721j2935j2533
$$ 713245 702169 690369 678232 666617 655485 643649 630329 616203 602482 589547 577014
51972E77014j2322j1674j0210p852m904k043K93K289M137N444O024O746Q473J0437
$$ 577014 564692 553018 542808 534956 530052 528009 528302 530591 534728 540172 546196 552942 561415 571852
51958E71852J0839R105O341L554O33k520n150o653p465q120q173o953m818k718
$$ 571852 582691 591796 598137 601691 602324 599804 594654 588001 580536 572416 564243 557290 552472 549754
51944E49754q29J456M189O528P953R137J1021J3414J5146J5593J5470J5820J6662
$$ 549754 548925 550381 554570 561098 569051 578188 589209 602623 617769 633362 648832 664652 681314
51931F81314J7057J6354J4781J2884J0919Q950O869M046l91o486j3069j8859k3404
$$ 681314 698371 714725 729506 742390 753309 762259 769128 773174 772783 766297 753228 734369 710965
51918G10965k6542k7759k6932k5147k3725k2633k0794j7822j4491j1517q865o425
$$ 710965 684423 656664 629732 604585 580860 558227 537433 519611 505120 493603 484738 478313
51906D78313m389k755j180L93J682K751M059N594O707P033O765N770L349n60m748
$$ 478313 473924 471169 469989 470382 472064 474815 478874 484468 491175 498208 504973 510743 514092 513532 508784
51891E08784p945j0057j1599j2528j2416j1338r757p750n176k447l20J097K495
$$ 508784 500839 490782 479183 466655 454239 442901 433144 425394 420218 417771 417451 418548 421043
51878D21043M317O139P339P929Q354Q751Q899Q791Q768Q843Q226O078K708m83
$$ 421043 425360 431499 438838 446767 455121 463872 472771 481562 490330 499173 507399 513477 516185 515702
51864E15702k504l736n032o337o865o466n884n597n133l920k230p83K05J115K167
$$ 515702 513198 509462 504430 498093 491228 484762 478878 473281 468148 464228 461998 461215 461420 462535 464702
51849D64702K978K874J528o88k927m527n422n862n914n580n187n187n528n651
$$ 464702 467680 470554 472082 471394 468467 463940 458518 452656 446742 441162 435975 430788 425260 419609
51835D19609n201m353l357k207q48O29K086L299L839L453K550J763J015l55k374
$$ 419609 414408 410055 406698 404491 403643 404272 406358 409657 413496 416949 419499 421262 422277 421922 419548
51820D19548m067m590m158l418k534j341K8J264K290L060L278K720J696P72K15
$$ 419548 415481 410891 406733 403315 400781 399440 399468 400732 403022 406082 409360 412080 413776 414548 414763
51805D14763p7l10p08j409k215k719k796k610k043p55R36J930J566M50m38r49
$$ 414763 414686 414376 413668 412259 410044 407325 404529 401919 399876 399121 400057 401987 403553 404003 403565 402616
51789D02616j453j916j937j464q06j65L49N94P56J339K276K616J865R78J088J759
$$ 402616 401163 399247 397310 395846 395040 394875 395224 395818 396574 397913 400189 402805 404670 405648 406736 408495
51773D08495J729J031J008K246L919N380P001Q896J0078R778Q631P771P366O773
$$ 408495 410224 411255 412263 414509 418428 423808 430809 439705 449783 459561 468192 475963 483329 490102
51759D90102N543L523N57l107o515q813j0121j0942j1189j0498r197q159p769
$$ 490102 495645 499168 499725 496618 490103 481290 471169 460227 449038 438540 429343 421184 413415
51746D13415p720p629p188n896l552r67O30J046J333K333L832N314O731Q038Q654
$$ 413415 405695 398066 390878 384982 381430 380463 381093 382139 383472 385805 389637 394951 401682 409720 418374
51731D18374Q068O588M923L320J713L87j65L8M66Q21J142J206M15j387l488m949
$$ 418374 426442 433030 437953 441273 442986 443373 443208 443246 443712 444533 445675 446881 447296 445909 442421 437472
51715D37472n378m882l672k118q71m59p94j434k130k803l083k447q90R76K538
$$ 437472 432094 427212 423540 421422 420551 420092 419298 417864 415734 412931 409848 407401 406511 407487 410025
51700D10025L580L984L546K434J385R79R39O85L67O87J652K179J356m10j932k638
$$ 410025 413605 417589 421135 423569 424954 425933 426872 427557 427924 428611 430263 432442 433798 433388 431456 428818
51684D28818k912l233l595l849m062m214l975l124j951q63J98J515K893L701L702
$$ 428818 425906 422673 419078 415229 411167 406953 402978 399854 397903 397040 397238 398753 401646 405347 409049
51669D09049L379L262L364L547M091N348P037Q304Q543P733O020L462M03k378
$$ 409049 412428 415690 419054 422601 426692 432040 439077 447381 455924 463657 469677 473139 473542 471164
51655D71164m296n475o223o181m548j279K421N069O099N839M592K274j012m555
$$ 471164 466868 461393 455170 448989 444441 443162 445583 450652 456751 462590 467182 469456 468444 463889
51641D63889p430r119r619r189q298p526p116o669n612l994k403j170n8J077J854
$$ 463889 456459 447340 437721 428532 420234 412708 405592 398923 393311 389317 386914 385744 385686 386763 388617
51626C88617J956J769J865K082J619J54j633k845l305l512l824m092l972l406
$$ 388617 390573 392342 394207 396289 397908 398062 396429 393584 390279 386767 382943 378851 374879 371473
51612C71473k705k252k158k194k005j474q70o02p35q47m24N43J548K209K750L678
$$ 371473 368768 366516 364358 362164 360159 358685 357815 357213 356478 355631 355207 355750 357298 359507 362257 365935
51596C65935N148O885Q627J0236J1441J1822J1095R119N733J148l417o272o826
$$ 365935 371083 377968 386595 396831 408272 420094 431189 440308 446041 447189 443772 437500 430674
51583D30674o145n463m750l329j328M92K113M379P562J0718J2816J3854J4460
$$ 430674 424529 419066 414316 410987 409659 410151 412264 416643 424205 434923 447739 461593 476053
51570D76053J4954J5361J5902J6883J8168J9122J9099J7946J6260J5338J6452
$$ 476053 491007 506368 522270 539153 557321 576443 595542 613488 629748 645086 661538
51559F61538J9780K4161K8216L1620L4892L7941L9353L7481L2135K4751J6836
$$ 661538 681318 705479 733695 765315 800207 838148 877501 914982 947117 971868 988704
51548I88704Q684j3q742j6321k2445k8111l3871l8521m0497l9962l8494l6928
$$ 988704 997388 997375 988633 972312 949867 921756 887885 849364 808867 768905 730411 693483
51536F93483l4745l1506k7667k3637j9277j4899j1614r891q621o572m116k589
$$ 693483 658738 627232 599565 575928 556651 541752 530138 520247 511626 505054 500938 498349
51524D98349k353k639l023l909n429o831p306o878o152n565n149m758m399m337
$$ 498349 495996 493357 490334 486425 480996 474165 466859 459981 453829 448264 443115 438357 433958 429621
51510D29621m820n544n707m972m054l821m143m203l785l443l341k857j673m60
$$ 429621 424801 419257 413550 408578 404524 400703 396560 392357 388572 385129 381788 378931 377258 376798
51496C76798K2r2k51m39r42j475j374o44k2J51M54J406K530K910K376J519P26
$$ 376798 376820 376728 376477 376038 375096 373621 372247 371603 371581 371732 372186 373592 376122 379032 381408 382927 383653
51479C83653j89j288k167k488k459k416k368k302k506l044l300k679j562q18n82
$$ 383653 383464 382176 380009 377521 375062 372646 370278 367976 365470 362426 359126 356447 354885 354067 353485
51464C53485l03Mm06j587k370j921j024j000j814k244j651o44J6L73Q53J522K127
$$ 353485 353182 353186 352780 351193 348823 346902 345878 344878 343064 340820 339169 338525 338541 338914 339767 341289 343416
51447C43416K571L090M054N613P497R245J0783J2441J4148J4941J3874J1149P822
$$ 343416 345987 349077 353131 358744 366241 375486 386269 398710 412858 427799 441673 452822 460644
51434D60644M561J393j318k656k347j566j835l452n441o789p261p092o466n541
$$ 460644 465205 466598 465280 462624 460277 458711 456876 453424 447983 441194 433933 426841 420375 414834
51420D14834m639m129m099m296m356m053l371k473j678j315j402j423p99L83J366
$$ 414834 410195 406066 401967 397671 393315 389262 385891 383418 381740 380425 379023 377600 376801 377184 378550
51405C78550J619J488J575J838J828J633J936K951L900L954L310K905L256M033
$$ 378550 380169 381657 383232 385070 386898 388531 390467 393418 397318 401272 404582 407487 410743 414776
51391D14776M749N462O588Q280J0156J1614J2403J2981J4352J7315K1726K6612
$$ 414776 419525 424987 431575 439855 450011 461625 474028 487009 501361 518676 540402 567014
51379E67014L1153L5414L9873M4434M8424N1597N4368N6553N6392N1831M2822
$$ 567014 598167 633581 673454 717888 766312 817909 872277 928830 985222 1037053 1079875
51368A079875L1640K0682J0495K26j0610k1401l1137l9225m5612n0437n3672n5038
$$ 1079875 1111515 1132197 1142692 1142918 1132308 1110907 1079770 1040545 994933 944496 890824 835786
51356H35786n4408n2244m9320m5911m1657l6400l0746k5476k0860j6920j3882
$$ 835786 781378 729134 679814 633903 592246 555846 525100 499624 478764 461844 447962
51345D47962j1883j0518r292q203p423o672n596m576m379m977n382m823l523k170
$$ 447962 436079 425561 416269 408066 400643 393971 388375 383799 379420 374443 369061 364238 360715 358545
51331C58545j099k44M79J031J261J036N24K69O49J298J478J083P71R98J405J359
$$ 358545 357446 357202 357681 358712 359973 361009 361533 361802 362451 363749 365227 366310 367081 368079 369484 370843
51315C70843P51l7o89j226j721k011j770r91k80l11r39j272r22o01r53j416j133
$$ 370843 371594 371557 370868 369642 367921 365910 364140 363149 362869 362558 361619 360347 359425 358824 357871 356455 355322
51298C55322n39q57k112k888k382j499j373j797j958j806j755j541n32J071K307
$$ 355322 354783 353926 351814 348926 346544 345045 343672 341875 339917 338111 336356 334815 334283 335354 337661
51283C37661K790L150M022N233O237O816P011O713N655L847J781J42p04r47r69
$$ 337661 340451 343601 347623 352856 359093 365909 372920 379633 385288 389135 390916 391058 390354 389407 388438
51268C88438q32l45M32J133J672K356L202L548K863J564M30n66k100m123n393
$$ 388438 387606 387261 387693 388826 390498 392854 396056 399604 402467 404031 404461 403895 401795 397672 392279
51253C92279m855l075j771k074l576n014n519n074m118l043k022j110l29K29L63
$$ 392279 387424 384349 382578 380504 376928 371914 366395 361321 357203 354160 352138 351028 350699 350928 351291
51238C51291m7p75j298j313j027p86n62j04N26R55J041J066J261J506J623J704
$$ 351291 351244 350469 349171 347858 346831 346045 345483 345379 345905 346860 347901 348967 350228 351734 353357 355061
51222C55061J873J997J855J477J060O38Q6n81j110j252j003n89k34Q2N75J322
$$ 355061 356934 358931 360786 362263 363323 363961 364047 363466 362356 361104 360101 359512 359278 359360 359935 361257
51206C61257K076K595L034L722M492M618L642K039Q21N66J023J592J891J863J487
$$ 361257 363333 365928 368962 372684 377176 381794 385436 387475 388296 388862 389885 391477 393368 395231 396718
51191C96718O89m35j476k007j957j494o20O40J683J595L55q19r10m27n16j198
$$ 396718 397407 396972 395496 393489 391532 390038 389418 390058 391741 393336 393691 392872 391962 391535 391019 389821
51175C89821j480j077q57j270j539q98J71P42P31P21R46J223J573K142K700K819
$$ 389821 388341 387264 386407 385137 383598 382700 382871 383613 384344 385065 386011 387234 388807 390949 393649 396468
51159C96468K407J651N81p75k009k621k666k620k733k925l119l213k896k006j027
$$ 396468 398875 400526 401107 400332 398323 395702 393036 390416 387683 384758 381639 378426 375530 373524 372497
51144C72497o80j052j561j744j571j117n18k04n36j084r46O7J121J525J572J836
$$ 372497 371817 370765 369204 367460 365889 364772 364254 364050 363514 362430 361484 361551 362672 364197 365769 367605
51128C67605K203K195J907J949K508L065L142K867K582K236J524N38p2K18J092
$$ 367605 369808 372003 373910 375859 378367 381432 384574 387441 390023 392259 393783 394321 394249 394467 395559
51113C95559J610J220L48j41R9P21J277J628J706J374P71M93J021K052K736K634
$$ 395559 397169 398389 398737 398596 398695 399416 400693 402321 404027 405401 406172 406665 407686 409738 412474 415108
51097D15108K072J519J001L71j89l86l91o47j081j036k58N46N82nm55n21n95p97
$$ 415108 417180 418699 419700 420071 419882 419496 419105 418458 417377 416341 416083 416629 417211 417206 416751 416230 415635 414838
51079D14838o61Q7J057J780K263K635K719K359J876J670J637J438J236J641K909
$$ 414838 414177 414264 415321 417101 419364 421999 424718 427077 428953 430623 432260 433698 434934 436575 439484
51064D39484M558N933O973Q229J0189J2678J4969J6563J7572J8106J7621J5545
$$ 439484 444042 449975 456948 465177 475366 488044 503013 519576 537148 555254 572875 588420
51052E88420J2532J0287R762J0220J0534J0599J0775J0535Q909O062L191P45k205
$$ 588420 600952 611239 621001 631221 641755 652354 663129 673664 682573 688635 691826 692571 690366
51039F90366o332j0698j3626j4376j3301j0949p890n205m200n233p289r036j0022
$$ 690366 684034 673336 659710 645334 632033 621084 613194 607989 603789 598556 591267 582231 572209
51026E72209j0632j1112j1091j0096q184n861l561j487J24R80J208J534K681M679
$$ 572209 561577 550465 539374 529278 521094 515233 511672 510185 510309 511289 512497 514031 516712 521391
51012E21391O978R124J0990J2390J2941J2559J1814J1450J1588J1620J0904R440
$$ 521391 528369 537493 548483 560873 573814 586373 598187 609637 621225 632845 643749 653189
51000F53189P750O313N288M675M388M013K836N33k253m305m936m450l605k904
$$ 653189 660939 667252 672540 677215 681603 685616 688452 688985 686732 682427 677491 673041 669436 666532
50986F66532k463k087j312K78K574N084P652J0594J3756J6004J6265J4889J3370
$$ 666532 664069 661982 660670 660948 663522 668606 676258 686852 700608 716612 732877 747766 761136
50973G61136J2816J3164J3908J5038J7047K0317K4670K9346L3479L6830M0010
$$ 761136 773952 787116 801024 816062 833109 853426 878096 907442 940921 977751 1017761
50962A017761M3674M7583N0852N3041N4503N5552N5887N5087N3311N0990M8099
$$ 1017761 1061435 1109018 1159870 1212911 1267414 1322966 1378853 1433940 1487251 1538241 1586340
50951A586340M4247L9492L4616L0288K6270K1841J6979J2703J0030Q910Q520Q302
$$ 1586340 1630587 1670079 1704695 1734983 1761253 1783094 1800073 1812776 1822806 1831716 1840236 1848538
50939A848538Q116P489N619K449q77l317n241p797j1204j4469j6761j8418k0417
$$ 1848538 1856654 1864143 1869762 1872211 1871334 1868017 1862776 1854979 1843775 1829306 1812545 1794127 1773710
50926A773710k3367k7233l1626l6065m0190m3835m6879m9095n0391n1017n1191
$$ 1773710 1750343 1723110 1691484 1655419 1615229 1571394 1524515 1475420 1425029 1374012 1322821
50915A322821n0561m8554m5280m1594l8166l4965l1789k8780k6098k3530k0819
$$ 1322821 1272260 1223706 1178426 1136832 1098666 1063701 1031912 1003132 977034 953504 932685
50904I32685j8121j5825j4081j2800j1846j1065j0284r570r137q783p749n668
$$ 932685 914564 898739 884658 871858 860012 848947 838663 829093 819956 811173 803424 797756
50892G97756l339j948j606j296l88M87M75j82m37J58R94J389J444J736K515L604
$$ 797756 794417 792469 790863 789567 789179 789666 790141 789959 789522 789680 790674 792063 793507 795243 797758 801362
50876H01362M757N810O605P122P702Q718J0083J1305J2043J2416J2780J3505J4919
$$ 801362 806119 811929 818534 825656 833358 842076 852159 863464 875507 887923 900703 914208 929127
50863I29127J7057J9444K1536K3471K5975K9293L2732L5564L8056M1193M5610
$$ 929127 946184 965628 987164 1010635 1036610 1065903 1098635 1134199 1172255 1213448 1259058
50852A259058N1179N7401O3818P0139P6399Q2971R0142R7587J04475J10117J14481
$$ 1259058 1310237 1367638 1431456 1501595 1577994 1660965 1751107 1848694 1953169 2063286 2177767
50841B177767J18125J21585J24576J25771J23680J17900J09181R8286Q5324P0421
$$ 2177767 2295892 2417477 2542053 2667824 2791504 2909404 3018585 3116871 3202195 3272616
50831C272616N4454L8639K3745J0160j703j1526j9262k4597k6628k4756j9745
$$ 3272616 3327070 3365709 3389454 3399614 3397911 3386385 3367123 3342526 3315898 3291142 3271397
50820C271397j3341o922r85M330Q694J1351J0961O048l695j6718l0928m5398o0199
$$ 3271397 3258056 3251134 3250149 3254479 3263173 3274524 3285485 3291533 3287838 3271120 3240192 3194794 3134595
50807C134595p4998q8844j01166j11823j20143j25011j26181j24595j21026j15325
$$ 3134595 3059597 2970753 2869587 2757764 2637621 2512610 2386429 2261834 2140808 2025483
50797B025483j07367r7901q7926p7911o8060n8681m9803m1108l2732k5536j9934
$$ 2025483 1918116 1820215 1732289 1654378 1586318 1527637 1477834 1436726 1403994 1378458 1358524
50786A358524j5099j0060n142j544K24Q09J031J114Q63M8j429l363n212o515p422
$$ 1358524 1343425 1333365 1328223 1326679 1326903 1327712 1328743 1329857 1330720 1330768 1329339 1325976 1320764 1314249 1306827
50771A306827q498j0019j1611j2698j3157j3454j4170j5414j6806j7983j8926
$$ 1306827 1298329 1288310 1276699 1264001 1250844 1237390 1223220 1207806 1191000 1173017 1154091
50760A154091j9626j9757j9069j7817j6438j4932j3104j1190r598q173o380m195
$$ 1154091 1134465 1114708 1095639 1077822 1061384 1046452 1033348 1022158 1012560 1004387 998007 993812
50748I93812j966N47M036Q322J2197J5040J7688K1088K4904K8281L1297L4702
$$ 993812 991846 992393 996429 1004751 1016948 1031988 1049676 1070764 1095668 1123949 1155246 1189948
50736A189948L8578M2236M5324M8283N1613N5145N8196O0152O0888O0819O0428
$$ 1189948 1228526 1270762 1316086 1364369 1415982 1471127 1529323 1589475 1650363 1711182 1771610
50725A771610N9708N8365N6585N5036N3832N2047M8691M3706L7544L0267K1637
$$ 1771610 1831318 1889683 1946268 2001304 2055136 2107183 2155874 2199580 2237124 2267391 2289028
50714B289028J1790J284r249j8996k6847l1943l4194l3904l1218k6407k0293j3790
$$ 2289028 2300818 2302102 2292853 2273857 2247010 2215067 2180873 2146969 2115751 2089344 2069051 2055261
50702B055261p253q11M867Q857J0787J0760Q588L752l810j3360k3823l4257m3992
$$ 2055261 2048008 2047197 2052064 2060921 2071708 2082468 2091056 2094808 2090998 2077638 2053815 2019558 1975566
50689A975566n2722o0359o6444o9906o9992o7183o2687n7204n0761m3572l6265
$$ 1975566 1922844 1862485 1796041 1726135 1656143 1588960 1526273 1469069 1418308 1374736 1338471
50678A338471k9229k2365j5569q933k326M489J1200J6951K1330K4795K7857L0270
$$ 1338471 1309242 1286877 1271308 1262375 1260049 1264538 1275738 1292689 1314019 1338814 1366671 1396941
50666A396941L1454L1382L0513K8989K6469K2914J9230J6720J5822J5660J5104
$$ 1396941 1428395 1459777 1490290 1519279 1545748 1568662 1587892 1604612 1620434 1636094 1651198
50655A651198J4094J3508J3802J4443J4889J5474J6744J8423J9794K0840K2309
$$ 1651198 1665292 1678800 1692602 1707045 1721934 1737408 1754152 1772575 1792369 1813209 1835518
50644A835518K4615K7419L0378L3697L7530M1284M3969M5112M5091M4617M3980
$$ 1835518 1860133 1887552 1917930 1951627 1989157 2030441 2074410 2119522 2164613 2209230 2253210
50633B253210M2853M0809L7921L4778L1913K9487K7640K6759K6947K7135K4943
$$ 2253210 2296063 2336872 2374793 2409571 2441484 2470971 2498611 2525370 2552317 2579452 2604395
50622B604395J7727M390j3321l1223m5057n2822n4960n2685m6973l9011l0394
$$ 2604395 2622122 2626512 2613191 2581968 2536911 2484089 2429129 2376444 2329471 2290460 2260066
50611B260066k2124j4122o415p1L841N591O071N159J831m246j2266k1398l1366
$$ 2260066 2237942 2223820 2217405 2217334 2221175 2226766 2232837 2237996 2239827 2235581 2223315 2201917 2170551
50598B170551m1735n1493n9651o5776o9696p1262p0619o8314o4994o1213n7487
$$ 2170551 2128816 2077323 2017672 1951896 1882200 1810938 1740319 1672005 1607011 1545798 1488311
50587A488311n4119n0966m7754m4550m1577l8686l5475l1761k7623k3210j8973
$$ 1488311 1434192 1383226 1335472 1290922 1249345 1210659 1175184 1143423 1115800 1092590 1073617
50576A073617j5655j3420j1268q152m424j353O64K488M840P490R892J1834J3204
$$ 1073617 1057962 1044542 1033274 1025122 1020698 1019345 1020009 1022497 1027337 1034827 1044719 1056553 1069757
50563A069757J3989J4690J5988J7838J9609K1227K3370K6168K8649K9892L0126
$$ 1069757 1083746 1098436 1114424 1132262 1151871 1173098 1196468 1222636 1251285 1281177 1311303
50552A311303L0222L0668L1441L2325L2938L2864L2117L1134L0227K9529K9447
$$ 1311303 1341525 1372193 1403634 1435959 1468897 1501761 1533878 1565012 1595239 1624768 1654215
50541A654215L0488L2488L4860L7720M1897M7482N3331N8514O3366O8533P3869
$$ 1654215 1684703 1717191 1752051 1789771 1831668 1879150 1932481 1990995 2054361 2122894 2196763
50530B196763P9041Q4439R0519R6814J02490J07474J12186J16425J19342J20357
$$ 2196763 2275804 2360243 2450762 2547576 2650066 2757540 2869726 2986151 3105493 3225850
50520C225850J19413J16483J11466J04462R5547Q4433P0786N4769L6898J7653
$$ 3225850 3345263 3461746 3573212 3677674 3773221 3857654 3928440 3983209 4020107 4037760
50510D037760k332k2099m0999n9084p6223r1205j02565j10052j14345j15383j12071
$$ 4037760 4035428 4013329 3972330 3913246 3837023 3745818 3643253 3533201 3418856 3303473 3191402
50499C191402j03857r1754p7314o1256m3682k5113o693J0520K5992L9361M9820
$$ 3191402 3087545 2995791 2918477 2857221 2813539 2788426 2781733 2792253 2818245 2857606 2907426
50488B907426N5973N6229M9555L6034J6792o555l2260n8330q2443j02440j17185
$$ 2907426 2963399 3019628 3069183 3105217 3122009 3115454 3083194 3024864 2942421 2839981 2722796
50477B722796j26872j32318j33942j31649j25708j17254j07606r7392q6803p6449
$$ 2722796 2595924 2463606 2329664 2198015 2072307 1955053 1847447 1750055 1663252 1586803
50467A586803o7248n9485n2728m6754m2008l8713l6237l3636l0483k6808k2687
$$ 1586803 1519555 1460070 1407342 1360588 1318580 1279867 1243630 1209994 1179511 1152703 1130016
50456A130016j8292j3973r912o020k448K99K144L855O163Q899J1437J3612J5522
$$ 1130016 1111724 1097751 1087839 1081819 1079371 1079670 1081814 1085669 1091832 1100731 1112168 1125780 1141302
50443A141302J6902J7494J7873J9001K0853K2049K1141J7943J3622R773P367O171
$$ 1141302 1158204 1175698 1193571 1212572 1233425 1255474 1276615 1294558 1308180 1317953 1325320 1331491
50431A331491N200L892K792K755L757M922N589N950O631Q051J0187J2621J4850
$$ 1331491 1336691 1340583 1343375 1346130 1349887 1354809 1360398 1366348 1372979 1381030 1391217 1403838 1418688
50418A418688J6838J9146K2336K6385L0991L6099M1738M7508N2823N7519O1719
$$ 1418688 1435526 1454672 1477008 1503393 1534384 1570483 1612221 1659729 1712552 1770071 1831790
50407A831790O5214O7414O7949O6867O4314O0499N5868N0716M4647L7027K8023
$$ 1831790 1897004 1964418 2032367 2099234 2163548 2224047 2279915 2330631 2375278 2412305 2440328
50396B440328J8626R394j98j0932k2780l4974m6742n7553o6925p4267p8876q0058
$$ 2440328 2458954 2468348 2468150 2457218 2434438 2399464 2352722 2295169 2228244 2153977 2075101 1995043
50384A995043p7570p2069o4773n6456m7091l6650k5861j5712o441K390J0824J7963
$$ 1995043 1917473 1845404 1780631 1724175 1677084 1640434 1614573 1598861 1592420 1594810 1605634 1623597
50372A623597K2685K4571K3792K0349J3930M704o211j7345k7816l7331m5515n1765
$$ 1623597 1646282 1670853 1694645 1714994 1728924 1733628 1727417 1710072 1682256 1644925 1599410 1547645
50360A547645n5864n8140n8760n7327n3652m8602m3678l9712l6240l2160k6901
$$ 1547645 1491781 1433641 1374881 1317554 1263902 1215300 1171622 1131910 1095670 1063510 1036609
50349A036609k1032j5797j1930r039o517m941n691q909j2729j5220j6318j7044
$$ 1036609 1015577 999780 987850 978811 972294 967353 961662 952753 940024 924804 908486 891442
50337H91442j7430j6504j4083j1228q775o557m366k587j353n9J612K973L428L566
$$ 891442 874012 857508 843425 832197 823422 816865 812499 809912 808559 808500 810112 813085 816513 820079
50323H20079M328N534O241O241O281O774P192O958O224N433M631L611K420J405
$$ 820079 824407 829941 836182 842423 848704 855478 862670 869628 875852 881285 885916 889527 891947 893352
50309H93352Q51Q31J249J868K419K846L357M052M681M941M967N246O013O979P745
$$ 893352 894203 895034 896283 898151 900570 903416 906773 910825 915506 920447 925414 930660 936673 943652 951397
50294I51397Q287Q825R412R914J0404J1207J2442J3659J4060J2996J0258O115
$$ 951397 959684 968509 977921 987835 998239 1009446 1021888 1035547 1049607 1062603 1072861 1078976
50282A078976J278l333o923r050r581q751p265n968n133m286k999j558n26J04
$$ 1078976 1080254 1076921 1069998 1060948 1051367 1042616 1035351 1029383 1024250 1019964 1016965 1015407 1014881 1014985
50268A014985Q09J687K278K312K135K198K522K968L675M879O471Q144R949J2249
$$ 1014985 1015794 1017481 1019759 1022071 1024206 1026404 1028926 1031894 1035569 1040448 1046919 1055063 1065012 1077261
50254A077261J5069J7752J9507K0136K0055J9604J8690J7181J5453J4227J3908
$$ 1077261 1092330 1110082 1129589 1149725 1169780 1189384 1208074 1225255 1240708 1254935 1268843
50243A268843J4188J4424J4148J3147J1230Q147L806j510p195j2592j7249k0885
$$ 1268843 1283031 1297455 1311603 1324750 1335980 1344127 1347933 1346423 1339228 1326636 1309387 1288502
50231A288502k3201k3913k3092k1236j8763j5726j2412j0088j0491j4246k0082
$$ 1288502 1265301 1241388 1218296 1197060 1178297 1162571 1150159 1140071 1129580 1115334 1095252
50220A095252k5841l0054l2463l3408l3132l1641k9076k6081k3537k1645j9546
$$ 1095252 1069411 1039357 1006894 973486 940354 908713 879637 853556 830019 808374 788828
50209G88828j6398j2738j0048q941q576q070p534p227o609n127l350k295k042
$$ 788828 772430 759692 749644 740703 732127 724057 716523 709296 702687 697560 694210 691915 689873
50196F89873j879j564j501j752j897j897k245l007l507l222k434j778j611j972
$$ 689873 687994 686430 684929 683177 681280 679383 677138 674131 670624 667402 664968 663190 661579 659607
50182F59607k594k905k525j915j915k564k987k643j929j296m97P45K000K715L126
$$ 659607 657013 654108 651583 649668 647753 645189 642202 639559 637630 636334 635837 636582 638582 641297 644423
50167F44423L826M643M710L736K631K608L906N585O493O293N689N662O573P967
$$ 644423 648249 652892 657602 661338 663969 666577 670483 676068 682561 688854 694543 700205 706778 714745
50153G14745R220J0205J1323J2964J5016J6839J7781J7737J7272J7134J7727J8993
$$ 714745 723965 734170 745493 758457 773473 790312 808093 825830 843102 860236 877963 896956
50141H96956K0634K2357K4228K6853L0847L5800M0093M2219M2146M1072M0079
$$ 896956 917590 939947 964175 991028 1021875 1057675 1097768 1139987 1182133 1223205 1263284
50130A263284L9439L9019L8651L8082L7035L5414L3041K9271K3371J5350O039
$$ 1263284 1302723 1341742 1380393 1418475 1455510 1490924 1523965 1553236 1576607 1591957 1597996
50119A597996l730j3621k3372l2395l9936m5428m8634m9746m9376m8138m6256
$$ 1597996 1594266 1580645 1557273 1524878 1484942 1439514 1390880 1341134 1291758 1243620 1197364
50108A197364m3726m0597l6840l2271k7229k3048k0967k0664k0588j9851j8998
$$ 1197364 1153638 1113041 1076201 1043930 1016701 993653 972686 952022 931434 911583 892585
50097H92585j8758j8834j8301j6615j3947j0953q472o867n529l528q99J331K613
$$ 892585 873827 854993 836692 820077 806130 795177 786705 779838 774309 770781 769882 771213 773826
50084G73826L524M756O136P084P360O891N588L891K896L223M140M425L765K780
$$ 773826 777350 782106 788242 795326 802686 809577 815165 819056 821952 825175 829315 833740 837505 840285
50070H40285K026J589J389J260Q81O2r30j708k227k704l265l875m390m550m253
$$ 840285 842311 843900 845289 846549 847430 847492 846562 844854 842627 839923 836658 832783 828393 823843 819590
50055H19590l873l861l969l541k639k012j699p47J154K821L234L156M047O001
$$ 819590 815717 811856 807887 804346 801707 799695 797996 797249 798403 801224 804458 807614 811661 817662
50041H17662P974R476J0776J1823J2271J2502J3390J4907J6009J6049J5380J4451
$$ 817662 825636 835112 845888 857711 869982 882484 895874 910781 926790 942839 958219 972670
50029I72670J3332J2324J2003J2223J2010J0920R781R632J0516J1868J3428J5186
$$ 972670 986002 998326 1010329 1022552 1034562 1045482 1055263 1064895 1075411 1087279 1100707 1115893
50017A115893J6844J8044J8772J9094J8650J6946J4187J1381R586R074R230R143
$$ 1115893 1132737 1150781 1169553 1188647 1207297 1224243 1238430 1249811 1259397 1268471 1277701 1286844
50005A286844Q342O942N076K426j468o596j2466j8450k3849k7823k9918l0638
$$ 1286844 1295186 1302128 1307204 1309630 1308162 1301566 1289100 1270650 1246801 1218978 1189060 1158422
49993A158422l0901l0982l0424k9014k7133k5114k2942k0845j9477j9096j9083
$$ 1158422 1127521 1096539 1066115 1037101 1009968 984854 961912 941067 921590 902494 883411
49982H83411j8763j8228j7943j7880j7586j6885j5974j4991j3912j2849j2037
$$ 883411 864648 846420 828477 810597 793011 776126 760152 745161 731249 718400 706363
49971G06363j1404j0438q705o455m575l793l863l755k863j774j498k087k550k036
$$ 706363 694959 684521 675816 669361 664786 660993 657130 653375 650512 648738 647240 645153 642603 640567
49957F40567o12J196L018M601N797O891Q460J0571J2479J3484J3621J3195J2074
$$ 640567 639955 641151 644169 648770 654567 661458 669918 680489 692968 706452 720073 733268 745342
49944G45342R995P296M737K764J354L92k49q74j792k997m423o389r308j2943j6253
$$ 745342 755337 762633 767370 770134 771488 771880 771631 770757 768965 765968 761545 755156 745848 732905 716652
49929G16652j8140j8240j7048j5513j4283j3201j1616r335o943m973l236j419
$$ 716652 698512 680272 663224 647711 633428 620227 608611 599276 592333 587360 584124 582705
49917E82705J94J232K068L199M057L540J895R29J792L531M569M875N705P618R789
$$ 582705 582899 584131 586199 589398 593455 596995 598890 599819 601611 605142 609711 614586 620291 627909 637698
49902F37698J1259J1997J2466J2822J2896J2573J1918J1009R858Q374O473M281
$$ 637698 648957 660954 673420 686242 699138 711711 723629 734638 744496 752870 759343 763624
49890G63624K143K09j827m337p153r680j1485j2560j3121j3463j3919j4500j4664
$$ 763624 765767 765976 764149 759812 752659 742979 731494 718934 705813 692350 678431 663931 649267
49877F49267j3884j2440j1129j0182r041p377n645m341l302k219j289q12m31N03
$$ 649267 635383 622943 611814 601632 592591 585214 579569 575228 571926 569707 568418 567606 567175 567678
49863E67678J918L005L287L288L962N715Q048J0115J1566J2805J4235J5443J5577
$$ 567678 569596 572601 575888 579176 583138 588853 596901 607016 618582 631387 645622 661065 676642
$$ [...]
##END NTUPLES=NMR SPECTRUM
##END=
