
##TITLE=AC1201_HPAAH12051_7164041_BXMSYcsEkW
##JCAMPDX= 6.0         $$ Bruker NMR JCAMP-DX V2.0
##DATA TYPE= NMR SPECTRUM
##DATA CLASS= NTUPLES
##ORIGIN= BRUKER
##OWNER= Administrator
$$ 1.72 TOPSPIN		Version 2.1
$$ 2012-12-01 14:18:03.076 -0500  Administrator@X
$$ Compression mode = diff/dup
##.OBSERVE FREQUENCY= 400.02188249412
##.OBSERVE NUCLEUS= ^1H
##.ACQUISITION MODE= SIMULTANEOUS (DQD)
##.ACQUISITION SCHEME= undefined
##.AVERAGES= 64
##.DIGITISER RES= 22
##SPECTROMETER/DATA SYSTEM= spect
##.PULSE SEQUENCE= noesygpps1d.comp
##.SOLVENT NAME= COFFEE_meoh
##.SHIFT REFERENCE= INTERNAL, COFFEE_meoh, 1, 14.96228
##AUDIT TRAIL= $$ (NUMBER, WHEN, WHO, WHERE, PROCESS, VERSION, WHAT)
$$ ##TITLE= Audit trail, TOPSPIN		Version 2.1
$$ ##JCAMPDX= 5.01
$$ ##ORIGIN= Bruker BioSpin GmbH
$$ ##OWNER= Administrator
$$ $$ E:\/data/COFFEE/nmr/AC1201_HPAAH12051_7164041_BXMSYcsEkW/12/pdata/1/auditp.txt
$$ ##AUDIT TRAIL=  $$ (NUMBER, WHEN, WHO, WHERE, PROCESS, VERSION, WHAT)
(   1,<2012-12-01 14:17:59.230 -0500>,<Administrator>,<X>,<go>,<TOPSPIN 2.1>,
      <created by zg
	started at 2012-12-01 14:06:28.535 -0500,
	POWCHK enabled, PULCHK disabled,
       configuration hash MD5:
       86 BA 57 50 F2 9D 5C 9B 26 00 A9 28 5F 66 2E 89
       data hash MD5: 64K
       1E A6 07 66 A9 E0 62 99 6F BD 95 1E 39 C5 61 3F>)
(   2,<2012-12-01 14:18:01.258 -0500>,<Administrator>,<X>,<proc1d>,<TOPSPIN 2.1>,
      <Start of raw data processing
       efp LB = 0.3 FT_mod = 6 PKNL = 1 PHC0 = 0 PHC1 = 0 SI = 128K 
       data hash MD5: 128K
       5E 96 27 08 F8 05 F9 7C 2F 5C BB 2E B5 2E DA 9B>)
(   3,<2012-12-01 14:18:01.964 -0500>,<Administrator>,<X>,<proc1d>,<TOPSPIN 2.1>,
      <pk PHC0 = -80.41992 PHC1 = 0 
       data hash MD5: 128K
       F3 BE A2 BD 77 8F C0 DE A6 CB E2 9F 89 98 9C F1>)
(   4,<2012-12-01 14:18:02.441 -0500>,<Administrator>,<X>,<proc1d>,<TOPSPIN 2.1>,
      <abs ABSG = 1 
       data hash MD5: 128K
       01 25 06 AE 2B ED A3 67 32 39 62 78 43 C5 BF F7>)
(   5,<2012-12-01 14:18:02.550 -0500>,<Administrator>,<X>,<proc1d>,<TOPSPIN 2.1>,
      <abs ABSG = 2 
       data hash MD5: 128K
       A1 80 9F 17 81 5F DD A2 8D 4B 33 8E FF 2A EB D0>)
(   6,<2012-12-01 14:18:02.668 -0500>,<Administrator>,<X>,<proc1d>,<TOPSPIN 2.1>,
      <abs ABSG = 3 
       data hash MD5: 128K
       99 C0 D7 27 F5 BA 25 FE 8A F4 6C E0 9D D8 B3 10>)
(   7,<2012-12-01 14:18:02.768 -0500>,<Administrator>,<X>,<proc1d>,<TOPSPIN 2.1>,
      <abs ABSG = 4 
       data hash MD5: 128K
       60 18 12 E8 A3 ED F2 0D C0 62 BF E7 0E 04 6B A4>)
(   8,<2012-12-01 14:18:02.877 -0500>,<Administrator>,<X>,<proc1d>,<TOPSPIN 2.1>,
      <abs ABSG = 5 
       data hash MD5: 128K
       37 80 2F EF E6 33 AB B3 4D 85 D9 5B C4 1D 0E F0>)
$$ ##END=
$$ 
$$ $$ hash MD5
$$ $$ 19 53 A1 A3 60 E0 18 66 A6 D3 92 28 9D A0 A1 3E
##$RELAX= 
##$RELAX= 
##$RELAX= 
##$RELAX= 
##$RELAX= 
##$RELAX= 
##$RELAX= 
##$RELAX= 
$$ Bruker specific parameters
$$ --------------------------
##$DU= <E:\>
##$EXPNO= 12
$$ [...]
##$TP07= 0
##$TPNAME0= <>
##$TPNAME1= <>
##$TPNAME2= <>
##$TPNAME3= <>
##$TPNAME4= <>
##$TPNAME5= <>
##$TPNAME6= <>
##$TPNAME7= <>
##$TPOAL= (0..7)
0.5 0.5 0.5 0.5 0.5 0.5 0.5 0.5
##$TPOFFS= (0..7)
0 0 0 0 0 0 0 0
##$TUNHIN= 0
##$TUNHOUT= 0
##$TUNXOUT= 0
##$USERA1= <user>
##$USERA2= <user>
##$USERA3= <user>
##$USERA4= <user>
##$USERA5= <user>
##$V9= 5
##$VALIST= <valist>
##$VCLIST= <CCCCCCCCCCCCCCC>
##$VD= 0
##$VDLIST= <DDDDDDDDDDDDDDD>
##$VPLIST= <PPPPPPPPPPPPPPP>
##$VTLIST= <TTTTTTTTTTTTTTT>
##$WBST= 1024
##$WBSW= 4
##$XGAIN= (0..3)
0 0 0 0
##$XL= 0
##$YL= 0
##$YMAX_a= 7843088
##$YMIN_a= -16808714
##$ZGOPTNS= <>
##$ZL1= 120
##$ZL2= 120
##$ZL3= 120
##$ZL4= 120
##$ABSF1= 14.96228
##$ABSF2= -5.595901
##$ABSG= 5
##$ABSL= 3
##$ALPHA= 0
##$AQORDER= 0
##$ASSFAC= 0
##$ASSFACI= 0
##$ASSFACX= 0
##$ASSWID= 0
##$AUNMP= <proc_prof1d_extract.lims>
##$AXLEFT= 0
##$AXNAME= <>
##$AXNUC= <1H>
##$AXRIGHT= 0
##$AXTYPE= 0
##$AXUNIT= <>
##$AZFE= 0.1
##$AZFW= 0.1
##$BCFW= 0
##$BC_mod= 0
##$BYTORDP= 0
##$COROFFS= 0
##$CY= 15
##$DATMOD= 1
##$DC= 0
##$DFILT= <>
##$DTYPP= 0
##$F1P= 0
##$F2P= 0
##$FCOR= 0.5
##$FTSIZE= 131072
##$FT_mod= 6
##$GAMMA= 0
##$GB= 0
##$INTBC= 1
##$INTSCL= 1
##$ISEN= 128
##$LB= 0.3
##$LEV0= 0
##$LPBIN= 0
##$MAXI= 10000
##$MC2= 0
##$MEAN= 0
##$ME_mod= 0
##$MI= 0
##$NCOEF= 0
##$NC_proc= -2
##$NLEV= 6
##$NOISF1= 0
##$NOISF2= 0
##$NSP= 0
##$NTH_PI= 0
##$NZP= 0
##$OFFSET= 14.96228
##$PC= 1
##$PHC0= -80.41992
##$PHC1= 0
##$PH_mod= 1
##$PKNL= yes
##$PPARMOD= 0
##$PPDIAG= 0
##$PPIPTYP= 0
##$PPMPNUM= 2147483647
##$PPRESOL= 1
##$PSCAL= 4
##$PSIGN= 0
##$PYNMP= <proc.py>
##$REVERSE= no
##$SF= 400.020009124016
##$SI= 131072
##$SIGF1= 0
##$SIGF2= 0
##$SINO= 400
##$SIOLD= 131072
##$SPECTYP= <>
##$SREGLST= <1H.CDCl3>
##$SSB= 0
##$STSI= 131072
##$STSR= 0
##$SW_p= 8223.68421052631
##$SYMM= 0
##$S_DEV= 0
##$TDeff= 65536
##$TDoff= 0
##$TI= <>
##$TILT= no
##$TM1= 0
##$TM2= 0
##$TOPLEV= 0
##$USERP1= <user>
##$USERP2= <user>
##$USERP3= <user>
##$USERP4= <user>
##$USERP5= <user>
##$WDW= 1
##$XDIM= 131072
##$YMAX_p= 431725312
##$YMIN_p= -11202
##$CURPLOT= <Network HP LaserJet P1505>
##$CURPRIN= <$Network HP LaserJet P1505>
##$DFORMAT= <normdp>
##$LAYOUT= <+/1D_H.xwp>
##$LFORMAT= <normlp>
##$PFORMAT= <normpl>
##$SURQMSG= 1
$$ End of Bruker specific parameters
$$ ---------------------------------
##NTUPLES= NMR SPECTRUM
##VAR_NAME=  FREQUENCY,     SPECTRUM/REAL,   SPECTRUM/IMAG
##SYMBOL=    X,             R,               I
##VAR_TYPE=  INDEPENDENT,   DEPENDENT,       DEPENDENT
##VAR_FORM=  AFFN,          ASDF,            ASDF
##VAR_DIM=   131072,        131072,          131072
##UNITS=     HZ,            ARBITRARY UNITS, ARBITRARY UNITS
##FACTOR=    0.0627417313425164, 1,          1
##FIRST=     8223.62146879497, -299,         -61202
##LAST=      0,             1760,            -61784
##MIN=       0,             -11202,          0
##MAX=       8223.62146879497, 431725312,    0
$$ Real data points
##PAGE= N=1
##DATA TABLE= (X++(R..R)), XYDATA
$$ [...]
60978H338802J372818J649254J963105K315373K684645K967230K970272K530720
60970B6792219J683589O98195q7422m81698m99108k51111J54873N89090Q38849
60961B9437476O73575K1491r32530j855275k482490k743838k719258k524850k248134
60952A4626167j947380j662026j410339j192021j002507q41307p07176n94498
60944E268913m98632m19714l58113l10248k71555k40042k14510j92495j72474
60935B591130j55426j41956j30177j18254j06758r6649q7290p8391p1727o8734
60925A535768o8128o7818o7344o6547o3915n8625n2595m8144m4870m1079l7012
60914I19691l4187l2473l0290k7226k4327k2047j9904j7894j6483j5399j3967
$$ y = [8338802, 9711620, 11360874, 13323979, 15639352, 18323997, 21291227, 24261499, 26792219, 28475808, 29174003, 29086581, 28604883, 28105775, 27854664, 28009537, 28598627, 29437476, 30111051, 30132542, 29200012, 27344737, 24862247, 22118409, 19399151, 16874301, 14626167, 12678787, 11016761, 9606422, 8414401, 7411894, 6570587, 5863411, 5268913, 4770281, 4350567, 3992454, 3682206, 3410651, 3170609, 2956099, 2763604, 2591130, 2435704, 2293748, 2163571, 2045317, 1938559, 1841910, 1754620, 1676229, 1604502, 1535768, 1467640, 1399822, 1332478, 1265931, 1202016, 1143391, 1090796, 1042652, 997782, 956703, 919691, 885504, 853031, 822741, 795515, 771188, 749141, 729237, 711343, 694860, 679461, 665494]
60903F65494j2435j1525j0994j0050q816p963p280o060m636l977l930l317j758
60890E72753r9J002J690K165K439K828L652M496M753M694M994N412N090M021L080
60875F22970K535J717K44j391k720l844m921n741o087n970n466m699l986l535
60861E79106l207k924k966l378l558k959j821o31O34K131L536M511N335O347P376
60846E87532Q373R976J2563J5322J7143J7915J7940J6815J4066J0520P838O748
60834G42751O753P270Q032Q582Q386P455O117M377K238K56j027j789k341k344
60820G94716j541o43m11m81j75O9n77j712k235k221k745m070n387o342p373q483
60804G50389r051r026r101r492r642r269q651p846o671n497m921m685l987k877
$$ y = [665494, 653059, 641534, 630540, 620490, 611674, 603711, 596431, 590371, 585735, 581758, 577828, 574511, 572753, 572654, 573656, 575346, 577511, 579950, 582778, 586430, 590926, 595679, 600373, 605367, 610779, 615869, 619890, 622970, 625505, 627222, 627466, 626075, 623355, 619511, 614590, 608849, 602762, 596792, 591326, 586627, 582641, 579106, 575899, 572975, 570009, 566631, 563073, 560114, 558293, 557662, 558296, 560427, 563963, 568474, 573809, 580156, 587532, 595905, 605881, 618444, 633766, 650909, 668824, 686764, 703579, 717645, 728165, 736003, 742751, 749504, 756774, 764806, 773388, 781774, 789229, 795346, 799723, 801961, 802217, 801190, 799401, 797060, 794716, 793175, 792532, 792121, 791640, 791465, 791534, 790957, 789245, 787010, 784789, 782044, 777974, 772587, 766245, 758872, 750389, 741338, 732312, 723211, 713719, 704077, 694808, 686157, 678311, 671640, 666143, 661222, 656537, 652550, 649673]
60790F49673k096j588n05J236K717L572M489N825P019P717Q373R289J0115J0620
60776G16456J1002J1160J0771J0286J0658J1768J2313J1669J0662J0035R391Q286
60764H44457P217O720O416N764M970M467M150L720L224K753K193J669J557J754
60750I01031J603R06K16q5k32k85J06P37O22o78k309l292l696m051m407m605m831
60733H76750n268n707o067o674p552q007p553o628n866n222m368l464k865k498
60719G99011k107j808j809j851j416l79Q27J546J286L9j564k756l364l787m320
60704G77548m841n138n092m630l960l611l684l402k163p34l63r24j179p98p29
60689G36300j437k167k487l184m899o965q459r408j0162j0443r953r300r369j0099
$$ y = [649673, 647577, 645989, 645484, 646720, 649437, 653009, 657498, 663323, 670342, 678059, 686432, 695721, 705836, 716456, 727458, 738618, 749389, 759675, 770333, 782101, 794414, 806083, 816745, 826780, 836171, 844457, 851674, 858394, 864810, 870574, 875544, 880011, 884161, 887881, 891105, 893858, 896051, 897720, 899277, 901031, 902634, 903540, 903756, 903671, 903439, 903154, 903260, 903997, 904619, 903941, 901632, 898340, 894644, 890593, 886186, 881581, 876750, 871482, 865775, 859708, 853034, 845482, 837475, 829922, 823294, 817428, 812206, 807838, 804374, 801509, 799011, 796904, 795096, 793287, 791436, 790020, 789641, 790468, 792014, 793300, 793339, 791775, 789019, 785655, 781868, 777548, 772707, 767569, 762477, 757847, 753887, 750276, 746592, 743190, 741027, 740293, 739930, 739006, 737827, 737029, 736300, 734863, 732696, 730209, 727025, 722126, 715161, 706702, 697294, 687132, 676689, 666736, 657436, 648067, 637968]
60675F37968j0661j0503r691q549p377o319n222l953k817k209j784q20O08J642
60661E70313K014K444L363M230M527M530M603M591M406M379M528M335L758L607
60647F25628M338N242N423M802L770K618J808J842K355K217J189N13J209K726
60633F65680M040N111O359P515Q071Q258Q712R633J0869J2259J3302J3257J2251
60620G85317J1582J2207J3579J4554J4618J3631J1374Q292N692M268L185J564
60608H99863k2o24n78q75j595k247l095m748o844q467r626j1148j3209j5016j5887
60593H05882j5734j4693j3088j1516j0209q644o447m220k598j179O34K263K720
60580G23171K285K214K919L592L551K858J772O35J80Q87J992K194J360O29Q05
$$ y = [637968, 627307, 616804, 607113, 598564, 591187, 584868, 579646, 575693, 572876, 570667, 568883, 568063, 568671, 570313, 572327, 574771, 578134, 582364, 586891, 591421, 596024, 600615, 605021, 609400, 613928, 618263, 622021, 625628, 629966, 635208, 640631, 645433, 649203, 651821, 653629, 655471, 657826, 660043, 661232, 661745, 662954, 665680, 669720, 674831, 681190, 688705, 696776, 705034, 713746, 723379, 734248, 746507, 759809, 773066, 785317, 796899, 809106, 822685, 837239, 851857, 865488, 876862, 885154, 890846, 895114, 898299, 899863, 899841, 899217, 898639, 897764, 896169, 893922, 890827, 886079, 879235, 870768, 861142, 849994, 836785, 821769, 805882, 790148, 775455, 762367, 750851, 740642, 731998, 725551, 721331, 718733, 717554, 718188, 720451, 723171, 725456, 727670, 730589, 734181, 737732, 740590, 742362, 742997, 743177, 744064, 746056, 748250, 749610, 750239, 751044]
60565G51044J623K570L450M023L981L489L058K758K179J183L4j160k450l544m012
60550G68226l947l729l231k011k33J394K653M098O242R063J2395J6197K0358K4670
60536H52145K9013L3194L6682L8780L8921L6473L0781K1903J1017m21j1424k1000
60524A096064k7759l0915l1255l0198k8178k4723j9753j3922q018k815R06L097
60512H82531M838O983Q855R223Q250P314P232P839R064J1198J4146J7549K1627
60499A016649K6835L2843L8989M5632N3857O3803P4521Q5520R7167J09470J21828
60488A767114J34498J49134J67292J89218K14497K42876K73861L05725L34650
60479C778865L54021L55001L29888K76286J97934J01923l750j09970k06286k83031
$$ y = [751044, 752667, 755237, 758687, 762710, 766691, 770180, 773238, 775996, 778175, 779358, 779392, 778232, 775782, 772238, 768226, 764279, 760550, 757319, 755308, 755075, 756469, 759122, 763220, 769462, 778525, 790920, 807117, 827475, 852145, 881158, 914352, 951034, 989814, 1028735, 1065208, 1095989, 1117892, 1128909, 1128488, 1117064, 1096064, 1068305, 1037390, 1006135, 975937, 947759, 923036, 903283, 889361, 881343, 878528, 879434, 882531, 887369, 894352, 903207, 912430, 920680, 927994, 935226, 943065, 952129, 963327, 977473, 995022, 1016649, 1043484, 1076327, 1115316, 1160948, 1214805, 1278608, 1353129, 1438649, 1535816, 1645286, 1767114, 1901612, 2050746, 2218038, 2407256, 2621753, 2864629, 3138490, 3444215, 3778865, 4132886, 4487887, 4817775, 5094061, 5291995, 5393918, 5390168, 5280198, 5073912, 4790881]
60469D790881l34286l59117l60996l46324l22106k93507k63246k33031k04702
60460B073566j79656j57989j38947j21877j06581r3141q1715p2104o3517n5302
60450A002737m7821m1894l7440l3502k9617k6174k3321k0583j7833j5600j4100
60439F94852j2908j1917j1534j1470j0578q554o813o735p878q733q565p636o319
60426E75212m962m194m419n100n253m502l204j857p78q4M32J108J804J985J681
60411E47869J745K654L692L869L257K703K637K834L045L216L218L041L098L802
60397E90680M861N481N331M944N068N868O803P196O906O397O067N670M758L517
60383F69547K615K234J847J051O9p97j589k252k476k267k150k374k432j912j280
$$ y = [4790881, 4456595, 4097478, 3736482, 3390158, 3068052, 2774545, 2511299, 2278268, 2073566, 1893910, 1735921, 1596974, 1475097, 1368516, 1275375, 1193660, 1121556, 1058039, 1002737, 954916, 913022, 875582, 842080, 812463, 786289, 762968, 742385, 724552, 708952, 694852, 681944, 670027, 658493, 647023, 636445, 627891, 621078, 614343, 606465, 597732, 589167, 581531, 575212, 570250, 566056, 561637, 556537, 551284, 546782, 543578, 541721, 540943, 540859, 541291, 542399, 544203, 546188, 547869, 549614, 552268, 555960, 559829, 563086, 565789, 568426, 571260, 574305, 577521, 580739, 583780, 586878, 590680, 595541, 601022, 606353, 611297, 616365, 622233, 629036, 636232, 643138, 649535, 655602, 661272, 666030, 669547, 672162, 674396, 676243, 677294, 677363, 676566, 674977, 672725, 670249, 667982, 665832, 663458, 661026, 659114, 657834]
60368F57834j181j379j093j27R12J482J618J614J698K062K826L774M442M593M518
60353F83593M725N382O182O731P070P539Q212Q738Q958R261R938J0477J0114Q901
60339G95821P572O419N008L109J209j17p98q94k38J200K966M634O329Q404J0710
60324H51334J2482J2926J1770R346O131K268k254o886j0430j2137j2575j2804
60312H49171j3000j2575j1438j0203r139p880o365n205m682m198l241k248j909
60299G57088k045j782o14J115K670L536L692L424K887J897L85j077j717j502j188
60284G66769j332j669j528n24J178K986M213M698M940N331N494M909L853L020
60270H02338K496J991J876K859M600N787N911N950O867Q354R546J0297J1184J2757
$$ y = [657834, 656653, 655274, 654181, 654054, 654966, 656448, 658066, 659680, 661378, 663440, 666266, 670040, 674482, 679075, 683593, 688318, 693700, 699882, 706613, 713683, 721222, 729434, 738172, 747130, 756391, 766329, 776806, 786920, 795821, 803393, 809812, 814820, 817929, 819138, 819021, 818223, 817329, 817091, 818291, 821257, 825891, 832220, 840624, 851334, 863816, 876742, 888512, 897858, 903989, 906257, 904003, 897117, 886687, 874550, 861975, 849171, 836171, 823596, 812158, 801955, 792816, 784936, 778571, 773366, 768684, 764486, 761245, 758997, 757088, 755043, 753261, 752647, 753762, 756432, 759968, 763660, 767084, 769971, 771868, 772253, 771176, 769459, 767957, 766769, 765437, 763768, 762240, 761716, 762894, 765880, 770093, 774791, 779731, 785062, 790556, 795465, 799318, 802338, 804834, 806825, 808701, 811560, 816160, 821947, 827858, 833808, 840675, 849029, 858575, 868872, 880056, 892813]
60256H92813J5146J7948K0352K1988K3718K6735L0827L4553L7432M0706M5352
60245A207570N0538N5055N9356O4933P2199Q0103Q7619R4606J01163J07050J11980
60234B092172J15937J18929J20556J20025J16601J10173J01368R0943P9182O6171
60224C132057N2344L8212K3713Q614o438k0015l1240m0288m7380n2066n3884n2996
60212B950633m9825m4612l7656k9447k0219r889J426J3354K5792L8832N2065O4804
60200B955258P7038Q9284J01260J11724J19858J25696J28771J27580J21261J10836
60190D068566R7976Q3264O6473M7833K8111P950j2126l1472m9669o6605q1711
60179D158590r3681j01491j05181j05180j01550r4429q4479p2330n8183m2502
$$ y = [892813, 907959, 925907, 946259, 968247, 991965, 1018700, 1049527, 1084080, 1121512, 1162218, 1207570, 1258108, 1313163, 1372519, 1437452, 1509651, 1589754, 1677373, 1771979, 1873142, 1980192, 2092172, 2208109, 2327038, 2447594, 2567619, 2684220, 2794393, 2895761, 2986704, 3065886, 3132057, 3184401, 3222613, 3246326, 3254940, 3248502, 3228487, 3197247, 3156959, 3109579, 3057513, 3003629, 2950633, 2900808, 2856196, 2818540, 2789093, 2768874, 2758985, 2760411, 2773765, 2799557, 2838389, 2890454, 2955258, 3032296, 3121580, 3222840, 3334564, 3454422, 3580118, 3708889, 3836469, 3957730, 4068566, 4166542, 4249806, 4316279, 4364112, 4392223, 4400173, 4388047, 4356575, 4306906, 4240301, 4158590, 4064909, 3963418, 3858237, 3753057, 3651507, 3557078, 3472599, 3400269, 3342086, 3299584]
60169C299584k6302j0153O273K3048L9178N3736O6839P8596Q7908R3286R4260
60158C806253R0950Q3160P1078N6370M1079K5829J0220n165j8593k9054l7103
60147D095024m3461m7647m8492m5431l8929k9909j8968o116Q696K4910M1702N8989
60135C950368P7526R7707J19051J41235J64789J90098K16375K42491K68228K93870
60125E761738L18828L41516L60475L74932L84419L88323L85845L76178L58935
60116I051189L34501L03589K66527K23593J75902J24963P1223J4366m4643j03155
60106A0418055j58923k11112k58452k98020l27265l46007l55188l54862l45052
60097G763174l27482l04531k77103k45171k09893j73454j37069j00788o5079l1018
$$ y = [3299584, 3273282, 3263129, 3269402, 3292450, 3331628, 3385364, 3452203, 3530799, 3618707, 3711993, 3806253, 3897203, 3980363, 4051441, 4107811, 4148890, 4174719, 4184939, 4179774, 4161181, 4132127, 4095024, 4051563, 4003916, 3955424, 3909993, 3871064, 3841155, 3822187, 3816071, 3824767, 3849677, 3891379, 3950368, 4027894, 4125601, 4244652, 4385887, 4550676, 4740774, 4957149, 5199640, 5467868, 5761738, 6080566, 6422082, 6782557, 7157489, 7541908, 7930231, 8316076, 8692254, 9051189, 9385690, 9689279, 9955806, 10179399, 10355301, 10480264, 10551487, 10565853, 10521210, 10418055, 10259132, 10048020, 9789568, 9491548, 9164283, 8818276, 8463088, 8108226, 7763174, 7435692, 7131161, 6854058, 6608887, 6398994, 6225540, 6088471, 5987683, 5922604, 5891586]
60087E891586R45L0919N8250Q1522R9889J13152J20681J21547J15727J04091Q7361
60076F825670O6302M2629J8324n850k9859n2700p2828r0250j06543j22535j37449
60065F334911j50568j62068j71615j77761j79626j78063j74316j68363j59408
60056D813123j47249j32551j16288r9300q1871o3558m4043k4257n784J1117K7904
60045D137243M5872O4680Q3054J00030J14907J26779J34826J38651J37886J31928
60035E215856J20478J04043Q3673O0525L5797J0641j4233l8617o2474q5583j07274
60024E322832j26199j40728j50102j54864j55660j52206j44240j32926j20131
60015D045776j06594r1895p6065n9911m3771k7187j0046P086K4088M1647O0122
$$ y = [5891586, 5892531, 5923450, 5981700, 6063222, 6163111, 6276263, 6396944, 6518491, 6634218, 6738309, 6825670, 6891972, 6934601, 6952925, 6947075, 6917216, 6864516, 6791688, 6701438, 6594895, 6472360, 6334911, 6184343, 6022275, 5850660, 5672899, 5493273, 5315210, 5140894, 4972531, 4813123, 4665874, 4533323, 4417035, 4317735, 4235864, 4172306, 4128263, 4104006, 4098222, 4109339, 4137243, 4183115, 4247795, 4330849, 4430879, 4545786, 4672565, 4807391, 4946042, 5083928, 5215856, 5336334, 5440377, 5524050, 5584575, 5620372, 5631013, 5616780, 5578163, 5515689, 5430106, 5322832, 5196633, 5055905, 4905803, 4750939, 4595279, 4443073, 4298833, 4165907, 4045776, 3939182, 3847287, 3771222, 3711311, 3667540, 3640353, 3630307, 3637393, 3661481, 3703128, 3763250]
60004C763250P9043R8084J17568J37451J56578J73417J86879J96050J99779J97114
59994E305213J87800J72247J51473J27124J00809P3197M4165J3820j7238m8485
59984F110125p9390j08641j34258j54618j68812j76152j76372j70409j60027j46348
59974D635098j29505j09854q8593o6926m5458k4667n078J3369L1372M9293O6600
59963D325651Q2437R6097J06952J14647J19404J21435J20111J14620J05431R4129
59953E400914Q1804O8630N5002M1803K9388J7575O957j022n733p814p414l252
59941E676838N838J9594L7343N9266Q5660J15837J48733J84069K21928K61632
59931F816738L01789L40920L77400M09132M33889M49551M53527M42557M13985
$$ y = [3763250, 3842293, 3940377, 4057945, 4195396, 4351974, 4525391, 4712270, 4908320, 5108099, 5305213, 5493013, 5665260, 5816733, 5943857, 6044666, 6117863, 6162028, 6175848, 6158610, 6110125, 6030735, 5922094, 5787836, 5633218, 5464406, 5288254, 5111882, 4941473, 4781446, 4635098, 4505593, 4395739, 4307146, 4240220, 4194762, 4170095, 4165017, 4178386, 4209758, 4259051, 4325651, 4408088, 4504185, 4611137, 4725784, 4845188, 4966623, 5086734, 5201354, 5306785, 5400914, 5482718, 5551348, 5606350, 5648153, 5677541, 5695116, 5702073, 5701051, 5695318, 5687504, 5680090, 5676838, 5682676, 5702270, 5739613, 5798879, 5884539, 6000376, 6149109, 6333178, 6555106, 6816738, 7118527, 7459447, 7836847, 8245979, 8679868, 9129419, 9582946, 10025503, 10439488]
59922A0439488L67086L02865K23257J31395L2360o7242j60921k43724l12531l65584
59912A0346449m01956m21629m26100m18389m01789l78546l50111l18119k84252
59903F945558k49305k13352j76898j40868j05546p0546l5981k597K9445O0801
59893F040711R1577J20705J46952J69574J87537J99133K02843J97715J82658J56540
59883G695945J19638P4095K2491l3027q9743j43852j91937k32268k64046k86432
59873F670864k99190l03395l00597k91826k78170k61402k43100k23690k03240
59864D266254j82501j62385j42980j24025j05913q9411p4757o1827n0879m2411
59854C229165l6596l3360l2638l3888l5752l6834l6632l5337l3104k9923k5820
$$ y = [10439488, 10806574, 11109439, 11332696, 11464091, 11496451, 11429209, 11268288, 11024564, 10712033, 10346449, 9944493, 9522864, 9096764, 8678375, 8276586, 7898040, 7547929, 7229810, 6945558, 6696253, 6482901, 6306003, 6165135, 6059589, 5989043, 5953062, 5950465, 5979910, 6040711, 6132288, 6252993, 6399945, 6569519, 6757056, 6956189, 7159032, 7356747, 7539405, 7695945, 7815583, 7889678, 7912169, 7879142, 7789399, 7645547, 7453610, 7221342, 6957296, 6670864, 6371674, 6068279, 5767682, 5475856, 5197686, 4936284, 4693184, 4469494, 4266254, 4083753, 3921368, 3778388, 3654363, 3548450, 3459039, 3384282, 3322455, 3271576, 3229165, 3192569, 3159209, 3126571, 3092683, 3056931, 3020097, 2983465, 2948128, 2915024, 2885101, 2859281]
59843B859281k0818j5124r715o117n206o718j0183j5598k2719l0397l7273m2587
59831B636826m5899m6778m5312m2337l8465l3483k7258k0648j4935j0793q163
59820B302755o556n017k445J514O476J2419J9879K8540L6610M2381M5754M7737
59808B530047M9210N0834N3112N5623N6887N5867N2900M8519M2274L3750K3982
59797C053005J4716O770J96m514o592o147m085r56L413R344J7027K6608L7965
59784C146750N0646O4552Q0290R8410J18820J41509J67250J96867K30188K66294
59774D561576L04189L42544L79012M09995M30245M32255M07366L49527K59054
59765G875763J43648J6901j04664k06156k79147l23072l41948l40642l24239k98555
$$ y = [2859281, 2838463, 2823339, 2813624, 2807507, 2802301, 2795583, 2785400, 2769802, 2747083, 2716686, 2679413, 2636826, 2590927, 2544149, 2498837, 2456500, 2418035, 2384552, 2357294, 2336646, 2321711, 2310918, 2302755, 2296199, 2291182, 2288737, 2290251, 2296727, 2309146, 2329025, 2357565, 2394175, 2436556, 2482310, 2530047, 2579257, 2630091, 2683203, 2738826, 2795713, 2851580, 2904480, 2952999, 2995273, 3029023, 3053005, 3067721, 3074491, 3074687, 3070173, 3063581, 3057434, 3053349, 3052393, 3055806, 3065150, 3082177, 3108785, 3146750, 3197396, 3261948, 3342238, 3440648, 3559468, 3700977, 3868227, 4065094, 4295282, 4561576, 4865765, 5208309, 5587321, 5997316, 6427561, 6859816, 7267182, 7616709, 7875763, 8019411, 8036312, 7931648, 7725492, 7446345, 7123273, 6781325, 6440683, 6116444, 5817889]
59755E817889k68682k37189k05052j73680j44622j17999r2950o9483m8446k9833
59745D429953j2560M061J9921L5179N0513O6253Q2232R8580J15654J33243J50868
59734E173897J68846J88157K09286K32096K56821K84170L14411L47151L82092
59725G556927M19226M58298M98769N40094N81195O19634O52117O75849O88913
59716A2691022O89737O77293O52027O16202N73558N29126M88716M57409M38253
59707A7813343M32597M40778M61441M90659N23033N53671N78394N92514N90920
59698B2477350N69716N27234M63833L81820K85495J80347P2090l3131j28402k07507
59688B4588845k66983l06076l24969l24092l04853k69573k20361j58835q6929
$$ y = [5817889, 5549207, 5312018, 5106966, 4933286, 4788664, 4670665, 4577715, 4508232, 4459786, 4429953, 4417393, 4421454, 4441375, 4476554, 4527067, 4593320, 4675552, 4774132, 4889786, 5023029, 5173897, 5342743, 5530900, 5740186, 5972282, 6229103, 6513273, 6827684, 7174835, 7556927, 7976153, 8434451, 8933220, 9473314, 10054509, 10674143, 11326260, 12002109, 12691022, 13380759, 14058052, 14710079, 15326281, 15899839, 16428965, 16917681, 17375090, 17813343, 18245940, 18686718, 19148159, 19638818, 20161851, 20715522, 21293916, 21886430, 22477350, 23047066, 23574300, 24038133, 24419953, 24705448, 24885795, 24957885, 24924754, 24796352, 24588845, 24321862, 24015786, 23690817, 23366725, 23061872, 22792299, 22571938, 22413103, 22326174]
59679B2326174o853P9924J72847K71390L74732M82078N92135P02004Q07329R03335
59669B6705095R84688J044304J073352J062900J005310Q95028P30204N14878K59361
59660C4275120k1347l08981n83094q23819j016328j153579j235339j265535j250672
59651B6616426j199281j121321j027147r26599q28438p40783o72276o32035o26597
59642A8841949o55685p10637p76796q37914q80430q96809q86787q55509q09845
59633A1531537p55705o97406o37924n79284n23183m71247m24333l81938l43019
59624F717498l07223k74730k45329k18529j94217j72348j52263j33306j15802
59615D903751j00452q7023p4785o3974n5600m9909m6262m4521m5229m8363n3157
$$ y = [22326174, 22319321, 22399245, 22572092, 22843482, 23218214, 23700292, 24292427, 24994431, 25801760, 26705095, 27689783, 28734087, 29807439, 30870339, 31875649, 32770677, 33500881, 34015759, 34275120, 34253773, 33944792, 33361698, 32537879, 31521551, 30367972, 29132633, 27867098, 26616426, 25417145, 24295824, 23268677, 22342078, 21513640, 20772857, 20100581, 19468546, 18841949, 18186264, 17475627, 16698831, 15860917, 14980487, 14083678, 13196891, 12341382, 11531537, 10775832, 10078426, 9440502, 8861218, 8338035, 7866788, 7442455, 7060517, 6717498, 6410275, 6135545, 5890216, 5671687, 5477470, 5305122, 5152859, 5019553, 4903751, 4803299, 4716276, 4641491, 4577517, 4521917, 4472008, 4425746, 4381225, 4335996, 4287633, 4234476]
59604D234476n9287o6942p5394q2830q8105r1594r3864r4544r3145r0060q6033
59593C312678q1249p5442o8472o0522n2136m4143l6953k9986k2562j5190r047
59582B816976m160P03O204J1578J5940J9326K1969K3607K4177K4347K4638K4724
59570C010029K4275K3907K4617K6665K9529L2754L6362M0736M6381N3576O2024
59559C410855P1034Q0179Q9649R9986J11688J24897J39181J53902J69068J85403
59549D635842K03093K20996K37771K53254K67734K80318K89229K93603K93823
59540F975663K90048K81594K68221K51199K32451K12824J91165J65084J33266
59531I001515R7867O4102L6487J5632o83j3900k3220k7105k4621j5353O37K2474
$$ y = [4234476, 4175189, 4108247, 4032853, 3950023, 3861918, 3770324, 3676460, 3581916, 3488771, 3398711, 3312678, 3231429, 3155987, 3087515, 3026993, 2974857, 2930714, 2893761, 2863775, 2841213, 2826023, 2816976, 2812816, 2813519, 2819723, 2831301, 2847241, 2866567, 2888536, 2912143, 2936320, 2960667, 2985305, 3010029, 3034304, 3058211, 3082828, 3109493, 3139022, 3171776, 3208138, 3248874, 3295255, 3348831, 3410855, 3481889, 3562068, 3651717, 3751703, 3863391, 3988288, 4127469, 4281371, 4450439, 4635842, 4838935, 5059931, 5297702, 5550956, 5818690, 6099008, 6388237, 6681840, 6975663, 7265711, 7547305, 7815526, 8066725, 8299176, 8512000, 8703165, 8868249, 9001515, 9099382, 9163484, 9199971, 9215603, 9214920, 9201020, 9177800, 9150695, 9126074, 9110721, 9111358, 9133832]
59519I133832M8880P8838J10876J41995J68355J86794J94774J89556J69223J34467
59509A0557590Q7939L1970l1637r9950j68913k35221k96469l49505l90659m18244
59499H686901m33196m36893m29951m13676l90777l63730l33806l02309k71131
59490E311432k41320k12572j84938j59586j37012j16049r5661p6332n8578m1475
59480C987909k3903o084J1323K8638M6438O4363Q1882R9559J18360J38191J58206
59469D704882J77992J97527K16305K33250K47195K56887K60985K58490K48708
59460F802221K30614K03077J66182J21505P0860J5762m1429r7079j47833j91886
59450G131994k28302k56198k75425k86998k92044k90913k84105k73195k60000
$$ y = [9133832, 9182712, 9261550, 9372426, 9514421, 9682776, 9869570, 10064344, 10253900, 10423123, 10557590, 10645529, 10677499, 10645862, 10545912, 10376999, 10141778, 9845309, 9495804, 9105145, 8686901, 8253705, 7816812, 7386861, 6973185, 6582408, 6218678, 5884872, 5582563, 5311432, 5070112, 4857540, 4672602, 4513016, 4376004, 4259955, 4164294, 4087962, 4029384, 3987909, 3964006, 3957922, 3969245, 3997883, 4044321, 4108684, 4190566, 4290125, 4408485, 4546676, 4704882, 4882874, 5080401, 5296706, 5529956, 5777151, 6034038, 6295023, 6553513, 6802221, 7032835, 7235912, 7402094, 7523599, 7594459, 7610221, 7568792, 7471713, 7323880, 7131994, 6903692, 6647494, 6372069, 6085071, 5793027, 5502114, 5218009, 4944814, 4684814]
59441D684814k45408k29668k13207j96599j80271j64692j50242j36616j23127
59432C044984j09851r7658q6966p7382o8719o1115n3973m6218l8046l0964k5479
59421B348613k0208j4097q051l320M35M299Q377J2070J5320J8712K2730K7251
59409B412131L0916L0991K5464J5998P389L388M221Q429J5109K3447L2233M1210
59397B650926N1194O1240O7638O7818O4066O1496O3314O9733Q0141R4050J10470
59386C442086J28505J48429J70787J94945K20036K46766K76714L10270L46671
59377E485209L85517M26679M68951N10119N47976N80046O02858O13140O09619
59368A0230114N92814N63775N24397M78295M29650L81244L34579K91257K52581
$$ y = [4684814, 4439406, 4209738, 3996531, 3799932, 3619661, 3454969, 3304727, 3168111, 3044984, 2935133, 2837475, 2750509, 2673127, 2604408, 2543293, 2489320, 2443102, 2405056, 2374092, 2348613, 2328405, 2314308, 2306257, 2302937, 2303372, 2307671, 2316048, 2328118, 2343438, 2362150, 2384880, 2412131, 2443047, 2474038, 2499502, 2515500, 2522889, 2526277, 2530498, 2538927, 2554036, 2577483, 2609716, 2650926, 2702120, 2763360, 2830998, 2898816, 2962882, 3024378, 3087692, 3157425, 3237566, 3331616, 3442086, 3570591, 3719020, 3889807, 4084752, 4304788, 4551554, 4828268, 5138538, 5485209, 5870726, 6297405, 6766356, 7276475, 7824451, 8404497, 9007355, 9620495, 10230114, 10822928, 11386703, 11911100, 12389395, 12819045, 13200289, 13534868, 13826125, 14078706]
59359A4078706K18220J86676J56855J27771R7101O1842K0628k5784p6250j30072
59349A4715693j85917k41103k92423l37222l73899m02287m23676m39852m52227
59340A1567087m62006m70205m76653m79572m77328m70098m59085m44691m26553
59331G400896m04764l80016l52999l24729k96852k70528k45423k20726j96705
59322D708154j74305j53853j35131j18109j02647q8056p3873o0433m7932l5873
59312C717942k4315j4414o504J015R551J8335K6196L3856M2423N0695N6396N9400
59300C970576O1466O3184O3510O2014N9332N5426M9565M2164L4680K7590K0355
59289D509862J3462Q492N964M976N284P917J3305K0629K9427M0248N3224O7457
$$ y = [14078706, 14296926, 14483602, 14640457, 14768228, 14865329, 14927171, 14947799, 14922015, 14845765, 14715693, 14529776, 14288673, 13996250, 13659028, 13285129, 12882842, 12459166, 12019314, 11567087, 11105081, 10634876, 10158223, 9678651, 9201323, 8731225, 8272140, 7827449, 7400896, 6996132, 6616116, 6263117, 5938388, 5641536, 5371008, 5125585, 4904859, 4708154, 4533849, 4379996, 4244865, 4126756, 4024109, 3936053, 3862180, 3801747, 3753815, 3717942, 3693627, 3679213, 3672709, 3673724, 3683275, 3701610, 3727806, 3761662, 3804085, 3854780, 3911176, 3970576, 4032042, 4095226, 4158736, 4220750, 4280082, 4335508, 4385073, 4427237, 4461917, 4489507, 4509862, 4523324, 4531816, 4537780, 4542756, 4548040, 4555957, 4569262, 4589891, 4619318, 4659566, 4712790, 4780247]
59277D780247Q2335R7949J13809J28428J40542J49317J52977J48861J35790J15499
59267F045754R1181O5395L9438J3625j2179l7502o0626p9681r4203j04656j10925
59256E755621j12600j10386j05627r8605q8891p7345o6001n5898m6643l8217l1550
59245D923858k7010k3956k2097k1761k2535k3284k3792k4767k5849k5341k2390
59234D661076j7763j1810l388Q469K3291M0488O0484Q3669J09496J37474J68010
59223E259496K01368K36780K73146L09505L44182L74501L97910M12351M15073
59214H224312M02523L72449L25299K63017J87625J01715R318q4811j76268k60898
59204I364281l34591l93941m36916m62786m72336m68240m54083m32558m05315
$$ y = [4780247, 4862582, 4960531, 5074340, 5202768, 5343310, 5492627, 5645604, 5794465, 5930255, 6045754, 6136935, 6202330, 6241768, 6255393, 6243214, 6205712, 6145086, 6065405, 5971202, 5866546, 5755621, 5643021, 5532635, 5427008, 5328403, 5239512, 5162167, 5096166, 5040268, 4993625, 4955408, 4923858, 4896848, 4872892, 4850795, 4829034, 4806499, 4783215, 4759423, 4734656, 4708807, 4683466, 4661076, 4643313, 4631503, 4628115, 4636584, 4659875, 4700363, 4760847, 4844516, 4954012, 5091486, 5259496, 5460864, 5697644, 5970790, 6280295, 6624477, 6998978, 7396888, 7809239, 8224312, 8626835, 8999284, 9324583, 9587600, 9775225, 9876940, 9886258, 9801447, 9625179, 9364281, 9029690, 8635749, 8198833, 7736047, 7263711, 6795471, 6341388, 5908830, 5503515]
59195E503515l74460l42722l11730k81431k51884k24354k00005j78697j59779
59186C178453j43084j28376j14946j02525r1746q2895p5044o7112n9107n1681
59176B261937m5148l9567l4985l1053k6983k2422j7790j3446r222n029j097K636
59164B017831O598J0742J4503J7822K1314K5200K8950L2312L5657L9148M2596
59153B292673M6296N0842N5822N9944O2852O5632O9027P2377P4813P6223P6509
59142C003010P5155P2221O8527O4150N7903M9190L9248K9694K0748J1800K862
59131C494508n450j2671j8365k1922k3159k2663k0983j8046j3615p671m5R407
59119C339325K0002L0538M0721N1304O2474P3341Q3576R4275J06445J19561J32498
$$ y = [5503515, 5129055, 4786333, 4474603, 4193172, 3941288, 3716934, 3516929, 3338232, 3178453, 3035369, 2906993, 2792047, 2689522, 2597776, 2514881, 2439837, 2372725, 2313618, 2261937, 2216789, 2177222, 2142237, 2111184, 2084201, 2061779, 2043989, 2030543, 2021321, 2016292, 2015195, 2017831, 2024429, 2035171, 2049674, 2067496, 2088810, 2114010, 2142960, 2175272, 2210929, 2250077, 2292673, 2338969, 2389811, 2445633, 2505577, 2568429, 2634061, 2703088, 2775465, 2850278, 2926501, 3003010, 3078165, 3150386, 3218913, 3283063, 3340966, 3390156, 3429404, 3459098, 3479846, 3491646, 3494508, 3489058, 3476387, 3458022, 3436100, 3412941, 3390278, 3369295, 3351249, 3337634, 3329963, 3329918, 3339325, 3359327, 3389865, 3430586, 3481890, 3544364, 3617705, 3701281, 3795556, 3902001, 4021562, 4154060]
59108D154060J45041J57751J70973J84564J97996K10282K20474K28314K33594
59099E903049K34766K29406K16245J95528J67249J30739Q6720L8281j1004n8724
59089G132255j02887j41292j72814j98115k18000k32145k40443k44297k45332
59080E336930k43755k39228k32398k24376k15395k05256j94495j84026j74111
59071C423890j64552j55348j46435j37379j28123j19338j11384j03714r5973q8809
59061B172835q2707p6929p0667o4438n9286n5206n1403m7581m4019m0722l7464
59050A542413l4367l1706k9411k7336k5685k4634k3948k3345k2852k2441k1852
59039A254836k0937j9706j7907j5351j2693j0835r425p105l520J24K895N162P397
$$ y = [4154060, 4299101, 4456852, 4627825, 4812389, 5010385, 5220667, 5441141, 5669455, 5903049, 6137815, 6367221, 6583466, 6778994, 6946243, 7076982, 7163702, 7201983, 7190979, 7132255, 7029368, 6888076, 6715262, 6517147, 6299147, 6067002, 5826559, 5582262, 5336930, 5093175, 4853947, 4621549, 4397173, 4181778, 3976522, 3782027, 3598001, 3423890, 3259338, 3103990, 2957555, 2820176, 2692053, 2572715, 2461331, 2357617, 2261644, 2172835, 2090128, 2013199, 1942532, 1878094, 1818808, 1763602, 1712199, 1664618, 1620599, 1579877, 1542413, 1508046, 1476340, 1446929, 1419593, 1393908, 1369274, 1345326, 1321981, 1299129, 1276688, 1254836, 1233899, 1214193, 1196286, 1180935, 1168242, 1157407, 1147982, 1140877, 1137357, 1137481, 1140376, 1145538, 1152935]
59026A152935R261J0631J2066J3534J3904J2629J0701R077P400N188L094J829
59014A262249R69l4p02m69K32Q96K048M214O701Q517R762J0934J1649J1212R871
58999A338049Q344O638M311J462j428m139o451p764p672o500m777k842j280p39
58985A315212q71m40Q88K069K557L321N153P202Q262Q482Q677Q960R101R391J0215
58970A398179J1485J3273J6002J9288K1687K2459K2571K3114K3925K4518K5151
58959A621652K5910K6036K5269K4637K4947K5661K6283K7458K9510L1314L2067
58948A920744L2906L5271L8795M2308M5794M9821N3968N7510O0874O5030P0068
58937B473089P5561Q1571Q8083R4410J00330J06854J14773J23510J32574J42977
$$ y = [1152935, 1162196, 1172827, 1184893, 1198427, 1212331, 1224960, 1235661, 1244738, 1252138, 1257326, 1260420, 1262249, 1263218, 1263184, 1262482, 1262013, 1262245, 1263141, 1265189, 1269403, 1276104, 1284621, 1294383, 1305317, 1316966, 1328178, 1338049, 1346393, 1353031, 1357342, 1358804, 1357376, 1353237, 1346786, 1339022, 1331350, 1324850, 1320073, 1317231, 1315951, 1315212, 1314341, 1313901, 1314789, 1316858, 1319415, 1322736, 1327889, 1335091, 1343353, 1351835, 1360512, 1369472, 1378573, 1387964, 1398179, 1409664, 1422937, 1438939, 1458227, 1479914, 1502373, 1524944, 1548058, 1571983, 1596501, 1621652, 1647562, 1673598, 1698867, 1723504, 1748451, 1774112, 1800395, 1827853, 1857363, 1888677, 1920744, 1953650, 1988921, 2027716, 2070024, 2115818, 2165639, 2219607, 2277117, 2337991, 2403021, 2473089, 2548650, 2630221, 2718304, 2812714, 2913044, 3019898, 3134671, 3258181, 3390755, 3533732]
58927C533732J55786J70426J85828K02199K20249K39806K60607K83452L09064
58918E561149L36890L66372L98292M33442M71178N10712N52415N96105O39346
58909I865901O79291P14871P45188P66917P75352P67047P39561O89877O15617
58900A6359622N17433L98477K62578J14928l6629j83610l19944m41380n43204
58891A6128271o21351o75515p08771p24227p23848p10011o85906o54307o17572
58882A0006763n78462n39197n00181m61298m23868l89588l58394l29375l03043
58873F123357k80583k61448k43920k27479k12534j98443j84170j70383j58458
58864D185939j47756j36337j24153j13115j04010r5716q7534q0016p3250o6483
$$ y = [3533732, 3689518, 3859944, 4045772, 4247971, 4468220, 4708026, 4968633, 5252085, 5561149, 5898039, 6264411, 6662703, 7096145, 7567323, 8078035, 8630450, 9226555, 9865901, 10545192, 11260063, 12005251, 12772168, 13547520, 14314567, 15054128, 15744005, 16359622, 16877055, 17275532, 17538110, 17653038, 17616409, 17432799, 17112855, 16671475, 16128271, 15506920, 14831405, 14122634, 13398407, 12674559, 11964548, 11278642, 10624335, 10006763, 9428301, 8889104, 8388923, 7927625, 7503757, 7114169, 6755775, 6426400, 6123357, 5842774, 5581326, 5337406, 5109927, 4897393, 4698950, 4514780, 4344397, 4185939, 4038183, 3901846, 3777693, 3664578, 3560568, 3464852, 3377318, 3297302, 3224052, 3157569]
58854C157569n9655n3456m7798m1978l6291l1549k7195k1813j5401r143l168L397
58842B813519J0299J6290K1402K6928L3058L8612M3354M8547N4970O2101O9484
58831C238564P7210Q5064R2785J01070J10711J21089J31207J41606J53444J66433
58821D419183J79886J95026K13633K34952K56842K79678L06130L37016L70397
58812F792743M05191M42690M83711N26826N70277O13260O54413O91018P20411
58803A1900540P40233P46808P35488P03203O49007N72036M71491L49432K11588
58794A7079826O4765q4726k29922l63168m78504n72878o44825o93884p21708p31733
58784A2623243p27065p10035o83667o51486o15622n76960n37122m98347m61447
$$ y = [3157569, 3097914, 3044458, 2996660, 2954682, 2918391, 2886842, 2859647, 2837834, 2822433, 2813290, 2810122, 2813519, 2823818, 2840108, 2861510, 2888438, 2921496, 2960108, 3003462, 3052009, 3106979, 3169080, 3238564, 3315774, 3400838, 3493623, 3594693, 3705404, 3826493, 3957700, 4099306, 4252750, 4419183, 4599069, 4794095, 5007728, 5242680, 5499522, 5779200, 6085330, 6422346, 6792743, 7197934, 7640624, 8124335, 8651161, 9221438, 9834698, 10489111, 11180129, 11900540, 12640773, 13387581, 14123069, 14826272, 15475279, 16047315, 16518806, 16868238, 17079826, 17144591, 17059865, 16829943, 16466775, 15988271, 15415393, 14770568, 14076684, 13354976, 12623243, 11896178, 11186143, 10502476, 9850990, 9235368, 8658408, 8121286, 7622939, 7161492]
58775G161492m26041l92698l62590l35384l09971k87060k68174k52171k35974
58766D291429k18899k03073j89224j75548j61486j48981j38865j29197j18723
58757B807433j08884j00857r3431q5529p8099p1835o5521n8416n1882m7006m2781
58746B003192l8330l4666l2567l0783k8095k5307k3546k2417k1245k0398j9998
58735A705840j9076j7346j6003j5676j5453j4963j5283j6581j7176j6334j5819
58724A526130j7073j8957j9923k0437k1614k3311k5067k7193k9469l0537k9998
58713A262551k9243k9057k8343k6568k5164k5002k4706k3180k1666k1360k1049
58702I87213j9153j6441j4674j4111j4019j4203j4379j3622j2043j1351j2294
$$ y = [7161492, 6735451, 6342753, 5980163, 5644779, 5334808, 5047748, 4779574, 4527403, 4291429, 4072530, 3869457, 3680233, 3504685, 3343199, 3194218, 3055353, 2926156, 2807433, 2698549, 2597692, 2504261, 2418732, 2340633, 2268798, 2203277, 2144861, 2092979, 2045973, 2003192, 1964862, 1930196, 1897629, 1866846, 1838751, 1813444, 1789898, 1767481, 1746236, 1725838, 1705840, 1686764, 1669418, 1653415, 1637739, 1622286, 1607323, 1592040, 1575459, 1558283, 1541949, 1526130, 1509057, 1490100, 1470177, 1449740, 1428126, 1404815, 1379748, 1352555, 1323086, 1292549, 1262551, 1233308, 1204251, 1175908, 1149340, 1124176, 1099174, 1074468, 1051288, 1029622, 1008262, 987213, 968060, 951619, 936945, 922834, 908815, 894612, 880233, 866611, 854568, 843217, 830923]
58691H30923j3265j2968j2439j2722j2558j0504p571n623m552l121j284K85J726
58678G36327L207L745K591P25n58j417k418l122l151l308m137m614l745k147p64
58663G17214O57K503M111M901N167M698K354j745n385o944p155o961n721l052
58649G04642m15J021K264M487O867Q169Q853R853J0867J1432J2127J3254J3995
58636H07416J4209J5189J7319J9128K0060K1860K5463K9000L0863L2415L5438
58625A068360L9256M2684M6650N2384N9015O5524P3182Q3469R5317J07006J19054
58614A851901J32753J47345J61296J74890J89063K02954K14936K24590K31393
58605C531121K32752K25685K09260J83616J48335J04098N4411L527m5911r1485
$$ y = [830923, 817658, 804690, 792251, 779529, 766971, 756467, 748896, 743273, 738721, 735600, 734316, 734601, 736327, 739534, 743279, 745870, 746595, 746037, 744620, 742202, 739080, 735929, 732621, 728484, 723870, 720125, 717978, 717214, 717871, 720374, 724485, 729386, 734553, 739251, 741605, 739860, 734475, 727531, 720376, 713415, 707694, 704642, 704227, 705248, 707512, 711999, 718866, 727035, 735888, 745741, 756608, 768040, 780167, 793421, 807416, 821625, 836814, 854133, 873261, 893321, 915181, 940644, 969644, 1000507, 1032922, 1068360, 1107616, 1150300, 1196950, 1249334, 1308349, 1373873, 1447055, 1530524, 1625841, 1732847, 1851901, 1984654, 2131999, 2293295, 2468185, 2657248, 2860202, 3075138, 3299728, 3531121, 3763873, 3989558, 4198818, 4382434, 4530769, 4634867, 4689278, 4692805, 4646894, 4555409]
58595D555409j29523j57573j76662j88930j94855j94856j91237j85856j77947
58586B957970j66926j55146j44924j35032j23395j11195j00864r1742q1420p0158
58576A777168o0362n2671m5872l9789l5227l1749k8402k5756k4649k3966k2316
58565A386409k0602k0231k0191j8836j7180j7387j9226k0990k2674k5126k7320
58554A156646k7649k6848k6593k6315k4449k1680j9846j8687j6785j4615j3538
58543I19641j2921j1379r693r321r220p459m899l813l925l253j932j737k634l144
58529H34311l362m359n507n610n730p603j0245j1504j1850j3173j4875j4877j3564
58516G12052j3002j3071j2078j0351r618r529q473o996o725o794n184k744j913
$$ y = [4555409, 4425886, 4268313, 4091651, 3902721, 3707866, 3513010, 3321773, 3135917, 2957970, 2791044, 2635898, 2490974, 2355942, 2232547, 2121352, 2020488, 1928746, 1847326, 1777168, 1716806, 1664135, 1618263, 1578474, 1543247, 1511498, 1483096, 1457340, 1432691, 1408725, 1386409, 1365807, 1345576, 1325385, 1306549, 1289369, 1271982, 1252756, 1231766, 1209092, 1183966, 1156646, 1128997, 1102149, 1075556, 1049241, 1024792, 1003112, 983266, 964579, 947794, 933179, 919641, 906720, 895341, 885648, 876327, 867107, 859648, 854749, 850936, 847011, 843758, 841826, 840089, 837455, 834311, 830949, 826590, 821083, 815473, 809743, 802140, 791895, 780391, 768541, 755368, 740493, 725616, 712052, 699050, 685979, 673901, 663550, 653932, 644403, 635930, 628934, 622209, 615415, 610231, 607487, 605574]
58503F05574k251j297P04J193p8q88o48o59o83O91K554K602J309J197K275K275
58487F13870J166J174K430K760J913J938L119L546K866K695L205K993K346K848
58473F48869L956L700K547K623L446K577K66q32m93j156l272m740n041n768o911
58458F39771o836o017o571q043p891o113n097m966l623j314n00j128p54N65L97
58443E81880r57n85J536K300J223J198K913L746L149L770O087P103N727M543M772
58428F28405M297K098M0j121k902n003m779k122k69l67K11K725M911N336N549
58413F37009O365O370N461N655P222Q154Q275R534J1510J1310Q764O884O498N287
58399G44298K885J596J322q04m658o608n838n615p061p372n654m701n306m606
$$ y = [605574, 603323, 602026, 602730, 603923, 603845, 602957, 602309, 601650, 600967, 601658, 604212, 606814, 608123, 609320, 611595, 613870, 615036, 616210, 618640, 621400, 623313, 625251, 628370, 631916, 634782, 637477, 640682, 643675, 646021, 648869, 652825, 656525, 659072, 661695, 665141, 667718, 667984, 667152, 666659, 665503, 662231, 657491, 652450, 646682, 639771, 632935, 626918, 620347, 612304, 604413, 598300, 593203, 588237, 584614, 583300, 582800, 581672, 580918, 581483, 581880, 580923, 580338, 581874, 584174, 585397, 586595, 589508, 593254, 596403, 600173, 606260, 613363, 619090, 623633, 628405, 632702, 634800, 634840, 633719, 630817, 625814, 621035, 618913, 618644, 618277, 618488, 621213, 626124, 631460, 637009, 643374, 649744, 655205, 660860, 668082, 676236, 684511, 694045, 705555, 716865, 725629, 732513, 739011, 744298, 747183, 748779, 750101, 749297, 744639, 738031, 732193, 726578, 719517, 712145, 706491, 701790, 696484, 691878]
58385F91878j789K11M02J469M196N904O049P388R969J0132P328N597O322O046
58371G61102L569K565M560O053N349N556P926Q908P070O224Q290R521P471N361
58357H49525N767O248N034M940P604R742R083Q322R529J0295R019Q160Q774P777
58343I59819M174J829K550K668J30j580l27O05o98p15K513N039M161L277N137
58328I88582O899O447O874R946J1853J0376R512J2041J4329J3564J3201J5832
58316A119456J7657J5714J3797J5416J7463J6692J5834J7467J8294J5533J2553
58305A295876J2465J2457J0161Q920J1068J2765J1182J0018J2214J4247J3428
58294A424801J3437J6775J9235J7906J6955J9416K1206J9512J8826K2156K4750
$$ y = [691878, 690089, 690300, 690702, 692171, 696367, 702271, 708320, 715708, 725677, 735809, 743137, 748734, 755056, 761102, 764671, 767236, 771796, 777849, 783198, 788754, 796680, 805588, 812658, 818882, 827172, 836693, 844164, 849525, 855292, 861540, 866574, 871514, 879118, 888860, 897943, 906265, 915794, 926089, 935108, 943268, 952042, 959819, 963993, 965822, 968372, 971040, 971170, 969590, 969263, 969868, 969170, 968455, 970968, 976007, 980168, 983445, 988582, 995481, 1001928, 1008802, 1018748, 1030601, 1040977, 1050489, 1062530, 1076859, 1090423, 1103624, 1119456, 1137113, 1152827, 1166624, 1182040, 1199503, 1216195, 1232029, 1249496, 1267790, 1283323, 1295876, 1308341, 1320798, 1330959, 1339879, 1350947, 1363712, 1374894, 1384912, 1397126, 1411373, 1424801, 1438238, 1455013, 1474248, 1492154, 1509109, 1528525, 1549731, 1569243, 1588069, 1610225, 1634975]
58283A634975K3283K2548K6031K8863K7439K6804L0778L4151L2741L1699L5440
58272A954752L8939L7728L6744M0267M3062M0898L9735M4542M9166M7598M5103
58261B418534M7748N1191N0634N1315N7872O3953O3881O3847O9802P5543P5074
58250C089394P5177Q2716R1099R2826R3709J00741J07871J08363J09216J18242
58240D069354J28920J33289J37408J48412J59239J62560J66462J79545J94190
58231E479379K01758K09895K26887K44312K54033K66241K90754L17344L35382
58222G825985L55195L87886M22976M49581M79826N26131N76260O17759O65043
58213A2306642P33642Q11104Q84044R69048J083776J214437J347561J505169J709969
$$ y = [1634975, 1658258, 1680806, 1706837, 1735700, 1763139, 1789943, 1820721, 1854872, 1887613, 1919312, 1954752, 1993691, 2031419, 2068163, 2108430, 2151492, 2192390, 2232125, 2276667, 2325833, 2373431, 2418534, 2466282, 2517473, 2568107, 2619422, 2677294, 2741247, 2805128, 2868975, 2938777, 3014320, 3089394, 3164571, 3247287, 3338386, 3431212, 3524921, 3625662, 3733533, 3841896, 3951112, 4069354, 4198274, 4331563, 4468971, 4617383, 4776622, 4939182, 5105644, 5285189, 5479379, 5681137, 5891032, 6117919, 6362231, 6616264, 6882505, 7173259, 7490603, 7825985, 8181180, 8569066, 8992042, 9441623, 9921449, 10447580, 11023840, 11641599, 12306642, 13040284, 13851388, 14735432, 15704480, 16788256, 18002693, 19350254, 20855423, 22565392]
58204B2565392J947683K206578K520146K924899L415314L993134M718332N654279
58196D9945757O815008Q235362J0032227J2310068J5067615J8289805K2047097
58189A42742939K6382264L1185733L6257583M1152398M4481440M3547436L5622745
58182D01372538K0401437J162178j6948153l0020710l7020341l9047511l7774219
58175B62125219l4618228l0653042k6597954k2790363j9338685j6312137j3741382
58168I8073428j1558715r670623q045060o658676n432103m293854l242437k280296
58160D6891664j355700m25965N03733J447123K399442L117591L080637J903002
58152E7561527j90681k437520m110754m955879n123299m868274m392230l840952
$$ y = [22565392, 24513075, 26719653, 29239799, 32164698, 35580012, 39573146, 44291478, 49945757, 56760765, 64996127, 75028354, 87338422, 102406037, 120695842, 142742939, 169125203, 200310936, 236568519, 277720917, 322202357, 365749793, 401372538, 421773975, 422936153, 405988000, 375967290, 338946949, 299899438, 262125219, 227506991, 196853949, 170255995, 147465632, 128126947, 111814810, 98073428, 86514713, 76844090, 68799030, 62140354, 56708251, 52414397, 49171960, 46891664, 45535964, 45109999, 45613732, 47060855, 49460297, 52577888, 55658525, 57561527, 57370846, 54933326, 50822572, 45866693, 40743394, 35875120, 31482890, 27641938]
58144B7641938l307228k823181k392861k026023j726396j477250j263060j085375
58136A1540564r43136q20476p07558o12211n39684m80785m28835l88594l60667
58127F258618l35883l11423k94259k83598k68095k44958k23966k08686j91341
58118C896409j69767j51798j39212j24626j07907r8878r9976j02085j00903j01840
58108B699417j05553j04332r6527q9861q6898q1352p1918o5718o4710o2155n5857
58097A814536n1874n2014n0298m4904m1373m1130l8744l3326l0871l2687l2918
58086A364397l0071k9523l2238l2377k8723k7337l0007l1000k8089k6248k7503
58075A041281k7397k4419k3004k4324k3743k0140j8291j9396j8654j4752j2458
$$ y = [27641938, 24334710, 21511529, 19118668, 17092645, 15366249, 13888999, 12625939, 11540564, 10597428, 9776952, 9069394, 8457183, 7917499, 7436714, 7007879, 6619285, 6258618, 5922735, 5611312, 5317053, 5033455, 4765360, 4520402, 4296436, 4087750, 3896409, 3726642, 3574844, 3435632, 3311006, 3203099, 3104221, 3004245, 2902160, 2801257, 2699417, 2593864, 2489532, 2393005, 2303144, 2216246, 2134894, 2062976, 1997258, 1932548, 1870393, 1814536, 1762662, 1710648, 1660350, 1615446, 1574073, 1532943, 1494199, 1460873, 1430002, 1397315, 1364397, 1334326, 1304803, 1272565, 1240188, 1211465, 1184128, 1154121, 1123121, 1095032, 1068784, 1041281, 1013884, 989465, 966461, 942137, 918394, 898254, 879963, 860567, 841913, 827161, 814703]
58064H14703j3184j2251q251o035p519q333o513n899q028r011p430p184r618j0702
58050F94745q864p861r160r108o408m940o335p023n275m196n129n096l179k618
58036F09553m193m267j688P4l49l5J776J908j72r16L44pk471k866k40J015p44
58019E96722j517O07K032Q05R1J495J789n90k351j833k242n198p382o817o322
58004E69289p606p963o127n287o934p596n168k751k768k903j344n43k143l436
57990E06720k561k088l938n667n251m696n521n465l113j067j101q46J363K947
57976D69716J891N25J070J788R45L61J510K246Q41o60l87J5r14j375j36N60r17
57959D77079k387j895j144j928k940l109m144o729q096o550m607m459m172j734
$$ y = [814703, 801519, 789268, 781017, 774982, 767463, 759130, 752617, 746718, 738690, 729679, 722249, 715065, 705447, 694745, 685881, 678020, 668860, 659752, 653344, 648404, 642069, 635046, 629771, 625575, 620446, 615350, 612171, 609553, 605360, 601093, 599405, 599479, 599130, 599095, 600871, 602779, 602607, 601691, 602035, 602028, 599557, 596691, 596451, 597466, 596722, 595205, 595812, 597844, 598649, 598740, 600235, 602024, 601434, 599083, 597250, 595008, 589810, 582428, 575611, 569289, 561683, 553720, 547593, 542306, 535372, 527776, 522608, 519857, 517089, 514186, 512842, 512299, 510156, 506720, 504159, 502071, 498133, 492466, 487215, 482519, 476998, 471533, 468420, 467353, 466252, 465406, 466769, 469716, 471607, 472132, 473202, 474990, 475935, 476296, 477806, 480052, 480893, 480233, 479846, 479861, 478947, 477572, 477436, 477996, 477079, 474692, 472797, 471653, 469725, 466785, 463676, 459532, 452803, 444707, 438157, 433550, 429091, 424919, 423185]
57945D23185R84J716J710K757L718L290K901L652L714J831M5j09o43l200n702
57930D39849o170o420q532j0981j1740j1942j2970j3132j0903q398p948q049o317
57917C16347l709k232j154Q42K353J809R11J961L929M664M863O396Q678R949J0389
57902C65996J0865J0533Q520O207N128M488L270K505K928K814Q84j074j225r21
57888D20918k107l923m791n434o902p927p260o296o536o674n213l554l469l848
57874C46984l019j942j976j830NK070K480K469L983N902O186N746O618Q048P913
57859C89637O537N634M967L364J607J146J229L47r36j431j979l611m877m139k891
57844C94604l502n247n796n230n219n544m814l484k988k932k149j357j816k598
$$ y = [423185, 424169, 425885, 427595, 430352, 434070, 437360, 440261, 443913, 447627, 449458, 449503, 449394, 448751, 445551, 439849, 433679, 427259, 418727, 407746, 396006, 384064, 371094, 357962, 347059, 338661, 330713, 322664, 316347, 312638, 310406, 309252, 310094, 312447, 314256, 315167, 317128, 321057, 325721, 330584, 336980, 345658, 355607, 365996, 376861, 387394, 395914, 402121, 407249, 411737, 415007, 417512, 420440, 423254, 424138, 423064, 421839, 420918, 418811, 414888, 410097, 404663, 397761, 389834, 382574, 376278, 369742, 363068, 357855, 354301, 350832, 346984, 343965, 342023, 340047, 338217, 338222, 340292, 342772, 345241, 349224, 355126, 361312, 367058, 373676, 381724, 389637, 396174, 401808, 406775, 410139, 411746, 412892, 414121, 414468, 413532, 412101, 410122, 406511, 401634, 397495, 394604, 391102, 385855, 380059, 374829, 369610, 364066, 359252, 355768, 352780, 349848, 347699, 346342, 344526, 341928]
57830C41928k201j655k852n061o126o041o305o937p127p666r482j0998j0146q035
57816B51296p380q191q209o852n537m769l894l171l258l239j875o1N55N15J467
57801A97397L157M313N483Q091J1436J3482J3801J3168J1231P382L019J70j274
57788B90856k402k701j441k07q73k303k348j894l280n759o392m839l519l269k536
57773B47093p96O61J414K194K527J153j159k241j915j937k662k748k139k328l539
57758B33578m331m079l342j899Q59L802M960M518M338M874N044M772M811M569
57744B62474L000J274J466K938L090J589O30J036J404J161J350K025J959J316
57730B86712J639K812K981J936J691L151M903N869O623P502P880P865Q425R464
$$ y = [341928, 339727, 338072, 335220, 330159, 324033, 317992, 311687, 304750, 297623, 289957, 280475, 269477, 259331, 251296, 243916, 235725, 227516, 220664, 215127, 210358, 206464, 203293, 200035, 196796, 194921, 194860, 195415, 195930, 197397, 200554, 204867, 210350, 218441, 229877, 243359, 257160, 270328, 281559, 288941, 291960, 292130, 290856, 288454, 285753, 284312, 284105, 283232, 280929, 278581, 276687, 273407, 267648, 261256, 256417, 252898, 249629, 247093, 246297, 246958, 248372, 250566, 253093, 254246, 253087, 250846, 248931, 246994, 244332, 241584, 239445, 237117, 233578, 229247, 225168, 221826, 219927, 220786, 224588, 229548, 234066, 238404, 243278, 248322, 253094, 257905, 262474, 265474, 266748, 268214, 271152, 274242, 275831, 276461, 277497, 278901, 280062, 281412, 283437, 285396, 286712, 288351, 291163, 294144, 296080, 297771, 300922, 305825, 311694, 318317, 325819, 333699, 341564, 349989, 359453]
57716C59453R908R741R835R901R040Q087Q739J0616J1929J2806J4939J8045J9969
57703E13008K0381K1172K2787K3541K3131K3641K6128K9216L1893L4957L8897
57692H08752M2989M7289N2993O0208O7826P6026Q6238R8303J10523J22933J37527
57681A711607J54741J72722J90596K09198K27766K43227K53794K60058K61425
57672C685134K54766K38194K13483J83501J49981J14504P7802L6119j7882q6959
57662D848643j63240k32230k81799l07020l09794k96600k75073k50238k24021
57653B508628j98005j74350j53511j33832j14752r8095q4992p3992o3567n4115
57643A359417m6068l8414l0680k4080j9119j4228q357k727J715O350J2525J9252
$$ y = [359453, 369361, 379102, 388937, 398838, 407878, 415965, 424704, 435320, 447249, 460055, 474994, 493039, 513008, 533389, 554561, 577348, 600889, 624020, 647661, 673789, 703005, 734898, 769855, 808752, 851741, 899030, 952023, 1012231, 1080057, 1156083, 1242321, 1340624, 1451147, 1574080, 1711607, 1866348, 2039070, 2229666, 2438864, 2666630, 2909857, 3163651, 3423709, 3685134, 3939900, 4178094, 4391577, 4575078, 4725059, 4839563, 4917365, 4953484, 4935602, 4848643, 4685403, 4453173, 4171374, 3864354, 3554560, 3257960, 2982887, 2732649, 2508628, 2310623, 2136273, 1982762, 1848930, 1734178, 1636083, 1551091, 1477099, 1413532, 1359417, 1313349, 1274935, 1244255, 1220175, 1201056, 1186828, 1178471, 1175744, 1177459, 1183809, 1196334, 1215586]
57631A215586K5111L0688L7182M4337N1591N9653O9172P9399Q9780J01332J14788
57620A918619J28835J41844J53868J65361J75302J82046J84576J81559J70663
57611C402673J50448J21744Q6061M4348j324m6625q7330j21680j49188j68849
57601C230278j80139j84481j83982j79748j72572j63829j54381j43826j32093
57592A735227j20423j09779r9732r0011q1535p4665o8209o1403n5221n0464m6261
57581H77524m1897l8251l5925l3699l0498k7229k5003k3157k0813j8633j7424
57570E64995j6425j4889j3691j3520j2996j0708p797o325o183n699m365k933j577
57557D47887J72K095L551M518N252N653N991P223R441J1305J2118J3035J5000
$$ y = [1215586, 1240697, 1271385, 1308567, 1352904, 1404495, 1464148, 1533320, 1612719, 1702499, 1803831, 1918619, 2047454, 2189298, 2343166, 2508527, 2683829, 2865875, 3050451, 3232010, 3402673, 3553121, 3674865, 3760926, 3805274, 3803950, 3757325, 3669995, 3548315, 3399127, 3230278, 3050139, 2865658, 2681676, 2501928, 2329356, 2165527, 2011146, 1867320, 1735227, 1614804, 1505025, 1405293, 1315282, 1233747, 1159082, 1090873, 1029470, 974249, 923785, 877524, 835627, 797376, 761451, 727752, 697254, 670025, 645022, 621865, 601052, 582419, 564995, 548570, 533681, 519990, 506470, 493474, 482766, 474969, 468644, 462461, 456762, 452397, 449464, 447887, 448059, 450154, 453705, 458223, 463475, 469128, 475119, 482342, 491783, 503088, 515206, 528241, 543241]
57544E43241J6978J7899J8686K0657K3309K5610K8151L1988L6426M0079M3296
57533H46320M7604N3333N9566O5982P3192Q1642R1374J02247J13440J23639J32560
57522A790899J41117J49129J54199J54023J48261J36966J18939R3424O1985K7217
57512B976159r049m4765p6677j02308j21595j35067j42014j42398j38781j34004
57502A929501j28285j20594j11496j02394r3345q3972p5299o8312o1896n4607
57492A029301m7378m2008l7992l3369k7782k2209j6681j0859n935l206j417J748
57480G82213O106R686J2306J5493J9270K2144K4367K8254L4774M2407M9828N7430
57468A104278O5676P4166Q2867R2358J02483J12409J22082J31716J39786J43557
$$ y = [543241, 560219, 578118, 596804, 617461, 640770, 666380, 694531, 726519, 762945, 803024, 846320, 893924, 947257, 1006823, 1072805, 1145997, 1227639, 1319013, 1421260, 1534700, 1658339, 1790899, 1932016, 2081145, 2235344, 2389367, 2537628, 2674594, 2793533, 2886957, 2948942, 2976159, 2967110, 2922345, 2845668, 2743360, 2621765, 2486698, 2344684, 2202286, 2063505, 1929501, 1801216, 1680622, 1569126, 1466732, 1373387, 1289415, 1214116, 1145804, 1083908, 1029301, 981923, 939915, 901923, 868554, 840772, 818563, 801882, 791023, 785088, 781882, 780465, 782213, 788319, 798005, 810311, 825804, 845074, 867218, 891585, 919839, 954613, 997020, 1046848, 1104278, 1169954, 1244120, 1326987, 1419345, 1521828, 1634237, 1756319, 1888035, 2027821, 2171378]
57458B171378J41824J35139J23147J03929P6666M3272O845k9981o4710r4756j18457
57447B494296j35491j46117j50876j50893j47371j40903j32153j22622j13486
57438A254384j04347r4627q5399p8044p1858o5110n7978n2209m8115m4232l9895
57427E12570l5970l2830k9755k6596k4127k2340k0278j7821j5896j4658j3252
57416B59047j1669j1017j1510j1888j1276j0173r195q289p461o962o526n743n137
57403A42201n464o090n650m288l505l808m179l971l560l088k365k022k940m342
57389H6929m377k858j484j146r76m62m26j200j740j331o36m11n89j099k035k614
57373F3545j687K29J135L88l65J79J120R90k07j586k681l310l206k575k131k047
$$ y = [2171378, 2313202, 2448341, 2571488, 2675417, 2752083, 2795355, 2802200, 2772219, 2707509, 2612753, 2494296, 2358805, 2212688, 2061812, 1910919, 1763548, 1622645, 1490492, 1367870, 1254384, 1150037, 1055410, 970011, 891967, 820109, 754999, 697021, 644812, 596697, 552465, 512570, 476600, 443770, 414015, 387419, 363292, 340952, 320674, 302853, 286957, 272299, 259047, 247378, 236361, 224851, 212963, 201687, 191514, 182319, 174030, 166569, 159607, 153081, 147338, 142201, 136737, 130647, 124997, 120709, 117204, 113396, 109217, 105246, 101686, 98598, 96233, 94211, 91271, 86929, 82552, 79694, 78210, 77064, 76088, 75626, 75200, 74000, 72260, 70929, 70293, 69882, 69293, 68194, 66159, 63545, 61858, 62087, 63222, 63610, 63245, 63424, 64544, 65534, 65327, 63741, 61060, 57750, 54544, 51969, 49838, 47791]
57357D7791j849j551j689k040j672o63l14j152k066j992j197m16O4j1q75j914
57341B8454j968r40P4M92P86J112R08K55J07P12J175J098J168J668J871J560J649
57324D0181K581L454L466K997K585K078J454J246J466J301N87L37J183K365K999
57309G0280L269L698M192M480M613M589M279L983M199M716M992N351O491P876
57295A37008Q223P716P928R287J0458J0812J1552J3561J5932J7700J9402K1822
57283B91401K4514K6716K8525L0134L0990L0725K9883K8904K7340K4834K1814
57272E95780J8419J3912P940J380m883j0978j7100k2518k6380k8623k9516k9136
57260D68297k7940k6793k5923k4675k2794k0890j9285j7498j5388j3567j2198
$$ y = [47791, 45942, 44391, 42702, 40662, 38990, 38327, 38013, 36861, 34795, 32803, 31606, 31190, 31254, 31243, 30368, 28454, 26486, 25546, 25620, 26112, 26898, 28010, 28918, 29173, 29280, 29992, 31167, 32265, 33433, 35101, 36972, 38532, 40181, 42762, 46216, 49682, 52679, 55264, 57342, 58796, 60042, 61508, 62809, 63396, 63733, 64916, 67281, 70280, 73549, 77247, 81439, 85919, 90532, 95121, 99400, 103383, 107582, 112298, 117290, 122641, 129132, 137008, 145231, 152947, 160875, 170162, 180620, 191432, 202984, 216545, 232477, 250177, 269579, 291401, 315915, 342631, 371156, 401290, 432280, 463005, 492888, 521792, 549132, 573966, 595780, 614199, 628111, 636051, 637431, 632548, 621570, 604470, 581952, 555572, 526949, 497433, 468297, 440357, 413564, 387641, 362966, 340172, 319282, 299997, 282499, 267111, 253544, 241346]
57249B41346j0595q567o913o080n478m675l984l388k208m46Q48J148J152J408
57235A93568J581J606K086K919L076K459K442L709N109N512N371N478N598N365
57221B45879N249N658O205O724P769R353J0568J1214J2295J4066J5245J5218J5327
57208C80770J6717J8474J9254J9394J9858K0472K0723K1216K2735K4728K6169
57197F10510K7104K8113K9059K9557K9878L0158K9602K7652K5150K3204K1662
57186I11649J9834J7944J6814J6638J7081J7938J8993J9881K0729K2115K3841
57175A123457K4816K4709K4520K4943K5438K5674K6349K7652K8421K7940K7252
57164A411171K7559K8563K9532L0584L1800L2410L2189L2330L3651L5177L5831
$$ y = [241346, 230751, 222184, 215271, 209191, 203713, 199038, 195054, 191666, 189458, 189012, 189860, 191008, 192160, 193568, 195149, 196755, 198841, 201760, 204836, 207295, 209737, 213446, 218555, 224067, 229438, 234916, 240514, 245879, 251128, 256786, 262991, 269715, 277484, 286837, 297405, 308619, 320914, 334980, 350225, 365443, 380770, 397487, 415961, 435215, 454609, 474467, 494939, 515662, 536878, 559613, 584341, 610510, 637614, 665727, 694786, 724343, 754221, 784379, 813981, 841633, 866783, 889987, 911649, 931483, 949427, 966241, 982879, 999960, 1017898, 1036891, 1056772, 1077501, 1099616, 1123457, 1148273, 1172982, 1197502, 1222445, 1247883, 1273557, 1299906, 1327558, 1355979, 1383919, 1411171, 1438730, 1467293, 1496825, 1527409, 1559209, 1591619, 1623808, 1656138, 1689789, 1724966, 1760797]
57153A760797L6265L7522L9182M0185M0508M0593M0296L9748M0075M1764M3477
57142B200412M3973M4042M4963M6227M6618M6510M7170M8588M9797N0725N1998
57131B721023N3399N4235N4750N5660N6715N7132N7043N7134N7251N6763N5901
57120C337006N5403N5193N4741N4572N6161O0388O6992P5393Q5306R6713J09920
57109D107788J25438J43405J63517J85920K11733K42560K80221L27208L86588
57100F174378M61219N53874O68208Q08790R80136J186440J431797J719184K048934
57091A6032960K418181K820114L242272L666616M071786M433160M722794M921166
57083D6329049N037684N108095N147645N098500M839848M269255L379849K261535
$$ y = [1760797, 1797062, 1834584, 1873766, 1913951, 1954459, 1995052, 2035348, 2075096, 2115171, 2156935, 2200412, 2244385, 2288427, 2333390, 2379617, 2426235, 2472745, 2519915, 2568503, 2618300, 2669025, 2721023, 2774422, 2828657, 2883407, 2939067, 2995782, 3052914, 3109957, 3167091, 3224342, 3281105, 3337006, 3392409, 3447602, 3502343, 3556915, 3613076, 3673464, 3740456, 3815849, 3901155, 3997868, 4107788, 4233226, 4376631, 4540148, 4726068, 4937801, 5180361, 5460582, 5787790, 6174378, 6635597, 7189471, 7857679, 8666469, 9646605, 10833045, 12264842, 13984026, 16032960, 18451141, 21271255, 24513527, 28180143, 32251929, 36685089, 41407883, 46329049, 51366733, 56474828, 61622473, 66720973, 71560821, 75830076, 79209925, 81471460]
57075H1471460J040522j74563j306111k301244l129203l779426m253739m559904
57067F3007792m711701m728990m633846m448286m195600l899376l579190l249598
57059B9561205k923396k612183k322905k057311j815928j600001j409313j241549
57051A3578619j094856r68422q60119p66483o85602o17405n60799n13250m73249
57042G038434m40210m11772l84411l57072l31224l07099k83094k59190k37463
57033D026899k18581k01023j84297j69626j56827j44034j31233j20559j12213
57024B588506j03669r4035q5557p9429p3640o6680o0065n5260n1104m6099m0515
57013A832453l4621k7515j9157j0790k003R668K5006M2274O1427Q5359J15407
$$ y = [81471460, 82511982, 82337419, 81031308, 78730064, 75600861, 71821435, 67567696, 63007792, 58296091, 53567101, 48933255, 44484969, 40289369, 36389993, 32810803, 29561205, 26637809, 24025626, 21702721, 19645410, 17829482, 16229481, 14820168, 13578619, 12483763, 11515341, 10655222, 9888739, 9203137, 8585732, 8024933, 7511683, 7038434, 6598224, 6186452, 5802041, 5444969, 5113745, 4806646, 4523552, 4264362, 4026899, 3808318, 3607295, 3422998, 3253372, 3096545, 2952511, 2821278, 2700719, 2588506, 2484837, 2390802, 2305245, 2225816, 2152176, 2085496, 2025431, 1970171, 1919067, 1872968, 1832453, 1797832, 1770317, 1751160, 1740370, 1738367, 1748035, 1773041, 1815315, 1876742, 1962101, 2077508]
57002B077508J49520J85827K21202K42090K24182J51658L7644q0573j68413k14252
56992B826393k26407k18305j99524j75758j50901j27621j07144q9210p2770n7504
56982A401249m4695l6121l2425l3056l6957m2425m7100m9403m9609m8621m6359
56971I34478m2269l6727l0765k4933j9347j4306r870n416n25M208Q170J1846J6059
56958G90603K0739K5247K9211L1846L1069K4733J2941j435j4599k3916k8780l0128
56946H67531k9201k6657k2953j9099j6084j3670j0731o953l135L28M157Q982J4448
56933G46963J9982K5575L1351L6802M0432L9640L1639J6115l049k0036l1415l7346
56921H96653l9284l8306l5641l2652k9602k5880k1788j8586j6555j4659j2493
$$ y = [2077508, 2227028, 2412855, 2634057, 2876147, 3100329, 3251987, 3289631, 3209058, 3040645, 2826393, 2599986, 2381681, 2182157, 2006399, 1855498, 1727877, 1620733, 1531523, 1458753, 1401249, 1356554, 1320433, 1288008, 1254952, 1217995, 1175570, 1128470, 1079067, 1029458, 980837, 934478, 892209, 855482, 824717, 799784, 780437, 766131, 756261, 750845, 750320, 754528, 762698, 774544, 790603, 811342, 836589, 865800, 897646, 928715, 953448, 966389, 964954, 950355, 926439, 897659, 867531, 838330, 811673, 788720, 769621, 753537, 739867, 729136, 722183, 719048, 719376, 723533, 732515, 746963, 766945, 792520, 823871, 860673, 901105, 940745, 972384, 988499, 985450, 965414, 933999, 896653, 857369, 819063, 783422, 750770, 721168, 695288, 673500, 654914, 638359, 623700, 611207]
56910F11207j0891j0208r650q725p781o770n097l063j759j256n86L29O27N56J417
56895E48350L196M447M950O153Q453J0525J2060J4642J8924K3282K6167K7411
56883G08560K6337K1244J2164J727p895j6501k3314k5975k3895j9868j6359j2684
56871F23541p858l431r17J316N654J1614J7255K2704K9485L7627M6119N5074O4706
56858I02889P2561P4074O5828M7338K0922q298l3535m9856n6734n6525n1691m4407
56846H82566l6808k9597k1627j2304l024N276J4053K4827L6681M8212O0217P4173
56834A042645Q9517J04394J16961J23118J15100Q6839M1298r995n4779q6092j02455
56823A466551j06041j01286r2612q2207p0553n8437m6904l5862k4649j3581l270
$$ y = [611207, 600316, 590108, 580458, 571733, 563952, 557182, 552085, 549022, 547263, 546007, 545421, 545750, 546377, 546933, 548350, 551546, 555993, 560943, 567096, 575549, 586074, 598134, 612776, 631700, 654982, 681149, 708560, 734897, 756141, 768305, 770032, 762137, 745636, 722322, 696347, 672452, 652584, 636225, 623541, 615683, 612252, 611335, 612651, 618305, 629919, 647174, 669878, 699363, 736990, 783109, 838183, 902889, 975450, 1049524, 1115352, 1162690, 1183612, 1175314, 1141779, 1091923, 1035189, 978664, 926973, 882566, 845758, 816161, 794534, 782230, 779206, 784482, 798535, 823362, 860043, 908255, 968472, 1042645, 1132162, 1236556, 1353517, 1476635, 1591735, 1678574, 1719872, 1709877, 1655098, 1569006, 1466551, 1360510, 1259224, 1166612, 1084405, 1013852, 955415, 908511, 872649, 848000, 834419, 831149]
56812H31149O999J8445L0729M2517N3764O5583P7502Q5767Q4440O8390L7108k816
56800A399577m0402o7326q2173q7681q6196p9397o9960o0381n1028m1489l2665
56789G00879k5442j8620j0657k374M520J0538J7440K5163L2311L8637M3946M5222
56777H61563L8200K2234J291j9702l7271m8847n3152n1801m8244m4457m0244l5556
56765E44014l1194k7224k2877j8410j5140j3445j2327j1122r979q734p017n389
56753C61156m780m826m361l328k622k370j955j458j379j342p32j24m22j171j429
56738C28857j570k347k951k212r62q93j660j662j116j598k800k574n10J275J301
56723C08578M31j54m80p84q72r73j579k132j490J66J503K048K423K719K412J754
$$ y = [831149, 838148, 856593, 887322, 929839, 983603, 1049186, 1126688, 1212455, 1296895, 1365285, 1402393, 1399577, 1359175, 1291849, 1209676, 1121995, 1035799, 956402, 886442, 826061, 775033, 733544, 700879, 675437, 656817, 646160, 643786, 648306, 658844, 676284, 701447, 733758, 772395, 816341, 861563, 899763, 921997, 923288, 903586, 866315, 817468, 764316, 712515, 664271, 619814, 579570, 544014, 512820, 485596, 462719, 444309, 429169, 415724, 403397, 392275, 382296, 373562, 366545, 361156, 356376, 351550, 347189, 343861, 341239, 338869, 336914, 335456, 334077, 332735, 332003, 331879, 331457, 330286, 328857, 327287, 324940, 321989, 319777, 318815, 317922, 316262, 314600, 313484, 311886, 309086, 306512, 306002, 307277, 308578, 309009, 308855, 308375, 307591, 306719, 305746, 304167, 302035, 300545, 300711, 302214, 304262, 306685, 309404, 311816, 313570]
56707C13570J460J205K10r26r38j11J96l9L21J248J572J224J227J557J207L57
56691C23340L03J109J459R01J98m65j590k666k570j633j298j813k277k637l413
56676C06948l799k527l72P06P30J342K536K685J858K014L521M469L964L275L114
56661C30464K565J427Q74J037N86n59p90J23K70j143k493k677k812l806m677m607
56645C13782m351m430m083l138k793l451l826l255k752k837k515j470j034j806
56631B72041k444j984j237q17Q0J705K637J974P76J31l63j038j078j59N88M32
56615B71244J04N3m31j437j717q57j58l44l30N56J196O88j51n18q99j415r45Q01
56597B65440K213K167J707J978K322J831J096R12P71J5p45p19j79K71N83O49K03
$$ y = [313570, 315030, 316235, 316445, 315519, 314581, 314470, 314666, 314627, 314948, 316196, 317768, 318992, 320219, 321776, 322983, 323340, 323643, 324752, 326211, 327112, 327310, 326845, 325255, 322589, 320019, 318386, 317088, 315275, 312998, 310361, 306948, 303149, 300622, 300250, 300956, 301686, 303028, 305564, 308249, 310107, 312121, 315642, 320111, 324075, 327350, 330464, 333029, 334456, 335330, 336367, 336953, 336394, 335604, 335727, 335997, 334854, 332361, 329684, 326872, 323066, 318389, 313782, 309431, 305001, 300918, 297780, 294987, 291536, 287710, 284455, 281703, 278866, 276351, 274881, 273847, 272041, 269597, 267613, 266376, 265559, 265639, 267344, 269981, 271955, 272731, 272862, 272499, 271461, 270383, 270224, 270812, 271244, 271348, 271401, 270970, 269533, 267816, 266959, 266801, 266457, 266127, 266683, 267879, 268567, 268416, 267898, 266999, 265584, 264639, 265440, 267653, 269820, 271527, 273505, 275827, 277658, 278754, 279666, 280437, 280452, 279707, 278988, 278809, 279080, 279663, 280312, 280515]
56580B80515k11L15J263J161K13K21J509K297J802J431J964K240J785K053L579
56565C02137M508L661K705L449N099O019O205O315O110N547N596O356O282M767
56551C74756L588M098M940M370K890J776P91o98j979k238k188k712l292l254l204
56536C77644l786m455m714n045n515n205m122l753m570n077m554m363n163n313
56522C12009l786k239k220k638k067j383j845k583k271j517j395j331o11k36j103
56507B84784k006j552n00j69j97J64K48m58p56K01J023L94n22j45Q44J036P72
56490B83161Q70P14j37l48Q31J476j5j800j313N72J121J19l70L71J233J740K312
56473B90537K746K642K678L375L669K652J615K154L487L888L531L651M045L814
$$ y = [280515, 280304, 280619, 281882, 283043, 283256, 283477, 284986, 287283, 289085, 290516, 292480, 294720, 296505, 298558, 302137, 306645, 310306, 313011, 316460, 321559, 327578, 333783, 340098, 346208, 351755, 357351, 363707, 369989, 374756, 378344, 382442, 387382, 391752, 394642, 396418, 397209, 396511, 394532, 392294, 390106, 387394, 384102, 380848, 377644, 373858, 369403, 364689, 359644, 354129, 348924, 344802, 341049, 336479, 331402, 326848, 322485, 317322, 312009, 308223, 305984, 303764, 301126, 299059, 297676, 295831, 293248, 290977, 289460, 288065, 286734, 286123, 285887, 284784, 282778, 281226, 280726, 280557, 280360, 280524, 280772, 280314, 279558, 279759, 280782, 281176, 280654, 280509, 281353, 282389, 283161, 284031, 284745, 284608, 284260, 285091, 286567, 286552, 284752, 283439, 284011, 285132, 285251, 284881, 285252, 286485, 288225, 290537, 293283, 295925, 298603, 301978, 305647, 308299, 309914, 312068, 315555, 319443, 322974, 326625, 330670, 334484]
56459C34484L343L280K753J004m35J82J682J551k77j735j956j807j781j669j781
56444C36838k423k822k301j740k077k607k449k318k953l272k328j529k525m276
56430C01218m605l444k147r72M13J255J026J059K485L948L839L147L499L918K505
56415C17144o0j722k430l355l967l006j293n59m27M44J381R12n0M69J880J930
56399C07291N50m08n66j086j819j554o69o19j129p12M81J026R23J200J454N50
56383C04913q27j034l20j26k44O52K313L513M459N872O569N009K438J432J929
56368C36548J797O44l5N2j40m78N2R58J000P84J844L787N189O462Q849J1325J1651
56351C90289R902P934O134L669J173j3n89k099l865m200l718m133m810l989k381
$$ y = [334484, 337827, 341107, 343860, 344864, 344429, 344611, 346293, 347844, 347567, 345832, 343876, 342069, 340288, 338619, 336838, 334415, 331593, 329292, 327552, 325475, 322868, 320419, 318101, 315148, 311876, 309548, 308019, 305494, 301218, 296613, 293169, 291022, 290050, 290463, 291718, 292744, 293803, 296288, 300236, 304075, 307222, 310721, 314639, 317144, 317084, 315362, 312932, 309577, 305610, 302604, 301311, 300752, 300325, 300769, 302150, 303062, 303012, 303481, 305361, 307291, 307841, 307433, 306867, 305781, 303962, 302408, 301739, 301120, 299991, 299279, 299760, 300786, 301709, 302909, 304363, 304913, 304086, 303052, 302732, 302606, 302362, 303014, 305327, 308840, 313299, 319171, 325740, 330749, 333187, 334619, 336548, 338345, 338989, 338954, 339006, 338866, 338388, 338440, 339398, 340398, 341182, 343026, 346813, 352002, 358464, 367313, 378638, 390289, 400191, 408125, 414259, 417928, 419101, 419088, 418499, 416400, 412535, 408335, 404617, 400484, 395674, 391685, 389304]
56336C89304j903j810l0K599L491L032L866O048P127O777P024Q032P889O723O741
56321D54910P973Q031O460N444N788O040N877O604P933P979O876O751P834Q170
56307E52670P346O841O539M736J829K08J65l31j553j548o2Q77O86Q26J377Q12
56291E81418n34m72J208K588L418N265P860R207R471J0727J2783J3426J2894J3869
56277F83128J6751J9231K0766K3071K6033K7651K8444L1173L5792L9373M1625
56266I93038M5526N1842N7937O3033O9662P8734Q8039R6816J07097J19202J30589
56255A901515J40480J50912J61979J70720J76045J79937J82430J80317J72392
56246C416727J61150J47639J29544J06111Q0263N4094K7045J55k2982m1390n7936
$$ y = [389304, 387401, 385591, 385561, 388160, 391651, 394683, 398549, 404597, 411724, 418501, 425525, 433557, 441446, 448169, 454910, 462883, 470914, 477374, 482818, 488606, 494646, 500523, 507127, 515060, 523039, 529915, 536666, 544500, 552670, 560016, 566857, 573396, 578132, 579961, 580169, 580334, 580003, 578450, 576902, 576840, 577717, 578403, 579229, 580606, 581418, 580884, 580412, 581620, 584208, 587626, 592891, 600751, 609958, 619429, 630156, 642939, 656365, 669259, 683128, 699879, 719110, 739876, 762947, 788980, 816631, 845075, 876248, 912040, 951413, 993038, 1038564, 1090406, 1148343, 1211376, 1281038, 1359772, 1447811, 1544627, 1651724, 1770926, 1901515, 2041995, 2192907, 2354886, 2525606, 2701651, 2881588, 3064018, 3244335, 3416727, 3577877, 3725516, 3855060, 3961171, 4041434, 4095528, 4122573, 4122728, 4099746, 4058356, 4000420]
56235D000420p3385q4375q9469r2138r5224r7287r7022r6496r7222r7589r6897
56224B983316r7601j00798j03848j05034j06264j08568j09357j06977j03735j01630
56214A939504r9157r5058r1070q8140q3927p6913o9243o2922n6938n0539m5463
56203A120134m2445l9366l5133l1569k9475k6934k3397k1113k0510j8845j5455
56192H15892j3391j3629j2835r499p020p705q728p314n139m263l345j213K60N2
56178G22123M84K843M880N433O832R957J1711J0508R385J0585J1934J1725J2174
56165H30574J4714J6788J6632J6318J6907J5728J1797Q625Q253P815N416L886
56153I73453N003N766M290L704O158Q692R311J1322J7195K3839K8712L4830M4907
$$ y = [4000420, 3927035, 3842660, 3753191, 3661053, 3565829, 3468542, 3371520, 3275024, 3177802, 3080213, 2983316, 2885715, 2784917, 2681069, 2576035, 2469771, 2361203, 2251846, 2144869, 2041134, 1939504, 1840347, 1745289, 1654219, 1566079, 1482152, 1405239, 1335996, 1273074, 1216136, 1165597, 1120134, 1077689, 1038323, 1003190, 971621, 942146, 915212, 891815, 870702, 850192, 831347, 815892, 802501, 788872, 776037, 766538, 759518, 751813, 743085, 735771, 730632, 726369, 723024, 721811, 722071, 722123, 722607, 725450, 730330, 735763, 742595, 752552, 764263, 774771, 784156, 794741, 806675, 818400, 830574, 845288, 862076, 878708, 895026, 911933, 927661, 939458, 948083, 956336, 964151, 969567, 973453, 978456, 984222, 988512, 992216, 998374, 1007066, 1016377, 1027699, 1044894, 1068733, 1097445, 1132275, 1177182]
56140A177182N6173O6074P7451R2852J09102J22817J35763J49259J58557J58544
56130B303774J50358J37340J19764R9008Q1438P1937O7825O4069N9547N3422M1505
56119C249987K2325J785j3950k5312l4439l9839m1861m7170o0988q0006r8725
56108B831807j16842j34220j45255j45720j39589j32032j21331j04959q7508p4597
56098A629754o4210n1930l9683l1515k5778j9313j4422j3990j4607j2269r878
56087A332159j1458j4108j3491j2038j3555j5098j2494q628p917p769m102P6K25
56074A211802q35J602N111N378N025Q151J1533J0577Q649J0997J4801J4837J3523
56061A321151J5561J8145J6580J4135J6016J9045J7713J4975J6384J9155J7919
$$ y = [1177182, 1233355, 1299429, 1376880, 1469732, 1578834, 1701651, 1837414, 1986673, 2145230, 2303774, 2454132, 2591472, 2711236, 2810244, 2891682, 2963619, 3031444, 3095513, 3155060, 3208482, 3249987, 3272312, 3274097, 3260147, 3234835, 3200396, 3160557, 3118696, 3071526, 3010538, 2930532, 2831807, 2714965, 2580745, 2435490, 2289770, 2150181, 2018149, 1896818, 1791859, 1704351, 1629754, 1565544, 1513614, 1473931, 1442416, 1416638, 1397325, 1382903, 1368913, 1354306, 1342037, 1332159, 1320701, 1306593, 1293102, 1281064, 1267509, 1252411, 1239917, 1231289, 1223372, 1215603, 1211501, 1211577, 1211802, 1210967, 1212569, 1217680, 1223058, 1228083, 1236234, 1247767, 1258344, 1266993, 1277990, 1292791, 1307628, 1321151, 1336712, 1354857, 1371437, 1385572, 1401588, 1420633, 1438346, 1453321, 1469705, 1488860, 1506779]
56050A506779J5704J8010K1633K0688J8198K0099K3526K2704K0673K3118K6598
56039A737730K5257K3044K6448L1453L0967K8787L2297L7724L7138L4016L6765
56028B081626M2632M3457M1741M5341N1629N2843N1815N6236O2715O2964O0432
56017B653431O4006P0661P1604O9974P4658Q2151Q2936Q0360Q4399R2128R3711
56006C520019R2078R6997J05291J07377J07480J16178J28906J33774J34588J43413
55996D686101J56653J62303J64530J76077J92689K00996K05426K20187K41042
55987F406004K53274K61451K81527L09717L30185L47201L77180M15129M43318
55978I424986M67009N05702N55282N96744O36086O95539P71709Q44712R21889
$$ y = [1506779, 1522483, 1540493, 1562126, 1582814, 1601012, 1621111, 1644637, 1667341, 1688014, 1711132, 1737730, 1762987, 1786031, 1812479, 1843932, 1874899, 1903686, 1935983, 1973707, 2010845, 2044861, 2081626, 2124258, 2167715, 2209456, 2254797, 2306426, 2359269, 2411084, 2467320, 2530035, 2592999, 2653431, 2717437, 2788098, 2859702, 2929676, 3004334, 3086485, 3169421, 3249781, 3334180, 3426308, 3520019, 3612097, 3709094, 3814385, 3921762, 4029242, 4145420, 4274326, 4408100, 4542688, 4686101, 4842754, 5005057, 5169587, 5345664, 5538353, 5739349, 5944775, 6164962, 6406004, 6659278, 6920729, 7202256, 7511973, 7842158, 8189359, 8566539, 8981668, 9424986, 9891995, 10397697, 10952979, 11549723, 12185809, 12881348, 13653057, 14497769, 15419658]
55969A5419658J027518J156735J288115J433762J624696J855941K104122K390328
55961B8300875K762618L227362L769430M429976N285651O365071P679439R322459
55953G1142881J1428121J4035004J7111791K0699534K4874645K9582712L4660893
55946B23535581L9852647M4256832M5596835M0769677K8134224R579516j0042089
55939D21683223k5870245l5596522l9621212l9561439l7008517l3201794k9040198
55932A81783296k5035203k1372995j8124832j5348164j3026532j1067045r402532
55925F8405993q019183o880704n912914n075543m375931l802320l309214k875727
55917B8154457k516717k227776j974512j743458j552048j400769j263091j129746
$$ y = [15419658, 16447176, 17603911, 18892026, 20325788, 21950484, 23806425, 25910547, 28300875, 31063493, 34290855, 38060285, 42490261, 47775912, 54140983, 61820422, 71142881, 82571002, 96606006, 113717797, 134417331, 159291976, 188874688, 223535581, 263388228, 307645060, 353241895, 394011572, 422145796, 431725312, 421683223, 395812978, 360216456, 320595244, 281033805, 244025288, 210823494, 181783296, 156748093, 135375098, 117250266, 101902102, 88875570, 77808525, 68405993, 60386810, 53506106, 47593192, 42517649, 38141718, 34339398, 31030184, 28154457, 25637740, 23409964, 21435452, 19691994, 18139946, 16739177, 15476086, 14346340]
55909A4346340j018373r32267q50921p68102p00105o49500n97532n39177m90957
55900G799406m57411m22729l82046l49579l29095l06233k76766k54219k42644
55891D778684k28735k07509j90454j81765j70737j53966j41991j37889j31264
55882C234374j19106j11310j10213j05411r4048q6194q5064q1417p2570o7672
55872B301369o9053o6987n8316n2231n2413n0888m4800m2142m5341m5694l9632
55861A733872l4777l4479l1608k3159j6488j5855j6658j7500k3898l5329m2466
55850A441655m2004m1138m3194m2371l6822l3307l4128l2620k6346k1874k1771
55839A066080j9733j3478r773j1385j1540o759l256m944o656n053n093r702j3600
$$ y = [14346340, 13327967, 12395700, 11544779, 10776677, 10076572, 9427072, 8829540, 8290363, 7799406, 7341995, 6919266, 6537220, 6187641, 5858546, 5552313, 5275547, 5021328, 4778684, 4549949, 4342440, 4151986, 3970221, 3799484, 3645518, 3503527, 3365638, 3234374, 3115268, 3003958, 2893745, 2788334, 2694286, 2608092, 2523028, 2441611, 2369041, 2301369, 2232316, 2165329, 2107013, 2054782, 2002369, 1951481, 1906681, 1864539, 1819198, 1773504, 1733872, 1699095, 1664616, 1633008, 1609849, 1593361, 1577506, 1560848, 1543348, 1519450, 1484121, 1441655, 1399651, 1358513, 1315319, 1272948, 1236126, 1202819, 1168691, 1136071, 1109725, 1087851, 1066080, 1046347, 1032869, 1023096, 1011711, 1000171, 993412, 990156, 985212, 978556, 973503, 968410, 958708, 945108]
55826I45108j3282j3205j6402j8633j7335j6963k0126k2395k1061k0181k2119
55815G43406k2807k0119j8212j9029j8171j3697j0316j0368r380n145k416l790
55803E89956m447j057K395K670L104O213Q273O407L821L035J086l791p784q392
55789F01489q858j1308j2415j0313q737r884j0117p242m995n735n606j839J781
55776E06221J473q54l001o951j3213j7223j6254j4008j3813j3392j0824r219j0603
55763C78339j1317q643o035o730p932o498m758n495o448n093l732m744n719m386
55749B90809l437n358p325o309m617n258o292m935l053l379m305l354k073k596
55735B28518l100j352Q17J086J062K648L754K009o20j433j731l646n551n057l543
$$ y = [945108, 931826, 918621, 902219, 883586, 866251, 849288, 829162, 806767, 785706, 765525, 743406, 720599, 700480, 682268, 663239, 645068, 631371, 621055, 610687, 601307, 596162, 593746, 589956, 585509, 584452, 586847, 589517, 592621, 598834, 607107, 613514, 617335, 620370, 621456, 617665, 609881, 601489, 592631, 581323, 568908, 558595, 549858, 539974, 529857, 522615, 517620, 511885, 506279, 504440, 506221, 507694, 506840, 503839, 496888, 483675, 466452, 450198, 436190, 422377, 408985, 398161, 388942, 378339, 367022, 358379, 352344, 345614, 337682, 331184, 326426, 320931, 314483, 309390, 305658, 300914, 295195, 290809, 287372, 282014, 274689, 268380, 263763, 258505, 252213, 247278, 244225, 240846, 236541, 233187, 231114, 228518, 225418, 224066, 224883, 225969, 227031, 229679, 233433, 235442, 234822, 233389, 231658, 228012, 222461, 217404, 213861]
55720B13861l467m093l743l342m039m297k911j831k525k849r75J034J049P68K260
55705A84900M107M514M806O167O515M307J905J449R95j449l705l263j820j840
55691B07588j996k32J907K252K240L975O048O397O349P669Q473O377L044J472
55677B61563J259M48n29o61j401l909n874n000l081k748k901j345O86Q47M4M05
55661B37803J251J048R39K330L355J961Q0O62K702L429L173L811M493L287J280
55646B71604P53R53k71k313l209l523m922o553o702o339p203q146p313o145p102
55631B03569r053r110p564o882p190o845o217o758p499o427m411l820m286l609
55617A13898j976j472k176k346j780j594j535p32j79j116k161j281N11Q54J64
$$ y = [213861, 210394, 206301, 202558, 199216, 195177, 190880, 187969, 186138, 183613, 180764, 179789, 180823, 181872, 182640, 184900, 189007, 193521, 198327, 204494, 211009, 215316, 217221, 218670, 219665, 218216, 214511, 211248, 209428, 207588, 205592, 205360, 207267, 209519, 211759, 215734, 221782, 228179, 234528, 242197, 250670, 257047, 260091, 261563, 262822, 263270, 262741, 262080, 260679, 256770, 250896, 245896, 242815, 240067, 237166, 235821, 236507, 237354, 237398, 237803, 239054, 240102, 241041, 243371, 246726, 248687, 248767, 249429, 252131, 255560, 258733, 262544, 267037, 270324, 271604, 272357, 273310, 273039, 270726, 267517, 263994, 259072, 252519, 245817, 239478, 232275, 224129, 216816, 210671, 203569, 194516, 185406, 177842, 170960, 163770, 156925, 150708, 143950, 136451, 130024, 125613, 121793, 117507, 113898, 111922, 110450, 108274, 105928, 104148, 102554, 101019, 100287, 100108, 98992, 96831, 95550, 96061, 96915, 97079]
55602I7079N09J500J083n48j410j396j914k632k021n08J27j43j19j34j164k145
55586H6164j415J13L50l58k26M64J40p97q93p62j920l416l178j715j106j166k91
55569F9988Q64L56j133j140L28J111R34J372K203J615o9o31J27K76m22j86J110
55552G6703J463K87p49q83j234k282l136l617m401n053m491l323l065l249k071
55537D0899L51K208L306N159P925J0142J1444J2661J3247J1605Q102N035L397
55524A35481K225J120P40Q32L28n59p38n27j003j548o79J064J772J333J135J108
55508A42084o1k063l354m003n183o209n364l385k848m053m845m490m405m859m401
55493H2561k988k402l044l384k981l005l384k546n94M10r3l32N06J099P79O48
$$ y = [97079, 97588, 99088, 100171, 99623, 98213, 96817, 94903, 92271, 90250, 89742, 89869, 89726, 89607, 89473, 88309, 86164, 84749, 84862, 85212, 84854, 84628, 85092, 85232, 84435, 83542, 82780, 80860, 77444, 74266, 72551, 71445, 70279, 69988, 70852, 71208, 70075, 68935, 69263, 70374, 71308, 72680, 74883, 76498, 76429, 75798, 75925, 76201, 75779, 75593, 76703, 78166, 78453, 77704, 76821, 75587, 73305, 70169, 66552, 62151, 57098, 52607, 49284, 46219, 42970, 40899, 41250, 43458, 46764, 51923, 59848, 69990, 81434, 94095, 107342, 118947, 127049, 132084, 135481, 137706, 138826, 139566, 140398, 140726, 140167, 139429, 138902, 137899, 136351, 135672, 136736, 138508, 139841, 140976, 142084, 142023, 139960, 136606, 132603, 127420, 121211, 115847, 112462, 109614, 105561, 100716, 96226, 91821, 86962, 82561, 79573, 77171, 74127, 70743, 67762, 64757, 61373, 58827, 58233, 58643, 58550, 58218, 58724, 59823, 60602, 61250]
55477F1250J151J280Q42Q55J141K73j497k074r58J5k7K52J516K486K436K288K349
55460G3578J596J10m79J18R1j312k503k396j962j959j544m30P2o15j185p92m49
55443E9939r58j465j229q85r49q58m26m09q54o74L95J247J334J322J397R58L64
55426E8249P54J744J575P8r20o95n81j216j459q72p02j301j167K21J083K34r65
55409E4060r48k27J43M50J222J881J816J414J045L90m64q03o89r66j439r52L01
55392E6234O38l31j039o88m36r79j223l85O48R92R52O91k08j208r87J56L12r07
55374E2232j655j081o66j286j628q21q5k66k33O83J069K5q49p7J135R35k62r00
55356D6270p87o64n65k75k50p06r26o04n41j033j138n21l18r56j031L45J795J764
$$ y = [61250, 62401, 63681, 64523, 65378, 66519, 66792, 65295, 63221, 62263, 62278, 62251, 62503, 64019, 66505, 68941, 71229, 73578, 75174, 75284, 74805, 74923, 75014, 73702, 71199, 68803, 66841, 64882, 63338, 62908, 62980, 62365, 61180, 60388, 59939, 58981, 57516, 56287, 55402, 54453, 53595, 53169, 52760, 51906, 51232, 51627, 52874, 54208, 55530, 56927, 57885, 58249, 59003, 60747, 62322, 62400, 61480, 60785, 60204, 58988, 57529, 56657, 55955, 54654, 53487, 53708, 54791, 55025, 54060, 53112, 52885, 53028, 53478, 54700, 56581, 58397, 59811, 60856, 61246, 60782, 59979, 59290, 58324, 56885, 55933, 56234, 56872, 56541, 55502, 54814, 54378, 53399, 52176, 51791, 52439, 53431, 54383, 55074, 54866, 53658, 52671, 52827, 53139, 52232, 50577, 49496, 48830, 47544, 45916, 45095, 45010, 44744, 44511, 45194, 46263, 46288, 45439, 45362, 46497, 47432, 47170, 46270, 45483, 44819, 44254, 43979, 43729, 43023, 42097, 41493, 40952, 39919, 38781, 38260, 37942, 36986, 35955, 36300, 38095, 39859]
55338C9859Q18L77N29M93L0p32j678k082j093N15Q16l40r15mP75K82k42K36N02
55319C8146n47j626j188M5O08O43Q61P63j03o28J96J408J630J174R54P40J01k62
55301D2915K04O58M40M30J235J636O15o53o69QQ1j76P4L17k08p18k05N69L25n26
55281D6352q37q02j175j444p21M09P56M31J87j33q24r83J89J635J828J082P53
55264D6703R04N95k12p58r26j080j047o15k86l37JJ081J755J092M2r4L05L11L07
55245D7741R51J439P52l33m33J03j00j130j899j838r96O15K278K347M55j274j018
55228D7660L6j58j114j004j08j99j176j146L10J560J680J436J363R84K59l2K72
55211E0623M33J80N5L32Q06J424K006J798N23o74o61k2J25J08P74J435Q11n54
$$ y = [39859, 40677, 41054, 41583, 42076, 42106, 41374, 39696, 37614, 36521, 37036, 37852, 37512, 36597, 36593, 37368, 37650, 37408, 37644, 38146, 37599, 35973, 34785, 34830, 35438, 36081, 36942, 37705, 37602, 36974, 37170, 38578, 40208, 41382, 42336, 43076, 43177, 42915, 43119, 43777, 44217, 44647, 45882, 47518, 48133, 47480, 46811, 46819, 46900, 46724, 46798, 47115, 46907, 46189, 45984, 46553, 46878, 46352, 45515, 44713, 43538, 42094, 41373, 41782, 42538, 42969, 43156, 43023, 42199, 41216, 41405, 43040, 44868, 45950, 46703, 47607, 48202, 47990, 47232, 46306, 45226, 44179, 43564, 43278, 42941, 42942, 44023, 45778, 46870, 46912, 46818, 47123, 47434, 47741, 48692, 50131, 50883, 50550, 50117, 50220, 50120, 48990, 47091, 45253, 44257, 44872, 47150, 49497, 49952, 48678, 47660, 47696, 47538, 46424, 45420, 45312, 45113, 43937, 42791, 43101, 44661, 46341, 47777, 49140, 50124, 50383, 50351, 50623, 51056, 51236, 51291, 51623, 52429, 53853, 55859, 57657, 58180, 57506, 56845, 56823, 56948, 57056, 57830, 59265, 60076, 59522]
55193E9522r48k24K69J60L60Q69M80j008k195k135j427q73n08k40k31l22j28J84
55175E1605K10J59L69L83k75r11n64K83M01j80l81m4L2k17J6P36R08P6j052j722
55155D9832j842j556j111r79j167q99R9P09Q0o75p4J205J289J70k73P06J664J273
55137D8451Qr15r56k78O53J158Q92K40l10q05j137o01Q32J757J152J15K21J075
55119E1552J192N74M56J091J660J991K467K598J607J40m35j33L7Q1O97J311O98
55102F7584o85j139l98K13K53N34J035P55j74l89L02O07J18j14K55K58l01l14
55084F8400N48J199J162J223J545J247M92P00J905K137N84q50n07M77K47q75j329
55067G8305q63l44J1O00J197J125L80l99q30r31p69m91l21j88J19L15j01q65j096
$$ y = [59522, 58574, 58350, 58619, 58779, 59139, 60008, 60488, 59480, 57285, 55150, 53723, 52850, 52342, 52102, 51871, 51549, 51421, 51605, 51815, 51974, 52343, 52726, 52451, 51540, 50976, 51259, 51660, 51480, 51099, 51055, 51087, 50870, 50886, 51622, 52530, 52606, 51554, 49832, 47990, 46434, 45323, 44344, 43177, 42278, 42377, 43086, 43166, 42491, 42417, 43622, 44911, 45081, 44808, 45514, 47178, 48451, 48459, 47544, 46588, 46310, 46963, 48121, 49013, 49253, 48943, 48138, 47001, 46400, 47232, 48989, 50141, 50256, 50477, 51552, 52744, 53318, 53774, 54865, 56525, 58516, 60983, 63581, 65188, 65328, 64893, 64760, 64797, 64878, 65575, 66886, 67584, 66899, 65760, 65362, 65575, 65828, 66362, 67397, 68152, 67978, 67589, 67891, 68498, 68616, 68502, 68757, 69015, 68714, 68400, 68948, 70147, 71309, 72532, 74077, 75324, 75816, 76516, 78421, 80558, 81142, 80292, 79785, 80262, 80509, 79634, 78305, 77442, 77098, 77109, 77709, 78906, 80031, 80411, 80012, 79182, 78251, 77482, 76991, 76670, 76482, 76601, 76916, 76815, 75950, 74854]
55048G4854n52R9L93M11P0p64j410r54J91O46J82nN95J025O64K85N00O41J9q49
55028G6041j169r83o42j54K90J05o69j113p61l02l63n30j64N82J155J273Q60J04
55010G3560k27N59J849K184J226J94J2J81n0m76n07m3O39J156R49j95j431j692
54992G7888j231j193j662j543n85J02p3k30L47J074J227J016Q20M80l8k45L7M22
54974G6613Q07J466K092J954J261R90J179Q60ok32N29J200J308J720K581K474
54958I6796Q37n87j17J570K897L750M865O009O434O376O682P529Q649J0111J1853
54943A73654J3127J3413J3137J2554J0828P306K893r91m187p357j0419j2593j3571
54930A97794j3665j3047j1731j0082q645p668p156o940o456n120l298k106j835
$$ y = [74854, 74302, 74401, 74794, 75205, 75275, 74511, 73101, 72147, 72338, 72984, 73166, 73161, 73756, 74781, 75445, 75730, 76230, 76871, 76890, 76041, 74872, 73889, 73247, 73093, 73383, 73488, 72819, 71706, 70945, 70643, 70280, 69750, 69586, 70168, 71323, 72596, 73456, 73560, 73333, 73892, 75741, 77925, 79151, 79345, 79357, 79538, 79488, 79012, 78505, 78462, 79101, 80257, 81206, 81011, 79580, 77888, 76657, 75464, 73802, 72259, 71674, 71776, 71703, 71473, 71820, 72894, 74121, 75137, 75957, 76437, 76399, 76154, 76191, 76613, 77420, 78886, 80978, 82932, 84193, 85183, 86362, 87222, 87216, 86984, 87513, 88713, 90021, 91741, 94322, 96796, 97633, 97046, 96929, 98499, 101396, 105146, 110011, 116020, 122454, 128830, 135512, 143041, 151690, 161801, 173654, 186781, 200194, 213331, 225885, 236713, 244019, 246912, 245921, 241734, 234377, 223958, 211365, 197794, 184129, 171082, 159351, 149269, 140624, 132956, 125800, 118860, 112404, 107284, 103986, 101880, 100045]
54917A00045j522m95N84P92K47l42n68k25Q43K268L362M211N599P505Q875R379
54901A40558J0135J1901J3774J4457J3782J2095R367N697J742k195o416j0456
54889B14441j2820j2984j2402j2489j2783j2202j0884r526q010o018m121k982
54877I7220k305j710j692k497l040k337j146q31j263j352r38o40l51N78J848K260
54861H1804J315k16j228j179l58J78n32k004k633j806p76o61q83n77k91q44j573
54844F7736j308l47J30NK8J60k79j026j038j21Q01J121J065Q64M66M1p8R0L66
54825F8676Q42J447J598J005L37K85N30N26N82J100J468Q80j67n33j83p7m75o26
54807G7215mJ089K158K912L141K929K796L047L329L345L492M141M988N809P156
$$ y = [100045, 98523, 98028, 98612, 99404, 99651, 99309, 98741, 98516, 99359, 101627, 104989, 109200, 114799, 122304, 131179, 140558, 150693, 162594, 176368, 190825, 204607, 216702, 226069, 231766, 233508, 231313, 224897, 214441, 201621, 188637, 176235, 163746, 150963, 138761, 127877, 118351, 110341, 104323, 100202, 97220, 94915, 93205, 91513, 89016, 85976, 83639, 82493, 81662, 80399, 79047, 78109, 77469, 77118, 77696, 79544, 81804, 83119, 82903, 81675, 80496, 80138, 80316, 79784, 77780, 75147, 73341, 72565, 71904, 71021, 70444, 70153, 69309, 67736, 66428, 66081, 66211, 66216, 66244, 66404, 66125, 65099, 64061, 63940, 64741, 65862, 66927, 67791, 68257, 68298, 68220, 68310, 68676, 69518, 70965, 72563, 73568, 73905, 74190, 74720, 75246, 75828, 76928, 78396, 79276, 79109, 78576, 78393, 78316, 77841, 77215, 77211, 78300, 80458, 83370, 86511, 89440, 92236, 95283, 98612, 101957, 105449, 109590, 114578, 120387, 127543]
54792A27543R362J1575J2760J3100J3463J3995J4157J3480J1539P959L329p58
54780B51504l541o042r053j1330j1260r357p510o485n770n237n197n227m623l737
54766A57135l336l025j918m36K51K92Q97K192L106L397M039N413O725P501Q222
54751A90455R227J0358J1891J4483J7840K0659K2163K2582K2014K0025J6570J2121
54739C90388O708Pp352j3700j7912k0182k1090k0936k0087j8998j7667j5914j4244
54726B09021j3415j3080j1975r655p072n254m300l884l840l950l886l546l028
54713A22136k337j666j567k125k440j816r49q61j225r98l19k30p91r62l46L10
54697A03814M78L92K17j02j52N28J295J045k7n99k43J78K39N95J507K063J454
$$ y = [127543, 136905, 148480, 161240, 174340, 187803, 201798, 215955, 229435, 240974, 248933, 252262, 251504, 247963, 241921, 232868, 221538, 210278, 200921, 193411, 186926, 181156, 175919, 170722, 165495, 160872, 157135, 153799, 150774, 148856, 148420, 148671, 148963, 149860, 152052, 155158, 158555, 162594, 168007, 174732, 182233, 190455, 199682, 210040, 221931, 236414, 254254, 274913, 297076, 319658, 341672, 361697, 378267, 390388, 397096, 397103, 389751, 376051, 358139, 337957, 316867, 295931, 275844, 256846, 239179, 223265, 209021, 195606, 182526, 170551, 160896, 153824, 148570, 144270, 140386, 136546, 132596, 128710, 125164, 122136, 119799, 118133, 116566, 114441, 112001, 110185, 109236, 108375, 107150, 106152, 105833, 105603, 104812, 103850, 103504, 103814, 104292, 104684, 104901, 104799, 104647, 105175, 106470, 107515, 107488, 106889, 106646, 106824, 107063, 107658, 109165, 111228, 112682]
54680A12682P1j089j309m06J064J888J462P56J032J964K309K077K363L252L650
54665A31766L259K983L184L224K956K965L071K387J228J133K443L649L761L548
54651A71557L676L514K739K427L378M805N832O866Q364R661J0275J1155J3255
54638B57504J5933J8066J9766K1589K2893K2408J9925J6225J1727O289O9o350
54626D26044j2415j7602k1251k2981k2946k1456j8936j6363j4792j4096j3102
54615B30104j1357r680q571p428n948m958m895m763l688k382j878j905j809k009
54601A58833l049m001l481j864r45j532k712l425l539l319k895k484k337k355
54587A20895k278k196k331k526k470k292k307k372k098j526j042q20p59q51j128
$$ y = [112682, 112753, 111664, 110355, 109949, 111013, 112901, 114363, 115119, 116151, 118115, 120424, 122501, 124864, 128116, 131766, 135025, 138008, 141192, 144416, 147372, 150337, 153408, 155795, 157023, 158156, 160599, 164248, 168009, 171557, 175233, 178747, 181486, 183913, 187291, 192096, 197928, 204794, 213158, 222819, 233094, 244249, 257504, 273437, 291503, 311269, 332858, 355751, 378159, 398084, 414309, 426036, 432325, 432394, 426044, 413629, 396027, 374776, 351795, 328849, 307393, 288457, 272094, 257302, 243206, 230104, 218747, 209067, 200496, 193068, 187120, 182162, 177267, 172504, 168816, 166434, 164556, 162651, 160842, 158833, 155784, 151783, 148302, 146438, 145493, 143961, 141249, 137824, 134285, 130966, 128071, 125587, 123250, 120895, 118617, 116421, 114090, 111564, 109094, 106802, 104495, 102123, 100025, 98499, 97457, 96637, 95878, 95027, 93899]
54572I3899j416j512j449j331j132q60o08k91K39O27K56o64r84m1J444K348K404
54555I0929J993J348O54L75P14J145J090P23N45N64N21N22Q34J357J808K184K516
54538A09822K536K125J814K270L475M788N718O247O669P397Q693J0236J1248J1201
54524A94239J0275Q944P438N624L198M1l299n727o778p371q532r744r724q608
54510A69976p925q160q011o581m881m175m200m025l656l588l583l100k360j951
54496A03780j824j583j305j259j244r54n29k03J48M62K72l02j84J156K586K703
54480A01720J738R89Q97Q58N93N18P79R46P39M09L36O87J285J522Q02n10j150
54463A13158m99N50Q21L49j13l44o06q52r10j029j425j708j469j052r72j101j106
$$ y = [93899, 92483, 90971, 89522, 88191, 87059, 86199, 85591, 85300, 85539, 86166, 86422, 85758, 84774, 84733, 86177, 88525, 90929, 92922, 94270, 94924, 95299, 96013, 97158, 98248, 98971, 99516, 100080, 100601, 101123, 101957, 103314, 105122, 107306, 109822, 112358, 114483, 116297, 118567, 122042, 126830, 132548, 138795, 145464, 152861, 161554, 171790, 183038, 194239, 204514, 213458, 220896, 226520, 229718, 229759, 226460, 220733, 213955, 206584, 198052, 188308, 178584, 169976, 162051, 153891, 145880, 139299, 134418, 130243, 126043, 122018, 118362, 114774, 111191, 108091, 105731, 103780, 101956, 100373, 99068, 97809, 96565, 95611, 95082, 94879, 95027, 95489, 95761, 95459, 95275, 96431, 99017, 101720, 103458, 104447, 105344, 106202, 106795, 107313, 108092, 109038, 109777, 110186, 110522, 111209, 112494, 114016, 114818, 114308, 113158, 112659, 113209, 114030, 114379, 114266, 113922, 113316, 112464, 111554, 110525, 109100, 107392, 105923, 104871, 103899, 102798, 101692]
54446A01692j192j504j429m95N81P35J05l89n49q91j366j267m10N07P76K13r37
54429I4180j928j765l95P73M99n27o80K29Q65N34MK8L07L64L94P01J085J245J192
54410I7105J007O79M28O10J108J300Q97L83M94J460K865L947M136L579L039L077
54394A26114L554M067M442M455L675K145O90j16q27k205l855m645m175l062j961
54379A28296j196j030j520k119k214j925j735j620j282r36j038j437j654j759
54365A06831k060k154j284L44J579J694J063L59q2j75k2L8l8L26J450K510K473
54348A12852J647J217J404J296N71J95Q95K072K652K405J875J579J607J664J283
54333A35214L62n62r65j102j494j927j775j210j161j914k666k703k303k087k125
$$ y = [101692, 100500, 98996, 97567, 97072, 97653, 98388, 98493, 98104, 97555, 96664, 95298, 94031, 93621, 94128, 94904, 95117, 94180, 92252, 90487, 90092, 90865, 91364, 90837, 90157, 90386, 91251, 91785, 91789, 91817, 92124, 92488, 92882, 93583, 94668, 95913, 97105, 98112, 98791, 99219, 99829, 100937, 102237, 103134, 103517, 104011, 105471, 108336, 112283, 116419, 119998, 123037, 126114, 129668, 133735, 138177, 142632, 146307, 148452, 149142, 149026, 148199, 145994, 142139, 137494, 133319, 130257, 128296, 127100, 126070, 124550, 122431, 120217, 118292, 116557, 114937, 113655, 112719, 111681, 110244, 108590, 106831, 104771, 102617, 101333, 101677, 103256, 104950, 106013, 106372, 106290, 106115, 106093, 106131, 106093, 106419, 107869, 110379, 112852, 114499, 115716, 117120, 118416, 118987, 119182, 120077, 122149, 124801, 127206, 129081, 130660, 132267, 133931, 135214, 135576, 135014, 134049, 132947, 131453, 129526, 127751, 126541, 125380, 123466, 120800, 118097, 115794, 113707, 111582]
54318A11582k104j873j552j330j318j434j427j265j228j462j728j933k356k856
54304H7716k559j153K05K23p23j247r65o36n98m03l2n7n17p57o33p48j245j459
54286G4412j017l31K10O03O75J27o54q48m87l97p46p56q4O78J189J757K189J611
54268G8131O1r30k79J180J918J572P82K7n30o80m04j5M10J090J740J609P15J08
54250H6505K62L02l97j044q37m54q26j272m87J134J769P79m62n44L87J370J912
54233H8097J975J448L80o58j042q11n52o14p42n16K2L78K22k37n98p55p54n39
54215H4704j59n5n43j164j164n87j86j88k3N64R54O12j01n91q62j186j414j260
54197G7351q69n30j99K20L90o0q29j129n80M35J181J133K71q42j420j095k56L58
$$ y = [111582, 109478, 107605, 106053, 104723, 103405, 101971, 100544, 99279, 98051, 96589, 94861, 92928, 90572, 87716, 85157, 84004, 84209, 84432, 83709, 82462, 81497, 80861, 80263, 79860, 79828, 79771, 79254, 78497, 77864, 77116, 75871, 74412, 73395, 73064, 73274, 73877, 74552, 74679, 74025, 73177, 72690, 72293, 71547, 70791, 70707, 71385, 72574, 74331, 76520, 78131, 78192, 77262, 76983, 78163, 80081, 81653, 82435, 82462, 81932, 81252, 80848, 80833, 81243, 82333, 84073, 85682, 86397, 86505, 86767, 87069, 86672, 85628, 84791, 84337, 83511, 82239, 81752, 82886, 84655, 85434, 84972, 84428, 84815, 86185, 88097, 90072, 91520, 91900, 91242, 90200, 89389, 88837, 88223, 87481, 86965, 86987, 87365, 87587, 87350, 86752, 85997, 85243, 84704, 84545, 84490, 83947, 82783, 81619, 81032, 80846, 80658, 80635, 81199, 82153, 82765, 82664, 82073, 81211, 80025, 78611, 77351, 76482, 75952, 75753, 75973, 76363, 76303, 75474, 74345, 73765, 74200, 75381, 76514, 76785, 75943, 74523, 73428, 73172, 73530]
54179G3530L19j45l57J78J172J722J331N11j6l08q04j297j146m39N4Q3J42L37
54161G4867Q7p34j270r06j06M40P22R42R05N76N34J116J673J449P23L12K74l9
54143H1565q61j667j945j733j354j013p42m81k15q9k26m31l61j8L07N53Q46R37
54125G3072L95m60o32J92J025Q03l29j417j798j440o38P9K61Q1J68N68N65j25
54107G0370p20m67K67O49N31L25J81L4K3K04K58L7J3N39J144J227J004J045J236
54088G7900J012L45k37m87n65n48m31m32o55o48R6J228J804J418N86J3n8J80L35
54069H0856P7m97q61o22L9P29J250J464J148M06k10l34j50J66P70J485J548P02
54051H7966n7L14J480K285K335K045J583Q44L15P61J978K826K676K086J845K118
$$ y = [73530, 73849, 73704, 73347, 73525, 74697, 76419, 77750, 78261, 78245, 77937, 77133, 75836, 74690, 74251, 74305, 74388, 74530, 74867, 74954, 74220, 72950, 72044, 71938, 72378, 73100, 74042, 74947, 75523, 76057, 77173, 78846, 80295, 81018, 81330, 81604, 81565, 80704, 79037, 77092, 75359, 74005, 72992, 72250, 71769, 71554, 71465, 71239, 70808, 70447, 70429, 70736, 71289, 72135, 73072, 73467, 73007, 72375, 72567, 73592, 74395, 74066, 72649, 70851, 69411, 68773, 68852, 69113, 69194, 69362, 69930, 70495, 70370, 69650, 69183, 69450, 70099, 70630, 70955, 71136, 71170, 71193, 71397, 71655, 71692, 71705, 72244, 73388, 74615, 75619, 76664, 77900, 78912, 79257, 79020, 78533, 77968, 77420, 76989, 76557, 75902, 75254, 75350, 76578, 78382, 79800, 80386, 80399, 80341, 80521, 80856, 80933, 80436, 79575, 78953, 78992, 79721, 80971, 82435, 83583, 83989, 83779, 83445, 83295, 83461, 84231, 85716, 87264, 87966, 87909, 88223, 89703, 91988, 94323, 96368, 97951, 98795, 99110, 99871, 101849, 104675, 107351, 109437, 111282, 113400]
54035A13400K778L765M822N445N479N365N516N829N997N960N801N530N124M645
54021A85456M174L759L416L097K668K080J455R22N63N31R05J258Q54m10j763k555
54005B06410k979l381l475k955k426k781l889m686m552l919l456l297l129k675
53991A58810j976j483j665k291k470j799r87q34j077r70n44l98n64n81n17r04
53975A39750j618j826j240n18k37j49K18Q11J210J101M97k01l93LK30l16j072
53958A36250j073m29j13k87r5P55J321Q45j24o15m49nN72J235J740K027K494L360
53940A47409M164M472M584M977N400N202M334L432K976K858K743K433J811P85
53926A97580n82j946k741k396p98J345K931L389L071K645K458K604L181M063M716
$$ y = [113400, 116178, 119943, 124765, 130210, 135689, 141054, 146570, 152399, 158396, 164356, 170157, 175687, 180811, 185456, 189630, 193389, 196805, 199902, 202570, 204650, 206105, 207027, 207590, 208121, 209026, 210284, 211138, 210728, 208965, 206410, 203431, 200050, 196575, 193620, 191194, 188413, 184524, 179838, 175286, 171367, 167911, 164614, 161485, 158810, 156834, 155351, 153686, 151395, 148925, 147126, 146139, 145305, 144228, 143258, 142714, 142316, 141752, 141171, 140654, 139750, 138132, 136306, 135066, 134548, 134311, 134162, 134380, 135191, 136401, 137502, 137999, 137798, 137405, 137408, 137638, 137322, 136250, 135177, 134748, 134635, 134348, 134253, 135008, 136329, 137174, 137050, 136435, 135986, 135981, 136553, 137788, 139528, 141555, 144049, 147409, 151573, 156045, 160629, 165606, 171006, 176208, 180542, 183974, 186950, 189808, 192551, 194984, 196795, 197580, 196998, 195052, 192311, 189915, 189117, 190462, 193393, 196782, 199853, 202498, 204956, 207560, 210741, 214804, 219520]
53911B19520M722M366M331M826N405N696N927O444O955O671N269L359J788P74
53897B86053L8m13l60j68p22k153l318l227k485k489l507m513m823m907n322n810
53881B41874n890n693n587n531n309n110n236n464n253m616m248m637n366n507
53867A68427m655l346k467k389k781l098l065k622j850j057p31j048j639k062
53853A35617k328k617k763k436j809j451j585j824j758j451j187j004p01j69L56
53838A12890L98l05j361j900j463n51j0kN5O06J407J855J618Q50K1m16l12J40
53820A13520O97J213J516J436J084Q01O38K60l84p75n04J66P55J239J764K198
53804A25624K462K864L555M067M021L828L985M134L766L394L923N031N409M629
$$ y = [219520, 224242, 228608, 232939, 237765, 243170, 248866, 254793, 261237, 268192, 274863, 280132, 283491, 285279, 286053, 286091, 285678, 285318, 285150, 284428, 282275, 278957, 275730, 273245, 270756, 267249, 262736, 257913, 253006, 247684, 241874, 235984, 230291, 224704, 219173, 213864, 208754, 203518, 198054, 192801, 188185, 183937, 179300, 173934, 168427, 163772, 160426, 157959, 155570, 152789, 149691, 146626, 144004, 142154, 141097, 140366, 139318, 137679, 135617, 133289, 130672, 127909, 125473, 123664, 122213, 120628, 118804, 117046, 115595, 114408, 113404, 112703, 112534, 112890, 113288, 112983, 111622, 109722, 108259, 107708, 107698, 107696, 107751, 108357, 109764, 111619, 113237, 114087, 114108, 113692, 113380, 113520, 114217, 115430, 116946, 118382, 119466, 120267, 120905, 121165, 120781, 120006, 119502, 119668, 120423, 121662, 123426, 125624, 128086, 130950, 134505, 138572, 142593, 146421, 150406, 154540, 158306, 161700, 165623, 170654, 176063, 180692]
53790A80692L650L249L137K974L124L771M165L578K395J595J433J342Q58J83j75
53775B15971l1K14l0p98j416j372j074j262j901k346k411k494k706k763k778l211
53759A89592l863l897l134k497k658l116l054k439j733j204r38r40q08n6Q58O58
53743A60771r84k653k924k136j567j493j185m49P0L8j13p0j50o48j222j347r85
53726A42953n39l74n05o53m79J10Q97J523J723J440R53P55J063J391J057J98k19
53709A51294M85J891K994L179K564J755J489K103L111L657L445K924K531K305
53695A85727K257K455K584K152J329Q59R21R58R26J587K966L662K679J050M49
53680B12561R10J188Q84O98Q31N94j57n19O2Q73R49K95l60m73j5O74J017O26k15
$$ y = [180692, 184342, 187591, 190728, 193702, 196826, 200597, 204762, 208340, 210735, 212330, 213763, 215105, 215963, 216146, 215971, 215940, 216154, 216124, 215326, 213910, 212538, 211464, 210202, 208301, 205955, 203544, 201050, 198344, 195581, 192803, 189592, 185729, 181832, 178698, 176201, 173543, 170427, 167373, 164934, 163201, 161997, 161059, 160119, 159311, 159255, 160113, 160771, 159787, 157134, 154210, 152074, 150507, 149014, 147829, 147380, 147450, 147488, 147375, 147305, 147155, 146507, 145285, 143938, 142953, 142414, 142040, 141535, 140882, 140403, 140513, 141410, 142933, 144656, 146096, 147049, 147804, 148867, 150258, 151315, 151513, 151294, 151779, 153670, 156664, 159843, 162407, 164162, 165651, 167754, 170865, 174522, 177967, 180891, 183422, 185727, 187984, 190439, 193023, 195175, 196504, 197363, 198284, 199242, 200168, 201755, 204721, 208383, 211062, 212112, 212561, 213471, 214659, 215543, 216241, 217072, 217666, 217509, 216990, 217052, 217925, 218874, 219169, 218809, 218336, 218321, 218995, 220012, 220638, 220423]
53661B20423q37j039j201j489j572j337j125r82l37R76J955J534J45o22K3J175
53645B15690J517Q67K7m48o73p38l50N09J118P67k21p64l07O31J246J318J123
53628B21312R53R52J128J269J119Q57J009J718K389K455K100J879J919K003K143
53613B45205K492K837K742K308K236K979M129M822M645L969L573L890M608N023
53599B95458M895M753N197O044O481O010M935L890L176K724K539K876L791M656
53585C57425M531L268J887J504K043K493K319J959J917K018J906J637J387J075
53571C87369O62M28N32O48M76J91Nl19r91j611j690j408j273j210p19J59P26N56
53553C82531K6k50j00K37M99O01N68L67j71j001j458o92J167K738K797J710Q95
$$ y = [220423, 219586, 218547, 217346, 215857, 214285, 212948, 211823, 210841, 210504, 211480, 213435, 214969, 215114, 214492, 214515, 215690, 217207, 218074, 218101, 217653, 216980, 216242, 215892, 216401, 217519, 218286, 218065, 217301, 216994, 217625, 218871, 220189, 221312, 222265, 223217, 224345, 225614, 226733, 227590, 228599, 230317, 232706, 235161, 237261, 239140, 241059, 243062, 245205, 247697, 250534, 253276, 255584, 257820, 260799, 264928, 269750, 274395, 278364, 281937, 285827, 290435, 295458, 300353, 305106, 310303, 316347, 322828, 328838, 333773, 337663, 340839, 343563, 346102, 348978, 352769, 357425, 361956, 365224, 367111, 368615, 370658, 373151, 375470, 377429, 379346, 381364, 383270, 384907, 386294, 387369, 388031, 388459, 388991, 389639, 390115, 390306, 390311, 389992, 389001, 387390, 385700, 384292, 383019, 381809, 381090, 381249, 381975, 382531, 382557, 382307, 382207, 382444, 382943, 383544, 384112, 384479, 384308, 383307, 381849, 381157, 382324, 385062, 387859, 389569, 390464]
53536C90464J159K121L049L612L791L699L618L808M149M326M320M401M708N243
53522D42468O163P593R137J0080J0151R749R458R684J0630J2134J3511J4091J3950
53509E78799J3763J3992J4710J6044J8109K0363K1738K1826K1409K1555K2477
53498G84785K3627K4485K5002K5466K6238K7382K8396K8582K7817K6733K5985
53487A074498K5671K5575K5622K5749K5688K5271K4795K4732K5113K5500K5558
53476A353772K5352K5080K4694K3987K2935K1815K0946K0368J9871J9244J8422
53465A596486J7358J5999J4388J2704J1114R732Q683P913O851M681J222k747o333
53452A698051r305j1800j3597j4412j4676j5307j6640j8158j9354k0357k1485
$$ y = [390464, 391623, 393744, 396793, 400405, 404196, 407895, 411513, 415321, 419470, 423796, 428116, 432517, 437225, 442468, 448631, 456224, 465361, 475441, 485592, 495341, 504799, 514483, 525113, 537247, 550758, 564849, 578799, 592562, 606554, 621264, 637308, 655417, 675780, 697518, 719344, 740753, 762308, 784785, 808412, 832897, 857899, 883365, 909603, 936985, 965381, 993963, 1021780, 1048513, 1074498, 1100169, 1125744, 1151366, 1177115, 1202803, 1228074, 1252869, 1277601, 1302714, 1328214, 1353772, 1379124, 1404204, 1428898, 1452885, 1475820, 1497635, 1518581, 1538949, 1558820, 1578064, 1596486, 1613844, 1629843, 1644231, 1656935, 1668049, 1677781, 1686464, 1694377, 1701228, 1705909, 1707131, 1704384, 1698051, 1688746, 1676946, 1663349, 1648937, 1634261, 1618954, 1602314, 1584156, 1564802, 1544445, 1522960]
53441A522960k2732k3945k5109k6095k6433k5841k4790k4178k4397k4978k5187
53430A249275k4785k4019k3005k1417j8972j6083j3664j2177j1157r947q578p558
53418A057913o968o265m973l141j056J108L169M844O059P207Q787J0887J3149
53405A090720J5214J7009J8641K0136K1404K2423K3360K4531K6252K8648L1483
53394A339821L4140L6043L7252L8512M0407M2685M4688M6325M8119N0359N2760
53383A811111N5020N7115N8891N9981O0451O0977O1923O2742O2715O1894O0834
53372B473654N9734N8462N7014N5419N3378N0574M7064M2996L8214L2812K7623
53361B996944K3397J9700J5472J0552N805J666k498p356j2694j7887k2655k6969
$$ y = [1522960, 1500228, 1476283, 1451174, 1425079, 1398646, 1372805, 1348015, 1323837, 1299440, 1274462, 1249275, 1224490, 1200471, 1177466, 1156049, 1137077, 1120994, 1107330, 1095153, 1083996, 1074049, 1065471, 1057913, 1050945, 1044680, 1039707, 1036566, 1035510, 1036618, 1039787, 1044631, 1050690, 1057897, 1066684, 1077571, 1090720, 1105934, 1122943, 1141584, 1161720, 1183124, 1205547, 1228907, 1253438, 1279690, 1308338, 1339821, 1373961, 1410004, 1447256, 1485768, 1526175, 1568860, 1613548, 1659873, 1707992, 1758351, 1811111, 1866131, 1923246, 1982137, 2042118, 2102569, 2163546, 2225469, 2288211, 2350926, 2412820, 2473654, 2533388, 2591850, 2648864, 2704283, 2757661, 2808235, 2855299, 2898295, 2936509, 2969321, 2996944, 3020341, 3040041, 3055513, 3066065, 3071870, 3073536, 3071038, 3063682, 3050988, 3033101, 3010446, 2983477]
53349B983477l0810l4428l8419m3013m7647n1646n4984n7894o0014o0570n9508
53338B444544n7846n6573n5632n4409n3045n2481n3054n3632n2868n0877m9018
53327A855109m7992m7086m5433m3202m1097l9258l7232l4639l1466k8082k5215
53316A434407k3419k2317k0985j9453j8889j9717k0475j9520j7099j4635j2613
53305A225285j0498q321o846o171n506m424l239k022l90J553L126M153N057N795
53291A197552N887N840P130J0197J3585J5852J7319J9090K1275K3237K4902K6692
53279A388558K8508K9698L0004K9778K9383K8902K8331K7655K6722K5365K3556
53268A696460K1321J8782J6338J4388J2723J0675Q147N894M466L421J989kk366
$$ y = [2983477, 2952667, 2918239, 2879820, 2836807, 2789160, 2737514, 2682530, 2624636, 2564622, 2504052, 2444544, 2386698, 2330125, 2274493, 2220084, 2167039, 2114558, 2061504, 2007872, 1955004, 1904127, 1855109, 1807117, 1760031, 1714598, 1671396, 1630299, 1591041, 1553809, 1519170, 1487704, 1459622, 1434407, 1410988, 1388671, 1367686, 1348233, 1329344, 1309627, 1289152, 1269632, 1252533, 1237898, 1225285, 1214787, 1206466, 1199620, 1193449, 1187943, 1183519, 1180280, 1178258, 1177868, 1179421, 1182547, 1186700, 1191757, 1197552, 1203439, 1209279, 1216409, 1226606, 1240191, 1256043, 1273362, 1292452, 1313727, 1336964, 1361866, 1388558, 1417066, 1446764, 1476768, 1506546, 1535929, 1564831, 1593162, 1620817, 1647539, 1672904, 1696460, 1717781, 1736563, 1752901, 1767289, 1780012, 1790687, 1798834, 1804728, 1809194, 1812615, 1814604, 1814602, 1812236]
53255A812236n193q597j2115j5039j7188j8908k0449k1844k3282k5128k7416k9609
53243A587468l1037l1524l1527l1662l1989l1994l1374l0536k9963k9429k8413
53232A248020k7058k6041k5562k5217k4850k4755k4931k4907k4485k3910k3217
53221I73087k2143k0816j9709j8749j7388j5741j4598j4079j3393j2356j1866
53210G92249j2280j2610j2218j2060j3126j4658j5209j4720j4186j3929j3487
53199F43766j2822j2289j1753j0932j0362j0745j1562j1584j0730j0101j0174
53188E20712j0224r752r345r622j0353j1029j1609j2159j2413j2010j0870r146
53176C92180p351o381o755p727p872o708n185m382m441m891n315n421n046m487
$$ y = [1812236, 1807043, 1798446, 1786331, 1771292, 1754104, 1735196, 1714747, 1692903, 1669621, 1644493, 1617077, 1587468, 1556431, 1524907, 1493380, 1461718, 1429729, 1397735, 1366361, 1335825, 1305862, 1276433, 1248020, 1220962, 1194921, 1169359, 1144142, 1119292, 1094537, 1069606, 1044699, 1020214, 996304, 973087, 950944, 930128, 910419, 891670, 874282, 858541, 843943, 829864, 816471, 804115, 792249, 779969, 767359, 755141, 743081, 729955, 715297, 700088, 685368, 671182, 657253, 643766, 630944, 618655, 606902, 595970, 585608, 574863, 563301, 551717, 540987, 530886, 520712, 510488, 500736, 491391, 481769, 471416, 460387, 448778, 436619, 424206, 412196, 401326, 392180, 384829, 378448, 371693, 363966, 356094, 349386, 344201, 339819, 335378, 330487, 325172, 319751, 314705, 310218]
53162C10218m312m623m918m842m547m206l750l280l155l397l544l324k971k616
53148B56733k039j352j281k202l355l610k795j703j041q82j022j268j357j070
53134B31756n40j99k60n39q33j231j822k288k133j341m81l8J11K70K65k73j103
53117B19321j481j231j082j556k079j721n32N05O54P0n99q68n87O0P43J229J426
53100B12272J205N51J1M03J673K646K353J226L36N4O3J96L37o2j287k505k659
53083B16813k119k238l300m076l718k878k476k436k247j904j630j399j306j810
53069A83276k910l726l518k622j809j225o37j99k66p26j227j752k351k630k199
53054A55479j440j103j242j216p26k17j50m22o09m24J71R07J250Q00k57j290j804
$$ y = [310218, 305906, 301283, 296365, 291523, 286976, 282770, 279020, 275740, 272585, 269188, 265644, 262320, 259349, 256733, 254694, 253342, 252061, 249859, 246504, 242894, 240099, 238396, 237355, 236473, 235451, 234183, 232826, 231756, 231216, 231017, 230757, 230218, 229385, 228154, 226332, 224044, 221911, 220570, 220089, 220051, 220162, 220432, 220697, 220424, 219321, 217840, 216609, 215527, 213971, 211892, 210171, 209639, 210144, 210798, 210868, 210269, 209401, 208814, 208874, 209617, 210846, 212272, 213477, 214028, 214039, 214442, 216115, 218761, 221114, 222340, 222676, 222730, 222793, 222989, 223326, 223264, 221977, 219472, 216813, 214694, 212456, 209156, 205080, 201362, 198484, 196008, 193572, 191325, 189421, 187791, 186392, 185086, 183276, 180366, 176640, 173122, 170500, 168691, 167466, 166829, 166630, 166364, 165638, 164411, 162659, 160308, 157678, 155479, 154039, 152936, 151694, 150478, 149752, 149535, 149385, 148963, 148354, 147930, 148101, 149008, 150258, 151058, 150801, 149511, 147707]
53037A47707j728j288q85r09j366j775j770j572j533j497j117o15n30q17r64r73
53021A28368j379k092k167j164M4N19N56Q85J175N50o89j121k20P95O92j74o48
53004A23930m73k77l16j58M75J256J754J782J278L66m12n13l8M42P38J070J303
52987A32207R33N2m95k87Nk86p85p48k96j38l40k04O56J749K261J780N16p39j026
52968A34815n3J361K148K166K086K232K231J869J618J988K717K990K300J027K32
52953A61727P91K506M144M652M220L820L889L974L583K833K032J215L27m50q06
52938A98457o32j06L23J62o28j415j505j028p91j269k136k819l040k700j847r31
52922A78095o22r95j333j037m04n7J4K77P10O52k40j357j739j114o9O54Q04N64
$$ y = [147707, 145979, 144691, 143806, 142897, 141531, 139756, 137986, 136414, 134881, 133384, 132267, 131652, 131122, 130305, 129341, 128368, 126989, 124897, 122730, 121566, 121610, 122129, 122685, 123570, 124745, 125295, 124606, 123485, 123265, 124060, 124752, 124578, 123930, 123457, 123180, 122864, 122706, 123181, 124437, 126191, 127973, 129251, 129617, 129205, 128692, 128654, 129096, 129834, 130904, 132207, 133140, 133192, 132697, 132410, 132415, 132129, 131344, 130596, 130300, 130162, 129822, 129618, 130274, 132023, 134284, 136064, 136580, 135841, 134815, 134762, 136123, 138271, 140437, 142523, 144755, 146986, 148855, 150473, 152461, 155178, 158168, 160468, 161495, 161727, 162518, 165024, 169168, 173820, 178040, 181860, 185749, 189723, 193306, 196139, 198171, 199386, 199713, 199263, 198457, 197825, 197719, 198042, 198204, 197576, 196161, 194656, 193628, 192837, 191568, 189432, 186613, 183573, 180873, 179026, 178095, 177473, 176478, 175145, 174108, 173704, 173647, 173661, 173938, 174648, 175300, 175060, 173703, 171964, 170850, 170781, 171435, 172239, 172803]
52904A72803J95q3j16j2j84p85j209o65O82J654J423M15m12o37l24M98J658K508
52886A77409K483J850J249P83K20k48j91K37M77M98P39J133J104N96K19J87k7
52869A88718o70j180j051n58j57J72N43P35N82L48K52J11k03m26l47j39N8M24
52851A87212R62J317J381J532J871J891J345Q57J041J632K034K204K280J949R70
52836B10478m0k82N3Q9l79o51k34N90J334J798J854J405P54M96Q38J302J274N98
52818B21277l98j254j672j710j716j962k432l000l496l532k716j414p76j485k789
52803A90925l375k970k360k131k128k147k320k624k683k325j823j394r74o73q90
52788A60108j667k397k558k343k170j931j274m11q6o42j554k075k034j823j726
$$ y = [172803, 172998, 172915, 172799, 172787, 172603, 171818, 170609, 169944, 170626, 172280, 173703, 174118, 173706, 173069, 172745, 173243, 174901, 177409, 179892, 181742, 182991, 183774, 183994, 183746, 183555, 183792, 184269, 184767, 185506, 186639, 187743, 188339, 188558, 188745, 188718, 188048, 186868, 185817, 185259, 185102, 185274, 185817, 186552, 187134, 187482, 187734, 187845, 187642, 187216, 186869, 186730, 186788, 187212, 188174, 189491, 190872, 192404, 194275, 196166, 197511, 198368, 199409, 201041, 203075, 205279, 207559, 209508, 210478, 210438, 210156, 210209, 210298, 209919, 209268, 209034, 209624, 210958, 212756, 214610, 216015, 216769, 217265, 218103, 219405, 220679, 221277, 220879, 219625, 217953, 216243, 214527, 212565, 210133, 207133, 203637, 200105, 197389, 195975, 195199, 193714, 190925, 187550, 184580, 182220, 180089, 177961, 175814, 173494, 170870, 168187, 165862, 164039, 162645, 161671, 160998, 160108, 158441, 156044, 153486, 151143, 148973, 147042, 145768, 145357, 145271, 144629, 143075, 141000, 138966, 137143, 135417]
52773A35417j610j265q41p49j150j705j856j336m34J55j19j111k011k172j801
52758A17412j592j746j780j303o09k30l62q76j567k136k232j869j507j441j370
52743I6792r39l35L1Q9n6n29j327j772j161J37Q60L73o52j251j305j260j207q41
52725H5647j54L68L23j30n42o78o22m59j55K81O23O76N15L30J29j94n13n41k93
52706H4611j80m85r65j122p15N4O86O79J7o13m14N79J481J597J153Q19R86J621
52688H9789K457K954K590J535P18Q48J672K477K916L032K896K702K806L138L002
52673A25532J956M99o17j358k001k273j785r93p89j217j527j470j584k044k238
52658A08091j762j095q11q24p74o81p34q59r19r63j035r71o91m13l90o53j078
$$ y = [135417, 133807, 132542, 131701, 130952, 129802, 128097, 126241, 124905, 124471, 124626, 124507, 123396, 121385, 119213, 117412, 115820, 114074, 112294, 110991, 110382, 110152, 109790, 108914, 107347, 105211, 102979, 101110, 99603, 98162, 96792, 95853, 95518, 95549, 95638, 95582, 95053, 93726, 91954, 90793, 90930, 91790, 92163, 91511, 90260, 88955, 87695, 86488, 85647, 85493, 85861, 86184, 86054, 85512, 84834, 84212, 83753, 83598, 83879, 84502, 85178, 85693, 86023, 86152, 85958, 85445, 84904, 84611, 84431, 83946, 82981, 81859, 81144, 81198, 81884, 82563, 82580, 81967, 81553, 82132, 83613, 85210, 86363, 87182, 88168, 89789, 92246, 95200, 97790, 99325, 100043, 100891, 102563, 105040, 107956, 110988, 113884, 116586, 119392, 122530, 125532, 127488, 127987, 127370, 126012, 124011, 121738, 119953, 118960, 118171, 116954, 115427, 113957, 112373, 110329, 108091, 106329, 105234, 104423, 103599, 102825, 102144, 101410, 100551, 99632, 98669, 97634, 96663, 95972, 95559, 95169, 94516, 93438]
52641I3438j442j394p86r1L1l88n90j45N88J144J569K013K273K123J681J060J17
52624A01201j057j806j653r97o33p54j006j188j360j379j003m38k07l50k60M35
52608H7545J243J329M96o44j291j048m8J189J998K009J523J238J465J689J193
52593I9886M0q70q03L3Q83J205R35K53m32n82k3P61J205J357J580J761J467Q60
52575A09516P68J517K339K325J629J225J660K451K718K137J206O28N58N58L33
52560A31568K05N80J223J555J478J359J236Q41M17O59J536J978J279K01p1M51
52544A46495P81M94J27J28K57K77M15Q48J243J248J079J136J290J026K33n11n99
52527A55967l1O96J126J114P37J60l09l82r1K13K73K12K12J22l19r11j028l64
$$ y = [93438, 91996, 90602, 89816, 89725, 89756, 89368, 88778, 88633, 89221, 90365, 91934, 93947, 96220, 98343, 100024, 101084, 101201, 100144, 98338, 96685, 95688, 95055, 94301, 93295, 92107, 90747, 89368, 88365, 87927, 87720, 87370, 87110, 87545, 88788, 90117, 90613, 89969, 88678, 87630, 87582, 88771, 90769, 92778, 94301, 95539, 97004, 98693, 99886, 99926, 99056, 98253, 98286, 99169, 100374, 101309, 101562, 101130, 100548, 100525, 101286, 102491, 103848, 105428, 107189, 108656, 109516, 110284, 111801, 114140, 116465, 118094, 119319, 120979, 123430, 126148, 128285, 129491, 130119, 130677, 131235, 131568, 131773, 132353, 133576, 135131, 136609, 137968, 139204, 140045, 140462, 141121, 142657, 144635, 145914, 146115, 146044, 146495, 147276, 147770, 147897, 148025, 148282, 148559, 148974, 149822, 151065, 152313, 153392, 154528, 155818, 156844, 157077, 156566, 155967, 155936, 156632, 157758, 158872, 159609, 159769, 159460, 159078, 158987, 159200, 159473, 159685, 159897, 160019, 159700, 158789, 157761, 157397]
52509A57397N96J067P47j3o67r56r39p85n87m52n53r98j587j869j618j061n62
52492A47160j90J99O87J289K034K705K733J812N54j4M03J107J363J137P76M91
52476A64246L68M65O54O53M73M60O95P32K22n12r12q53n76j62M71J189J658J667
52458A70938J234N00k38n15m0R08J651J639P94m79j473j582q09J75O73N61K02
52441A74139n5r0M2J55M1k84n84p55q84r10n16L05R66R73N92M05M18K02k25l33
52421A73602M3L69K17j16j31Q4M4l65o79m27L43J154J491J114K04p14j100q23
52403A74310k80J1m6n3L27Q46Q87K27o14r41o67k59kL55J056J734J679P23m31
52384A78862r19o21j50kn1J36O82J270J519J348J077J170J716K209K082J539J407
$$ y = [157397, 157993, 159060, 159807, 159794, 159127, 158171, 157232, 156447, 155860, 155408, 154855, 153857, 152270, 150401, 148783, 147722, 147160, 146970, 147169, 147856, 149145, 151179, 153884, 156617, 158429, 158983, 158969, 159372, 160479, 161842, 162979, 163755, 164246, 164614, 165079, 165733, 166386, 166859, 167319, 168014, 168746, 168968, 168456, 167544, 166691, 166115, 165953, 166424, 167613, 169271, 170938, 172172, 172672, 172434, 171919, 171879, 172787, 174438, 176077, 176871, 176392, 174919, 173337, 172528, 172703, 173376, 173937, 174139, 174084, 173994, 174036, 174191, 174232, 173948, 173364, 172609, 171725, 170815, 170299, 170604, 171570, 172543, 173135, 173540, 173958, 174160, 173935, 173602, 173645, 174014, 174231, 174115, 173984, 174068, 174112, 173747, 173068, 172641, 172984, 174138, 175629, 176743, 176947, 176233, 175133, 174310, 174030, 174041, 173995, 173942, 174269, 175115, 176002, 176229, 175615, 174674, 174007, 173748, 173746, 174101, 175157, 176891, 178570, 179293, 178862, 177943, 177322, 177172, 177170, 177119, 177255, 177937, 179207, 180726, 182074, 183151, 184321, 186037, 188246, 190328, 191867, 193274]
52367A93274K004K653K691K437K543K826K590J920J673K069K301J899J521J869
52353B24270K564K858K803K886K933K365J413J070J690K423K418J930J770K120
52339B55513K392K107J490J123J320J945K605K933K720K044J321J092J545K228
52325B82378K451J998J336J051J312J881K506L111L690M187M440M315L986L949
52311C22591M531N393N942O136O597P707R091J0104J0557J0678J0740J1020J1771
52298D32858J2899J3865J4271J4307J4424J4774J5236J5685J5946J5752J5204
52287E95221J4960J5506J6408J6798J6426J5814J5430J5175J4670J3648J2094
52276G62150J0391R199Q862Q851Q303P049N663M572L629K645J872J598J602J315
$$ y = [193274, 195278, 197931, 200622, 203059, 205602, 208428, 211018, 212938, 214611, 216680, 218981, 220880, 222401, 224270, 226834, 229692, 232495, 235381, 238314, 240679, 242092, 243162, 244852, 247275, 249693, 251623, 253393, 255513, 257905, 260012, 261502, 262625, 263945, 265890, 268495, 271428, 274148, 276192, 277513, 278605, 280150, 282378, 284829, 286827, 288163, 289214, 290526, 292407, 294913, 298024, 301714, 305901, 310341, 314656, 318642, 322591, 327122, 332515, 338457, 344593, 351190, 358897, 367988, 378092, 388649, 399327, 410067, 421087, 432858, 445757, 459622, 473893, 488200, 502624, 517398, 532634, 548319, 564265, 580017, 595221, 610181, 625687, 642095, 658893, 675319, 691133, 706563, 721738, 736408, 750056, 762150, 772541, 781740, 790602, 799453, 807756, 814805, 820468, 825040, 828669, 831314, 833186, 834784, 836386, 837701]
52262H37701M02r01j905j960j143m22p80k100l245l315k478j463o72p8M09Q86
52246H18936J674L046M842O512P682Q395Q856R118R183R230R544J0210J0986J1532
52232I29746J1680J1456J0967J0360R745Q984P761O124M795M439M683M346K867
52219A027953R25n71j546k403l170l679m200n177o491p663q620r573j0253j0133
52205I55399r438r083r346r438q757p804p272o932o199n301m978n174m966l870
52191H56841k537j865j909k022j711j046l59J01K92K99J77j64q39j690k268k255
52175H39045j865j601j714j977k101k081k079k102k091k167k559l192l617l482
52161H06417k925k373k066k011k153k450k766k980l142l366l509l217k360j348
$$ y = [837701, 838103, 837202, 835297, 833337, 832194, 831772, 830992, 828892, 825647, 822332, 819854, 818391, 817719, 817641, 818050, 818936, 820610, 823656, 828498, 835010, 842692, 851087, 859943, 869061, 878244, 887474, 897018, 907228, 918214, 929746, 941426, 952882, 963849, 974209, 983954, 992938, 1000699, 1006823, 1011618, 1016057, 1020740, 1025086, 1027953, 1028878, 1028307, 1026761, 1024358, 1021188, 1017509, 1013309, 1008132, 1001641, 993978, 985358, 975785, 965532, 955399, 945961, 936878, 927532, 918094, 909337, 901533, 894261, 887329, 881130, 875829, 870851, 865677, 860711, 856841, 854304, 852439, 850530, 848508, 846797, 845751, 845392, 845493, 845785, 846084, 846261, 846097, 845258, 843568, 841300, 839045, 837180, 835579, 833865, 831888, 829787, 827706, 825627, 823525, 821434, 819267, 816708, 813516, 809899, 806417, 803492, 801119, 799053, 797042, 794889, 792439, 789673, 786693, 783551, 780185, 776676, 773459, 771099, 769751]
52147G69751q14j026j678k300k757l257l880m402m592m522m354m060l622l240
52133G25247l031k684k020j639k363l927m982m705l695k924k563k391k623l430
52119F82270m111l783k667j759j351q18J36J025J603K360L581M722N287N674O519
52104F98688P710Q726R583J0735J2180J3370J4048J4732J6057J7929J9548K0231
52092H63537K0165K0224K0930K1763K1759K0787J9764J9450J9447J8743J6983
52081A083552J4722J2621J0864R374Q114P000N814M440L044J843P86l85j826l502
52067A156461n357p301q954r730r489q934q950r480r550q555p035n876n162m378
52053A047710l414k711k424k098j348l50N12J109J501J781K239L289M858O115
$$ y = [769751, 768937, 767911, 766233, 763933, 761176, 757919, 754039, 749637, 745045, 740523, 736169, 732109, 728487, 725247, 722216, 719532, 717512, 715873, 713510, 709583, 704601, 699896, 696201, 693277, 690714, 688323, 685700, 682270, 678159, 674376, 671709, 669950, 668599, 667781, 667917, 668942, 670545, 672905, 676486, 681208, 686495, 692169, 698688, 706398, 715124, 724707, 735442, 747622, 760992, 775040, 789772, 805829, 823758, 843306, 863537, 883702, 903926, 924856, 946619, 968378, 989165, 1008929, 1028379, 1047826, 1066569, 1083552, 1098274, 1110895, 1121759, 1131133, 1139247, 1146247, 1152061, 1156501, 1159545, 1161388, 1162174, 1161789, 1159963, 1156461, 1151104, 1143803, 1134849, 1125119, 1115630, 1106696, 1097746, 1088266, 1078716, 1070161, 1063126, 1057250, 1052088, 1047710, 1044296, 1041585, 1039161, 1037063, 1035715, 1035365, 1035877, 1036986, 1038487, 1040268, 1042507, 1045796, 1050654, 1056769]
52039A056769O226N383M768N355O855P953P593O019M467L845L882L698K860J655
52025A127328M79n52j423k066k561l188m114n202o203o983p568q139q955j0037
52011A060816j0993j1419j1445j1591j2136j2951j3933j5172j6580j7765j8434
52000I08397j8736j9026j9532k0188k0617k0364j9536j9039j9683k1078k1984
51989F88614k1812k1159k0679k0202j9362j8466j8075j8105j7934j7325j6681
51978D78814j6384j6280j5830j4659j3043j1821j1618j2011j1811j0389q407o987
51966C29574o477o367o076n409m465l593l347m012n156n874n602m536l298k412
51952B62950k055k091k277k474k665k808k813k647k345j879j251o84m99p61j258
$$ y = [1056769, 1062995, 1068378, 1073146, 1078501, 1085356, 1093309, 1100902, 1106921, 1111388, 1115233, 1119115, 1122813, 1125673, 1127328, 1127807, 1127255, 1125832, 1123766, 1121205, 1118017, 1113903, 1108701, 1102498, 1095515, 1087947, 1079808, 1070853, 1060816, 1049823, 1038404, 1026959, 1015368, 1003232, 990281, 976348, 961176, 944596, 926831, 908397, 889661, 870635, 851103, 830915, 810298, 789934, 770398, 751359, 731676, 710598, 688614, 666802, 645643, 624964, 604762, 585400, 566934, 548859, 530754, 512820, 495495, 478814, 462430, 446150, 430320, 415661, 402618, 390797, 379179, 367168, 355357, 344968, 336561, 329574, 323097, 316730, 310654, 305245, 300780, 297187, 293840, 289828, 284672, 278798, 273196, 268660, 265362, 262950, 260895, 258804, 256527, 254053, 251388, 248580, 245767, 243120, 240775, 238896, 237645, 236961, 236462, 235701, 234443]
51937B34443j834k498l155l603l784l725l273k292j178o42p91r66o50q0K92L98
51921B06662K94r7o43q49n44k31l27n10l87l43j007k153k876k752k227j823j582
51904A88605j322j049r28j065j369j558j498j520j983k460j940k95J095Q64o65
51889A72912k050k593k688k616k041q90R7K34k68o09l18L96R10P53M8n29m62P3
51871A60359N68P94P58L66l17o93j67R62J746J671J118P42R02J589K363K486J727
51854A76974R09J025J869K284J778J034P40P21O10N11O10O80M38n1o50j344j864
51837A86274j721r10q5L41P25J385J920J800J246Q95R52J203J518J857K004J794
51821B01198J437J152P65J35l05k3P40J187R38L11l05q62j362j671j718j559j178
$$ y = [234443, 232609, 230111, 226956, 223353, 219569, 215844, 212571, 210279, 209101, 208459, 207668, 206702, 206052, 205972, 206264, 206662, 206956, 206859, 206216, 205367, 204823, 204592, 204265, 203755, 203368, 203025, 202018, 199865, 196989, 194237, 192010, 190187, 188605, 187283, 186234, 185306, 184241, 182872, 181314, 179816, 178296, 176313, 173853, 171913, 171618, 172713, 173577, 172912, 170862, 168269, 165581, 162965, 160924, 160034, 160131, 160365, 160097, 159488, 159170, 159566, 160476, 161229, 161277, 160748, 160286, 160359, 160927, 161721, 162479, 162845, 162528, 161835, 161668, 162630, 164376, 166047, 167165, 167907, 168809, 170398, 172761, 175247, 176974, 177883, 178908, 180777, 183061, 184839, 185873, 186613, 187334, 187944, 188455, 189065, 189745, 190183, 190132, 189482, 188138, 186274, 184553, 183643, 183558, 183899, 184624, 186009, 187929, 189729, 190975, 191870, 192822, 194025, 195543, 197400, 199404, 201198, 202635, 203787, 204552, 204687, 204382, 204359, 205099, 206286, 207224, 207535, 207230, 206368, 205006, 203335, 201617, 200058, 198880]
51804A98880n39J26M41K93q2m39o47n05J63J069J533J174L81j10M4O11J105J154
51786B04652O93M5k48J11Q01J126P12m8m18j69K17K01j04j49L28J085J852K587
51768B13274L188L346L014K601K402K107J327M57M19J437K627L025K707K500K816
51753B47247L215L208L029L317M208N056N129M308L014J681M97m43j076j410j438
51738B79542j076l93J62J21l35m36K35J202J733J788J951K521L099L139K604J884
51722B97741J214M68m95j376j565p62N94J570J519N14q76k133l021l451l328k612
51706B84001j487m00J50j45j251k734l837l877k925k018k242l384l976k998j204
51691B51673j89m17p75j05J491L061M001M441M866N616O538O916O015L925J632
$$ y = [198880, 198341, 198467, 198908, 199201, 199119, 198680, 198033, 197528, 197691, 198760, 200293, 201467, 201848, 201738, 201782, 202393, 203498, 204652, 205345, 205390, 205142, 205253, 206054, 207180, 207892, 207844, 207426, 207257, 207474, 207675, 207571, 207422, 207750, 208835, 210687, 213274, 216462, 219808, 222822, 225423, 227825, 229932, 231259, 231716, 232135, 233572, 236199, 239224, 241931, 244431, 247247, 250462, 253670, 256699, 260016, 264224, 269280, 274409, 278717, 281731, 283412, 283909, 283466, 282390, 280980, 279542, 278466, 278073, 278235, 278356, 278021, 277585, 277820, 279022, 280755, 282543, 284494, 287015, 290114, 293253, 295857, 297741, 298955, 299423, 298928, 297552, 295987, 295225, 295819, 297389, 298908, 299422, 298546, 296413, 293392, 289941, 286613, 284001, 282514, 282114, 282264, 282119, 280868, 278134, 274297, 270420, 267495, 265477, 263235, 259851, 255875, 252877, 251673, 251484, 251067, 250292, 250187, 251678, 254739, 258740, 263181, 268047, 273663, 280201, 287117, 293132, 297057, 298689]
51676B98689N1p59j214j473j468j278r86m00O02J515J587P64k56q78j063q83k25
51659B92325P63J462J367O64k06j239k705m398n636o103o225o501o728o228m800
51644B45812l106k048j951k356k645k665k736l078l399l258k697k247k230k327
51630B09069k070j508j089r71q76o17l87m13n90o73n69l40q1O4o8m27p17p19n16
51611A96502k32J63O94J203J572J915K357K778K907K530J542J31r86r60K01J490
51595B13807K077K221K549K913K738K245K406L593M983N576N255M623M237M158
51581B63381L997L242J784K30o21o02j90J42K03j35q51j468j411p84k58j39j00
51564B66420J38M53P54J111J319J083P88J354K853M131M226L477K735K164J558
$$ y = [298689, 298740, 297981, 296767, 295294, 293826, 292548, 291562, 291162, 291764, 293279, 294866, 295630, 295374, 294496, 293433, 292550, 292325, 293088, 294550, 295917, 296581, 296375, 295136, 292431, 288033, 282397, 276294, 270069, 263568, 256840, 250612, 245812, 242706, 240658, 238707, 236351, 233706, 231041, 228305, 225227, 221828, 218570, 215873, 213626, 211396, 209069, 206999, 205491, 204402, 203431, 202555, 201938, 201551, 201138, 200548, 199875, 199306, 198966, 198885, 198949, 198881, 198454, 197737, 197018, 196502, 196270, 196433, 197127, 198330, 199902, 201817, 204174, 206952, 209859, 212389, 213931, 214062, 213076, 212116, 212317, 213807, 215884, 218105, 220654, 223567, 226305, 228550, 230956, 234549, 239532, 245108, 250363, 254986, 259223, 263381, 267378, 270620, 272404, 272634, 272013, 271411, 271221, 271363, 271566, 271431, 270580, 269112, 267701, 266917, 266659, 266520, 266420, 266558, 267011, 267765, 268876, 270195, 271278, 272066, 273420, 276273, 280404, 284630, 288107, 290842, 293006, 294564]
51549B94564J228J600K312K546K091J360N71l65j185j329p87j99L7J91N33P91
51533C03959O57M39P22J507K084J899J211P20O86P13M31j5l81q44j650k489k813
51516C06836k642k491k531k529k548k899l274k904j872j346j951k778k693j881
51502B72497j327j387j712k041k182j717o10J71k99j513k110j636p86q6O16J265
51486B57143J355Q47N30R80J799K237K141J973K191K797L357L474L413L904N032
51471B93173N759N255M217L988M732N404N416N153M865M203L198K508K315J887
51457C52073Q36r6j58K08Pq97j687j625p35L31Q00M39j39j80K09K58k30o50p45
51438C48019j105k122l265l917m242m609m812m526m037l857m005m206m350m241
$$ y = [294564, 295792, 297392, 299704, 302250, 304341, 305701, 306272, 305907, 304722, 303393, 302606, 302407, 302444, 302635, 303168, 303959, 304616, 305055, 305777, 307284, 309368, 311267, 312478, 313198, 313884, 314597, 315028, 315013, 314632, 313788, 312138, 309649, 306836, 304194, 301703, 299172, 296643, 294095, 291196, 287922, 285018, 283146, 281800, 279849, 277071, 274378, 272497, 271170, 269783, 268071, 266030, 263848, 262131, 261521, 261692, 261393, 259880, 257770, 256134, 255348, 255262, 255878, 257143, 258498, 259345, 259875, 260855, 262654, 264891, 267032, 269005, 271196, 273993, 277350, 280824, 284237, 288141, 293173, 298932, 304187, 308404, 312392, 317124, 322528, 327944, 333097, 337962, 342165, 345363, 347871, 350186, 352073, 352909, 352813, 352655, 352863, 352870, 351973, 350286, 348661, 347926, 348257, 349057, 349496, 349357, 349177, 349386, 349644, 349414, 348764, 348019, 346914, 344792, 341527, 337610, 333368, 328759, 323947, 319421, 315384, 311527, 307522, 303316, 298966, 294725]
51424B94725l469k132j170j263j879k063j711j354j092o85l16l97o84n23J85R76
51408B77148J683K507L294L555L266K919K688K251J487O72j24j170k427l448m055
51393B90246m543n038n267n223n402n992o393n951m808l655k952k767l040l656
51379B25559m325m674m448l657k666k001j742j281j37J048R96n81k518l564l646
51364A92363l412l170k856k597k608k734k603k198j847j764j885k024j894j209
51350A59562j54N23L23k78m22rK98J64jJ83M48M36K80L39O05Q47J056J397J806
51331A67403K098K321K675L095L281L235L363L853M290M101L282K378J822J559
51317B08756J359J119Q27L58l83j243j922k343k727l208l559l476l048k793l072
$$ y = [294725, 291256, 289124, 287954, 286691, 284812, 282749, 281038, 279684, 278592, 277907, 277591, 277194, 276510, 275987, 276172, 277148, 278831, 281338, 284632, 288187, 291453, 294372, 297060, 299311, 300798, 301470, 301346, 300176, 297749, 294301, 290246, 285703, 280665, 275398, 270175, 264773, 258781, 252388, 246437, 241629, 237974, 235022, 232255, 229215, 225559, 221234, 216560, 212112, 208455, 205789, 203788, 202046, 200765, 200628, 201676, 202672, 202091, 199573, 196009, 192363, 188951, 185781, 182925, 180328, 177720, 174986, 172383, 170185, 168338, 166574, 164689, 162665, 160771, 159562, 159408, 159931, 160254, 159976, 159554, 159545, 159843, 160007, 160006, 160189, 160637, 161073, 161353, 161692, 162297, 163144, 164200, 165597, 167403, 169501, 171822, 174497, 177592, 180873, 184108, 187471, 191324, 195614, 199715, 202997, 205375, 207197, 208756, 210115, 211234, 212061, 212419, 212036, 210793, 208871, 206528, 203801, 200593, 197034, 193558, 190510, 187717, 184645]
51302A84645l685m091l991l523l021k696k594k645k608k205j401n44j01k13o18
51287A50709r23q81m95K9L68K49l46j055j259n70O34J334Q89q5l52L15P09k11
51269A49059j806k455j542l9Q05O31j68j038j439j032r5O54Q69Q90R75Q02L2j023
51251A44080j767j966j696j032k60J1m92j217j500j453j508j377l82J235K209
51236A32885J772N79k06j92J95N26P19P86O38J89m28p87m66L68Q29K72p62j053
51218A35864k28Q01J079P01L23J78O5o5o1O7K68P64J752K838L209K492J181J25
51200A51353k33j03l2l62r07j180r59m88o8K80N57N27O2m41l94K16P85Q35N03
51181A49951K40L36P37J097R21k4j275j933j504l98N44Q55O44K00l74j120j919
$$ y = [184645, 180960, 176869, 172878, 169355, 166334, 163638, 161044, 158399, 155791, 153586, 152185, 151641, 151540, 151327, 150709, 149786, 148905, 148410, 148439, 148807, 149056, 148710, 147655, 146396, 145826, 146460, 147794, 148683, 148598, 148246, 148561, 149270, 149059, 147253, 144798, 143256, 143217, 144022, 144653, 144485, 143447, 142008, 140976, 140881, 141535, 142404, 143294, 144269, 145071, 145103, 144080, 142313, 140347, 138651, 137619, 137359, 137370, 136878, 135661, 134161, 132708, 131200, 129823, 129441, 130676, 132885, 134657, 135236, 135030, 134838, 135033, 135559, 136278, 137064, 137702, 137891, 137463, 136676, 136210, 136578, 137407, 137679, 136917, 135864, 135636, 136437, 137516, 138217, 138540, 138718, 138783, 138718, 138657, 138724, 138992, 139756, 141508, 144346, 147555, 150047, 151228, 151353, 151120, 151017, 150985, 150623, 149716, 148536, 147577, 147089, 147021, 147301, 147858, 148385, 148447, 148006, 147612, 147828, 148613, 149448, 149951, 150191, 150527, 151264, 152361, 153282, 153258, 151983, 150050, 148546, 148148, 148692, 149547, 150191, 150391, 150017, 148897, 146978]
51164A46978k397k191j386n51j97l44p13j207j775j985j277R3R49M07j047k149
51148A31208k260j700r10M7J038J592J453R94P44P33O64M71M30P46J329J837J804
51131A40220R44l70j158q30O4M99K56m0l8j14n23r16j014j122j460j570j014k12
51113A31602J50K12N89J154J173O12L09N58N38k99j108p67M28J186J037Q12J228
51096A39414J869J896J236N31K73L52M18L32J92J71L92Q61J443J850J790J214
51080A54234M41m3J5M21P70P67M01m6j65K58R60J423J432J275J287J498J765K045
51062A68738K221J987J208K79k78l96l67k70R5P68J546K337L133L636L336K203
51046A90176Q76o5o15r64r14j72J000J803J668Q12K7m6M72P58J64r56j562j161
$$ y = [146978, 144581, 142390, 141004, 140453, 140256, 139912, 139199, 137992, 136217, 134232, 132955, 133048, 133997, 134404, 133357, 131208, 128948, 127248, 126338, 126385, 127423, 129015, 130468, 131462, 132206, 132939, 133603, 134074, 134504, 135250, 136579, 138416, 140220, 141164, 140794, 139636, 138806, 138870, 139369, 139625, 139585, 139547, 139433, 138910, 137994, 136980, 135858, 134398, 132828, 131814, 131602, 131752, 131964, 132553, 133707, 134880, 135492, 135801, 136359, 136897, 136598, 135490, 134723, 135151, 136337, 137374, 138186, 139414, 141283, 143179, 144415, 144946, 145219, 145571, 145989, 146321, 146513, 146684, 147076, 147937, 149380, 151230, 153020, 154234, 154675, 154632, 154647, 155068, 155838, 156605, 157006, 156960, 156795, 157053, 158013, 159436, 160868, 162143, 163430, 164928, 166693, 168738, 170959, 172946, 174154, 174433, 174155, 173759, 173392, 173122, 173217, 173985, 175531, 177868, 181001, 184637, 187973, 190176, 191052, 190987, 190372, 189408, 188494, 188322, 189322, 191125, 192793, 193605, 193632, 193586, 194058, 194816, 194980, 194024, 192462, 191301]
51028A91301l82j13m51p83o83k79O4O3m06j098j428j081m70k18k71n4N14P91M10
51009A85426j02j3P08J604K461L321L982M011L326K431J897J827J949K094K447
50994B17369L281M489N546O039O185O554P277P880P984P847P997Q613R485J0359
50980C16905J1023J1312J1457J2175J3917J6153J7952J9305K1300K4755K9155
50969E05409L3270L6485L9152M1883M4920M8109N1110N3601N5579N7432N9451
50958A026401O1171O1498N9691N6088N1686M7103M2236L6851L1114K5282J9281
50947A518402J2993O909J995j260l328m904o078o475n960m748l155j707j281k430
50933A498973m564o556q337j1137j5740k1217k6091l0213l4608l9685m4586m8417
$$ y = [191301, 190919, 190806, 190355, 189572, 188889, 188610, 188674, 188737, 188331, 187233, 185805, 184724, 184254, 184036, 183765, 183711, 184225, 185016, 185426, 185324, 185311, 186019, 187623, 190084, 193405, 197387, 201398, 204724, 207155, 209052, 210879, 212828, 214922, 217369, 220650, 225139, 230685, 236724, 242909, 249463, 256740, 264620, 272604, 280451, 288448, 297061, 306546, 316905, 327928, 339240, 350697, 362872, 376789, 392942, 410894, 430199, 451499, 476254, 505409, 538679, 575164, 614316, 656199, 701119, 749228, 800338, 853939, 909518, 966950, 1026401, 1087572, 1149070, 1208761, 1264849, 1316535, 1363638, 1405874, 1442725, 1473839, 1499121, 1518402, 1531395, 1538304, 1540299, 1539039, 1535711, 1530807, 1524729, 1518254, 1512294, 1507546, 1504391, 1502684, 1501403, 1498973, 1494409, 1487853, 1479516, 1468379, 1452639, 1431422, 1405331, 1375118, 1340510, 1300825, 1256239, 1207822]
50921A207822n1252n3503n4956n5039n3717n1564m9091m6419m3488m0218l6530
50910F72045l2575k8860k5813k3236k0590j7798j5320j3388j1673r940q537p760
50898D56555p116n815l861k148j370j326j397j305j197j281j516j491o33J156
50884D27255L031L891L662L388L844M602M846M600M532M942N679O701Q018R213
50870D98204R856J0376J1642J3581J5104J5740J6392J7994K0178K2093K3957K6804
50858G01921L0907L5403L9591M3834M8929N5135O2197O9889P8099Q6533R4726
50847A347164J02430J09775J16964J23868J29949J34579J37329J37989J36331
50838B476378J31972J24450J13403R8881Q1674O3208M4860K7389J1176l140j4737
$$ y = [1207822, 1156570, 1103067, 1048111, 993072, 939355, 887791, 838700, 792281, 748793, 708575, 672045, 639470, 610610, 584797, 561561, 540971, 523173, 507853, 494465, 482792, 472852, 464315, 456555, 449439, 443624, 439763, 437615, 436245, 434919, 433522, 432217, 431020, 429739, 428223, 426732, 426099, 427255, 430286, 434177, 437839, 441227, 445071, 449673, 454519, 459119, 463651, 468593, 474272, 480973, 488991, 498204, 508060, 518436, 530078, 543659, 558763, 574503, 590895, 608889, 629067, 651160, 675117, 701921, 732828, 768231, 807822, 851656, 900585, 955720, 1017917, 1087806, 1165905, 1252438, 1347164, 1449594, 1559369, 1676333, 1800201, 1930150, 2064729, 2202058, 2340047, 2476378, 2608350, 2732800, 2846203, 2945084, 3026758, 3089966, 3134826, 3162215, 3173391, 3170251, 3155514]
50827C155514k3190k8520l0643k9399k5297j9626j3412o813N9O073R427Q840M040
50814C007053m512j5906k8928m2614n6569p0559q4014r6353j07366j16728j23426
50803B260078j26490j26157j23597j19505j13648j05828r6542q6560p6555o7278
50793A217918n9265n2035m4393l5995k7983k1568j6545j1854p102k796O31L256
50781I42269N123N927N438L867J740l43j882k760l439m647o682r101j1085j2087
50767I12338j2265j2333j2924j3951j4696j4576j3713j2628j1628j0566r048o694
50755G67316l452J45L217N318O936Q953J1653J4440J6496J7562J8082J8679J9564
50742I04909K0507K1399K2648K4757K7599L0608L3800L8116M4375N2168O0075
$$ y = [3155514, 3132324, 3103804, 3073161, 3043762, 3018465, 2998839, 2985427, 2978614, 2978673, 2984746, 2994173, 3003013, 3007053, 3002541, 2986635, 2957707, 2915093, 2858524, 2787965, 2703951, 2607598, 2500232, 2383504, 2260078, 2133588, 2007431, 1883834, 1764329, 1650681, 1544853, 1448311, 1361751, 1285196, 1217918, 1158653, 1106618, 1062225, 1026230, 998247, 976679, 960134, 948280, 941178, 938382, 939013, 942269, 947392, 953319, 958757, 962624, 964364, 964021, 962139, 959379, 955940, 951293, 944611, 935510, 924425, 912338, 900073, 887740, 874816, 860865, 846169, 831593, 817880, 805252, 793624, 783058, 774010, 767316, 763864, 764009, 767226, 772544, 779480, 788433, 800086, 814526, 831022, 848584, 866666, 885345, 904909, 925416, 946815, 969463, 994220, 1021819, 1052427, 1086227, 1124343, 1168718, 1220886, 1280961]
50731A280961O6853P2176P6490Q0398Q4016Q6653Q7224Q5216Q1027P5275O8162
50720B144451N9754N0315L9792K7456J2861k900j7642k9739l8770m4612m6936
50709B154030m5958m2808l8570l3319k6718j9191j1935n925j489J218J897L22
50697A931554l428r247j7127k6883l7787m8640n8233o5772p1006p4031p4953p3719
50685A370728p0344o5198n8947n2247m5478l8795l2293k6029j9971j4037q204
50674I39185k591K603P346J1958J6996K2786K8862L4002L7057L7932L7659L7286
50662A211081L6751L5129L1982K8062K4502K1590J8856J6161J4130J3308J3323
50651A464875J3316J3036J3013J3703J4853J5914J6751J7635J8685J9780K0963
$$ y = [1280961, 1347814, 1419990, 1496480, 1576878, 1660894, 1747547, 1834771, 1919987, 2001014, 2076289, 2144451, 2204205, 2254520, 2294312, 2321768, 2334629, 2331729, 2314087, 2284348, 2245578, 2200966, 2154030, 2108072, 2065264, 2026694, 1993375, 1966657, 1947466, 1935531, 1929606, 1928117, 1929335, 1931232, 1931554, 1928126, 1918879, 1901752, 1874869, 1837082, 1788442, 1730209, 1664437, 1593431, 1519400, 1444447, 1370728, 1300384, 1235186, 1176239, 1123992, 1078514, 1039719, 1007426, 981397, 961426, 947389, 939185, 936594, 939197, 946543, 958501, 975497, 998283, 1027145, 1061147, 1098204, 1136136, 1173795, 1211081, 1247832, 1282961, 1314943, 1343005, 1367507, 1389097, 1407953, 1424114, 1438244, 1451552, 1464875, 1478191, 1491227, 1504240, 1517943, 1532796, 1548710, 1565461, 1583096, 1601781, 1621561, 1642524]
50640A642524K2582K4812K7322K9672L1818L3911L5742L6721L6386L4705L1895
50629A988090K8241K4075J9602J4695R217L560j456n336q207j0163j0840r915
50617B041563p722m837j306L255Q745J4184J8373K0719K1461K1204K0287J8435
50605B174361J5137J0321M532j679q262j5465k3446l2273m1829n1362n9539o5585
50593A904911p0034p3744p6440p7059p5397p2486o9256o5719o1789n7896n4225
50582A150866n0107m5007l9603l5086l1681k8570k5117k1458j7942j4645j1581
50571H30069q830o303l774j251J071L238N478P673R380J0632J2247J4895J8186
50558H92711K1104K3263K5302K8023L1444L4921L7950M0549M2889M4830M6151
$$ y = [1642524, 1665106, 1689918, 1717240, 1746912, 1778730, 1812641, 1848383, 1885104, 1921490, 1956195, 1988090, 2016331, 2040406, 2060008, 2074703, 2083920, 2087480, 2086024, 2080688, 2072481, 2062318, 2051478, 2041563, 2033841, 2029004, 2027698, 2030953, 2039698, 2053882, 2072255, 2092974, 2114435, 2135639, 2155926, 2174361, 2189498, 2199819, 2204351, 2202672, 2194410, 2178945, 2155499, 2123226, 2081397, 2030035, 1970496, 1904911, 1834877, 1761133, 1684693, 1607634, 1532237, 1459751, 1390495, 1324776, 1262987, 1205091, 1150866, 1100759, 1055752, 1016149, 981063, 949382, 920812, 895695, 874237, 856295, 841650, 830069, 821239, 814936, 811162, 809911, 810982, 814220, 819698, 827371, 836751, 847383, 859630, 874525, 892711, 913815, 937078, 962380, 990403, 1021847, 1056768, 1094718, 1135267, 1178156, 1222986, 1269137]
50547A269137M7072M8194M9626N0439M9438M6505M2873L9996L8378L7653L7461
50536A756772L7911L9212M1232M3545M5808M7914M9823N1492N3118N5343N8852
50525B281022O3615O8741P3280P6997Q0153Q2748Q4407Q4840Q3954Q1398P6612
50514C137767O9444O0277M9324L6364K1608O277q421k2569l7031n1793o5571p7117
50502C118559q6025r2029r4373r2535q7037p8829o8307n5532m1235k6749j2959
50491B382949O0J2247K2979L1438L7080L9464L8104L2796K3813J1463m259k3104
50479B605030m3729o3764q0922r4021j03025j08382j10440j09504j06196j01454
50469A683593r6062r0253q3937p7173p0236o3325n6568n0274m4799m0003l5206
$$ y = [1269137, 1316209, 1364403, 1414029, 1464468, 1513906, 1560411, 1603284, 1643280, 1681658, 1719311, 1756772, 1794683, 1833895, 1875127, 1918672, 1964480, 2012394, 2062217, 2113709, 2166827, 2222170, 2281022, 2344637, 2413378, 2486658, 2563655, 2643808, 2726556, 2810963, 2895803, 2979757, 3061155, 3137767, 3207211, 3267488, 3316812, 3353176, 3374784, 3381061, 3372640, 3350071, 3313040, 3261247, 3195676, 3118559, 3032534, 2940505, 2846132, 2753597, 2666560, 2587731, 2519424, 2463892, 2422657, 2395908, 2382949, 2383009, 2395256, 2418235, 2449673, 2486753, 2526217, 2564321, 2597117, 2620930, 2632393, 2628134, 2605030, 2561301, 2497537, 2416615, 2322594, 2219569, 2111187, 2000747, 1891243, 1785047, 1683593, 1587531, 1497278, 1413341, 1336168, 1265932, 1202607, 1146039, 1095765, 1050966, 1010963, 975757]
50458I75757k9919k4450j9522j5509j2208r233o359l492o10K267N004P368R150
50445H78244J0427J1695J3476J5710J7767J9137J9975K0840K2124K3823K5662
50434A078880K7184K8023K8236K8299K8589K9019K9257K9139K8651K7770K6593
50423A389640K5512K4909K4756K4639K4169K3289K2344K1927K2511K4079K6294
50412A654069K9019L2321L5829L8602M0075M0760M1481M2182M2048M0662L8466
50401B075514L5964L2959K8786K3074J6176Q890J711n679j4029k3469l3241m2613
50389B104043n1614o0375o8208p4024p7402p8620p7834p4949p0170o3948n6371
50378A350528m7359l7559k8151j9604j1334k911N107J1866J7061K0674K2408K1895
$$ y = [975757, 945838, 921388, 901866, 886357, 874149, 864916, 858557, 855065, 854455, 856722, 861726, 869094, 878244, 888671, 900366, 913842, 929552, 947319, 966456, 986431, 1007271, 1029395, 1053218, 1078880, 1106064, 1134087, 1162323, 1190622, 1219211, 1248230, 1277487, 1306626, 1335277, 1363047, 1389640, 1415152, 1440061, 1464817, 1489456, 1513625, 1536914, 1559258, 1581185, 1603696, 1627775, 1654069, 1683088, 1715409, 1751238, 1789840, 1829915, 1870675, 1912156, 1954338, 1996386, 2037048, 2075514, 2111478, 2144437, 2173223, 2196297, 2212473, 2221363, 2223074, 2217395, 2203366, 2179897, 2146656, 2104043, 2052429, 1992054, 1923846, 1849822, 1772420, 1693800, 1615966, 1541017, 1470847, 1406899, 1350528, 1303169, 1265610, 1237459, 1217855, 1206521, 1203610, 1208717, 1220583, 1237644, 1258318, 1280726, 1302621]
50366A302621J9022J3750O086l292j2911k1414k8339l3696l7422l9703m1246m2473
50354A080983m2858m1685l9230l6455l3801l1081k8367k6167k4534k2779k0299
50343G33727j7328j4594j2595j1339j0519r718q624p153n321l158q83J055K454
50330F36004L721N347P223Q851J0157J1474J2864J3960J4596J5011J5360J5512
50318G70080J5548J5880J6605J7298J7822J8696K0157K1335K1213K0114J9337
50307I74085J9320J9103J7917J6418J5672J5516J4817J3062J0880Q895O924M573
50295A137182J952o14l081n429p301q418r088r838j0827j2065j3900j6550j9361
50282A022662k1273k2046k2350k2545k2217k1125j9860j9080j8637j8034j7279
$$ y = [1302621, 1321643, 1335393, 1341479, 1338187, 1325276, 1303862, 1275523, 1241827, 1204405, 1164702, 1123456, 1080983, 1038125, 996440, 957210, 920755, 886954, 855873, 827506, 801339, 776805, 754026, 733727, 716399, 701805, 689210, 677871, 667352, 657634, 649010, 641857, 636536, 633378, 632495, 633550, 636004, 639725, 645072, 652295, 661146, 671303, 682777, 695641, 709601, 724197, 739208, 754568, 770080, 785628, 801508, 818113, 835411, 853233, 871929, 892086, 913421, 934634, 954748, 974085, 993405, 1012508, 1030425, 1046843, 1062515, 1078031, 1092848, 1105910, 1116790, 1125685, 1132609, 1137182, 1139134, 1138520, 1135439, 1130010, 1122709, 1114291, 1105203, 1095365, 1084538, 1072473, 1058573, 1042023, 1022662, 1001389, 979343, 956993, 934448, 912231, 891106, 871246, 852166, 833529, 815495, 798216]
50271G98216j6773j6613j6442j5884j4824j3368j1758j0139q367o346m508l459
50259F59735l041k416j280k33L42R41J890K529K193J437J285J717J908J545R82
50244F69534L16o38j603k103k368l030l902m159l817l877m703n392n218m671m476
50229F19893m465m189l875l909l916l270k137j208n92J16Q51J019N99N73J780
50214E97270L814N447O008N930N904N865N197L802K463J859J602Q01p27k371l756
50199F39108n140o616p670p896p659p617p901q163q093p604o786n980n620n733
50185E40630n863n681n357n098m752m237l904m031m278m138l731l604l929m280
50171D77747m127l169j455N01J822K040J520Q87K05p77j902k775l440m224m936
$$ y = [798216, 781443, 764830, 748388, 732504, 717680, 704312, 692554, 682415, 674048, 667702, 663194, 659735, 656694, 654278, 652998, 652765, 653107, 654048, 655938, 658467, 660660, 662097, 663382, 665099, 667007, 668552, 669534, 669850, 669212, 667609, 665506, 663138, 660108, 656206, 652047, 648230, 644353, 639650, 634258, 629040, 624369, 619893, 615428, 611239, 607364, 603455, 599539, 596269, 594132, 592924, 592332, 592448, 593299, 594318, 594917, 595490, 597270, 601084, 606531, 612539, 618469, 624373, 630238, 635435, 639237, 641700, 643559, 645161, 645962, 645235, 642864, 639108, 633968, 627352, 619682, 611786, 604127, 596510, 588609, 580446, 572353, 564749, 557963, 551983, 546363, 540630, 534767, 529086, 523729, 518631, 513879, 509642, 505738, 501707, 497429, 493291, 489560, 485956, 482027, 477747, 473620, 470451, 468996, 469497, 471319, 473359, 474879, 475766, 475971, 475194, 473292, 470517, 467077, 462853, 457917]
50156D57917n015m546m376m886n346m908l774k840k477k286j846j252p92n45m33
50141D12595m14m82n87p05q36r16p55k51M09R08J180J457J860K178K266K471L267
50124D23645M485N355N477N273N288N423N316N175N631O780P816P819O637M916
50110E05036L448K617K272K050J804J752K147K877L506L665L299K652K088J915
50096E41128K136K521K957L576M358M847M646M080L910M371M847M690M052L668
50082E95787M035M952N827O242O281O389O867P519P899P894P891Q295R051R780
50068F94709J0301J0779J1382J2005J2407J2565J2620J2573J2270J1803J1651
50057H25065J2115J2790J3005J2759J2707J3102J3313J2738J1791J1405J1763
$$ y = [457917, 452902, 448356, 443980, 439094, 433748, 428840, 425066, 422226, 419749, 417463, 415617, 414365, 413573, 413028, 412595, 412181, 411699, 411112, 410407, 409571, 408655, 407900, 407649, 408058, 408966, 410146, 411603, 413463, 415641, 417907, 420378, 423645, 428130, 433485, 438962, 444235, 449523, 454946, 460262, 465437, 471068, 477848, 485664, 493483, 500120, 505036, 508484, 511101, 513373, 515423, 517227, 518979, 521126, 524003, 527509, 531174, 534473, 537125, 539213, 541128, 543264, 545785, 548742, 552318, 556676, 561523, 566169, 570249, 574159, 578530, 583377, 588067, 592119, 595787, 599822, 604774, 610601, 616843, 623124, 629513, 636380, 643899, 651798, 659692, 667583, 675878, 684929, 694709, 705010, 715789, 727171, 739176, 751583, 764148, 776768, 789341, 801611, 813414, 825065, 837180, 849970, 862975, 875734, 888441, 901543, 914856, 927594, 939385, 950790, 962553]
50046I62553J2120J1896J1439J1446J2106J3113J4285J5813J7916K0476K3175
50035A126338K5876K8699L1643L4207L5522L4922L2235K7647K1573J4785Q360
50024A421807L276J24q90K1K049M096N573O569O927N684K013l644j0072j6719
50010A426814k3785l0935l6893m0693m2664m3652m3879m3143m1653l9937l8050
49999A001530l5597l2644k9999k8326k7279k5916k3805k1495j9841j9095j8762
49988G18771j8269j7464j6464j5233j3642j1849j0402r758r840j0044r718q684
49976E67404p375o325n495m324k639j145o28r03j126r98j017j421j661j309q59
49961E30179j022j634j943j796j791k257k665k423j755j389j535j671j355q35
$$ y = [962553, 974673, 986569, 998008, 1009454, 1021560, 1034673, 1048958, 1064771, 1082687, 1103163, 1126338, 1152214, 1180913, 1212556, 1246763, 1282285, 1317207, 1349442, 1377089, 1398662, 1413447, 1421807, 1425083, 1425207, 1424317, 1424338, 1426387, 1430483, 1436056, 1442625, 1449552, 1455236, 1457249, 1453605, 1443533, 1426814, 1403029, 1372094, 1335201, 1294508, 1251844, 1208192, 1164313, 1121170, 1079517, 1039580, 1001530, 965933, 933289, 903290, 874964, 847685, 821769, 797964, 776469, 756628, 737533, 718771, 700502, 683038, 666574, 651341, 637699, 625850, 615448, 605690, 595850, 585806, 576088, 567404, 560029, 553704, 548209, 543885, 541246, 540101, 539473, 538570, 537444, 536446, 535429, 534008, 532347, 531038, 530179, 529157, 527523, 525580, 523784, 521993, 519736, 517071, 514648, 512893, 511504, 509969, 508298, 506943, 506108]
49947E06108n86m74J45J429K604K801K202J847K430L657M911O089P482R115J0560
49932E60320J1478J1995J2569J3588J5130J7137J9684K2977K6983L1199L5189
49921G78249L9231M4115N0166N6729O2762O7549P0623P1399O9433O4996N8980
49910A434232N2170M4921L7667L1384K7238K5725K6187K7282K7777K6961K4357
49899A785901J9435J1913K288q302j8850k8899l8183m6249n2697n7488o0751o2469
49887A445649o2673o1847o0668n9447n7990n6059n3676n0955m7894m4484m0911
49876H49045l7526l4666l2383l0319k7940k5062k2049j9367j7112j5163j3587
49865E73871j2457j1446j0103q592p665p634p870p578o777o069n722n532n398
$$ y = [506108, 505522, 505048, 505193, 506622, 509226, 512027, 514229, 516076, 518506, 522163, 527074, 533163, 540645, 549760, 560320, 571798, 583793, 596362, 609950, 625080, 642217, 661901, 684878, 711861, 743060, 778249, 817480, 861595, 911761, 968490, 1031252, 1098801, 1169424, 1240823, 1310256, 1375252, 1434232, 1486402, 1531323, 1568990, 1600374, 1627612, 1653337, 1679524, 1706806, 1734583, 1761544, 1785901, 1805336, 1817249, 1819537, 1811235, 1792385, 1763486, 1725303, 1679054, 1626357, 1568869, 1508118, 1445649, 1382976, 1321129, 1260461, 1201014, 1143024, 1086965, 1033289, 982334, 934440, 889956, 849045, 811519, 776853, 744470, 714151, 686211, 661149, 639100, 619733, 602621, 587458, 573871, 561414, 549968, 539865, 531273, 523608, 515974, 508104, 500526, 493749, 487680, 481958, 476426, 471028]
49852D71028n451n600n447m889m337m059l751l079k372k226k610k860k569k004
49838D19774j590j449j598k029k387k023q61J95K58l46n14J36Q13P81L35K97R17
49821D10709J772K455K914L169L148K944K920L435M455N625O636P487Q363R386
49807D75418J0573J1958J3549J5206J6823J8693K1406K5113K9159L2779L5961
49796G06638L9294M2980M6469M8958M9869M8771M5425M0086L3493K6316J8938
49785A147237J1907O183K625J432K235M456P226R307R454O985J889n393j4107
49772A191436k3306l2110l9894m6199n0665n3133n3646n2275m9213m5076m0694
49761G05225l6420l2057k7615k3722k0862j8643j6329j3808j1561r864q560p485
$$ y = [471028, 465577, 459977, 454530, 449641, 445304, 441245, 437494, 434415, 432043, 429817, 427207, 424347, 421778, 419774, 418184, 416735, 415137, 413108, 410721, 408698, 407837, 408032, 408290, 407944, 407430, 407566, 408379, 409160, 409495, 409792, 410709, 412481, 414936, 417850, 421019, 424167, 427111, 430031, 433466, 437921, 443546, 450182, 457669, 466032, 475418, 485991, 497949, 511498, 526704, 543527, 562220, 583626, 608739, 637898, 670677, 706638, 745932, 788912, 835381, 884339, 934208, 982979, 1028404, 1068490, 1101983, 1128299, 1147237, 1159144, 1165327, 1167952, 1169384, 1171619, 1176075, 1183301, 1192608, 1202062, 1209047, 1210936, 1205543, 1191436, 1168130, 1136020, 1096126, 1049927, 999262, 946129, 892483, 840208, 790995, 745919, 705225, 668805, 636748, 609133, 585411, 564549, 545906, 529577, 515769, 504208, 494344, 485784, 478299]
49749D78299o587n669m534l407k758k625k525k183j912k020k240j990j152l03
49735D38394n4k92k26O33J756K223J986J874K238K275J292k7m71m9J13m83j039
49718D50143p98j43O0l65q77j003p06k56m6k97p29p41j39N99R44R25R62J304J864
49699D50701K319K282J632Q56O67J143J604J570J414J700K298K652K632K608K742
49684D78820K738K390J998J991K382K698K505J894J373J265J315J119O90L39Q2
49669E03599k61m04K37J528K404K194J505J283J477J433J172J294J764J798J142
49654E22165N79P72J286J297P33K13J00K07K32R4j47l59m07l98o65j274j600r41
49636E21887N01J603J551P97M31P79J029M05p22j233o98J37M21K70L79Q74J259
$$ y = [478299, 471712, 466043, 461509, 458102, 455344, 452719, 450194, 448011, 446099, 444079, 441839, 439849, 438697, 438394, 438340, 438048, 437822, 438455, 440211, 442434, 444420, 446294, 448532, 450807, 452099, 452072, 451601, 451552, 451665, 451182, 450143, 449345, 449202, 449262, 448897, 448020, 447017, 446311, 446055, 446009, 445712, 444983, 444242, 444103, 444702, 445646, 446571, 447533, 448837, 450701, 453020, 455302, 456934, 457790, 458457, 459600, 461204, 462774, 464188, 465888, 468186, 470838, 473470, 476078, 478820, 481558, 483948, 485946, 487937, 490319, 493017, 495522, 497416, 498789, 500054, 501369, 502488, 503178, 503517, 503599, 503338, 502934, 503171, 504699, 507103, 509297, 510802, 512085, 513562, 514995, 516167, 517461, 519225, 521023, 522165, 522744, 523516, 524802, 526099, 526832, 527045, 527145, 527352, 527584, 527678, 527531, 527172, 526765, 526367, 525702, 524428, 522828, 521887, 522388, 523991, 525542, 526339, 526770, 527549, 528578, 528983, 528261, 527028, 526330, 526467, 526888, 527158, 527537, 528411, 529670]
49619E29670J432K041L473N008N538M908M045L813M254M941N536N794N468M640
$$ y = [529670, 531102, 533143, 536616, 541624, 547162, 552070, 556115, 559928, 564182, 569123, 574659, 580453, 585921, 590561]
$$ [...]
##END NTUPLES=NMR SPECTRUM
##END=
