
##TITLE=AC1203_CTOAH12045_5946457_1FB8grXUvw
##JCAMPDX= 6.0         $$ Bruker NMR JCAMP-DX V2.0
##DATA TYPE= NMR SPECTRUM
##DATA CLASS= NTUPLES
##ORIGIN= BRUKER
##OWNER= Administrator
$$ 1.72 TOPSPIN		Version 2.1
$$ 2012-04-10 23:20:28.015 -0500  Administrator@TOPSPIN
$$ Compression mode = diff/dup
##.OBSERVE FREQUENCY= 400.13188235
##.OBSERVE NUCLEUS= ^1H
##.ACQUISITION MODE= SIMULTANEOUS (DQD)
##.ACQUISITION SCHEME= undefined
##.AVERAGES= 64
##.DIGITISER RES= 22
##SPECTROMETER/DATA SYSTEM= spect
##.PULSE SEQUENCE= noesygpps1d.comp
##.SOLVENT NAME= COFFEE_meoh
##.SHIFT REFERENCE= INTERNAL, COFFEE_meoh, 1, 14.9684
##AUDIT TRAIL= $$ (NUMBER, WHEN, WHO, WHERE, PROCESS, VERSION, WHAT)
$$ ##TITLE= Audit trail, TOPSPIN		Version 2.1
$$ ##JCAMPDX= 5.01
$$ ##ORIGIN= Bruker BioSpin GmbH
$$ ##OWNER= Administrator
$$ $$ C:\Bruker\TOPSPIN/data/COFFEE/nmr/AC1203_CTOAH12045_5946457_1FB8grXUvw/12/pdata/1/auditp.txt
$$ ##AUDIT TRAIL=  $$ (NUMBER, WHEN, WHO, WHERE, PROCESS, VERSION, WHAT)
(   1,<2012-04-10 23:20:22.937 -0500>,<Administrator>,<TOPSPIN>,<go>,<TOPSPIN 2.1>,
      <created by zg
	started at 2012-04-10 23:08:51.328 -0500,
	POWCHK enabled, PULCHK disabled,
       configuration hash MD5:
       1A 1E CE 29 27 FD 77 03 67 4E F0 E3 C4 B2 CB 90
       data hash MD5: 64K
       33 2A 64 79 43 46 6A 8B 59 B0 16 33 03 AB DC 6F>)
(   2,<2012-04-10 23:20:25.703 -0500>,<Administrator>,<TOPSPIN>,<proc1d>,<TOPSPIN 2.1>,
      <Start of raw data processing
       efp LB = 0.3 FT_mod = 6 PKNL = 1 PHC0 = 0 PHC1 = 0 SI = 128K 
       data hash MD5: 128K
       17 7E 29 7E 73 73 32 81 E2 B7 1D 6C A9 82 7B F7>)
(   3,<2012-04-10 23:20:27.343 -0500>,<Administrator>,<TOPSPIN>,<proc1d>,<TOPSPIN 2.1>,
      <pk PHC0 = 31.79993 PHC1 = 0 
       data hash MD5: 128K
       01 4E A1 B8 CE 9B 55 4F FD EA 59 BF AE 45 E8 66>)
(   4,<2012-04-10 23:20:27.687 -0500>,<Administrator>,<TOPSPIN>,<proc1d>,<TOPSPIN 2.1>,
      <abs ABSG = 1 
       data hash MD5: 128K
       DD FE 01 BF FB 73 5B 79 7B F0 A0 97 FB EA C0 F7>)
(   5,<2012-04-10 23:20:27.781 -0500>,<Administrator>,<TOPSPIN>,<proc1d>,<TOPSPIN 2.1>,
      <abs ABSG = 2 
       data hash MD5: 128K
       52 A0 84 B4 7F 62 C3 C4 D5 A0 57 52 EC BE EB 44>)
(   6,<2012-04-10 23:20:27.828 -0500>,<Administrator>,<TOPSPIN>,<proc1d>,<TOPSPIN 2.1>,
      <abs ABSG = 3 
       data hash MD5: 128K
       F0 A3 E9 AC 04 68 DE AB BC 34 C6 ED 6A 8D 95 AD>)
(   7,<2012-04-10 23:20:27.890 -0500>,<Administrator>,<TOPSPIN>,<proc1d>,<TOPSPIN 2.1>,
      <abs ABSG = 4 
       data hash MD5: 128K
       D8 95 9F C6 65 DD EF C0 FB 6C 58 43 2F 3A 3F 46>)
(   8,<2012-04-10 23:20:27.937 -0500>,<Administrator>,<TOPSPIN>,<proc1d>,<TOPSPIN 2.1>,
      <abs ABSG = 5 
       data hash MD5: 128K
       60 0E AF 6B C9 B3 40 6A 49 99 52 E2 42 CB 65 B3>)
$$ ##END=
$$ 
$$ $$ hash MD5
$$ $$ 40 54 D2 D5 77 BD EC 39 6B 5B 71 48 B2 26 2C 4E
##$RELAX= 
##$RELAX= 
##$RELAX= 
##$RELAX= 
##$RELAX= 
##$RELAX= 
##$RELAX= 
##$RELAX= 
$$ Bruker specific parameters
$$ [...]
##$TP07= 0
##$TPNAME0= <>
##$TPNAME1= <>
##$TPNAME2= <>
##$TPNAME3= <>
##$TPNAME4= <>
##$TPNAME5= <>
##$TPNAME6= <>
##$TPNAME7= <>
##$TPOAL= (0..7)
0.5 0.5 0.5 0.5 0.5 0.5 0.5 0.5
##$TPOFFS= (0..7)
0 0 0 0 0 0 0 0
##$TUNHIN= 0
##$TUNHOUT= 0
##$TUNXOUT= 0
##$USERA1= <user>
##$USERA2= <user>
##$USERA3= <user>
##$USERA4= <user>
##$USERA5= <user>
##$V9= 5
##$VALIST= <valist>
##$VCLIST= <CCCCCCCCCCCCCCC>
##$VD= 0
##$VDLIST= <DDDDDDDDDDDDDDD>
##$VPLIST= <PPPPPPPPPPPPPPP>
##$VTLIST= <TTTTTTTTTTTTTTT>
##$WBST= 1024
##$WBSW= 4
##$XGAIN= (0..3)
0 0 0 0
##$XL= 0
##$YL= 0
##$YMAX_a= 13636303
##$YMIN_a= -5736213
##$ZGOPTNS= <>
##$ZL1= 120
##$ZL2= 120
##$ZL3= 120
##$ZL4= 120
##$ABSF1= 14.9684
##$ABSF2= -5.58413
##$ABSG= 5
##$ABSL= 3
##$ALPHA= 0
##$AQORDER= 0
##$ASSFAC= 0
##$ASSFACI= 0
##$ASSFACX= 0
##$ASSWID= 0
##$AUNMP= <proc_prof1d_extract.lims>
##$AXLEFT= 0
##$AXNAME= <>
##$AXNUC= <1H>
##$AXRIGHT= 0
##$AXTYPE= 0
##$AXUNIT= <>
##$AZFE= 0.1
##$AZFW= 0.1
##$BCFW= 0
##$BC_mod= 0
##$BYTORDP= 0
##$COROFFS= 0
##$CY= 15
##$DATMOD= 1
##$DC= 0
##$DFILT= <>
##$DTYPP= 0
##$F1P= 0
##$F2P= 0
##$FCOR= 0.5
##$FTSIZE= 131072
##$FT_mod= 6
##$GAMMA= 0
##$GB= 0
##$INTBC= 1
##$INTSCL= 1
##$ISEN= 128
##$LB= 0.3
##$LEV0= 0
##$LPBIN= 0
##$MAXI= 10000
##$MC2= 0
##$MEAN= 0
##$ME_mod= 0
##$MI= 0
##$NCOEF= 0
##$NC_proc= -3
##$NLEV= 6
##$NOISF1= 0
##$NOISF2= 0
##$NSP= 0
##$NTH_PI= 0
##$NZP= 0
##$OFFSET= 14.9684
##$PC= 1
##$PHC0= 31.79993
##$PHC1= 0
##$PH_mod= 1
##$PKNL= yes
##$PPARMOD= 0
##$PPDIAG= 0
##$PPIPTYP= 0
##$PPMPNUM= 2147483647
##$PPRESOL= 1
##$PSCAL= 4
##$PSIGN= 0
##$PYNMP= <proc.py>
##$REVERSE= no
##$SF= 400.130004887603
##$SI= 131072
##$SIGF1= 0
##$SIGF2= 0
##$SINO= 400
##$SIOLD= 131072
##$SPECTYP= <>
##$SREGLST= <1H.CDCl3>
##$SSB= 0
##$STSI= 131072
##$STSR= 0
##$SW_p= 8223.68421052632
##$SYMM= 0
##$S_DEV= 0
##$TDeff= 65536
##$TDoff= 0
##$TI= <>
##$TILT= no
##$TM1= 0
##$TM2= 0
##$TOPLEV= 0
##$USERP1= <user>
##$USERP2= <user>
##$USERP3= <user>
##$USERP4= <user>
##$USERP5= <user>
##$WDW= 1
##$XDIM= 131072
##$YMAX_p= 512769581
##$YMIN_p= -310848070
##$CURPLOT= <Network HP LaserJet P1505>
##$CURPRIN= <$Network HP LaserJet P1505>
##$DFORMAT= <normdp>
##$LAYOUT= <+/1D_H.xwp>
##$LFORMAT= <normlp>
##$PFORMAT= <normpl>
##$SURQMSG= 1
$$ End of Bruker specific parameters
$$ ---------------------------------
##NTUPLES= NMR SPECTRUM
##VAR_NAME=  FREQUENCY,     SPECTRUM/REAL,   SPECTRUM/IMAG
##SYMBOL=    X,             R,               I
##VAR_TYPE=  INDEPENDENT,   DEPENDENT,       DEPENDENT
##VAR_FORM=  AFFN,          ASDF,            ASDF
##VAR_DIM=   131072,        131072,          131072
##UNITS=     HZ,            ARBITRARY UNITS, ARBITRARY UNITS
##FACTOR=    0.0627417313425165, 1,          1
##FIRST=     8223.62146879498, -5482,        -89955
##LAST=      0,             -2366,           -92781
##MIN=       0,             -310848070,      0
##MAX=       8223.62146879498, 512769581,    0
$$ Real data points
##PAGE= N=1
##DATA TABLE= (X++(R..R)), XYDATA
$$ [...]
60662A787645r862j0317q675o669n872n804n333m484l764k767q49J340K170P98
60648A727557k072n042p106q104q420q346p851p192p255q597j0418j1373j1178
60635A624603j0406r082o910m735m081m976n764n463m731m097l097j918k029l972
60621A553342o188p293q042r672j1725j3174j4419j6351j8349j9103j8705j8207
60609A392114j7676j6440j4833j3857j3259j1696q912o282m957m650m453l841
60597A271258k823j849j499j606j213j72O7j347k570r93L029O264O443M369K075
60582A279433P40P40J945L226L149J957J584L039N148O628Q012J0247J2581J3330
60568A351759J2285J1066J1180J2698J4776J6736J8594K0939K4192K7845L0819
$$ plain form
60662 1787645 1777783 1767466 1758791 1752122 1746250 1740446 1735113 1730629 1726865 1724098 1723249 1724589 1726759 1727557
60648 1727557 1725485 1720443 1713337 1705233 1696813 1688467 1680616 1673424 1666169 1657572 1647154 1635781 1624603
60635 1624603 1614197 1605115 1598205 1593470 1589389 1584413 1578649 1573186 1568455 1564358 1561261 1559343 1557314 1553342
60621 1553342 1547154 1539861 1531819 1522147 1510422 1497248 1482829 1466478 1448129 1429026 1410321 1392114
60609 1392114 1374438 1357998 1343165 1329308 1316049 1304353 1295441 1289159 1284202 1279552 1275099 1271258
60597 1271258 1268435 1266586 1265087 1263481 1262268 1262096 1262163 1260816 1258246 1257253 1260282 1266546 1272989 1277358 1279433
60582 1279433 1280173 1280913 1282858 1286084 1289233 1291190 1292774 1295813 1300961 1307589 1315601 1325848 1338429 1351759
60568 1351759 1364044 1375110 1386290 1398988 1413764 1430500 1449094 1470033 1494225 1522070 1552889
60557A552889L2827L4806L7511M0164M1322M0753L9712L9324L9416L9016L7463
60546A975203L4619L0390K4588J7389R488J512o475j4421k1489k6551k9579l1708
60534A962966l3505l4066l2640l0293k8685k7673k5599k1951j8240j5827j4250
60523A680237j2517j0937j0578j1474j2441j2420j1292r607q169p693q085q129
60511A556895o631l994j901j173o48J298M581P610R421J0618J2054J3570J4743
60498A616443J6050J8161K0533K1910K2236K2761K4126K5668K7024K8934L1585
60487A875431L3707L4567L5658L8723M2926M5879M7036M8103N0160N2324N3580
60476B358094N3933N2983M8999M0652K8746J5255J486j1900k3855l3048l8649
$$ plain form
60557 1552889 1585716 1620522 1658033 1698197 1739519 1780272 1819984 1859308 1898724 1937740 1975203
60546 1975203 2009822 2040212 2064800 2082189 2091677 2093189 2086714 2072293 2050804 2024253 1994674 1962966
60534 1962966 1929461 1895395 1862755 1832462 1803777 1776104 1750505 1728554 1710314 1694487 1680237
60523 1680237 1667720 1656783 1646205 1634731 1622290 1609870 1598578 1588971 1580802 1573109 1565024 1556895
60511 1556895 1550264 1546270 1544369 1543196 1542548 1543846 1548427 1556037 1565458 1576076 1588130 1601700 1616443
60498 1616443 1632493 1650654 1671187 1693097 1715333 1738094 1762220 1787888 1814912 1843846 1875431
60487 1875431 1909138 1943705 1979363 2018086 2061012 2106891 2153927 2202030 2252190 2304514 2358094
60476 2358094 2412027 2465010 2514009 2554661 2583407 2598662 2600148 2588248 2564393 2531345 2492696
60465B492696m0406l8462l3729k7889k2133j6158r043p97P488J4753K0654K5442
60453B372416K9651L3629L6959L8793L9361M0720M5137N2831O2024P1236Q0813
60442B903570R2160J06104J22402J40407J59750J80428K02596K26417K51979K79089
60432D664902L07067L35020L62575L90118M18030M45893M72629M96430N13067
60423H405731N14312M89976M33186L43915K27532R1368n6021k03341l37006m44993
60413I464659n20837n64549n80625n75244n54275n22625m84640m44388m04934
60404D812542l67506l32053k98657k67845k39540k12771j87151j64081j45526
60395B597412j31659j20386j09304r7650q6228p6136o7965o1803n7246n3339m9049
$$ plain form
60465 2492696 2452290 2413828 2380099 2352210 2330077 2313919 2304876 2304079 2311567 2326320 2346974 2372416
60453 2372416 2402067 2435696 2472655 2511448 2550809 2591529 2636666 2689497 2751521 2822757 2903570
60442 2903570 2995730 3101834 3224236 3364643 3524393 3704821 3907417 4133834 4385813 4664902
60432 4664902 4971969 5306989 5669564 6059682 6477712 6923605 7396234 7892664 8405731
60423 8405731 8920043 9410019 9843205 10187120 10414652 10506020 10449999 10246658 9909652 9464659
60413 9464659 8943822 8379273 7798648 7223404 6669129 6146504 5661864 5217476 4812542
60404 4812542 4445036 4112983 3814326 3546481 3306941 3094170 2907019 2742938 2597412
60395 2597412 2465753 2345367 2236063 2138413 2052185 1976049 1908084 1846281 1789035 1735696 1686647
60384A686647m4192l9774l7054l6105l5463l3519l0310k7581k6720k6958k6181
60373A322790k3547k0410j8394j7376j6152j4344j2620j1310j0021q594p372o390
60361A156260n320m389m201m349l566j803q13j590k513j387J551M208N537O272
60347A143897P017P345O849N760M253K473J389K272M845P174P971P994Q509R360
60333A227108R422Q387P213O957P579P849O530M060K639L727N750N624K719l72
60319A305192j549j888l347n415n997m774l628l713l984l061j120P30J914K468
60305A271828K400J822J323J529K315K953K965K635K656L478M989O686Q148R278
60291A325005J0208J1122J2241J3614J4696J4489J2670J0373R176R224Q964P030
$$ plain form
60384 1686647 1642455 1602681 1565627 1529522 1494059 1460540 1430230 1402649 1375929 1348971 1322790
60373 1322790 1299243 1278833 1260439 1243063 1226911 1212567 1199947 1188637 1178616 1170022 1162650 1156260
60361 1156260 1150940 1146551 1142350 1138001 1134435 1132632 1131819 1130229 1127716 1126329 1127880 1132088 1137625 1143897
60347 1143897 1150914 1158259 1165108 1170868 1175121 1177594 1178983 1181255 1186100 1193274 1201245 1209239 1217748 1227108
60333 1227108 1236530 1244917 1252130 1259087 1266666 1274515 1281045 1285105 1287744 1291471 1297221 1302845 1305564 1305192
60319 1305192 1303643 1301755 1298408 1292993 1286996 1282222 1278594 1274881 1270897 1267836 1266716 1267446 1269360 1271828
60305 1271828 1274228 1276050 1277373 1278902 1281217 1284170 1287135 1289770 1292426 1295904 1300893 1307579 1315727 1325005
60291 1325005 1335213 1346335 1358576 1372190 1386886 1401375 1414045 1424418 1433594 1442818 1451782 1458812
60279A458812L916J308K64N90J565K489K606J518J19K69K861O538Q932Q990P481
60264A508258N679M275L411K836J822k90l232o020q134r758j0819j0713r382p770
60250A460163o640n750m757m042l824l238j356J318L283L683K810J467O08J072
60236A444797K749M348M786M389L939L337K351J991L510O292Q276Q520Q033Q124
60222A515442R210J1127J3192J3999J2690J0613J0129J1634J3371J4363J5548
60211A651318J7413J8691J8632J8792K0868K4018K6069K6670K7577L0197L4159
60200A914404L8352M2325M6410N0960N5672N9733O2974O6542P1759P8543Q5951
60189B573625R3844J02568J11187J18206J24398J32636J43966J55963J66153J74944
$$ plain form
60279 1458812 1462728 1464036 1464300 1464890 1466455 1468944 1471550 1473068 1473187 1473456 1476317 1482855 1491787 1500777 1508258
60264 1508258 1513937 1518212 1521623 1524459 1526281 1525991 1522759 1516739 1508605 1498847 1488028 1477315 1467933 1460163
60250 1460163 1453523 1447773 1443016 1438974 1435150 1431912 1430556 1431874 1435157 1438840 1441650 1443117 1443725 1444797
60236 1444797 1447546 1451894 1456680 1461069 1465008 1468345 1470696 1472687 1476197 1482489 1490765 1499285 1507318 1515442
60222 1515442 1524652 1535779 1548971 1562970 1575660 1586273 1596402 1608036 1621407 1635770 1651318
60211 1651318 1668731 1687422 1706054 1724846 1745714 1769732 1795801 1822471 1850048 1880245 1914404
60200 1914404 1952756 1995081 2041491 2092451 2148123 2207856 2270830 2337372 2409131 2487674 2573625
60189 2573625 2667469 2770037 2881224 2999430 3123828 3256464 3400430 3556393 3722546 3897490
60179C897490J83428J90463J94261J95255J94845J92375J86009J75940J64094
60170E574160J50951J35169J16497R6723P7398N8496L9710K1272L341j3693k8073
60159F231951l7755m3023m6162m7979m6546m0138k9729j7581m862Q352K2071L6568
60147E985167N2525O9998Q7893J05146J21547J36897J50558J62349J72593J80309
60137G224982J82935J79045J70223J58733J44381J25416J01896P6243N0496K4657
60127H439007j941k8825n4457p7204r6018j10720j21813j29356j32139j28820
60117G557714j19864j07382r2858p5984n6321l5086j4303N324K4681M4537O4508
60106G194966Q3738J01588J16941J27692J32025J30141J23850J14459J01959Q6473
$$ plain form
60179 3897490 4080918 4271381 4465642 4660897 4855742 5048117 5234126 5410066 5574160
60170 5574160 5725111 5860280 5976777 6073500 6150898 6209394 6249104 6270376 6273717 6260024 6231951
60159 6231951 6194196 6151173 6105011 6057032 6010486 5970348 5940619 5923038 5918176 5926528 5948599 5985167
60147 5985167 6037692 6107690 6195583 6300729 6422276 6559173 6709731 6872080 7044673 7224982
60137 7224982 7407917 7586962 7757185 7915918 8060299 8185715 8287611 8363854 8414350 8439007
60127 8439007 8437066 8408241 8353784 8276580 8180562 8069842 7948029 7818673 7686534 7557714
60117 7557714 7437850 7330468 7237610 7161626 7105305 7070219 7055916 7061240 7085921 7130458 7194966
60106 7194966 7278704 7380292 7497233 7624925 7756950 7887091 8010941 8125400 8227359 8313832
60096H313832O9274N1605L3512J5214j035j2136j7395j9136j9389j7150r831L404
60084H390769K0858M0516O1979Q6101J13326J42684J72278K00913K29407K59956
60074I718787K93766L29483L64440L97281M28856M60565M92278N21958N46867
60065A3554281N64891N75045N77134N71054N56399N32663M99792M58388M09349
60056A8298996L53403K91118K23357J51524P7120J170p5477j51157k23249k89454
60046A8657351l48794m00524m42402m71118m84945m85292m75169m56731m30680
60037A4661696l97413l57769l12894k64164k13353j62428j13039o6406k3468J5365
60027A2766127N0307Q1310J06990J25105J34391J35336J29003J15672R5153O8058
$$ plain form
60096 8313832 8383106 8434711 8468223 8483437 8482402 8470266 8452871 8433735 8414346 8397196 8387365 8390769
60084 8390769 8411627 8452143 8514122 8600223 8713549 8856233 9028511 9229424 9458831 9718787
60074 9718787 10012553 10342036 10706476 11103757 11532613 11993178 12485456 13007414 13554281
60065 13554281 14119172 14694217 15271351 15842405 16398804 16931467 17431259 17889647 18298996
60056 18298996 18652399 18943517 19166874 19318398 19395518 19396688 19321211 19170054 18946805 18657351
60046 18657351 18308557 17908033 17465631 16994513 16509568 16024276 15549107 15092376 14661696
60037 14661696 14264283 13906514 13593620 13329456 13116103 12953675 12840636 12774230 12750762 12766127
60027 12766127 12816434 12897744 13004734 13129839 13264230 13399566 13528569 13644241 13739394 13807452
60017A3807452L6173J675l3667o8682j02564j34541j63774j89783k13034k34520
60007A2704735k54276k70736k82094k88012k89417k86836k79814k67997k51882
59998A0233671k32270k09629j84410j57270j28616r8533o7618l7201q175J9888
59988I129837M7684P4722R9743J22109J41777J58027J69308J74514J73536J66449
59978A0457706J53059J33728J09820Q2654N2374J8587j8025n5150r0062j21302
59968A0723389j49118j74204j95998k12445k21649k23468k19256k10377j97500
59959H919374j81027j61447j39309j15322r0470o5457m0169j4147J2648M0038
59949H164712O8138R6702J24445J50139J74217J97957K21098K41552K57539K68449
$$ plain form
60017 13807452 13843625 13845300 13811633 13742951 13640387 13505846 13342072 13152289 12939255 12704735
60007 12704735 12450459 12179723 11897629 11609617 11320200 11033364 10753550 10485553 10233671
59998 10233671 10001401 9791772 9607362 9450092 9321476 9222943 9155325 9118124 9109949 9129837
59988 9129837 9177521 9252243 9351986 9474095 9615872 9773899 9943207 10117721 10291257 10457706
59978 10457706 10610765 10744493 10854313 10936967 10989341 11007928 10989903 10934753 10844691 10723389
59968 10723389 10574271 10400067 10204069 9991624 9769975 9546507 9327251 9116874 8919374
59959 8919374 8738347 8576900 8437591 8322269 8231799 8166342 8126173 8112026 8124674 8164712
59949 8164712 8232850 8329552 8453997 8604136 8778353 8976310 9197408 9438960 9696499 9964948
59939I964948K73272K70035K57842K38151K13012J83128J48662J10816P1246L0659
59929A1761771j0791n2156r1816j28465j61144j88701k10015k24176k30015k26584
59919A0237908k15055j98909j80746j59670j33472j02809p1304m1659j3449J4913
59909I135748M3534P0987R5844J17594J36521J53053J66963J77292J83177J84352
59899A0465065J80568J71532J58221J43323J29087J15385J01158Q6973P4546O4353
59889A1690211N5702M9050M6371M9046N7100P0663R0433J16086J45983J79116
59879A2549761K15909K56525K99821L44707L90964M37807M82884N23827N59595
59870A6061800N89202O10061O18715O12420N89128N46827M84234M01859L01798
$$ plain form
59939 9964948 10238220 10508255 10766097 11004248 11217260 11400388 11549050 11659866 11731112 11761771
59929 11761771 11750980 11698824 11607008 11478543 11317399 11128698 10918683 10694507 10464492 10237908
59919 10237908 10022853 9823944 9643198 9483528 9350056 9247247 9175943 9134284 9120835 9135748
59909 9135748 9179282 9250269 9346113 9463707 9600228 9753281 9920244 10097536 10280713 10465065
59899 10465065 10645633 10817165 10975386 11118709 11247796 11363181 11464339 11551312 11625858 11690211
59889 11690211 11745913 11794963 11841334 11890380 11947480 12018143 12108576 12224662 12370645 12549761
59879 12549761 12765670 13022195 13322016 13666723 14057687 14495494 14978378 15502205 16061800
59870 16061800 16651002 17261063 17879778 18492198 19081326 19628153 20112387 20514246 20816044
59861B0816044J87353O3719o1902j82305k92394l88835m68625n29347n70426n93000
59851A7980282n98693n89443n67962n37100m98653m53861m04818l54054l02626
59842A3673072k49991j96354j43789r4092m6472J100M8465R2568J30519J62206
59832A3377232J88877K09829K21981K22789K12210J91007J58387J12859N5156
59823A4950327j1067q1466j52767k22112k86264l42516l89684m27306m54392m69840
59813A2112913m73851m68166m55059m36595m14563l90221l63981l35845l06381
59804H468251k76942k48826k22515j97907j74943j53912j35352j19946j08346
59795F829562j00616r5624r1379q6501q1338p7182p4334p1468o7104o1043n4111
$$ plain form
59861 20816044 21003397 21067116 21005214 20822909 20530515 20141680 19673055 19143708 18573282 17980282
59851 17980282 17381589 16792146 16224184 15687084 15188431 14734570 14329752 13975698 13673072
59842 13673072 13423081 13226727 13082938 12988846 12942374 12943474 12991939 13084507 13215026 13377232
59832 13377232 13566109 13775938 13997919 14220708 14432918 14623925 14782312 14895171 14950327
59823 14950327 14939260 14857794 14705027 14482915 14196651 13854135 13464451 13037145 12582753 12112913
59813 12112913 11639062 11170896 10715837 10279242 9864679 9474458 9110477 8774632 8468251
59804 8468251 8191309 7942483 7719968 7522061 7347118 7193206 7057854 6937908 6829562
59795 6829562 6728946 6633322 6541943 6455442 6374104 6296922 6222588 6151120 6084016 6022973 5968862
59784E968862m7231m1338l7498l6271l7218l9711m3786m9512n6076o2370o7870
59773E449981p1935p2971o9867o3954n7784n1956m4901l6052k7243k0184j4273
59762D918861q117j644M686J1603K0306L0575M1007N0728N9651O7388P3308P7708
59750E346060Q1733Q5900Q9500R1721R2654R2742R1653Q8157Q1289P1687O1576
59739F274672N3034M6365M0670L5947L3651L4836L8876M4774N2926O4445P9254
59728F799450R6039J14159J34493J58189J85152K14156K44048K74760L07269L42585
59718H870300L80519M19419M57113M91777N21623N43936N54410N46954N14235
59709A3300286M49897L52470K28270R0454m5324j65562k61406l29028l68985l85069
$$ plain form
59784 5968862 5921631 5880293 5842795 5806524 5769306 5729595 5685809 5636297 5580221 5517851 5449981
59773 5449981 5378046 5305075 5235208 5171254 5113470 5061514 5016613 4980561 4953318 4933134 4918861
59762 4918861 4910744 4909100 4913786 4925389 4945695 4976270 5017277 5068005 5127656 5195044 5268352 5346060
59750 5346060 5427793 5513693 5603193 5694914 5787568 5880310 5971963 6060120 6141409 6213096 6274672
59739 6274672 6327706 6374071 6414741 6450688 6484339 6519175 6558051 6602825 6655751 6720196 6799450
59728 6799450 6895489 7009648 7144141 7302330 7487482 7701638 7945686 8220446 8527715 8870300
59718 8870300 9250819 9670238 10127351 10619128 11140751 11684687 12239097 12786051 13300286
59709 13300286 13750183 14102653 14330923 14421377 14376053 14210491 13949085 13620057 13251072 12866003
59699A2866003l82791l67630l43565l12749k76512k36507j94792j53121j12705
59690A0485631p4430l8554m188L0028O4330R7595J28991J59297J90107K22243
59680A1261050K55403K89020L23002L57878L94517M33415M74260N16537N60550
59671A4865632O07195O56658P08231P61527Q16820Q73604R29923R84038J035789
59662B2239417J085079J129448J164383J185959J192353J183159J158882J121887
59654C1460567J076967J030109R86522R49896R22820R07019R02795R08502R20915
59645D0066112R36058R49442R55734R49143R24905Q80286Q14094P26123O18003
59636D7819900M94265L61445K26182R4850k5641j28297k07930k61952k89524k91145
$$ plain form
59699 12866003 12483212 12115582 11772017 11459268 11182756 10946249 10751457 10598336 10485631
59690 10485631 10411201 10372647 10368459 10398487 10462817 10560412 10689403 10848700 11038807 11261050
59680 11261050 11516453 11805473 12128475 12486353 12880870 13314285 13788545 14305082 14865632
59671 14865632 15472827 16129485 16837716 17599243 18416063 19289667 20219590 21203628 22239417
59662 22239417 23324496 24453944 25618327 26804286 27996639 29179798 30338680 31460567
59654 31460567 32537534 33567643 34554165 35504061 36426881 37333900 38236695 39145197 40066112
59645 40066112 41002170 41951612 42907346 43856489 44781394 45661680 46475774 47201897 47819900
59636 47819900 48314165 48675610 48901792 48996642 48971001 48842704 48634774 48372822 48083298 47792153
59626D7792153k69069k26547j65927q8241N235J12214K30302L57110M89042O21806
59616D8858078P52947Q82078J007207J122113J218707J290507J331953J335323
59608E7798913J290794J189918J028315Q06035N27963K04905j46592n06452q53794
59599F1340005j169250j437176j647299j795278j882553j915644j903946j856739
59591D7732120j782453j690724j593313j501498j423690j366820j337986j341166
59583C5694470j371664j415898j457803j485253j491807j475626j438510j384588
59575B4173321j318156j242526j160858j076980r94598r16064q42146p72534p06430
59566A5143029o43427n84310n30536m82671m39672l99867l62337l27235k95198
$$ plain form
59626 47792153 47523084 47296537 47130610 47042369 47047604 47159818 47390120 47747230 48236272 48858078
59616 48858078 49611025 50493103 51500310 52622423 53841130 55131637 56463590 57798913
59608 57798913 59089707 60279625 61307940 62113975 62641938 62846843 62700251 62193799 61340005
59599 61340005 60170755 58733579 57086280 55291002 53408449 51492805 49588859 47732120
59591 47732120 45949667 44258943 42665630 41164132 39740442 38373622 37035636 35694470
59583 35694470 34322806 32906908 31449105 29963852 28472045 26996419 25557909 24173321
59575 24173321 22855165 21612639 20451781 19374801 18380203 17464139 16621993 15849459 15143029
59566 15143029 14499602 13915292 13384756 12902085 12462413 12062546 11700209 11372974 11077776
59557A1077776k66550k40923k17616j96458j78165j63588j52970j46104j42800
59548I372602j42673j44871j48530j53250j58793j64632j70060j74198j75735
59539G939860j73574j68187j61408j54189j45607j34886j23189j12144j01514
59530F665162q9939p7263o4563n2323m0246k8611j8180q813M10R617J7987K5232
59518F338470L2009L8813M5584N2245N8577O3815O7685P1478P6704Q2945Q8830
59507G017155R4905J03452J15195J28290J41202J54693J70015J86824K04112K21913
59497H537756K40902K61285K82872L05452L28359L50757L72921L96031M19813
59488A1496148M41610M58820M71172M79502M83493M82037M74995M62981M45927
$$ plain form
59557 11077776 10811226 10570303 10352687 10156229 9978064 9814476 9661506 9515402 9372602
59548 9372602 9229929 9085058 8936528 8783278 8624485 8459853 8289793 8115595 7939860
59539 7939860 7766286 7598099 7436691 7282502 7136895 7002009 6878820 6766676 6665162
59530 6665162 6575223 6497960 6433397 6381074 6340828 6312217 6294037 6285224 6285634 6295251 6313238 6338470
59518 6338470 6370479 6409292 6454876 6507121 6565698 6629513 6697198 6768676 6845380 6928325 7017155
59507 7017155 7112060 7215512 7330707 7458997 7600199 7754892 7924907 8111731 8315843 8537756
59497 8537756 8778658 9039943 9322815 9628267 9956626 10307383 10680304 11076335 11496148
59488 11496148 11937758 12396578 12867750 13347252 13830745 14312782 14787777 15250758 15696685
59479A5696685M23518L96707L67194L35240K99483K59547K17928J78696J44801
59470A8319799J16983R4647P7173O4530N7111N5272N9054O8320Q2706J01012J20527
59459A9217134J37278J47252J47510J36257J12191P4318K2749m0433j11700j87705
59449A9654851k66015l44176m18736m85829n42540n87206o18857o37181o42943
59440A5111368o37563o22090n97234n64483n26607m86506m45846m05026l64263
59431A0461750l24254k85754k48807k12894j78027j45190j15097q6795n8388k9047
59421H777497N80K9941N9296Q8531J16667J43279J69278J95444K21349K46541
59411A0048403K71444K95824L17653L34891L47178L54268L54048L44126L24270
$$ plain form
59479 15696685 16120203 16516910 16884104 17219344 17518827 17778374 17996302 18174998 18319799
59470 18319799 18436782 18531429 18608602 18673132 18730243 18785515 18844569 18912889 18995595 19096607 19217134
59459 19217134 19354412 19501664 19649174 19785431 19897622 19971940 19994689 19954256 19842556 19654851
59449 19654851 19388836 19044660 18625924 18140095 17597555 17010349 16391492 15754311 15111368
59440 15111368 14473805 13851715 13254481 12689998 12163391 11676885 11231039 10826013 10461750
59431 10461750 10137496 9851742 9602935 9390041 9212014 9066824 8951727 8864932 8806544 8777497
59421 8777497 8778077 8808018 8867314 8955845 9072512 9215791 9385069 9580513 9801862 10048403
59411 10048403 10319847 10615671 10933324 11268215 11615393 11969661 12323709 12667835 12992105
59402A2992105K95193K55845K04623J42835P4457K614p1043j43645k10952k70761
59392A3271271l23672l69413m05116m28767m42072m47911m46861m38353m23812
59383I545294m06221l87120l66135l43226l19701k96798k74522k52200k29481
59374F669890k06723j84882j65012j47488j31799j17130j02793q8217p3215n8513
59364E394118m5294l3970k3970j4760o198K224J1311K0856K9395L5974M1488M7699
59352E458873N5342O3352O9412P1286O8627O3988O1288O3066O9420P9299R1741
59341F215694J06080J22217J40598J60595J79005J92101J99816K06504K16975
59332G739585K33155K54787K81365L12213L46167L82651M22143M64720N09242
$$ plain form
59402 12992105 13287298 13543143 13747766 13890601 13965058 13967672 13896629 13752984 13542032 13271271
59392 13271271 12947599 12578186 12173070 11744303 11302231 10854320 10407459 9969106 9545294
59383 9545294 9139073 8751953 8385818 8042592 7722891 7426093 7151571 6899371 6669890
59374 6669890 6463167 6278285 6113273 5965785 5833986 5716856 5614063 5525846 5452631 5394118
59364 5394118 5348824 5314854 5290884 5276124 5269926 5272150 5283461 5304317 5333712 5369686 5411174 5458873
59352 5458873 5514215 5577567 5646979 5718265 5786892 5850880 5912168 5975234 6044654 6123953 6215694
59341 6215694 6321774 6443991 6584589 6745184 6924189 7116290 7316106 7522610 7739585
59332 7739585 7972740 8227527 8508892 8821105 9167272 9549923 9972066 10436786 10946028
59323A0946028N54841O02033O51217P01037P49319P94782Q36587Q72703Q99627
59314A7608174R13519R11525Q93014Q60006Q15583P61568O98821O29911N59488
59305B4651609M91150M25378L61394K99319K39187J79465J18320N5324r461p6956
59295B6734729j47974k21271k94124l64103m29185m87031n35828n75423o06699
59286B3073091o30578o48715o64038o78815o92690p03969p12190p17899p20397
59277A6903800p17487p07573o90910o68842o42822o14050n83124n50041n15031
59268A1213920m79037m42938m07036l71883l38691l08076k79257k51402k24852
59259H110748k00130j76755j54193j32962j13646r5702p8547o2831m9176l6536
$$ plain form
59323 10946028 11500869 12102902 12754119 13455156 14204475 14999257 15835844 16708547 17608174
59314 17608174 18521693 19433218 20326232 21186238 22001821 22763389 23462210 24092121 24651609
59305 24651609 25142759 25568137 25929531 26228850 26468037 26647502 26765822 26821146 26811685 26734729
59295 26734729 26586755 26365484 26071360 25707257 25278072 24791041 24255213 23679790 23073091
59286 23073091 22442513 21793798 21129760 20450945 19758255 19054286 18342096 17624197 16903800
59277 16903800 16186313 15478740 14787830 14118988 13476166 12862116 12278992 11728951 11213920
59268 11213920 10734883 10291945 9884909 9513026 9174335 8866259 8587002 8335600 8110748
59259 8110748 7910618 7733863 7579670 7446708 7333062 7237360 7158813 7095982 7046806 7010270
59249G010270k3303r458L792J5920K7335L8427M9638O1687P4507Q6816R8026J09326
59237G542983J21279J31804J38731J43220J48183J53980J58441J60655J61892
59228H861168J62749J62172J59896J57259J54938J52260J49624J49238J52181
59219A0261485J56665J60600J64140J68093J71201J70698J64781J53144J35807
59210A1706614J12915Q5469N5032K2583j1595m6881q1695j13903j41574j63536
59200A1423429j79537j89925j95120j95336j90611j80998j67007j50016j31757
59191I843122j12973r3075p1528m8960k6410m239J7288L7193N4715P0621Q6305
59180I752059J01831J16034J28399J39676J50722J61882J73430J85747J99099
$$ plain form
59249 7010270 6986967 6977509 6981301 6997221 7024556 7062983 7112621 7174308 7248815 7335631 7433657 7542983
59237 7542983 7664262 7796066 7934797 8078017 8226200 8380180 8538621 8699276 8861168
59228 8861168 9023917 9186089 9345985 9503244 9658182 9810442 9960066 10109304 10261485
59219 10261485 10418150 10578750 10742890 10910983 11082184 11252882 11417663 11570807 11706614
59210 11706614 11819529 11904998 11960030 11982613 11971018 11924137 11842442 11728539 11586965 11423429
59200 11423429 11243892 11053967 10858847 10663511 10472900 10291902 10124895 9974879 9843122
59191 9843122 9730149 9637074 9565546 9516586 9490176 9485937 9503225 9540418 9595133 9665754 9752059
59180 9752059 9853890 9969924 10098323 10237999 10388721 10550603 10724033 10909780 11108879
59171A1108879K14215K32715K55785K82604L11240L40821L71441M02017M29776
59162A3949493M52135M67581M74277M69140M49064M12283L58126K86576J98897
59153A7517572R8162j1353j25028k38184l46247m45026n30696n99877o50639o83362
59143A3985322o99916p01934o90616o67936o36961o00657n61170n20320m79955
59134H425857m41421m05257l71545l40133l10625k82807k57000k33560k12160
59125E571349j92245j73955j57953j44454j32997j22809j12948j02574r1939q2535
59115D256940p5342o9307o2572n4747m7016m0260l4260k8439k2365j5655q345
59104C798632j180N221J1196J7290K3327K9125L5250M1961M8254N3350N8196O3860
$$ plain form
59171 11108879 11323094 11555809 11811594 12094198 12405438 12746259 13117700 13519717 13949493
59162 13949493 14401628 14869209 15343486 15812626 16261690 16673973 17032099 17318675 17517572
59153 17517572 17615734 17604381 17479353 17241169 16894922 16449896 15919200 15319323 14668684 13985322
59143 13985322 13285406 12583472 11892856 11224920 10587959 9987302 9426132 8905812 8425857
59134 8425857 7984436 7579179 7207634 6867501 6556876 6274069 6017069 5783509 5571349
59125 5571349 5379104 5205149 5047196 4902742 4769745 4646936 4533988 4431414 4339475 4256940
59115 4256940 4181598 4112291 4049719 3994972 3947956 3907696 3873436 3844997 3822632 3806977 3798632
59104 3798632 3797452 3802673 3813869 3831159 3854486 3883611 3918861 3960822 4009076 4062426 4120622 4184482
59092D184482O9391P3354P6755Q2060Q9401R6245J01086J05227J10295J16019
59082E104315J21222J25397J28488J30513J32061J33859J35408J35320J33284
59073F279867J30278J26497J20725J12395J02860R3872Q6066P9503P4475P1059
59063G277597O8868O7794O8201P0151P3647P9665Q9560J03024J17920J32562J47102
59052H296091J62353J78601J95856K13936K31798K47805K60903K70533K75606
59043A0333482K74908K68352K55913K35380K03348J59039J05500M6722j4355p4674
59033A1793615j30371j78573k18298k48837k69167k79868k83573k82358k76528
59024I626042k67012k56687k47621k38893k29151k19785k13455k10557k09185
$$ plain form
59092 4184482 4253873 4327227 4403982 4486042 4575443 4671688 4772774 4878001 4988296 5104315
59082 5104315 5225537 5350934 5479422 5609935 5741996 5875855 6011263 6146583 6279867
59073 6279867 6410145 6536642 6657367 6769762 6872622 6966494 7052560 7132063 7206538 7277597
59063 7277597 7346465 7414259 7482460 7552611 7626258 7705923 7795483 7898507 8016427 8148989 8296091
59052 8296091 8458444 8637045 8832901 9046837 9278635 9526440 9787343 10057876 10333482
59043 10333482 10608390 10876742 11132655 11368035 11571383 11730422 11835922 11882644 11868289 11793615
59033 11793615 11663244 11484671 11266373 11017536 10748369 10468501 10184928 9902570 9626042
59024 9626042 9359030 9102343 8854722 8615829 8386678 8166893 7953438 7742881 7533696
59015G533696k07953k07038k06848k07187k07554k07300k05836k03375k00722
59006E679883j97712j92935j85758j77555j69951j62998j55887j48246j39781
58997D149060j30065j19885j11474j05860j01275r5606q9294q4116q0234p6397
58987C154854p2332o9013o6814o5119o3523o2077o0430n7939n4495n0510m6390
58976B486212m2756m0341l8786l6400l2185k7294k3369k0426j7655j5185j3399
58965B178416j1350p920m111k217k681l449k675o49J244K222K343J925J224M60
58951B152782J11J134M103P849J0076J0134R942J1172J2801J3024J2401J2995
58939B258524J5106J6970J7608J7891J8731K0059K1868K4500K7410K9107K9056
$$ plain form
59015 7533696 7325743 7118705 6911857 6704670 6497116 6289816 6083980 5880605 5679883
59006 5679883 5482171 5289236 5103478 4925923 4755972 4592974 4437087 4288841 4149060
58997 4149060 4018995 3899110 3787636 3681776 3580501 3484895 3395601 3311485 3231251 3154854
58987 3154854 3082522 3013509 2946695 2881576 2818053 2755976 2695546 2637607 2583112 2532602 2486212
58976 2486212 2443456 2403115 2364329 2327929 2295744 2268450 2245081 2224655 2207000 2191815 2178416
58965 2178416 2167066 2159146 2155035 2152818 2150137 2146688 2144013 2143364 2144608 2146830 2149173 2151098 2152322 2152782
58951 2152782 2152893 2154027 2158130 2165979 2176055 2186189 2196131 2207303 2220104 2233128 2245529 2258524
58939 2258524 2273630 2290600 2308208 2326099 2344830 2364889 2386757 2411257 2438667 2467774 2496830
58928B496830K8378K8164K8227K8029K7797K8106K9133L0778L2789L4438L4937
58917B827606L4568L4575L5630L7183L8757M0925M4310M8324N1739N4127N6074
58906C303818N8259O0921O4124O7886P1984P5896P9088Q1267Q2497Q3246Q4211
58895D113197Q5816Q7780Q9468R0796R2678R6353J02334J10184J19091J28298
58885E115995J37123J45367J53855J63823J75419J87581J99805K13024K27959
58876F719951K43804K59680K76420K95280L15832L37087L60060L86801M16888
58867I611803M47570M77946N10553N47691N88433O30674O74141P19654P67043
58858A4975508Q15774Q66398R19214R72028J021107J064043J100206J128626J146711
$$ plain form
58928 2496830 2525208 2553372 2581599 2609628 2637425 2665531 2694664 2725442 2758231 2792669 2827606
58917 2827606 2862174 2896749 2932379 2969562 3008319 3049244 3093554 3141878 3193617 3247744 3303818
58906 3303818 3362077 3422998 3487122 3555008 3626992 3702888 3781976 3863243 3945740 4028986 4113197
58895 4113197 4199013 4286793 4376261 4467057 4559735 4656088 4758422 4868606 4987697 5115995
58885 5115995 5253118 5398485 5552340 5716163 5891582 6079163 6278968 6491992 6719951
58876 6719951 6963755 7223435 7499855 7795135 8110967 8448054 8808114 9194915 9611803
58867 9611803 10059373 10537319 11047872 11595563 12183996 12814670 13488811 14208465 14975508
58858 14975508 15791282 16657680 17576894 18548922 19570029 20634072 21734278 22862904 24009615
58849B4009615J150794J136653J099693J035877R43016Q20942O71003M96246L01818
58840C1665657R4629j17095l23907n16154o86398q30779r47729j036234j096230
58831B6205760j129859j141065j134021j112458j079694j038258r89823r36171
58823A7644411q79801q22955p66718p11845o59821o12191n69147n29673m92800
58814A1599460m58265m26301l97256l71039l46711l23135l00171k78414k57768
58805H440400k37446k17642j99679j83907j68886j53483j38372j24532j11655
58796F904798r9108q7119p5709o3715n0288l6444k3715j2105o10J1061K2621L4322
58784F523989M6630N9436P2445Q5734R9127J11957J24387J37861J53286J69776
$$ plain form
58849 24009615 25160409 26297062 27396755 28432632 29375648 30196590 30867593 31363839 31665657
58840 31665657 31760286 31643191 31319284 30803130 30116732 29285953 28338224 27301990 26205760
58831 26205760 25075901 23934836 22800815 21688357 20608663 19570405 18580582 17644411
58823 17644411 16764610 15941655 15174937 14463092 13803271 13191080 12621933 12092260 11599460
58814 11599460 11141195 10714894 10317638 9946599 9599888 9276753 8976582 8698168 8440400
58805 8440400 8202954 7985312 7785633 7601726 7432840 7279357 7140985 7016453 6904798
58796 6904798 6805690 6718571 6642862 6579147 6528859 6492415 6468700 6456595 6455985 6467046 6489667 6523989
58784 6523989 6570619 6630055 6702500 6788234 6887361 6999318 7123705 7261566 7414852 7584628
58774G584628J86177K02513K18993K35121K51142K68833K89316L11396L33702
58765I881821L57112L83191M11688M41563M73387N08542N47059N88365O33160
58756A4225888O82201P33948P85796Q37110Q88683R39577R86860J028196J062179
58747B2170438J086047J095317J086167J056153J002261R20348Q07661O65033
58739B9889425M96474L07834J06168j00697l04661m97439o71201q20293r42099
58730B7463511j035731j101047j139937j156875j156151j139437j107895j065551
58722A8560887j018005r68235r15994q61213q05805p52110p01577o55042o12434
58713A1270472n72194n32863m95356m61965m33147m07097l82395l59059l36838
$$ plain form
58774 7584628 7770805 7973318 8192311 8427432 8678574 8947407 9236723 9548119 9881821
58765 9881821 10238933 10622124 11033812 11475375 11948762 12457304 13004363 13592728 14225888
58756 14225888 14908089 15642037 16427833 17264943 18153626 19093203 20080063 21108259 22170438
58747 22170438 23256485 24351802 25437969 26494122 27496383 28416731 29224392 29889425
58739 29889425 30385899 30693733 30799901 30699204 30394543 29897104 29225903 28405610 27463511
58730 27463511 26427780 25326733 24186796 23029921 21873770 20734333 19626438 18560887
58722 18560887 17542882 16574647 15658653 14797440 13991635 13239525 12537948 11882906 11270472
58713 11270472 10698278 10165415 9670059 9208094 8774947 8367850 7985455 7626396 7289558
58704G289558l14696k92554k71792k53225k36095k19622k04176j90152j76901
58695E130345j63685j50880j39444j29526j20137j10328j00618r2765q7537q3231
58685C952194p7753p1769o7771o5967o3788o0178n7219n5916n3805m9362m5651
58674C283015m6047m8748m9460m7724m6352m5954m4660m2583m2087m3487m4583
58663B781330m4676m5273m6483m6645m5896m6287m7722m7723m6063m5563m7068
58652B271931m7649m5504m2852m1794m0796l7851l4220l2260l1762l0941k9330
58641A856972k7438k5272k3153k2407k3282k3608k1410j7671j4907j4182j4795
58630A628847j5689j5842j4510j2154r898p402l107K467O130O285N656P446J0558
$$ plain form
58704 7289558 6974862 6682308 6410516 6157291 5921196 5701574 5497398 5307246 5130345
58695 5130345 4966660 4815780 4676336 4546810 4426673 4316345 4215727 4122962 4035425 3952194
58685 3952194 3874441 3802672 3734901 3668934 3605146 3544968 3487749 3431833 3378028 3328666 3283015
58674 3283015 3236968 3188220 3138760 3091036 3044684 2998730 2954070 2911487 2869400 2825913 2781330
58663 2781330 2736654 2691381 2644898 2598253 2552357 2506070 2458348 2410625 2364562 2318999 2271931
58652 2271931 2224282 2178778 2135926 2094132 2053336 2015485 1981265 1949005 1917243 1886302 1856972
58641 1856972 1829534 1804262 1781109 1758702 1735420 1711812 1690402 1672731 1657824 1643642 1628847
58630 1628847 1613158 1597316 1582806 1570652 1560754 1553352 1550245 1552712 1558842 1565127 1570783 1578229 1588787
58617A588787J1274Q654N517M154L468J016l608q342j0946j1038r926q783p654
58604A562573o382n614n883o323n610l913k637k432k676k610j740M95M014P512
58590A528774J0024J2424J5764J9091K1025K2556K5560K9183L0854L0708L1770
58579A777733L5513M0386M5201N0654N6631O1182O3633O6085P0524P6760Q4200
58568B428502R3054J02604J10989J18046J26035J36291J47565J58940J71819J87347
58558C781192K04300K21279K38929K58060K77348K94589L08877L20172L28073
58549F232819L31839L29999L19330K96245K59994K12698J56022R0654J9713n0678
58539H198635j15661j73751k23531k61768k86981l01979l10237l12033l06483
$$ plain form
58617 1588787 1600061 1608715 1614232 1618386 1621854 1622870 1619262 1610920 1599974 1588936 1579010 1570227 1562573
58604 1562573 1556191 1550577 1544694 1538371 1532761 1528848 1526211 1523779 1521103 1518493 1516753 1517248 1521262 1528774
58590 1528774 1538798 1551222 1566986 1586077 1607102 1629658 1655218 1684401 1715255 1745963 1777733
58579 1777733 1813246 1853632 1898833 1949487 2006118 2067300 2130933 2197018 2267542 2344302 2428502
58568 2428502 2521556 2624160 2735149 2853195 2979230 3115521 3263086 3422026 3593845 3781192
58558 3781192 3985492 4206771 4445700 4703760 4981108 5275697 5584574 5904746 6232819
58549 6232819 6564658 6894657 7213987 7510232 7770226 7982924 8138946 8229600 8249313 8198635
58539 8198635 8082974 7909223 7685692 7423924 7136943 6834964 6524727 6212694 5906211
58530E906211k95170k81100k65711k49119k31868k14376j96110j77151j59177
58521C836429j43382j28993j15183j02613r1711q1476p1530o3216n7145n1801
58511B929379m6277m2064m0209l9023l6785l4516l3795l3799l2992l2026l2601
58500B525292l4874l8013m1928m6392m9911n1427n1845n2336n2533n1772n0350
58489B003911m8202m4393l9412l5812l4850l4657l3324l1403k9728k7467k4482
58478A620181k2866k3631k4353k2727k0048j8587j7870j6377j4630j3685j2614
58467A412793j0470q772r047r836r131p939q291r478r407q137o974n589l175j004
58453A305543p19j395j259r60k061l692l878l135l533n144o341o793p376q055
$$ plain form
58530 5906211 5611041 5329941 5064230 4815111 4583243 4368867 4172757 3995606 3836429
58521 3836429 3693047 3564054 3448871 3346258 3254547 3173071 3101541 3038325 2981180 2929379
58511 2929379 2883102 2841038 2800829 2761806 2725021 2690505 2656710 2622911 2589919 2557893 2525292
58500 2525292 2490418 2452405 2410477 2364085 2314174 2262747 2210902 2158566 2106033 2054261 2003911
58489 2003911 1955709 1911316 1871904 1836092 1801242 1766585 1733261 1701858 1672130 1644663 1620181
58478 1620181 1597315 1573684 1549331 1526604 1506556 1487969 1470099 1453722 1439092 1425407 1412793
58467 1412793 1402323 1393551 1384504 1374668 1365537 1357598 1349307 1339829 1330422 1322285 1315311 1309722 1306547 1305543
58453 1305543 1304824 1303429 1302170 1301210 1299149 1295457 1291579 1288444 1284911 1279767 1273426 1266633 1259257 1251202
58439A251202q370r016j0483j1352j0467r336r794j0865j0644r790j0145j1293
58427A129647j1491j0757j0142r292p638o489o985p438n851l500k768k999k067
58414A042230n53n98j804j972j097r71j591j566j272k148l525l609k920l311m261
58399A011032l586j314O48K214M966Q682J1288J2130J2332J2266J1562J1032J1653
58386A104905J2308J1348R592Q685P689M634N17j848k311l150m942o253o969q385
58372A125820j0181j0694j0083j0089j0857j0900r976r221q836q275p903p975
58360A010830p008m018j030l38p84Q3J761K255K140L277M990N506N746P555R606
58345A040571R524Q621R786J1912J1613R540R655J2535J4687J4653J4606J5477
$$ plain form
58439 1251202 1242832 1233816 1223333 1211981 1201514 1192178 1182384 1171519 1160875 1151085 1140940 1129647
58427 1129647 1118156 1107399 1097257 1087965 1080327 1073838 1066853 1059415 1053564 1050064 1047296 1044297 1042230
58414 1042230 1041677 1041079 1039275 1037303 1036206 1035235 1033644 1032078 1030806 1028658 1025133 1021524 1018604 1015293 1011032
58399 1011032 1007446 1006132 1006780 1008994 1013960 1022642 1033930 1046060 1058392 1070658 1082220 1093252 1104905
58386 1104905 1117213 1128561 1138153 1146838 1154527 1159161 1159678 1157830 1155519 1152369 1147427 1141174 1134205 1125820
58372 1125820 1115639 1104945 1094862 1084773 1073916 1063016 1053040 1043819 1034983 1026708 1018805 1010830
58360 1010830 1003822 999804 998774 998436 997652 997735 999496 1001751 1003891 1007168 1012158 1017664 1023410 1030965 1040571
58345 1040571 1050095 1058716 1068502 1080414 1092027 1101567 1111222 1123757 1138444 1153097 1167703 1183180
58333A183180J5451J4142J3760J5098J6203J5885J5014J4029J2496J1266J1616
58322A338140J2361J1128Q191N705L918J675l17o17m46j811l396k579l49L51l5
58307A371919J134L401M198L949M905O033M719K496K996N080M433J511J122M007
58293A421903N655M142K579K678K283O50J72J402J903J263J880L732L940K487
58279A456669K824N743Q264R431J1570J4738J5742J3967J2577J2837J2689J1917
58267A588968J3069J6216J8343J8885K0248K2289K2086J9864J9022J9762J8913
58256A797665J6591J6446J8685J9564J8600J9295K1962K3056K2507K4183K8004
58245B026558K9363K7814K8299L1992L3953L2136L0841L2708L4842L5378L6531
$$ plain form
58333 1183180 1198631 1212773 1226533 1241631 1257834 1273719 1288733 1302762 1315258 1326524 1338140
58322 1338140 1350501 1361629 1369820 1375525 1379443 1381118 1380801 1380184 1379738 1377927 1374531 1371952 1371603 1371954 1371919
58307 1371919 1373053 1376454 1380652 1384601 1389506 1395539 1400258 1402754 1405750 1410830 1415263 1416774 1417896 1421903
58293 1421903 1427558 1431700 1434279 1436957 1439240 1439890 1440062 1441464 1443367 1444630 1446510 1450242 1454182 1456669
58279 1456669 1459493 1465236 1473500 1482931 1494501 1509239 1524981 1538948 1551525 1564362 1577051 1588968
58267 1588968 1602037 1618253 1636596 1655481 1675729 1698018 1720104 1739968 1758990 1778752 1797665
58256 1797665 1814256 1830702 1849387 1868951 1887551 1906846 1928808 1951864 1974371 1998554 2026558
58245 2026558 2055921 2083735 2112034 2144026 2177979 2210115 2240956 2273664 2308506 2343884 2380415
58234B380415L8817L9542L9057M1095M5061M5823M3006M2286M5553M8270M8547
58223B857472M9998N3408N4703N3731N5801O1884O6613O8618P2940Q0341Q4676
58212C560185Q4347Q5921R2271R7689R9072J01474J07886J13907J17445J23363
58202D583560J33399J41724J45592J50423J59485J68822J76775J87689K01750
58193F049219K12765K20686K34030K54792K73653K85792K98274L15751L32471
58184H477433L45214L60404L81142M00948M17460M38107M64811M88280N05541
58175A2279340N27620N60966N97091O29740O65765P09138P51241P87862Q28780
58166A8337543Q79687R32123R82417J041644J114861J190113J260895J339108
$$ plain form
58234 2380415 2419232 2458774 2497831 2538926 2583987 2629810 2672816 2715102 2760655 2808925 2857472
58223 2857472 2907470 2960878 3015581 3069312 3125113 3186997 3253610 3322228 3395168 3475509 3560185
58212 3560185 3644532 3730453 3822724 3920413 4019485 4120959 4228845 4342752 4460197 4583560
58202 4583560 4716959 4858683 5004275 5154698 5314183 5483005 5659780 5847469 6049219
58193 6049219 6261984 6482670 6716700 6971492 7245145 7530937 7829211 8144962 8477433
58184 8477433 8822647 9183051 9564193 9965141 10382601 10820708 11285519 11773799 12279340
58175 12279340 12806960 13367926 13965017 14594757 15260522 15969660 16720901 17508763 18337543
58166 18337543 19217230 20149353 21131770 22173414 23288275 24478388 25739283 27078391
58158B7078391J432422J530568J628784J742126J880702K034014K195992K380114
58150D1903113K592732K819193L055685L325360L642605L994218M379553M834463
58142G0546922N389894O044495O805417P712436Q790162J0025899J1430628J3062428
58134A39808281J4941281J7000085J9167455K1431449K3801329K6356299K9371249
58127B91877428L3020987L6489648L7458104L3160381K2561350P584226p950312
58120D54201812k0636431k8945253l3054997l3945287l2750512l0474664k7812213
58113B46582455k5094200k2433927j9895960j7521046j5302359j3234965j1357231
58106A21742767r695941q212057o845072n575045m407643l341629k389559j590708
$$ plain form
58158 27078391 28510813 30041381 31670165 33412291 35292993 37327007 39522999 41903113
58150 41903113 44495845 47315038 50370723 53696083 57338688 61332906 65712459 70546922
58142 70546922 75936816 81981311 88786728 96499164 105289326 115315225 126745853 139808281
58134 139808281 154749562 171749647 190917102 212348551 236149880 262506179 291877428
58127 291877428 324898415 361388063 398846167 432006548 454567898 462152124 454201812
58120 454201812 433565381 404620128 371565131 337619844 304869332 274394668 246582455
58113 246582455 221488255 199054328 179158368 161637322 146334963 133099998 121742767
58106 121742767 112046826 103834769 96989697 91414652 87007009 83665380 81275821 79685113
58098G9685113r67316n13427k72899l80197r44872j892002k961395l870045m458669
58089F3424291m711097m694776m501298m208965l868384l511935l166133k846534
58081C1915169k551957k278089k030685j815578j626216j453833j300916j172442
58073A7685453j063009r65015q80500q12653p54450o97998o46538o05011n67311
58064A0692968n25376m82976m47846m17474l85118l53077l27507l06224k83916
58055G163454k64111k53964k51580k49460k46259k44615k41695k32528k19393
58046D959849k08244j98955j87754j75851j67051j60172j51891j43717j38588
58037C427626j34263j27483j20691j17297j14525j08346j01163r6960r3331q6223
$$ plain form
58098 79685113 78717797 78204370 77931471 77551274 76606402 74714400 71753005 67882960 63424291
58089 63424291 58713194 54018418 49517120 45308155 41439771 37927836 34761703 31915169
58081 31915169 29363212 27085123 25054438 23238860 21612644 20158811 18857895 17685453
58073 17685453 16622444 15657429 14776929 13964276 13209826 12511828 11865290 11260279 10692968
58064 10692968 10167592 9684616 9236770 8819296 8434178 8081101 7753594 7447370 7163454
58055 7163454 6899343 6645379 6393799 6144339 5898080 5653465 5411770 5179242 4959849
58046 4959849 4751605 4552650 4364896 4189045 4021994 3861822 3709931 3566214 3427626
58037 3427626 3293363 3165880 3045189 2927892 2813367 2705021 2603858 2506898 2413567 2327344
58027B327344p8391p4825p3622o9680o4166o1944o2389o0780n6507n2428m8453
58016A624159m2967l8195l6997l6748l3344k8849k8041k9754k8980k5578k3511
58005A271195k2999k0666j6566j4223j4154j3451j1336r697q821p633p159q889
57993A115601j1094j1339j0974j2332j3638j1862q472o978o744m866k383k718
57981A012201n246o193m847l552k614o31J230O71q98k16J947K059J79l34R04O42
57965I95302k341n762q168j0370j2257j2335j0813r714r815j0372j1240j2369
57953H79746j2371j0654r474j0654j2142j1406r970j0463j1429r949p319o851
57941G57064p583n881k263q28k255l045j842j136k112k873k533k547l083k228
$$ plain form
58027 2327344 2248953 2174128 2100506 2030826 1966660 1904716 1842327 1781547 1725040 1672612 1624159
58016 1624159 1581192 1542997 1506000 1469252 1435908 1407059 1379018 1349264 1320284 1294706 1271195
58005 1271195 1248196 1227530 1210964 1196741 1182587 1169136 1157800 1148103 1139282 1131649 1124490 1115601
57993 1115601 1104507 1093168 1082194 1069862 1056224 1044362 1035890 1028912 1022168 1017302 1014919 1012201
57981 1012201 1006955 1000762 995915 992363 989749 989118 990348 991019 990121 989905 991852 993911 994090 993756 994660 995302
57965 995302 992961 987199 979031 968661 956404 944069 933256 923542 913727 903355 892115 879746
57953 879746 867375 856721 847247 836593 824451 813045 803075 792612 781183 771234 763915 757064
57941 757064 749481 743600 741337 740509 738254 735209 733367 732231 730119 727246 724713 722166 719083 716855
57927G16855M05L054N183P725R744Q918N806L642L387K794R23m08l91o47j894
57912G65096k715k696l432n406o911p041o966p445p731p603p814q058p097n197
57898F78984l870l098j676l37j283m221o058n252l574k738k210j231m27k44L6
57883F42801Q31J531J797J942J891J422J201J796K114Q68j103k180k733l971m972
57868F43235m119k675l454o140p449o116m208l218k254q33j09l44PJ715L694N115
57852F12847O270O910O208M866M777O166P324P415P210O952O011M733M012L013
57838F94714J45l638n435m553l218l002l429m325o337q680r532r061r077r464
57824F15108q344o127n520o762o760m343k458l301m734l833j041J424K843L593
$$ plain form
57927 716855 717260 720314 725497 733222 742966 751884 757690 761332 764719 767513 768436 768028 767637 766990 765096
57912 765096 762381 759685 756253 750847 743936 736895 729929 722484 714753 707150 699336 691278 684181 678984
57898 678984 675114 672016 670340 670003 668720 664499 658441 653189 649615 646877 644667 643436 643009 642765 642801
57883 642801 643632 645163 646960 648902 650793 652215 653416 655212 657326 658194 657091 654911 652178 648207 643235
57868 643235 639116 636441 632987 626847 619398 613282 609074 605856 603602 602769 602660 602316 602323 604038 607732 612847
57852 612847 619117 626027 632235 637101 641878 648044 655368 662783 669993 676945 682956 687689 691701 694714
57838 694714 694859 691221 685786 681233 678015 675013 671584 667259 660922 652242 642710 633649 624572 615108
57824 615108 606764 600637 595117 588355 581595 577252 574794 571493 566759 562926 561885 563309 566152 569745
57810E69745L732L846N258P703Q903P931O832P442Q689Q664P229N064K234o92
57796F52580k145j845j800l466n807p434q744j0430j1803j2166j2131j2224j1842
57783E50743j0786r956r498q338o689o570q431r718q556o547n970o347n966m836
57769D42535m045l896m568o820j0013j1420r709p313p053q152q131p002o636p255
57755C40522p435o927o691o608n687m285l732l877l194j344L66J263K165L722
57741B98258N361O318O539O362O143O201O446O183M942L211J804J032J008J961
57727C61769L465M214L424J903Q95O14N47L73j68j522l510n141n824n979n872
57712C49188n046l619k827l339m183m252l667k804j429J40O11j63j95J921M646
$$ plain form
57810 569745 573477 577323 582581 590284 599187 607118 613950 621392 630081 638745 645974 651038 653272 652580
57796 652580 650435 648590 646790 643324 637517 630083 621339 610909 599106 586940 574809 562585 550743
57783 550743 539957 530001 520503 512165 505476 498906 490475 480757 472201 465654 459684 453337 447371 442535
57769 442535 438490 434594 430026 423206 413193 401773 392064 384751 377698 369546 361415 354413 347777 340522
57755 340522 333087 326160 319469 312861 307174 302889 299157 295280 292086 290742 291108 292371 294536 298258
57741 298258 303619 309937 316476 322838 328981 335182 341628 347811 352753 355964 357768 358800 359808 361769
57727 361769 365234 369448 372872 374775 375670 376284 376831 377204 377036 375514 372004 366863 361039 355060 349188
57712 349188 344142 340523 337696 334357 330174 325922 322255 319451 318022 318162 318773 318610 318415 320336 324982
57697C24982N697N356N699P354R009R634R415Q830Q292Q368R040R235Q166O565
57683D35642N482M769M024M005N628Q211J0271J1362J1785J1313R793Q272P865
57670E38422Q142Q242Q736J0632J3124J4350J4047J3669J4189J5474J7488K0271
57658F96786K2959K4516K5280K6147K6739K6247K5749K7362L1062L4482L6247
57647A003576L7457L9459M2116M4898M7905N1050N3855N6736O0923O6465P1844
57636A576284P6430Q1725Q9204R8298J07636J17035J27020J37438J48006J59557
57626B718633J73387J89617K07157K25008K42669K59510K74581K87068K96373
57617D874003L01792L02379K96821K83095K59014K24334J82562J39749J00415
$$ plain form
57697 324982 330679 336035 341734 349088 358097 367731 377146 385976 394268 402636 411676 420911 429077 435642
57683 435642 441124 445893 449917 453922 459550 467761 478032 489394 501179 512492 522285 530557 538422
57670 538422 546564 554806 563542 574174 587298 601648 615695 629364 643553 659027 676515 696786
57658 696786 719745 744261 769541 795688 822427 848674 874423 901785 932847 967329 1003576
57647 1003576 1041033 1080492 1122608 1167506 1215411 1266461 1320316 1377052 1437975 1504440 1576284
57636 1576284 1652714 1734439 1823643 1921941 2029577 2146612 2273632 2411070 2559076 2718633
57626 2718633 2892020 3081637 3288794 3513802 3756471 4015981 4290562 4577630 4874003
57617 4874003 5175795 5478174 5774995 6058090 6317104 6541438 6724000 6863749 6964164
57608F964164O4121K5782k0551p7457j42138k07300k63933l04629l26266l30794
57598E380999l23307l08770k89974k68077k44118k19503j95412j72454j50973
57589C208411j31316j13837r8723q5732p4054o2729n1354m0185k9541j9519j0263
57578B491158j864O236J5061K4968L5192M4863N3975O3079P2564Q2647R3460J04718
57566C086057J15917J27183J39334J52697J66505J79704J91520K00909K06502
57557D566328K07700K04631J96271J79804J53062J16830P3785K6280k3474p2047
57547E629170j15615j52182j81816k04854k21123k30747k34564k33532k28540
57538C826197k20662k10855j99598j87378j75173j63727j52829j42031j31445
$$ plain form
57608 6964164 7028285 7054067 7033516 6956059 6813921 6606621 6342688 6038059 5711793 5380999
57598 5380999 5057692 4748922 4458948 4190871 3946753 3727250 3531838 3359384 3208411
57589 3208411 3077095 2963258 2864535 2778803 2704749 2642020 2590666 2550481 2520940 2501421 2491158
57578 2491158 2489294 2495530 2510591 2535559 2570751 2615614 2669589 2732668 2805232 2887879 2981339 3086057
57566 3086057 3201974 3329157 3468491 3621188 3787693 3967397 4158917 4359826 4566328
57557 4566328 4774028 4978659 5174930 5354734 5507796 5624626 5698411 5724691 5701217 5629170
57547 5629170 5513555 5361373 5179557 4974703 4753580 4522833 4288269 4054737 3826197
57538 3826197 3605535 3394680 3195082 3007704 2832531 2668804 2515975 2373944 2242499
57529B242499j21136j10591r9817r0128q2535p6164o9614o3206n8235n4593n0840
57518A365640m6383m1913l7888l4085l0595k7756k5257k2597k0232j8803j7593
57507A042538j5397j2516j0185q370o129l865k925k876j684J165M044O294R340
57494I99434J3799J7835J9863K0816K2278K4202K6038K8422L1970L5687L8368
57483A278712M0547M3452M6942N0112N3263N7671O3812P0938P8063Q4605R0634
57472A958751R7210J05646J15752J25814J34895J43768J52714J60116J64542J66573
57462C325781J66727J63052J52883J35885J13233Q4889N0531J2604k4420n8136
57452D123029q9139j17469j40771j56897j66331j70730j70705j66397j58974j50161
$$ plain form
57529 2242499 2121363 2010772 1910955 1820827 1738292 1662128 1592514 1529308 1471073 1416480 1365640
57518 1365640 1319257 1277344 1239456 1205371 1174776 1147020 1121763 1099166 1078934 1060131 1042538
57507 1042538 1027141 1014625 1004440 996070 989941 986076 983151 980275 978591 979756 983800 990094 999434
57494 999434 1013233 1031068 1050931 1071747 1094025 1118227 1144265 1172687 1204657 1240344 1278712
57483 1278712 1319259 1362711 1409653 1459765 1513028 1570699 1634511 1705449 1783512 1868117 1958751
57472 1958751 2055961 2161607 2277359 2403173 2538068 2681836 2834550 2994666 3159208 3325781
57462 3325781 3492508 3655560 3808443 3944328 4057561 4142450 4192981 4205585 4181165 4123029
57452 4123029 4033890 3916421 3775650 3618753 3452422 3281692 3110987 2944590 2785616 2635455
57442B635455j40884j31257j21226j10487r8610q6131p4837o6092n9377n3209
57432A693345m6894m0549l4099k7313k0623j4833r839m528J767Q329J3961J8512
57420A537236K3023K8453L4648M0751M6401N2133N8606O5749P3080Q0589Q8912
57409B129581R8478J08810J18825J27720J35411J42063J47348J50189J49294J43805
57399C451524J33261J16986R3892O3269K6017j4755n4524q9433j18130j41472
57389C466635j60251j73733j80971j82890j81781j78896j73777j66085j56733
57380A911518j46704j36023j24770j14039j04909r7144q9785q2505p5618o9291
57370H70730o3465n8151n3257m8711m4951m2316l9703l5346k9703k5770k5255
$$ plain form
57442 2635455 2494571 2363314 2242088 2131601 2032991 1946860 1872023 1805931 1746554 1693345
57432 1693345 1646451 1605902 1571803 1544490 1523867 1509034 1499195 1494667 1496434 1504763 1518724 1537236
57420 1537236 1560259 1588712 1623360 1664111 1710512 1762645 1821251 1887000 1960080 2040669 2129581
57409 2129581 2228059 2336869 2455694 2583414 2718825 2860888 3008236 3158425 3307719 3451524
57399 3451524 3584785 3701771 3795663 3858932 3884949 3870194 3815670 3726237 3608107 3466635
57389 3466635 3306384 3132651 2951680 2768790 2587009 2408113 2234336 2068251 1911518
57380 1911518 1764814 1628791 1504021 1389982 1285073 1187929 1098144 1015639 940021 870730
57370 870730 807265 749114 695857 647146 602195 559879 520176 484830 455127 429357 404102
57359D04102k6098k5498k3787k2989k2953k1822j9584j8135j7803j6886j5037
57348A73510j4158j5009j5613j4334j2371j1509j1354j0455q695o941n553m691
57336D2827m924o060o515n409m144m337n178A482a805k626l325l774k824j330
57322a5684m90J0J267L326M933a702A922K524K908M577O353P596Q583R335R132
57307E2930P656N820M774M783N528O728P699P228M920K094M51L05R51K103L929
57292A17899O029P510Q006P966Q072Q854J0493J2472J3768J3824J2853J1083Q614
57279B47443O336N664O619P479P218O942P805Q987R250R129R758J0581J0295R177
57265C62683Q452Q104P448P087P942Q895Q077O369O809J0100J3319J3880J2457
$$ plain form
57359 404102 378004 352506 328719 305730 282777 260955 241371 223236 205433 188547 173510
57348 173510 159352 144343 128730 114396 102025 90516 79162 68707 60012 53071 47518 42827
57336 42827 37903 31843 25328 19919 15775 11438 6260 1482 -1805 -4431 -7756 -11530 -14354 -15684
57322 -15684 -16174 -16164 -14897 -11571 -6638 -1702 1922 4446 7354 11931 18284 25880 34463 43798 52930
57307 52930 60586 66406 71180 75963 81491 88219 95918 103146 108066 110160 110611 110916 111867 113970 117899
57292 117899 123928 131438 139444 147410 155482 164336 174829 187301 201069 214893 227746 238829 247443
57279 247443 253779 259443 266062 273541 280759 287701 295506 304493 313743 322872 332630 343211 353506 362683
57265 362683 371135 379239 386687 393774 401716 410611 418688 425057 431866 441966 455285 469165 481622
57252D81622J1055J0317R905R809R948R858R638J0055J0968J1083R988Q990R173
57239F12409J0127J1390J3556J6875K0174K2423K4176K6374K8742L0568L2072
57228H48886L4001L6590L9785M3537M7098M9078M9213M9152N0473N2805N4693
57217A355311N5512N5510N4797N3211N0490M5891L8508K8693J8337Q991O49o995
57205A758905j3366j8054k1881k5700k8946l0469l0062k8285k5624k2900k1478
57194A492140k1737k2073k0676j7816j5217j3689j2431j0331o950k588J803N032
57182A355467O715P612Q572R803J1472J4023J7241K0007K1764K3369K5704K8392
57170A550141L0762L3039L5614L8036L9750M1113M2593M3675M3404M1456L7976
$$ plain form
57252 481622 492677 502994 512899 522708 532656 542514 552152 562207 573175 584258 594246 603236 612409
57239 612409 622536 633926 647482 664357 684531 706954 731130 757504 786246 816814 848886
57228 848886 882887 919477 959262 1002799 1049897 1098975 1148188 1197340 1247813 1300618 1355311
57217 1355311 1410823 1466333 1521130 1574341 1624831 1670722 1709230 1737923 1756260 1765251 1765900 1758905
57205 1758905 1745539 1727485 1705604 1679904 1650958 1620489 1590427 1562142 1536518 1513618 1492140
57194 1492140 1470403 1448330 1427654 1409838 1394621 1380932 1368501 1358170 1351220 1348632 1350435 1355467
57182 1355467 1362182 1369794 1378366 1388169 1399641 1413664 1430905 1450912 1472676 1496045 1521749 1550141
57170 1550141 1580903 1613942 1649556 1687592 1727342 1768455 1811048 1854723 1898127 1939583 1977559
57159A977559L3179K7874K3563K1142K0177J9937K0358K1558K3486K6420L0586
57148B245839L4920L7822L9588M2247M6330M9807N1341N2308N4272N6565N8134
57137B769173N9765O2384O4932O6031O6268O6681O6443O4325O1226N8880N7128
57126C463236N4620N1313M8171M5229M1962L8784L6313L3991L1225K8924K8050
57115C901818K7644K6010K3050J9892J7376J6352J7793K0893K2701K1605J9515
57104D134649J8765J8796J8030J6824J6105J5139J3348J2140J2184J1224P787
57093D294991M662N014P280P793O349M778J866n489j7260l1054m6819o6124q7438
57080D078549j06832j23178j38620j54347j69933j86243k04908k25335k45969
$$ plain form
57159 1977559 2010738 2038612 2062175 2083317 2103494 2123431 2143789 2165347 2188833 2215253 2245839
57148 2245839 2280759 2318581 2358169 2400416 2446746 2496553 2547894 2600202 2654474 2711039 2769173
57137 2769173 2828938 2891322 2956254 3022285 3088553 3155234 3221677 3286002 3347228 3406108 3463236
57126 3463236 3517856 3569169 3617340 3662569 3704531 3743315 3779628 3813619 3844844 3873768 3901818
57115 3901818 3929462 3955472 3978522 3998414 4015790 4032142 4049935 4070828 4093529 4115134 4134649
57104 4134649 4153414 4172210 4190240 4207064 4223169 4238308 4251656 4263796 4275980 4287204 4294991
57093 4294991 4299653 4304667 4311947 4319740 4326089 4330867 4332733 4327244 4309984 4278930 4232111 4165987 4078549
57080 4078549 3971717 3848539 3709919 3555572 3385639 3199396 2994488 2769153 2523184
57071B523184k67463k90870l14235l35387l56475l81131A68663b69363m70811
57062g40174n11458n58704o07708o57958p13034p73714q38156r08162r88288j079469
57052h376825j180396j294441j427687j580911j751162j940562k155388k397433
57044b2104805k665167k962805l298992l677141m096759m563258n085673n666031
57036e4120631o303335p007205p793269q663160r600365j0583472j1587332j2569490
57028a28228259j3466125j4196798j4672792j4853187j4862183j5022336j5624307
57021b30925987j6540638j7093034j6417599j4042146j0149527n357234l21905
57014c10848070M482162Q767421J2366789J5184506J7171437J8335216J8774863
$$ plain form
57071 2523184 2255721 1964851 1650616 1315229 958754 577623 168663 -269363 -740174
57062 -740174 -1251632 -1810336 -2418044 -3076002 -3789036 -4562750 -5400906 -6309068 -7297356 -8376825
57052 -8376825 -9557221 -10851662 -12279349 -13860260 -15611422 -17551984 -19707372 -22104805
57044 -22104805 -24769972 -27732777 -31031769 -34708910 -38805669 -43368927 -48454600 -54120631
57036 -54120631 -60423966 -67431171 -75224440 -83887600 -93487965 -104071437 -115658769 -128228259
57028 -128228259 -141694384 -155891182 -170563974 -185417161 -200279344 -215301680 -230925987
57021 -230925987 -247466625 -264559659 -280977258 -295019404 -305168931 -310526165 -310848070
57014 -310848070 -306365908 -297598487 -285231698 -270047192 -252875755 -234540539 -215765676
57007b15765676J8674938J8228447J7560224J6727526J5768605J4723086J3619203
57000a00463647J2474961J1316511J0178229R085063Q049936P086558O209402
56993c6062987N421414M715413M087963L540537L068470K660985K312189K021119
56985h234897J780782J577511J401661J249858a108075a12436G70959P82337O90352
56976B243648O02007N18045M45177L85344L33366K86276K46940K16561J91157
56967E468521J67640J46831J28532J09872R0477P3555O0132M7605L5453K6853
56957F355471K2845K0106J6224J2496J0206Q930R747J5203K4789L5075M5202N6980
56945F633274O8780P6030P9990Q8628J03045J07645Q0610J4495p5901j64464k30597
$$ plain form
57007 -215765676 -197090738 -178862291 -161302067 -144574541 -128805936 -114082850 -100463647
57000 -100463647 -87988686 -76672175 -66493946 -57408883 -49358947 -42272389 -36062987
56993 -36062987 -30641573 -25926160 -21838197 -18297660 -15229190 -12568205 -10256016 -8234897
56985 -8234897 -6454115 -4876604 -3474943 -2225085 -1108075 -112436 770959 1553296 2243648
56976 2243648 2845655 3363700 3808877 4194221 4527587 4813863 5060803 5277364 5468521
56967 5468521 5636161 5782992 5911524 6021396 6111873 6185428 6245560 6293165 6328618 6355471
56957 6355471 6378316 6398422 6414646 6427142 6437348 6446278 6456025 6471228 6496017 6531092 6576294 6633274
56945 6633274 6702054 6778084 6858074 6946702 7049747 7157392 7238002 7252497 7176596 7012132 6781535
56934F781535k68397k84638k90048k91901k92969k94089k94650k91763k82759
56925D190321k68784k53425k38123k22012k05799j92130j81753j72800j64245
56916B291250j56637j49058j39114j26759j14624j03617r1652p7765o4071n2447
56906A215506m2564l4425k9486k7655k6102k2537j7158j0529k706M381P117M467
56894A018309p52o164j2293j9277k4616k6549k6741k7194k7010k4612k0921j7820
56882G84360j5266j2267r095o406l527M34M899Q745J1786J4242J6137J8051K0625
56869H32718K2232J9231J0094k421j4299k3645k9959l2554l1649k9341k7552k6172
56857F66683k4325k1885j8617j3792q097l953k245o30L140P889J0900J1621J1504
$$ plain form
56934 6781535 6513138 6228500 5938452 5646551 5353582 5059493 4764843 4473080 4190321
56925 4190321 3921537 3668112 3429989 3207977 3002178 2810048 2628295 2455495 2291250
56916 2291250 2134613 1985555 1846441 1719682 1605058 1501441 1409789 1332024 1267953 1215506
56906 1215506 1172942 1138517 1109031 1081376 1055274 1032737 1015579 1005050 1002344 1006725 1013842 1018309
56894 1018309 1017557 1011393 999100 979823 955207 928658 901917 874723 847713 823101 802180 784360
56882 784360 769094 756827 747732 741326 737799 738233 743132 751877 763663 777905 794042 812093 832718
56869 832718 854950 874181 884275 881854 867555 843910 813951 781397 749748 720407 692855 666683
56857 666683 642358 620473 601856 588064 579967 576014 573769 573139 576279 584168 595068 606689 618193
56844F18193J1444J1313J1228J1514J1982J2402J3055J4002J4799J5481J6611
56833G62024J7820J7955J7057J6448J6341J5604J4406J4295J4658J2116N149l537
56821I20336j1107j8084k5424l1001l2338l0555k8391k5878k1270j4946r122m484
56809F67736k6M480Q591J3057J8863K4989K9775L3962L9626M6461N1560N2648
56797I91722M9114M0347K6151R106o194j7030k3889k7752k8342k5669k1177j6303
56785I50084j1208n587L61O363J2521J8932K5564L2687M0600M8988N7007O3769
56773A240081O8057O8006O1912M9208L0475P583j5604l4320m6206n2677n5937
56762A320578n5975n2067m5618l9211l3507k7247j9825j2012m516K379Q265J3318
$$ plain form
56844 618193 629637 640950 652178 663692 675674 688076 701131 715133 729932 745413 762024
56833 762024 779844 797799 814856 831304 847645 863249 877655 891950 906608 918724 923873 920336
56821 920336 909229 891145 865721 834720 802382 771827 743436 717558 696288 681342 672220 667736
56809 667736 667710 672190 680781 693838 712701 737690 767465 801427 841053 887514 939074 991722
56797 991722 1040836 1081183 1107334 1116440 1110246 1093216 1069327 1041575 1013233 987564 966387 950084
56785 950084 938876 933289 933650 940013 952534 971466 997030 1029717 1070317 1119305 1176312 1240081
56773 1240081 1308138 1376144 1438056 1487264 1517739 1525322 1509718 1475398 1429192 1376515 1320578
56762 1320578 1264603 1212536 1166918 1127707 1094200 1066953 1047128 1035116 1030600 1032979 1041244 1054562
56750A054562J8899K5673L1879L5413L6496L5951L1766K0762L747j3942k7674
56739A253532l6906m2936m6030m6033m3698l9935l4974k9177k3552j8768j4693
56728H76830j1238q462n599j444L988R406J3951J7584J9586J8443J3743O774j178
56715I52384r608j7586k3445k6493k7705k8102k7727k6682k5772k5346k4678k3163
56703F66077k1063j8591j5515j2240r977r086q378o762m655l063k294k105k279
56690E50069k449k194j721j635j854j802j809k943m934n749m054j010J164J408
56676E20487M7k114m020m658m034l223k950k838k522k397k625k423j273JK86l25
56660D85419q84r93j019j359k041k813l211k880k059j355r56o31n03r98j850k076
$$ plain form
56750 1054562 1073461 1099134 1131013 1166426 1202922 1238873 1270639 1291401 1295148 1281206 1253532
56739 1253532 1216626 1173690 1127660 1081627 1037929 997994 963020 933843 910291 891523 876830
56728 876830 865592 857130 851531 850087 854075 863481 877432 895016 914602 933045 946788 953562 952384
56715 952384 942776 925190 901745 875252 847547 819445 791718 765036 739264 713918 689240 666077
56703 666077 645014 626423 610908 598668 588691 579605 571227 564465 559810 556747 554453 552348 550069
56690 550069 547620 545426 543705 542070 540216 538414 536605 533662 528728 522979 518925 517915 519079 520487
56676 520487 520534 518420 514400 509742 505708 502485 499535 496697 494175 491778 489153 486730 485457 485458 485744 485419
56660 485419 484535 483542 482523 481164 479123 476310 473099 470219 468160 466805 465849 465218 464715 463717 461867 459791
56644D59791j229M3J015J610J895J749J402J456K012K419K236J702J115N85N48
56629D78349J483K835L182J972K01r03j005k93J003K269K630J917Q37L6l41j93
56613D93979M23P48J06p48m69O48Q50l99j617j735j542j932k376k267k333l362
56597D77974m649m866l717j873o9J041J103Q07J316K392K379P22r36j044n4R52
56581D71478J942L034L382K433J147N38K37k52j72J017J955J060j092k709l272
56566D80726l325k803j456l13o76k024k736k526k363k369j682l50N39O69P81J015
56550D61107O22m98j408j615j584j620j416q31j5J145K535K909J114j763l149
56535D55533k166m64N77J647L585N311N198L534K069J495Q28o23j947j842m65
$$ plain form
56644 459791 458562 458605 459620 461230 463125 464874 466276 467732 469744 472163 474399 476101 477216 477801 478349
56629 478349 479832 482667 485849 487821 488022 487119 486114 485821 486824 489093 491723 493640 494477 494513 494172 493979
56613 493979 494402 495150 495256 494508 494039 494687 495537 495138 493521 491786 490244 488312 485936 483669 481336 477974
56597 477974 473325 468459 464742 462869 462800 463841 464944 465751 467067 469459 471838 472560 471624 470580 470526 471478
56581 471478 473420 476454 479836 482269 483416 483954 484191 483939 483767 484784 486739 487799 486707 483998 480726
56566 480726 477401 474598 473142 472829 472153 470129 467393 464867 462504 460135 458453 458103 458642 459311 460092 461107
56550 461107 461729 461231 459823 458208 456624 455004 453588 452757 452742 453887 456422 459331 460445 458682 455533
56535 455533 453367 452903 453480 455127 458712 464023 469221 472755 474824 476319 477147 476524 474577 472735 472270
56520D72270Q29J433K243L936N279M366J403r92q41R41K041J557M01l17j10J197
56504D95636L445N819P366P809P467O704N949N770O314P134P907Q603Q585O746
56490E91254L430R79J092K671L612L693L926L957K359o67l018l455l011l262m468
56475E99092n936o978p164o464n444m667l969l070k529k988l721l252j473J09
56461E41546L86k19p69r32p90m07M7K52Mp25j686k046r61R61J672P9k371l598
56443E30443l373k767k276k111l170n694p775p467n801n337o167o037m365l182
56429D64921l546l765k307j96Q85J015J290K035K972L990M883N221N086N018M972
56414D92474M570M323N049O008N573M080L807N453O877O386N140M909N435N739
$$ plain form
56520 472270 473099 474532 476775 480711 485990 490356 491759 490767 489926 490867 492908 494465 494866 494549 494439 495636
56504 495636 499081 504900 512266 520075 527542 534246 540195 545965 552279 559413 567320 575923 584508 591254
56490 591254 594684 595663 596755 599426 603038 606731 610657 614614 616973 616306 613288 609833 606822 603560 599092
56475 599092 593156 586178 579014 572550 567106 562439 558470 555400 552871 549883 546162 542910 541437 541546
56461 541546 541932 541713 540944 540012 539222 538815 538862 539114 539118 538393 536707 534661 533700 534661 536333 536412 534041 530443
56443 530443 527070 524303 522027 519916 516746 511052 503277 495810 490009 484672 478505 472468 468103 464921
56429 464921 461375 457610 455303 455107 455992 457007 458297 460332 463304 467294 472177 477398 482484 487502 492474
56414 492474 497044 501367 506416 512424 517997 522077 525884 531337 538214 544600 549740 554649 560084 565823
56400E65823O305Q015R988J0411Q950O865N324M663M803N200M903L508J720M60
56386F46938J8K71P77M32j566m007m536k869j504k277l923m382l802l633l992
56371F11945l846l081k693l226m323n467o240o223n487m709m262l821l343l297
56357E51927l500k941j512n41p75j252j183j370k403l094k383j340j426j951j363
56342E24893j30n4j231j871j083J30P72R74R23J86j254k376k044j52K335M032
56326E24050M126L179K597K923L210K576J541J083J210J487K193L776N598O340
56312E65889N478L673K061J559K310L197K812J422R90K468M346M862M448M574
56298F10089N272N422M885M586M725M411L146J665J078J722K788K907J642M66
$$ plain form
56400 565823 572128 580143 590131 600542 609492 616357 621681 626344 631147 636347 641250 644758 646478 646938
56386 646938 646956 647227 648004 648436 646870 642863 638327 635458 633954 631677 627754 623372 619570 615937 611945
56371 611945 608099 605018 602325 599099 594776 589309 583069 576846 571359 566650 562388 558567 555224 551927
56357 551927 548427 545486 543974 543433 542658 541406 540223 538853 536450 533356 530973 529633 528207 526256 524893
56342 524893 524763 524709 523478 521607 520524 520654 521426 522400 523323 523509 522255 519879 517835 517683 520018 524050
56326 524050 528176 531355 533952 536875 540085 542661 544202 545285 546495 547982 550175 553951 559549 565889
56312 565889 571367 575040 577101 578660 580970 584167 586979 588401 589391 591859 596205 601067 605515 610089
56298 610089 615361 620783 625668 630254 634979 639390 642536 644201 645279 647001 649789 652696 654338 654804
56284F54804J307L899N887N974N381N557O256O863P701Q638Q209N932L841L837
56270G34086M914N080M695N657Q275J1215J3671J5418J5676J4246J3025J3955
56258H59913J6006J6607J5607J5219J6208J6851J5946J4448J3536J3121J2884
56247A026346J3031J3357J3064J2064J1103J0296Q933P074O016O574P946Q786
56235A144590Q756Q734R929J2613J5530J7101J7576J8854K1595K4147K5504K7461
56223A352390L1907L7439M1193M3010M5178M8607N2018N4702N7620O1484O6052
56212A891600P1569P8933Q7983R7291J05932J14093J22022J30056J39524J51748
56202B990751J65990J80037J93014K06127K20550K35961K51256K65523K78291
$$ plain form
56284 654804 656111 660010 665897 671871 677252 682809 689065 695928 703629 712267 720476 726408 730249 734086
56270 734086 739000 744080 748775 754432 762707 773922 787593 803011 818687 832933 845958 859913
56258 859913 875919 892526 908133 923352 939560 956411 972357 986805 1000341 1013462 1026346
56247 1026346 1039377 1052734 1065798 1077862 1088965 1099261 1108194 1115268 1121284 1127858 1135804 1144590
56235 1144590 1153346 1162080 1172009 1184622 1200152 1217253 1234829 1253683 1275278 1299425 1324929 1352390
56223 1352390 1384297 1421736 1462929 1505939 1551117 1599724 1651742 1706444 1764064 1825548 1891600
56212 1891600 1963169 2042102 2130085 2227376 2333308 2447401 2569423 2699479 2839003 2990751
56202 2990751 3156741 3336778 3529792 3735919 3956469 4192430 4443686 4709209 4987500
56193D987500K89653K99644L06660L07548L00636K87431K69836K47181K18125
56184G514214J83958J47252J08421O6629K3400j7797n5206q9085j18725j42402
56174G620659j60412j75028j87097j95443j99967k02415k03692k03243k01634
56165E891728k00923k01645k02013k00930j99350j97858j95398j91396j86902
56156D115313j82580j77614j71430j64728j57926j50352j41592j32245j22950
56147B713896j14056j06142r9207r1800q2997p4677o9376o6348o2459n6726n0980
56136A839128m6302m1912l7765l4928l2940k9940k5938k2917k1161j8755j5260
56125A511310j2634j1666j0649q501o105l773n97K774M191L925N112Q919J2661
$$ plain form
56193 4987500 5277153 5576797 5883457 6191005 6491641 6779072 7048908 7296089 7514214
56184 7514214 7698172 7845424 7953845 8020474 8043874 8026077 7970871 7881786 7763061 7620659
56174 7620659 7460247 7285219 7098122 6902679 6702712 6500297 6296605 6093362 5891728
56165 5891728 5690805 5489160 5287147 5086217 4886867 4689009 4493611 4302215 4115313
56156 4115313 3932733 3755119 3583689 3418961 3261035 3110683 2969091 2836846 2713896
56147 2713896 2599840 2493698 2394491 2302691 2219694 2145017 2075641 2009293 1946834 1890108 1839128
56136 1839128 1792826 1750914 1713149 1678221 1645281 1615341 1589403 1566486 1545325 1526570 1511310
56125 1511310 1498676 1487010 1476361 1467860 1461755 1457982 1457385 1460159 1464350 1468275 1473387 1482306 1494967
56112A494967J4248J5076J6774J8415J9069K0097K2590K4977K5478K4753K4213
56101A720657K3630K2332K0848J9732J8391J6356J4237J2580J1455J1520J3460
56090A905198J6190J8135K0312K5148L2180L8379M3131M9129N7609O6675P5365
56079B347451Q5337R7083J08433J18471J29145J41102J51636J58380J61478J60493
56069C659009J53361J40657J26975J15711J05923R6261Q7808Q0388P0059N3564
56059D689716L2456J0256j1247l0690m5703n5855o4242p3860q4982r7699j13138
56048D155012j29909j43052j49131j49318j45614j37912j26798j14998j03522
56039B954758r0435p5825o3609n5793m9461m2346l6671l4236l2411k8643k4651
$$ plain form
56112 1494967 1509215 1524291 1541065 1559480 1578549 1598646 1621236 1646213 1671691 1696444 1720657
56101 1720657 1744287 1766619 1787467 1807199 1825590 1841946 1856183 1868763 1880218 1891738 1905198
56090 1905198 1921388 1939523 1959835 1984983 2017163 2055542 2098673 2147802 2205411 2272086 2347451
56079 2347451 2432788 2529871 2638304 2756775 2885920 3027022 3178658 3337038 3498516 3659009
56069 3659009 3812370 3953027 4080002 4195713 4301636 4397897 4485705 4566093 4636152 4689716
56059 4689716 4722172 4732428 4721181 4690491 4644788 4588933 4524691 4450831 4365849 4268150 4155012
56048 4155012 4025103 3882051 3732920 3583602 3437988 3300076 3173278 3058280 2954758
56039 2954758 2864323 2788498 2724889 2669096 2619635 2577289 2540618 2506382 2473971 2445328 2420677
56028B420677k2547k1067j9016j8082j8691j7778j4260j1871j2631j2564q297
56017B243873k909m42N73L057N588O143P224J1707J7370K0863K3376K7142L0207
56004B393772K9927K8132K7796K8304K8610L0772L5381L8146L6422L4574L7185
55993B749021M1613M3163M2928M4202M5666M4768M3645M5191M7293M7373M8251
55982C243114N2944N8107N9489N9504O2446O6738O9163P2216P9549Q8266R3375
55971D004911R5912R9500J03186J04991J07888J14755J22162J26569J31405J40264
55961E151543J49134J53864J58986J69809J82047J89392J95211K06121K19867
55952F775974K30740K41295K57051K74911K88676L00937L17587L35937L50436
$$ plain form
56028 2420677 2398130 2377063 2358047 2339965 2321274 2303496 2289236 2277365 2264734 2252170 2243873
56017 2243873 2240964 2240522 2241095 2244152 2249740 2255883 2263107 2274814 2292184 2313047 2336423 2363565 2393772
56004 2393772 2423699 2451831 2479627 2507931 2536541 2567313 2602694 2640840 2677262 2711836 2749021
55993 2749021 2790634 2833797 2876725 2920927 2966593 3011361 3055006 3100197 3147490 3194863 3243114
55982 3243114 3296058 3354165 3413654 3473158 3535604 3602342 3671505 3743721 3823270 3911536 4004911
55971 4004911 4100823 4200323 4303509 4408500 4516388 4631143 4753305 4879874 5011279 5151543
55961 5151543 5300677 5454541 5613527 5783336 5965383 6154775 6349986 6556107 6775974
55952 6775974 7006714 7248009 7505060 7779971 8068647 8369584 8687171 9023108 9373544
55943I373544L64554L84452M06644M24995M43753M69777M98089N20070N40036
55934A3425914N68365O03965O39383O76920P22734P70925Q11571Q49186Q95415
55925A9964378R49178J002584J059935J130692J209849J286414J365134J458172
55917B9426336J562275J667834J783207J924567K088418K260873K446733K660802
55909D5821045K898758L148798L424628L752793M134950M560063N046851N634765
55901G8422651O341081P169303Q148415R312808J0653860J2149101J3831004J5766899
55893A61795122J7987479K0506776K3381378K6643222L0196481L3890429L7564337
55886C51965224M0628951M1467426L7731172K7933627J3043181l654978j8452106
$$ plain form
55943 9373544 9738098 10122550 10529194 10954189 11397942 11867719 12365808 12885878 13425914
55934 13425914 13994279 14598244 15237627 15914547 16637281 17408206 18219777 19068963 19964378
55925 19964378 20913556 21916140 22976075 24106767 25316616 26603030 27968164 29426336
55917 29426336 30988611 32656445 34439652 36364219 38452637 40713510 43160243 45821045
55909 45821045 48719803 51868601 55293229 59046022 63180972 67741035 72787886 78422651
55901 78422651 84763732 91933035 100081450 109394258 120048118 132197219 146028223 161795122
55893 161795122 179782601 200289377 223670755 250313977 280510458 314400887 351965224
55886 351965224 392594175 434061601 471792773 499726400 512769581 509114603 490662497
55879D90662497k9107164l5283052l7782081l7700637l6034653l3540873l0675216
55872B50538821k7663257k4655386k1788828j9143998j6740116j4593200j2726964
55865A13227072j1127771r744308q539643p504155o619527n852807n187847m625085
55857E4025929m148292l724987l340594l001398k704131k432936k186224j976840
55849C0510527j803719j649708j508500j388472j289219j199095j117322j054581
55841A9499911j009368r65880r17634q72138q30415p82920p28668o78560o36230
55832A2078098n93777n49507n12018m83176m53975m21158l92234l70354l48929
55823G952970l24820l03036k85319k67238k49083k36606k28829k17935k03339
$$ plain form
55879 490662497 461555333 426272281 388490200 350789563 314754910 281214037 250538821
55872 250538821 222875564 198220178 176431350 157287352 140547236 125954036 113227072
55865 113227072 102099301 92354993 83815350 76311195 69691668 63838861 58651014 54025929
55857 54025929 49877637 46152650 42812056 39810658 37106527 34673591 32487367 30510527
55849 30510527 28706808 27057100 25548600 24160128 22870909 21671814 20554492 19499911
55841 19499911 18490543 17524663 16607029 15734891 14904476 14121556 13392888 12714328 12078098
55832 12078098 11484321 10934814 10422796 9939620 9485645 9064487 8672253 8301899 7952970
55823 7952970 7628150 7325114 7039795 6772557 6523474 6286868 6058039 5840104 5636765
55814E636765j92999j88886j83988j75702j69319j65875j59423j49114j41683
55805D109776j38839j34122j25173j17476j12774j05496r4376q6504q5831q7943
55795C021242q9698r3887j00589j03999j01923r9165r7897r3892q5799p8830p5259
55784B000304p0270o1327n3074m8710m4699l8283l2557k9832k7157k2596j9151
55773A552648j8793j9015j8618k0322k4514k6968k5871k4726k5523k5650k4302
55762A298346k5021k8779l1090k9241k6169k4313k2052j9086j8614k0932k1236
55751A031813j7347j3461j2942j3285j1663r593q675p281m709l272l203j213L014
55738I28183M709J588k317l698m941q402j1581j2096j2231j4247j6017j5385j4383
$$ plain form
55814 5636765 5443766 5254880 5070892 4895190 4725871 4559996 4400573 4251459 4109776
55805 4109776 3970937 3836815 3711642 3594166 3481392 3375896 3281520 3195016 3109185 3021242
55795 3021242 2931544 2837657 2737068 2633069 2531146 2431981 2334084 2240192 2154393 2075563 2000304
55784 2000304 1930034 1868707 1815633 1766923 1722224 1683941 1651384 1621552 1594395 1571799 1552648
55773 1552648 1533855 1514840 1496222 1475900 1451386 1424418 1398547 1373821 1348298 1322648 1298346
55762 1298346 1273325 1244546 1213456 1184215 1158046 1133733 1111681 1092595 1073981 1053049 1031813
55751 1031813 1014466 1001005 988063 974778 963115 953522 944847 937566 932857 929585 926382 925169 928183
55738 928183 932892 934480 932163 928465 923524 915122 903541 891445 879214 864967 848950 833565 819182
55725H19182j5141j5881j4624j2852j1977j0359p212n433p093j0061j2135j4499
55713F81915j8067k0593k0554k0043k0772k1121j9781j8211j6928j3901r292o922
55701D75730q097q992p394o700r400j1940j0723q437r280j1956j2521j0877r394
55688C50019q079n766l475k318o37K737N104L812Q09o93j317l057m509l070J38
55673C29698J914J846J630J182o39k931l929m075m752n421m908l979l876m006
55659B97754l691m134n905o708m682j851j230k448l188k867j926L49M064O799
55645B70336O680N559O004P088O379M213K555J376l48j606p09J443K685K957L506
55630C18118M060L730L418M301N151M146K117J241J669K083K313K657K154L23
$$ plain form
55725 819182 804041 788160 773536 760684 748707 738348 731136 725703 718610 708549 696414 681915
55713 681915 663848 643255 622701 602658 581886 560765 540984 522773 505845 491944 482652 475730
55701 475730 467633 458641 451247 444547 435147 423207 412484 404047 394767 382811 370290 359413 350019
55688 350019 341940 336174 332699 330381 329744 332481 337585 341397 342206 341513 340196 337139 332630 329560 329698
55673 329698 331612 333458 335088 336270 335631 332700 328771 324696 319944 314523 309615 305636 301760 297754
55659 297754 294063 289929 284024 277316 272634 270783 269553 267105 263917 261050 259124 259473 263537 270336
55645 270336 277016 282575 288579 295667 302046 306259 308814 310190 309842 308236 307527 308970 311655 314612 318118
55630 318118 322178 325908 329326 333627 338778 342924 345041 346282 347951 350034 352347 355004 357158 357481
55616C57481q29M62K414K155J78p76j49L07j24p45j543k692k759m18K671L536
55600C59169J955K57k81j91K66J216J735Q65k89R4J661K567K388K038J535K51
55584C75236j235k010k932n395q514j0057r820r672j0537j1630j2440j3237j3629
55571B64128j2666j0476q249o717n919n937o428o257n066m277m971n837n120l483
55557A72725k913l638m256m225m122m074l784l522l446k731j102n9p08j502l89
55542A32254J730K172M45j393j927j672j290o27K77Q71R47O81O7q73j802k710
55526A27150l837m371k810M04K548K200J165J248J331q6j666j227O82J979K368
55511A27078K864L334L206L385M689N672M740L163L079L775L087J322M17J93j042
$$ plain form
55616 357481 356652 357114 359528 361683 361861 361085 360936 361243 361119 360374 358831 356139 353380 352962 355633 359169
55600 359169 361124 361381 361100 360909 361175 362391 364126 364991 364702 364796 366457 369024 371412 373450 374985 375236
55584 375236 374001 371991 369059 363664 355150 345093 335273 325601 315064 303434 290994 277757 264128
55571 264128 251462 240986 232737 226020 220101 214164 207736 201479 196413 192136 187165 181328 176208 172725
55557 172725 169812 166174 161918 157693 153571 149497 145713 142191 138745 136014 134912 134853 134145 132643 132254
55542 132254 133984 136156 136601 135208 133281 131609 130319 129692 129969 130840 131787 132468 132535 131662 129860 127150
55526 127150 123313 118942 116132 116536 119084 121284 122449 123697 125028 124942 123276 122049 122731 124710 127078
55511 127078 129942 133276 136482 139867 144556 150228 154968 158131 161210 164985 168072 169394 169811 170004 168962
55496A68962k865l441l395n102q024q732o220l587l316m084l624k114r90n38j82
55481A12748J62L85P90J664K856M019M592L956K484J707K337L004K415J568J950
55466A46637K752K265J074J160K446K942K065J172Q92M79j88l87l72j058j964
55451A59915j869j426k528m968o399n940n274n678o370o501o439o358n668m633
55437H9864m549n489n686m076j868q25j244k220k794k413j323o48j085j764j485
55422E2395n23J55O53J409J452l79k925l686k146j32Q95Q37l97k782m848m743
55406C5235k733o86P15K056L077K966K416K590K353l22m220n551l366r59r85k240
55390C0346k559j918j153j45J014J292N81L98J306J683M40r38n94J088K456K766
$$ plain form
55496 168962 166097 162656 159261 154159 146135 137403 131183 127596 124280 120196 116572 114458 113468 112930 112748
55481 112748 112910 113295 114085 115749 118605 122624 127216 131172 133656 135363 137700 140704 143119 144687 146637
55466 146637 149389 151654 152728 153888 156334 159276 161341 162513 163405 163884 163696 163309 162937 161879 159915
55451 159915 158046 156620 154092 149124 142725 136785 131511 125833 119463 112962 106523 100165 94497 89864
55437 89864 85315 79826 74140 70064 68196 67371 66127 63907 61113 58700 57377 56729 55644 53880 52395
55422 52395 51872 52027 52680 54089 55541 55162 52237 48551 46405 46273 47168 48005 47608 44826 39978 35235
55406 35235 32502 31816 32531 34587 37664 40630 43046 45636 47989 47667 43447 37896 34530 33571 32586 30346
55390 30346 27787 25869 24716 24571 25585 26877 27458 27856 29162 30845 31285 30347 29753 30841 33297 36063
55374C6063K167R33j93j63Q42J412J057R04J496J767J069M60P54R45o1j494j844
55357D6114r46J58N97J15r59j656j193j34K77P9M45J492J924J185K05l25o59o42
55339D6077L14J467J083p06j555l33J231J381O60J94l81j671k914l130k557j649
55323C7511j47J724K646K132J539J799J722L8k254l221k497r80P70K214K192M02
55307D5590j301r30Q79J722P08o98r34m4R44J291R65M27J78K40K03j24m62n93
55289D8061p22j176k088l233l851l117j365j36j77k74O36J325K00j618j610K49
55273C1104J580J483J308J407L15j930k822j280L81J80m44N90K392K776J855J389
55257D0284J633J327K98j86M08R89L34j362k615k066j01J096P2j694j640N7O95
$$ plain form
55374 36063 38230 39163 38970 38807 39649 41061 42118 43022 44518 46285 47354 47814 48568 49513 49452 47958 46114
55357 46114 45168 45326 45923 46038 45079 43423 42230 42096 42373 42452 42897 44389 46313 47498 47703 47378 46719 46077
55339 46077 46391 47858 48941 48235 46680 46347 47578 48959 49619 49813 49432 47761 44847 41717 39160 37511
55323 37511 37364 39088 41734 43866 45405 47204 48926 48964 46710 43489 40992 40012 40782 42996 45188 45590
55307 45590 44289 43359 44238 45960 46668 45970 45036 44992 45936 47227 48192 48619 48797 49037 49240 49116 48654 48061
55289 48061 47339 46163 44075 40842 36991 33874 32509 32373 32196 31922 32558 33883 34083 32465 30855 31104
55273 31104 32684 34167 35475 36882 37197 35267 32445 31165 31546 31726 31282 31872 34264 37040 38895 40284
55257 40284 41917 43244 43542 43356 43764 44753 45087 43725 41110 39044 38943 40039 40111 38417 36777 36834 37529
55240C7529o28j555l00J620K056J339Q43L81p33j638j138O3M33R7L90J527K377
55223D2663K171J158k0o05l4J215J889J632J298J125K06j443k189j220J00N97
55207D8543J032J975K063L50j444j271K14J195J676K433K531P64j442j588k5N74
55191E7580n35j435j075p19j243j552p60L8n78k283l646l879l102j710k26O37
55175C5512L88p36j793j691j91J532J963J170P98J733K891L107K925L345L738
55160E4691K625J0k450l392k809j503m17k61r47j524j237k25J029K201K741K050
55144E0582N71l66l35k13l28J55J218J277l46j952j929r53j68R98L180M924M543
55127F0858K833J631Q17o94k060j395R30K572K504J698P02q58k408k512j234l38
$$ plain form
55240 37529 36901 35346 35046 36666 38722 40061 40904 41285 40552 38914 37776 37839 38272 38369 38759 40286 42663
55223 42663 44834 45992 45972 45367 45333 46548 48437 50069 51367 52492 52698 51255 49066 47846 47946 48543
55207 48543 49575 51550 53613 53963 52519 51248 51462 52657 54333 56766 59297 60061 58619 57031 57006 57580
55191 57580 57045 55610 54535 53816 52573 51021 50261 50299 49721 47438 43792 39913 36811 35101 34875 35512
55175 35512 35900 35164 33371 31680 31489 33021 34984 36154 36952 38685 41576 44683 47608 50953 54691
55160 54691 57316 57326 54876 51484 48675 47172 46755 46494 45547 44023 42786 42561 43590 45791 48532 50582
55144 50582 51153 50787 50452 50239 49911 50066 51284 52561 52215 50263 48334 47381 47213 48211 51391 56315 60858
55127 60858 63691 65322 66139 65445 63385 61990 62920 65492 67996 69694 70396 69538 67130 64618 63384 63046
55111F3046p31j587k143k483k286r44P72J144K24Q4J626L014K380N28l86J92Q52
55094F3302K80j287k596k783k248j996k108j501K92J966K121J420J581K649K823
55079F1915J047j673l767m597m143k405K67K829M154L747K009R6q24o07m4M39
55063E8443J169J960J730L09p01j29R16R61O53J470K964L495L076L073L440K776
55047H5605J186O80K146L946M239K928Q67j203k311j476Q32K744L181K753K119
55032A08236R49p68j840j355o2P56J029J563K556L274L022J831L15q18j234j077
55016A16377n81J99J097J602J386O76j68j040j670j542p26m4J59M96J158J260
55000A18639M75l5L22Q8j875l872l586j838j433k711l120j472K64K20p42r58n63
$$ plain form
55111 63046 62315 60728 58585 56102 53816 52872 53644 54788 55012 55096 56722 59736 62116 62644 62258 62450 63302
55094 63302 63582 62295 59699 56916 54668 52672 50564 49063 49355 51321 53442 54862 56443 59092 61915
55079 61915 62962 61289 57522 52925 48782 46377 46644 49473 53627 57374 59383 59479 58655 58048 58004 58443
55063 58443 59612 61572 63302 63611 62910 62781 63697 64658 65311 66781 69745 73240 76316 79389 82829 85605
55047 85605 86791 87471 89617 93563 97802 100730 101597 100394 98083 96607 97439 100183 103364 106117 108236
55032 108236 109185 108417 106577 105222 105160 105916 106945 108508 111064 114338 117360 119191 119506 118688 117454 116377
55016 116377 115796 115995 117092 118694 120080 120756 120588 119548 117878 116336 115610 115566 115725 116221 117379 118639
55000 118639 119114 119079 119401 119489 117614 113742 110156 108318 106885 104174 101054 99582 99846 100066 99324 98366 97803
54983I7803p01j433j875j660j153o72k11M00J332K447L059K565J257J5o08m89
54967A00076L47J311J242o3r61J40K489M002M022L496K846J522l50j678j913j478
54951A15050n97Q25K241K745K365J723P34q31j915j213N21J198L39n84p41o50
54935A21210k96J059K803L110J809P93P89J61j926l538k843r85k37o81o71L75
54919A20932J393J421O44j10j68M59R77Q26P04J575K786K670J240O16K058M209
54903A42232N106M590L760L392L802N144O943Q272R068J0152J1504J1877J0944
54890B36786J0342J1544J3972J6254J8131J9950K1326K1520K0406J8039J4107
54879D22377Q794L412r38m754r225j4398j8970k1547k1597j9701j7184j5087j3258
$$ plain form
54983 97803 97102 95669 93794 92134 90981 90309 90098 90498 91830 94277 97336 99901 101158 101173 100565 100076
54967 100076 100423 101734 102976 102913 101952 102092 104581 108583 112605 116101 118947 120469 120119 118441 116528 115050
54951 115050 114453 115278 117519 120264 122629 124352 125086 124255 122340 121127 121648 122846 123185 122601 121860 121210
54935 121210 120914 121973 124776 127886 129695 130488 131277 131438 129512 125974 123131 122146 121909 121228 120557 120932
54919 120932 122325 123746 124390 124280 124112 124571 125548 126374 127078 128653 131439 134109 135349 135965 138023 142232
54903 142232 147338 151928 155688 159080 162882 168026 174969 183241 192309 202461 213965 225842 236786
54890 236786 247128 258672 272644 288898 307029 326979 348305 369825 390231 408270 422377
54879 422377 431171 434583 433645 428891 419666 405268 386298 364751 343154 323453 306269 291182 277924
54866B77924j1078r002q255q931r617r215p884n977l502j044L40P46J570L323
54852B09398M833N342N745O849P897Q119Q361R855J2400J4973J7178J8887J9413
54839C49250J8271J6007J3239R593M597j085o312j0694j4347j7100j8791j9666
54827C22962j9816j8860j6835j4628j2986j1893j1337j1547j1986j1307r163o933
54815A65671n872n604n128m224l009j417Mlj650l335l628k876j940o91R82J895
54799A29175R62q95j697q17N84J068J5k168m052m051k040M03J788J961J290q0
54783A21446j616k368k255k166k233j614n29n93k030k611q33J676K557J844Q79
54768A09554p4j171j454k98Q75N62j88N24K233L072L026L485M143L354J543J269
$$ plain form
54866 277924 266846 257844 249589 240658 231041 221826 213942 207965 204463 203419 203759 204505 206075 209398
54852 209398 214231 219573 225318 232167 240064 248183 256544 266399 278799 293772 310950 329837 349250
54839 349250 367521 383528 396767 406360 410957 409872 403560 392866 378519 361419 342628 322962
54827 322962 303146 284286 267451 252823 239837 227944 216607 205060 193074 181767 172604 165671
54815 165671 159799 154195 149067 144843 141834 140417 140421 140418 138768 135433 131805 128929 126989 126298 127280 129175
54799 129175 130137 129242 127545 126728 127312 128380 128395 126227 122175 118124 116084 116487 118275 120236 121526 121446
54783 121446 119830 117462 115207 113041 110808 109194 108665 108072 106042 103431 102598 104274 106831 108675 109554
54768 109554 109480 108309 106855 106557 107432 107994 107806 108330 110563 113635 116661 120146 124289 127643 129186 130455
54752A30455L317N234M798K923K012K890M371M993M404L664M393O966R756J1007
54738B01183J1065J1574J2890J3920J4343J5214J6987J8612J9208J9292J9561
54727C73849J9517J8275J5885J2974R535M866j271p923j3461j6806j8071j8087
54715C79282j7315j5640j3121j0465q442p207o433n665m522l029j846j464j265
54702B82868k68J184J811J623K265M579P238Q788R660J1199J3801J6916J9804
54689C81468K1447K1017J9359J8740J9970K1174K0413J8068J5318J2002P725L625
54677E80326R30j201m340q232j1480j4050j7025k0385k2928k4086k4185k3319
54665D10025k1541j9590j8081j6468j4226j2158j1090j0373r318q892r884j0666
$$ plain form
54752 130455 133772 139006 143804 146727 148739 151629 156000 160993 165397 169061 173454 180420 190176 201183
54738 201183 212248 223822 236712 250632 264975 280189 297176 315788 334996 354288 373849
54727 373849 393366 411641 427526 440500 450035 454901 453630 445707 432246 415440 397369 379282
54715 379282 361967 346327 333206 322741 314299 307092 300659 294994 290472 287443 285597 284133 282868
54702 282868 282600 283784 285595 287218 289483 294062 301300 310088 319748 330947 344748 361664 381468
54689 381468 402915 423932 443291 462031 482001 503175 523588 541656 556974 568976 576701 580326
54677 580326 581256 580055 575715 567483 556003 541953 524928 504543 481615 457529 433344 410025
54665 410025 388484 368894 350813 334345 320119 307961 296871 286498 277180 268288 258404 247738
54653B47738r266o744n767o401o192m208k120j099l34P98J523J303O47k15j643
54638B08020l175l617k906k085j317J43J750J730o1j342m19J735L090K844J423
54623B05813k92j088j30J861L228L422L237L060K538K034K566L939M675M277L960
54608B43100M628N751O638P204P119N911M409M295N641O608O178N410N359N581
54594C23832N626O169P516Q475P892O250M755L911L690M045M649N079N625O814
54580D04328Q083Q474Q740J0721J4219J6611J6462J5487J5843J7424J9118K0835
54568E76345K2649K3462K2132J8845J4048P411q16q780j4921j9709k3963k6704
54556E89999k6536k4308k2339k1487k0642j8873j6540j4273j2261j0626r470q444
$$ plain form
54653 247738 238472 231728 225961 219560 213368 209160 207040 205941 205607 206405 207928 209231 209878 209663 208020
54638 208020 204845 201228 198322 196237 194920 195063 196813 198543 198482 197140 196721 198456 201546 204390 205813
54623 205813 205521 204433 204303 206164 209392 212814 216051 219111 221649 223683 226249 230188 234863 239140 243100
54608 243100 247728 253479 260117 267321 274440 280351 284760 289055 294696 301304 307482 312892 318251 323832
54594 323832 329458 335627 343143 351618 359510 365760 370515 374426 378116 382161 386810 391889 397514 404328
54580 404328 412411 420885 429625 440346 454565 471176 487638 503125 518968 536392 555510 576345
54568 576345 598994 622456 644588 663433 677481 684892 684076 675296 660375 640666 616703 589999
54556 589999 563463 539155 516816 495329 474687 455814 439274 425001 412740 402114 392644 384200
54544C84200o984n077l277k103j784k348l573n147o984q886r998r520q141p567
54530C02811q233q659p684o116n402n652n964n917n849o135o824p487p234n706
54516B09949m099l937m675m180k056o26j486l069l142k129j978k896l357k761
54502A69558k044j721j075M66K392L696L683K266K26j141j312j137j407j530n54
54487A70366J153K353K711K880L079K801J940J237J299J866K195J851J109P95
54473A97635J512K891M039M840O052P850R239R470R131R069R089Q738Q542R360
54459B97457J0826J1541J0599Q184M969J639j327m027o887r536j0675r899q855
54446B94009r453j1377j2529j1691r654p850o965o926p296p437o925n983n134
$$ plain form
54544 384200 377216 372139 368862 366759 364975 362627 359054 353907 346923 338037 328039 318519 310378 302811
54530 302811 294578 285919 278235 272119 266717 261065 255101 249184 243335 237200 230376 222889 215655 209949
54516 209949 205850 201913 197238 193058 191002 190376 188890 185821 182679 180550 178572 175676 172319 169558
54502 169558 167514 165793 164718 165184 167576 171272 174955 177221 177447 176306 174994 173857 172450 170920 170366
54487 170366 171519 173872 176583 179463 182542 185343 187283 188520 189819 191685 193880 195731 196840 197635
54473 197635 199147 202038 206077 210917 216969 224819 234058 243528 252659 261728 270817 279555 288097 297457
54459 297457 308283 319824 330423 338607 343576 345215 343888 339861 332974 323438 312763 302864 294009
54446 294009 284556 273179 260650 248959 239305 231455 224490 217564 210268 202831 195906 189923 184789
54433A84789m525l952l361k788k075j156m72m66p99o50K19J261J904K095K005
54418A72029J658J068M91L57Q15J450J599J198R86J596K674L345L325L047K920
54403A98558L120L760M500M328K729P81o1j02r99l140m836m521k552m37O38K24
54387B01990j297k719l063k794k913l110k350j142j225k655l429k732k212l003
54373A67346l642k540o83k5o98j424j498p69J074L578M967M140K288J155Q51P15
54357A74835J045K191L153K872J955J512J410J289J882L379L871J969k66K38K960
54342B04295M610M127L837N364P308P805P098O599P044Q276R458R204O913M123
54328B96061L005L396L080J128q88j399p38PK16p17l359o910r286r343p903o152
$$ plain form
54433 184789 180264 176312 172951 170163 168088 166932 166460 165994 165195 164545 164764 166025 167929 170024 172029
54418 172029 173687 174755 175246 175603 176418 177868 179467 180665 181651 183247 185921 189266 192591 195638 198558
54403 198558 201678 205438 209938 214266 216995 217776 217715 217613 216614 213474 208638 204117 201565 201128 201766 201990
54387 201990 200693 197974 194911 192117 189204 186094 183744 182602 181377 178722 175293 172561 170349 167346
54373 167346 163704 161164 160481 160456 159758 158334 156836 156067 157141 160719 165686 169826 172114 173269 174120 174835
54357 174835 175880 178071 181224 184096 186051 187563 188973 190262 192144 195523 199394 201363 201097 201335 204295
54342 204295 208905 213032 216869 222233 229541 237346 244444 251043 258087 266363 275821 285025 291938 296061
54328 296061 299066 302462 305542 306670 305782 304383 303645 303652 303868 303151 299792 292882 283596 274253 266350 260198
54312B60198m417k984k653l578m813n602o045o006m823k701j067o77o39j63M4
54297B14074p73j774j577k12J087J433P63n82j776j660O2K144L182L260L405L921
54281B24977M200M020L987M542N263N498N333N522O439P266O610M136J229m78
54267B88544r85j675l301n104n957n616m515l133k070k129l652n974p955q905
54253B27573q828q042o882n633m532l815l672m032m551n023n575o124n962m472
54239A50430k134k58K98k23j072j723k049k195k332k373k071j495j079q10K9J768
54223A32711L407L532J972n9j240j109j22O42K07j221k154j421M82K148K842K748
54207A43365K289K036K662L967M508L216R33p31j444j823j745o74O66O80q10k225
$$ plain form
54312 260198 255781 252797 250144 246566 241753 236151 230106 224100 219277 216576 215509 214832 214193 214030 214074
54297 214074 213301 211527 209950 209738 210825 212258 213021 212439 210663 209003 209065 211209 214391 217651 221056 224977
54281 224977 229177 233197 237184 241726 246989 252487 257820 263342 269781 277047 283657 287793 289022 288544
54267 288544 287559 285884 282583 277479 271522 265906 261391 258258 256188 254059 250407 244433 236478 227573
54253 227573 218745 210703 203821 198188 193656 189841 186169 182137 177586 172563 166988 160864 154902 150430
54239 150430 148296 148038 148336 148113 147041 145318 143269 141074 138742 136369 134298 132803 131724 130914 130943 132711
54223 132711 136118 139650 141622 141563 140323 139214 139092 139734 139941 138720 136566 135145 135627 137775 140617 143365
54207 143365 145654 147690 150352 154319 158827 162043 162976 162245 160801 158978 157233 156559 157225 157905 157095 154870
54191A54870k412j804j102k44Q02J348Q28m24j614k168j865j018m91p91j256q97
54175A41762J71R81J055N15n62j670j369R99L473L298N91j775k010j056k02O38
54159A44839J581J818J147N97N98K75m96l93P66R09j116l160k708n96M19k56r04
54142A43320o57l19k85M0N50J73j293k703l297l456l446k833j611o11k63k9M39
54125A23719P08N44N23R17J041M30j86p6J28o88k232l043k496j456o72L19K066
54108A19546L808M215L166J825R31J3j314k199j622r0O63k47j853k621k160j404
54092A20657j387k154k726k050j42J709K089Q14j055k371k794k570j942j011N4
54077A05121R13J178P33q1o83q23p11o47o58p06p88o92q8R08J690J898J722J287
$$ plain form
54191 154870 152458 150654 149552 149308 150110 151458 152286 151862 150248 148080 146215 145197 144706 143915 142659 141762
54175 141762 141933 142914 143969 144484 143922 142252 140883 141882 145355 148653 149244 147469 145459 144403 144201 144839
54159 144839 146420 148238 149385 149982 150580 150855 150359 149966 150732 151641 150525 147365 144657 144061 144480 144224 143320
54142 143320 142663 142344 142059 142099 142649 142822 141529 138826 135529 132073 128627 125794 124183 123572 123309 123280 123719
54125 123719 124427 124971 125494 126411 127452 127882 127696 127620 127748 127060 124828 121785 119289 117833 117161 117480 119546
54108 119546 123354 127569 130735 132560 133491 133504 132190 129991 128369 128279 128942 128695 126842 124221 122061 120657
54092 120657 119270 117116 114390 112340 112198 113907 115996 116810 115755 113384 110590 108020 106078 105067 105121
54077 105121 106034 107212 107945 107864 107181 106358 105647 105000 104342 103636 102848 102156 102068 102976 104666 106564 108286 109573
54059A09573M49m78o33J13N91j05j242j528r48l73j1N59J166J249J024J223J654
54042A12283J294j01j570k250k153j586p92j65P8L96J187J788J349M57M58J214
54026A11887J152j97j257o50J048K482L220L357K583P44j198j877j018L05Q41
54011A21422L15l64lJ501K890L004K156J408R41J80p47r34r3J094K099K978L626
53994A41473L704L415L388L590L445K976K820L066L189L144L386L801L815L494
53980A88706L373L339L037L123M469O332P124O978P494Q862R526Q946Q390Q332
53966B78031P655O320O304Q431J0580J0659R436Q571P810O146M203L284L134K719
53952C73283K263K554L047K521J142P4n11j492l217n159o777p688p463o351n516
$$ plain form
54059 109573 110022 109544 108911 109024 109615 109510 108268 106740 105792 105419 105408 105967 107133 108382 109406 110629 112283
54042 112283 113577 113476 111906 109656 107503 105917 105125 104960 105038 105434 106621 108409 109758 110215 110673 111887
54026 111887 113039 112842 111585 110935 111983 114465 117685 121042 123625 124369 123171 121294 120276 120581 121422
54011 121422 121737 121373 121370 122871 125761 128765 130921 132329 133270 133450 132703 131769 131676 132770 134869 137847 141473
53994 141473 145177 148592 151980 155570 159015 161991 164811 167877 171066 174210 177596 181397 185212 188706
53980 188706 192079 195418 198455 201578 206047 212379 219503 226481 233975 242837 252363 261309 269699 278031
53966 278031 285686 292006 298310 306741 317321 327980 337416 345987 353797 359943 364146 367430 370564 373283
53952 373283 375546 378100 381147 383668 384810 384884 384373 382881 379664 374505 367728 360040 352577 346226 340710
53937C40710n547n526m613l524l254l305k717j994k330l615m709n168n225m670
53923B84513l348k251k412l098k724j384q06j771l133l619l338l038k822k109
53909B48660m84J540K556J646j98r79m52o27k684m829m597k111N82K465L995N263
53893B49746N562M624K888Q13q26o76J567L913M226L182L187M733N956N913N978
53878C00786P373R179R863R485R284R909J0889J1384J0934R705Q348P424O976
53865D21539O713O222M877K266p47k191j085J264K882L330L513M093N137O534
53851D64347P711P607O088M622M489N198N786O514P812Q690Q111O987O822P030
53837E57814N824L209Q62o39k228m130n469o149o996p892p876p212p325q433r363
$$ plain form
53937 340710 335163 329637 325024 321500 318246 314941 312224 310230 307900 304285 299576 294408 289183 284513
53923 284513 281165 278914 276502 273404 270680 269296 268490 266719 263586 259967 256629 253591 250769 248660
53909 248660 248176 249716 252272 253918 253720 252741 252289 251662 248978 244149 239552 237441 238023 240488 244483 249746
53893 249746 255308 259932 262820 263633 262807 262131 263698 267611 271837 275019 278206 282939 288895 294808 300786
53878 300786 308159 317338 327201 336686 345970 355879 366768 378152 389086 398791 407139 414563 421539
53865 421539 428252 434474 439351 441617 440870 438679 437594 438858 441740 445070 448583 452676 457813 464347
53851 464347 472058 479665 485753 490375 494864 500062 505848 512362 520174 528864 536975 543962 550784 557814
53837 557814 563638 566847 567709 567070 564842 560712 555243 549094 542098 534206 526330 519118 511793 503360 493997
53822D93997r885j0969j2438j2771j1899j1742j2997j3729j2381j0173q979q588
53810C57446p680o130m831m339m912o750q953r512p747n686n624p075p675o451
53796B64081m763m240m967n695n093k947p06l71k302m562n057l825k590k506l134
53781B11323l314k443r84p0m49j665k593k762k670k675k369j364p0P91J080J284
53765A91050J922K951L598K953J111n90j021n37r8K65J100K104K508K561L145
53750B13022L874L367J666O73J443K669K782K299K838M747O885Q214Q565Q204
53736B71248P455O642N969N543N617O393P468P982P555O615N744N129M655M083
53722C58098L228K425K395L106L239J749n36k000k363k507k673k536k734m412
$$ plain form
53822 493997 484112 473143 460705 447934 436035 424293 411296 397567 385186 375013 366034 357446
53810 357446 349766 343636 338805 334466 329554 322804 313851 304339 296592 290906 285282 278207 270532 264081
53796 264081 259318 255078 250111 244416 239323 236376 235670 235299 232997 228435 223378 219553 216963 214457 211323
53781 211323 208009 205566 204582 204512 204063 202398 199805 197043 194373 191698 189329 187965 187895 188686 189766 191050
53765 191050 192972 195923 199521 202474 203585 202995 201974 201437 201339 201604 202704 204808 207316 209877 213022
53750 213022 216896 220263 221929 222602 224045 226714 229496 231795 234633 239380 246265 254479 263044 271248
53736 271248 278703 285345 291314 296857 302474 308867 316335 324317 331872 338487 344231 349360 354015 358098
53722 358098 361326 363751 366146 369252 372491 374240 373704 371704 369341 366834 364161 361625 358891 354479
53708C54479p068q670q283p017o063n372m678m243m030l597l269l972n444o188
53694B76585n594m546l528k007k28L78n44j440j279r91j462k012k141k797m298
53679B44096m782k738K38J263j17j836k278j569m40O64J531K277L289M398M733
53664B48729M062L329L186L138K927L408M913O052N484L795K314J292N02M95J504
53649B95130K309J731L80n48j099j540r49J137K844K086k02j356r46p64j246p67
53633B96200J192K838K870K219K009J779R25K32O26J570K073K322L057L945L868
53618C27725K603J132K92n1l03l18J91Q37Q54L99P17K365L956L722K012Q30R50
53601C47913J163O14J11J85k35j812k920j630J309L198K621N68j138j343j36R36
$$ plain form
53708 354479 347411 338741 330458 323441 317378 312006 307328 303085 299055 295458 292189 288217 282773 276585
53694 276585 270991 266445 262917 260910 260682 261060 260516 259076 257797 256806 255344 253332 251191 248394 244096
53679 244096 239314 236576 236814 238077 237960 236124 233846 232277 231837 232501 234032 236309 239598 243996 248729
53664 248729 252791 256120 259306 262444 265371 268779 273692 279744 285228 289023 291337 292629 293131 293626 295130
53649 295130 297439 299170 299550 299002 297903 296363 295414 296551 299395 301481 301279 299923 298977 298213 296967 296200
53633 296200 297392 300230 303100 305319 307328 309107 310032 310264 310890 312460 314533 316855 319912 323857 327725
53618 327725 330328 331460 331752 331701 331398 331080 331271 332108 332962 333361 334078 336443 340399 344121 346133 346963 347913
53601 347913 349076 349690 349801 349986 349751 347939 345019 343389 344698 347896 350517 351085 349947 348604 348468 349404
53585C49404l1k817m713l871j712m56L04K082L899L297N33j404j262r45j706j914
53569C38688j10K152K592J660J624L104M426M127K687J694K014K992L185K090
53555C72925R98J557L583N190N195M405M205M765N096M313K534J063J570M339
53541D21738P466Q659P761O466N837N497N186N301N551M814L173K411L517N056
53527D98433N203M218L622L865M150L907L126J731l7j057l74J310K320K089J560
53512E34066J560J825J789J488J255J110Q17J87p10j357j014L03J274O62o92m49
53496E42114K041M362M020K040J765M242O727O565M647L658M245M961N209N886
53482F02482P112P567O687N677N533N765N963O874Q684R914R442Q328Q048Q297
$$ plain form
53585 349404 349373 346556 341843 337972 336260 335804 336108 338190 342089 345386 345919 344515 343253 342308 340602 338688
53569 338688 338578 340730 343322 344982 346606 349710 354136 358263 360950 362644 364658 367650 370835 372925
53555 372925 373923 375480 379063 384253 389448 393853 398058 402823 407919 412232 414766 415829 417399 421738
53541 421738 429204 437863 445624 452090 457927 463424 468610 473911 479462 484276 487449 489860 493377 498433
53527 498433 503636 507854 511476 515341 519491 523398 526524 528255 528218 527161 526787 528097 530417 532506 534066
53512 534066 535626 537451 539240 540728 541983 543093 543910 544097 543387 542030 541016 541319 542593 543255 542563 542114
53496 542114 544155 548517 552537 554577 556342 560584 567311 573876 578523 582181 586426 591387 596596 602482
53482 602482 609594 617161 623848 629525 635058 640823 646786 653660 662344 672258 681700 690028 698076 706373
53468G06373Q188Q293R463J0739J0700J0073J0655J2276J3336J3874J5312J7295
53456H46577J7810J6921J7318K0125K2921K3532K3222K4193K5974K6636K6198
53445A091427K6314K7334K7969K7736K7849K9336L1642L3486L4313L4605L5100
53434A427111L5854L6042L5070L3767L3670L4888L5784L5236L4075L3506L3185
53423A808188L2058L0324K9261K9428L0186L0800L1114L1179L0948L0373K9458
53412B143317K8371K7603K7528K7530K6372K3900K1515K0279J9436J7721J5292
53401B398864J3154J1248Q420M197m04l941n815o639p822j0333j3508j5655j6380
53388B355386j7311j9589k1825k2121k1231k1705k4151k6492k7130k6744k6455
$$ plain form
53468 706373 714561 722854 732317 743056 753756 763829 774484 786760 800096 813970 829282 846577
53456 846577 864387 881308 898626 918751 941672 965204 988426 1012619 1038593 1065229 1091427
53445 1091427 1117741 1145075 1173044 1200780 1228629 1257965 1289607 1323093 1357406 1392011 1427111
53434 1427111 1462965 1499007 1534077 1567844 1601514 1636402 1672186 1707422 1741497 1775003 1808188
53423 1808188 1840246 1870570 1899831 1929259 1959445 1990245 2021359 2052538 2083486 2113859 2143317
53412 2143317 2171688 2199291 2226819 2254349 2280721 2304621 2326136 2346415 2365851 2383572 2398864
53401 2398864 2412018 2423266 2431686 2435883 2435479 2431538 2425723 2419084 2411262 2400929 2387421 2371766 2355386
53388 2355386 2338075 2318486 2296661 2274540 2253309 2231604 2207453 2180961 2153831 2127087 2100632
53377B100632k6106k5409k5136k5796k6359k5651k4097k2661k1002j8286j5214
53366A844915j3371j2696j1371q636o025n095n252m835l398j738k84J342L349
53353A776905N429P369R299J1166J2698J3915J5179J6675J8334K0187K2318K4504
53341A953978K6515K8587L0961L3123L4423L5399L7293M0176M2859M4979M7722
53330B356015N1649N5278N7087N7791N9083O1051O2525O3274O4002O4509O3913
53319C016177O2789O3040O5064O6803O6397O4237O1568N8607N5306N2499N0605
53308C683092M8035M2857L5761K9720K6396K4244K0618J4694P697J114m493r300
53296C920435j3733j8324k3572k9634l6056m1884m6318m9459n2364n5831n9115
$$ plain form
53377 2100632 2074526 2049117 2023981 1998185 1971826 1946175 1922078 1899417 1878415 1860129 1844915
53366 1844915 1831544 1818848 1807477 1798841 1792816 1787721 1782469 1777634 1774236 1772498 1772214 1773556 1776905
53353 1776905 1782334 1789703 1799002 1810168 1822866 1836781 1851960 1868635 1886969 1907156 1929474 1953978
53341 1953978 1980493 2009080 2040041 2073164 2107587 2142986 2180279 2220455 2263314 2308293 2356015
53330 2356015 2407664 2462942 2520029 2577820 2636903 2697954 2760479 2823753 2887755 2952264 3016177
53319 3016177 3078966 3142006 3207070 3273873 3340270 3404507 3466075 3524682 3579988 3632487 3683092
53308 3683092 3731127 3773984 3809745 3839465 3865861 3890105 3910723 3925417 3933114 3934228 3929735 3920435
53296 3920435 3906702 3888378 3864806 3835172 3799116 3757232 3710914 3661455 3609091 3553260 3494145
53285C494145o0440n9197n7140n6540n7438n7818n6567n4896n4039n2972m9996
53274B877102m5871m3383m3777m5424m6285m5975m4826m2840m0568l9255l8676
53263B400222l6473l1413k5938k3384k3618k3645k1932j9587j7568j5460j3542
53252B147662j3586j6413k0240k2639k2868k1521j9175j6361j3860j1933j0007
53241A959059p840o227n851o044n429l340j75L102N526O751P418Q494J0217J2290
53227A977951J4708J7414J9569K0507K1287K3625K7152K9499K9506K8517K7973
53216B237708K7587K6838K6307K6272K5651K3798K1856K0761J9223J5534J0435
53205B481970O276M006K517N20k445o309j0271j2795j3257j3239j4796j7805k0438
$$ plain form
53285 3494145 3433705 3374508 3317368 3260828 3203390 3145572 3089005 3034109 2980070 2927098 2877102
53274 2877102 2831231 2787848 2744071 2698647 2652362 2606387 2561561 2518721 2478153 2438898 2400222
53263 2400222 2363749 2332336 2306398 2283014 2259396 2235751 2213819 2194232 2176664 2161204 2147662
53252 2147662 2134076 2117663 2097423 2074784 2051916 2030395 2011220 1994859 1980999 1969066 1959059
53241 1959059 1951219 1944992 1939141 1933097 1927668 1924328 1924153 1927255 1932781 1939532 1946950 1955444 1965661 1977951
53227 1977951 1992659 2010073 2029642 2050149 2071436 2095061 2122213 2151712 2181218 2209735 2237708
53216 2237708 2265295 2292133 2318440 2344712 2370363 2394161 2416017 2436778 2456001 2471535 2481970
53205 2481970 2488246 2492252 2494769 2495289 2492844 2486535 2476264 2463469 2450212 2436973 2422177 2404372 2383934
53192B383934k1903k3070k4571k5846k6418k6727k7406k8592l0118l1555l2080
53181B085648l1200k9573k8319k7620k6813k5677k4723k4281k4220k4440k4769
53170A794013k4565k3242k1182j9345j8271j8024j8614j9394j8813j6112j2936
53159A583515j1645j2231j2523j1494j0490j0773j1610j1776j1542j1903j2772
53148A454756j3136j2605j1868j1738j2459j3802j5369j6834j8036j8807j8736
53137A291366j7588j5907j4751j4672j5320j6051j6496j6595j6546j6768j7420
53126A113252j8091j8395j8600j9034j9242j8582j7418j6695j6488j6167j5872
53115I18668j6369j7271j7002j5170j3423j3048j3188j2627j1940j2220j2741
$$ plain form
53192 2383934 2362031 2338961 2314390 2288544 2262126 2235399 2207993 2179401 2149283 2117728 2085648
53181 2085648 2054448 2024875 1996556 1968936 1942123 1916446 1891723 1867442 1843222 1818782 1794013
53170 1794013 1769448 1746206 1725024 1705679 1687408 1669384 1650770 1631376 1612563 1596451 1583515
53159 1583515 1571870 1559639 1547116 1535622 1525132 1514359 1502749 1490973 1479431 1467528 1454756
53148 1454756 1441620 1429015 1417147 1405409 1392950 1379148 1363779 1346945 1328909 1310102 1291366
53137 1291366 1273778 1257871 1243120 1228448 1213128 1197077 1180581 1163986 1147440 1130672 1113252
53126 1113252 1095161 1076766 1058166 1039132 1019890 1001308 983890 967195 950707 934540 918668
53115 918668 902299 885028 868026 852856 839433 826385 813197 800570 788630 776410 763669
53104G63669j2002j0553j0497j1980j2453j0345p625p164q893j0321j0196r636
53092F42004r700r828r341q930r347r734q789p103o624p788q660p636n689m926
53078E27909n624n978m708k791k224l563n243n267l360j232p44k050l736m463
53064D76926l928k475o54O17L65j329l031l377k496j558j308j552j715j405o03
53049D52477K50N41K14l6L65J150J766K238K884L496L443K570J507J007J200J443
53033D76515Q52q18k838m358n413o409o913o120m604m242n640p107p082o279o159
53018D03385o457o093n609o630q988j0362r200o420l882k513k427l544n230o239
53004C19791n813m540l654l846m789n432m769k924j303j015j384r97O3K29j220
$$ plain form
53104 763669 751667 741114 730617 718637 706184 695839 688214 681050 672157 661836 651640 642004
53092 642004 632304 622476 613135 604205 594858 585124 576335 569232 562608 554820 546160 538524 532835 527909
53078 527909 522285 516307 511599 508808 506584 503021 497778 492511 489151 487919 487175 485125 481389 476926
53064 476926 472998 470523 469869 470486 470851 469522 466491 463114 460618 459060 457752 456200 454485 453080 452477
53049 452477 452727 453268 453482 453446 453811 454961 456727 458965 461849 465345 468788 471358 472865 473872 475072 476515
53033 476515 477367 476549 473711 469353 463940 457531 450618 444498 439894 435652 430012 422905 415823 409544 403385
53018 403385 396928 390835 385226 378596 369608 359246 350046 343626 339744 337231 334804 331260 326030 319791
53004 319791 313978 309438 305784 301938 297149 291717 286948 284024 282721 281706 280322 279325 279388 279617 278397
52989B78397l117l989l656k789j922j410j490j803j579p37j24k84p83j139j573
52974B52002k240k599k245j754j882k353k231j232r4K65l42j143r75M59J856J488
52958B36980n53k158j722j40M91l73j283r08L76J168P42l18r18o56j36l1n8O68
52940B31171K164L124K351K93j398j595n80O63J415J449Q42M1j27Q66K454L228
52924B46361K356N36q37j209j015n75K86J387K042K160K548L416L578K080j25
52909B62989j200n65J074L105N102O108N514M531N077P137Q784Q963Q539Q192
52895C33350P153N070L477M053O283Q095Q168O736M821L557L600M317M100K274
52881D05054O2j070j350j970l199m393n420o610p441o695m241j691p42j549l047
$$ plain form
52989 278397 275280 271291 267635 264846 262924 261514 260024 258221 256642 255905 255781 255497 254714 253575 252002
52974 252002 249762 247163 244918 243164 241282 238929 236698 235466 235372 235637 235295 234152 233177 233636 235492 236980
52958 236980 236427 234269 232547 232407 232898 232525 231242 230334 230710 231878 232620 232302 231384 230728 230592 230561 230503 231171
52940 231171 233335 236459 238810 239103 237705 236110 235530 236193 237608 239057 239899 239940 239813 240679 243133 246361
52924 246361 248717 249253 248416 247207 246192 245617 245903 247290 249332 251492 254040 257456 261034 263114 262989
52909 262989 261789 261224 262298 265403 270505 276613 282127 286658 291735 298872 307656 316619 325158 333350
52895 333350 340503 345573 349050 353103 359386 367481 375649 382385 387206 390763 394363 398680 402780 405054
52881 405054 405116 404046 402696 400726 397527 393134 387714 381104 373663 366968 362727 361036 360294 358745 355698
52866C55698m271m859m728l921k809k037j931k081j780r70m08p04j516k120k404
52851C19159k632k537j609k43M37J64o0N03J299J540J375J296J149N66j45m69
52835C19793n17o16l73R08K976M581M677L278J169o22j309q20L4K49m06j250j377
52818C30375l76J284K438K064L26j459k018j090O88K359L034K452J457J285K046
52803C44865K565K031J072O94R39J190J188J011P05N73J248K651L558L053J845
52788C69188J268J479J726J829K237K854L022K694K525K818L354M214N716P425
52774D12349Q246P785O758N799M789L608K620K067J613R71K59n10j603k882l696
52759D48173l861l997m430m594m141l973n105o951p758o737m876l553l161l351
$$ plain form
52866 355698 351427 346568 341840 337919 335110 333073 331142 329061 327281 326311 325903 325199 323683 321563 319159
52851 319159 316527 313990 312381 312138 312575 312739 312679 313182 314481 316021 317396 318692 319841 320407 320262 319793
52835 319793 319276 318660 318287 319195 322171 326752 331429 334707 335876 335254 333945 333125 333159 333408 333002 331752 330375
52818 330375 329999 331283 333721 335785 336111 334652 332634 331544 332232 334591 337625 340077 341534 342819 344865
52803 344865 347430 349461 350533 351227 352166 353356 354544 355555 356260 356833 358081 360732 364290 367343 369188
52788 369188 370456 371935 373661 375490 377727 380581 383603 386297 388822 391640 394994 399208 404924 412349
52774 412349 420595 428380 435138 440937 445726 449334 451954 454021 455634 456605 456864 456354 454751 451869 448173
52759 448173 444312 440315 435885 431291 427150 423177 418072 411121 403363 396626 391750 388197 385036 381685
52745C81685l935m863n735o014n755n568n725n733n195m685n082o146o483n359
52731C05407l805l307l847m116l521k927l152l626l275k139j357j594k208k129
52717B64404j151j64k72j639l210l667k824j874j857k254j791n56k80j954m059
52702B36852m096j617J280K380J336p73k829m152m458m036l554l266k932k753
52688B07382l498n008n533l743q57O22Kj049j086n91p05j517k366k930l195k990
52672A72938k285j551j145p00K76J404J707Q46m27j167j263j376j960k573k381
52657A60343j266l4N91O32L05n41j757k369j667m17K6l84n15J79J190K140L033
52640A59489L322K262N76J47J445K743K805K778M140O109O672N467M000L400L401
$$ plain form
52745 381685 377750 372887 367152 361138 355383 349815 344090 338357 333162 328477 323395 317249 310766 305407
52731 305407 301602 298295 294448 290332 286811 283884 280732 277106 273831 271692 270335 268741 266533 264404
52717 264404 263253 263089 262817 261178 257968 254301 251477 249603 247746 245492 243701 243145 242865 240911 236852
52702 236852 232756 231139 232419 234799 236135 235362 232533 228381 223923 219887 216333 213067 210135 207382
52688 207382 203884 198876 193343 189600 188743 189365 189367 188318 187232 186641 185936 184419 182053 179123 175928 172938
52672 172938 170653 169102 167957 167257 167533 168937 170644 171490 171063 169896 168633 167257 165297 162724 160343
52657 160343 159077 159043 159634 160266 160571 160030 158273 155904 154237 153820 153846 153462 152947 153126 154316 156456 159489
52640 159489 162811 165073 165649 165796 167241 169984 172789 175567 179707 185816 192488 197955 201955 205355 208756
52625B08756L495L819M589N528O012N485L890K067J348K170L386L490K120n1k339
52610B53765m306n545n991o134o359o430o134n872n934n740m618k954j835j851
52596A84062k883m550o104o390m848k392n89j79p68j449j239K97K116K249J99
52581A57532j944j996m32N66J99m07l00K62Q31J275J102k31k005k538j245N10
52565A51179J113M08n38p49j09O45N73l87j189j057o33q97j431r55O49K100K465
52548A51187J993J145N7r00j204j057j080j095l57Q51J261N57n2K39O34K72k42
52531A52209J83J450K514K770K361J548N53k13l34K82J411K602L254L115K755
52516A76460K823K802J459j149l094k723p19P19M16p50j087J38K168L632L889
$$ plain form
52625 208756 212251 216070 220659 226187 232199 237684 241574 243641 244989 247159 250545 254035 256155 256104 253765
52610 253765 249459 243914 237923 231789 225430 219000 212866 206994 201060 195320 190702 187748 185913 184062
52596 184062 181179 176629 170525 164135 159287 156895 156306 156127 155359 153910 152671 152968 155084 157333 157532
52581 157532 155588 153592 153160 153726 153925 153518 153218 153480 154311 155586 156688 156457 154452 151914 150669 151179
52565 151179 152292 152700 152162 151413 151304 151949 152522 152135 150946 149889 149256 148359 146928 145973 146622 148722 151187
52548 151187 153180 154325 154382 153482 152278 151221 150141 149046 148689 149540 150801 151358 151306 151545 152179 152451 152209
52531 152209 152392 153842 156356 159126 161487 163035 163588 163375 163041 163323 164734 167336 170590 173705 176460
52516 176460 179283 182085 183544 182395 179301 176578 175859 176578 176994 176244 175157 175295 177463 181095 184984
52501A84984L448L041K683K022J168N53J94j21j04P03J950K722K761K606K556
52486B11166K445K416K892L562L522K559J429O46L5k99J79J301K058K127K252
52471B38290K660K352R47m3R80L317M655L762J533l87j146q61j1J017J987K597
52455B61649K509J896J556J856K039J395O60R58J766J526K37n44n08j261l372
52440B72362m833l836j312P75K052K965K970J544k3r5P35O34m52r38m61k51o12
52423B71224k35J411K968L276K855K438J541l84k548l724l690k764q12K035M335
52408B77926M437K638R70O74Q54J11j353k024j064Q31K489L441L806L661L079
52393C00476K332J520L78r29j214M94L203M603L777K232J730K126K078J158K36
$$ plain form
52501 184984 188432 191473 194156 196178 197346 197899 198093 197972 197868 198571 200521 203243 206004 208610 211166
52486 211166 213611 216027 218919 222481 226003 228562 229991 230637 230672 230373 230552 231853 233911 236038 238290
52471 238290 240950 243302 244249 244206 245186 248503 253158 256920 258453 258066 256920 256059 256048 257065 259052 261649
52455 261649 264158 266054 267610 269466 271505 272900 273560 274518 276284 277810 278047 277503 276995 275734 272362
52440 272362 267529 263693 262381 263156 265208 268173 271143 272687 272664 272569 273304 273938 273486 272548 272087 271836 271224
52423 271224 270989 272400 275368 278644 281499 283937 285478 285094 282546 278822 275132 272368 271556 273591 277926
52408 277926 282363 285001 285971 286645 287499 287610 286257 284233 283169 284000 286489 289930 293736 297397 300476
52393 300476 302808 304328 304706 303777 302563 303057 306260 310863 314640 316872 318602 320728 322806 323964 324200
52378C24200J77R69J967K379J765O12J28R88K386K804J559o10k181j962j32J626
52362C36675J689M34j34R51K312K233R08k49o45p05o85m93k91j36N28J984L245
52345C47621L027J404n63k285l460l054l04L329N045L978K098J448J856K106J912
52330C64158J761J765J741J808K072K163J704Q63o2j051j892j885o66J083K300
52315C75862K509J777K01j766k971k475p82N15M42n38j413j728j547q25O42K649
52299C70552M398N166M983M488M162L925L526K981K487K115J901K050K801L951
52285D19486M810M758L972L526M364N963O420M593J891R68K574M730N345M615
52271D78015M110M519N409O357P156P317O594N766N804O441O648O464P022Q653
$$ plain form
52378 324200 324377 325346 327313 329692 331457 332069 332197 333185 335571 338375 339934 339324 337143 335181 335049 336675
52362 336675 338364 338798 338664 339615 341927 344160 345068 344819 344174 343469 342784 342291 342000 341864 342392 344376 347621
52345 347621 350648 352052 351489 349204 345744 342690 342386 345715 350760 354738 356836 358284 360140 362246 364158
52330 364158 365919 367684 369425 371233 373305 375468 377172 378035 377973 376922 375030 373145 372479 373562 375862
52315 375862 378371 380148 380349 378583 375612 373137 372355 372870 373312 372774 371361 369633 368086 367261 367903 370552
52299 370552 374950 380116 385099 389587 393749 397674 401200 404181 406668 408783 410684 412734 415535 419486
52285 419486 424296 429054 433026 436552 440916 446879 453299 457892 459783 460751 463325 468055 473400 478015
52271 478015 482125 486644 492053 498410 505566 512883 519477 525243 531047 537488 544136 550600 557622 566275
52257E66275J0150J0422R918R842J0637J1809J2849J3837J5251J7287J9349K0443
52245G28069K0351J9990K0149K0404K0067J9674K0410K2319K4190K5206K5579
52234I66408K5579K5191K4851K5302K6402K7203K7588K8575L0477L1836L1095
52223A270507K8468K5502K3473K2725K2856K2972K2254K0750J9129J7619J5988
52212A512243J4592J4097J3983J2778J0462Q936R203R577Q040N066K535J058O4
52199A622634m54k85l46j603k946k326M1J757J724J527K726M746O386P760R541
52184A650882J1556J3324J4937J6430J7147J6996J7257J8986K1232K2161K1544
52173A842452K0812K0961K1597K1984K1842K0970J9096J6358J3248J0055O959
$$ plain form
52257 566275 576425 586847 596765 606607 617244 629053 641902 655739 670990 688277 707626 728069
52245 728069 748420 768410 788559 808963 829030 848704 869114 891433 915623 940829 966408
52234 966408 991987 1017178 1042029 1067331 1093733 1120936 1148524 1177099 1207576 1239412 1270507
52223 1270507 1298975 1324477 1347950 1370675 1393531 1416503 1438757 1459507 1478636 1496255 1512243
52212 1512243 1526835 1540932 1554915 1567693 1578155 1587091 1596294 1605871 1613911 1618977 1621512 1622570 1622634
52199 1622634 1622180 1621895 1621549 1619946 1617000 1614674 1614715 1616472 1618196 1619723 1622449 1627195 1633581 1641341 1650882
52184 1650882 1662438 1675762 1690699 1707129 1724276 1741272 1758529 1777515 1798747 1820908 1842452
52173 1842452 1863264 1884225 1905822 1927806 1949648 1970618 1989714 2006072 2019320 2029375 2036334
52162B036334M515L137K160M35k045m076n065n871p445r640j1879j4057j5984
52149A970519j6873j6492j6128j7292j9726k1758k2451k2306k1984k1477k0649
52138A753383j9559j7952j5480j2817j1460j1797j2207j1027q754p271p284p609
52126A610166o979n613m599m458m821n223n631o087o218n544m297l426l438l580
52112A540252k958k157k639m438n690n200m344n198p583r328r169p909o677n589
52098A461373m582m345n382o984p927p831p111o049m696l458k986l303l648l396
52084A389675k808k639l220m132m744m815m585m370m295m384m641m936m925m371
52070A330810l414k434j722j419j507j620j176n8J006J135L10o52r30j58J646
$$ plain form
52162 2036334 2040849 2043986 2046146 2046581 2044536 2040460 2035395 2029524 2022079 2012439 2000560 1986503 1970519
52149 1970519 1953646 1937154 1921026 1903734 1884008 1862250 1839799 1817493 1795509 1774032 1753383
52138 1753383 1733824 1715872 1700392 1687575 1676115 1664318 1652111 1641084 1632330 1625059 1617775 1610166
52126 1610166 1603187 1597574 1592975 1588517 1583696 1578473 1572842 1566755 1560537 1554993 1550696 1547270 1543832 1540252
52112 1540252 1537294 1535137 1532498 1528060 1522370 1517170 1512826 1507628 1500045 1490717 1481548 1473639 1466962 1461373
52098 1461373 1456791 1452446 1447064 1440080 1432153 1424322 1417211 1411162 1406466 1403008 1400022 1396719 1393071 1389675
52084 1389675 1386867 1384228 1381008 1376876 1372132 1367317 1362732 1358362 1354067 1349683 1345042 1340106 1335181 1330810
52070 1330810 1327396 1324962 1323240 1321821 1320314 1318694 1317518 1317460 1318466 1319601 1319911 1319259 1318329 1318171 1319817
52055A319817M023N998O734O492O527P836J0253J2737J4203J4178J3173J2474
52043A434445J3165J5200J7792K0499K3495K6796K9912L2385L4080L4833L4497
52032A717099L3538L2971L3361L4302L5140L5625L5657L4986L3556L1647K9392
52021B087274K6646K3545K0588J7867J4889J1644R081P732O572M057Q6l903o578
52008B219500p794q257q813r972j1535j2687j2906j2594j2422j2414j2343j2562
51996B085201j3498j4436j3890j1429q300n863m182k594r62K58Q83J284J984L267
51982B017723N058O835P874P873P300O893O966P314P545P227N954L813J756R89
51968B101120J719K753K734J544J06j174l042o067r243j0804j0536j0364j2203
$$ plain form
52055 1319817 1323840 1329838 1336572 1343064 1349591 1357427 1367680 1380417 1394620 1408798 1421971 1434445
52043 1434445 1447610 1462810 1480602 1501101 1524596 1551392 1581304 1613689 1647769 1682602 1717099
52032 1717099 1750637 1783608 1816969 1851271 1886411 1922036 1957693 1992679 2026235 2057882 2087274
52021 2087274 2113920 2137465 2158053 2175920 2190809 2202453 2211534 2219266 2225838 2229895 2229981 2226078 2219500
52008 2219500 2211706 2203449 2194636 2184664 2173129 2160442 2147536 2134942 2122520 2110106 2097763 2085201
51996 2085201 2071703 2057267 2043377 2031948 2023648 2017785 2013603 2011009 2010047 2010305 2011188 2012472 2014456 2017723
51982 2017723 2022781 2029616 2037490 2045363 2052663 2059556 2066522 2073836 2081381 2088608 2094562 2098375 2100131 2101120
51968 2101120 2102839 2105592 2108326 2109870 2109976 2108802 2105760 2099693 2090450 2079646 2069110 2058746 2046543
51955B046543j5853j9504k1795k2671k2670k2479k3148k5694k9835l3711l5386
51944A773797l4618l2920l2164l3159l5133l6449l6138l4974l4683l5920l7545
51933A390094l8076l7292l6010l4927l4358l4607l5637l6551l6242l4590l2464
51922I99340l0559k9008k8015k7852k7942k6979k4568k2040k0943k1223k1525
51911G18686k0879j9348j7436j5637j4431j3938j3626j2894j1897j1131j0476
51900E56993r390q050p360p556p634o603m767l303l006l782m979n852o056n970
51886D72685o207o677o603n675m551l902l623l493l844m782n419m922l945l915
51872D05127m886n304m187k484j695j908k051j547q79n69m80l89n87j378k287
$$ plain form
51955 2046543 2030690 2011186 1989391 1966720 1944050 1921571 1898423 1872729 1842894 1809183 1773797
51944 1773797 1739179 1706259 1674095 1640936 1605803 1569354 1533216 1498242 1463559 1427639 1390094
51933 1390094 1352018 1314726 1278716 1243789 1209431 1174824 1139187 1102636 1066394 1031804 999340
51922 999340 968781 939773 911758 883906 855964 828985 804417 782377 761434 740211 718686
51911 718686 697807 678459 661023 645386 630955 617017 603391 590497 578600 567469 556993
51900 556993 547603 539553 532193 524637 517003 510400 505633 502330 499324 495542 490563 484711 478655 472685
51886 472685 466478 459801 453198 447523 442972 439070 435447 431954 428110 423328 417909 412987 409042 405127
51872 405127 400241 394937 390750 388266 386571 384663 382612 381065 380186 379617 379137 378748 378161 376783 374496
51857C74496k370j362%R62J492J685J109n61k513l484l502l930n478p088p364
51842C42092o344n089m120l167k165j571j724k427l243l745l621k916k146j842
51828B97972k087k659l243l341k535j226m48n14m93K65R16M64m54m49L86N77m51
51811B82680j625j958j648j171m20O52J529J868K016K331K573K401J858J123L46
51796B92555o5K18P53Q44Q55J921L954N174M308K302R28O22O31N22M59M79N68
51779C17028J138K500M094N087N403N369M726L096J296Q79K024K931J958m07k358
51764C54764k982k816k405j367O91K913L611J959j099l757m851m483l589l072
51750C33517k917k148j00K103K312R7k202k172l13R68P54L87R49J756J868J557
$$ plain form
51857 374496 372126 370764 370764 371726 373218 374903 376012 375451 372938 369454 365952 362022 356544 349456 342092
51842 342092 335748 330659 326539 323372 321207 319636 317912 315485 312242 308497 304876 301960 299814 297972
51828 297972 295885 293226 289983 286642 284107 282881 282433 281919 281426 281691 282607 283071 282617 282168 282554 283131 282680
51811 282680 281055 279097 277449 276278 275858 276510 278039 279907 281923 284254 286827 289228 291086 292209 292555
51796 292555 292490 292708 293461 294305 295160 297081 301035 306209 310517 312819 313747 314369 315000 315522 315981 316460 317028
51779 317028 318166 320666 324760 329847 335250 340619 345345 348441 349737 350616 352640 355571 357529 357122 354764
51764 354764 351782 348966 346561 345194 345885 348798 352409 354368 353269 349512 344661 340178 336589 333517
51750 333517 330600 328452 328352 330455 332767 332864 330662 328490 328177 329145 329899 330286 331235 332991 334859 336416
51734C36416J423J167K63r38j580j356n75K94P85O24K05J89M10m3j293k169j753
51717C32069o19P4n5o91j469j912j612j006j047j569j086R62K931L019J554J22
51701C29665n47n38L91K289M008M404M075M309M776M009K048P47J241K641L612
51686C67130L806L417K640K127K764M448N924O323O095O065O491P268Q231Q812
51672D41541Q443P592P620R076J0955J2049J2398J2845J3874J5374J7057J8554
51660E87378J9479J9680J9299J8465J7360J6375J5569J4124J1148P008K927p27
51648G48085m605q616j1296j1666j0657r813r406q713p561o581o240o395o582
51635F39954o247n057l504k715k972k873q75K469M834M803L507L199M731O891
$$ plain form
51734 336416 337839 339006 339269 338331 336751 335395 334820 335114 335899 336523 336728 336917 337327 337284 335991 333822 332069
51717 332069 331450 331524 331469 330778 329309 327397 325785 324779 323732 322163 321077 322039 324970 327989 329543 329665
51701 329665 329118 328580 328971 331260 335268 339672 343747 348056 352832 356841 358889 359636 360877 363518 367130
51686 367130 370936 374353 376993 379120 381884 386332 392256 398579 404674 410739 417230 424498 432729 441541
51672 441541 449984 457576 465196 474272 485227 497276 509674 522519 536393 551767 568824 587378
51660 587378 606857 626537 645836 664301 681661 698036 713605 727729 738877 745885 748812 748085
51648 748085 743480 734864 723568 711902 701245 691432 682026 673313 665752 659171 652931 646536 639954
51635 639954 633707 628650 625146 622431 619459 616586 615711 618180 623014 627817 631324 634523 639254 646145
51621F46145Q002P691O761N728M111J494j281k806k796k238j786r85M13J445J188
51606F71086L79O05K092L392L440K936L213M412N496N677N172M582M118L714L506
51591G23820L769M366M587L821K258P98J51J50k5j061l006n352p444q702q825
51576G09305q150p762q738j0882j2614j2561j1133r909r715r911r661r070q730
51563E80469q773q805q424p479o275n601o030o961p046n839m288l231k510k049
51549D97158k567m131n094l941j540n5q0n01p58j463k611l057k281j210o23q6
51533D67160P90J204L13j209j739n18J625L098K896J610J011J974L084K426O23
51518D84348M12K818N653O711O660P281Q445Q818Q526Q825R369Q273N256K755
$$ plain form
51621 646145 654147 661838 668599 674327 678438 679932 678651 675845 673049 670811 669025 668040 668453 669898 671086
51606 671086 671465 672070 674162 677554 680994 683930 687143 691555 697051 702728 707900 712482 716600 720314 723820
51591 723820 727589 731955 736542 740363 742621 743419 743570 743720 743695 742634 739628 734276 726832 718130 709305
51576 709305 701155 693393 684655 673773 661159 648598 637465 627556 617841 607930 598269 589199 580469
51563 580469 571696 562891 554467 546988 540713 535112 529082 522121 515075 509236 504948 501717 499207 497158
51549 497158 494591 490460 485366 481425 479885 479830 479750 479249 478491 477028 474417 471360 469079 467869 467246 467160
51533 467160 467950 469154 469467 468258 466519 466001 467626 470724 473620 475230 476241 478215 481299 483725 484348
51518 484348 484760 487578 493231 499942 506602 513883 522328 531146 539672 548497 557866 566139 571395 574150
51504E74150K842M473N019L649J892J198J135K91j805m204n796o471o813p050
51490E62510o834o078n341n034m758l922k637j433l55R86K471L324L185K801L312
51475E42197N010P073Q443Q766Q411P757O775N455M402M397N325O033N641M521
51461F30206L607L115K539J676R08M03k04j120j904k155k142k251k112j035P20
51446F30251J896J748R12L16j59j062j919j575j16P57j05j699k270j696j411k251
51430F21617l464l992l801l633l919m473m941n226n337n025l900k269j514k722
51416E67401m868n486l707j515j086j931k025q94K42Q70J775L138L976L997M327
51401E64214N563O544O069M728M065M716O223P947R321R850R587R183R012Q822
$$ plain form
51504 574150 576992 581465 586484 590133 592025 593223 594358 594649 592844 588640 582844 576373 569560 562510
51490 562510 555676 549598 544257 539223 534465 530543 527906 526473 526118 527104 529575 532899 536084 538885 542197
51475 542197 547207 554280 562723 571489 579900 587657 594432 599887 604289 608686 614011 620044 625685 630206
51461 630206 633813 636928 639467 641143 642051 642454 642250 641130 639226 637071 634929 632678 630566 629531 630251
51446 630251 632147 633895 634807 635123 634964 633902 631983 630408 630292 631049 630944 629245 626975 625279 623868 621617
51430 621617 618153 614161 610360 606727 602808 598335 593394 588168 582831 577806 573906 571637 570123 567401
51416 567401 562533 557047 553340 551825 550739 548808 546783 545889 546131 547001 548776 551914 555890 559887 564214
51401 564214 569777 576321 582390 587118 591183 595899 602122 610069 619390 629240 638827 648010 657022 665844
51387F65844Q585Q791R344R166P676N895N178N489N639M783K995R77k71j47N88
51372G40532L58j130k322k017j003n41l92K30P99L96j58R57L816O494P712Q111
51356G61842Q523Q567P644O159M883L855K635J121m90k072l493m400m443l617
51342G86714k300j170r71j928l345m111l737k738k092k569m234o333p735p855
51328G35596p003n813m847m851o420q627r094o550k773o44o58p53L86J600J179
51313F80728p36k494k851j877n77j19j033k730m112m828n426o264p020p546q373
51298F24742r784j1095j1468j1113j0875j0942j0672r795r014r107r788j0038
51286E01051r527r167r904j1320j1950j0922q805o731n336m654m411m088l314
$$ plain form
51387 665844 674429 683220 692564 701730 709406 715301 720479 725968 731607 736390 739385 740362 740091 739944 740532
51372 740532 740890 739760 737438 735421 734418 733877 733485 733715 734514 734910 734752 735709 739525 746019 753731 761842
51356 761842 770365 778932 786576 792735 797618 801473 804108 805229 804739 802667 799174 794774 790331 786714
51342 786714 784414 783244 782273 780345 777000 772889 769152 766414 764322 761753 757519 751186 743451 735596
51328 735596 728593 722780 717933 713082 706662 698035 688941 682391 679618 678974 678316 677563 677949 679549 680728
51313 680728 679992 677498 674647 672770 672193 672074 671041 668311 664199 659371 653945 647681 640661 633115 624742
51298 624742 614958 603863 592395 581282 570407 559465 548793 538998 529984 520877 511089 501051
51286 501051 491524 482357 472453 461133 449183 438261 429456 422725 417389 412735 408324 404236 400922
51273D00922k560k798m023m869m255k726j480q03l41k34p75j505j763j802k171
51258C68817k391j608k95J71k96k62R07J987J763Q04N39J442K871M030M431L972
51242C86882L131K651K742K983L231L842M742N130M679M402N559P969R937R863
51228D57743P875N871N721P011P096M153l38l239l590l305m133n650o771p490
51214D60954q189q629q699r098j0120j0740j0102q984q605q815q708q310q184
51201C43771p921o639m757l723l844l745k388o00p1j463l781n297n090l962l532
51186B86958m038l829j788N85R12p19j790p91J058J870J399O76N23J276K850M312
51170B89464M287K643R87O28Q26K20q79q94N25J943K121J384N76k28j308k312
$$ plain form
51273 400922 398362 395564 391541 386672 382417 379691 378211 377408 377067 376833 376058 374553 372790 370988 368817
51258 368817 366426 364818 364523 364694 364398 364136 365043 367030 368793 369597 370136 371578 374449 378479 382910 386882
51242 386882 390013 392664 395406 398389 401620 405462 410204 415334 420013 424415 429974 437943 447880 457743
51228 457743 465618 471489 477210 484221 491317 495470 495132 491893 488303 484998 480865 475215 468444 460954
51214 460954 452765 444136 435437 426339 416219 405479 395377 386393 377788 368973 360265 351955 343771
51201 343771 335850 329211 324454 320731 316887 313142 310754 310154 310083 308620 304839 299542 294452 290490 286958
51186 286958 282920 279091 277303 277888 278800 278081 276291 275500 276558 278428 279827 280503 281026 282302 285152 289464
51170 289464 293751 296394 297381 298009 298835 299055 298176 297282 297807 299750 301871 303255 303831 303603 302295 299983
51154B99983k553k006j289o80J92J497K476K049K54j317j019R66K705K736J641
51139C05635Q97N73p12l389n640n308k613n3L12j337l359m353l870k310p50m06
51123B73317j560l160l885l359k034k94J475K280J063j803m386n137m441l671
51109B44405l230k339o42R23J203K85n80l45Q26J764J425o5j395j332j17O90m0
51092B41436j642k476j801k78J231K563L684M091L406K041N25j400l995o106n777
51077B35502k701R36K697K279J016k13j612l329m760n114m118k133m7J056Q56
51062B20315L86R53K410L177K287O90J09J036K444L145K873K085J308R35J309
51047B45462K591M358N594N481M262L034K542K512K414K301K345K010O79r06r17
$$ plain form
51154 299983 297430 295424 294135 293455 293647 295144 297620 299669 299923 298606 297587 298553 301258 303994 305635
51139 305635 306532 307105 306393 303004 297364 292056 289443 289390 289702 288365 285006 280653 276783 274473 273723 273317
51123 273317 271757 268597 264712 261353 259319 259025 260500 262780 263843 262040 257654 252517 248076 244405
51109 244405 241175 238836 238194 239117 240320 240605 240025 239680 240506 242270 243695 243630 242235 240903 240786 241476 241436
51092 241436 239794 237318 235517 235239 236470 239033 242717 246808 250214 252255 252780 251380 247385 241279 235502
51077 235502 232801 233737 236434 238713 239729 239516 237904 234575 229815 224701 220583 218450 218403 219459 220315
51062 220315 220701 221654 224064 227241 229528 230218 230327 231363 233807 236952 239825 241910 243218 244153 245462
51047 245462 248053 252411 258005 263486 267748 270782 273324 275836 278250 280551 282896 284906 285585 284679 283762
51032B83762J300L947M593K901Q31J81P36J150R66J019J873K720K295N76j196
51017C07654k119k479k756k585j500j07L70k79r57o18N84J724K060J441L28l77
51001C00384J1J228K308K610K199J174o17k970m876n246l849j457O28J255K92
50986B93074r68r55K76J069N30r5P28K401L046K432K403M095O085O315M806L277
50970C28519K556J846O16o6J069L568N642O202N627M641L382J960J061J274K260
50955C70157L188L789M316M633M274L479L308M205N063M571L143K612L812N346
50941D25896N341L964L320M812P545R666J0591J1168J2040J2900J3373J3728J4324
50928E48668J5054J5827J7014J8822K0592K1391K1342K1766K3886K7522L1250
$$ plain form
51032 283762 285062 289009 293602 296503 297334 297515 298251 299401 300367 301386 303259 305979 308274 308850 307654
51017 307654 305535 303056 300300 297715 296215 296108 296478 296199 295242 294624 295208 296932 298992 300433 300761 300384
51001 300384 300395 301623 303931 306541 308740 309914 309297 306327 301451 296205 292356 290899 291527 292782 293074
50986 293074 292106 291151 291427 292496 293026 292931 293659 296060 299106 301538 303941 308036 314121 320436 325242 328519
50970 328519 331075 332921 333537 333471 334540 338108 343750 349952 355579 360220 363602 365562 366623 367897 370157
50955 370157 373345 377134 381450 386083 390357 393836 397144 401349 406412 410983 414126 416738 420550 425896
50941 425896 431237 435201 438521 443333 450878 460544 471135 482303 494343 507243 520616 534344 548668
50928 548668 563722 579549 596563 615385 635977 657368 678710 700476 724362 751884 783134
50917G83134L3819L5497L7751M1555M6285N0665N4310N7728O1247O4862O8866
50906A335719P3467P7941Q1616Q5502R1208R7921J02556J03766J03607J03934
50896B257237J03218R9081R2176Q5031P8106O9720N9321M8233L7356K6567J6439
50885B972485Q174J537m939j1474j6699k0047k2315k3649k3386k2325k2663k4809
50873B789890k6763k7619k9209l2941l7554m1756m6608n3123n9567o3739o6479
50862B304532p0327p5725q0907q4624q6580q6043q2605p7999p4634p2334o8807
50851A443947o3289n7505n2696m8068m2857l7985l4538l2121k9754k7309k5051
50840I92774k2687j9781j6631j3927j1837r847p287l917k97K455L694L944M126
$$ plain form
50917 783134 816953 852450 890201 931756 978041 1028706 1083016 1140744 1201991 1266853 1335719
50906 1335719 1409186 1487127 1568743 1654245 1745453 1843374 1945930 2049696 2153303 2257237
50896 2257237 2360455 2459536 2551712 2636743 2714849 2784569 2843890 2892123 2929479 2956046 2972485
50885 2972485 2980659 2982196 2977257 2965783 2949084 2929037 2906722 2883073 2859687 2837362 2814699 2789890
50873 2789890 2763127 2735508 2706299 2673358 2635804 2594048 2547440 2494317 2434750 2371011 2304532
50862 2304532 2234205 2158480 2077573 1992949 1906369 1820326 1737721 1659722 1585088 1512754 1443947
50851 1443947 1380658 1323153 1270457 1222389 1179532 1141547 1107009 1074888 1045134 1017825 992774
50840 992774 970087 950306 933675 919748 907911 898064 890777 886860 886563 889018 892712 896656 900782
50827I00782M406M512M848O251Q641J0804J1792J1953J2445J4185J7169K0296
50815A028084K2095K2277K2216K3310K5309K7211K9167L2084L5544L7882L8769
50804A343948M0254M4423N0905N7568O2989O7586P2725P9357Q7401R6012J04577
50793B107745J13425J23344J34496J46208J57823J69243J80583J91692K02021
50784C526580K10666K16786K20454K22658K23758K22232K15859K04047J88064
50775E451104J69050J47016J22037R5369O8704M2916J8161n091k5558m1658n2596
50764E989454n9117o2871o4610o3478n8846n2395m7194m4816m4705m6517n1535
50753E393370o0881p3566q7485j01728j16744j32447j47369j60099j70767j80370
$$ plain form
50827 900782 905188 909700 914548 920799 929440 940244 952036 963989 976434 990619 1007788 1028084
50815 1028084 1050179 1072456 1094672 1117982 1143291 1170502 1199669 1231753 1267297 1305179 1343948
50804 1343948 1384202 1428625 1479530 1537098 1600087 1667673 1740398 1819755 1907156 2003168 2107745
50793 2107745 2221170 2344514 2479010 2625218 2783041 2952284 3132867 3324559 3526580
50784 3526580 3737246 3954032 4174486 4397144 4620902 4843134 5058993 5263040 5451104
50775 5451104 5620154 5767170 5889207 5984576 6053280 6096196 6114357 6109266 6083708 6042050 5989454
50764 5989454 5930337 5867466 5802856 5739378 5680532 5628137 5580943 5536127 5491422 5444905 5393370
50753 5393370 5332489 5258923 5171438 5069710 4952966 4820519 4673150 4513051 4342284 4161914
50743D161914j88805j94278j95113j91728j86067j79216j70509j59396j47040
50734B549762j35211j24342j13892j03976r5303q7652p9904p1742o4108n7718
50724A615914n2069m6378m0598l5142l0346k6470k3519k0917j8036j5157j3132
50713A294150j2099j1368j0634j0154r664q328o137m208l223k588j627n40M21
50700A214001J658L526N727Q072J0767J3380J4659J4282J3739J4647J7045K0231
50688A351734K4094K8469L2406L5522L9192M4701N0905N5557N8526O1656O5756
50677A848518O9908P4015P9763Q7968R6828J04172J10115J16120J22504J28452
50667B838363J33602J37952J40561J40183J37126J32820J27302J18870J06702
$$ plain form
50743 4161914 3973109 3778831 3583718 3391990 3205923 3026707 2856198 2696802 2549762
50734 2549762 2414551 2290209 2176317 2072341 1977038 1889386 1809482 1737740 1673632 1615914
50724 1615914 1563845 1517467 1476869 1441727 1411381 1384911 1361392 1340475 1322439 1307282 1294150
50713 1294150 1282051 1270683 1260049 1249895 1240231 1231903 1225766 1221558 1218335 1215747 1214120 1213580 1214001
50700 1214001 1215659 1219185 1224912 1232984 1243751 1257131 1271790 1286072 1299811 1314458 1331503 1351734
50688 1351734 1375828 1404297 1436703 1472225 1511417 1556118 1607023 1662580 1721106 1782762 1848518
50677 1848518 1918426 1992441 2072204 2160172 2257000 2361172 2471287 2587407 2709911 2838363
50667 2838363 2971965 3109917 3250478 3390661 3527787 3660607 3787909 3906779 4013481
50658D013481R2128P6296N8280L7204J4960n274k2637l8398n2321o1925o6131
50647D045663o7371o8336o8317o4819n7766n0034m4098m0208l7986l7976m0911
50636C467841m6573n4132o2985p2767q3068r3366j02910j10708j16030j18784
50626B606518j19066j16764j12253j06801j01302r5126q7444p9178p2160o6573
50616A649851o0896n4443m8214m2900l7842l2618k8037k4595k1278j6987j2116
50605A269925p760m222j200J434L919O864J0354J3602J6230J9039K2688K6486
50593A377359K9413L1610L3800L6077L8241M0701M4004M7962N2203N6846O1691
50582A849907O5589O7929P0073P3958P9454Q4460Q7268Q7715Q6365Q3959Q1510
$$ plain form
50658 4013481 4105609 4181905 4240185 4277389 4292349 4287075 4264438 4226040 4173719 4111794 4045663
50647 4045663 3978292 3909956 3841639 3776820 3719054 3669020 3624922 3584714 3546728 3508752 3467841
50636 3467841 3421268 3367136 3304151 3231384 3148316 3054950 2952040 2841332 2725302 2606518
50626 2606518 2487452 2370688 2258435 2151634 2050332 1955206 1867762 1788584 1716424 1649851
50616 1649851 1588955 1534512 1486298 1443398 1405556 1372938 1344901 1320306 1299028 1282041 1269925
50605 1269925 1262165 1257943 1256743 1258177 1262096 1268960 1279314 1292916 1309146 1328185 1350873 1377359
50593 1377359 1406772 1438382 1472182 1508259 1546500 1587201 1631205 1679167 1731370 1788216 1849907
50582 1849907 1915496 1983425 2053498 2127456 2206910 2291370 2378638 2466353 2552718 2636677 2718187
50571B718187P9478P6754P1789O4817N7755N1587M5327L8110L0941K5346K1164
50560C281255J6961J2289Q446O789P123Q224R493J1394J4232J7212J9197J9909
50548C432524J9750J8711J6433J3248J0020O738K296l842j0978j8700k7824l8805
50536C419571n0331o0729o9923p8647q6551r2563r6666r9580j01123j00604r8611
50525B484243r6457r3828q8996q2046p5774p2193o9709o5247n8120n0187m2930
50514A688756l6208k9769k4289k0254j6895j3039q557m217l81L402P374J0848
50502A556771J3080J4523J6464J9376K2368K4590K6375K8451L0657L2338L3612
50491A818605L5238L7239L8663L8913L8543L8386L8457L8225L7555L6941L6963
$$ plain form
50571 2718187 2797665 2874419 2946208 3011025 3068780 3120367 3165694 3203804 3234745 3260091 3281255
50560 3281255 3298216 3310505 3318951 3325740 3332863 3341087 3350580 3361974 3376206 3393418 3412615 3432524
50548 3432524 3452274 3470985 3487418 3500666 3510686 3517424 3519720 3515878 3504900 3486200 3458376 3419571
50536 3419571 3369240 3308511 3238588 3159941 3073390 2980827 2884161 2784581 2683458 2582854 2484243
50525 2484243 2387786 2293958 2204962 2122916 2047142 1974949 1905240 1839993 1781873 1731686 1688756
50514 1688756 1652548 1622779 1598490 1578236 1561341 1548302 1539745 1535528 1535147 1538549 1545923 1556771
50502 1556771 1569851 1584374 1600838 1620214 1642582 1667172 1693547 1721998 1752655 1784993 1818605
50491 1818605 1853843 1891082 1929745 1968658 2007201 2045587 2084044 2122269 2159824 2196765 2233728
50480B233728L7779L9103M0545M2004M3772M6189M9387N3449N8640O5204P3009
50469B782809Q1566R0255R8487J06013J13242J20916J29112J36881J43133J47437
50459C949851J49671J49605J47351J43562J38312J30307J18180J02376Q4812O6899
50449E180926M8792L0325J1574p436k6462m4361n9714p2369q3233r2275r7773
50438D787994r8290r4520q8423q1216p2894o3207n2266m0343k7765j5105l227
50427D150738O889J4360J8509J8820J4622N262q861k5740m3200o0911p9932r9961
50415C910595j18118j31216j38535j41555j41740j39604j35589j30521j24877
50406B708840j18379j10767j02606r4824q7623q0170p1511o1791n2371m4571l8354
$$ plain form
50480 2233728 2271507 2310610 2351155 2393159 2436931 2483120 2532507 2585956 2644596 2709800 2782809
50469 2782809 2864375 2954630 3053117 3159130 3272372 3393288 3522400 3659281 3802414 3949851
50459 3949851 4099522 4249127 4396478 4540040 4678352 4808659 4926839 5029215 5114027 5180926
50449 5180926 5229718 5260043 5271617 5264181 5237719 5193358 5133644 5061275 4978042 4885767 4787994
50438 4787994 4689704 4595184 4506761 4425545 4352651 4289444 4237178 4196835 4169070 4153965 4150738
50427 4150738 4157627 4171987 4190496 4209316 4223938 4229200 4220339 4194599 4151399 4090488 4010556 3910595
50415 3910595 3792477 3661261 3522726 3381171 3239431 3099827 2964238 2833717 2708840
50406 2708840 2590461 2479694 2377088 2282264 2194641 2114471 2042960 1981169 1928798 1884227 1845873
50395A845873l2476k6014j9337j3350q222l335J659O301J0091J3414J7248K2026
50383A813878K7092L1367L4277L5891L6587L7037L8231M0710M3697M5568M5589
50372B229924M4512M3247M1622L9095L5903L2595K8921K4410J9828J6816J5678
50361B572551J4559J1376O051N11k934l059l48L257N857P462R965J4754K0877
50348B660879K6236L0206L4031L8641M3169M6146M7477M8234M8732M7751M4072
50337C115574L8105L1244K3985J5474M932p197j9836l2296m4273n5411o5400p4108
50325B930793q1120q5564q6882q5537q2431p7927p1966o4701n6460m7346l7565
50314B153294k7825j8772j0297k169N028J0438J4062J6300J6617J3836P936L88
$$ plain form
50395 1845873 1813397 1787383 1768046 1754696 1746474 1743139 1744798 1751099 1761190 1774604 1791852 1813878
50383 1813878 1840970 1872337 1906614 1942505 1979092 2016129 2054360 2095070 2138767 2184335 2229924
50372 2229924 2274436 2317683 2359305 2398400 2434303 2466898 2495819 2520229 2540057 2556873 2572551
50361 2572551 2587110 2598486 2604537 2605048 2602114 2599055 2598707 2601964 2607821 2615283 2625248 2640002 2660879
50348 2660879 2687115 2717321 2751352 2789993 2833162 2879308 2926785 2975019 3023751 3071502 3115574
50337 3115574 3153679 3184923 3208908 3224382 3229314 3222117 3202281 3169985 3125712 3070301 3004901 2930793
50325 2930793 2849673 2764109 2677227 2591690 2509259 2431332 2359366 2294665 2238205 2190859 2153294
50314 2153294 2125469 2106697 2096400 2094231 2099259 2109697 2123759 2140059 2156676 2170512 2178448 2178836
50302B178836p604j6111k5339l4403m1919m7162n0226n1467n1312n0151m8068
50291A755074m4999m1281l7617l4470l1915k9976k8369k6080k2402j8481j6535
50280A422949j6904j7074j4547r804n450l100k236j586l56J876N231R015J1905
50267A379919J3246J3944J5655J8969K2621K4737K4874K4487K5048K6262K6780
50256A616542K6329K5925K5946K5333K3328K0958J9730J9575J9096J7493J5156
50245A855411J2557R627O400L388R29j266l475n364o518p438r284j2355j5234
50232A827378j6038j4599j2816j2664j4326j6540j8140j8696j8249j7486j7621
50221A650203j9152k0935k1592k1488k1965k2834k2429k0448j8896j9350k0811
$$ plain form
50302 2178836 2171232 2155121 2129782 2095379 2053460 2006298 1956072 1904605 1853293 1803142 1755074
50291 1755074 1710075 1668794 1631177 1596707 1564792 1534816 1506447 1480367 1457965 1439484 1422949
50280 1422949 1406045 1388971 1374424 1364620 1359170 1356070 1353834 1352248 1351892 1353768 1358999 1368014 1379919
50267 1379919 1393165 1407109 1422764 1441733 1464354 1489091 1513965 1538452 1563500 1589762 1616542
50256 1616542 1642871 1668796 1694742 1720075 1743403 1764361 1784091 1803666 1822762 1840255 1855411
50245 1855411 1867968 1877595 1883995 1887383 1888312 1887046 1883571 1878207 1871689 1864251 1854967 1842612 1827378
50232 1827378 1811340 1796741 1783925 1771261 1756935 1740395 1722255 1703559 1685310 1667824 1650203
50221 1650203 1631051 1610116 1588524 1567036 1545071 1522237 1499808 1479360 1460464 1441114 1420303
50210A420303k1374k0647j9321j7602j5569j4036j3469j2781j0806q362p129o888
50198A252319n732l029l54P67N05j88p35o34N49K154K615J471J69NK45o08k494
50181A247025l994m451m665n473o686p615p949p856p700p819q160q132p285o139
50167A153101n644n672m825k313O56K148J788Q44K69j64n59r4J660L586M273L891
50151A152945L702M197M904N680O682P058N420K120n40j231j348k775n166o943
50137A174705q006r639j1976j3456j3089j1908j1508j2123j2664j2093j0321q151
50125A039771o683o478p166p998q637r059r056q501p993q345r318r601q323o028
50111I26585l879k483j783j616j970k886m329n866o529n583l740l054n026q979
$$ plain form
50210 1420303 1398929 1378282 1358961 1341359 1325790 1311754 1298285 1285504 1274698 1266336 1259207 1252319
50198 1252319 1246587 1243558 1243204 1243971 1244476 1244288 1243553 1242919 1243468 1245622 1248237 1249708 1249877 1249882 1250127 1249519 1247025
50181 1247025 1243031 1238580 1233915 1228442 1221756 1214141 1206192 1198336 1190636 1182817 1174657 1166525 1159240 1153101
50167 1153101 1147457 1141785 1136960 1134647 1135303 1137451 1139239 1140083 1140352 1140188 1139629 1139535 1141195 1144781 1149054 1152945
50151 1152945 1156647 1160844 1165748 1171428 1178110 1185168 1190588 1192708 1192168 1190937 1189589 1186814 1181648 1174705
50137 1174705 1166699 1157060 1145084 1131628 1118539 1106631 1095123 1083000 1070336 1058243 1047922 1039771
50125 1039771 1033088 1026610 1019444 1011446 1002809 993750 984694 976193 968200 959855 950537 940936 932613 926585
50111 926585 922706 920223 918440 916824 914854 911968 907639 901773 895244 889661 885921 882867 877841 868862
50097H68862j2681j4480j4433j3491j2120j0118p505n075l735l578m026m675n485
50084G57460o072n622l954k020q18k88J05K86j02o00k77R32K139K832L308L691
50068G51000L631L350L906N676P434P815P151O850P401Q058Q447R373J1603J4518
50054H56213J6645J7141J6342J5134J4282J4383J5713J7685J8813J7975J5762
50043A036088J4012J3754J4089J3548J2039J0685J0045R403Q053O447N524N340
50031A159027N140M618M509N586P363Q341P607N885M683M563M832M951N408O689
50017A239202Q058Q380P851P914R352J1385J2970J4164J5594J7236J8359J8489
50005A388954J7902J7342J7492J8522J9769K0271J9758J8930J8487J8343J8116
$$ plain form
50097 868862 856181 841701 827268 813777 801657 791539 784034 778959 775224 771646 767620 762945 757460
50084 757460 751388 745766 741812 739792 738974 738686 738791 739077 738975 738375 738098 739030 741169 744001 747309 751000
50068 751000 754631 757981 761887 767563 774997 782812 789963 796813 804214 812272 820719 830092 841695 856213
50054 856213 872858 889999 906341 921475 935757 950140 965853 983538 1002351 1020326 1036088
50043 1036088 1050100 1063854 1077943 1091491 1103530 1114215 1124260 1133663 1141716 1148163 1153687 1159027
50031 1159027 1164167 1168785 1173294 1178880 1186243 1194584 1202191 1208076 1212759 1217322 1222154 1227105 1232513 1239202
50017 1239202 1247260 1255640 1263491 1271405 1280757 1292142 1305112 1319276 1334870 1352106 1370465 1388954
50005 1388954 1406856 1424198 1441690 1460212 1479981 1500252 1520010 1538940 1557427 1575770 1593886
49994A593886J7847J7737J7562J6981J5997J4603J2450R585O956N197L347K08
49982A732356l372n196n080n641q804j3004j5398j5616j5684j6824j8337j9508
49970A589892k0672k1938k2399k1406j9493j7425j5281j3259j2206j2485j3066
49959A400262j2705j1450j0137r025p949p203p165p285o542m806k907j571j092
49946A310425j750l481n310o176o348p066q876j1237j3632j5858j7254j7018j5585
49933A180834j4502j4595j5415j6573j8149j9327j8447j5482j2999j3236j5280
49922A006829j6495j5892j4586j3518j2451j1115r836q814p861p058o810o969
49910H75424o751n644l979k471j658j717k357k934l046k854k578k116j588j632
$$ plain form
49994 1593886 1611733 1629470 1647032 1664013 1680010 1694613 1707063 1716648 1723604 1728801 1732148 1732356
49982 1732356 1728984 1723788 1718708 1713067 1704263 1691259 1675861 1660245 1644561 1627737 1609400 1589892
49970 1589892 1569220 1547282 1524883 1503477 1483984 1466559 1451278 1438019 1425813 1413328 1400262
49959 1400262 1387557 1376107 1365970 1356945 1348996 1341793 1334628 1327343 1320801 1315995 1313088 1311517 1310425
49946 1310425 1308675 1305194 1299884 1293708 1287360 1280294 1271418 1260181 1246549 1230691 1213437 1196419 1180834
49933 1180834 1166332 1151737 1136322 1119749 1101600 1082273 1063826 1048344 1035345 1022109 1006829
49922 1006829 990334 974442 959856 946338 933887 922772 912936 904122 896261 889203 882393 875424
49910 875424 868673 863029 859050 856579 854921 853204 850847 847913 844867 842013 839435 837319 835731 834099
49896H34099k389k800j939o30n17j721k695k530k094k439l138l020j758k9J477
49881H07877K491K785K069N21r50j310m42O46J002J007J804L335L959K629N04
$$ plain form
49896 834099 831710 828910 826971 826341 825824 824103 821408 818878 816784 814345 811207 808187 806429 806400 807877
49881 807877 810368 813153 815222 815743 814793 813483 813041 813687 814689 815696 817500 820835 824794 827423 827927
$$ [...]
##END NTUPLES=NMR SPECTRUM
##END=
