
##TITLE=AC1204_BRAAS12063_5946503_ShiT139uOt
##JCAMPDX= 6.0         $$ Bruker NMR JCAMP-DX V2.0
##DATA TYPE= NMR SPECTRUM
##DATA CLASS= NTUPLES
##ORIGIN= BRUKER
##OWNER= Administrator
$$ 1.72 TOPSPIN		Version 2.1
$$ 2012-04-10 22:27:43.406 -0500  Administrator@TOPSPIN
$$ Compression mode = diff/dup
##.OBSERVE FREQUENCY= 400.13188235
##.OBSERVE NUCLEUS= ^1H
##.ACQUISITION MODE= SIMULTANEOUS (DQD)
##.ACQUISITION SCHEME= undefined
##.AVERAGES= 8
##.DIGITISER RES= 22
##SPECTROMETER/DATA SYSTEM= spect
##.PULSE SEQUENCE= zg30
##.SOLVENT NAME= COFFEE_meoh
##.SHIFT REFERENCE= INTERNAL, COFFEE_meoh, 1, 14.98061
##AUDIT TRAIL= $$ (NUMBER, WHEN, WHO, WHERE, PROCESS, VERSION, WHAT)
$$ ##TITLE= Audit trail, TOPSPIN		Version 2.1
$$ ##JCAMPDX= 5.01
$$ ##ORIGIN= Bruker BioSpin GmbH
$$ ##OWNER= Administrator
$$ $$ C:\Bruker\TOPSPIN/data/COFFEE/nmr/AC1204_BRAAS12063_5946503_ShiT139uOt/10/pdata/1/auditp.txt
$$ ##AUDIT TRAIL=  $$ (NUMBER, WHEN, WHO, WHERE, PROCESS, VERSION, WHAT)
(   1,<2012-04-10 22:27:36.562 -0500>,<Administrator>,<TOPSPIN>,<go>,<TOPSPIN 2.1>,
      <created by zg
	started at 2012-04-10 22:26:30.093 -0500,
	POWCHK enabled, PULCHK disabled,
       configuration hash MD5:
       1A 1E CE 29 27 FD 77 03 67 4E F0 E3 C4 B2 CB 90
       data hash MD5: 64K
       B0 36 15 AA D9 8B 7C 29 07 6B 64 C0 51 25 CD 69>)
(   2,<2012-04-10 22:27:39.218 -0500>,<Administrator>,<TOPSPIN>,<proc1d>,<TOPSPIN 2.1>,
      <Start of raw data processing
       efp LB = 0 FT_mod = 6 PKNL = 1 PHC0 = 0 PHC1 = 0 SI = 32K 
       data hash MD5: 32K
       55 68 B3 E3 25 E7 69 FA 47 BA 0A E3 68 6B 27 5D>)
(   3,<2012-04-10 22:27:39.671 -0500>,<Administrator>,<TOPSPIN>,<proc1d>,<TOPSPIN 2.1>,
      <pk PHC0 = 207.8778 PHC1 = 0 
       data hash MD5: 32K
       94 E4 D6 39 8F 14 BD E6 BC 63 58 27 63 5D 4E 18>)
(   4,<2012-04-10 22:27:39.765 -0500>,<Administrator>,<TOPSPIN>,<proc1d>,<TOPSPIN 2.1>,
      <abs ABSG = 1 
       data hash MD5: 32K
       68 85 FF 79 93 7A 49 19 91 DC 58 D1 9A 4D 3D CD>)
(   5,<2012-04-10 22:27:39.796 -0500>,<Administrator>,<TOPSPIN>,<proc1d>,<TOPSPIN 2.1>,
      <abs ABSG = 2 
       data hash MD5: 32K
       84 B2 1B FE 27 3C 8A 69 8B 3B 97 4E C4 10 22 72>)
(   6,<2012-04-10 22:27:39.828 -0500>,<Administrator>,<TOPSPIN>,<proc1d>,<TOPSPIN 2.1>,
      <abs ABSG = 3 
       data hash MD5: 32K
       1B 7A 44 AA 02 22 4E E9 77 66 6E BA 46 02 70 90>)
(   7,<2012-04-10 22:27:39.859 -0500>,<Administrator>,<TOPSPIN>,<proc1d>,<TOPSPIN 2.1>,
      <abs ABSG = 4 
       data hash MD5: 32K
       EE A3 3B 43 30 3A 48 9E 5E DE 65 A2 06 56 0C D5>)
(   8,<2012-04-10 22:27:39.890 -0500>,<Administrator>,<TOPSPIN>,<proc1d>,<TOPSPIN 2.1>,
      <abs ABSG = 5 
       data hash MD5: 32K
       04 EB 49 6F 26 4F E5 F9 C8 D5 6F 54 B1 1F C2 30>)
$$ ##END=
$$ 
$$ $$ hash MD5
$$ $$ 65 6F 20 D1 A2 6A 73 0E F6 E6 E0 6E 14 FA 10 F1
##$RELAX= 
##$RELAX= 
##$RELAX= 
##$RELAX= 
##$RELAX= 
##$RELAX= 
##$RELAX= 
$$ Bruker specific parameters
$$ --------------------------
$$ [...]
##$TP= (0..7)
150 150 150 150 150 150 150 150
##$TP07= 0
##$TPNAME0= <>
##$TPNAME1= <>
##$TPNAME2= <>
##$TPNAME3= <>
##$TPNAME4= <>
##$TPNAME5= <>
##$TPNAME6= <>
##$TPNAME7= <>
##$TPOAL= (0..7)
0.5 0.5 0.5 0.5 0.5 0.5 0.5 0.5
##$TPOFFS= (0..7)
0 0 0 0 0 0 0 0
##$TUNHIN= 0
##$TUNHOUT= 0
##$TUNXOUT= 0
##$USERA1= <user>
##$USERA2= <user>
##$USERA3= <user>
##$USERA4= <user>
##$USERA5= <user>
##$V9= 5
##$VALIST= <valist>
##$VCLIST= <CCCCCCCCCCCCCCC>
##$VD= 0
##$VDLIST= <DDDDDDDDDDDDDDD>
##$VPLIST= <PPPPPPPPPPPPPPP>
##$VTLIST= <TTTTTTTTTTTTTTT>
##$WBST= 1024
##$WBSW= 4
##$XGAIN= (0..3)
0 0 0 0
##$XL= 0
##$YL= 0
##$YMAX_a= 530775
##$YMIN_a= -670543
##$ZGOPTNS= <>
##$ZL1= 120
##$ZL2= 120
##$ZL3= 120
##$ZL4= 120
##$ABSF1= 14.98061
##$ABSF2= -5.57192
##$ABSG= 5
##$ABSL= 3
##$ALPHA= 0
##$AQORDER= 0
##$ASSFAC= 0
##$ASSFACI= 0
##$ASSFACX= 0
##$ASSWID= 0
##$AUNMP= <proc_prof1d_extract_pilot.lims>
##$AXLEFT= 0
##$AXNAME= <>
##$AXNUC= <1H>
##$AXRIGHT= 0
##$AXTYPE= 0
##$AXUNIT= <>
##$AZFE= 0.1
##$AZFW= 0.1
##$BCFW= 0
##$BC_mod= 0
##$BYTORDP= 0
##$COROFFS= 0
##$CY= 15
##$DATMOD= 1
##$DC= 0
##$DFILT= <>
##$DTYPP= 0
##$F1P= 0
##$F2P= 0
##$FCOR= 0.5
##$FTSIZE= 32768
##$FT_mod= 6
##$GAMMA= 0
##$GB= 0
##$INTBC= 1
##$INTSCL= 1
##$ISEN= 128
##$LB= 0
##$LEV0= 0
##$LPBIN= 0
##$MAXI= 10000
##$MC2= 0
##$MEAN= 0
##$ME_mod= 0
##$MI= 0
##$NCOEF= 0
##$NC_proc= -8
##$NLEV= 6
##$NOISF1= 0
##$NOISF2= 0
##$NSP= 0
##$NTH_PI= 0
##$NZP= 0
##$OFFSET= 14.98061
##$PC= 1
##$PHC0= 207.8778
##$PHC1= 0
##$PH_mod= 1
##$PKNL= yes
##$PPARMOD= 0
##$PPDIAG= 0
##$PPIPTYP= 0
##$PPMPNUM= 2147483647
##$PPRESOL= 1
##$PSCAL= 4
##$PSIGN= 0
##$PYNMP= <proc.py>
##$REVERSE= no
##$SF= 400.13
##$SI= 32768
##$SIGF1= 0
##$SIGF2= 0
##$SINO= 400
##$SIOLD= 32768
##$SPECTYP= <>
##$SREGLST= <1H.CDCl3>
##$SSB= 0
##$STSI= 32768
##$STSR= 0
##$SW_p= 8223.68421052632
##$SYMM= 0
##$S_DEV= 0
##$TDeff= 65536
##$TDoff= 0
##$TI= <>
##$TILT= no
##$TM1= 0
##$TM2= 0
##$TOPLEV= 0
##$USERP1= <user>
##$USERP2= <user>
##$USERP3= <user>
##$USERP4= <user>
##$USERP5= <user>
##$WDW= 1
##$XDIM= 32768
##$YMAX_p= 470048735
##$YMIN_p= -725901
##$CURPLOT= <Network HP LaserJet P1505>
##$CURPRIN= <$Network HP LaserJet P1505>
##$DFORMAT= <normdp>
##$LAYOUT= <+/1D_H.xwp>
##$LFORMAT= <normlp>
##$PFORMAT= <normpl>
##$SURQMSG= 1
$$ End of Bruker specific parameters
$$ ---------------------------------
##NTUPLES= NMR SPECTRUM
##VAR_NAME=  FREQUENCY,     SPECTRUM/REAL,   SPECTRUM/IMAG
##SYMBOL=    X,             R,               I
##VAR_TYPE=  INDEPENDENT,   DEPENDENT,       DEPENDENT
##VAR_FORM=  AFFN,          ASDF,            ASDF
##VAR_DIM=   32768,         32768,           32768
##UNITS=     HZ,            ARBITRARY UNITS, ARBITRARY UNITS
##FACTOR=    0.250966925370066, 1,           1
##FIRST=     8223.43324360095, -267351,      -124133
##LAST=      0,             -237721,         18930
##MIN=       0,             -725901,         0
##MAX=       8223.43324360095, 470048735,    0
$$ Real data points
##PAGE= N=1
##DATA TABLE= (X++(R..R)), XYDATA
$$ [...]
23730 -137826 -180229 4760 71304 -138649 168098 -84181 97400 -160118 -38097 -89280 -122023
23719 -122023 32753 399123 142886 -223263 315879 -198305 -145820 86620 -33640 -146285
23709 -146285 154905 -88545 -63955 -5217 -194583 -145934 227430 -108604 -402128 -60513 -179738
23698 -179738 -230487 -149693 97996 -134293 147740 67013 137490 -283641 74006 -42955 -186399
23687 -186399 -298065 292432 -114685 199598 -141668 -61213 -84395 399035 347048 286448
23677 286448 -3181 -216170 -302803 -34069 63765 97066 43532 -159525 -106771 -243454 33005
23665 -45712 -16591 -319488 -1930 82762 -71493 35330 -102495 -64546 -123454 231139 -20748
23653 -180500 -82501 -47309 -139239 -204859 -273715 16428 274342 -187886 -224292 361658 -33120
23641 -187568 -233988 48489 57557 -203949 102228 126487 31576 -10972 -123299 -21509 -243226
23630 -243226 182683 -18015 -251756 97385 -116499 -194823 -118881 -22414 -19784 -327893 -230854
23619 -230854 86136 -7126 -28280 179875 191035 -86023 -38155 25085 27919 136249 -117300
23607 -25904 -331966 220771 -3783 182839 -100436 -130088 275720 -206152 50291 276439
23597 276439 -212106 -123890 48800 -116247 129797 -242842 -10112 -203920 83155 -9526 -139731
23586 -139731 301248 20240 -110175 91670 305908 72903 215786 330593 561209 25982
23575 150720 160755 427265 301205 -87458 233460 232008 -67767 99333 51251 -241653 97415
23563 -145262 109034 180213 -27392 -42586 -1847 96413 104879 -24804 -16650 -107529 -248945 -33307
23550 -80654 -70487 -232116 4367 -104150 -326149 -131823 18709 -735 218730 35988 197426
23539 197426 92960 76066 -152044 120174 2146 139160 -304101 59389 -145432 -123111 176832
23527 20209 -15391 134791 -334023 -139809 196693 -249199 46147 138071 197341 -161817
23516 153811 -219282 -37913 -2310 97425 32507 -226396 -262828 -41220 -121127 -155639 42073
23504 -89610 -98181 -95755 -10235 -8316 -136066 -107906 16491 -75441 70102 -221786 -204070 -162741
23492 -162741 -245489 155831 -151371 84546 135015 19800 63693 -288445 -265457 12403 60691
23481 60691 -87258 169749 37596 -271719 -231014 -15807 176151 -148574 -46933 -56066 -159432
23470 -159432 39434 133159 389074 -256067 -4081 -134105 -311144 -43327 -31912 68803 229754
23459 229754 -319140 72930 -282256 17846 31160 84117 -124792 -214765 -90471 65571 -85043
23447 -14527 75245 205713 -132413 385546 -138638 -263188 52883 94412 81584 -61006 47037
23435 195172 -100947 -201532 2169 152198 125885 378473 -96870 62281 51530 -89552 -10251
23423 143924 118508 272002 193812 -370890 -68148 -63637 100556 98459 -234779 58248 -211896
23411 -187930 -192238 -507980 99986 -74935 -114143 260262 115476 211139 -78996 150546 -97546
23399 35651 19138 105839 257287 45647 -130353 44336 78891 -85460 -29840 97244 12681
23387 38141 19429 6298 -9510 37234 139023 -82527 -96320 -6139 69757 232752 -131736 -188861
23375 -188861 -202821 96496 -51083 19496 -128100 -115927 96221 -335441 -394964 -82270 -148801
23364 -148801 56272 108490 -30030 -499317 -131302 -93551 335821 14520 -71192 -241885 -68430
23352 -270949 -96666 -27006 -230153 -102709 -210392 101478 103124 -141453 161943 -161875
23341 33188 3708 -7295 341741 65224 -27286 227205 -28604 146509 -7150 55693 12982 -23601
23328 122026 84326 -81164 29282 -92914 -114 -22372 -168849 -57782 96736 175985 -20240 176052
23315 -6858 36333 -37988 988 -426904 -59883 -193972 92089 -74719 151178 -65916 42459 240220
23303 240220 -132020 95586 -96785 126175 108388 338594 -15330 60076 -325858 144382
23292 -7457 -77411 195367 8891 38047 -108405 168220 151211 10772 -87874 -52920 -161352
23281 -161352 169765 82082 -91733 280642 16733 265246 -114143 -280551 -106914 -139767
23271 -139767 -266419 -143694 -290214 -32432 -46849 104763 -40323 -190454 65801 2267 412835
23260 412835 -67636 -236336 168788 -121023 -204755 68344 -95940 66048 -232369 -210575 -1419
23248 100460 67303 112034 -30220 -30213 378936 141016 320888 113357 171955 -232414 -74652
23236 -21675 -352447 136860 31105 -93713 186584 99232 114312 -179450 -132239 274533 -5914
23224 87524 -165996 -285873 -77216 75062 371860 -18703 -144397 -170095 -97434 -4027 -25116
23213 -25116 -135965 -57885 -36562 -17123 -124969 -21410 -27362 -350746 -143273 -72087 311629
23201 -105937 -254252 39103 -66712 -184164 102132 184944 -38793 -25510 -8521 95645 -148718
23189 232330 68358 161204 -150475 149203 155156 205053 -339863 12637 -10104 -28952 241839
23177 -22363 40277 -127282 5754 86732 213717 200538 54870 -45210 -214023 273273 -192623
23165 301924 -324280 -160323 -42817 3715 119796 -88059 -57419 -36956 13827 -91150 80635
23153 112906 69704 122637 -304324 -292787 -13115 25454 -28438 177762 69839 -238272 -170333
23142 -170333 348021 -34378 186355 -47818 -167684 -178426 68999 -31789 -207523 157299
23131 123419 -167839 -98459 -83010 -113581 -130759 146913 -106921 -93918 348141 60153 -143530
23119 40356 51581 83014 344016 -111703 -26118 -48509 -65717 -37394 -93701 63817 -120484
23107 88066 -17954 -100318 -369956 -78449 -277177 211610 215238 -370913 -44158 -46652 169653
23095 -326166 -24830 38760 297052 65198 -146479 -260958 125517 -136762 255475 267103
23085 267103 -60575 -243431 133278 66825 55420 8444 22615 80845 -34940 308711 156487
23074 156487 152834 -112776 45919 -151659 -225275 -148298 -77453 -96016 -62942 -22393 149762
23062 77407 156193 -321334 -38631 202803 -20683 -5178 101867 249932 -142563 134516 151860
23051 151860 129318 -148720 143413 -4372 22735 156363 -387961 74910 -91998 386324 20158
23039 308698 -105444 280808 -113556 197869 276496 -426611 374218 8595 74406 -129058
23028 90058 107227 -42320 -415612 235687 39965 -316323 151435 -156501 27437 109913 248224
23017 248224 149951 -152312 43316 86158 98439 -159581 -169498 119316 200288 -136635 -278555
23006 -278555 29786 77629 -279146 -171455 -73208 -51943 172363 -54253 -74598 -55118 -5514
22994 44158 171445 79889 10201 -16573 -4497 145243 87279 13972 -213446 61326 47524
22983 47524 64220 -162339 190735 -56132 -257255 151321 229049 -172143 119898 39045
22972 -137486 -123329 -188082 88984 -79200 -106854 -48919 2747 -104544 139113 -274270 -272231
22961 -272231 128802 119945 -237973 -93863 23396 93379 46832 -141129 15344 -59652 148548
22949 -22152 -365696 -243676 107490 -38951 195851 4859 -77932 -109500 -299906 -208176 203455
22937 -107691 -304338 -156503 15038 170803 143905 97429 -274438 42208 -121378 -133859
22927 -133859 -40669 221672 127892 -72229 192369 -357834 66780 296148 -61565 122450
22916 99362 -172756 -19084 -156631 194778 44946 -1538 -179101 161115 116956 231382 -45435
22904 97392 -130164 -374407 68136 10451 -22480 -143219 -84567 28175 -157512 -61651 30043
22892 -237797 -11223 -329778 -62226 -147598 -19526 -184581 -363936 -110426 -135849 -163147 35322
22880 330245 -263714 -31771 -72599 -190475 123598 33845 -295663 48543 -55605 40008 -317192
22868 4101 -151912 -248680 207986 -229053 289513 81205 -249479 -138194 68690 -85397 -97790
22857 -97790 65338 -126142 -91652 -157014 106681 -166419 238381 -73986 -255483 56853 21659
22845 -154010 -94553 192330 -181252 70754 -208810 -80475 -391187 359479 -388319 19255
22834 -30386 -37091 45000 -167150 45835 259362 4882 -11478 -40881 36290 150194 10164
22822 45010 227132 211181 -220310 -33993 -123131 -114469 113422 -6412 -8818 43475 256052
22811 256052 87513 -21426 140070 200847 -234594 185279 46463 13763 215152 -109358
22800 -8734 -75165 25137 -302574 137566 -76964 177297 -176836 -142304 -75980 87782 -24971
22788 1936 11821 -203900 14808 166524 146280 -62340 -12605 193903 -10883 -242194 -131173
22777 -131173 -102189 224106 -382323 -19586 -139702 -209256 -54938 101499 -254826 -40621
22766 -316662 -248403 -57327 -125743 -147359 -318238 -144642 -149013 -65491 -95887 -39215 165229
22754 94136 147841 -354291 -506348 -204836 -193070 -164393 63963 242182 -54308 -46769 -6749
22742 229733 -322617 247043 151933 -45565 92074 116336 -505376 -185396 -275778 -141575
22732 -141575 156113 -256622 24911 256726 -80094 -72756 195934 -151564 -359027 -226319
22722 -226319 -157681 -89180 -183830 -113845 -48317 91406 -12092 74623 181280 -78956 -117362
22711 -117362 -327801 123411 -77224 -276405 -56386 -185263 -16713 233098 -204100 -68752
22700 92889 -294286 -343429 152689 132816 -88898 310324 -136270 -189875 -199563 33091 -9687
22688 29888 145911 98227 -245764 27036 130159 -192786 -1008 -138414 97231 -234721 -35513
22676 82092 -41852 -24049 -282674 -49416 3135 107711 -49796 -81108 53223 -34076 33839
22664 56892 19210 -208712 -104951 -467121 47296 -177037 271699 -325321 -96876 155021
22653 -160368 -122673 249338 -1971 -218061 74902 137316 -331372 14504 73729 -474213 74144
22641 -74837 134518 -236780 37497 -211435 117613 116536 -69556 -106393 173940 -68377 -96865
22630 -96865 -157955 -208795 64450 -279640 -100845 146539 65227 33658 185696 307406 -307539
22618 74782 -381251 -125070 -22399 -198898 20712 -110876 -28859 43153 81100 71203 -216853
22606 363481 -165849 8106 -178082 38348 139359 46783 -56790 -54499 -282198 -22898 -366469
22595 -366469 -257235 165620 -38467 -97929 240051 -443553 208094 -128747 -560319 -163570
22584 -136582 -10853 -114453 -248555 11209 -64707 -30886 -227190 84064 -150239 -110989 46356
22572 -126701 89444 79658 34825 -155700 -157827 -14682 -94868 -262308 191967 -167515 -39209
22560 50922 59197 71213 -103373 58327 -219526 -8466 32159 24016 -182223 -66281 48956 87689
22548 87689 -134435 38047 -292096 202612 10363 138098 -26463 -286626 -236690 -283637 -86526
22536 -206153 233822 186936 113375 -108432 39163 -183205 -175203 -2533 -112837 -160369 -74702
22524 -146089 -46133 -14551 254129 -216009 -156852 -4586 -162373 230394 -58925 -168986 81571
22512 -106625 -240229 -285118 -44342 -192994 -222662 -116365 -218938 217567 -160189 -209705
22502 -209705 -249124 57888 -127275 178855 102273 74892 -197756 4868 -63889 -55064 -150341
22491 -150341 54134 287204 -216742 257914 91985 -166692 -146362 -148752 22400 -1412 101894
22479 -95678 6501 -86049 -37594 -73059 -158680 41812 10367 -14051 -225676 34889 -158080
22467 101557 4183 128593 -92043 239903 -193666 -112920 215284 28896 -414610 -143623
22456 55299 -20384 -37341 -412449 -137792 272576 -26233 -135990 -24404 -245483 -359631
22446 -359631 324481 -117681 -31135 257669 -132463 -339875 134494 -165519 -153402 24782
22435 -27737 333583 -378508 -113997 76569 -69101 -188480 40164 -189406 -119917 92292 -128798
22423 51847 -131784 -270056 -139084 25099 -294167 18979 196727 32990 -454520 -318958
22413 -318958 -67085 124694 161927 -90898 146457 -261930 102712 -157402 -343682 113174
22402 -50330 171053 -191375 166966 -151214 155713 163696 103676 181052 -118125 -196981 93089
22390 345106 -484320 65271 -36060 136552 -340333 -189078 164100 -140926 37487 79278
22380 79278 -329237 -132285 245198 149671 -25044 -526817 147536 8456 -4891 71836 -115
22368 114447 28826 -116313 -268715 -33130 -271786 -7557 -2436 -134345 44458 15967 -174410
22356 -220002 -102169 -13448 -82757 -237587 311364 116438 -323053 -49543 -290890 -175145
22346 -175145 -206919 -99121 9119 -130631 195697 179828 210421 -90363 191241 -204443 -16745
22334 -180817 -251944 -147075 -170544 -18941 77535 -91039 -237644 29958 -114115 48981 -164931
22322 129166 -119967 -277235 -259339 203393 -47589 131056 112651 126314 214555 -183544
22311 -145639 425674 -144835 194476 -137672 39681 -213359 988 -248747 -516893 -24029
22300 -130367 11572 -255879 113734 100288 78504 -471656 74133 38014 303125 155810
22290 155810 -127963 109705 180709 -12190 -348446 -252898 -60294 -8205 192545 -241128 31918
22278 -76287 -71446 -356703 -223797 -216881 -32509 -347891 53898 -89845 112450 -163757 145339
22266 -52742 48031 82481 -73100 -16397 15733 233903 12909 441361 53737 108158 -181670
22254 -52280 -71671 82109 -66865 283356 38084 -208650 321956 -361184 261324 -106732
22243 -150462 -175621 -491674 -183615 246930 -60447 -76411 -196413 -127996 -309101 -214797
22233 -214797 -1623 178098 83574 132724 -245886 -169896 -393321 66786 107415 -164807 -277102
22222 -277102 12523 81595 131247 93940 -54663 39786 -210238 -163694 -254083 -9029 -402600
22211 -402600 -171803 30290 10585 -62308 8137 74682 163065 58101 41084 -212944 -85987
22199 -96895 93646 85770 166617 212984 -139726 -32753 -70724 348218 102113 9611 49021
22188 49021 -207908 6436 72558 -122835 -214477 220286 -8630 -245022 251769 -150300 111386
22176 -85345 -122773 349042 -157864 14892 -150825 121632 -12005 377708 -37847 73245 -226033
22164 -238913 79680 -241517 -97693 100174 37521 2301 -238393 -95007 -243125 158447 208204
22153 208204 -6065 137768 -17176 -295571 -266437 -32189 -90575 -155842 -164554 -437104 -350596
22142 -350596 126975 -322727 94106 -90572 42636 -45735 17820 89314 155649 136863 -131103
22130 39558 -71373 211511 -127848 -15426 -282952 7314 -441394 -320684 152416 -236220
22119 -97113 -406011 -403366 253880 -114924 -371660 -388550 -145096 -85371 -132950 -329858 -122445
22107 -223165 -442238 24978 -131305 -234648 -121367 -141218 77102 -140181 82443 143659
22097 143659 -38650 -351410 117908 -281794 -56255 -3126 -35138 227271 254570 -384393 48201
22085 -6871 32177 -82754 69923 -3194 24384 11103 -341130 16795 111736 156114 -194362 219342
22072 -7109 -159823 41018 -313870 -46851 -160269 -61888 -209795 -86959 -125011 -189425 230321
22060 124320 78366 -18377 -171547 -70634 16734 37564 -161796 -85127 253827 -8889 -93094
22049 -93094 70067 -214524 -217529 -334353 19520 -250523 -74707 -289093 183298 -117059 -304113
22038 -304113 -442207 -99098 -154320 -37931 -307640 225590 -141653 -17716 -28241 -232297
22028 -232297 28940 -49370 -113836 63697 18052 110022 -211950 159349 -12535 -169278 -242843
22017 -242843 -174191 -261508 -312379 12207 -133978 11203 460474 -42201 -48889 -18254 -86848
22006 -86848 -426456 -213696 -328745 27209 -281426 -7266 53850 -190337 75460 -25035 -258758
21995 -258758 -214987 -113754 -205275 -81237 24567 -186775 -14046 175158 144351 -217483 172095
21983 170002 159829 177643 83202 -246015 -33990 92723 -76650 146881 224248 -149418 368901
21971 158450 38347 15831 -64799 -66000 42383 -33090 -359663 -36115 -134029 -371255 -174131
21959 312390 -95016 -26883 -267787 -150954 24003 -184805 -98509 -46198 120946 -94178 -145265
21948 -145265 168074 394435 49521 -202384 170525 -73261 -53657 -106851 -312237 -273299
21938 -273299 28487 24039 -312254 -453332 126281 63076 -164227 77601 -227785 72468 -137431
21926 29613 -100151 -105998 -133725 -139122 95769 -151624 -17990 -25777 58644 -37504 88707 -103282
21913 -124348 203899 45296 79180 143742 -200782 79773 44343 -161124 -124937 -49551 -167402
21902 -167402 -102081 222790 -201653 -293645 32026 -39301 -8262 265361 -26141 -281491 -97366
21890 134580 33144 202625 30047 -262100 2346 197965 -386528 -22601 183763 91284 82953
21879 82953 -402354 -47520 -99448 -395738 18325 -203338 37787 -180171 28394 3522 -9937
21867 -204923 -365321 -462942 -276806 -81447 -17330 59117 -35830 -36306 -389418 71536 -156945
21855 -203686 -38377 -67256 111192 165508 144363 -182918 110816 177684 -120421 -126516 -28818
21843 -102305 112287 -199297 -22451 41059 382357 -70562 -127930 139291 -283562 -200526
21833 -200526 -11991 294806 -48361 -251337 93168 -170154 243374 -73522 19282 -151531
21822 202312 156441 -49691 -228878 218983 43864 -13850 60906 243903 173093 -441026 -47707
21810 -287868 152369 -420150 50886 34655 -119538 -26807 -249289 -122648 -394732 97932
21799 -192125 30778 -398036 -83450 -178123 121267 -86974 -134203 17660 9210 -163843 223922
21787 -87428 -37807 71507 -64277 -29890 -66266 -143236 -300389 -205968 -33414 378557 -50427
21775 -179533 159407 -126045 358886 214295 -141505 86290 148868 -168260 -283039 10113
21764 -245966 -25319 -3042 -248412 198143 -79684 231707 25571 -27569 -220989 -2518 -377794
21753 -377794 87911 198483 102389 -189436 64134 -52396 155028 164407 -89908 -185058 -63860
21741 -552666 344088 -1580 200245 79348 212210 -64995 -174412 11232 33544 112070 -80071
21729 38887 -195746 -289686 -82395 19564 -67352 -45811 185928 37581 217015 -84699 81491
21717 -360255 -166093 172021 -12736 -265428 -71051 -145508 39927 -187628 -40437 -496030
21707 -496030 190750 -79236 -139440 150240 -181421 -201450 50393 82922 253744 130524
21697 130524 53027 -7686 108341 132285 -71384 126665 239509 -277847 61951 250969 -166193
21685 24240 -247376 183122 204866 -77136 -24209 -301748 -233838 121061 -4864 60618 -42425
21673 -120514 192904 -125676 -102554 -124169 190686 133524 -124408 -271591 11424 -209037
21662 -19223 -294131 -142493 80725 121227 -73875 -120357 353392 38318 133653 132776 43421
21650 -74441 8832 -122406 -246653 13064 -169013 -201845 -200511 78206 -372406 -133617 -16415
21638 -103418 93939 -107790 274612 -273159 104988 29880 -59321 -109673 31408 -121216
21627 43825 -420393 -55676 131916 258112 -203439 -31692 -59948 -74728 -73046 -393845 -117872
21615 265228 -130659 -230875 50622 55796 -285551 -107897 64833 -130299 217919 165842
21605 165842 88919 -29862 -258042 -133431 -61000 -18001 -291553 -387373 -82067 -50319 -392058
21594 -392058 -166075 100476 -120105 22076 -17849 -190517 -57563 -221932 -245185 -171562
21584 -171562 72674 25148 -66000 -4359 232946 49048 -81401 -79653 -40621 -204962 63362
21572 -104851 722 85971 -176607 97958 45396 201289 -185829 28892 -115602 -197366 -37606
21560 -148673 -2261 -263561 -424175 40402 -98549 -4335 -275616 -317355 -64365 -31964 -49414
21549 -49414 -5609 -325193 -137149 -195282 -175533 -187248 41416 87010 -67254 -90754 -217011
21538 -217011 -242071 183759 -108154 -2456 -155380 -223203 292991 -90798 -148261 -142190 -71443
21527 -71443 262354 -168411 -366948 -55942 -146485 -82404 -44834 -36761 -136013 -140533 46138
21515 -187049 -84324 -25929 -92162 -177651 11808 -35682 -243122 -282929 350416 -162107 -10351
21503 -121422 13098 -328741 423373 -102660 -52799 -174415 -51737 -244604 30947 -41574
21492 140497 82934 -70516 -309984 423147 -170221 23102 412653 185054 -139625 -211265
21482 -211265 -65827 -179939 -164940 -60 136426 -6236 -127958 294130 9002 -190580 -1935 -85015
21470 -85015 217081 -213145 -391803 260593 169052 44438 -488306 -177272 -150771 195251
21459 -117526 135341 33009 73915 -100828 -87428 -452408 -114762 -129157 -236482 116567
21448 -69825 -160489 -13503 -83148 -44 -17986 -312251 -242593 66473 -156898 204808 -53673 -18165
21435 97393 -313714 -228185 97264 -196674 -50209 387151 -225973 61918 105033 53256 38000
21424 38000 27306 392882 211223 289046 158754 72938 -208748 4017 -30584 186776 -180740
21412 54830 46948 -295147 52492 -67582 -116181 102027 207881 52524 79069 -202936 -277695
21401 -277695 -230077 -2338 -77597 -46665 -101988 -117701 -135724 -123008 379909 -293928 -209916
21390 -209916 -68092 6644 -233640 -406656 147854 63636 66269 9148 -499505 -420833 -394313
21379 -394313 -140509 -98480 -41026 -39621 31260 -75850 -400372 46950 56266 -244913 -228078
21368 -228078 -143916 -68371 -203704 -55122 143579 -140396 269843 -70154 163951 -34876
21357 24697 -77023 -137160 -130872 239716 -11878 -23314 166281 -78139 -237200 -54173 -124669
21346 -124669 123933 108172 127421 -111018 197199 88539 110779 179588 -73993 -159387 -552932
21335 -552932 -180797 -181225 -77579 -357853 32390 78738 -198936 133960 -34111 -285736 -93733
21323 -124762 -96276 -326572 85698 128130 -80184 -359652 -38694 193220 -104032 18338 -82682
21311 -283524 -153186 -98966 23311 -62608 -58042 -213808 -97929 -102351 145592 -15794 -169017
21300 -169017 5001 126793 60354 -222476 -73533 -88390 219915 211962 -49850 -70338 87198
21288 -79670 -35330 152714 -81338 65313 212409 -332163 8452 -481912 -153038 12630 -65833
21276 210662 108689 -25890 -247049 -124154 -30185 -21527 -213710 93388 -296606 -102620
21265 17818 -81587 -15474 -42475 283232 -325922 -103024 -255963 31538 -180957 24492 -53109
21253 -307282 -209780 -429070 4611 332404 14237 127879 5041 55347 202411 -106270 -130322
21242 -130322 148831 84873 -134205 -173542 -35158 32306 2530 63399 -157825 199464 4405
21230 -8942 -192169 36927 -265256 -182953 -320026 26 -129326 -268155 -104802 -293866 62777
21218 18784 411373 -176524 170932 20968 -52606 -135951 -66510 -271257 60195 -104108 10634
21206 -102784 44194 300708 102739 205777 -17919 -42231 -329008 32767 80326 4435 -239889
21194 -57393 -62756 254291 -220264 -154171 -246380 -320175 -202207 45716 -155457 -5732 -283989
21183 -283989 -78841 653 41020 9450 162730 -142132 206578 -47587 -232864 -30137 -298278
21172 -298278 -260200 272357 167051 -393912 178849 -305438 -110204 -248466 -88444 -152091
21162 -152091 -47941 101006 -28494 117092 -160008 121371 -140015 82953 89872 -192995
21151 40381 -279840 33792 -107146 136796 117533 -74782 -150759 -34214 18480 -79177 -176893
21140 -176893 -189023 141863 64943 66242 -218885 -164500 -412686 -272947 113745 -252287
21129 -167145 85257 -121243 26618 73687 -212572 -524040 82881 -30051 -364332 57150 -118558
21117 151769 138439 -16767 262462 -325900 -307055 -49123 -98523 -84591 -127756 71139 431
21105 122333 -56976 -53943 -225097 11845 197372 -7372 215736 5554 -83522 -57454 -69734
21094 -69734 4909 -117768 -228890 -290787 -51776 -214324 -215311 -149729 9070 80386 34018 -17308
21081 102384 17729 37936 215958 -222524 -162505 -92620 134675 -199623 -95000 -120171 -79757
21070 -79757 -32679 46762 -146606 68447 -266867 -236511 -153194 -188946 -154167 -92667 232581
21058 -155140 -92578 226140 -2421 423874 -122876 -149990 -545567 -129033 -123387 -242199 -202319
21047 -202319 -219394 23391 -12436 -154068 -238495 -302847 150389 -231094 -181330 255620 -50716
21035 -133878 -7671 -186587 -145986 -108923 325828 55723 35911 -354972 -90800 -192622 103882
21023 91651 -23966 179810 77488 -31941 277014 121088 -43284 88381 143907 91339 37874
21011 -94854 63696 23326 208588 -46404 213301 -166687 303697 -10332 -21784 -113442 245528
20999 45010 -120197 -95298 203602 228412 114948 353968 410245 50538 265431 316221 169234
20988 169234 -269022 -362846 121282 96353 -91277 24035 8887 301341 103586 54164 -277237
20976 238912 63227 -380359 -434898 -68166 -373001 133986 -80480 -255341 -257703 32764 -169124
20964 -25594 -176964 -279829 149803 80947 -67232 -119112 -88926 -61845 252032 124584 -29458
20952 -27387 -204689 -117138 120963 48126 -293123 -162771 -130460 92468 -7437 155676 -150029
20940 -225145 70074 60521 162310 264968 93864 -51324 214485 319396 226921 135928 305993
20929 305993 144633 230752 321986 324132 -32359 61406 32042 63590 85246 -303718 -140669
20917 -419609 -264343 240521 106758 -161665 16813 -322641 -139799 127551 73290 -211888
20906 222553 102830 -32023 -170996 -215222 -249393 -122870 -14511 52166 -168745 -262953 -154842
20895 -154842 103459 -234024 89109 292456 -74369 -146695 102363 -171619 -67006 -291457
20885 -291457 -232365 -45079 122819 123757 -251773 -67304 84414 -335101 -270903 -94607 26002
20873 197866 36929 -71704 -203486 -355345 30426 71158 259656 -98438 227473 -71500 -241703
20862 -241703 -120802 -289828 -415269 -302051 -241162 -57835 -33817 -134215 46233 -43473
20851 -400639 -150673 -131930 -265386 21831 -34117 346357 114203 -185189 255632 -102114
20840 -23710 1817 140253 202952 60311 -160725 169688 33766 300048 71458 147144 38351
20828 -152871 -74757 -148299 289086 144741 -72753 122440 -63973 103887 150950 -161873
20817 -99316 -140899 -215963 -115556 -84088 158055 265627 -20283 -158672 -67212 -170470 171042
20805 -198807 -123540 130196 -43094 -296450 -288652 52957 -110002 -135575 115756 -207844 -12775
20793 41309 -29063 -141024 6677 1450 243819 21540 65175 89187 -235107 -31169 -221539
20782 -221539 -126595 -27283 -227158 -261699 21764 31951 -279535 61404 -397479 43798 92995
20771 92995 -235703 -109123 -10532 -415762 40019 -273901 -207288 150118 -73866 -182863
20761 -182863 -110582 -23469 -401269 -96784 -232554 -195691 60208 -667 43073 114856 -237429
20749 -215563 126581 -30974 53138 -131630 -3911 -210209 -276405 -8226 -19741 62406 -26649
20737 -378796 -106970 -30293 168980 -159424 -283258 -239607 -472571 -106876 -46123 -123741
20727 -123741 -61109 45546 78232 -153165 -179568 -129497 -257947 -326181 -90733 -190806 167885
20715 -159845 -236325 311393 -177685 -311178 144035 84451 -37820 -297130 122013 58296
20704 58112 -335994 -357001 102517 278067 46500 99305 153909 -384368 166437 -271405
20693 -179176 355 38956 -37676 187390 -234405 -246 239259 -192838 71228 -136419 -242918
20682 -242918 -168712 157063 -128980 171814 196417 -6940 -121034 -127933 35405 -192136 -183237
20671 -183237 -73098 100375 -76316 -111771 -457087 -44510 -14876 -259353 -110396 -167332 -219105
20660 -219105 -170381 248293 -286724 -446317 -251794 -19752 321001 -66098 -61396 -55137 -213123
20649 -213123 -68780 -189579 -4841 228380 29801 308764 -38534 -5791 -157557 24007 -145485
20637 295134 -191607 174867 -273864 121245 75915 166421 -21393 -42976 -221373 126407
20626 89243 -124699 162868 56696 75582 -203417 -73121 -125045 -109472 -42052 -224580 35843
20614 -58033 -35582 -208747 -214290 -485843 -263153 115686 -228837 -87856 -125404 -197222 -115943
20603 -115943 -204639 -167289 -69145 156371 -177333 -216404 205923 -14601 -404209 -11520 -97481
20592 -97481 11759 -118519 -110838 -84063 -103241 -308494 -12709 -166652 -291377 11097 -27213
20580 -114460 -37958 -146577 16888 274039 -38927 208807 126213 2431 96084 149340 249235
20569 249235 -216440 72043 -1507 238999 -73784 131359 -14068 200966 33721 -225637 353998
20557 -220597 162502 81096 -350496 10239 243870 -158456 -142551 191818 279508 -92209
20546 -61445 84273 -104578 -8460 -180202 -21651 6424 111256 -167687 150555 192678 -234014
20534 -393551 -282097 -289567 -49528 -227874 132013 -259874 -176154 -150973 -80846 -213452 312019
20522 -59092 339592 145411 -23624 171185 -277570 141342 -97319 -87173 -83088 132351 -148646
20510 -184282 5349 -204261 10969 52762 46066 -294455 -33228 -56990 195639 174839 31130
20498 -114037 103392 -343852 -78117 -305823 299874 42415 -122085 -67990 251202 -202569
20487 119740 -363762 -156059 170724 66248 50756 113904 -316787 -83223 -125955 281430
20476 -107348 -124382 -183491 41271 243759 32894 -116637 135093 -176302 -72156 -22176 -23547
20465 -23547 206009 75239 98912 190404 158302 283606 -9635 -98978 -12841 163394 -193359
20453 -53297 -423354 -32534 242552 104323 -185632 167255 -24702 231976 304109 -75292
20442 153945 178039 -196277 -31262 -223910 -296577 -437923 -142228 57573 -247633 -93451
20431 -73538 -174324 38128 -96214 -492756 -166262 84449 -42714 -313319 -261061 -177003 262879
20419 -22115 -206673 -99102 -84896 -338135 125022 38580 -106319 -165381 -33603 59652 95977
20408 95977 -165399 -63851 -118481 141031 49 -291810 -82558 -60843 189151 -78850 -16828
20396 -131442 -27977 36090 -618332 -379990 -123628 -370891 -152897 -257290 -168159 -118150
20386 -118150 -234599 -134894 75074 91002 -74841 -360643 -60633 2275 -107218 140462 -35115
20374 -216311 -191969 382545 -168995 87786 -373216 -15565 201506 -170426 -339590 37210
20363 -292739 -115900 -129073 263783 87179 -173477 20611 -20510 -138026 -339582 -143210
20352 115803 -264976 -54625 -164519 -305366 131612 -93971 -468010 -309237 230144 69446
20341 22029 23798 257208 -328054 -17746 -128833 -32947 -234226 44035 -26586 -95006 -45821
20329 -106566 72242 -38033 90870 33624 269729 -102793 24315 118274 2394 50002 -124601
20317 -25982 -206461 -169136 -369441 -116694 -155047 -140025 318181 -56933 -6770 162121 132600
20306 132600 -117345 -62294 -185150 80934 -150131 -398194 -135784 96766 -322624 221769
20295 -135324 -235046 -44678 -132796 -98134 -109282 209830 -45752 -115691 -106717 -110883 9927 14679
20283 14679 83040 -130134 -110981 -212621 -139767 291763 -388918 -39631 -177177 -54640 -74055
20272 -74055 -172072 18028 -181665 -337313 -159510 -69062 -169704 -311952 -84252 -65699 -213729
20261 -213729 -298919 133160 -84884 -115466 -91120 167468 -84063 193826 -102654 57048 -86522
20249 13045 39135 -126736 -320342 -92192 -55171 -132894 72709 -132215 -156054 -90736 -166269
20238 -166269 134973 140648 172203 -136027 216269 -357774 -320705 -265835 -124668 159788
20227 50928 -6834 246486 -122345 -64672 -172433 -84732 65886 -115857 -475396 20843 93776
20216 93776 194630 88389 103106 -366270 -185017 -290127 238586 151146 146546 -302495 -138712
20204 117006 120324 143483 61772 -169193 -76926 -258212 57119 78264 227262 -102078 9996
20192 -24049 159211 -34610 -269874 -232086 128170 -181076 -64604 -22033 -17071 197420 -126921
20180 60322 -106599 1930 -269666 123730 -12577 -94342 -86540 -120471 81403 34641 -242971
20168 -301940 -385378 -189103 -6851 43703 80785 -18146 284611 -31390 -77499 -42444 -102833
20157 -102833 49430 25885 -84952 168836 32169 67589 214518 -28064 -34623 -83909 24060
20145 -234893 237559 160989 -40805 -9058 64264 -16975 -287217 151062 503068 42361 82253
20134 82253 801347 487114 397658 430726 366645 322994 297496 161453 776723 216377 473966
20123 473966 -67109 -103796 315302 265045 111496 140492 -273018 109846 86683 211469
20113 211469 9111 -366636 -204006 -408009 -190364 2183 -36673 -455946 127908 6624 -67023
20101 -104743 -260772 308686 51900 45062 -197012 -178131 254238 37065 134280 -198721 -44778
20089 -389547 251013 -249690 170423 33978 -58198 -406276 60259 -328908 -61980 85461
20078 -58687 -10419 -10447 -64277 40757 56158 -23804 168313 209198 -39343 -946 18835 -229117
20065 -32906 -291589 77445 -37884 -2810 -69871 439594 -39720 -41505 -81377 -142715 -216476 -366702
20053 -366702 -323223 -241853 102079 78668 -191604 -173538 -208 -228419 278041 -63521 -191111
20042 -191111 43710 -64671 -138185 -357488 -154979 -246682 83588 131074 107308 -12914 11148
20030 85799 12856 52682 -119776 -94114 191953 234904 -15854 -82895 -88980 -219717 -243331
20019 -243331 -112776 16051 -147298 77183 94484 -48319 -376273 -220914 93751 -212213
20008 -59141 40944 262403 -22371 -4496 -2174 -146151 405815 -2811 -141546 -39313 12432
19996 31199 -63934 48345 -224 -5297 128564 -79587 -55272 -105459 -243398 151785 99891 202713
19984 202713 20161 191426 -46468 60181 222692 -64989 -192321 107081 182360 -38970 212297
19972 90293 330026 -9897 48500 -292263 175910 264017 141023 -58438 49894 71005 -8796
19960 -256629 -1488 43668 -257454 -136715 -22671 209087 146142 -7176 211121 54262 51611
19949 51611 582596 303116 156692 252272 395752 216990 -115855 -135229 -462708 165053
19938 -44574 -16819 -50572 77856 -48294 151557 -31782 27734 -242155 -185030 -139711 -102653
19927 -102653 -74220 -69774 324243 -8916 -446902 -8772 365986 -220976 -268858 251427 31729
19915 214757 263416 -82236 -338913 -67144 -111367 113938 -50729 176305 -63202 -194652 -60894
19903 77588 46035 -282011 154674 157510 -93857 59396 -158035 152233 -111664 38311 237276
19892 237276 107952 -12701 -89632 -3709 -43105 -128071 -262986 -480595 -316139 -64691 -139677
19881 -139677 -254745 53891 -38699 -235829 -145144 32723 -72110 -240241 169650 -81800 -97270
19870 -97270 -77446 5408 -65573 -262419 -260404 -332393 -106489 37611 -168109 -122626 77737
19858 -255152 37148 -152911 81669 -220711 -41166 -114112 -113407 -144434 27040 -176505 160875
19846 68693 -215623 -93899 211103 363229 -147207 285603 103086 -167677 -73019 -28549
19835 -204652 -20300 286707 56227 -186213 -92440 162051 -228269 -20291 88374 95835 79790
19824 79790 196816 117289 168142 -208111 -169811 -3147 -158843 -238864 -83902 286132 -89936
19812 -249375 -19524 -115687 300943 3587 -263905 -79669 -23051 61155 -373173 -45532 -87264
19801 -87264 269698 -398923 -49002 -314598 -139235 62717 -219554 -412598 102603 79956
19791 79956 52787 75877 -113341 15569 -138137 172425 -478817 123787 215951 -285798
19780 30487 -62798 -23197 135977 -139517 -264983 236400 -232085 -92740 190148 175120
19770 175120 -110306 151352 15100 68240 -98186 -46378 -406114 -273174 -403645 -226370
19760 -226370 97690 220429 -122083 -75127 75117 -12874 199702 -136405 69370 23383 -173307
19748 40814 -102214 270337 -73042 263249 -264104 -64808 -241622 -168816 224723 198357
19738 198357 -18008 -137949 102223 89248 209648 -67129 -6834 -134381 149751 -143483
19727 160715 -7885 216222 -49967 258685 212946 -171471 14257 239 -15406 -35029 557440
19715 810829 264130 142073 154610 -168801 265093 137560 41146 -154540 171141 -30157
19704 -180341 -62424 -22047 -454204 -32047 11816 -56576 -64167 -23891 122000 200623 243879
19693 243879 -20613 -211070 -69035 -80173 28083 287499 198495 288332 -15091 131963 32586
19681 545941 651355 -369047 153859 -79587 -175686 100306 295857 218858 185729 -128618
19670 -319542 150438 -134340 224498 85154 -440977 -115288 -231635 -279969 145573 -94422
19659 144102 -184134 -89034 -317351 11890 -286485 136550 96489 -76951 -115182 -164558 -113603
19648 -113603 -229995 -37355 124233 -108031 -8949 -262987 -32914 -162428 258636 -55945
19637 -153766 162059 -330473 -12890 42760 115629 -231256 44974 86339 -178240 -192403 -55459
19625 -137432 -44844 303798 -269676 -187479 -4023 -129851 57792 136380 -101107 -191677 -8884
19613 345766 79668 138595 -197246 75542 -96450 -182970 54026 184153 -115442 -131877 82218
19601 -264617 -17842 243923 42747 -116470 57805 -179194 232486 31323 272064 68023
19590 112032 -20595 51310 -156147 -88378 -81209 -326095 -227494 -92335 -210989 -390723 -314183
19579 -314183 -169914 -156241 -267448 -188739 -37798 -188630 -170521 221077 113086 -102631
19568 30759 204603 -190979 -41962 -212663 -147149 51889 266295 -356922 153760 -84095
19557 -14624 -71150 -169052 -321450 67204 -284551 -429228 -163291 -5730 -165701 -269114 -162161
19546 -162161 35784 -233530 -197780 -232164 -220695 -103196 37197 -157427 -68625 -207247 -59381
19534 -286396 -252439 5271 -27062 -51876 62065 103402 52934 -202059 359126 1215 231899
19523 231899 145043 -169377 -104539 -65411 -288618 237590 81336 -136860 31146 -368680
19512 -3421 164430 -280759 204051 64966 43801 46873 81510 -32236 -150108 52822 -193748
19500 -11298 -83514 16116 -309309 -13077 124520 4084 79396 -337938 -120282 333305 -136714
19488 -104811 103532 -120386 43748 -496383 -200860 -104974 -16712 67064 -125535 29047
19477 492095 52802 -174144 -171123 -363700 -39840 58722 -190249 -32036 -184752 -68773 249316
19465 -205934 -409691 -144587 -25754 14433 59500 175109 206711 -149000 -189775 36687 223087
19454 223087 -141406 -38511 -176311 369152 51071 141555 100306 -67190 -70708 -179813 -149554
19443 -149554 -157622 -33744 -59078 -148345 79028 -403359 -20736 -166552 -64872 46248 -182854
19431 -190105 44965 -575313 -12299 56939 111055 -135450 3787 133668 113894 91654 -260842
19419 -147166 -162648 -145550 -105046 -78488 -37623 82329 124898 -267342 -83724 -35633 -27776
19408 -27776 -343894 126304 -96282 69445 31773 -160147 -175984 -114189 238945 -13502 -227885
19397 -227885 -74115 -249374 -72738 -352730 69900 -111630 140991 -148496 146612 -161102
19386 176546 -86395 159745 -4764 -99215 -134451 -173695 -347873 -43805 18901 -184096 23384
19374 206158 -250712 -277804 -282646 -18975 -204732 -208743 80224 -76027 129592 -203245 -262846
19363 -262846 201253 -54974 -157476 265723 48271 -202867 -273793 97395 -128799 -356780
19353 -356780 -58940 -568945 -85493 77202 100286 6004 -31437 77902 -208267 -52502 149350
19341 234638 -287450 -360647 229511 103331 -266702 -74929 25167 -4823 -205237 -69635 -276167
19330 -276167 -83067 169258 99840 -12237 -222091 2520 -81248 58537 80364 88145 -257341
19318 34365 -26568 162789 -223379 -1157 -40398 -130859 -79962 -285459 -89865 90169 -324344
19306 -4565 -204905 90641 24776 -96223 166610 142420 -23791 -282911 -104775 -286007 -124323
19294 -204254 -210596 -243241 -102282 47855 -131220 -30416 320489 -256284 -102264 109448
19283 67594 127092 -33843 -156798 -46185 123617 -182032 -245618 -144055 -153679 11333 -153714
19271 33601 -17246 -530598 68464 51577 -25138 -278479 105407 286499 -150027 -151137 -143658
19260 -143658 -374851 183640 -155709 53581 -110553 25798 213133 -58763 -466331 145453
19249 73282 -483986 72670 -33950 120608 30696 11956 -356875 -353866 -159062 184114 -69977
19237 -205739 -74801 -301479 -144902 270580 -81582 -127542 -16157 -343996 -236271 -64375
19226 -304964 -102557 -333492 -63885 262562 -44437 -139513 282655 -353572 77088 107158
19216 107158 -365847 -102279 52187 -68233 146963 -159658 223292 -16700 101957 -216421
19205 -91575 91176 -162191 -347070 -42421 -68170 -105351 250696 -52058 -175731 -227194 -304520
19194 -304520 33737 -21080 -28399 17259 -250613 -241124 482 -19565 -214547 -108790 -223375
19183 -223375 -203416 128169 -85474 -183540 55730 -173326 208112 -18478 4075 -246249 -210800
19172 -210800 -93043 98157 -261070 -168667 -216054 -146324 -33624 -73385 45393 -245836 153906
19160 66330 214042 294893 201212 215782 89614 -385207 -83333 -49905 -1332 18033 111879
19149 111879 -8136 14711 -132705 34401 19799 -175170 -96756 -309396 -115269 -184265 182667
19137 -169372 -420145 -90022 -259194 -128457 -131241 47329 221523 44088 365504 67283 40864
19126 40864 -140296 69000 156540 77151 -173143 158494 191365 -157518 -144457 -315759 -182253
19115 -182253 174116 -174057 140173 167791 96127 -173083 261740 -57613 -40244 -87364
19105 -87364 12126 -80512 65249 -123917 -184477 -102767 -7634 891 -53610 25550 -259666 243020
19092 -163927 -47664 -90315 -182899 -278308 -118523 -460328 -62526 -210184 -337620 -27723 -45463
19081 -45463 -134094 -141181 64194 -27484 78838 -135060 -180577 161716 -227799 27304 -79443
19069 111446 -261065 -198906 -35669 -112919 -168288 -130124 -260661 75523 299484 23514 -51519
19057 107217 201335 -432416 -22011 102202 -141062 83508 -241818 -42624 -197188 -64714
19046 344074 19991 104489 50335 172040 -287195 46597 110475 184720 -8845 21045 -276526
19034 -87159 120156 34380 -264271 26814 -35128 -457781 -439245 -432046 -184110 -106982 157789
19022 10297 -128356 -66200 -49769 56779 -166255 -100121 -137705 62553 113387 -73185 -125727
19011 -125727 -42598 -361265 -58681 -2132 -183706 -288316 -162400 343584 -211270 90484
19000 -95771 -177440 73772 102137 212209 133423 105455 -135448 153787 -226168 115194 -159887
18988 -3553 21817 -358375 207653 -159512 28502 42733 191964 -80380 -3509 -21533 4092
18976 -116242 -257212 -236821 99377 22692 19401 -12401 -252947 109177 187805 34375 76793
18965 76793 -238130 -20960 147738 399112 14579 199673 451656 365572 556582 8586 160849
18954 160849 27124 135907 -182670 117009 127522 -203859 -300588 -95222 -317071 -263879
18944 -263879 -139401 192020 135559 148209 -63454 -266547 -122756 -52945 -321085 101886
18933 285479 220292 343731 104405 -163468 -43661 52858 148914 79450 -36215 -249166 -194808
18922 -194808 46884 -58063 145343 176866 -64666 157347 59221 -79885 -142714 -345794 67708
18910 120083 -177540 -95581 191887 -346508 -134947 -105541 -467609 -187032 166525 -141393
18899 84841 231072 135131 279225 196425 322000 306096 601658 227609 248861 -56324 -381683
18888 -381683 1868 223689 -4306 -49671 210167 61963 -108383 -160471 -86454 -8802 152813
18876 135850 80343 -299620 62349 -141330 -80496 124885 -140024 -143256 -199969 61824 36007
18865 36007 107787 -43418 98035 69739 120389 -287840 -135719 -128800 -109757 -254819 353979
18853 -176199 -66640 54890 134009 -250898 -57024 -334462 -15122 -298707 38436 -180040 114971
18841 7375 -88772 -322907 -88193 62399 99371 -271986 -184021 -260803 143090 -184332 20034
18829 -38200 214705 -14965 -196763 100224 -133408 -277876 212329 27211 -276177 -188262
18819 -188262 58437 176245 -414652 16161 -10675 -88115 -57406 -54156 117566 13710 -241507
18807 55515 -42959 -91412 -168574 145334 -169252 -30339 158409 357259 97932 -153883 -204554
18796 -204554 -144933 84164 32427 440687 143897 179858 192051 45707 -257654 113779 -20855
18784 28826 72592 -107208 -97362 -416103 -504952 382244 -9427 89465 -230793 -30229 -72712
18773 -72712 -43178 29375 -392795 109673 -110667 -44842 -72998 37757 63028 261876 154936
18762 154936 84103 173908 -32185 155920 -186627 -226166 -30908 142422 -175486 -123331 -35813
18750 119724 1526 -98029 -123593 103859 143280 -81657 17109 -184567 -152038 142192 -8938
18738 -108196 -159457 152504 -315258 -127264 187302 174503 19176 -172701 -297183 132960
18727 72350 -239775 -430620 266060 31433 44777 -205311 39882 -83875 -149080 -138488 -281709
18716 -281709 -206123 60410 148015 99878 -31552 -599562 312401 -43327 -386415 -16716 -283591
18705 -283591 172454 -268569 122479 -82899 355752 -30413 102627 -111452 -248330 -56182
18694 -449339 -359176 -319483 42457 -109378 -51416 -199792 -125326 -137982 -70795 30921 7577
18682 188433 272449 -223902 -36952 -424803 -213698 90028 -8728 -141361 -37526 -171052 88695
18670 -274795 -152331 32178 170613 -126191 -189001 70448 -208058 -236423 213183 105422
18659 269578 -285703 365780 74259 -202877 -62689 -398252 210087 -372960 126200 -197095
18648 -68503 381448 181353 -182572 -199750 -9432 -75304 -73908 231282 -116794 -185460 -30327
18636 98426 -20865 87909 -80763 -210269 124692 -145543 -72427 -48439 -287419 -35891 -37147
18625 -37147 113350 76446 67210 -322450 -41418 -192800 97370 -233884 210831 168866 -189888
18613 -93931 -103672 176434 73091 251065 -340655 2454 162526 -13184 -71571 231132 -264852
18601 -194592 -51213 -235468 -144626 34842 -147201 55688 -290082 -131880 -215620 -184045 49915
18589 -216555 -241411 -110022 69905 248377 129460 -553375 48372 285473 -377253 151118
18578 203761 277937 -14989 -57954 -271939 -208727 67086 129377 -203327 92319 241767 -457782
18566 -249296 -151256 115439 9700 -163586 -186800 33927 -434148 -419275 63035 18935 309318
18555 309318 -121118 98965 -56052 -61497 -153587 64605 -146872 59210 183166 118570 -142082
18543 62003 74687 37991 91624 -6481 -111387 -452007 -112172 107868 262971 -21760 165314
18531 -279914 -93757 -120321 -451725 -42577 -259733 -16567 -305058 -177222 -252667 -284000 -318366
18520 -318366 -230496 -254457 -99462 -310556 303447 64289 170459 149851 -86453 231472 -77803
18508 92007 -16055 99644 -226277 -371589 -342052 36348 -240349 -31807 -28147 -210126 -270633
18497 -270633 140222 -24925 -158399 -57582 -32594 -207227 -303472 17803 -45574 -173046 110113
18485 116741 170967 -337515 -324303 -234404 -145745 -110916 296714 -39192 -24990 98832 -33187
18473 -29092 -282187 -188128 62642 11327 -158276 -79071 -162038 -52142 -19789 181135 -46897
18461 -75615 209212 -60040 -116075 164321 -253485 20610 449404 70860 -18835 -13721 135419
18449 -22293 -58777 24038 3881 -47073 -36776 148393 88182 143010 19322 -14922 -166722
18438 -166722 -25195 13429 -99710 189369 -317785 -97073 268800 172941 -351904 -92476 154666
18426 217429 -329690 -42671 -122889 -89316 -35657 -58587 -380203 -305484 -111883 -295848 576778
18414 -91095 -59012 11237 232663 -153885 134320 -161781 -185634 40905 199678 25055 142919
18403 142919 114686 -16495 -19301 -145923 390582 144351 119794 -86069 -205639 67924 14188
18391 -70766 82885 -73253 286690 139347 122118 113571 -2588 16605 -97153 -160299 -52053 65474
18378 43133 -91973 140113 -129305 -119221 30731 -246348 3878 -299446 83369 -14446 -32102
18367 -32102 -59138 -186912 -20147 -42126 207634 -378118 -134012 53219 -100034 -323140
18357 -323140 -261167 -157277 -36730 -119005 148255 -372632 137262 -127206 -110545 327929
18346 -4102 -34410 214575 92500 49602 -192096 -5503 -130369 -57038 24978 -53903 -145192
18335 -145192 -51587 -176753 -129091 -54765 -102789 58853 218878 -130024 -69255 -104486 244852
18323 -73189 -301942 -283816 68628 201597 -199290 -227709 -3077 -359670 100588 -281922 -187688
18312 -187688 229899 -216404 -124795 -112181 -47287 -50934 127513 -85563 -223734 86438 342528
18301 342528 194515 -187252 89176 -9437 -65156 -87885 179639 -96542 183469 38380 -119129
18289 -178654 57282 -38915 80696 253038 280665 50240 -67487 109090 39234 40129 -27552
18277 12498 -26791 329523 -207316 41339 99899 -107328 -225066 57343 -163685 56995 -104309
18265 -111506 62650 102157 89094 367146 171580 -122543 -62089 -275185 -103841 112654
18254 -10557 323877 -61551 229527 -35534 -128794 -5304 195045 -78754 -24783 -290008 -176018
18243 -176018 88267 -440543 -292955 -412145 -151491 -53625 27888 140974 -206432 252 28540
18232 28540 60362 97887 -252619 -136788 162702 -155781 57471 155420 -221584 -423662
18222 -423662 8014 219814 -158950 -150585 -128930 -278936 137981 36283 -112757 95723 162878
18211 162878 153493 265460 -176829 -151343 263296 -110250 204536 -18492 -173091 -213178
18201 -213178 9013 -30765 333573 -28512 122042 -119123 -258421 -247244 20625 -160007 191659
18189 3083 48952 -36126 159478 49600 16728 -68448 172287 -304010 -110618 -114455 139311
18177 -100513 80541 -339915 -57056 346204 -69835 203068 103739 -69402 195464 -6249 47987
18165 -39867 -1322 -32408 -20453 -40453 -421560 -415208 -71092 -248012 -77515 203670 -206069
18153 -164513 47598 -152044 -296876 58897 -298320 177388 32608 -275508 17306 46855
18143 46855 -16835 -37482 -49724 -325111 -48197 68273 -144499 -80328 -45437 273805 47838
18131 -95288 31113 67527 -123471 28983 80454 -39259 -62550 193669 121667 100454 94958
18120 94958 -20339 54861 -17269 -59714 -122841 55960 -36994 -122112 -105456 -204094 -29933 10701
18107 -250772 -149439 -12829 -291670 -104147 127355 39427 -147463 -205488 119056 147191
18097 147191 58096 336312 -93850 -453624 -116009 -208240 39969 73406 -142419 76673 -158136
18085 -49011 -18350 179128 76767 -190300 -38995 127845 37119 -340656 15883 -206538 -106831
18074 -106831 68589 401315 37556 -46476 -58321 137744 79469 -219225 64455 -215933 -34158
18062 101482 -224881 -8355 137385 50592 56626 268540 1154 66570 -137704 -141850 319085
18050 -102756 -28085 55924 91595 -21220 -91487 -41037 64599 -56585 341463 -286186 3753
18038 59580 -287610 -171743 -43875 21276 -373949 -28431 -97897 -88326 184225 91925 -186055
18026 30018 221305 -115937 -20002 38319 276809 326672 86346 -131302 -46924 -28028 -81162
18015 -81162 -327994 129737 196803 343359 56546 59063 172453 260177 -276113 -238555 -194641
18004 -194641 -591951 -142275 74124 81823 -146814 -233019 -207021 -38807 25741 -221928 -73465
17992 3475 -84347 -99197 52064 37289 -37338 120328 -309114 283593 -265546 -181149 -174046
17981 -174046 198369 374521 -128758 314056 157958 111215 47061 -113976 211133 8267
17970 -107642 142364 -2453 -11677 13289 -34941 29236 -94549 -63273 -101838 66940 -35191 207199
17957 -20586 106810 242435 -56416 27286 148432 -116805 18111 65536 -281933 124443
17946 60406 -301749 -153580 192236 -118702 176165 -42035 94944 -27966 -132493 -8624 -101877
17935 -101877 -203210 52684 55389 27247 114718 144315 203218 -152828 -163533 146400 -18467
17923 125732 82584 -30251 154931 -61531 159818 -16323 103778 482061 -15841 95179 24109
17911 -118210 -79870 222728 45663 -135806 103338 164955 164507 -56503 -42893 72550 -125843
17899 132240 -3378 91963 -69427 200374 -15086 158188 82928 196170 123055 13808 54631
17888 54631 191001 -134396 56616 -199748 -65774 -178549 -97089 -48350 28139 766 -108190
17876 81270 -227773 167066 -137687 111407 -87301 -40682 -37057 52326 -43033 22985 79483
17865 79483 -204535 -104147 -136168 91655 175496 -44852 -120506 107782 5216 110629 196032
17854 196032 -153417 -82441 -52311 112016 -83046 -45599 -103852 253330 150838 11755 72879
17843 72879 -7762 39487 50511 21456 135922 184816 89996 236274 45085 -175153 67591
17831 189364 -88189 -321099 -209782 -138885 32375 -112478 299847 411689 161573 -224438
17820 256861 -320721 140981 -325049 255304 211995 134245 -127783 40449 -163926 190902
17809 -23111 -26907 372002 230941 2546 -112520 64880 -261444 -14777 -34128 -187748 57808
17797 -381245 170527 88214 2089 536858 -105356 -23576 -98632 239395 231860 -52206 -21105
17785 309379 11229 -321152 -12931 11997 -118960 227590 -84790 -84731 61215 71993 -203861
17773 195518 18248 15404 -84463 -8707 81437 -271153 -73782 -124408 105127 -40664 77470
17761 100850 191767 122816 -40267 226140 242802 -7073 171873 -178258 -30842 265721 -39295
17749 66845 -164727 189735 77140 105958 -194941 289406 149584 210312 -67806 -30529 -92660
17738 -92660 12528 239945 40862 136141 164736 -47622 -23107 130726 48126 144488 72200
17726 477206 224190 18641 -75144 117850 -48053 179559 65738 136912 357870 95043 234394
17715 234394 -7041 244223 131762 32874 134472 258971 29841 -88001 -8940 533241 -94700
17703 -50114 28181 -83856 -68554 177438 28997 -126372 145781 198602 -75193 79795 225768
17692 225768 257978 216008 76510 34012 360973 63534 198788 74696 -99640 -84377 228087
17680 131669 283081 -123258 -274423 74024 134465 -128051 -55086 -84139 166713 118236
17670 118236 368888 240686 -51129 -47591 -266838 104590 245808 219237 267488 136803
17660 136803 152543 191315 -50406 110278 320824 127156 -23762 223480 -179125 -196661
17650 -196661 -17020 -238782 72630 -16110 -129178 132472 134177 -108068 -37391 182062 142007
17639 142007 -54499 -162255 116490 58039 247567 -63744 -15983 26163 89125 130617 89414
17628 89414 122234 -105435 -128559 96947 73826 129155 -22284 239099 234504 392731 92298
17616 41342 149983 21521 42855 344520 96251 -17315 56498 744 292996 301237 278876 -133946
17603 85088 282398 72441 -44098 111740 193006 -51739 106300 100279 12952 -172771 236651
17591 235926 -46659 -83559 -75253 28295 48845 -161063 -29780 221966 125766 500737 104962
17579 205292 155610 315913 239154 126868 170056 157896 99568 172231 -24367 290048 62442
17567 206264 392833 192539 470451 220008 -161817 -191268 205379 -198326 -82416 81934
17556 133728 310253 282657 39998 649149 174452 5068 465158 252805 236872 119922
17546 119922 293419 281685 201075 248371 -3552 84015 181116 160833 54341 -311838 48358
17534 189239 256662 388560 228737 112456 -49482 186024 157124 312767 24270 270510
17524 270510 322877 185544 341649 355540 57151 449258 164029 104385 312399 213537
17514 213537 512301 250211 641568 731134 1008402 1207677 1100158 740234 871619 707955
17504 707955 540639 599435 266850 580348 304988 667461 570741 697645 593454 732936
17494 732936 850636 791125 1099230 945787 317083 596082 184034 444887 588733 694550
17484 694550 598927 408585 402723 134844 176081 91747 438129 678289 282822 225527 310142
17473 310142 323970 431383 301578 202856 250371 373873 282489 399357 160888 130081
17463 130081 260538 472252 295694 438398 -8006 371650 496574 181298 221846 357557
17453 357557 197428 502393 427352 291007 93199 25959 -44635 353714 195135 390754
17443 390754 184751 92045 343771 211888 101465 280051 398299 351483 299865 297579
17433 297579 253379 301523 410863 507800 351667 485515 287924 632300 331567 38309
17422 201857 42270 380716 240097 520963 370284 161210 534010 303334 208312 340906
17412 340906 136952 26374 255244 501071 431808 490418 282818 373044 270000 338249
17402 338249 207926 594024 564807 35630 326150 -8619 444871 418640 79981 237062 367102
17391 367102 277995 362281 334944 273166 2854 32331 251272 59646 263505 151526 218837
17380 218837 593173 521734 343014 262792 253687 392687 540553 29748 416973 115906
17369 253117 100229 128346 292999 117229 114188 436500 110525 232714 157666 28516
17358 228689 89920 306886 265822 111680 146689 -184321 469168 -55693 306061 288317
17348 288317 482989 872911 455191 372399 124151 526551 135516 142063 207719 -193094
17337 45362 100018 -27039 293944 153754 181311 213876 367346 536051 445700 253401 309729
17326 309729 296012 356601 247534 162108 433519 636022 517362 327085 504026 201544
17315 16365 303986 358107 291107 454452 393838 374994 424043 157366 218017 430793 322300
17304 322300 157391 546089 171681 325551 354355 551946 286254 282809 311348 189000
17294 189000 483135 107298 364198 406905 402678 444190 317204 320282 183111 223181 394061
17283 394061 275199 105122 314179 431489 390678 955913 399694 639210 360385 352615
17273 352615 188438 157388 308803 -8824 354883 304594 135885 379446 112498 472167
17263 472167 520322 667996 437070 433038 138905 352098 270946 381401 172598 395404
17253 395404 305242 193932 267664 358350 545607 99558 415939 128817 401087 400401 88277
17241 490622 299796 284643 368723 442370 76574 479528 407363 649944 95266 452010 608322
17230 608322 324255 388971 201855 289300 -21665 518916 664231 562490 552750 284570
17220 284570 215657 340328 199946 551363 530684 255660 445372 353627 429027 444248
17210 444248 342330 413312 436518 173836 134202 126209 332620 357200 239896 390920 268734
17199 268734 586356 431415 715988 588706 394935 406771 624480 648592 320185 545077
17189 545077 281659 554266 464165 374769 1463 514099 499799 277803 269616 440639 606262
17178 606262 169152 622593 394197 398839 370230 147828 333172 375934 505502 508153 389078
17167 389078 684370 432891 413772 337492 398610 508154 539164 434871 455542 593373
17157 593373 417548 426114 604966 546483 775628 365023 480319 479086 413556 447080 572830
17146 572830 682682 571950 689382 576817 276996 307017 220581 362083 479884 641932
17136 641932 433506 222224 578024 701116 501160 561132 428296 553029 529935 385656
17126 385656 525600 259114 577119 678895 732850 318678 366755 324372 585171 581172
17116 581172 628613 743850 775638 669470 332580 335462 573276 459699 734851 571435
17106 571435 654607 523312 576042 432285 388064 516074 868481 753033 562121 699606
17096 699606 519331 674230 812499 730370 613831 827444 934591 317210 807296 663643
17086 663643 615492 842630 509634 788624 679919 655927 587504 999648 595378 659647
17076 659647 369065 658512 852765 837353 797629 821318 933667 598237 839436 493387
17066 493387 635712 735911 492648 644933 721950 703292 846324 900621 894736 757006
17056 757006 833932 1091741 849641 756311 834064 934752 704191 800218 739056 750715 706383
17045 706383 684131 691235 1128768 848859 958061 768435 832791 1207714 893024 682124
17035 682124 868451 971672 792594 1020330 1416340 796444 667321 803956 1321640 921307
17025 921307 924326 968951 989239 783692 1141335 1476841 1049413 753737 1043660 709846
17015 709846 1333697 911480 846516 1121836 1312587 1041118 1013098 883229 870286 1128653
17005 1128653 1123624 1192195 1017820 777730 1132940 1069989 1148559 1249139 1034021 932284
16995 932284 1431586 1206600 785528 979450 1194443 1581962 1179599 1048460 1441211 1409888
16985 1409888 948026 1463098 1142097 1901808 1195965 1118480 1314539 1545361 1196070 1639576
16975 1639576 1595921 1387344 1470007 1172041 1309846 1571626 1170380 1507150 1520668 1246719
16965 1246719 1343119 1446441 1366908 1523017 1397131 1428822 1656660 1562384 1462284 1392982
16955 1392982 1745865 1485922 1774897 1299511 1921301 1744596 1615751 1706914 1694237 1709427
16945 1709427 1770709 1828617 1710651 1488591 2011616 1508522 1713267 2100094 1779194 1608513
16935 1608513 1688640 1911811 1962921 1851335 1791897 2009627 2017900 2212880 1940746 1883582
16925 1883582 1994390 1962767 2024718 2236168 2424631 2299088 2221598 2042509 2245180 2445431
16915 2445431 2162643 2149585 2338554 2179279 2188206 2517242 2608666 2505753 2726343 2292483
16905 2292483 2710939 2485338 2648617 2425444 2370870 2486595 2538761 2507184 2524400 2969154
16895 2969154 2617085 3061118 2758305 2721145 2795843 2722458 2794073 2686831 2958717 2652538
16885 2652538 2836728 3376094 3109933 2959867 2660558 3090420 3221238 3364860 3293985 3566736
16875 3566736 3108529 3429148 3380845 3570974 3216578 3766391 3381363 3669510 3581760 3758771
16865 3758771 3882262 3725348 4005713 4063663 3817117 4181736 3984013 3984757 4022100 4267661
16855 4267661 4281826 4204588 4407597 4536802 4746644 4767945 4309196 4643017 4927316 5010055
16845 5010055 4957407 5087211 4955216 4859773 5344040 5439333 5273417 5638001 5881947 5487437
16835 5487437 5797651 5710449 5348410 5801759 6050746 6291728 6351367 6334440 6226215 6914885
16825 6914885 6661775 6965728 6863717 6722227 7330684 7108347 7470166 7453610 7877273 8072328
16815 8072328 7734939 7845836 8259511 7866531 8295621 8404016 8644961 8864083 9266152
16806 9266152 8985432 9061778 9791776 9726763 9934103 10305479 10386839 10630939 10772355 10986902
16796 10986902 11352212 11238560 11795515 11680500 12169189 12420724 12745411 12991410 13220456
16787 13220456 13574374 13689137 14459371 14480426 15073394 15274894 15268411 16095575 16583244 16604763
16777 16604763 17248137 17778988 17764403 18424542 19109864 19474353 20314238 20614059 21147141
16768 21147141 21829630 22581473 22840193 23564686 24139666 25463061 25651969 26652073 27748659
16759 27748659 28300556 29267991 30237190 31139181 31814359 33024700 34081640 35300128 36681495
16750 36681495 37890520 39095183 40078429 41606447 43447604 44735264 46496627 48170910
16742 48170910 49598708 51619062 53383427 55327833 57562254 59519724 62040916 63884844
16734 63884844 66403018 69039364 71670065 74002458 76791690 79721050 82650385 85344098
16726 85344098 88211960 91366691 94415474 97000099 100245048 102942092 105617236 108716198
16718 108716198 111150200 113747020 116091871 118222372 120463783 122181705 123710712 125026531
16710 125026531 126019170 126532793 126704764 126823577 126273626 125899014 124915901 123604403 121960713
16701 121960713 120412794 118280680 115987917 113651216 111149214 108114532 105619377 102629427
16693 102629427 99733490 96513182 93591736 90639412 87794501 84873707 82006846 79233436
16685 79233436 76430800 73610409 71329334 68568111 66254390 63709911 61316344 59049052
16677 59049052 56861528 54759123 52717812 50682542 49181951 47525761 45625969 44088344
16669 44088344 42572922 41034696 39826731 38084670 36935731 35853821 34601208 33604345
16661 33604345 32066021 31218009 30400127 29635352 28582049 27645355 26784550 26034476 25325812
16652 25325812 24305493 23435734 23268025 22509038 21886791 21404249 20575559 20081933 19115909
16643 19115909 18974105 18448722 18106068 17320144 17087911 16703106 16149465 15992903 15442063
16634 15442063 14915865 14794797 14119620 14201339 13775573 13632143 13122083 12681451 12482242
16625 12482242 11932261 12022544 11936417 11691697 11036821 11032048 10880138 10137011 9889986 10236255
16615 10236255 9587262 9834608 10004298 9248593 9195316 9084669 8563772 8563351 8370425 8189716
16605 8189716 8227481 7943649 8024341 7514652 7658814 7536282 7320887 7363158 7004092 6759494
16595 6759494 6780561 6832505 6935972 6556556 6342349 6457131 6451753 5890473 5942072 5840763
16585 5840763 5886063 5486183 5545238 5819719 5602951 5243804 5328231 5306114 5228681 5438379
16575 5438379 5017325 4846538 4829224 4789948 4483961 4642504 4661704 4260208 4474354 4328121
16565 4328121 4213477 4346525 4141402 4118754 3930251 4204736 3944795 3954655 3773400 3871370
16555 3871370 3690656 3867293 3832808 3280885 3351167 3224198 3510452 3461113 3485538 3628052
16545 3628052 3462019 3271412 3008672 3317717 3241005 3132401 3169366 3247720 2920774 3060990
16535 3060990 2924853 2842745 2780304 3180539 2911966 2615003 2545537 2693616 2889606 2348663
16525 2348663 2620046 2570096 2501428 2491283 2446727 2452132 2512372 2043776 2011015 2657313 2602720
16514 2602720 2140086 2498742 2207263 2562961 2276593 2183507 2390169 2781739 2196683 2275417
16504 2275417 1866652 2177872 2319132 2072026 2162406 1901461 2243525 2005447 1693559 1833029
16494 1833029 1912259 1785466 2010865 1912695 1789946 1676570 2074830 1912134 1827900 1797032
16484 1797032 1982045 2005101 1635489 1769495 1760840 1827890 1484385 1941437 1765296 1876140
16474 1876140 1550856 1486179 1396398 1663343 1417613 1443058 1485702 1852832 1748495 1410891
16464 1410891 1493865 1412618 1382666 1301010 1499536 1362620 1647466 1445176 1196357 1150545
16454 1150545 1531848 1551857 1363184 1592790 1380974 1198004 1417965 1125532 1164742 1544366
16444 1544366 1039444 1507200 1455683 1357043 1247627 1038000 1032434 1397220 1189004 1354868
16434 1354868 1403988 948818 1333821 1297679 1408240 1039256 1227663 1094328 1131577 1276010
16424 1276010 1256305 1310277 1092583 949840 1247343 1060472 1085612 914531 1162236 1264187
16414 1264187 1261197 1151127 732073 1184521 1019759 675553 910786 1045405 1005977 1029927
16404 1029927 942016 788152 904812 795709 756521 720431 1018973 909119 1030982 1191797
16394 1191797 893732 693911 1154933 1072049 1011817 1295660 1094726 954460 755900 1100384
16384 1100384 1081357 792039 698882 803898 807984 682416 665686 378301 471771 597982
16374 597982 1152470 1025103 628033 884396 1049838 718630 630562 783339 360032 598407
16364 598407 633399 740638 714381 464347 400608 616833 320244 929431 780081 423856
16354 423856 706480 405358 676875 514981 848642 891191 901002 801227 509609 751148
16344 751148 719392 785609 368214 679077 509424 852113 891532 504220 651145 499026
16334 499026 257025 410647 448136 428546 634925 448840 657212 401426 814240 362578
16323 303321 734286 635968 531756 458062 732275 612081 275567 682096 488835 412344
16313 412344 768007 320981 720106 503092 444667 540626 843973 699903 523134 304657
16303 304657 325137 464684 500769 825613 94071 423687 622344 476057 587733 405250
16293 405250 582740 544493 397589 321822 374827 11358 543863 752274 415898 654226
16283 654226 367623 508865 424509 573476 415249 505554 486011 472351 447336 766986
16273 766986 634483 583627 403473 242484 456807 436998 381275 626477 359544 258782
16263 258782 527266 414710 622653 398081 182981 387179 362925 311718 580018 328268
16253 328268 408960 252729 292682 518540 318607 508495 461138 205769 738841 106456
16242 610923 392735 158428 699649 295911 535800 353848 385427 244742 239145 47462
16231 609129 243609 640915 729694 206398 501962 280270 607953 79925 -108850 775391
16220 389603 235986 288563 318651 81487 301403 566711 513714 250504 164326 197770 225712
16209 225712 126659 407838 269789 174469 424762 353133 398277 531182 59982 106925 -72237
16197 175139 26888 374648 141661 137637 444987 323536 247625 155845 308479 1511 495627
16186 495627 445964 292108 336808 247463 229786 206543 330132 -183411 359718 361699 215093
16175 215093 150790 80904 298081 469005 115553 261887 361783 421015 -132681 -18695
16164 263240 345019 408427 293601 360323 161615 54378 112647 134698 -37884 366313 11549
16152 96277 294850 107553 372960 -31000 276541 178213 -24503 -114325 -205489 260348 35714
16140 385219 -69703 383763 333548 225057 -80443 222590 250434 139595 485854 -28173
16129 20956 273519 -234038 42411 319665 132178 346224 -78250 295710 39011 -43028
16118 -318606 -207898 64288 -2809 270126 408727 -35761 -228822 520239 300977 212781
16108 212781 251938 -112993 334410 -122928 70669 139064 -41198 -92538 247832 19660 64314
16097 64314 199799 473743 250556 122219 173568 79745 202497 -28107 151940 -145647
16086 -11260 -27451 -259693 270424 68620 -21149 222835 89281 48571 113088 172630 -110778
16074 248017 452143 45152 30625 195802 93288 19867 78380 173700 108334 194800 44997
16062 -57279 65829 62006 178767 224779 -17461 -108926 -56932 220083 -212712 166454 -350196
16050 64635 62468 -192133 217727 -51151 80935 248766 -170985 284213 64685 130321 169528
16039 169528 114802 61417 59277 139349 317413 338547 254323 -21372 225375 391902 -218518
16027 -76593 -196772 -11352 54721 -345970 57213 186645 146716 -210756 87147 73672 195461
16016 195461 6752 104851 194566 130466 108626 -19009 206418 -22003 180477 -143730 108415
16004 83092 290244 178489 -237776 -323990 145307 124585 193956 -39032 -317625 -48321 -245624
15993 -245624 43911 -45975 26638 99577 41395 -12999 62657 445139 -132650 -725 383675
15981 384352 104845 -45419 10378 -111250 461412 285204 346460 293782 582676 436220
15971 436220 980792 973784 1019268 553665 912888 163031 285152 401182 -75350 275977
15960 16174 -93950 1564 -81038 -265815 -110047 -60135 -26631 -181547 -168401 146631 -48724
15948 146118 175852 -261875 31509 -95647 -228329 310068 -133369 -31073 132176 -347879
15937 -127925 29580 368775 147643 11528 56532 -99031 101080 169834 299969 7917 -233700
15925 -7963 183451 42585 -135235 101595 192303 -260633 -55181 -271278 194656 -137645
15914 179300 -30096 -134933 158564 -7021 146606 -253641 -130253 100778 71596 -41085
15903 74897 1222 -25052 -132776 61286 -123118 63543 -18348 -171419 231767 -326326 -200486
15892 -200486 29458 -209053 100619 -159691 27400 255630 -279367 -210944 285583 -176246
15881 219356 128618 87870 12554 68113 -71434 1471 -95147 224639 66624 -264986 -110146
15869 23028 -152876 52919 -128984 16320 -85257 48716 -146309 -219552 -27942 -127877 -5387
15857 29476 146971 302820 266483 -11055 -231562 -85816 99217 -140408 -105147 101754 23438
15845 409066 -308546 41562 -170842 -176851 4176 32076 -157715 109447 -347469 200830 353020
15834 353020 -56709 225882 -59087 -42134 -301167 -359382 -74630 88485 -76899 -103095 -20734
15822 -51411 287678 193548 -62063 96336 -171813 22483 -52643 -16967 -6599 79496 -212607
15810 -83372 -182830 -149497 109177 -176539 -95504 203671 -56527 -236402 174540 415486
15800 415486 -148980 4142 193098 -162 106801 44591 -241767 -358862 7304 120128 -55787
15788 91706 -15165 194721 75734 361532 6599 -116368 -278318 -76409 -44688 -66539 57368
15776 236029 44968 -112575 58117 196462 8791 -79154 22311 287990 72999 -402428 -104270
15764 224997 104184 372217 -129499 -185526 -255052 -31280 249804 20703 132331 -39185
15753 113751 -161888 -184296 -49126 -322734 36529 19774 12536 58273 43628 107626 182374
15742 182374 311520 150977 250608 278474 287624 -29765 209141 88234 -122441 -183510 70769
15730 111586 51370 181053 -6218 40724 -204375 184333 -95708 -176988 -55917 -420907 -65018
15718 163698 141451 82858 -19461 49766 23769 -84764 -174303 -948 26454 68494 -132950 153165
15705 -263950 -28831 -67958 46319 22991 -118591 227822 -68873 -67600 -175705 -109739 -92176
15694 -92176 91464 -37060 66348 249470 -84422 -279696 -21528 -6409 -268269 -58748 261895
15682 -314917 -38277 294025 37713 -232632 122834 -269668 386202 134918 36277 -150112
15671 57545 -95636 75821 -146653 226693 -116613 -270937 -28779 -46265 -66119 34642 120296
15660 120296 -166160 -46952 -3127 -254234 192552 -89909 140483 -231799 -173036 15703 -131573
15648 -248318 138443 -21815 -314323 -214884 109097 -137697 -67316 83074 -101732 47744
15637 -369612 140178 43924 -249572 -29680 -405795 362610 -104977 35274 26779 -246170
15626 75319 -225451 30161 1015 218673 -42006 60112 24065 -311406 152525 -218249 -52544
15614 4376 -90455 -118112 -329870 219296 286614 97292 323172 87124 -256606 -61533 -121279
15603 -121279 -52180 33859 14550 163977 132613 -64428 33969 -223426 -122890 33163 226647
15592 226647 135499 -103379 -79814 66613 63511 186772 -50501 34339 104415 128841 -89880
15580 90139 186807 121531 -189247 19883 -199088 188936 149399 -153732 -377012 -86790 -86194
15569 -86194 -126443 304137 -192573 101362 297646 96721 -168739 8773 -52576 -79419 105256
15557 131616 -273960 72653 -202582 -244842 -110116 -161052 -66688 26394 -67403 204644 173007
15546 173007 -286064 356087 -97044 39680 -492134 -278086 -118714 49467 54782 56996 397850
15535 397850 245734 -211820 -9969 128041 -100306 59558 -331884 160825 -274071 -132804
15524 286128 -202988 -205865 48483 -6675 64203 122244 12150 18108 -6183 -146429 28803 -211065
15511 274435 77867 -57225 50803 -134732 155347 -81406 22183 -104494 248144 -45340 -3359
15499 -63847 -80305 235094 -30212 -171354 126168 -123306 -28729 345537 206621 -835 13933
15487 303917 -129367 163818 395438 77268 -34192 -70518 60266 -52800 260225 -38979 -26626
15476 -26626 470954 -55567 -82568 232037 -189195 125071 -277979 175242 -127593 43849
15465 -56841 54282 186882 171996 18722 338205 315678 443704 472583 498765 413157 355566
15454 355566 307902 -31199 -237489 504302 5573 58285 160120 -115811 26531 2805 -29724
15442 50664 -171159 110562 556091 121031 -211472 145759 4300 -113148 6449 -155815
15431 394839 189841 167560 406723 225579 414634 660557 799403 888674 503379 399771
15421 399771 385774 182392 94548 16859 -18798 81995 228820 -136625 -255266 -68276 174108
15409 -130113 169053 88853 -97361 -8154 -77014 -99339 144761 -130763 248958 47767 167757
15398 167757 -126769 267573 51132 -198442 -66919 85657 73731 366757 383642 -78720 212027
15386 15584 -196702 222476 47590 473863 226291 148169 -69677 177752 62844 -144139
15375 -106415 329031 163364 -153561 387649 169588 -302617 175250 94354 443497 88150
15364 184032 -318211 47545 121504 76366 4492 229783 229600 340419 280900 334944 52038
15352 60975 19464 -359526 298484 133537 6322 -168448 33283 385590 -89406 230735 322559
15341 322559 367151 332266 110796 -101864 297242 213493 -70838 222657 133144 336161
15331 336161 -111598 531218 593980 277793 383935 250434 265235 69526 71884 184619
15321 184619 -75403 439608 -148916 34143 93979 132060 315299 117654 168232 170752 188796
15310 188796 361950 111038 201048 64959 -20695 58312 81403 233463 -60047 158943 50543
15298 211496 50280 189672 47227 85124 -42506 175825 97494 189745 273460 288975 19588
15286 -202 118102 -39279 -183890 71133 -33787 95300 45897 -9863 83369 234343 364974
15275 364974 147466 -21511 -205195 -19416 256687 4659 179693 -54605 -125597 33229 94995
15264 94995 -148108 -85963 146065 223748 106953 205756 187866 206982 332171 -49523 -68696
15253 -68696 -108607 218870 329647 -147355 40830 -280954 -66364 104468 -113744 -87236
15243 -87236 314777 -392784 -83879 383887 85118 7011 79715 68998 -52472 190987 -275999
15231 320661 230682 376625 305955 725173 1396192 1124174 1367013 1098664 562488 304688
15221 304688 299115 -56407 -32159 71238 -39632 32561 27097 130636 48393 79945 -1064 -176206
15209 -176206 189938 226609 112764 140956 -84582 221938 -222514 327174 239899 170911
15199 170911 -37495 -109859 93252 -16909 27703 -18732 108080 270812 -109151 -378278 237978
15187 -142411 260085 234385 23870 341017 276104 66900 -278366 10673 113174 142877 154131
15176 154131 -39143 -16747 74780 32141 184757 55562 92030 49910 251595 54059 41979
15165 41979 48083 -28453 223542 271891 220120 91931 284007 111516 204171 192099 -65392
15153 265857 239986 343745 351972 -52724 -36244 197367 71692 166577 -84031 181464 93265
15142 93265 124030 167974 -79244 224658 208646 135039 -444963 133687 73754 88856 92284
15131 92284 -5250 126363 20626 201383 -20100 12076 130921 87780 472069 118435 -238299
15119 594508 70180 276903 28746 -40436 251468 252754 228061 296124 161620 228806 337159
15108 337159 55577 363849 55215 148049 202743 495104 393154 224837 200264 343492
15098 343492 360904 342655 319254 -266455 47300 270169 278241 187708 184712 32867 294086
15087 294086 160377 94717 321395 38617 445312 300818 102266 289015 188822 122499
15077 122499 224560 62319 212976 -49977 310485 86146 149344 204674 64569 -67454 129048
15065 270878 117362 357834 -44805 654964 259502 50111 88157 -94015 -206062 267656
15054 1683 25590 235897 -36698 294008 157411 397770 56221 73147 56715 -117436 432285
15042 102362 268311 224450 336397 110598 297197 292582 335473 83909 431900 330282
15032 330282 441939 417593 311394 397262 335693 251553 529185 511153 712743 130037
15021 424300 126735 285902 356859 602710 643267 390211 990219 479907 709284 538657
15011 538657 801614 530953 300020 268473 445492 731554 671351 515066 289868 264724
15001 264724 176807 534012 294478 563933 487185 598163 478334 389281 226263 403920
14991 403920 298047 273360 157608 234585 107043 260593 524828 391864 128560 453196
14981 453196 579204 241309 295348 323705 399319 199495 633285 475691 679823 448722
14971 448722 528718 601875 735923 714678 545246 970304 463649 758022 413271 663889
14961 663889 456387 337809 403466 646832 362414 725826 722450 473555 544626 689917
14951 689917 591054 520890 254300 775331 390417 215705 301561 381481 697846 281318
14940 114280 328254 83614 421331 362030 638354 486298 110767 303330 443441 350196
14930 350196 408240 213437 181731 409274 643811 594653 726437 673908 524804 416944
14920 416944 461213 542742 555700 616427 883071 1021138 881220 1107202 1268745 1376200
14910 1376200 1701735 1654699 1613979 1485407 1833159 1403797 1330987 1255848 1903274 2050793
14900 2050793 2043207 1877078 1424349 1233791 1162073 1054676 986813 747177 838894 433580
14890 433580 571800 412086 591010 489607 599556 482161 443513 495486 433794 302199
14880 302199 181956 282459 702347 238550 589670 393392 481378 674245 721984 649388
14870 649388 633614 624359 1140954 803930 630255 615435 440662 886368 747402 927726
14860 927726 795863 406458 644525 402134 510066 302721 516359 608849 799616 370847
14849 821321 363348 790257 518089 513205 652283 861529 836828 497752 207122 446545
14839 446545 557013 351922 525559 647356 146205 471944 553359 576764 190970 918937
14829 918937 801492 929966 1061315 985174 1171601 1405378 871114 903135 939277 960288
14819 960288 473224 636898 648382 446233 639745 408989 717162 663935 914088 531844
14809 531844 356253 641548 542855 734916 472762 462390 1146411 707887 378762 533752
14799 533752 697166 1140937 858001 693421 790528 888834 583620 945989 1004106 898029
14789 898029 798734 848722 915606 981297 477327 769388 560130 830638 479147 396142
14779 396142 555610 585086 709913 625229 284287 616393 591133 465364 576711 628483
14769 628483 806044 871247 859275 600595 566677 981140 681505 782300 822241 902673
14759 902673 968398 1102881 997846 633826 730556 797749 546307 885127 657238 762099
14749 762099 454453 542469 630459 307442 514289 913885 886355 825450 541203 604062
14739 604062 597564 777219 495303 801475 591372 413279 696909 563640 585435 604727
14729 604727 643581 839145 573815 915286 793407 735504 676363 835981 929075 737477
14719 737477 803504 758736 688699 989544 1038429 1393245 1402797 1347247 1590671 1738009 1628837
14708 1628837 1360775 1329443 1263815 1207395 1428525 883914 758856 453655 873647 1056039
14698 1056039 860258 612143 932206 1148643 853948 1095958 946828 1200175 919185
14689 919185 1225617 1584304 1222660 1706951 1757038 1735835 1536616 1621703 1320885 1407579
14679 1407579 695770 918847 1140677 1074525 1270889 1436221 763858 1067072 872813 1152817
14669 1152817 776680 800731 846524 1291518 1016577 1168715 803573 1281177 694350 1257493
14659 1257493 981723 1363136 828332 676773 893421 795958 851894 1043148 1283927 1467378
14649 1467378 726748 1032859 1018252 850700 1163844 994254 995416 1132791 1040105 837867
14639 837867 1464409 1304656 1203407 1458038 1372725 1077492 1017288 1105093 1374672 1295316
14629 1295316 1388672 1262301 1393979 1231147 1524507 1264491 1171046 1560883 1057206 1292772
14619 1292772 1472382 1495334 1012391 1375470 935171 1055569 1483843 1458205 1146769 1780351
14609 1780351 1695493 1336472 1369095 1463074 1608198 1390609 1344821 1440491 1502716 1392231
14599 1392231 1369620 1587698 1555069 1313839 1748164 1503832 1637700 1721522 1723925 1876763
14589 1876763 1630291 1413351 1883453 1660042 1667671 1740023 1558927 1961866 1714328 1651627
14579 1651627 1516374 1742023 2066535 1715707 1732784 1763112 1751342 1940837 1943791 1800676
14569 1800676 1720051 1762618 2112756 1934123 1448909 2126585 1987445 1906426 2243328 1982570
14559 1982570 2173871 2029176 1972463 1926613 2436600 2192493 2515362 2282824 2392459 2332191
14549 2332191 2705614 2810333 2750203 2789360 2978332 3232076 3058749 3293702 3380607 3960695
14539 3960695 4171703 4421543 4947021 6009738 6942699 8838491 12322199 19027711 28561798
14530 28561798 37449788 22263335 12324165 7655388 5430404 4771160 4861562 5058560
14522 5058560 3997272 3109882 2655335 2471199 2727217 2391005 2399113 2272709 2254575 2370312
14512 2370312 2431075 2659427 2652604 2465078 2271833 2396373 2323190 2488755 2525097 2488338
14502 2488338 2920300 2806598 2677687 2764542 2570274 2763494 2656303 2959315 2762663 2641869
14492 2641869 2710496 3152549 3020576 2770230 3116672 3496264 3288385 3104215 3176348 3293995
14482 3293995 3011152 3397329 3534951 3137714 3357273 3477027 3313958 3728068 3512046
14473 3512046 3947425 4018076 3416185 3949472 3799672 3644315 3740717 3918467 3849100 4137036
14463 4137036 3988292 3958211 4366204 4046587 4254720 4318236 4302564 4553194 4558811 4747107
14453 4747107 4426742 4540582 4730037 4548319 4688782 5041305 4964083 4941956 4712222 5143288
14443 5143288 5172614 5504832 5265247 5134300 5383586 5162389 5673407 5547394 5686981 5847811
14433 5847811 5687543 5763744 5734999 6188041 5691402 6043595 6403414 6100692 6531110 6404476
14423 6404476 6428827 6481964 6746294 6784437 7016223 7142008 7026053 7110327 7426240 7388341
14413 7388341 7204370 7130865 7333607 7746541 7798133 7858764 8384096 8232285 8689143 8940925
14403 8940925 8910697 8915212 9206366 9026335 9011914 9194370 9282004 9400032 9714586 9612096
14393 9612096 10043751 10298945 10225494 10749922 10797939 10784116 11278764 10955298 11297038 11089079
14383 11089079 11620932 11689249 11945390 11837205 12119626 12506590 12654574 12873837 13275793
14374 13275793 13366337 13570259 13563888 13693020 14470892 14265365 14633289 15239079 15359213 15712767
14364 15712767 16335211 16397998 16765536 16747808 17110132 17293179 17974411 17732639 18637347 18610101
14354 18610101 19326055 19563472 19914312 20398811 21031058 21525233 21866549 22116992 22905625
14345 22905625 23074747 23760128 23996870 24790211 25320235 25853521 26683111 27181257 27693753
14336 27693753 28324345 29324570 29923604 30800618 31385629 32253539 33182651 33856586 34909926
14327 34909926 36079317 36708817 37680254 39053738 39987168 41058700 42246270 43226314 45095396
14318 45095396 46367386 48005799 49379544 50589097 52401369 53881094 55920688 58114885
14310 58114885 59806933 62048370 64191337 66375989 69068173 71516699 74257246 77060112
14302 77060112 79729174 82790604 85668567 89153691 92783498 96888269 100790056 105001149
14294 105001149 109560136 114164600 119341061 124794272 130657560 137067096 143033961 149894749
14286 149894749 157266544 164878189 172901842 181747881 190763867 200499243 210817112 221347672
14278 221347672 232726549 244724117 257022063 270311586 284022436 298223955 312950448
14271 312950448 327365168 342239916 356911135 370956724 385023812 398758722 411592796
14264 411592796 423244944 433432906 442961101 451017852 458121822 464368270 469200475 470048735
14256 470048735 468568552 468104412 467164586 458746269 450887285 442416670 429987946 418764320
14248 418764320 404587291 392143074 379200402 364959391 351624411 338037040 323846834
14241 323846834 309827802 295935224 282523912 269979544 257624186 246062745 234713436
14234 234713436 224128179 213834680 202979359 192890953 182889757 174219110 165523753
14227 165523753 157285544 150050540 142842606 136097550 130002645 124518322 119103811 114077540
14219 114077540 109059545 104309634 99966705 96454536 92779432 89076944 85369692 82195786
14211 82195786 79263541 76133235 73334002 70440775 68038718 66102218 63695810 61610542
14203 61610542 59455708 57469339 56033490 53737103 52302695 50740259 49519835 47671852
14195 47671852 46601269 45064766 43801782 42573994 41863376 40581317 38942263 38074690
14187 38074690 37252230 36154356 35891689 34252895 33292799 32581990 31827425 30725886 30390307
14178 30390307 29509792 28785765 28313287 27444927 26688968 26143112 25413061 24928425 24560510
14169 24560510 24289988 23300164 22819311 22115158 22143387 21397635 20849508 20433394 20301794
14160 20301794 19639051 19475930 18747416 18517357 18425330 17879054 17409156 17431333 16599536 16672442
14150 16672442 16116699 16158289 15677001 15630397 14860182 14911979 14727222 14327978 14250430 13982292
14140 13982292 13441834 13569358 13526438 13099660 12969511 12358424 12254048 12185626 12211682 11611730
14130 11611730 11474579 11351736 11407687 11127578 10803872 10800418 10728421 10693463 10075229 9858418
14120 9858418 10207354 9853124 9949551 9490565 9609201 9179655 9148894 9195697 8931536 8617434
14110 8617434 8469574 8843065 8541665 8512547 8301233 8179058 7701777 7889305 8114765 7783957
14100 7783957 7673410 7583367 7319947 7654712 7388518 7286312 7473417 6878772 6622052 7058713
14090 7058713 6843565 6896364 7043770 6345420 6258234 6444420 6530344 5961567 6028107 5972118
14080 5972118 6004157 6171817 5823462 5810190 5399080 5690756 5785003 5878056 5391508 5326550
14070 5326550 5234623 5516117 5424339 5130022 5165052 5014793 4978271 4992907 5156693 4466354
14060 4466354 4833959 4799145 4676935 4753218 4730224 4428775 4582737 4609464 4232945 4203350
14050 4203350 4106858 4225440 4294758 4268276 4154702 4405698 4327135 4227697 4092948 4024174
14040 4024174 4340555 4150966 4030051 4048489 3812124 3800751 4020419 3447843 3778981 3770879
14030 3770879 3656026 3630444 3578804 3159725 3512077 3130577 3370445 3362277 3360195 3357827 3195170
14019 3195170 3176595 3257532 3130320 3071423 3186176 3277617 3194857 3041857 3055933 3262242
14009 3262242 3109060 3344341 2745809 2893792 2923670 2663072 2637022 2636751 2816368 2598836
13999 2598836 2545236 2369710 2512430 2749943 2342980 2493570 2113900 2442767 2632684 2387317
13989 2387317 2277047 2428608 2331594 2475497 2423959 2361173 2598498 2338054 2724905 2514579
13979 2514579 2859294 2444023 3203737 3428705 4064066 4860277 7437904 13313838 22916538
13970 22916538 36342695 26947385 16892898 11429322 7999039 6303964 5475664 5041214
13962 5041214 4332661 3702931 3823106 3427494 2999169 3351648 2826504 2765360 3131611 3046985
13952 3046985 2453170 2664107 2373617 2225473 2417696 2227765 2141171 2491755 2359153 2231591
13942 2231591 2037874 1918126 2462917 2432727 1935109 2133329 1915243 1927409 1889405 2086283
13932 2086283 1595991 1869955 2143091 2028471 1896291 1733801 1940215 2052051 2054661 2333317
13922 2333317 2037164 1678879 1901271 1512114 1668411 1850506 1818394 1611409 1880648 1812033
13912 1812033 2001707 1509152 1418839 1784411 1838580 1503573 1648168 1511415 1560276 1613831
13902 1613831 1515903 1541817 1638130 1569848 1579267 1497463 1946463 1398352 1180974 1484398 1260107
13891 1260107 1580757 1495846 1331024 1387006 1281399 1483617 1521898 1217920 1855105 1257355
13881 1257355 1282445 1753190 1588824 1481795 1265540 1057627 1294298 1621503 1320727 1006656
13871 1006656 1329785 1382370 1303919 1544318 1164440 1066931 1157117 1118888 1213264 1103368
13861 1103368 1297734 1336577 1247213 1229788 1383552 1451780 1444105 1055562 1297896 1385007 1299775
13850 1299775 1459483 1399713 1037919 1337616 1172426 1488293 1379868 1241549 1174529 813933
13840 813933 1303469 973650 1146390 920956 966819 1204177 983796 707111 1013922 1026200
13830 1026200 1361211 1064223 1004035 1145152 922363 995969 870123 954457 1279118 1109923
13820 1109923 1159215 1043833 1145714 1115360 731700 894384 1079008 1054066 451647 1102433
13810 1102433 967605 595616 1288045 1140871 930689 718955 1227349 896382 811809 797845
13800 797845 666064 953561 954461 1034096 881644 622230 764129 1032026 633073 1043281
13790 1043281 683054 983651 872895 914752 835813 866432 668431 630798 1024098 1009169
13780 1009169 793594 840725 881793 972571 823515 984771 982104 685142 850993 1047915
13770 1047915 883561 1111393 606750 844356 697301 944266 767002 791743 690211 862345
13760 862345 331176 807181 766717 841144 814171 817351 656563 604417 943528 493279 629797
13749 629797 728193 729378 870011 677462 820981 930077 1218987 807564 888604 592800
13739 592800 884367 888069 1150046 482678 788722 766187 717213 1019642 650297 813477
13729 813477 603470 389926 469948 854437 874069 431422 588931 578663 327343 613562
13719 613562 676474 476773 631975 752742 512966 906406 576509 437153 603672 576613
13709 576613 606013 561087 315206 913834 381109 502702 467349 576539 523564 434610
13699 434610 725790 517145 557865 665995 470373 702029 561649 277972 279206 706011
13689 706011 439610 759369 491081 796906 570304 582340 711549 826668 709661 741105
13679 741105 836461 627193 542370 851371 341850 371552 719941 640733 301383 512880
13669 512880 554174 357447 270951 464062 826027 399125 435281 460516 373706 278096 208721
13658 208721 559489 292958 602168 639009 870549 543437 321280 686955 785254 627718
13648 627718 139965 215007 264314 278296 700777 773155 701792 361240 906234 405453
13637 693531 597675 60486 480681 391046 301162 253915 236670 212346 330059 403333 565047
13626 565047 280533 507114 485110 487836 318061 317681 364294 544411 386401 397459 379974
13615 379974 36298 589280 256358 317075 134730 435344 657648 304884 243089 643615
13605 643615 265710 440806 527280 283647 544818 692113 407112 415653 566830 338557
13595 338557 527292 151862 257778 305143 540671 583263 271767 272128 45210 487567 555694
13584 555694 503406 494029 485827 221871 386042 750575 454418 556070 236246 432593
13574 432593 -26630 480622 349770 455786 296292 351330 52494 393722 346431 540955
13564 540955 252317 523242 365877 478336 506802 48664 477104 401598 306295 216844
13554 216844 459276 587168 253653 401261 622567 181969 332468 507220 316571 472745
13544 472745 484317 248757 457356 575855 317851 229943 104436 233150 507528 330772
13534 330772 246506 385850 153650 194282 357238 425222 103046 409320 592318 61228
13523 481046 593237 337865 480934 148107 588670 370631 442922 185943 462309 418639
13513 418639 274763 -37091 -31681 -5293 374698 271689 246662 -122445 421713 113861 363645
13502 363645 41132 413379 -19665 535189 369880 835213 422667 413043 -176167 41676
13491 469586 186668 76344 -18675 148106 -50664 479196 252552 363446 104136 399694
13481 399694 350744 144993 571551 113603 173351 414369 -48325 127779 474032 10101
13470 437351 308012 603980 332320 404324 70018 379194 123254 226677 247952 247681 -48983
13458 151817 198570 31212 144419 427144 241204 358291 99491 79307 125016 258627
13448 258627 221659 559666 382655 252920 454126 147637 472153 189757 288546 249201
13438 249201 177332 529339 668783 210633 129101 452201 649882 384116 124696 318167
13428 318167 309488 258735 242285 239467 -12829 352660 270543 178246 651660 212965 82986
13416 67806 148528 276352 309623 214158 243833 168891 330202 105205 267003 603311 139669
13404 486391 -19294 234433 58326 357365 125701 381926 54853 332570 446977 -94182
13393 259482 228831 244302 32730 27328 329558 21173 324866 40096 133568 188922 48009
13381 166639 117667 26020 597272 239814 376582 -253951 -281233 81737 319815 402465
13371 402465 295118 299774 91290 281545 440380 333689 9911 195895 180410 84549 129317
13360 129317 123167 142105 708 386437 530445 44307 434573 246481 -138337 300473 15744
13348 78932 283079 120792 91746 250695 106838 74783 282245 428258 -167380 358617
13337 81827 144534 87448 359976 107809 80315 383520 204180 325891 186520 124129
13327 124129 229743 86017 -100246 332473 143171 166946 120935 52075 -71784 367650
13316 182328 24936 118345 372337 102249 21992 459262 17487 72229 10180 277003 375480
13305 375480 -154651 227965 497117 236733 238548 166281 404168 551359 33951 330954
13295 330954 239848 3762 248067 -143004 -18501 255555 353284 26546 -85787 -132253 125764
13283 250261 369360 276427 -45994 202593 -247899 312094 -58398 598825 299664 188737
13273 188737 28449 152618 84097 -54794 -258686 171328 204494 341946 43951 51847 -32562
13261 272475 327801 120887 9778 342739 -69724 248966 183008 448980 226286 207967 153114
13250 153114 557742 -5696 49076 132770 268187 492936 25604 -163711 309369 289371 7050
13238 -101110 38749 111426 192432 1321 24051 62326 517835 395632 103941 186864 3222
13226 -179312 -75813 284321 -106466 116486 10559 108130 -47817 97984 -41738 349683 320557
13215 320557 214562 302617 105487 395320 201128 420301 43894 136508 50153 71316
13205 71316 -80087 207714 262116 -101414 115982 -55351 60081 90643 294817 -202737 100828
13193 244432 112206 564015 -45631 98225 114792 56789 -197644 18007 39119 -59583 -8833
13181 71393 -125776 -26986 45581 91328 196907 47421 123306 54405 -5090 -147911 128959
13169 41372 57010 182314 -131836 84812 -89500 31476 -9807 -213675 -8531 235223 173733
13158 173733 150273 328862 186472 99585 286285 318351 89069 340280 278194 -145764
13147 -204068 -164958 155021 140400 178490 200481 308822 469650 -44478 109683 194854 -141559
13135 61113 37991 74346 -10925 -188679 -251367 153988 -1778 -73059 72362 26242 335538
13124 335538 223553 44427 -61623 168627 356988 119771 -127665 -73171 76347 54049
13114 54049 216079 87868 386527 196907 -39342 371792 -38076 98878 76366 -189366 129499
13102 8840 64860 -159292 229369 7229 121334 171825 -147613 129014 298544 69951 37231
13091 37231 85288 193500 26163 330181 -252481 256452 196124 169732 -29787 32562 124340
13080 124340 93003 16427 -231688 114759 96719 -200134 25895 283885 196974 177789 -17128
13068 150486 108498 -193011 276231 -25681 -77679 -147903 98033 95527 138390 -97844 63688
13056 104102 144978 170730 -13160 61011 12764 197011 -27015 259257 -44376 35825 -49821
13044 305648 33743 195620 274873 168450 327176 82313 78494 119312 341774 102975 66785
13033 66785 -11300 171323 156215 279496 -93025 -63291 389235 225003 99074 73399 223003
13022 223003 131116 131626 173201 336628 -23109 9668 87463 179529 34633 25124 -179298 -120601
13010 -120601 204611 -238788 -24786 308253 -21513 29172 28706 14792 -73521 275091 222901
12999 222901 365245 -95358 267598 -84968 103524 -64927 300507 200482 -115154 306727
12988 127102 -142808 185511 383998 223758 175513 136680 -57563 36598 81825 52759 134932
12977 134932 49377 265989 7749 98531 -266709 -8115 15965 133026 139388 229812 -95902
12965 132379 73256 235711 84864 290784 170743 -39444 9834 13558 285041 26723 328364
12954 328364 69313 110824 42369 -114266 -5770 161722 -148619 7565 31661 203998 240808
12943 240808 -179259 -291489 -12139 -161269 -171894 -160377 457429 -17151 -138510 139886
12932 15897 10773 -86534 191425 133835 413799 90254 -59432 441594 2047 80959 -100590
12920 169428 112066 373784 -272915 -136802 156757 -107959 53132 -226366 206458 -100276
12909 153513 -310846 -135137 156217 22402 -117288 -3880 -63661 -65549 198817 -407524 41429
12897 -92398 167203 -216137 -111346 -16672 109081 -73784 -65333 -423987 -40645 -10556 -116248
12886 -116248 -122646 37004 -325202 -138739 11166 -67828 133108 118075 233835 40666 -195089
12874 14586 -145777 28622 160322 -159245 -131707 -170987 90208 -199956 -98901 471778 442895
12863 442895 134957 17685 142693 51105 -200583 31155 -70219 -179831 7597 331647 -255241
12851 7080 -144400 219584 -192603 -157499 228297 -283001 -109233 -83805 245114 -172230
12840 9329 -427940 228663 7036 -28502 -68119 168937 -76859 -83354 129957 4054 161096
12829 161096 62825 129096 210867 118978 -279147 -71088 23058 97975 58932 64575 -72146
12817 57257 166017 -156119 -89557 88054 -28433 -14621 68165 11357 -179923 -157514 86614
12805 249204 -100182 -113613 -174267 39042 55696 164114 145515 -191601 -11255 -166665 83715
12793 146176 -25684 21676 165849 -48430 246073 135544 94627 22841 87066 -218561 -172959
12782 -172959 -10217 -261210 -289405 -31668 234466 -68229 -62339 -82150 -52044 -173801 136110
12770 65505 85895 -216343 390833 -132034 23647 -303838 122041 46176 -216433 235622
12759 76956 -11617 85593 -105940 178804 179138 247878 -71267 -177143 343184 -74002 218127
12747 -303356 -62836 -48637 -60301 -79372 -15432 89432 199260 -1807 33128 -130593 -212346
12736 -212346 -370195 -443526 233908 330643 122855 6359 -26173 -25345 227017 330563 185901
12725 185901 223657 -17763 236349 78758 -130886 176736 150501 -114898 252672 42562
12714 -256370 -137013 82461 166795 83715 174335 19164 264501 130626 -221010 -46515 16488
12702 -334446 -46922 473602 5559 192043 93301 105809 10856 257502 -120154 395437 41742
12690 298433 -11454 75420 -252565 57207 368276 -108492 -312491 -35476 193487 438924
12680 438924 24457 6839 331615 155391 348235 228137 -6058 223 938 -240954 -24640 -169217
12668 -169217 -23645 107192 87067 413925 143396 333936 69630 238743 42092 412042
12658 412042 149154 24072 374225 -240804 112852 328653 352163 40946 71966 102519
12648 102519 155003 -71464 -67160 -35608 50512 -3950 215742 251155 -30593 51560 22968 -11815
12635 48260 -34587 -129301 17424 -29030 60382 -159783 -16022 -81808 401645 -23009 -133327
12624 -133327 -118689 -42508 -67579 -4580 8616 198894 220088 662544 -129418 -39546 173867
12612 260068 342947 178016 169433 -90704 -103222 155715 -658 306641 141131 -155415 3249
12600 358701 -34229 -62758 150481 106505 281075 287645 374266 137120 -5167 240856 -171738
12588 37319 127137 -405099 113228 -72724 -366539 244974 144839 29641 465633 -67173
12577 -259898 -29535 -50028 -28695 -42152 90373 92914 -129021 -42466 30657 412267 97943
12565 -68675 293137 59841 -272752 -139910 -202061 77182 287705 -20776 -321978 -26014 -245986
12554 -245986 170662 129701 -220763 -57966 -221823 -253091 -265586 -68923 116735 3998 474853
12543 474853 125010 -41553 -16523 -270433 -24792 -139347 175444 157753 75821 -180253
12532 201319 49885 -216154 -21440 110644 -143611 113085 57066 22559 45590 26301 160023
12521 160023 27807 -146047 309886 132730 60980 -30627 -103757 -110486 -28601 27425 99832
12510 99832 118821 137282 -78058 -51272 -235667 31516 36655 169220 151544 141522 219115
12499 219115 55194 -18334 -156065 -4425 -136098 -143196 -91112 48027 -14850 -379369 -93370
12487 -213748 -125967 -260055 190652 44260 30118 -785 168101 51288 -175314 341091 10536
12475 28475 84107 142847 24353 -119704 88143 -158208 -159851 66248 -113898 140467 218991
12464 218991 -216944 -304155 166883 73246 -91151 -54610 53037 98157 167451 -108725 -354638
12453 -354638 89231 -64318 -85701 -85618 189522 5854 -138291 32023 289414 337709 138349
12441 17444 46852 252096 170322 -50624 -108327 283876 -45495 -353392 -391433 -362926 -52208
12429 148454 -115970 276664 -284289 -137043 84199 -251087 -50656 68274 -325664 262802
12418 47924 -330040 3837 115087 -27688 251346 359626 -18245 -14826 310317 -153704 -80386
12407 -80386 -113658 -236609 -74028 -123516 -116873 -6555 -14653 263288 280790 -353863 -238338
12396 -238338 -66979 -64767 78229 -1172 -265273 -50893 -4399 -12492 -132432 127532 5302 -300966
12383 182399 -246828 10541 192621 -17563 -188002 -22486 -18529 46915 302133 -96774 432515
12371 139213 481013 112146 -119522 216029 237134 447436 -185686 116665 -22140 131309
12360 251059 50792 187670 -183947 117042 -46661 -130039 -32065 22699 -104684 319449
12349 -116771 -56889 -31935 -120171 108116 126233 -107997 52017 -232321 59978 -47818 -51603
12338 -51603 -186618 154066 64771 -293929 36754 -118578 163186 78239 -144055 420672
12327 -157461 -65630 -365657 -16551 188362 155712 85793 -210849 351072 176279 52428
12316 228257 117100 366752 38903 -234683 349090 148709 180850 179662 145189 -185757
12305 149996 158984 81257 159615 482297 216668 -168496 247907 63048 79730 -52488 -70911
12294 -70911 207909 -34230 148739 194106 171899 159869 109673 430912 -69939 164797 -16075
12282 170327 256289 6553 -161959 569507 233778 415075 -80017 674888 -50477 -1082 99162
12270 119584 217245 -7347 -104832 400098 171888 -109497 48918 109649 85866 264723 181309
12259 181309 396445 163884 340044 90752 335049 168172 292395 72581 305254 80517
12248 45509 -124892 222135 298936 55308 -27479 237404 310946 45658 -44930 -1858 82527
12236 260998 5229 176699 85162 409488 130390 32635 432668 235388 14325 -57836 25910
12224 303224 350920 321182 269794 -209570 329251 259912 -157569 160514 60534 -140033
12213 185281 -286446 -68870 262928 241702 60105 216683 10780 282559 41823 1567 -96649
12201 105873 177828 464005 147511 292525 209358 167562 474269 176975 133641 84293
12191 84293 42669 -182608 -130096 -6668 388388 -18327 143554 -10808 22139 99378 -85097
12179 118006 105887 63963 110590 170057 202889 -103387 228888 -68954 -110264 -203866 -151917
12168 -151917 265142 245285 -54684 126868 221473 239314 -58551 39885 136419 -203715 349736
12156 277088 79698 158305 165414 358644 241462 42387 191000 169515 302928 -8500 -53031
12145 -53031 -33801 369205 96068 54218 326920 221457 -174604 -34834 238260 166322 222760
12134 222760 -18833 -188531 -2722 -275004 -69425 335337 -132867 -33231 18566 415500 -92313
12122 89500 -274891 119243 43411 187284 247617 344280 -19857 -42862 316468 107297 134240
12111 134240 137856 -407389 46092 448633 -12338 384766 386984 150261 283004 189333 139200
12100 139200 276055 484308 146305 -24768 213064 47752 -224981 151568 136027 8661
12089 -66087 -44737 -187450 -270522 297032 351066 -84837 -25763 286137 -43124 -129637 189513
12077 172256 -123377 -55619 212255 -103806 197906 326919 193087 -324969 -248562 50020
12066 427205 -76165 120545 35359 -56586 42083 -91340 245354 67095 522681 278100 62600
12054 56057 67984 28457 -71525 123336 -134656 -31215 52689 149318 97660 47890 139924
12043 139924 -184284 104534 -204761 186776 21331 60174 135133 47854 -160316 -187257
12033 -187257 59693 -306842 -240355 431073 283949 -67129 -88391 281572 114512 82619
12023 82619 82236 -228950 42530 -346131 246578 -98452 2428 31579 -105790 -46274 221922
12011 87346 129025 -219517 192078 -119433 -128637 189997 -2851 -191218 -47038 -392308 192970
11999 -87075 82098 -13110 143782 -97299 184690 -50059 87273 214760 65252 130407 213492
11988 213492 348755 -154311 472191 269201 -31831 172815 -83338 297651 205644 64330
11977 -167104 -228557 -75284 -61452 -510165 -209040 -235431 140017 177564 401366 -202891
11966 21628 236445 60232 -161045 43382 -281565 -226027 404630 253006 -66991 -115586 -148539
11955 -148539 -12517 -19578 -176975 -101595 -55849 10120 60556 108616 -185991 -190040 243955
11943 -324422 90792 -205513 -101852 -51738 -515958 -192989 27466 -104652 -242295 -20299
11932 -209667 168665 -72191 197103 10566 -349158 -136286 45132 -202913 67194 106082
11922 106082 -98552 -139087 -231478 209406 133885 -103409 -33498 232745 -129536 -91117 230553
11910 -220840 59239 84998 -59430 -267593 -159855 -67834 -204023 23961 -87803 100713 132929
11899 132929 230726 -141449 24324 315086 -9365 18609 -32091 55012 -29648 -62574 98287
11887 -545327 254537 -18844 173394 -273489 56268 24687 -246216 -162510 87655 -132882
11876 -83943 -136815 -103318 -16166 91729 -191868 85654 -13304 24082 -12831 -13973 34306 -58558
11863 -191176 237390 -152090 5201 263935 69490 -23377 -292091 -46913 -156535 88409 -102899
11851 -221055 -224495 -204592 -144351 355608 18961 40278 309695 146465 -64740 135261 115079
11840 115079 -291526 -76377 -127702 115179 -38795 -192404 158806 199729 88222 37452 33366
11829 33366 -99536 305349 156626 -156753 65002 137768 -66217 37178 -18140 -14555 -314033
11818 -314033 -123481 235109 5843 -23019 -59491 -162074 134133 -65784 27621 155426 104612
11807 104612 71813 -103816 -154900 -120323 161674 158232 -108723 26725 -192115 15671 -342038
11795 6271 -27344 -46988 247528 -50892 97571 -59483 8098 140251 33418 54123 381391
11784 381391 100276 -92328 -246335 -32530 121448 189364 244073 -194384 94629 -201670
11773 -58196 -226621 21879 -232962 77555 291677 -249933 -147347 105875 369710 28772
11762 -57544 18800 -230685 -211326 -327583 99377 149079 -245141 89329 164607 54990 -139019
11750 33804 -21634 123681 -313407 -99990 -239954 -115418 -227507 -67896 -346488 -14474
11739 85438 -183251 33698 -107325 961 -33644 -16472 26052 -57417 26516 55436 -19981 -222198
11727 -222198 -51540 -35192 -15329 -75532 -93402 330367 -82623 -152132 164177 -311942 -211432
11716 -211432 242746 19896 243681 -22752 44381 -209492 -12162 -254532 267715 -127791
11705 -178683 -123211 102552 -50376 178424 288471 -86908 -74608 -216567 -112778 125934
11694 359538 -91604 150573 58000 72556 47987 -355057 -22633 102436 -67434 -163791 125020
11682 230740 24818 37693 207266 216777 -41019 -156184 240374 -508867 123701 -186646
11671 289260 97968 137073 -43774 -252721 -8090 509589 -139313 -101219 166156 9310 18450
11660 18450 -201160 -139697 377311 218046 133134 19408 -204612 -26477 210190 -301746
11649 260965 -57709 -135598 67268 178417 70885 -131286 -139669 173530 -57892 196736 -8729
11637 -140170 59259 -17688 -28920 -348372 33873 262832 -66313 -293739 169782 35792 -27602
11625 464515 -25115 198209 45785 -124122 -260286 -251875 1095 327412 -393793 12020 84225
11614 84225 105537 101798 475400 32299 66158 -83413 -97079 351566 213945 -34310 -24692
11603 -24692 150832 184701 -99102 29132 110915 194629 912 35185 -155567 19871 -69415 126615
11590 7554 -1218 -60745 144013 -503987 -99171 69061 329362 -126660 -64935 243033 -133947
11578 98198 176420 416623 365091 50263 -51433 -46051 136865 -44515 217398 135156 107664
11567 107664 138376 282065 219893 -83800 59341 93044 236172 -91184 -118523 532661 -159784
11555 251495 281659 -52441 -169968 214546 -16716 -61757 192762 -62896 -75658 -150480 138308
11543 272639 -54130 49075 73175 -41116 -267181 30625 -4133 97299 110066 -274 217151 -275542
11530 -118020 86569 -40775 109747 182171 89466 501183 78766 -71797 240395 259403 -234644
11518 -32690 405410 -1699 117442 -98209 68865 -99732 103842 -149699 -3201 221756 47633
11506 407034 142517 8915 76613 190551 290109 -103304 3597 195188 -16683 21205 337584
11495 337584 -4422 -192939 215952 -33292 312076 112300 373107 -19153 84363 137991 176458
11484 176458 1945 -90319 536596 -72785 23164 4557 5291 -55978 273411 150517 263127
11473 263127 222195 -182436 57185 -13805 197365 52738 135230 44281 357835 218167 274712
11462 274712 122004 90827 89373 159947 266241 -25443 23521 53175 33881 39925 -154879
11450 257910 -57350 357431 170664 15634 187565 348641 115876 262844 -111435 184991
11439 185281 61803 -4032 165435 163049 100391 60899 229076 1740 161712 -247443 -72154
11427 144698 163816 -103585 -99184 258209 261213 -430003 -44340 253411 -112616 -40278 240235
11415 -113221 141046 182331 -142149 209946 11812 106244 127671 -32678 -209771 -161101 -73178
11403 68968 -194099 328980 -231838 296336 -218227 -41883 -220560 46855 -140816 -54726
11392 -167849 103803 -258802 -120815 168925 210818 -92253 123635 253053 -209599 -49081
11381 218355 -280735 -173437 -33677 -194598 17259 27762 -311786 -112097 -109561 -182440 -141499
11370 -141499 -487497 282872 193973 22363 -480168 -120519 169020 -50449 126162 223050
11360 223050 -146178 -63931 -49492 41542 55457 -189952 -146962 329511 290678 -120764 -378368
11349 -378368 267773 -116684 -80632 -247146 -14576 234172 435581 -335323 266387 1943
11338 171739 10397 -256562 -262054 -104724 -130360 -122759 210780 -368828 -84237 347365 -31612
11326 3265 -5545 89558 26826 264444 238389 202139 35365 30461 -269786 -358677 -178811 115027
11313 -91561 -412754 -52268 -179969 -181648 41381 15541 102830 123033 -102165 -255834 123128
11301 131000 -338664 76505 158172 386853 30655 168351 -312566 -42385 -138182 -46613 -164115
11290 -164115 -161621 -253752 65698 -91496 -15013 82787 -266987 -84052 -221247 -244575 -207926
11279 -207926 143693 -83395 630 138608 -282612 -371620 143480 -69528 86830 -113684 -55620
11267 -170441 -81940 -122367 -21479 -192370 274022 37216 110044 -136115 -95498 -162075 -106124
11256 -106124 248598 -164697 -141036 92803 -199834 92329 -103859 -281293 -159639 -137053
11246 -137053 23660 141866 136593 -337419 -266670 -198945 -200972 -36680 164191 -51506 -173129
11235 -173129 -190136 172969 -57296 283633 48607 -77972 -261415 -194720 -104844 34043 -131185
11223 -46256 7593 -281576 56966 -47912 211692 -30602 -131472 419239 1297 94195 46716
11211 -333846 109110 -113283 178158 -196408 184579 -154145 -48174 -106154 -123912 -199976
11201 -199976 144571 191137 -70019 42315 -224336 -185054 -48639 -18024 121951 -112841 -51882
11189 86762 -27348 -234406 -275891 -361227 -513361 -182859 -57563 -283500 -241845 -412341 45429
11177 39697 -219604 -51294 -162245 -77658 24680 -220509 59814 -49741 -265661 -132531 37273
11165 286963 -165253 -121711 161173 -303234 141362 87099 -295625 135053 -69615 -31043
11154 -35355 -1333 36296 -93957 11114 98475 31948 171512 -51234 199709 -85142 -284740
11143 -284740 279817 -166669 -246761 108399 29919 -118951 23512 -314502 -39203 -16030
11132 314 -269239 -145718 -147 -103302 37208 157711 -24748 -261592 -119933 75413 144345
11121 144345 15293 243049 -1526 -119983 -6280 355436 -141211 154570 17356 5425 -80817
11109 22996 350772 -330859 268727 179677 -45088 -55808 -30934 -1684 -60958 -314811 -119439
11097 -300171 185510 -38382 169230 -155942 181277 217161 109650 193565 74409 264282
11087 264282 -252943 349775 -243865 127626 211165 -158053 74290 -17545 154857 373776
11077 373776 -295547 105269 -224193 506243 -9030 166409 253969 -21089 20333 154231
11067 154231 284477 -36076 175388 292783 185214 139100 315055 20352 -18117 259094
11056 -340505 81033 140046 169558 284807 407384 95878 318156 428369 307438 458573
11046 458573 391713 121415 554628 486064 185604 339479 485584 263573 502577 418039
11036 418039 458261 216069 427600 806713 755863 393580 909072 366476 654415 386577
11026 386577 735567 552275 335205 373256 997069 640940 683279 292265 644574 506108
11016 506108 425627 461790 599888 508360 506193 583934 661831 917607 563444 787628 539707
11005 539707 220967 956198 704896 453332 427955 573863 419744 442594 517398 430038
10995 430038 311483 346058 480254 486013 471130 131666 756862 673073 668599 431245 708435
10984 708435 341910 539766 723573 505773 713274 512008 856647 682462 846576 544842
10974 544842 400070 481139 610055 535085 967874 336672 826005 486534 795439 1040658
10964 1040658 1004498 675479 1096712 1174370 896677 1112048 1410005 1639469 1518984 1732351
10954 1732351 1648238 2150492 1950282 1866108 2229787 2077952 1804317 2250924 1748569 1667735
10944 1667735 1821845 1397019 1476094 1581230 1505715 1587885 1496989 1699196 1476408 1374512
10934 1374512 1346747 1144973 1198827 716123 871685 452464 577468 382873 363248 229152
10924 229152 210608 479494 353607 311798 -8008 -160251 207983 158340 -126490 322445
10913 74654 217658 38184 207630 -28035 -57657 -51716 371721 159148 334254 -284178 69243
10901 199526 101187 204898 -49629 -86470 84206 -57654 -307800 86296 -210042 127125 -256960
10889 55976 -13650 6437 145918 -305155 76023 -90596 -428206 -212169 -59711 -129111 -195
10877 -105321 163164 27638 129779 -113637 -29744 -9316 -59693 -341837 47938 -132046 -245819
10866 -245819 -54640 152541 69199 91373 -32605 -223673 -20100 -67972 62986 22095 67228
10855 67228 194051 -41841 -12336 -203092 272626 -183801 -21950 -284342 153285 -179167
10844 182982 280042 -93392 105540 -89260 -162856 -40499 74114 -27664 -104435 -401413 53260
10832 -97870 166130 -55293 169653 47466 234877 122559 -115666 -166663 65266 -219901
10821 31719 1523 181412 -69029 80214 97094 -188992 -214 102617 -251478 -153373 -148637 113893
10808 -158760 101695 -193962 -25800 234844 -83206 -256670 44822 2198 -243378 -122798
10798 -122798 78177 -95892 -155510 220888 179565 -1646 -88730 -22689 128232 -177901 42208
10786 -600394 -137149 -124940 82621 100076 -183665 123873 26657 -101444 -246106 -252619 29198
10774 9713 94728 -308208 -17507 -152141 -276450 -164149 -25030 150263 -212959 -305631 -44388
10762 -136632 -13837 -86021 -11051 58918 8728 4010 -174165 66347 123122 -104234 135947
10750 -60921 -201079 324216 -58927 -92437 -259354 -188912 -284895 -71706 -306186 13111 113588
10739 113588 -1137 174926 -136583 165498 -230767 -194216 -230305 -27068 -314162 -214695 195546
10727 45992 -322258 -106107 -360036 -122437 -187335 -43995 -15622 -80302 -58279 -199791 176686
10715 -202161 -85747 -194315 195855 -247479 53617 109148 -143573 5511 -291153 15792 -223777
10703 -18936 150703 -47041 99562 35073 177042 175916 -37076 56824 -42183 -230151 64333
10691 37258 296941 95623 149865 -144704 40485 -59502 159105 273633 -241862 32867 18066
10680 18066 -211357 -99694 87250 -60545 -175084 -129199 -62313 235063 380 -96372 -220419
10669 -220419 -58868 -363027 -27182 -227329 -186084 -97689 -125554 -76169 80964 49478 30354
10658 30354 169792 19441 70900 -312207 12997 -401638 36492 -213615 -150123 10202 176724
10647 176724 -176023 133452 166672 -65627 -50348 -131024 -279441 -117737 -86125 -129053 -81469
10636 -81469 168128 -223304 -177755 -63842 -162521 20737 -124603 -94262 61842 -380509 -291419
10625 -291419 3368 -259863 -237258 -218427 237687 26117 128339 -286986 -222494 -78623 -94362
10614 -94362 -140400 -89365 152216 273946 -100655 -4454 -42409 -217253 -38417 -133335 54029
10602 -243214 -25186 172682 -29157 108615 170536 34931 205408 -175695 -161259 -26231 -339027
10591 -339027 -40399 -352185 -266673 46945 -93624 -56840 -19079 -114497 29009 55583 -393229
10579 8251 -37618 235321 24129 -180256 -137473 149688 114172 37741 71575 -78637 -33002
10567 -331904 31117 31613 236492 147657 -3632 -133009 -346085 10972 -106847 -61464 275656
10555 68247 -364 -179729 -114478 -294462 -331282 337973 62931 -121477 -222122 -224155 32043
10543 80312 41167 16390 -212090 -29243 94512 -233302 -199327 -39081 -256417 51804 -43454
10531 -310517 -384943 235899 158391 -15918 -183450 76292 387803 33798 -214083 -14966 52283
10519 -217088 280688 172235 -171667 -246929 -48863 219271 42269 -2268 216954 461 -180880
10507 -130732 -85339 -41483 -105368 21294 -165148 65735 63042 -497657 -102087 170943 -64369
10495 -154526 -76587 -340053 259750 -283711 -232508 -195963 305492 -116761 -38543 -13752
10484 -69635 188951 -39078 36134 -153911 133997 -122383 -75787 -383537 -124832 86146
10473 -24907 155231 -85363 121775 327517 -279781 -108050 -70383 14990 161062 15021
10462 12815 201294 403310 367252 604187 563151 714938 424423 215173 309713 282238
10452 282238 -78495 -377749 42955 98036 283126 147093 12250 106958 155436 127272 -179866
10440 302987 -119322 -141707 108307 38634 -17643 -138553 -207535 57802 3556 -46843 -343728
10429 -343728 -107444 -86242 -38976 75003 -15263 -214443 71537 -311162 -56987 129513 -73598
10417 -250133 -190313 -318891 40168 -101310 -201727 -118691 -33221 112991 -17344 70143 -24911
10405 -11554 -115831 48600 292668 -52700 193332 -86047 80429 -209517 -213694 48653 -257092
10393 117686 338369 -331731 81956 146958 -80140 -30045 -21418 28400 30597 90521 51873
10382 51873 -148034 -218476 176795 101656 -62112 -210282 76025 143076 160038 -188655 7898
10370 -168524 -100856 -6400 -149265 -171197 323699 27980 160446 -17034 -12578 84470 -50442
10358 157940 240804 -147330 170726 -66808 170946 315254 115873 199408 309946 143210
10347 270527 264764 -40217 118320 92229 244157 250045 113765 87492 319713 -91048 572695
10335 140714 1903 -93807 180779 205494 330678 386457 304863 230887 353187 445883 252874
10324 252874 193344 143778 681 534615 4536 465375 477871 173382 -32667 262650 103437
10312 -128811 30188 154990 -78216 56221 235242 125385 434941 186615 305374 136057
10301 291042 177941 227229 -158982 168931 94325 -11376 -191167 47617 -372465 18302
10290 -364774 98257 138654 133495 -97017 -274892 87866 -173881 -303622 -132982 205964 -34936
10278 -235189 18229 117559 60739 14419 142360 -138552 145956 111056 99749 92598 -382295
10266 -159473 -261969 -3085 226720 -133344 -94552 -207452 113732 28083 -101834 -27003
10255 141569 -41859 101664 -402135 -79426 212267 110600 -127799 -29366 -56920 65392
10244 60631 235725 1564 80438 216261 165130 372897 265471 100824 498149 166243
10233 -119301 405191 -118414 -162321 20622 246196 202193 74242 236193 -199712 231504
10222 289153 -79462 -86788 90957 -389274 15925 -137827 55187 8221 150518 -58043 -285857
10211 -285857 166013 -91397 -181574 -398079 -30588 -28567 69646 -342452 -207622 237878 -55738
10199 -16810 -17577 -307329 -96644 -15749 -210816 31549 -14054 -464336 -134822 76218 122832
10188 122832 -127556 -128300 -294709 49998 -355504 7798 253520 -143214 11615 -136075 -82028
10177 -82028 -17356 47867 -217670 -135502 238956 9212 266897 -725901 -36567 37506 80378
10166 80378 44229 -144514 -209979 135180 161212 -79536 180964 -262526 -69503 314 -132762
10154 -49800 -31287 -151622 -82248 153242 -212120 179244 -126160 -258241 301660 -127389
10143 358866 -70967 63797 -300294 -16048 -213220 -224788 94710 269050 -342354 -61156 279052
10131 100360 -104239 -307449 164695 -121723 -320773 118256 -164823 12039 -7721 -94228
10121 -94228 107221 -58684 103353 -6056 32527 -181017 -244336 -132498 -199409 -203453 14568
10109 224104 251229 -191986 88300 118069 -11256 153220 -40916 -179437 40278 -247425 -338851
10098 -338851 -46153 -217563 59249 17761 45407 -76573 -215383 -218823 -21143 -36443 -107096
10087 -107096 -141954 -32062 112158 -35280 196861 -162634 -149656 -143250 -199776 -212130 -430252
10076 -430252 68485 2317 3464 -90353 313536 -104024 -109570 -325995 -144510 1602 32147
10065 32147 -168485 89586 49553 -26979 -82771 141023 -99944 -301394 123223 -23100 -347239
10054 -347239 -109567 28428 -16921 33565 -145136 -66561 3884 -114071 2 -49529 124709 36893
10041 123296 -74783 -229435 -191108 -60146 -384298 -194003 -28354 -105913 -92684 -38818 44390
10029 2979 -273412 -38771 -29650 -209332 -140812 -217709 -164018 4873 -102332 -203735 108631
10017 -253450 50711 -106882 -60791 -71162 -163288 -9402 -6865 58952 -146820 -214752 251072
10005 -69643 281261 -15310 -108786 -211747 -24877 64385 74446 144730 366027 -100418 -239121
9994 -239121 51116 -297524 -38646 -49804 -367671 -122211 5441 -279124 -213780 15028 34229
9983 34229 -151228 321080 -27647 315783 -393450 -120045 -62277 -43641 -54704 -13095 -446344
9972 -446344 -61556 -135443 157384 -258978 192550 -242287 -144992 -106449 203240 67849 -186427
9960 57055 -127452 -151578 -89676 -125028 73206 -103745 -62089 -71161 105575 -29892 -142379
9949 -142379 132938 -92739 -15149 -84378 -49755 -21708 -113300 -380436 53729 169161 -117893
9937 -76418 -81218 -211372 94483 -151344 -128933 -185146 -48665 -1039 212522 -42329 34223 -174649
9924 80369 23392 -255381 -301588 -116792 -252339 -113426 -208404 -255944 -197474 370828 -138319
9912 -141056 97134 -80051 11535 273437 -22767 2435 -77612 -279181 -4467 -87120 164411
9900 -18989 -213585 -198867 -70013 -72822 -200968 -286816 252182 -37585 -70493 42716 -84341
9888 -343258 -135050 -39311 -2105 -496884 -163154 -30767 -497479 -265540 -271711 100536 15278
9876 -71258 -93871 -181310 -325606 -199333 385986 -59840 172852 141895 -36264 -186128 12987
9864 -119071 -300130 -112288 126133 -146235 -95175 -63194 126667 30906 103317 -272758
9853 -151859 -424791 -233446 108733 -23238 148281 -193434 -368599 -124555 -103683 803 -388895
9841 -285685 -22188 -210886 -503681 72411 -209688 203347 -75592 61646 14931 70045 35537
9830 35537 64811 -194869 -191072 -53935 76429 109805 -116602 -162524 -241072 766 -208718 19883
9817 106961 197167 -193035 -1612 -81263 6546 326458 -219015 -22714 207701 276447 -71917
9805 129775 187521 -157055 198438 -178388 -338490 75057 135996 -265030 -76418 70301 -228921
9793 36586 -166195 162610 -42777 -111366 279618 -45031 -46436 -228305 14777 -121139 245733
9781 -45066 -121567 -111212 6743 -206681 76728 -203577 17585 -42914 33041 -67194 95579 -238511
9768 -182938 26046 -363718 -56182 81750 -136820 -337720 303373 -115204 69661 65226 -159300
9756 156926 -369520 -109381 32550 24783 81866 -36974 -382874 -316816 55089 14024 46155
9745 46155 227159 -304567 -29338 100182 -128419 -454025 310483 -284866 22907 41863
9735 41863 -225121 33137 -229631 -48019 27524 42917 -180241 -104646 26756 -2437 -27750
9724 -27750 218010 98267 -134021 -227329 -158026 -404944 164277 -152999 -152046 217327 -231730
9712 -341359 -244437 -162048 -162207 -106462 41477 140374 -19070 293002 -169879 -128817 -291574
9701 -291574 131695 118976 -212740 -23938 -176897 402138 -429059 -92602 -142901 12812 -146050
9689 -54856 84700 -27351 -338829 -382578 -201293 57574 -61838 146978 103160 -246265 -65068
9677 -437481 -155031 -13310 -72723 -143974 -194422 -170098 19435 135610 -50048 -27723 -156051
9666 -156051 -374941 -99717 -113146 -97490 -279121 -130911 -91390 -274925 -172728 -62970 -193085
9655 -193085 -212587 50470 -131877 -48670 301703 -185930 -188669 10346 226544 53171 -218763
9643 59456 -261780 -274634 -13531 227821 195804 117706 -9148 -166384 -188813 -75351 -140546
9632 -140546 -57698 -387781 -72744 -31856 38061 171030 150344 90775 -135950 -160867 221401
9620 -152388 -188606 187909 122735 -66631 -247793 -176936 -168380 -126323 -80357 160034 -259230
9608 -63242 -12005 96580 -82961 -213142 -36783 168696 -96593 -224613 57609 -263379 -5769
9596 117517 281960 73603 209548 61194 -24639 -14997 97364 -155004 -45698 -317595 -95862
9584 93154 -71158 29610 -168587 26248 11122 -361913 -305572 989 -158503 -143044 -30832 -137308
9572 -137308 -18303 -78466 53133 89618 -85522 114906 -116637 -127324 -225960 140410 -250160
9560 -174346 166169 -203477 2089 -153189 2021 -57761 -130761 -15500 6161 -61853 180001
9548 37416 267785 -154920 49150 10332 -67661 -102173 248509 87881 208417 -243448 -32600
9536 -251384 25113 53000 -186933 146349 -153693 -117938 -75923 -221474 -191713 -296914 80284
9524 -22938 -194970 98781 134951 -193103 -163477 -19475 -452347 -114978 -162122 -438667 35501
9512 -201935 -8293 107971 89631 -356305 -106428 -125832 -140007 3993 -143169 -127820 -262198
9501 -262198 -316876 -162570 -18239 19165 -76467 -54687 -14946 285684 -188173 -208872 -66098
9489 70457 -121038 162703 21456 -137581 -138720 124260 164222 -178006 32535 77504 -238035
9477 91304 -3732 -120216 -70069 -140272 134665 -12023 -245048 -134223 -201922 31979 -375307
9465 108090 -142514 -207529 209480 -51506 -68025 12400 -106468 -320902 -67459 -80736 -251854
9454 -251854 -3988 -249412 95465 211677 -94256 -73541 183470 176022 -212381 -177670 167158
9442 -32828 -162230 -206018 -444241 96095 117126 34298 -50593 172220 -58767 181623 116719
9431 116719 44463 244990 -228786 -70792 -171059 -231795 -106836 92891 -236108 -251386 135655
9419 -86100 193847 8043 275649 -20611 -127765 -241552 -63570 45680 -141431 113441 -191333
9407 -82099 29507 -311747 14223 -240970 -108639 -228192 140841 -21732 -166114 149154
9396 174961 172068 -71697 225077 -81584 -247607 -20898 -19656 -36379 250916 41801 -136253
9384 55279 283010 -178728 -192102 -374328 143824 -65454 -356 -148706 -138551 -336331 211319
9372 -119798 -363972 -202263 109025 20077 337170 114183 -265107 -34908 -400663 -36862
9361 -419472 129849 -178426 -123388 -30131 78724 -55098 -153513 -194865 -133653 -99796 64657
9349 193717 -56604 297144 171836 -72665 100792 9484 11475 -314570 257167 -82201 -38326
9337 228301 22120 -170355 -31215 -107666 -88083 -16196 18455 233627 -18104 -70292 -93156
9326 -93156 -259331 15246 -367400 -11792 -7993 48481 -122979 95721 62594 -69917 -49849
9315 -49849 -145061 -86044 196749 232106 -237990 -369322 -170688 -371449 -179358 -122389 -31387
9303 -160404 -125344 -38047 -118408 167363 -50655 10450 73718 114984 9270 -1976 -48307 146417
9290 -20901 -200468 -240785 57987 -321571 6910 -12237 12512 78357 -52942 -2135 43088 -137163
9277 180306 11161 -144472 28726 -198148 -148894 102103 74946 -80825 38665 -222401 -232208
9266 -232208 106973 -57380 -67712 24824 98057 -67411 -416474 -310097 -194512 60336 -154359
9254 169710 90899 13502 -276382 -99069 -37560 -216896 -14603 -168548 136264 13 34671
9243 34671 -148453 -259014 141814 -108631 25566 -167801 -183687 5318 -240100 -174526 -18287
9231 12373 -21390 309834 -51336 -82374 21856 52767 -47497 -301723 29989 37680 -97304 -109240
9219 -109240 -60033 -190081 -73020 -109845 -325946 66751 -301685 192821 -95255 12559 -219303
9207 -144498 -180614 -177777 396037 -175304 91834 429770 -95789 -193686 -14833 -399734 -227982
9196 -227982 -485040 55299 -172724 -141008 102696 164292 -321276 -65500 -51752 -225813 -240767
9185 -240767 -339913 -298900 -115409 -184861 -96742 -370797 -64414 -81996 -349063 155500 -146112
9173 -17830 -130976 -186729 -62831 -360425 -330659 44524 194265 -299667 -73384 -10147 83695
9161 -146447 63628 -143112 -127860 -182856 -297805 51660 24366 -92824 194209 -42797 265613
9149 -129598 -114690 32332 207999 497397 -51255 -319472 -232796 -135594 -264999 -161549 -15675
9137 113825 -267526 -88551 -103712 -152142 -106948 -90098 47913 -193643 -254327 48371 21343
9125 121351 -207678 -243136 48660 -219073 308400 194184 -94739 -201658 -175052 -84320 10274
9113 -419462 -380579 212089 -103232 -384205 -256726 9745 -12005 -172769 -192782 240027 -212897
9101 -134728 -171849 -80742 106699 -165400 30480 103279 -97189 79056 -89444 378216 -54689
9089 119291 -147316 -257806 11856 -161170 -283820 434222 351545 -22719 -222369 329705
9078 -105621 -241945 -116008 -133084 3155 -289461 64632 -57351 -75135 -197395 -239282 -392422
9067 -392422 28854 -30305 -44619 -97310 317520 -213284 54129 24661 28977 -304983 -78502
9055 20619 -62729 -231366 -293609 154085 -161375 -116022 -318363 3421 -15684 297909 20627
9043 -48204 266513 12703 -250103 -151790 119763 69444 -165272 -20225 -81286 7408 40904
9032 40904 -138330 81267 74792 -64594 134139 -49881 82907 -133608 -140043 26149 -296082
9020 -249079 178024 -293777 98591 119501 187748 -33905 85827 -82048 -338689 -49405 -164406
9009 -164406 -263493 -346646 -99219 29947 -154902 -122527 -189157 -77360 -111147 -230789 -299538
8998 -299538 132828 -191816 -195752 108266 -122838 39519 -111207 -253963 -47508 -228928
8988 -228928 -58843 -131140 37181 457080 185811 18580 -329670 206215 112225 -118305 164154
8976 -144342 -184447 185640 -330536 146256 -30334 15096 206999 -60375 -95767 -198007 -77639
8964 380819 -508240 206371 -59931 -94855 -149931 196426 -195751 -3033 56330 188703 33412
8952 -241795 36940 -64552 -104427 -233359 77431 -1484 98393 -140310 -59787 44973 -100659
8940 -3582 -4499 122 59919 47569 32324 -261956 -94685 93196 -12850 -239321 71927 -54284
8927 -65522 57425 -410584 -432767 238760 -127110 -289261 86194 54012 -217291 77515 -21429
8915 59764 264291 246508 -141400 -371761 -19688 -80427 154778 276226 303066 207665 959800
8904 959800 2352741 3668873 7244416 3329131 1517139 606446 543029 598774 372266
8895 372266 597433 103201 343167 -86250 181284 212672 -133561 201368 108266 -55129
8884 78970 -107136 191284 228718 -142150 -23046 227440 442 128406 -120726 -139759 142477
8872 692 259426 -77819 -209788 73759 -82241 14743 -66527 -92626 127328 -52537 -120951 -220737
8860 -220737 -84416 -152851 450873 89472 -199841 189704 393346 40119 -280898 181224
8849 22230 -17432 94147 223684 48865 -189517 -60111 -390416 115695 -174934 100557 -12837
8837 -151800 58857 24314 -205688 59151 99853 -13853 -67631 -1013 -107863 -95093 104305
8825 373146 -283736 -262950 -49278 -92270 -44743 81054 46223 -81328 18641 -41454 -203544
8814 -203544 26109 46101 -41712 -280617 225192 148087 -27981 -144516 -128903 -238558 61978
8802 153473 -100702 145594 68559 184402 119483 -6618 -4196 1783 46109 -10831 -387007
8791 -387007 182113 -226397 -454844 -180345 -298760 13253 -233651 -61982 -220895 -192984
8781 -192984 -80555 -108149 -51722 -95952 -278844 16285 -91413 94971 -262458 -205631 -15070
8769 69671 -80199 -163602 214269 -203267 110355 -111230 359334 11252 138709 11200 -68601
8757 -60438 61838 -244223 -222272 -3328 -24024 -138178 -157880 -303771 -308221 -251140 -116021
8745 -348781 -71501 -198256 -199517 -168111 92727 -174084 -149537 180640 -141967 28963 -272428
8733 -18248 -60775 52220 -163966 -129830 34667 167589 -421311 2792 142562 192975 141379
8722 141379 273853 -175183 44118 -149909 69815 67246 1118 -64837 -112365 -243831 308276
8710 -3290 155750 13270 -247880 -150571 -52755 -143188 -168540 116605 -386539 -262298 -15938
8698 -82926 244310 70438 -259952 -94923 -46797 -5455 182711 19020 -125303 -108679 8893
8686 -129335 149227 -168973 -42077 -35695 -13045 -132344 54366 -48021 -293913 120508 -233739
8674 -333798 71688 69669 -86254 -383197 -82128 -281071 -15138 -115342 -142740 -162514 -107169
8663 -107169 -236053 330435 -19491 -188576 39045 220084 -90325 369315 -63602 69567 -385546
8651 -134387 -5756 113485 -158872 -63006 307597 -107281 -269613 -135724 -321225 -239481
8641 -239481 -226917 -106337 39396 -20483 -51512 -147330 -127566 76197 -69585 8067 -472700
8629 -291359 154590 -207432 96436 86707 -48620 26428 -173621 184095 149989 -45540 -1561
8617 69048 27148 -105915 -91092 76025 91093 -443163 -307609 169167 201198 -137153 -181873
8606 -181873 -280143 56452 -49668 93473 -104688 171921 -243417 -374512 -75204 109947 -30623
8594 -123405 -55788 -328395 -181318 133363 -384762 -18501 -135347 79234 -106943 -19891
8583 90388 -106757 102514 -16061 109580 -20837 -184770 -284533 -17079 42501 114082 21304
8571 175094 -87302 423191 -46983 -179131 -44912 247536 -163771 111552 -52998 47963 -86380
8559 -144688 -15598 -192342 -374425 198461 -63220 -169411 128262 -17682 -191503 108198
8548 170387 -223362 48024 -44423 45211 222461 181349 139459 -112049 -267071 44108 -281074
8536 17 -235024 -45365 134052 -132903 -85045 -85630 -98494 -69520 18846 -51828 -145202 -315431
8524 -315431 -34647 -353431 69050 -72872 26524 -243103 -339788 106093 136859 -200688 -231710
8513 -231710 69576 -11530 -231260 -197776 165358 57887 -192654 -286434 81892 -123341 101763
8501 -21671 169481 175231 -15050 -373864 -347472 -46470 216245 -353521 -166233 -169878 133194
8489 -90972 16337 -73055 59571 -266855 -291946 70382 -286347 57569 -123890 -177407 248598
8477 95836 -54531 32701 56039 -143830 -281134 204130 -90890 -351944 76738 251739 -125324
8465 105320 -295502 -37315 -195193 -199749 64773 -129101 -26495 -200539 237762 18763 -178957
8453 70387 229358 -1251 2767 128075 -22037 -155582 -132317 -88468 -170480 -23090 -77438 -164966
8441 -164966 -118206 90209 -110923 19075 245333 -25321 -40973 78740 -79417 -399324 -83975
8429 -191655 -5229 8322 -210939 -77 8885 8481 -151824 21725 43732 -22282 -173714 36065 -17514
8415 -237273 159751 50929 -45765 -48566 78092 -70196 14373 111352 -110961 81451 -253077
8403 -70033 -211524 -46610 -68363 25670 -102337 -28612 84762 -164692 188876 -422703 144539
8391 -106989 -140396 -274238 -168765 -243976 13940 428008 -79186 -265228 18128 -196195 -212128
8380 -212128 -64655 -33323 75688 -156743 100806 57675 -223629 -216492 -84305 23500 -25647
8368 -228051 -91246 40372 -91682 177844 118366 -45096 -212641 -237992 -100230 -68490 -74308
8357 -74308 -124065 175519 -347992 -316900 98890 253578 -105971 -108137 -112347 -30207 155732
8345 133238 -72741 -197367 158058 -34337 -167593 187845 194166 -270894 -142496 42227 114221
8334 114221 -48986 -189777 63164 436362 248393 63847 11067 -96555 -147056 220147 -205381
8322 -158798 225149 -285479 -45790 125144 -114369 -162622 -194443 161616 -176156 21695
8311 -9710 42221 -187425 -36394 -24826 -91256 -36622 -90123 -91054 -346222 -232219 -107720 -307904
8299 -307904 -339396 -77403 -182516 42395 -104145 -11154 -256262 -74060 -159328 -155603 -87361
8288 -87361 -217933 -287507 274452 -17850 97786 -173495 -303064 184302 -31190 -226783 -5739
8276 -125797 -208543 -64240 47948 -366677 -33134 -116656 166282 -118378 205065 -82607 -60791
8265 -60791 -44736 11247 -12768 249883 315699 5357 158486 -112863 70335 -78241 -320387
8254 -320387 31300 -82588 -94411 199011 38174 79931 -130793 -24014 207101 157242 111461
8243 111461 51348 -51430 -116237 -222939 -4946 6865 -137480 -163247 -490776 82111 -105200
8231 -76247 -133417 -29235 -11075 53623 49998 82829 -13115 15089 -37960 50497 -398574 -223288
8219 -223288 -148455 -56210 -335733 14747 -68097 -228309 -425633 -307369 -203498 -314762
8209 -314762 81351 122989 -316049 -118387 -32342 -32011 209045 -141114 -232556 16032 17321
8198 17321 -272488 -12112 74254 64403 244378 251835 -69621 -115309 -25683 -199782 -183166 282558
8185 -200361 -194424 187748 15358 118166 -132510 -142972 28404 -105855 -204600 198040 -58402
8173 -165624 131918 119291 -128212 -149457 -126985 -97190 287368 -136718 -81296 162588 160187
8162 160187 -102305 -109651 14673 -292372 -102301 163300 -366154 181203 -18911 71537 247578
8151 247578 -334831 403765 -19731 77579 46758 -174003 106285 48117 -175880 -171944 -269005
8140 -269005 143847 -334603 -148345 -251203 -221177 -30497 -83580 -424424 -55486 63463 -81303
8128 -142417 -140286 -124682 25388 137416 -113591 383382 58744 -279535 -1632 96404 38340
8116 -43899 71926 -29141 73532 -345974 -209063 -37952 -329904 313731 75458 182524 -61095
8104 -152957 -27702 80886 -127222 129974 100809 4538 -70551 -94249 52612 1886 91714 -195100
8091 114781 25692 -241936 -62095 25080 -138447 145947 7787 16971 -233256 -24609 -288371
8080 -288371 122325 -5633 -337616 73806 -240778 285728 -30826 -7952 -131939 -136938 -171348
8069 -171348 -229270 -123117 -4044 246297 97981 -26397 63525 -18378 122236 216107 -24998
8057 -66211 -216981 236335 69888 -68512 -42857 -58368 -392259 -161731 238163 -65956 103531
8045 -251531 227741 -209745 190256 -107798 93829 90049 -73779 -378995 51869 -163002 -30695
8033 387155 -275812 -100121 23425 202855 78414 -16774 -109805 -65764 -7919 135246 -100901
8021 177209 156746 -59068 -289450 203735 -245239 -534624 378023 39438 -97112 -241461
8011 -241461 49781 265656 -224317 -193607 -269681 -147914 -228023 -317683 47462 -77793 -7059
7999 -212301 36625 -298204 -96938 110281 168377 61907 158413 -41151 -463306 -360944 -323729
7988 -323729 103716 107512 -141819 203151 -222216 -327868 -106298 15728 -166488 -175814 -114077
7977 -114077 49859 484206 -11151 72345 -209951 53169 -312499 273808 -77420 -323458 -224638
7966 -224638 175744 64815 252256 -18610 -82033 152398 -93703 7969 -47791 -119360 119834
7954 7587 -59127 126325 -59267 42291 -44823 -86196 -218412 22654 -194920 -339496 -61532
7942 -10682 65874 -422217 202085 -31970 -224732 -403622 -8303 125122 -279271 -72041 -156347
7931 -156347 246242 62932 -482891 162445 -105395 -48283 83764 140543 -119770 -8744 151056
7919 23648 158013 -76323 -92521 14851 251407 145911 -179231 -286298 -173173 -236113 -81097
7907 50224 71100 -76353 -287549 139657 -32608 -91700 -78330 -198303 -111706 -420116 -184541
7895 430655 -86020 41253 132655 47476 280497 199576 42792 52322 125707 10278 -109105
7883 -58537 -60039 326578 214327 -37405 289999 -34801 -90398 105750 202699 -517 -116036
7872 -116036 -134141 92687 163809 12335 54683 28498 125464 -103695 202377 75998 48083
7861 48083 55574 -84632 231048 -117754 -47456 -172858 -102276 13221 60801 111827 -104673
7849 -197432 -260640 -209328 -16574 -76463 123288 121372 -295120 -253701 -170128 -67529 -14312
7837 -373017 -24435 -334175 -74367 55793 109235 -232871 -129298 -124683 180871 160402 170177
7826 170177 -209596 -305047 -124943 -91755 -76430 126467 -55752 77961 -55549 -201057 -39797
7814 -338853 -246308 31811 255487 54046 -208285 5115 -120583 -52412 -99773 -134172 -132568
7803 -132568 -191905 -60482 -102411 5437 -86465 -158485 -63808 72917 -231962 106183 -192251
7791 -95741 224286 10218 -144862 3940 -151652 164823 -125256 -52496 115032 -178966 -11729
7779 222255 -108221 82432 -96515 -373204 218596 -333362 -131708 -191650 -86856 -129081 -173242
7768 -173242 -23900 -340124 -131392 61784 130173 -120737 247428 -32157 167953 -238439
7757 -214794 -34921 231933 399157 -229671 -100800 -62102 37882 -24610 4110 257410 -173436
7745 19007 136179 174837 -356378 -275229 -44275 -33009 56597 41346 68467 6061 -370202
7733 -173495 40882 287471 128361 51917 -61042 -101953 78691 -181323 330780 -118118 118235
7721 -43016 181397 -15593 -15683 -131743 -64337 -7 179849 93748 -39039 -32524 -87850 -41995 68146
7707 394845 -16131 29428 255433 -16980 86642 28071 -61368 -246667 143028 -146336 -103225
7696 -103225 42200 132291 -226283 -92219 -131668 -106469 -266562 -123261 -16171 -385232 -76581
7684 -301245 -26253 220811 334059 -21121 -288672 -215734 -10578 -177787 164406 -208876
7673 54992 207181 96329 -76228 29500 268168 256721 -47600 136561 -124102 -122137 -186038
7662 -186038 -93093 -282862 -97747 44242 194119 -88100 -221530 -42585 390533 -54870 257566
7650 124441 -152263 -421106 -199437 -30558 -3747 85673 -296989 -21040 190213 1018 77791
7639 77791 -22880 341543 -183948 101031 -210706 -91761 -269807 94588 -150941 -155139 -108053
7628 -108053 -31122 -109264 -291306 -201516 122966 23579 45459 240738 100182 -168516 2865
7616 -67417 -75652 472847 -151239 -12528 -12335 -25922 -28435 140776 389633 140310 18185 -151688
7603 -190710 -95635 -214661 -84073 -419339 -133141 -320356 -146079 9066 -107197 -72092 105706
7591 149861 -47422 -202158 -280038 -255761 43398 -51535 -179233 -18417 46080 36056 -111481
7579 212067 -328553 -113786 -20291 -55148 -221092 231978 -211578 42079 110139 166757 222584
7568 222584 -23567 276623 3074 -226285 -371183 -180582 -125182 87595 -275706 -162037 -166490
7557 -166490 225988 -228452 157733 -56840 166585 42718 -87901 274835 -124653 254390
7546 -51537 89278 -308165 -350924 387930 -252739 100800 170742 -9394 1606 -99139 -274744
7535 -274744 58357 375111 -220437 -324552 -196941 -162013 -294862 189730 -236904 -114474
7524 -221751 -29166 -60544 443063 -58337 1287 -312247 -324076 -184750 -134164 218969 -109997
7512 6460 319862 126479 -275573 148578 1050 -287713 -41543 -87090 267502 -45971 -91484
7501 -91484 91847 -206049 -58300 -51222 283377 -92072 36557 -3540 -250343 -219882 37079 67850
7489 67850 -207995 -66471 -211297 -108738 -271367 -285131 -102041 -83489 14296 -105487 -71099
7478 -71099 78876 398581 173318 135255 -101088 -137924 -38034 -101191 -28986 -134245 -58978
7466 170285 104754 -13326 281589 -259910 -94856 -91177 -193749 -20892 -82044 -83807 -300166
7455 -300166 93444 -59354 235420 -98545 -240314 -11930 119277 -96254 245930 -96573 25394
7443 -343653 -213096 332519 3663 -285062 158877 290474 -256995 -208700 -156889 -291494
7433 -291494 43694 45407 -122595 -191321 1891 277653 -112808 -127243 -175247 -129170 6049 81402
7421 81402 -81909 -121799 -103426 27493 -68354 -24644 -218385 66246 -547712 315839 -10367
7409 238546 -202794 251246 -17131 -364380 -88294 -11172 321418 -7682 -394303 -25685 56686
7397 -1025 -104586 -102983 136511 80899 106963 12984 -163120 -461120 193967 271386 214273
7386 214273 -354195 27342 43214 -80302 -6051 48226 -30066 498455 25911 130227 32641
7374 199931 136190 -50021 -30236 -36937 -341355 -74400 239398 -69562 263789 -241271 376294
7362 -76143 -183775 -295931 -180287 -54333 146103 62665 -48237 218878 136702 -72541 -158027
7351 -158027 38599 -118212 -178171 21631 380751 -105079 -148699 105878 221113 97649 113603
7340 113603 48303 62788 -225387 107620 -113642 -125073 4748 61333 -204985 -6877 -128161
7329 -128161 39161 -241454 -72339 -276758 73531 -132226 5913 -26198 -139891 -204574 189694
7317 -30254 70872 427640 -54842 179671 -58779 -41071 33320 -178614 166464 -96080 151143
7305 -15103 -147784 28966 -63706 167790 -128987 90420 -185055 170448 -21276 -28697 -99442
7294 -99442 -97631 -25080 -58254 81780 -315080 -91270 -139962 -144638 -132 102955 -77190 36123
7281 -59268 -7651 52867 -120845 89083 -72839 -133082 -110598 -70647 -68644 15360 215100 88493
7268 -100575 13884 -83298 336776 -26726 -180773 114 -18248 96719 -204154 124057 -230676
7256 54889 90523 -157579 72972 -177605 -359503 -131004 -42451 -276260 9152 -239704 -112706
7244 72053 -268054 281906 252192 -188002 52859 75682 322892 15178 77245 -27376 -75900
7233 -75900 -2918 -434051 -334627 162228 213121 -262019 107586 3626 -156614 -108906 -84967
7222 -84967 -65175 113545 -11254 -114407 -149341 -69287 28269 -102617 72526 29480 38831
7211 38831 103179 40592 119963 -50575 -349000 -277140 -86836 133159 -60151 91393 54217
7200 54217 26959 -85272 167540 -126778 -19769 -126668 -57562 116510 -95393 -23755 176051
7188 -27179 112009 69635 -34539 -191498 102944 276610 160472 33237 33682 -396479 -228653
7177 -228653 -60273 91650 95834 -57900 208147 -216468 220072 287288 -93054 -93891 36855 43820
7165 43820 -134166 -46562 -6761 -285526 25774 146894 -133625 -401185 -11506 67234 -203967
7153 -225169 -57942 -353 -162786 -52759 357268 98092 -84163 -178830 31651 66198 -54713 65823
7140 32691 -227682 72532 -74849 -64896 -352374 -119796 29618 -347698 67725 -205949 234300
7128 173814 36261 10597 -190457 -85582 -97555 -15903 45855 -21013 -189497 -4844 -234239
7117 -234239 -16747 -321262 -159393 -262756 320279 158361 -397286 -18412 23730 -51531
7106 61406 -226875 -56392 -299550 -133156 198937 117146 -40931 125272 49686 12349 -294726
7094 314563 -136963 -163667 -124776 -121846 -144845 57706 -102829 -89338 85439 149507 206145
7083 206145 47017 -265634 303232 144583 22281 30045 128446 -143633 -41520 128430 34750
7071 144460 70706 56393 -142424 124344 -119554 68990 15943 -167214 -104660 15961 -259447
7059 -199040 -172902 -106212 257090 150314 -65642 120012 98675 -239895 -278906 -83774 -214458
7048 -214458 16199 -293962 -131112 151886 -64698 247962 -2288 59373 357555 -486037 -293680
7037 -293680 40955 21475 -71869 -115250 -5128 -183669 -6462 8043 -68097 51781 -422480 -258883
7025 -258883 178408 83882 -22132 78135 241676 -19258 58682 84431 60261 -66933 -62311
7014 -62311 124925 257427 35842 46859 182 72182 -116302 -184488 -64337 415093 -210373
7002 150426 -8345 -363961 -132393 -107175 362910 -384835 -249297 -380076 -3158 -338169 231804
6990 -37623 -11378 63798 -265048 -208481 223271 172233 -361067 -128944 -96912 -157788 217812
6978 -11102 379216 308716 -125687 -86373 -3420 -86143 -170624 55715 13792 -116742 -107457 151049
6965 192152 -113334 79049 -128574 259669 134175 183532 -75516 238373 -229453 79935
6954 222035 37441 376755 -37502 -95125 -368420 -104894 113054 172615 -17791 -180219 -312953
6943 -312953 -62582 -458215 226842 70063 -181703 105484 -14441 231068 -65192 -259047
6933 -259047 8170 -337319 -179187 175552 -73751 -177974 -146661 117970 23243 -146342 331601
6921 -71630 -60174 -264193 235376 32570 -196872 166495 -42056 -74109 -66765 -129204 -85347
6910 -85347 101939 -142726 78338 72618 55551 -30996 -27082 211402 135148 -65544 -148678 96553
6897 212915 12051 -93675 -27754 -105601 252177 -57837 -46069 87841 156415 88227 -20985
6885 303661 -127193 -114117 27606 -113215 76242 -57136 116932 189605 -63713 227496 162700
6874 162700 -47612 -33834 -47819 28346 -166843 32126 -103854 -185293 -5475 13008 9418 -104834
6861 20860 -44583 -146974 -393362 240063 87678 120378 -92621 7897 -45218 147948 26157
6849 43668 29105 -317225 399972 -226414 -273745 192493 -195645 50923 -211052 -143884 -64064
6837 -156239 42859 -423414 -217682 -119718 -131936 89238 -92169 61211 192447 136578 112749
6826 112749 264192 -95669 -51120 153830 -4716 -5083 -93384 47680 -72387 142768 179818 -218257
6813 -141922 399317 -124512 -100206 25609 -160770 -21244 -92203 -374684 -77773 207452 -38157
6801 1187 -37161 117276 -12770 288309 -236318 -290410 -128075 -83153 -11582 56770 113756
6790 113756 254896 143618 -82344 195246 -56892 132607 -82034 -69877 -110735 -251353 -13938
6778 71557 -80090 -125075 39076 -258537 -122496 209170 -7404 -50738 39919 224422 160953
6767 160953 -110443 167370 -498187 -203103 -186887 98793 -23136 -96352 94774 -185734 -31503
6755 211196 272351 -121229 135995 163966 -384569 227577 -124653 67680 127998 108150 -286330
6743 101167 177351 -190492 -137611 -135349 -122409 -60725 11793 -240667 146463 73156 -141073
6731 113374 -106246 -130602 264786 28336 -30010 11867 51192 281136 -186394 55253 -379728
6719 -268530 244161 206101 149842 -328384 327771 -70096 -126446 -53081 -106220 -115565 127581
6707 -178817 262224 -133448 -142342 238972 16443 -110505 -206593 206518 18731 352821 -304812
6695 -112801 121020 247553 -161367 56871 -77329 -212454 226820 180151 171670 -53389 -136167
6684 -136167 23821 -159801 9365 64691 282919 -229857 27412 -371875 39631 261468 -394673
6672 268569 -71221 94492 246856 -256334 254917 -249183 57845 -65233 -150372 174726 -128079
6660 -320225 -274410 -44234 275465 71896 60118 -251784 -309652 30761 37860 66292 -387023
6648 113149 2662 124870 80990 159318 -278726 -123563 188154 190763 -12899 36605 -123535
6636 112847 -304349 -3149 110608 7267 -160711 5406 92772 265448 273343 -169728 -3306 -79033
6624 -79033 -463822 -3832 36452 100459 185330 -90877 14101 89923 -103322 14802 -202882
6612 -28913 210138 -55914 -20151 -56040 168608 -102185 84135 -111809 15843 -446051 282748
6600 -91292 128543 183241 5775 -24117 20753 51976 163820 -151256 78369 -16844 110124
6588 -157371 140039 112193 56331 88091 429090 61081 119158 -76820 -124895 17820 -245628
6576 12435 -182365 -488823 -266652 20838 -110893 62723 74351 103104 -210957 -154456 -358407
6565 -358407 35801 285225 -31154 -154884 -326981 142606 37381 -124223 4948 -212081 -196742
6554 -196742 84571 -150379 65230 52808 286237 337878 -642 12524 362925 120381 24437
6542 196029 93161 81129 -212632 -216366 -52404 86437 41540 53098 1427 188082 -37498 -146783
6530 -146783 -73992 76488 -136910 142081 237342 -114619 -365369 -87138 115186 56410 -37262
6518 2386 -49552 -68820 414651 144772 -243239 438677 -358169 132319 -106299 11784 -64930
6506 -66020 -174323 -80355 43757 -8171 191772 -272526 223445 -247397 -10619 85119 -149813
6494 96133 -197449 -135355 -52670 -41064 167523 253129 145194 -139652 194635 6202 7617
6483 7617 238967 181377 78341 -51114 -260929 -81310 -16743 -71126 59373 197950 191296 -58307
6470 200857 -245188 -111495 -113864 -227163 178386 -92033 -136558 -178926 -22258 18927 37247
6459 37247 -52379 -52686 199717 -256748 -402011 33352 -60598 -177168 -67283 -11051 37521
6447 309431 -3255 35609 -97554 43009 -41201 -169570 296034 96464 -28538 -152298 -17376
6435 -116107 -116991 -163869 -482163 15428 56508 -187742 -13491 -38497 90768 -171990 -155481
6424 -155481 86414 -221193 172684 134745 -72526 -39158 -147581 193364 258234 -297767 -147147
6412 355777 -70406 102244 -25657 50900 -157980 236025 -50856 -120162 97693 -91140 -139042
6401 -139042 91047 -241659 446892 39559 26723 -88793 -174116 72874 82082 128312 19661
6389 217767 -178051 4525 -2951 89023 46440 -97705 -98955 65083 154139 -224560 220612 145865
6377 145865 281469 -71153 -107930 -19573 -175273 279385 -9316 -72189 19135 143728 104250
6366 104250 -131614 -18571 219285 -83955 119228 341803 -232817 -235059 -198024 -179147 -23480
6354 -146323 -219296 150227 53642 176450 -247731 -75026 -253830 4524 68986 -105848 -191616
6343 -191616 157322 -143480 2767 109440 -81091 -121740 104171 -110783 -111444 439653 164117
6331 -162191 362067 103820 -120809 -35565 -120825 214722 -264992 -2637 432784 49600 16034
6319 -141283 -65494 248483 -154227 404053 293794 -177151 -22194 25461 -107082 -127041
6309 -127041 83160 94692 -35170 -22696 151494 -50110 -326885 -506710 282509 -128113 32961
6297 -96923 -7836 -169380 6721 -151424 4348 85283 -79188 -216272 133463 287609 153765
6286 153765 -78612 7196 -126239 -207883 -203596 -46104 -270577 273492 301113 -50089 19515
6274 176892 -166913 573412 14108 132088 145821 16635 -27548 -97356 -52068 -217998 -34804
6262 -151192 77986 76988 227488 -141740 78071 -42949 175060 84982 -251188 27844 -354489
6250 154805 -167914 -212826 -17761 175313 -30353 191614 -244760 -40597 314779 22559 -246389
6238 -29716 -71091 80166 -103668 -382481 -198517 306768 -171676 -95281 165162 46659 -257421
6226 -207909 -219329 -253725 65436 -416660 -106284 -15771 221343 -236004 -16880 85827 95664
6215 95664 220625 -138910 -47154 -285179 34633 65178 237552 -68950 -27728 17393 194853
6204 194853 131538 223927 25473 77271 504102 -19087 104370 203859 -263607 -379466 112095
6192 -205455 -240010 303492 -50272 147191 73947 -60308 -136350 -11960 -57027 185462 -20604
6180 379943 107455 66155 -17680 -192742 -10176 103187 -139512 -362930 122621 29602
6169 270598 -81422 237170 -164801 75416 -41410 -97355 190435 171888 -175574 -36127 147190
6157 21462 78235 -68743 -85354 117181 -145935 266872 37837 -78757 -54837 507239 -24621
6145 33235 -46403 4314 -238144 -39488 -222174 329512 19666 234709 84974 -8498 8992 114945
6133 114945 -210745 192707 -121584 8339 170560 -74569 173267 11200 -116984 -67420 -234798
6122 -234798 250911 -21847 -5178 108655 196624 57371 -129249 153431 213791 437970 121210
6110 86652 -165231 110879 -30684 -150807 -131645 62331 28594 -84188 232624 -290799 162687
6098 207635 -61057 81369 -183606 -124447 -95000 -61344 -53613 -126481 -26370 80963 178711 141910
6086 141910 -90801 -23577 -95632 231274 213858 -82449 337260 128670 124193 -208626 -218535
6075 -218535 91652 6735 -47995 -246109 -41073 155719 -300594 -151450 -172423 200808 104057
6064 104057 74255 133936 256938 95596 -292735 86075 93077 -95106 101553 -132374 56156
6052 -75837 -3495 41003 15674 65530 -345236 31368 191621 301084 -161102 91674 -119075
6040 -119857 215479 -334814 -78620 75329 -104969 77745 -94608 -92519 371229 -52892 155208
6028 100051 -121511 -295112 39304 -129534 -72579 -264125 -180321 -252456 149492 26421 -28037
6016 -99436 204457 -111503 178623 -39825 -138102 127681 -294553 -138410 185237 -252920
6005 -37498 -340932 -214852 223301 -56381 -137783 -258850 16692 -163102 77116 -22935 62496
5993 63976 142501 118726 -20122 235600 15722 253896 -39729 20197 -159701 263291 -147404
5981 86294 128982 -8072 -148759 -46419 -29132 117368 147102 108201 -153643 494394 -30281
5969 35144 -98314 155510 183439 -126789 -223501 -121469 -103632 -182538 46722 143603 81300
5958 81300 211968 3576 -240321 -181205 221801 55234 -177270 26912 -217364 134694 -76964
5946 280108 245292 80458 13702 -21250 206060 -142599 17377 -104892 325749 268557 -80505
5934 -217817 88132 -64440 -12829 -136873 73846 219197 65101 284927 219506 -126300 -73888
5923 -73888 41971 -203907 74227 106428 -13585 127262 30001 20545 138814 -196400 -171377
5912 -171377 -301249 238969 83556 120707 83388 -22495 207765 -153586 -20541 26805 -196178
5900 -196380 231143 302318 285641 14912 -5012 -255037 -32751 -103201 -138496 73043 -44307
5888 -245761 58374 152007 163418 -301253 8261 -1322 -12615 -144692 73195 -261762 -140862
5877 -140862 -8943 131327 -14171 -275785 -152893 -126540 -38440 -147123 -54168 164842 48215
5865 -297094 159384 83399 -241255 81676 -72960 57261 127828 178978 250659 228221 257644
5854 257644 387860 -35656 -149452 356825 266910 -44563 46723 -10882 44437 -72844 183045
5842 177669 -51035 118866 -107866 -90236 -93451 91482 -335887 -179575 -64575 -224625 -71897
5830 215442 247561 150820 122873 128707 -273818 59882 165138 13305 -47835 -156714 176611
5818 -284750 236825 -393501 -206749 -189173 -71221 282011 465199 -63331 -246817 181080
5807 -58148 248101 -163169 300952 -283283 120628 146677 120714 109403 13049 -148998 -72799
5795 143398 -4693 119593 -117637 48861 14248 -20868 51043 -195534 -107650 227286 -34947
5783 133481 -109266 -358085 -94693 -100065 53185 -292443 23134 -289433 -65049 -198506 139762
5771 -187964 -152378 -156948 35217 -112288 178251 -76550 -143456 89048 38769 56393 -202898
5759 -17657 22313 164884 230900 52805 -209297 124106 190729 155195 -72832 4879 -99574
5747 203697 140456 -10541 128880 -157360 -66463 516869 -67853 130002 18696 275256 129837
5735 -177313 -158730 -65656 97112 154754 25893 84955 273409 -74043 139386 216895 -87276
5723 36758 -22668 216258 -45200 -184305 40761 -34313 111648 165962 73013 54706 -123146
5711 -140641 171444 38418 365120 90118 349328 -45034 -105965 172755 294489 48639 -7970
5699 -48948 -324676 114422 256943 86916 -234657 -135619 -124673 -103560 222562 203933 -233648
5687 237445 -74593 -99681 -176194 292855 -152023 -74984 -35883 26935 -210936 257911 91540
5675 164725 -116536 -38950 -5857 -8740 -184939 -185201 178028 169751 118393 -319478 160738 -28220
5662 286437 -155142 140268 61894 -193486 12520 416167 277706 -239921 -253842 -146073
5652 -146073 14581 -193075 -186325 -121461 84223 -130743 -154108 -300380 63119 -31124 -88510
5641 -88510 -48424 -257342 -280264 -227288 -194168 -118887 294887 -26728 -77559 32015 5746 119774
5629 119774 -8949 -241563 129095 116511 -71734 128593 7701 64117 173181 111805 -309187
5617 275196 -3196 -366901 -174270 106348 -555947 34514 268738 -70197 -138022 227344 -3311
5605 -54528 -212588 -247986 419029 -154162 319809 -22496 -263783 69430 98355 210027 -81283
5593 133085 235253 -100818 -71888 167528 75465 -77859 -58161 266337 -82286 -37330 -27632
5582 -27632 134132 -131432 28267 -285590 -114549 -3041 393 4146 246704 -220572 40518
5570 -124184 272869 136737 227532 -113614 114178 106537 63063 -126292 -137416 -187953 -307826
5559 -307826 -40099 -248066 184815 -89054 -92706 240446 -251429 111427 50953 -101518 -176556
5548 -176556 176849 141105 63076 403216 304107 182832 48396 -215099 185950 -182833
5537 123465 -5555 83260 292937 276588 152362 23832 -32807 -95492 -49509 21077 -90113
5525 -53870 240408 -136271 -29048 279771 -317240 208312 -11450 -14274 -60906 -224734 -166032
5514 -166032 -421518 -38979 136760 139364 30764 98385 169231 127940 -22068 76887 -121146
5502 146039 125110 98602 -214337 46050 -4293 -206554 334375 -40954 -141848 116909 -1089
5490 213309 -48327 21861 -36970 -107913 267970 102838 217415 -14961 201457 8388 24865
5479 24865 200159 -49316 146109 73144 -193082 -26592 -171805 370408 17891 -226040 -72342
5467 -21549 -116249 134647 72106 242007 -77463 183133 159804 228621 288304 30660 -144541
5455 163203 -171905 -114298 181966 -37917 407549 263079 -182218 197264 306170 282907
5445 282907 10737 -90554 33331 -190373 -30513 -100665 -258074 -122069 -114875 -107541 179018
5433 -138681 9606 115501 125561 -44001 218988 -21408 78090 -132855 268217 -240612 68458
5421 -122123 78289 501 33189 159632 -341627 33090 43479 244950 71691 -267287 -295340
5410 -295340 100422 -181391 173408 84639 -67776 102469 -50914 -46040 -67765 -90844 -298892
5399 -298892 -58584 130132 192410 -26183 -51512 -319032 -840 -105156 205926 55975 335784
5388 335784 201859 209938 -169973 37886 32170 157265 28849 -58458 174294 -41289 -40040
5377 -40040 54023 -272634 -77965 41447 201868 373410 92876 497469 -84580 -28090 -214584
5366 -214584 127252 148191 262619 22993 -39437 211871 -72300 34600 -94441 -423435 156636
5354 193449 138234 -188270 -153051 -141527 64212 -86785 -79057 100997 193675 -162214 -61903
5342 59596 216817 142393 -89888 -305393 -47441 26584 102315 -350146 -279407 116629 92063
5331 92063 -172497 60994 -206099 -82593 61138 73211 51890 44580 -24295 -75107 -345523
5320 -345523 283198 -132156 -172645 111145 57465 309050 -277063 -39748 18094 138125
5310 138125 14824 223210 126349 -101388 -135843 234656 -241622 58885 -387414 -157437
5299 341277 -102292 -22584 -220632 -25754 -3070 -57361 161415 -77988 -223548 126681 -100979
5287 21033 208191 151026 158099 -226768 -59449 -7371 -8830 213679 228774 -248265 297441
5275 77502 -136894 385732 83881 46366 141982 110705 129628 135651 155904 136266 -189689
5263 -253106 127452 56691 -211285 -99141 344199 63114 -80296 154940 -346425 -582595
5253 -582595 -255104 -34608 9284 276371 51636 -28003 23413 298127 254555 -140296 -877
5241 81407 -22588 -67263 41339 -190765 177251 58055 -182367 -45202 -94604 512854 -393786
5229 -217733 63464 173899 -99586 95311 -364472 -8402 259471 -49126 -144489 -143345 17265
5217 137713 60506 -139937 -216582 283996 142872 123346 399261 50841 49787 124418 184426
5206 184426 -117711 42813 -327039 -167992 83220 -152227 -340177 -116283 126066 -117379
5195 -150867 246154 94216 183166 338009 16538 56789 29867 -39276 55305 -192045 186242
5183 237999 -40940 -59486 -163860 -134943 235175 -116959 192102 52931 122903 -222608 24927
5171 318797 41123 -32586 200449 10736 -116191 135191 109642 71920 -99374 -152949 -34051
5159 -435418 109251 60962 42759 223387 343708 261963 32525 -29572 -110153 -123046 -511570
5148 -511570 -11858 4821 -95661 59745 105547 4536 14648 -90279 -91096 -186170 -135835 353590
5135 -235540 -83492 -49790 43458 -121912 -19808 -61950 -141139 105839 -95309 134684 -6538
5123 76920 -183246 -12850 142716 -56148 232084 266545 -219784 378567 -77872 265004 -80254
5111 -207208 -24465 -4381 197325 -130236 -187026 54552 341097 20227 -200348 155205 26134
5099 -130396 28392 -71404 -202499 -75805 -167370 -51058 -61417 -264484 279552 -14201 6246
5087 -124569 150918 23214 100996 -186159 65467 -117027 -220604 184652 -14688 -462457
5077 -462457 280913 -190442 46015 -152522 1656 3210 289242 39185 -43496 -156979 69823
5065 47273 221330 125137 9037 131492 -39865 148920 -23405 106548 73416 -80830 -139059
5054 -139059 -311387 -179576 -223678 -152398 224840 483450 -86630 -185320 180076 -214657
5043 -269087 244880 -72225 -222549 46026 11952 36389 -149238 54079 -196959 71248 111437
5032 111437 -34137 259022 -60963 -164724 -40511 260427 -216651 -59078 117929 -4797 43840
5020 -18201 537961 204856 -72394 86946 -201839 -86103 -138077 132260 -34841 -13614 183
5008 -94739 -124960 65787 -64203 -100298 208927 -26338 -145167 -105015 -120450 9620 145404
4997 145404 154506 -139289 128610 -106454 -97288 29233 -265394 77305 -201807 240676 -151881
4985 -154412 156094 289834 -9272 -182124 18711 283232 77410 -37120 -56951 162995 5492
4973 27229 -12034 37520 74903 -15998 -31078 -111235 -93333 10499 15622 35393 183296 -36352
4960 83836 58692 82833 104049 -57022 -138475 -63566 -4731 78686 -115900 -172278 -142805 38360
4947 -234475 -135421 -207054 20656 497993 283202 129686 -190331 -217389 71913 -269030 -94824
4935 -216313 35892 111235 24619 -11031 -249808 -156495 196244 176115 66705 -242683 -115097
4923 -92232 184010 178519 -33863 -13144 -50832 -96480 -10495 -14834 80279 -115915 -199289 -93198
4910 97110 216822 154228 -13475 -55335 -307440 -250296 29660 -88492 -35456 -72038 220314
4898 -103750 153235 53010 -94316 216937 46138 87538 -40274 -85600 -338154 -54024 -200102
4887 -200102 96286 48751 104137 157219 170901 49213 -56711 322158 1523 149306 -44751
4875 -209646 44414 -91885 10831 203547 41557 -179055 66478 -11502 -36055 -211684 350383
4863 155748 106749 119871 -188126 -252714 194957 -58492 -29618 246744 -154730 -56175 43595
4851 -198379 -167843 43681 215568 207862 -181858 -186143 -222513 22760 429444 66742 84453
4840 84453 -247635 309350 -182853 58462 21842 -393950 189116 -44784 58469 231893 -83231
4828 -52435 -49968 -96833 64706 269910 -14175 117474 -108878 119438 -39186 115945 115311
4817 115311 149464 176245 149577 -170254 -91766 -61371 -195205 -21550 -56095 -46643 374068
4805 66817 4858 -2848 32452 -23230 -188319 245662 271701 -226266 86810 -90306 -44157 -5492
4792 122392 258819 60742 -69862 141869 -60750 55180 -17797 -128680 45920 -74425 64308
4780 39920 -168390 307674 489 13953 233702 203048 -168223 -202939 -265213 17945 3676 -17229
4767 -129355 65836 171649 -75594 349787 96727 202439 -135255 226117 9199 83755 -29801
4755 192333 -131871 72248 164560 -95785 -27894 165845 -62961 -147267 22084 -24536 -274841
4744 -274841 90546 -177646 -48457 -11061 83196 -13434 53594 75928 -2991 -172475 43866
4732 -103488 71681 39782 -69124 213153 -122202 38799 -209843 -144674 -123276 -165919 108032
4720 193327 209618 -151771 203817 -35411 175909 52006 -168737 297820 76085 117859 44620
4708 -135202 2996 97514 -100371 -51383 136654 -107610 -270815 98843 -81109 -24863 78349
4696 89872 -68436 8911 61043 18815 -67655 141652 232750 -73038 84739 -123027 190479
4684 40276 240536 -35960 -434239 -21150 -176746 28398 19892 -266091 12906 69731 48995
4673 48995 37910 89613 176557 124273 270774 18682 125232 110990 -49156 98297 102360 230234
4661 230234 -18191 166739 -310230 278204 -94584 58333 -37399 -140529 164014 74490 -19242
4649 90178 -57894 -207434 -251783 217541 -6770 -85459 255568 291039 37992 -291546 231573
4637 -124385 -16824 -135677 353782 70860 169676 -92199 -132882 278491 -125166 -213647 43914
4625 184240 227462 -139585 41041 202464 -55853 -232425 141373 191881 -48507 -213645 -134632
4614 -134632 -132373 20059 373030 213898 -197863 234039 156274 -21595 129194 324286 -46792
4602 -54468 96493 -165912 229058 -97922 -48921 -78700 82446 262766 174171 -205782 71223
4590 249206 210779 153251 -160897 145849 92478 -169842 55940 -149143 124963 -119464
4579 -193355 313885 -88547 -56419 55819 58327 -368241 -66465 -199825 -102614 302707 -247259
4567 27516 -28154 169122 -100426 -17927 79516 -368630 145624 79659 74460 108578 79585
4556 79585 -148281 -18678 266971 -97708 87266 350574 231484 88785 92030 220163 -103024
4544 74084 8381 -189819 63318 -242681 -211416 106757 -284402 -134242 -68003 120488 345684
4533 345684 276764 -76275 -94112 -169623 118834 97659 -159311 -138970 -60536 87038 13144
4521 71001 -38140 39882 57497 203246 -527813 168621 -77888 -15108 -203156 11265 -158274
4509 110277 143066 -130773 -17076 327287 195706 83125 194615 -417760 15608 124405
4499 124405 539 207812 -127109 -225342 135606 -313743 -96225 -239305 103984 110189 -115125
4487 26071 125888 -63086 -98546 -35241 120368 312240 -91153 97093 55022 -20733 196374
4475 130513 -114289 162415 -166960 51483 -115671 -211548 235023 -205574 149780 159109
4465 159109 -248848 104749 46575 -36011 117966 18819 -45805 69724 -55758 -10255 -267608
$$ [...]
##END NTUPLES=NMR SPECTRUM
##END=
