
##TITLE=AC1204_BRAAS12063_6528160_YB5IYdtHLw
##JCAMPDX= 6.0         $$ Bruker NMR JCAMP-DX V2.0
##DATA TYPE= NMR SPECTRUM
##DATA CLASS= NTUPLES
##ORIGIN= BRUKER
##OWNER= Administrator
$$ 1.72 TOPSPIN		Version 2.1
$$ 2012-07-15 10:33:41.671 -0500  Administrator@TOPSPIN
$$ Compression mode = diff/dup
##.OBSERVE FREQUENCY= 400.02188249412
##.OBSERVE NUCLEUS= ^1H
##.ACQUISITION MODE= SIMULTANEOUS (DQD)
##.ACQUISITION SCHEME= undefined
##.AVERAGES= 8
##.DIGITISER RES= 22
##SPECTROMETER/DATA SYSTEM= spect
##.PULSE SEQUENCE= zg30
##.SOLVENT NAME= COFFEE_meoh
##.SHIFT REFERENCE= INTERNAL, COFFEE_meoh, 1, 14.98509
##AUDIT TRAIL= $$ (NUMBER, WHEN, WHO, WHERE, PROCESS, VERSION, WHAT)
$$ ##TITLE= Audit trail, TOPSPIN		Version 2.1
$$ ##JCAMPDX= 5.01
$$ ##ORIGIN= Bruker BioSpin GmbH
$$ ##OWNER= Administrator
$$ $$ C:\Bruker\TOPSPIN/data/COFFEE/nmr/AC1204_BRAAS12063_6528160_YB5IYdtHLw/10/pdata/1/auditp.txt
$$ ##AUDIT TRAIL=  $$ (NUMBER, WHEN, WHO, WHERE, PROCESS, VERSION, WHAT)
(   1,<2012-07-15 10:33:33.734 -0500>,<Administrator>,<TOPSPIN>,<go>,<TOPSPIN 2.1>,
      <created by zg
	started at 2012-07-15 10:32:27.140 -0500,
	POWCHK enabled, PULCHK disabled,
       configuration hash MD5:
       6B 1B 68 BB D9 2E 58 E2 7F 35 AD 54 07 DF 0E 41
       data hash MD5: 64K
       F2 36 D9 D9 65 52 FD A2 5C 56 6E 80 6E 34 E4 CD>)
(   2,<2012-07-15 10:33:37.359 -0500>,<Administrator>,<TOPSPIN>,<proc1d>,<TOPSPIN 2.1>,
      <Start of raw data processing
       efp LB = 0 FT_mod = 6 PKNL = 1 PHC0 = 0 PHC1 = 0 SI = 32K 
       data hash MD5: 32K
       7D 24 C0 B9 5E 4A AE 54 78 FD 05 DC E1 46 6A B7>)
(   3,<2012-07-15 10:33:37.703 -0500>,<Administrator>,<TOPSPIN>,<proc1d>,<TOPSPIN 2.1>,
      <pk PHC0 = 176.5942 PHC1 = 0 
       data hash MD5: 32K
       4C FB FC 88 1F 98 96 02 A5 BA 9D F5 29 1C CB A6>)
(   4,<2012-07-15 10:33:37.765 -0500>,<Administrator>,<TOPSPIN>,<proc1d>,<TOPSPIN 2.1>,
      <abs ABSG = 1 
       data hash MD5: 32K
       5B 59 04 56 E7 ED 9A C9 F6 7B 4C A4 0D 04 65 E0>)
(   5,<2012-07-15 10:33:37.796 -0500>,<Administrator>,<TOPSPIN>,<proc1d>,<TOPSPIN 2.1>,
      <abs ABSG = 2 
       data hash MD5: 32K
       C0 6E BF 6C 0C 39 91 67 97 5A 7B 92 B0 78 21 CC>)
(   6,<2012-07-15 10:33:37.828 -0500>,<Administrator>,<TOPSPIN>,<proc1d>,<TOPSPIN 2.1>,
      <abs ABSG = 3 
       data hash MD5: 32K
       A1 03 28 30 D2 26 31 CE C6 A0 E2 DA 2C A0 B7 E4>)
(   7,<2012-07-15 10:33:37.859 -0500>,<Administrator>,<TOPSPIN>,<proc1d>,<TOPSPIN 2.1>,
      <abs ABSG = 4 
       data hash MD5: 32K
       A7 31 68 67 90 34 D8 68 99 50 CE BE 54 13 C0 68>)
(   8,<2012-07-15 10:33:37.890 -0500>,<Administrator>,<TOPSPIN>,<proc1d>,<TOPSPIN 2.1>,
      <abs ABSG = 5 
       data hash MD5: 32K
       E9 B0 D6 B8 C0 58 0F 01 01 AE 01 24 A6 2C D3 2B>)
$$ ##END=
$$ 
$$ $$ hash MD5
$$ $$ 5F EE E6 C9 3B EB 7B C8 72 A9 4A D7 17 E3 39 E6
##$RELAX= 
##$RELAX= 
##$RELAX= 
##$RELAX= 
##$RELAX= 
##$RELAX= 
##$RELAX= 
$$ Bruker specific parameters
$$ --------------------------
$$ [...]
150 150 150 150 150 150 150 150
##$TP07= 0
##$TPNAME0= <>
##$TPNAME1= <>
##$TPNAME2= <>
##$TPNAME3= <>
##$TPNAME4= <>
##$TPNAME5= <>
##$TPNAME6= <>
##$TPNAME7= <>
##$TPOAL= (0..7)
0.5 0.5 0.5 0.5 0.5 0.5 0.5 0.5
##$TPOFFS= (0..7)
0 0 0 0 0 0 0 0
##$TUNHIN= 0
##$TUNHOUT= 0
##$TUNXOUT= 0
##$USERA1= <user>
##$USERA2= <user>
##$USERA3= <user>
##$USERA4= <user>
##$USERA5= <user>
##$V9= 5
##$VALIST= <valist>
##$VCLIST= <CCCCCCCCCCCCCCC>
##$VD= 0
##$VDLIST= <DDDDDDDDDDDDDDD>
##$VPLIST= <PPPPPPPPPPPPPPP>
##$VTLIST= <TTTTTTTTTTTTTTT>
##$WBST= 2048
##$WBSW= 25
##$XGAIN= (0..3)
0 0 0 0
##$XL= 0
##$YL= 0
##$YMAX_a= 509599
##$YMIN_a= -650449
##$ZGOPTNS= <>
##$ZL1= 120
##$ZL2= 120
##$ZL3= 120
##$ZL4= 120
##$ABSF1= 14.98509
##$ABSF2= -5.573092
##$ABSG= 5
##$ABSL= 3
##$ALPHA= 0
##$AQORDER= 0
##$ASSFAC= 0
##$ASSFACI= 0
##$ASSFACX= 0
##$ASSWID= 0
##$AUNMP= <proc_prof1d_extract_pilot.lims>
##$AXLEFT= 0
##$AXNAME= <>
##$AXNUC= <1H>
##$AXRIGHT= 0
##$AXTYPE= 0
##$AXUNIT= <>
##$AZFE= 0.1
##$AZFW= 0.1
##$BCFW= 0
##$BC_mod= 0
##$BYTORDP= 0
##$COROFFS= 0
##$CY= 15
##$DATMOD= 1
##$DC= 0
##$DFILT= <>
##$DTYPP= 0
##$F1P= 0
##$F2P= 0
##$FCOR= 0.5
##$FTSIZE= 32768
##$FT_mod= 6
##$GAMMA= 0
##$GB= 0
##$INTBC= 1
##$INTSCL= 1
##$ISEN= 128
##$LB= 0
##$LEV0= 0
##$LPBIN= 0
##$MAXI= 10000
##$MC2= 0
##$MEAN= 0
##$ME_mod= 0
##$MI= 0
##$NCOEF= 0
##$NC_proc= -8
##$NLEV= 6
##$NOISF1= 0
##$NOISF2= 0
##$NSP= 0
##$NTH_PI= 0
##$NZP= 0
##$OFFSET= 14.98509
##$PC= 1
##$PHC0= 176.5942
##$PHC1= 0
##$PH_mod= 1
##$PKNL= yes
##$PPARMOD= 0
##$PPDIAG= 0
##$PPIPTYP= 0
##$PPMPNUM= 2147483647
##$PPRESOL= 1
##$PSCAL= 4
##$PSIGN= 0
##$PYNMP= <proc.py>
##$REVERSE= no
##$SF= 400.02
##$SI= 32768
##$SIGF1= 0
##$SIGF2= 0
##$SINO= 400
##$SIOLD= 32768
##$SPECTYP= <>
##$SREGLST= <1H.CDCl3>
##$SSB= 0
##$STSI= 32768
##$STSR= 0
##$SW_p= 8223.68421052631
##$SYMM= 0
##$S_DEV= 0
##$TDeff= 65536
##$TDoff= 0
##$TI= <>
##$TILT= no
##$TM1= 0
##$TM2= 0
##$TOPLEV= 0
##$USERP1= <user>
##$USERP2= <user>
##$USERP3= <user>
##$USERP4= <user>
##$USERP5= <user>
##$WDW= 1
##$XDIM= 32768
##$YMAX_p= 475006184
##$YMIN_p= -688440
##$CURPLOT= <Network HP LaserJet P1505>
##$CURPRIN= <$Network HP LaserJet P1505>
##$DFORMAT= <normdp>
##$LAYOUT= <+/1D_H.xwp>
##$LFORMAT= <normlp>
##$PFORMAT= <normpl>
##$SURQMSG= 1
$$ End of Bruker specific parameters
$$ ---------------------------------
##NTUPLES= NMR SPECTRUM
##VAR_NAME=  FREQUENCY,     SPECTRUM/REAL,   SPECTRUM/IMAG
##SYMBOL=    X,             R,               I
##VAR_TYPE=  INDEPENDENT,   DEPENDENT,       DEPENDENT
##VAR_FORM=  AFFN,          ASDF,            ASDF
##VAR_DIM=   32768,         32768,           32768
##UNITS=     HZ,            ARBITRARY UNITS, ARBITRARY UNITS
##FACTOR=    0.250966925370066, 1,           1
##FIRST=     8223.43324360094, -97014,       -231819
##LAST=      0,             -10863,          -47202
##MIN=       0,             -688440,         0
##MAX=       8223.43324360094, 475006184,    0
$$ Real data points
##PAGE= N=1
##DATA TABLE= (X++(R..R)), XYDATA
$$ [...]
19536A16187a07476B46551a60733j32942B31243a14780F6358a65031j4064m4464
19526b23559P3044P0340A57012a64581I8230b08935A72395B7131a85398h5871
19515G5563g5465C2536a10152A32793J94383i1209k30208B904Q6422d9934l7074
19504h7008B77424I2484a58785N5095k14989B24873I214K9260J2499c17451D5577
19492b50539D9297a44637f9981j68641h9955j18277k1063Q6347A2996d6010A31886
19480g4729j23755C25526a54133N4684I6495e8961E4504e2373A25056b26465h4282
19468g083l2308R09l37813o5635a0124r2043I4766a85756E8113K47720a8403j65735
19456a84138p9554R925J09076j64887J18838G848f9025B9745b21916B7510m13
$$ plain form
19536 116187 -107476 246551 -160733 -293675 231243 -114780 66358 -165031 -179095 -223559
19526 -223559 -150515 -80175 157012 -164581 98230 -208935 172395 27131 -185398 -85871
19515 75563 -75465 32536 -110152 132793 327176 -91209 -321417 2904 89326 -49934 -87008
19504 -87008 277424 92484 -158785 -103690 -318679 224873 9214 38474 50973 -317451 45577
19492 -250539 49297 -144637 -69981 -238622 -89955 -208232 -229295 -142948 12996 -46010 131886
19480 -74729 -198484 325526 -154133 -99449 96495 -58961 54504 -52373 125056 -226465 -84282
19468 -7083 -39391 -38482 -376295 -441930 -10124 -102167 94766 -185756 58113 305833 -18403 -184138
19456 -184138 -263692 -253767 -144691 -309578 -190740 7848 -69025 29745 -221916 27510 27097
19445B7097R4548d26916a39054j8899B23716a44519j28413a23612A40325b6213
19434C3450b04472P5028G8194a47615e2523A45442k3302a93389i6625m21660E3025
19422C02151b75916I7986c04363I4427c8084A37093a88066A29056N0464c11356
19411e1851B2814a1819A63895D0417J56980b3187G2674b5024A26877j7080B4460
19399d4737A98112D2828c03656i3258A71768f7959A30513a50260d5528j28159
19389a73687A28567C5731K489J24735b11919A76928l5309b5122B3013a63004j09830
19378b72834A32702c82258J29693E5416J59013a48821k07036a74322j38646E9742
19367i2869H5818b03738A6290i4485M3792B7738L10431j48537d28623G8455N6764
$$ plain form
19445 27097 121645 -426916 -139054 -157953 223716 -144519 -272932 -123612 140325 -26213
19434 33450 -204472 -129444 78194 -147615 -52523 145442 122140 -193389 -96625 -518285 53025
19422 302151 -275916 97986 -304363 94427 -38084 137093 -188066 129056 179520 -311356
19411 -51851 22814 -11819 163895 40417 197397 -23187 72674 -25024 126877 109797 24460
19399 -44737 198112 42828 -303656 -93258 171768 -67959 130513 -150260 -45528 -173687
19389 -173687 128567 35731 38220 162955 -211919 176928 141619 -25122 23013 -163004 -272834
19378 -272834 132702 -382258 -252565 55416 214429 -148821 -355857 -174322 -312968 59742
19367 -92869 85818 -203738 16290 -94485 -50693 27738 338169 189632 -428623 78455 135219
19356A35219c1800k5785k71018J42002A07582h2101K728k12186d3964A29854a99882
19344b53154J20978j28138M585N7920D9493a76969L8692L68L458A74375k9597
19333A44778n4523e6511l32468a36258H325a58206A4873K4139Q2810b08057R0596
19322a17461l1151A03542l3261b31347d2104j42364g4359m7934e7109j41139O0677
19311a37571b7339B07400B1854K38606a70193j52300f6851A95980a14301A52472
19300C4537i9907M0039r0349B9053a00619M9849r9113I9057J05935e6585Q460
19289d8125p143B96283a71456K8234f4242j79673J2433l2230J01134e6561C3335
19277a74026e6144i599k47162A46373m0973J78053j06059n7945a34043d5896j62236
$$ plain form
19356 135219 -31800 -57585 -328603 -186601 107582 -82101 -79373 -291559 -43964 129854 -199882
19344 -253154 -132176 -260314 -255729 -197809 49493 -176969 -138277 -137909 -134451 174375 144778
19333 144778 90255 -56511 -388979 -136258 8325 -158206 14873 39012 121822 -208057 -117461
19322 -117461 -148612 103542 70281 -231347 -42104 -184468 -74359 -122293 -57109 -198248 -137571
19311 -137571 -27339 207400 21854 260460 -170193 -322493 -66851 195980 -114301 152472
19300 34537 -99907 -59868 -150217 29053 -100619 -50770 -149883 99057 204992 -56585 -48125
19289 -48125 -55268 296283 -171456 -143222 -64242 -243915 -231482 -263712 -162578 -56561 33335
19277 -174026 -56144 -9599 -256761 146373 105400 283453 177394 119449 -134043 -45896 -208132
19266b08132j84920a49838J8863A55078F0258b14331m4389J01893i671j17105
19256a26776j3843j08660e5867m3063B0871J77572a5511j00545G7519a1785k88808
19245c00593Q7593B74795A33355c45801H3422f3964A8919a97608d1346a7542J048
19234a6494k99419A71047a45988K0553d2479j09394o0809K2460f0260k2038D47070
19222h0094j13131J9327K5007n041B63224b09177D72760b22915E1443a49823n0842
19211b00665F8799g9830B5372a03950B31416r1528a9557B05605b00421l60907
19201e61328A23379a6862l6608H9747a6827j04555k52406D0624c33402E596J97102
19190B02698D2813a9456n9253i798j20536N9518j1687k9855j12782A73587b6183
$$ plain form
19266 -208132 -393052 -149838 -130975 155078 60258 -214331 -258720 -156827 -9671 -126776
19256 -126776 -140619 -249279 -55867 -98930 20871 198443 -15511 -116056 77519 -11785 -300593
19245 -300593 -213000 274795 133355 -345801 83422 -63964 18919 -197608 -41346 -17542 -16494
19234 -16494 -315913 171047 -145988 -125435 -42479 -151873 -212682 -190222 -60260 -82298 447070
19222 -80094 -193225 -173898 -148891 -153932 263224 -209177 472760 -222915 51443 -149823 -200665
19211 -200665 68799 -79830 25372 -103950 231416 139888 -19557 205605 -200421 -561328
19201 -561328 123379 -16862 -53470 89747 -16827 -121382 -373788 40624 -333402 5596 202698
19190 202698 42813 -19456 -78709 -9798 -130334 -70816 -82503 -112358 -225140 173587 -26183
19178B6134b41158A45980j7156c28809c0068p547n7287a0143A90030a36952A5488
19166b07534q2522H1524B3913a30064M0624A24281j1466b58477f48l11370F4454
19154d1537a7391o9505B80522j25228b88657N5438l0016A44522n4441a59705o8432
19143b28137L7187Q5731C1707e40158A25276a80174h4272K473k8919B05208b52648
19131F8227c30240B7139c43636a40077k7123B26687b1777p5358a7427j02627A61100
19119A78934j2187E8822q011a62539j26361A12977a7269l22416c28I1262j7690
19108G3572b22796j1951J00543A42250a78852j43281A08464g7812j00871F5428
19097H3204a25958l9461l92941a68861l77649a28693E0189a67336f1566j41402
$$ plain form
19178 26134 -241158 145980 128824 -328809 -30068 -37615 -94902 -10143 190030 -136952 15488
19166 -207534 -290056 81524 23913 -130064 -89440 124281 112815 -258477 -648 -312018 64454
19154 -41537 -17391 -86896 280522 155294 -288657 -233219 -263235 144522 90081 -159705 -228137
19143 -228137 -190950 -105219 31707 -540158 125276 -180174 -84272 -81799 -110718 205208 -252648
19131 68227 -330240 27139 -343636 -140077 -167200 226687 -21777 -97135 -17427 -120054 161100
19119 178934 166747 58822 50811 -162539 -288900 112977 -17269 -339685 -328 91262 73572
19108 73572 -222796 -234747 -134204 142250 -178852 -322133 108464 -77812 -178683 65428
19097 83204 -125958 -165419 -558360 -168861 -546510 -128693 50189 -167336 -61566 -202968
19087b02968C64511b70257L3650E1012Q1200A1906b9741I0512b45887a8959j30339
19076a49298K477B05344b8991n6701B58466q9605a11625k8918J2288n3715a8354
19064f9929I8948B9156Q4956b18334I3360h9807j49548J03951H0954D213R1635
19053I5848a65266A3540d02942a01864L1241o3421F7994a7589k96821a18962j91546
19042c10508B311d3512A9560b31153R5026p2659B77130F3573K54222a26848A96658
19030B16380q4139B7574N4595f2383H8806K6853J5596K36510b78784F8127K6902
19019I5029h8174d14j73683b6013r2713M464F6573N0152K06924a60544d4849a7583
19006A59556J38874I1749a94263A0249a77356K1378G3904J64227D7970L3815a40145
$$ plain form
19087 -202968 364511 -270257 -236607 51012 132212 11906 -29741 90512 -245887 -18959 -149298
19076 -149298 -146821 205344 -28991 -85692 258466 168861 -111625 -140543 -128255 -181970 -18354
19064 -69929 98948 29156 114112 -218334 93360 -89807 -239355 -135404 80954 4213 95848
19053 95848 -165266 13540 -402942 -101864 -70623 -134044 67994 -17589 -314410 -118962 -310508
19042 -310508 2311 -43512 19560 -231153 -136127 -208786 277130 63573 317795 -126848 196658
19030 216380 132241 27574 82169 -62383 88806 115659 131255 367765 -278784 68127 95029
19019 95029 -88174 -414 -174097 -26013 -118726 -114262 66573 116725 323649 -160544 -44849 -17583
19006 159556 298430 91749 -194263 10249 -177356 -155978 73904 238131 47970 81785 -140145
18994a73685j58861A528J07562n0693b59186l1763A76352C2055P8818P9977m1247
18983A49603P5328d32444g5030j17065A90013c27525C4657L421N919a7954B36294
18971a17751B53336i2208b758E5281E382d25371c4518q5726q707j49850B14346
18959A10299c60083C77780b0338k89817J18778b1989l71300a79673E1770b75354
18948E8702a21664R934l9287A80204N7123j7228P4809A20675g3168O44m4167H2231
18935C8082b60492b6126A23994a54143J766N4387c6339j51320k20022a43342c9034
18923f1082k3809r0690A25217B4110g8733H7432a43899o7024A10934e1361A59315
18911a57009o8934B77651E5375Q2034C0571c1751k13283D5858f7504j921j26634
$$ plain form
18994 -173685 -332546 1528 109090 58397 -259186 -290949 176352 32055 110873 190850 149603
18983 149603 224931 -432444 -75030 -192095 190013 -327525 34657 38078 43997 -17954 236294
18971 -117751 253336 -92208 -2758 55281 5382 -425371 -34518 -120244 -128951 -278801 214346
18959 110299 -360083 377780 -20338 -310155 -191377 -21989 -393289 -179673 51770 -275354
18948 58702 -121664 -111730 -151017 180204 237327 220099 294908 120675 -73168 -72524 -116691 82231
18935 38082 -260492 -26126 123994 -154143 -152377 -97990 -36339 -187659 -407681 -143342 -39034
18923 -61082 -84891 -175581 125217 24110 -78733 87432 -143899 -210923 110934 -51361 159315
18911 -157009 -225943 277651 55375 137409 30571 -31751 -245034 45858 -67504 -69425 -196059
18900a96059C852b75656a18646A59775d9164K0714j0207j14250A62507c08723
18889E5952J99580r2364b4064j18331q5214A77732a43057g0616k18754A37750
18878B91059k2952F0858j775c1274j59624N0416k79476c7826C62639c2174A5644
18866d4511B4034a53993j14633g47q1621q4658j61580g3958B04188C801J3264
18855A7065b48564a17041A88076c90043B91395a3655a812l27277A69217p3058
18845I6159Q302m1479a57679c3531B65880a89475H7696a33500j05139g458j97224
18834b04682J3579P6242B5841a84491P1597d4294k6740A17025m1587g6239n7857
18823a34096d5833I7064b09611M7615D0598a32040C31493j53204h1316j99189
$$ plain form
18900 -196059 3852 -275656 -118646 159775 -49164 -28450 -38657 -152907 162507 -308723
18889 55952 255532 163168 -24064 -142395 -227609 177732 -143057 -70616 -289370 137750
18878 291059 268107 60858 59083 -31274 -190898 -140482 -419958 -37826 362639 -32174 15644
18866 -44511 24034 -153993 -268626 -747 -82368 -167026 -328606 -73958 204188 3801 17065
18855 17065 -248564 -117041 188076 -390043 291395 -13655 -1812 -329089 169217 96159
18845 96159 104461 62982 -157679 -33531 265880 -189475 87696 -133500 -238639 -7458 -204682
18834 -204682 -191103 -114861 25841 -184491 -112894 -44294 -71034 117025 75438 -76239 -134096
18823 -134096 -45833 97064 -209611 -161996 40598 -132040 331493 178289 -81316 -280505
18813b80505e3039b1235C16851b36714B98364a61477C13706A55992L5866a78691
18802g2140k62315a50210o9329h0932K1199n3477b7531A47967a76418A08062a11240
18790c2951k35048Q2258O983j10597j4569N0073f5628J6621p5157K088K2171A4303
18777B16502E6836a53255j90649B42012a34182B18731c75294D9652c9267B28475
18766c09686e4797k5876B04092b5192j07876O5348b9953l0627b5137G1563J17020
18755A88583a8852n3222B3405a48867I0016a66174n5880M6536j8325f1596l3846
18744i5442A31084Q5827b32566j3315M3790g0600B3974L89239i6455D576a97818
18732B9791M6907J12714g4396j6945c9422B2539J8965j7042b54162Q4771N3367
$$ plain form
18813 -280505 -53039 -21235 316851 -236714 298364 -161477 313706 155992 191858 -178691
18802 -72140 -334455 -150210 -219539 -80932 -59733 -113210 -27531 147967 -176418 108062 -111240
18790 -32951 -267999 -185741 -178758 -289355 -303924 -253851 -65628 -49007 -124164 -122076 -99905 14303
18777 216502 56836 -153255 -343904 242012 -134182 218731 -375294 49652 -39267 228475
18766 -309686 -54797 -80673 204092 -25192 -133068 -67720 -29953 -60580 -25137 71563 188583
18755 188583 -18852 -72074 23405 -148867 90016 -166174 -222054 -175518 -193843 -61596 -95442
18744 -95442 131084 216911 -232566 -245881 -202091 -70600 23974 413213 -96455 4576 -197818
18732 29791 76698 189412 -74396 -91341 -39422 22539 41504 24462 -254162 -169391 -116024
18721a16024C2075I170a98795f002D2468J44401o8646Q0477E5157b76350N5875
18710b20475d5118m6041A98131a85334g0257E7354J05508b56567G2264d2194E2645
18698a28914A88713O2364H9528a90021R283P0804E078a59773j88445g4432A16672
18686b6937o5402b4115m21583a08676j13123R6238G1587J50487I784d19823a89553
18674a20773i014A49504D6663g8194k47215d3569m326j63416A06830d0989k3213
18663f4202q3395A16712N5828i8774n3049j05063J19629j30411a16038P445B46200
18651B92400e5638j26919P7400I9149D950J72709n856b22310d7015j9857A70358
18639d5343k00184C15213A41932m8198a33208A59288b45111A67125c2403A44547
$$ plain form
18721 -116024 32075 9170 -198795 -6002 42468 186869 118223 198700 55157 -276350 -220475
18710 -220475 -45118 -91159 198131 -185334 -70257 57354 162862 -256567 72264 -42194 52645
18698 -128914 188713 251077 89528 -190021 -180738 -109934 5078 -159773 -348218 -74432 116672
18686 -26937 -92339 -24115 -445698 -108676 -221799 -125561 71587 222074 9784 -419823 -189553
18674 -120773 -9014 149504 46663 -78194 -325409 -43569 -47895 -211311 106830 -40989 -64202
18663 -64202 -147597 116712 172540 -98774 -151823 -256886 -137257 -267668 -116038 -108593 246200
18651 292400 -55638 -182557 -105157 99149 4950 177659 171803 -222310 -47015 -66872 170358
18639 -45343 -245527 315213 141932 93734 -133208 159288 -245111 167125 -32403 144547
18628E753M9155K01242e7705B15542J42882b12449a5032p1613H3193G30a59486
18616c4472B06782c38573n0467J07109h5086O704o2020B36020d99887a21599q6834
18605b08433A9143K3150a42666K5451m9026L6018k93878B69990a58311A02998
18594B83501a38655j42023C11666J08608b2808l1223m00241M6101g633p6827A39156
18582a78814E4782a4449A57703b25687B44973b60081g1401H3624C3433a63111
18571e7434j40080F4581N7698P5038f5337j52467b7112l20419A05258J69640b34723
18559c53015C72957A02074b743k3198A40129j9212e8257j11163A06678k8701a43558
18547D5444b21940j85107G2748a04134a8011F5026L8581J2235a92176D0662M2574
$$ plain form
18628 5753 54908 256150 -57705 215542 358424 -212449 -15032 -86645 83193 730 -159486
18616 -34472 206782 -338573 -389040 -281931 -85086 -78382 -140402 236020 -499887 -121599 -208433
18605 -208433 19143 42293 -142666 -117215 -166241 -130223 -424101 269990 -158311 102998
18594 283501 -138655 -280678 311666 420274 -22808 -54031 -454272 -408171 -7633 -84460 139156
18582 -178814 54782 -14449 157703 -225687 244973 -260081 -71401 83624 33433 -163111
18571 -57434 -197514 64581 122279 197317 -65337 -217804 -27112 -347531 105258 274898 -234723
18559 -353015 372957 102074 -2743 -25941 140129 120917 -58257 -169420 106678 77977 -143558
18547 45444 -221940 -407047 72748 -104134 -18011 65026 103607 115842 -192176 40662 83236
18536H3236h6665a9541l04015K9331B64753q4249a05996j00305F8953c00234A33895
18524B15653b72949o2640A68170J40809c68872a01115k13557f8417i929m52499
18514d62428g3576B76522i240I2892a95953n2107i070k20486B4849a08255C06103
18502b33304O1840c7761J5520j80791I1430b18356P1428q695A47485J05853c99925
18490b95669A87345D203P939M6396a24916a0481A60167J06136h8887j08891J7565
18479a80213F8223f6950j77409P0122A09619g9846k1914A99037b35483d2997p4347
18468a17344l31685a76751p9734B920J8701c90917e6478k19003a5213A98205c4533
18456b4178l73856e6889k52310a43529O660j02917J15854j71042J12473j81959
$$ plain form
18536 83236 -86665 -19541 -323556 -294225 264753 180504 -105996 -206301 68953 -300234 133895
18524 215653 -272949 -335589 168170 308979 -368872 -101115 -314672 -68417 -9929 -462428
18514 -462428 -73576 276522 -9240 92892 -195953 -248060 -9070 -229556 24849 -108255 306103
18502 -233304 -171464 -37761 -22241 -203032 91430 -218356 -146928 -155623 147485 253338 -399925
18490 -295669 187345 4203 12142 58538 -124916 -10481 160167 266303 -88887 -197778 -180213
18479 -180213 68223 -66950 -244359 -174237 109619 -79846 -101760 199037 -235483 -42997 -117344
18468 -117344 -449029 -176751 -256485 2920 21621 -390917 -56478 -275481 -15213 198205 -34533
18456 -24178 -398034 -56889 -309199 -143529 -136869 -239786 -123932 -294974 -182501 -364460
18446c64460J42789L3531G7574O667c12374A57111a97438P6190r9561Q4349o0677
18435a97137L8052I4455b0415B24880A5300J44381a33080C819K30920g6530A40818
18423b1138D5115a24815k1592N4011m1467G1848b24351E874O1699b609A69821
18411a45535L7239a2238E1181a15469b6873j40576B60255h2251B38788a05920
18400a08628j56980J06373J7890M6749j39234M5638Q536F9870e979C3046a19300
18388b2277B90795E8040c11366I2021q875C3204d8582m43327F667b30770A23648
18376a24433e6648B6214M4472L189E460a38716r0097F57647a97586g9137j65478
18365b44615e0978a758k2792D67J99455A2457d2472I5170a38101C11013D1790
$$ plain form
18446 -364460 -221671 -188140 77574 84241 -312374 157111 -197438 -121248 -220809 -136460 -197137
18435 -197137 -159085 94455 -20415 224880 15300 159681 -133080 3819 234739 -76530 140818
18423 -21138 45115 -124815 -146407 -92396 -133863 71848 -224351 5874 67573 -2609 169821
18411 -145535 -108296 -12238 51181 -115469 -26873 -167449 260255 -82251 238788 -105920
18400 -108628 -265608 -159235 -141345 -94596 -233830 -188192 -179656 69870 -5979 33046 -119300
18388 -22277 290795 58040 -311366 92021 83146 33204 -48582 -491909 6667 -230770 123648
18376 -124433 -56648 26214 70686 73875 5460 -138716 -228813 657647 -197586 -79137 -244615
18365 -244615 -50978 -1758 -24550 467 199922 12457 -42472 95170 -138101 311013 41790
18353A20338B5474a34749f4966k36423J44703k55931h3188k07011K7733Q0799
18343a81667I4350J47962n9070E8082k7494J29157l9990a79772P7653B9657j905
18332B7752F895a88942L4715A62588i7012E4093a08908q8513C52616E756c98453
18320F2154K61018b58416F6914O6934h4094j47600d7291F6395K6240K69930A61012
18308a75614A47716F7526c10747J51240C8809K12396A06710b55016A73180J79238
18298C52418a4301C9139b68196h6315A86680C6616b52129B1007L7856k7857K61704
18287B92710c17994a23551b2091A48882a33365M6839A95414b01418C9091a98696
18276A29491a41076A34546J51447a5621q0257N253d2427I6404f9633A65037d8416
$$ plain form
18353 120338 25474 -134749 -64966 -301389 -156686 -412617 -83188 -290199 -262466 -181667
18343 -181667 94350 242312 183242 58082 30588 159745 119755 -179772 -102119 29657 27752
18332 27752 6895 -188942 -154227 162588 -97012 54093 -108908 -197421 352616 5756 -398453
18320 62154 323172 -258416 66914 133848 -84094 -231694 -47291 66395 92635 362565 161012
18308 -175614 147716 67526 -310747 -159507 38809 251205 106710 -255016 173180 352418
18298 352418 -14301 39139 -268196 -86315 186680 36616 -252129 21007 58863 31006 292710
18287 292710 -317994 -123551 -22091 148882 -133365 -86526 195414 -201418 39091 -198696
18276 129491 -141076 134546 285993 -15621 -95878 -90625 -42427 96404 -69633 165037 -48416
18264a25744A74653b69814A757a13834G0318a78297Q5688G7865b5287A35932f5745
18252a77841k31970A88902a19838a9731j40965j52228A04681a19603k2345m8430
18242a90378j11678j21156A07825j2498a60629d477j48958L3295c9151j53597
18232a92748L0211B44845c43415i8945A4599J12316a45523b0832c998j67638c9479
18220b34334J07711J882B6846g2476j9338M4231A29064b71344A00297J94762J01848
18209C96907c62323a13514C73735c2833j95777A45989c7506l86457B49453A14452
18198d53395a65306B89949B5714J1481K63007j38064a57777b8322J4036n879m06628
18187d26793I0635d65088E6013J92241b44231K8889B72969h7177C3116J60245
$$ plain form
18264 -125744 174653 -269814 1757 -113834 70318 -178297 -92609 77865 -25287 135932 -65745
18252 -177841 -409811 188902 -119838 -19731 -160696 -312924 104681 -119603 -141948 -190378
18242 -190378 -302056 -423212 107825 95327 -160629 -4477 -153435 -120140 -39151 -192748
18232 -192748 -162537 244845 -343415 -98945 14599 126915 -145523 -20832 -3998 -171636 -39479
18220 -234334 -126623 -124741 26846 -72476 -91814 -47583 129064 -271344 100297 295059 396907
18209 396907 -362323 -113514 373735 -32833 -228610 145989 -37506 -423963 249453 114452
18198 -453395 -165306 289949 25714 37195 300202 162138 -157777 -28322 -14286 -20165 -426793
18187 -426793 90635 -465088 56013 248254 -244231 -215342 272969 -87177 33116 193361
18177A93361B8817b42529b5517m5240P392C55777a0622o2948G0609e1371A8726
18165I2187e7550m54162D3858K31607a32604A04876a07772B87924a18631H133
18154b41699b848l95437J10461a12482D4480a96912e9761h981B60631j17119B7385
18142a38778A2478a28114j26216f8232k4304j14896D4975K12515a90715A82926
18131F710d3604H7733B836g6917A9198L1831J23244f4367C4314a41869c6052j00512
18119a36564j09790B6109J44604A901K63850A22610P9845B2677b87183b4580j35794
18108a60374a1305j63398h035j32017O1090C70966e8931j5395B05573a6902B01037
18096A9063b40422j343q3357r1112B74738b12012I0964a84380I6741A9984L3239
$$ plain form
18177 193361 28817 -242529 -25517 -70757 -63365 355777 -10622 -73570 70609 -51371 18726
18165 92187 -57550 -511712 43858 275465 -132604 104876 -107772 287924 -118631 8133
18154 -241699 -2848 -398285 -287824 -112482 44480 -196912 -59761 -8981 260631 143512 27385
18142 -138778 12478 -128114 -254330 -68232 -92536 -207432 44975 257490 -190715 182926
18131 6710 -43604 87733 2836 -76917 19198 51029 174273 -64367 34314 -141869 -36052 -136564
18119 -136564 -246354 26109 170713 1901 265751 122610 202455 22677 -287183 -24580 -160374
18108 -160374 -11305 -174703 -8035 -140052 -78962 370966 -58931 -74326 205573 -16902 201037
18096 19063 -240422 -241765 -325122 -416234 274738 -212012 90964 -184380 96741 19984 53223
18085E3223A2124f4710j57628E9339N6344O5048a69351H5066b10309c7491a7403
18073H1743K8579a67899j4158l5075J05094B70351b12578K5776r3515m7153d9110
18061h0802A72285G3997b04715G775b71869C9491J58130c10489h9614k46988d5822
18049B74498h1880k23488d5794n8432B7775b16092r1382d975H2040b47214A33054
18037A8448J96064d00698g9916m9985E1049a14188B01142F0096P2779L00151a92003
18025a87956O4635J0308N3119F1396M463k7538K66871C5729L9919b88390B07710
18013i340A10261C9183J67245G482M9438J36573C9224R9678a40812j9675A00779
18001E9175a60972D226a0666j4321p7319A7092J53874b04352e572A2201K99972
$$ plain form
18085 53223 12124 -64710 -222338 59339 115683 180731 -169351 85066 -210309 -37491 -17403
18073 81743 110322 -167899 -182057 -217132 -112038 270351 -212578 -186802 -280317 -327470 -49110
18061 -80802 172285 73997 -204715 7775 -271869 39491 197621 -310489 -89614 -336602 -45822
18049 274498 -81880 -305368 -45794 -104226 27775 -216092 -307474 -4975 82040 -247214 133054
18037 18448 214512 -400698 -79916 -129901 51049 -114188 201142 60096 132875 433026 -192003
18025 -187956 -123321 -113013 -59894 61396 65859 38321 305192 35729 75648 -288390 207710
18013 -9340 110261 39183 206428 7482 56920 193493 39224 138902 -140812 -160487 100779
18001 59175 -160972 4226 -10666 -24987 -102306 17092 170966 -204352 -5572 12201 312173
17990C12173j24640l7422C5038b8965k27167a19526k88486A38147b15872H8613
17979H7184a89531C12367e5574K5518r3661c1076B95431c9963l06735C9447d0569
17967e0004j61782G097a81482G0312h9708G9031i4000d5498k85453A10876f9450
17955d7902A19415b7323A63571a18252k0730A45278c42874A51645A2109a07941
17944h385A42103J7904h7482l9406d7021B80760K627g6902j6982n10810A61550
17932E0729J6130d0057k89647B31045H9443k2210b48654G9234c42671a795A765
17920a84837c2484A65587a30523A01396b23256L9544J2973Q1495B36027b5436
17909b38315O9488l6810A15051P3593f3986B19022b61510C4876h096j78686B46937
$$ plain form
17990 312173 187533 150111 35038 -28965 -256132 -119526 -408012 138147 -215872 88613
17979 87184 -189531 312367 -55574 -30056 -123717 -31076 295431 -39963 -346698 39447 -40569
17967 -50004 -211786 7097 -181482 70312 -89708 79031 -94000 -45498 -330951 110876 -69450
17955 -47902 119415 -27323 163571 -118252 -138982 145278 -342874 151645 12109 -107941
17944 -8385 142103 160007 -87482 -126888 -47021 280760 283387 -76902 -93884 -604694 161550
17932 50729 66859 -40057 -329704 231045 89443 67233 -248654 79234 -342671 -1795 1765
17920 -184837 -32484 165587 -130523 101396 -223256 -183712 -170739 -89244 236027 -25436
17909 -238315 -168827 -205637 115051 188644 -63986 219022 -261510 34876 -8096 -186782 246937
17897b52583C2375K833d8781k45573G0778a6190m0049C67137N9635d3231E7049
17885B436Q6815a03837a5903D21062j33476f2060m1742L1897o9052m0546j2610
17874a94113C6104J92548i5048j65250J13938H2338C1691a86539A6872a472F2655
17862F0910a43836A9745b55410C3050J52690R9081j6907q9224D8243h6004k01562
17851b87566j3504A41939o185a21139n638D2285c82936c4195j02691A50684o3258
17840H7426h8562A07066m9991c129A9126b09149E40962a8826J95C41273j37601
17829B03672a74387P9556C67733k6379J221A38L00876a05014C9149f9912B6469
17817a76314C0108m080b37454D32099A18252a81854e5643D7378J17717c5462j8917
$$ plain form
17897 -252583 32375 35208 -48781 -294354 70778 -16190 -56239 367137 426772 -43231 57049
17885 2436 89251 -103837 -15903 421062 287586 -62060 -103802 -71905 -140957 -181503 -194113
17874 -194113 36104 228652 -95048 -260298 -146360 82338 31691 -186539 16872 -1472 62655
17862 60910 -143836 19745 -255410 33050 185740 284821 267914 178690 48243 -86004 -287566
17851 -287566 -301070 141939 135754 -121139 -126777 42285 -382936 -34195 -136886 150684 87426
17840 87426 -88562 107066 57075 -3129 19126 -209149 540962 -18826 -18631 341273 203672
17829 203672 -174387 -94831 367733 341354 342575 138 301014 -105014 39149 -69912 26469
17817 -176314 30108 26028 -237454 432099 118252 -181854 -55643 47378 165095 -35462 -54379
17806e4379B02688e7367l22518B11483b43899P8485d2142B8181b84739i2213A90851
17794A32444a18325A71004b77236P1450C4424h3411a9236E3016a43507B14275
17783H9792A1933a77694L5720k6448F9234K68565j43557G2923J03188a37055E9708
17771C7290K74250A6338a16010B12827H7463d2359A37374a83825C2662P0094j1839
17760I0917k2317J88850a28430m6635A46842R2788h6335C9043O4516Q8105a4267
17748a67771C0678J18732Q0710d9511q0485L562A33319g4384A9259J2633a24891
17736d2310B16300I345a00175b4477O200B57668A05107a09997p9170j95021a2563
17724E17816A16462L5980f7662o9078F6298a47296D2413K02921a63395A33789
$$ plain form
17806 -54379 202688 -57367 -379885 211483 -243899 -165414 -42142 28181 -284739 -92213 190851
17794 132444 -118325 171004 -277236 -205786 34424 -83411 -19236 53016 -143507 214275
17783 89792 11933 -177694 -141974 -168422 69234 337799 194242 72923 176111 -137055 59708
17771 37290 311540 16338 -116010 212827 87463 -42359 137374 -183825 32662 102756 90917
17760 90917 68600 257450 -128430 -175065 146842 239630 -86335 39043 103559 191664 -14267
17748 -167771 30678 149410 230120 -49511 -129996 -126434 133319 -74384 19259 31892 -124891
17736 -42310 216300 9345 -100175 -24477 -18277 257668 105107 -109997 -189167 -384188 -12563
17724 517816 116462 152442 -67662 -136740 66298 -147296 42413 245334 -163395 133789
17713B8212a22301D63352a71726C59893o135a2838l6051N103F9724J67173c7275
17701d0781j3474M366j93373j5522H0999e9510a8674E136f2913C2072L77417a9335
17688E079b01269R1962d3587j17833j15875O4298K9022K2539L1680r767H9160
17676B31199r4784j474a79806I5087a06593B540e50r4450F4090a35485d3680K0297
17664b3383D0983a16826k0324B88066b93090B51466C5489r592O4412j0706O6357
17653A45960A1843K06075d1776B92543a09205A09832e4115A40998l0867a37055
17642D53096b99860M0461A28622N0602a30080A36949I052a84911D4410b75350
17631A30063e1853h201k65252J13194I0412L1031a70373D8922a50711L9053d2777
$$ plain form
17713 28212 -122301 463352 -171726 359893 353758 -12838 -48889 -43786 69724 236897 -37275
17701 -40781 -54255 -49889 -243262 -258784 80999 -59510 -18674 5136 -62913 32072 409489 -19335
17688 5079 -201269 -109307 -43587 -161420 -277295 -212997 -183975 -161436 -129756 -139523 89160
17676 231199 136415 134941 -179806 95087 -106593 2540 -550 -95000 64090 -135485 -43680 -23383
17664 -23383 40983 -116826 -137150 288066 -293090 251466 35489 25897 90309 79603 145960
17653 145960 11843 217918 -41776 292543 -109205 109832 -54115 140998 110131 -137055
17642 453096 -299860 -259399 128622 179224 -130080 136949 9052 -184911 44410 -275350
17631 130063 -51853 -8201 -273453 -160259 90412 121443 -170373 48922 -150711 -111658 -42777
17619f4005o4689o5681d3952I228b59831E8994J89529a45374D0000J5444K40794
17608B96238i4616A97646b50837B61607a81688a861l1163k29885D42838a47229
17597A07660j5043b2252A67729h3353j2150A55385a5188r9477e5762A28273m8182
17586H0091B7909j794J41945B306L327J18301B8875J50162a7383j19724r0535
17575b27642E04063A15669E6592b38283A49837b5346A74321a36047I8129l2994
17565F5135R0591m5411a5279A76545K63781A38666F8724J56597a56513B26811
17554a29709B55600l8055i2663A4924J56600C2499a16677j84798M0085h6343J4536
17543g1807k8959A58380d0488C82840f5952k00718B07360i2696D48103e5609l945
$$ plain form
17619 -64005 -128694 -194375 -43952 9228 -259831 58994 248523 -145374 40000 55444 296238
17608 296238 -94616 197646 -250837 261607 -181688 -1861 -33024 -262909 442838 -147229
17597 107660 92617 -22252 167729 -83353 -95503 155385 -15188 -114665 -55762 128273 80091
17586 80091 27909 26115 168060 2306 5633 123934 28875 179037 -17383 -137107 -227642
17575 -227642 504063 115669 56592 -238283 149837 -25346 174321 -136047 98129 65135
17565 65135 155726 110315 -15279 176545 440326 138666 68724 225321 -156513 226811
17554 -129709 255600 217545 -92663 14924 171524 32499 -116677 -301475 -261390 -86343 -71807
17543 -71807 -100766 158380 -40488 382840 -65952 -266670 207360 -92696 448103 -55609 -59554
17532e9554I0583m782j7263N3830b91353G5346J10b57954A47097J61620A46740
17520F5103K65707j27965J74708G9654b40501K4308A32292b09164a04431B93859
17509a6416B21987a44482F1828L1787D3958K75131A56436J00127A02240P6997
17499A79237n2027b02414c517E21346A6393J28139E0422h378m5111A3428K81257
17488B94685R6993i2646F8928K20921b33729k0041C25950G1650J78051o5855j7440
17477A66406j4500a11110C04486G1410J80380K8453a7143C70420b477A49986K12128
17466C62114A43454M0115J14957d0953D7740J29455B6432K76859d1038A42364
17455B35640P1075i2819A02930M20773k30959J34801B07037L3792K23557A87664
$$ plain form
17532 -59554 90583 85801 68538 122368 -291353 75346 75456 -257954 147097 308717 146740
17520 65103 330810 202845 377553 79654 -240501 -216193 132292 -209164 -104431 293859
17509 -16416 221987 -144482 61828 93615 43958 319089 156436 256563 102240 179237
17499 179237 127210 -202414 -3517 521346 16393 144532 50422 -8378 -53489 13428 294685
17488 294685 391678 -92646 68928 289849 -233729 -253770 325950 71650 249701 183846 166406
17477 166406 151906 -111110 304486 71410 251790 280243 -17143 370420 -2477 149986 362114
17466 362114 143454 183569 298526 -40953 47740 177195 26432 303291 -41038 142364
17455 235640 306715 -92819 102930 523703 292744 427545 207037 240829 464386 187664
17444G1191h316o8502a1760C14655j24622J50781a05586A47146R2559b24363B15473
17432A5776J28616A3178L3315N0736J63756j23980L5322M13413k41816b3192E9760
17420D53046a22479B85172j32808P0927J71431j5255H3824L40926A58895K82909
17410D41804A70368a7791j25984J9582B27982r6799d3127j50957b2242A12143
17399f7717B58744G105J2119K17086p7827E443L61338j73927k2710M03718k78397
17388B95465b1442o75C20140d4456q3907F3316L03823F1472L15410f0127A01875
17376C17444a19917A04694J24429F9087J543J02516o5090J21705G8343Q3401K60109
17365D21853a00373A20965J72468b36109b6094p1909A22917j3003N3382b4481
$$ plain form
17444 71191 -8316 -76818 -11760 314655 190033 340814 -105586 147146 239705 -224363 215473
17432 15776 144392 13178 46493 97229 260985 137005 172327 585740 343924 -23192 59760
17420 453046 -122479 285172 152364 223291 394722 379467 83824 424750 158895 441804
17410 441804 170368 -17791 -143775 -124193 227982 131183 -43127 -194084 -22242 112143
17399 -67717 258744 7105 19224 236310 158483 5443 366781 192854 170144 573862 295465
17388 295465 -21442 -22117 320140 -44456 -128363 63316 367139 61472 376882 -60127 101875
17376 317444 -119917 104694 229123 69087 70630 173146 108056 229761 78343 161744 421853
17365 421853 -100373 120965 293433 -236109 -26094 -98003 122917 109914 163296 -24481
17354D18062j85725o1133J6608A3417J07685B0104Q7576J18459K02257f4340B33619
17342b63719A36258b32270B52800f1137C44705F1128K83305K10354A8171f8951
17331c5325E61311K00244B45973c11800C95925k2997d1643B16244Q8417A35062
17320a6136A22287J57429a82624c3140C44204j27712F360J02802h3344A18381
17309D9900J68611J533a73250A9682K20033D2177J12169J77429A57516Q6271J53785
17298C97572h6619A35540f1153C1896L65388M0192k1182L8945q426f8927A09306
17286B99528p4025a4380E6236L9612J76494c0129q255D12011A87191a33119A62496
17274C72389A24821D9588L23754A63551K20310q6618A40959E4760L12175j23027
$$ plain form
17354 418062 232337 171204 187812 13417 121102 20104 107680 226139 428396 -64340 233619
17342 -263719 136258 -232270 252800 -61137 344705 61128 344433 554787 18171 -68951
17331 -35325 561311 761555 245973 -311800 395925 372928 -41643 216244 304661 135062
17320 -16136 122287 279716 -182624 -33140 344204 216492 6360 109162 -83344 118381
17309 49900 218511 220044 -173250 19682 239715 42177 154346 331775 157516 243787 397572
17298 397572 -86619 135540 -61153 31896 397284 437476 416294 455239 446813 -68927 109306
17286 299528 225503 -14380 56236 95848 272342 -30129 -38384 412011 187191 -133119 162496
17274 372389 124821 49588 373342 163551 383861 297243 140959 54760 366935 243908
17264B43908a45456B26831I5434O7385l6933J77885A7712J84273e275A41333K11931
17253C53264L4627h7040B60118j08063n8219K51105C8084J90852b06458A81900
17242G4760K57141j20688q3818J21329I3486K31727N0465A45965C5395L78275
17232D13670D455K16032q846o8492K83316F551L76411G1791K70988n5979M8923
17221C35723j21334q6730K63211a0359A36600M01842A52256d2908C12450R1005
17211D03455j59796K5734a7370A21774e4436a354A56517K64087r4013R1243k4417
17200C93417R2731A32921K15221b77801A47839Q286K61241A2628L3177L91350
17190D37155a77512C72011O2564n3847j75932o2497L58131k41473j051A288O835
$$ plain form
17264 243908 -145456 226831 95434 162819 125886 303771 17712 201985 -5275 141333 353264
17253 353264 387891 -87040 260118 152055 93836 344941 38084 228936 -206458 181900
17242 74760 331901 211213 127395 248724 93486 325213 375678 145965 35395 413670
17232 413670 4455 220487 211641 143149 426465 6551 382962 71791 342779 286800 335723
17221 335723 214389 127659 390870 -10359 136600 538442 152256 -42908 312450 403455
17211 403455 243659 269393 -17370 121774 -54436 -1354 156517 420604 326591 417834 393417
17200 393417 486148 132921 348142 -277801 147839 156125 417366 12628 45805 437155
17190 437155 -177512 372011 434575 380728 204796 142299 500430 258957 257906 1288 8123
17179H123J50647M13817j44551N7884A42055L16994n4964g0599A79428m2941J35739
17168B72226A09519J81724m8534g871C97073o6912O8510j34936q0773J83194A01993
17156E44733q5913G7436j8207L74160A73879n9697M18624k39889b856C00148a4892
17144B06295F5508M31983E8775L66964k0968K3226n9687A02842J89679n9622P32202
17133I65101C70303K5971j08149Q6830J23082B34547D7636q805K20357K869L3327
17122B95384P3567Q5886k26424K28068J75368k90791K55722k65102p9312R7323
17112C49689K9576q4442J45526I8808f606B50514A11617M17648i2171C31065J28879
17101D59944k04649L02259k14270j30333M6973o4771L62639P5149k21449o6362
$$ plain form
17179 8123 158770 572587 428036 485920 142055 459049 404085 -70599 179428 136487 272226
17168 272226 109519 291243 242709 -7871 397073 330161 398671 263735 182962 366156 101993
17156 544733 458820 77436 59229 433389 173879 114182 532806 292917 -2856 300148 -14892
17144 206295 65508 497491 58775 425739 404771 427997 368310 102842 292521 232899 965101
17133 965101 370303 396274 288125 374955 498037 234547 47636 38831 259188 262057 295384
17122 295384 368951 454837 228413 456481 631849 341058 596780 331678 252366 349689
17112 349689 379265 294823 440349 98808 -6606 250514 111617 529265 -92171 331065 459944
17101 459944 255295 557554 343284 212951 259924 195153 557792 632941 411492 345130
17091C45130A06559L74108k25862J19741K55055k63787A02909M28268J02328k51675
17081C81830A09195L64810j06209K34846B97382n0628N15338C03168L83605k77061
17071D09712N5934o8707A50113J06199L31072k64668K02229o5888N1561L59413
17061H70031l49121P456B09150M8269M23236k04437J23296J42244k73893J25313
17051E93178o9250k30619J29295J82528k19009J24560J08087k15438j81525N32647
17041G54454k64754J55238O8232P2529n8128m8998C04527L51260l3866k44706
17031C77215j16405J14009M02946B56543K69884J83923k22149P0295j5638n9069
17021D83789J17420N2783k72237K27724j47583J91328N397j78589L51764m00320
$$ plain form
17091 345130 106559 480667 254805 374546 629601 365814 102909 531177 633505 381830
17081 381830 109195 474005 367796 602642 297382 246754 762092 303168 686773 409712
17071 409712 465646 396939 150113 256312 587384 322716 524945 459057 510618 870031
17061 870031 520910 528366 209150 257419 680655 476218 599514 741758 467865 593178
17051 593178 523928 293309 422604 605132 386123 510683 618770 403332 221807 754454
17041 754454 489700 644938 713170 785699 727571 678573 304527 655787 621921 377215
17031 377215 260810 374819 777765 256543 526427 710350 488201 558496 542858 483789
17021 483789 601209 653992 381755 609479 461896 653224 658621 480032 831796 431476
17011D31476r2114N62348j35306k45030k45174K04506M00199j26864k43783M93857
17001A004115o5763k26542N019o5621K0079N13510l90939j57463J37488N4512
16991H28395N3790j55416j89788M16038j19878L5651j66518L0009K88465l94633
16981F26115M04742j81493q0266K81401l1986k41726N6746P5533J57537H3017
16970A286827l70703k90948M49158l1977j13276J04429l93515L32703K20913k34211
16960I59400o0586j14987J09725j50438L93605r8536j45106l6052o4724L57904
16950A150205q5176n7278r4823j96663M36736J58836k47574K9216O1626N1845
16940A206950k08990L55160o9312k59233K6521K58902J50241k50989J94039j11546
$$ plain form
17011 431476 339362 901710 766404 521374 276200 480706 880905 754041 510258 1004115
17001 1004115 938352 711810 716829 651208 671287 1184797 793858 636395 773883 828395
16991 828395 882185 726769 536981 953019 833141 868792 702274 732283 1020748 626115
16981 626115 1030857 849364 769098 1050499 1018513 776787 833533 909066 1066603 83017
16970 1286827 916124 625176 1074334 1042357 929081 1033510 639995 972698 1193611 959400
16960 959400 898814 783827 893552 743114 1136719 1038183 893077 857025 792301 1150205
16950 1150205 1065029 1007751 912928 716265 1153001 1311837 1064263 1093479 1155105 1206950
16940 1206950 997960 1353120 1283808 1024575 1051096 1309998 1460239 1209250 1403289 1291743
16930A291743J06353j93302J2887q2972L56312j57854P8520R2928k70962L34228
16920A567881l81948K95435l74413J00407O3427j2318M14093l73526J20887J95035
16910A614960Q853Q9672m6270M05320o75809K41300O5587L0604k878J58622j33867
16899A756094j13137K87947k69363r620k2616J10479j95419L01709K05163j50990
16889A900247J18235j58891j636j60354P28598n33778J35361L2557k7076j23642
16879A909621J57799J25818P5194o8199K08914o86608Q18018j52809j23095J31474
16869B396127j10520K06708l34009J95411L37632K37315k61131K93974m20012
16860B541495K00721K63194o6218j91790L75875l02619J77731K39098N5140q315
$$ plain form
16930 1291743 1398096 1204794 1217681 1134709 1491021 1333167 1411687 1504615 1233653 1567881
16920 1567881 1185933 1481368 1106955 1207362 1270789 1258471 1672564 1299038 1419925 1614960
16910 1614960 1623813 1713485 1667215 2072535 1396726 1638026 1703613 1734217 1731339 1889961 1756094
16899 1756094 1642957 1930904 1661541 1651921 1629305 1739784 1544365 1846074 2051237 1900247
16889 1900247 2018482 1859591 1857955 1697601 2426199 1892421 2027782 2060339 2033263 1909621
16879 1909621 2067420 2193238 2268432 2200233 2409147 1722539 2540557 2387748 2264653 2396127
16869 2396127 2285607 2492315 2158306 2353717 2691349 2928664 2667533 2961507 2541495
16860 2541495 2742216 3005410 2939192 2747402 3123277 2820658 2998389 3237487 3292627 3284312
16850C284312j21728k23284M56580J780k48062L48125j19555L40616n4839l68848
16840C295097J50764P1042K70566J58223j35293K92209j53581K31975J83557j31547
16830D233012K16058O4135K20635j48153k6126K87514j51220m4567Q05610n77057
16820D879841L77751j8043M18116r1293k57450L74943j27161K88294Q4511N70825
16810F500334o04481N37069j16117L80967J57754L25257m13811J73522M76056
16801G416550L84402j84996N72515o3941M52605R1633Q3024M78436K4212J70812
16791I425252L5540O55255P9563L81920o7529M49110L64311L81986L82711M78214
16781A2566333K95720k26237O57910P04296M12069O0810K07765J026838K96737
$$ plain form
16850 3284312 3162584 2939300 3395880 3397660 3149598 3497723 3378168 3718784 3663945 3295097
16840 3295097 3445861 3516903 3787469 3945692 3810399 4102608 3949027 4181002 4364559 4233012
16830 4233012 4449070 4513205 4733840 4585687 4559561 4847075 4695855 4651288 5456898 4879841
16820 4879841 5257592 5239549 5657665 5566372 5308922 5683865 5556704 5844998 5929509 6500334
16810 6500334 5895853 6432922 6316805 6697772 6855526 7180783 6766972 6940494 7416550
16801 7416550 7800952 7615956 8188471 8124530 8577135 8668768 8751792 9230228 9254440 9425252
16791 9425252 9460792 10116047 10195610 10577530 10510001 10959111 11323422 11705408 12088119 12566333
16781 12566333 12862053 12635816 13293726 13998022 14410091 14470901 14678666 15705504 16002241
16772A6002241N57707N40947N60727N57531Q20723M93088R62015O51407O09968
16763B1756354J169520N99305J068865Q59574R56501J078212J276821J236422
16755C0001574J687337J090164J565515J665691J727067J658238K325012J447942
16747D3168540K663922K049636K801239K591327L119273L312576L497266L277759
16739F6481538M191327M133727N004251N014097N386996N597478N975325O872892
16731A08657631P232386O949671Q416768Q057200Q688262Q686616Q984974Q894558
16723A74568066Q981981Q003716P661428O499736N488733L871884K427705Q31196
16715B18334445j095759k511774l915243n810861o626599p352408q719204r058010
$$ plain form
16772 16002241 16559948 17100895 17661622 18219153 19039876 19532964 20494979 21146386 21756354
16763 21756354 22925874 23525179 24594044 25453618 26410119 27488331 28765152 30001574
16755 30001574 31688911 32779075 34344590 36010281 37737348 39395586 41720598 43168540
16747 43168540 45832462 47882098 50683337 53274664 56393937 59706513 63203779 66481538
16739 66481538 70672865 74806592 79810843 84824940 90211936 95809414 101784739 108657631
16731 108657631 115890017 122839688 131256456 139313656 148001918 156688534 165673508 174568066
16723 174568066 183550047 191553763 199215191 205714927 211203660 215075544 217503249 218334445
16715 218334445 217238686 214726912 210811669 205000808 198374209 191021801 182302597 173244587
16707A73244587q702414r062883r249167q654115q402854q212394p679080o747110
16699A06534570p244407o391778n727527n299212n061706n067428m039269m104146
16691F3599097l566954l358178l480364k815457k516446k883376k237165j968230
16683D0772927k328795j939794j777311j518558j488913j333443j673473q81278
16675B7831362j201947j834626p01242r51745r29157q80778r84230q11334m95800
16666A9040503j102487m20048p51660n39374n07045n81346l56973n56924l25353
16657A3899293n34917m73477n28862m55789n6387n03644m39584P0894o24875j81020
16647A0171632k36051n74162J6140l28653k93716n05404K0546n42279K48715k19575
$$ plain form
16707 173244587 164542173 155479290 146230123 137576008 129173154 120960760 113281680 106534570
16699 106534570 99290163 92898385 87170858 81871646 76809940 71742512 67703243 63599097
16691 63599097 60032143 56673965 53193601 50378144 47861698 44978322 42741157 40772927
16683 40772927 38444132 36504338 34727027 33208469 31719556 30386113 28712640 27831362
16675 27831362 26629415 24794789 24093547 23141802 22212645 21331867 20347637 19536303 19040503
16666 19040503 17938016 17517968 16766308 16226934 15719889 15138543 14781570 14224646 13899293
16657 13899293 13364376 12890899 12362037 11906248 11849861 11346217 10906633 10977527 10352652 10171632
16647 10171632 9935581 9361419 9377559 9048906 8755190 8249786 8270332 7728053 7976768 7757193
16637G757193k16646l33557k7203m06249k17150M6255n4724l00063R9039k42776
16627F104119l36225j29507j2999k10526k95328N619P115o21912L46321k35265
16617D621412P7628l14035J50113k59643j69722k6487P9179K37246n26412K31270
16607D100549j15917m60194K86493k99341L3839j14221K92949l02161k77295n8887
16597C085814K45166l67342M47612o11609R2024q8088M55595n01400k00330K6073
16587B583515M9441k57572k5849J14340O0472k45483K42452k08560J28133K1479
16577B462368l4123p8542m4893l19408j17227K53414p9904O4127j89807l4638
16567A881367j81096K98255J10269n17425J84391n2482R8800J72815n6548j69195
$$ plain form
16637 7757193 7540547 7206990 7179787 6773538 6556388 6602643 6547919 6247856 6346895 6104119
16627 6104119 5767894 5638387 5625388 5414862 5119534 5125153 5132268 4510356 4856677 4621412
16617 4621412 4699040 4385005 4535118 4275475 4105753 4079266 4158445 4395691 3869279 4100549
16607 4100549 3984632 3524438 3810931 3511590 3545429 3431208 3724157 3421996 3144701 3085814
16597 3085814 3330980 2963638 3411250 2799641 2891665 2803577 3259172 2757772 2557442 2583515
16587 2583515 2632956 2375384 2349535 2463875 2524347 2278864 2521316 2312756 2440889 2462368
16577 2462368 2428245 2349703 2304810 1985402 1868175 2121589 2041685 2105812 1916005 1881367
16567 1881367 1700271 1998526 2108795 1591370 1775761 1723279 1822079 1994894 1938346 1769151
16557A769151j65515l5570j10979J66637Q8772m36623L54677n1572J46281l44419
16547A380840j03449J41326k7496J35673k79943j93066L67012j47661l657L13348
16537A582927p12527K31334K56978k85065L24068Q8377m11957K41162J13021m4687
16527A383631j25378r1883j06610k46046L25446j31528o492J41220k59772O754
16517H89342K81044D84401K41818L99402k45752j37522L78430J63759l86858p862
16507H89816k28753J13994j53862M1293j45544P9846J45045j02904J36629L2153
16497H07713J33756p8777l74265K36293Q6258j6037k50389K62863k1509j19865
16487F66041J84600C43123M22966j02416J56443P7005L918l99075J26245B52129
$$ plain form
16557 1769151 1603636 1568066 1457087 1623724 1712496 1275873 1630550 1578978 1725259 1380840
16547 1380840 1277391 1418717 1391221 1526894 1246951 1053885 1420897 1273236 1269579 1582927
16537 1582927 870400 1101734 1358712 1073647 1397715 1486092 1074135 1315297 1428318 1383631
16527 1383631 1258253 1166370 1059760 813714 1139160 1007632 1001140 1142360 882588 889342
16517 889342 1170386 484401 726219 1125621 879869 742347 1120777 1284536 897678 889816
16507 889816 661063 775057 621195 662488 516944 596790 741835 638931 775560 807713
16497 807713 941469 862692 488427 724720 810978 794941 544552 807415 785906 666041
16487 666041 850641 343123 766089 663673 820116 897121 901039 501964 628209 252129
16476F12904J01120k10890J86564j08741J31555j5859j45378K04401B34959L71212
16466F06171K27676l65729K13279j63830N8831Q8595j66604E0326N28190n7245
16456E21271j01696J65215p2963J59876k82319o6508N60371C31023o494K18871
16446E43400j91023L20073B22895K35034M25291C35021M86554k91608j40244J9214
16436D08937q9036M0166K80267j95281P7828q5476B11509K76406J50292A65393
16425C35900k0560A02095N10505k20939A94167M51775k58353K07341B97439p8642
16415B18797J20960L13353j96003A40343N49797B11730L43388k07723j09488J26037
16405C63944J8930A04600L75249B14541K29365I7185m8135N47829j29843j87678
$$ plain form
16476 612904 714024 503134 689698 580957 712512 696653 551275 755676 234959 606171
16466 606171 833847 468118 681397 517567 576398 664993 498389 50326 578516 521271
16456 521271 419575 584790 511827 671703 389384 322876 883247 331023 324529 543400
16446 543400 352377 672450 222895 457929 883220 335021 821575 529967 389723 408937
16436 408937 319901 360067 640334 445053 522881 437405 211509 487915 638207 165393
16425 335900 315340 102095 612600 391661 194167 645942 387589 594930 297439 218797
16415 218797 339757 653110 457107 140343 690140 211730 555118 347395 237907 363944
16405 363944 382874 104600 479849 214541 443906 97185 49050 596879 467036 279358
16395B79358m5154Q3024j49435J31717p9445m7448L67255k29031J9053e1987A28152
16383E09461B15012C8683M12303J08403k44898k8550J48475B07831a43971B94741
16372C61479K28p8570P1294I5957D2336J62971K24541A59433k0626D4827a20331
16360B68395q9935p9487J90396c6800C33977j53578i403B34845n195a67158B89406
16348C0504K95117A10701E3436O935K08074A7166P9591D4157M63084F7639J31938
16337A99577i2082B98937j07391j2311Q0642J52781L5883a12117A32489K3701
16327A56190i6458D40194A60121L2515e2901B18276k1187L12639b0868A3346J47802
16316A61148g2734G1447l5592f749n710H0862j7895A5680J29044O1342B2721d405
$$ plain form
16395 279358 234204 317228 167793 299510 220065 172617 539872 310841 329894 -51987 128152
16383 509461 215012 38683 450986 559389 314491 285941 434416 207831 -143971 294741
16372 361479 361707 283137 354431 95957 42336 205307 429848 159433 138807 44827 -120331
16360 268395 178460 98973 289369 -36800 333977 180399 -9403 234845 229650 -167158 289406
16348 30504 325621 110701 53436 60371 268445 17166 96757 44157 507241 67639 199577
16337 199577 -92082 298937 191546 179235 259877 412658 448541 -112117 132489 156190
16327 156190 -96458 440194 160121 192636 -52901 218276 197089 509728 -20868 13346 161148
16316 161148 -72734 71447 35855 -6749 -12459 80862 62967 15680 144724 206066 22721 -4405
16303C17058j16490H0965J63960p7401K07620j18066h3034B66168i7411n6309
16293a53720A15162b9164C71692A44839b9020A55707A352K52084Q7545p3792n6668
16282B10521m7897N4457q8105J74342j934a51528A74613g7998I082a08297n4141
16271a62438A08624O9199Q0167e1546C9325K01220E5094b0917C88475A23744g722
16259A07864b0602C6287a7209E6958c07027B16126f1187C8865g2715j24953j05888
16248c03556A39213l131K53354q3106m6816j20012A2974R2003J78080r9360A9876
16236e1131A95405a6478A66793j0092N3844J65191A08309a39802A15288m9175
16226F6113a12115A19087c34334i2947B31244f1117E6991A8007J80558c36169
$$ plain form
16303 317058 200568 80965 244925 167524 375144 257078 -83034 266168 -97411 -153720
16293 -153720 115162 -29164 371692 144839 -29020 155707 1352 253436 340981 267189 210521
16282 210521 162624 217081 128976 303318 301384 -151528 174613 -77998 9082 -108297 -162438
16271 -162438 108624 177823 257990 -51546 39325 240545 55094 -20917 388475 123744 -7722
16259 107864 -20602 36287 -17209 56958 -307027 216126 -61187 38865 -72715 -197668 -303556
16248 -303556 139213 136082 389436 306330 259514 139502 12974 104977 283057 183697 19876
16236 -51131 195405 -16478 166793 156701 210545 375736 108309 -139802 115288 66113
16226 66113 -112115 119087 -334334 -92947 231244 -61117 56991 18007 198565 -336169
16215A18641E311Q331a23193F03982D1023J5517J29997b26314E3921L2812c29200
16203I0590b21027A74438a75543E364J41213g3641C1362b6579r722G1338a19135
16191B17740C5797f5896j22519A10907a55829B04907a29116C22894e9906m9518
16181a09424L2787j06513K7001D7047c5948f984B9234a29073K1501p8280a567
16169e7066C23316i1246B51931Q4395C4206O5145b29259j13776A8664b84868f7099
16157a50435A8011a17520e6612k7531j9238D6014J0969J92074j7997j05372J39665
16146B65353p9678p3620g5951n3968m30983C77944n3453n4118d295l2713B62047
16134a64666A07010J12185c77633b4239B04484e760A52055a70636q3518F7433
$$ plain form
16215 118641 5311 13642 -123193 603982 41023 56540 186537 -226314 53921 86733 -329200
16203 90590 -221027 174438 -175543 5364 146577 -73641 31362 -26579 -36301 71338 -119135
16191 217740 35797 -65896 -188415 110907 -155829 204907 -129116 322894 -59906 -109424
16181 -109424 -76637 -183150 -156149 47047 -35948 -6984 29234 -129073 -107572 -185852 -1567
16169 -57066 323316 -91246 251931 336326 34206 99351 -229259 -343035 18664 -284868 -67099
16157 -150435 18011 -117520 -56612 -84143 -103381 46014 56983 249057 231060 125688 265353
16146 265353 185675 112055 -75951 -129919 -560902 377944 324491 270373 -4295 -37008 262047
16134 -164666 107010 219195 -377633 -24239 204484 -5760 152055 -170636 -254154 67433
16123c31029B93600O321j06729H8781d784B29086J1566A3211J80198j7947k3733
16112A51729B3585g8088j83756a11463A02393R9555K3971r2756R263H423R9119
16101A07542j6548k5022e6348l3479F4279J16597H6117a09814C18217a21660j26295
16090b47955h6463A60409h1745l61173B2693J10309C5315L00011c10249d0706
16079c02017q5747a9781I5085M4480a0360p1776n9620A34948m5914e5877K574
16068e3303D7439d385D8208A4276J45294b47028c0132l45537B63814e5723K312
16057e3411n5354d9853j55069k03942a05908j3862m3879O0609B12677c05502a51712
16045e1461o7349c6289m03046C5092a76300j53416A58309m4481m4785a35334j54754
$$ plain form
16123 -331029 293600 299921 193192 88781 -4784 229086 240652 13211 193409 175462 151729
16112 151729 23585 -78088 -261844 -111463 102393 201948 225919 133163 142426 8423 107542
16101 107542 90994 65972 -56348 -89827 64279 180876 86117 -109814 318217 -121660 -247955
16090 -247955 -86463 160409 -81745 -442918 22693 133002 35315 335326 -310249 -40706
16079 -302017 -387764 -19781 95085 139565 -10360 -82136 -141756 134948 89034 -55877 -53303
16068 -53303 47439 -4385 48208 14276 159570 -247028 -30132 -375669 263814 -55723 -53411
16057 -53411 -108765 -49853 -204922 -408864 -105908 -119770 -163649 -103040 212677 -305502 -151712
16045 -51461 -118810 -36289 -439335 35092 -176300 -329716 158309 113828 69043 -135334 -290088
16034b90088A10839C3549f5784D4650q199A2956b264m01720J94397c8965J4257
16023b4708l2568j53020A93186b6149A82847k9520b7799D5799b2731B21283i4433
16011F581f9374n8078j4684A13063J81680a9820G3122a66030A41672l3726J41089
16000B49035d6420j21915h1584A33242f1687q645A85167J33991a04435G317f6151
15988C5763m56K30642j2617F1441A1018K85476J23412I1581M46252g9427B73230
15976c8332G5492f945D387b9737j8303a4386j58487i313D0671a92312O4589a5711
15963C0256a00025o2836A89027c20197O2305C1047h5928J123k714j09597L6965
15952a60151B94374g2050j9012j4898b5056o7466D8336b35296j2958N6343E8243
$$ plain form
16034 -290088 110839 33549 -65784 44650 36451 12956 -2264 -403984 -209587 -38965 -24708
16023 -24708 -57276 -210296 193186 -26149 182847 153327 -27799 45799 -22731 221283 -94433
16011 6581 -69374 -127452 -142136 113063 294743 -19820 73122 -166030 141672 107946 249035
16000 249035 -46420 -168335 -81584 133242 -61687 -70332 185167 319158 -104435 7317 -66151
15988 35763 35307 265949 253332 61441 11018 296494 419906 91581 537833 -79427 273230
15976 -38332 75492 -6945 4387 -29737 -48040 -14386 -172873 -9313 40671 -192312 -127723 -15711
15963 30256 -100025 -162861 189027 -320197 -257892 31047 -85928 -84805 -87519 -197116 -160151
15952 -160151 294374 -72050 -91062 -105960 -25056 -92522 48336 -235296 -248254 -191911 58243
15940A28881a7328k52957A9575f2454l16987A5266d47387A23156c6551J2066k60178
15929b84663K6454A42163a79865F7893c92177a13294F9672c16362a2633j10089
15919a22722L3473j00571c8147B10701J9272k2150B2862Q9043N1864g8879K4883
15908e3996A68385B9180c42156I253d2496A06083a98674f5887l9820B54488d0552
15896f8087N722p5844A12210a2216H7772M3551a6925m63235J78874A7255b48895
15884B930K6537i9873F603K58918D2390i8791A10239c24762f9975L0865B2591
15872F1422A9120a4465j63295E6130j3879b29280j9117A31237A3086c55651J56388
15861a99263E8206K3414a25011O0584j33301j7185A85813a59822N7154l9153l13955
$$ plain form
15940 128881 -17328 -270285 19575 -62454 -379441 15266 -447387 123156 -36551 -24485 -284663
15929 -284663 -258209 142163 -179865 67893 -392177 -113294 69672 -316362 -12633 -122722
15919 -122722 -89249 -189820 -38147 210701 229973 207823 22862 111905 163769 -78879 -53996
15908 -53996 168385 29180 -342156 9253 -42496 106083 -198674 -65887 -105707 254488 -40552
15896 -68087 -62365 -138209 112210 -12216 87772 131323 -16925 -480160 -301286 17255 -248895
15884 2930 29467 -99873 6603 265521 42390 -98791 110239 -324762 -69975 -39110 22591
15872 61422 19120 -14465 -177760 56130 42251 -229280 -248397 131237 13086 -355651 -199263
15861 -199263 58206 81620 -125011 -64427 -197728 -214913 185813 -159822 -102668 -141821 -455776
15850d55776C9029e2247A61644c2630F1626c40569G2914A7473N1873c30549a07716
15838a24937c7652k93265C11823P0022A59250a51814b8317q48k69977B90235a11409
15826b12061F5781A1556J98718a53947E2127a80021L284m8126J10338j46557e652
15814a22989j61851A75055l9802B839A384i9082k57932B51142A10156c88719k3063
15803d11782h4320k63553a70549A46852a77548D2183e3442m44897K13420J19674
15793a65245A13996J66602d8839F1967d23050f8560K8452r4587F580K17593d6801
15781c458j42786D6334c46801B01789I6758m5021J21612m472p8107B1033c3119
15769d66851f3738B7497a392B2648d1098j37939c1144j02773F8193e120B76747
$$ plain form
15850 -455776 39029 -52247 161644 -32630 61626 -340569 72914 17473 69346 -330549 -107716
15838 -124937 -37652 -330917 311823 381845 159250 -151814 -28317 -29165 -299142 290235 -111409
15826 -212061 65781 11556 210274 -153947 52127 -180021 -176737 -224863 -114525 -261082 -5652
15814 -122989 -284840 175055 135253 2839 1384 -99082 -357014 251142 110156 -388719 -411782
15803 -411782 -84320 -347873 -170549 146852 -177548 42183 -53442 -498339 -284919 -165245
15793 -165245 113996 280598 -48839 61967 -423050 -68560 -40108 -134695 6580 224173 -46801
15781 -3458 -146244 46334 -346801 201789 96758 51737 173349 168877 90770 21033 -33119
15769 -466851 -63738 27497 -1392 22648 -41098 -179037 -31144 -133917 68193 -5120 276747
15757B92144F9399k5290a17011c8847J6797j90039k3533C25423r1889k3513J54534
15746C64555F0107O5466J01562a2604m3809o5584L2226C74476j76526J335b9784
15734A48854C9992a247o3110p567j49398G7551L6440R4051f708j00780C71827
15722c11534B17138H9627m0739a98556h3611A8134a08859N286C3489i3622m58333
15711e51955b13590D2104A7058d0151q9112o573k47520a75101C7759M6670J14016
15700A98445B0943c70319G3144O474h0545q0433j36655E0091a38833A85344E219
15688A61512d810A18480m5823c6173l00053i4383p3470A2955K96912d4456B0651
15676A33034a51018M409M4811q1056A74214l5969K1120K08147H6254j9402d0857
$$ plain form
15757 292144 69399 44109 -117011 -38847 -22050 -212089 -235622 325423 233534 210021 364555
15746 364555 60107 125573 227135 -12604 -56413 -121997 -89771 374476 197950 199285 -29784
15734 148854 39992 -1247 -64357 -71924 -221322 77551 113991 208042 -6708 -107488 371827
15722 -311534 217138 89627 48888 -198556 -83611 18134 -108859 -103573 33489 -93622 -551955
15711 -551955 -213590 42104 17058 -40151 -129263 -135836 -383356 -175101 37759 84429 198445
15700 198445 20943 -370319 73144 79618 -80545 -160978 -297633 50091 -138833 185344 5219
15688 161512 -4810 118480 72657 -36173 -336226 -94383 -167853 12955 309867 -44456 20651
15676 133034 -151018 -146609 -101798 -182854 174214 138245 159365 367512 86254 66852 -40857
15664h6526H9391N3553b98845A48448A5504K07468b77354M7610A10503b08313
15653a62087m9027g5381F4394B0441M8961R0487h7367A45127M7532d23291A72864
15641D7709b99238E041L21636j36593d50875J28378D2349M8572a95480A65027
15630B5767a26705j71529C4250a41220a3750r6646E7669J0711O3091a1911j04963
15619a16874j49430A89217q7731e7595A37676k7984N686e3610j44835d2373h430
15607G003f2846A60921a85243d1314k65717a06698B91354g1281B2387a66544m7785
15596b14329B6136c74893B01575a98559B35843a10151E9230J67138i5497A30850
15585A01179c46302c171F8295J92252G1024c0075l5764B02866h4293K8806A37221
$$ plain form
15664 -86526 89391 142944 -298845 148448 15504 222972 -277354 -229744 110503 -208313
15653 -162087 -211114 -75381 64394 20441 69402 159889 -87367 145127 192659 -423291 172864
15641 47709 -299238 5041 326677 190084 -450875 -322497 42349 90921 -195480 165027
15630 25767 -126705 -298234 34250 -141220 -13750 -110396 57669 68380 131471 -11911 -116874
15619 -116874 -266304 189217 101486 -57595 137676 109692 115378 -53610 -198445 -42373 -8430
15607 7003 -62846 160921 -185243 -41314 -307031 -106698 291354 -71281 22387 -166544 -214329
15596 -214329 26136 -374893 201575 -198559 235843 -110151 59230 226368 -95497 130850
15585 101179 -346302 -3171 68295 260547 71024 -30075 -65839 202866 -84293 -55487 137221
15573g5360j43096A31792h0663c39k36875C5316b38273M9955j73036h6799K6648
15562f0151A50059j7139A136a9144C6669b69838K1250B88785g1396j37249B02766
15550A31002i3125D8968d0404A86162a30963A26170a86594A91817D112h7619j13916
15539b01535k9304e0598A14529e5201j69996i5430k1873j057d2951j04762b7717
15527A51114h2838j02168L8498N827F8309j280J28110b01088o1522A74521a29250
15515a16631k18755I9755J99337j34247n8392a00543J7637r9091k05127a37646
15504a46573O173A33698b13624R5551E1188J2093b39916A86599B1973D060b39254
15492a51962A74343o8173f6895b9804m2069j82395d7156K1934K430l1907j41572
$$ plain form
15573 -75360 -218456 131792 -80663 -339 -237214 35316 -238273 -188318 -361354 -86799 -60151
15562 -60151 150059 132920 1136 -19144 36669 -269838 -248588 288785 -71396 -208645 202766
15550 131002 -93125 48968 -40404 186162 -130963 126170 -186594 191817 4112 -87619 -201535
15539 -201535 -230839 -50598 114529 -55201 -225197 -95430 -117303 -118360 -42951 -147713 -27717
15527 151114 -82838 -185006 -146508 -140681 68309 67029 195139 -201088 -262610 174521 -129250
15515 -116631 -335386 99755 299092 164845 106453 -100543 -82906 -181997 -387124 -137646
15504 -146573 -140400 133698 -213624 -118073 51188 63281 -239916 186599 21973 4060 -239254
15492 -151962 174343 106170 -66895 -29804 -71873 -254268 -47156 -25222 -22792 -54699 -196271
15481a96271B12363p7581K2055d718l8392A15530a52591D05674a93616k7112p8690
15470b99418C76559d0441a2275B2336H012p21O5756e8605C83241a21400B27373
15458b30487N0792I6422A9867d293q1782J1386j23101E3981d8314I8253b31763
15446a549D2235a6691d898k0209A89478l2617F8454a76999d3727k3267B0640e4283
15433A20579N3636e3151A41917b13093H5441M4287b14503j39316a37021B04090
15422A25872J08834O3921K9897c6282l17808A50735J56822a60746A95671f4620
15411G7145L5828b95730B7209a52425M5267A76794a27781f0614j53923B01180
15400H2092O0293f5615m0127B58272b61195F888a56072g6771L2318C37360b57038
$$ plain form
15481 -196271 212363 134782 156837 -4718 -43110 115530 -152591 405674 -193616 -220728 -299418
15470 -299418 376559 -40441 -12275 22336 8012 7291 73047 -58605 383241 -121400 227373
15458 -230487 -179695 96422 19867 -4293 -86075 -74689 -197790 53981 -48314 98253 -231763
15446 -1549 42235 -16691 -4898 -25107 189478 156861 68454 -176999 -43727 -66994 20640 -54283
15433 120579 174215 -53151 141917 -213093 85441 129728 -214503 -353819 -137021 204090
15422 125872 234706 298627 328524 -36282 -354090 150735 307557 -160746 195671 -64620
15411 77145 112973 -295730 27209 -152425 -107158 176794 -127781 -60614 -214537 201180
15400 82092 142385 -65615 -105742 258272 -261195 6888 -156072 -76771 -44453 337360 -257038
15388f6712q4302j26407J13942D0737h3779j47715A97429R4219A08872e1851D7343
15376a69587B69858b10331H3694K01623c00539A39709m6256R895a15052J4144
15366a00908m1107A16033J2301H561c20140J50514K9170J663A2648L2726K26982
15355B72356E0079f7579B644J8004K05414b00314k35340F2665f0151l7889j10796
15344b08836m1307O3867B18303r9016k1093c2615p4662B6977L7858J13838c80786
15332A90698E7649c66078f7850A45839l059b172A88468E1935N64246a89158A3749
15320B98275q0348J3785b78399A55213g2656B55821N4837j07309A8208c67871
15309A79480O6606d984j42777C3158E333K25741q0170a18340B9640J59008f404
$$ plain form
15388 -66712 -151014 -277421 -163479 40737 -83779 -231494 197429 291648 108872 -51851 47343
15376 -169587 269858 -210331 83694 285317 -300539 139709 93453 103348 -115052 -100908
15366 -100908 -142015 116033 128334 8561 -320140 -169626 -140456 -138793 12648 45374 272356
15355 272356 50079 -67579 2644 20648 226062 -200314 -435654 62665 -60151 -98040 -208836
15344 -208836 -250143 -186276 218303 119287 98194 -32615 -107277 26977 64835 178673 -380786
15332 190698 57649 -366078 -67850 145839 142780 -2172 188468 51935 616181 -189158 13749
15320 298275 217927 231712 -278399 155213 -72656 255821 310658 203349 18208 -367871
15309 179480 246086 -4984 -147761 33158 5333 231074 150904 -118340 29640 188648 -6404
15297a05157A22770N0349b52379F7041e8781H6901K83423j06502A28684L269h5787
15285c6285A23590h5206A04970D1503J45618a43676A83091K18754a78688L358
15275a75330O7344I2867J30829C7135J54928N772L4043q7565D9744D410M10520
15264D14930A41281b98607A27925k1757N8557c25658B0939O7054A3960O9691J1264
15253I4915b91526C54488A64826K5932J51565N90775N61128n52858K98494k72548
15243I67314j35243b16685B12164Q2975l9581h1304I2551k0446J02324d5278B14538
15231D6554b18436I5080J11061g2144A71411f1107k80022I2431J37989L79955
15221F10375F503R2617L3398b3463m131H2980M4835b08621c5038J0989j68222
$$ plain form
15297 -105157 122770 173119 -252379 67041 -58781 86901 370324 263822 128684 131953 -85787
15285 -36285 123590 -85206 104970 41503 187121 -143676 183091 401845 -178688 -175330
15275 -175330 -107986 92867 223696 37135 192063 197835 231878 144313 49744 4410 414930
15264 414930 141281 -298607 127925 106168 164725 -325658 20939 87993 13960 83651 94915
15253 94915 -291526 354488 164826 190758 342323 933098 1494226 941368 1239862 967314
15243 967314 832071 -216685 212164 295139 255558 -81304 92551 72105 174429 -45278 214538
15231 46554 -218436 95080 206141 -72144 171411 -61107 -341129 92431 230420 610375
15221 610375 6503 99120 132518 -23463 -27594 82980 127815 -208621 -35038 -24049 -192271
15210a92271A34318a25180A46236Q8990d75839C1841a28304H7902a78924A66254
15199B62164l5121j07235e2592A39515c56865A34490J30664A09104a7214l18669
15189c35883A16636m1143R5171L5566H7414J68254a71832A67467d6919A73081
15178a81961B60107N4659A44880M9090j5588A1546K45017A22302a82516C04308
15167C11006n5987b26588D194K34373m1433a3101A90311e0610g366A53909G0413
15155i5976p5365A49722m5903J80942p0540J13580J13775c5326K148B06695M52
15144B07147E3003k2516d24320A00892k0995J52517b99824a06202B45825N5460
15134C01285A5852L88171G8606Q3351f1995F217b357B49752H0393K81653C8727
$$ plain form
15210 -192271 134318 -125180 146236 235226 -475839 31841 -128304 87902 -178924 166254
15199 262164 227043 119808 -52592 139515 -356865 134490 265154 109104 -17214 -335883
15189 -335883 116636 75493 170664 206230 87414 255668 -171832 167467 -46919 173081
15178 -181961 260107 314766 144880 193970 178382 11546 256563 122302 -182516 304308
15167 311006 255019 -226588 4194 238567 197134 -13101 190311 -50610 -7366 153909 70413
15155 -95976 -171341 149722 103819 284761 214221 327801 441576 -35326 -33178 206695 207147
15144 207147 53003 30487 -424320 100892 79897 232414 -299824 -106202 245825 301285
15134 301285 15852 404023 78606 161957 -61995 6217 -2357 249752 80393 362046 38727
15122a05472D7641a83894A06482B9027g2541A92239q2274b037A83566J55010j64848
15111A73728B0412a63463G3781J13063c26589E8609A8881L60018A01556O6529
15101A68085M5336j03046M3572J6613b96340a26593e0874C7325j0244h9288C22116
15089a42923L4545C07329C8713J22555H0353k6103J11403b6330A05037K7305O989
15078A39331m8583L17059E2880J19676J73096l4450I1389a4991A75077D0490K07378
15067B47868j1803b5899C19515n8999k8240L8232J33421A28736E9364L18038b09118
15055f65j1941H2738J68785b03846C21396A46797K0007K25024A53598R2151B1159
15043A63858j1172J11846I10L58354M1540H2801L47471j67687A28512k8246N8090
$$ plain form
15122 -105472 47641 -183894 106482 29027 -72541 192239 109965 -2037 183566 338576 173728
15111 173728 20412 -163463 73781 186844 -326589 58609 18881 378899 101556 168085
15101 168085 213421 110375 153947 170560 -296340 -126593 -50874 37325 27081 -89288 322116
15089 -142923 -108378 307329 38713 161268 80353 54250 165653 -26330 105037 132342 139331
15078 139331 90748 407807 52880 172556 345652 311202 91389 -14991 175077 40490 247868
15067 247868 236065 -25899 319515 260516 232276 270508 403929 128736 59364 377402 -209118
15055 -665 -12606 82738 251523 -203846 321396 146797 166804 391828 153598 245749 21159
15043 163858 152686 264532 910 359264 400804 82801 430272 262585 128512 100266 158356
15032A58356L2662f3300B30655J29171A30926c04538f3603B4940L13107c703k1288
15021b4991D8608K18031n2588F7418J00496J69584E3636J62825m0309k4492J51487
15010C03147C2928G906K72673b7406D55056j43682j179H8664K2653J08385J96583
14999D16285A66553a20742C58540A15893L38254A07861L27275B1060J06840J25797
14989B53697l7823D7002a02402H4513L90614q7473K5304P4026j88A64114p6848
14978H7266k9947M15276P4696F8250M34736B35886J56503O1234Q7019I3317K57240
14967C50557H7725J48442L10144A91203N89395A79904P6969J38614A93370K0872
14957B14242J12305L00755j74049j40934L4451j07240J02954n5451b424A68223
$$ plain form
15032 158356 191018 -63300 230655 359826 130926 -304538 -63603 24940 338047 -3703 -24991
15021 -24991 48608 266639 214051 67418 167914 337498 53636 216461 176152 151660 303147
15010 303147 32928 7906 280579 -27406 455056 311374 310195 88664 111317 219702 416285
14999 416285 166553 -120742 358540 115893 454147 107861 435136 21060 127900 253697
14989 253697 215874 47002 -102402 84513 475127 387654 412958 486984 486796 164114 87266
14978 87266 57319 472595 547291 68250 502986 235886 392389 453623 540642 93317 350557
14967 350557 87725 236167 546311 191203 780598 179904 256873 395487 193370 214242
14957 214242 326547 627302 453253 312319 346770 239530 342484 287033 -2424 168223
14946A50888F7747R3349O3614p5800m8165K09725o903G9162L19817j0217A41675
14934I5252M47311k06151j28783J02610J30802c146E51570k50176J8282N3310
14924C72986r7973I0946J75572J70965J0262j75740O3458J44526M8959j47997
14914C80951K40727A99549R3801L8547A39652O27491l00586a5168B29876J16331
14904C46207A35625N804K74648D6750M21699F1392j9375K28613K04180A75780
14893B69540j9735Q5566r7610J99093o1294N7977N0511A44319K29738I6217N27341
14882F23558I0639M88577G7672L59451A99040K46877B20002J03282K86299B28618
14871D76584j21723a0370B07989P1341P6441H4099M08478A90297M60051j78054
$$ plain form
14946 150888 67747 161096 224710 148910 100745 310470 303567 79162 398979 388762 141675
14934 95252 542563 336412 207629 310239 441041 -3146 551570 301394 319676 372986
14924 372986 275013 90946 266518 437483 447745 272005 335463 479989 528948 380951
14914 380951 621678 199549 293350 331897 139652 767143 466557 -15168 229876 346207
14904 346207 135625 141429 416077 46750 468449 61392 42017 270630 474810 175780
14893 269540 249805 335371 237761 436854 375560 433537 484048 144319 374057 96217 623558
14882 623558 90639 579216 77672 437123 199040 445917 220002 323284 609583 228618
14871 476584 354861 -10370 207989 279330 355771 84099 492577 190297 650348 472294
14861D72294L79402k19213C00330m7236L91042l11693k0406J85331J23572j46364
14851D74576j77584O1224j30155J14926J47579r1299A31254J62581L86520B18540
14840C25516M28556C38561A27581N16063B18413p4017K98200N0029j97724J54266
14830D49167B05122J61015J21694J44686k33512J11545K35711k77726j22924J30541
14820D76152j37081J88257j84736p9846K40733k06162J97798A33478M84911K05675
14810H24064B83248K97998J55581p8872k41922N07368m48880J32516j05304J24464
14800F26197L50826B68913J6885L50323J29311B70404J62134j2162j0424J54849
14790E64801B65811N93385C70394O14206j66468C42623K12353K76815k85550k2540
$$ plain form
14861 472294 851696 632483 300330 253094 644136 332443 312037 497368 620940 474576
14851 474576 296992 358216 228061 342987 490566 399267 131254 293835 680355 218540
14840 325516 754072 338561 127581 643644 218413 144396 442596 492625 294901 449167
14830 449167 205122 366137 487831 632517 399005 510550 746261 468535 345611 476152
14820 476152 339071 527328 342592 262746 503479 297317 495115 133478 618389 824064
14810 824064 283248 581246 736827 657955 416033 923401 474521 607037 501733 626197
14800 626197 977023 268913 285798 636121 765432 270404 432538 420376 409952 564801
14790 564801 265811 859196 370394 984600 818132 342623 554976 831791 546241 523701
14780E23701J67249j933J6558p6728l4565J92270J32757C79722L34815p2167j74667
14769D67703P2147o9975K21113L73167k30663D10516K81293K30229l22021K076
14759F02093k39230N68391l88949n4611K59002J52963k59411j6850R8533l36513
14749C85418K084K50726n2207K13133J75082k89037C38858N14412j07494o6007
14739F79769N2442j21689K54469r5797l5390K6453J04781r4917k00977m5108M22007
14728I46043j68060k41656J34218K20765o420N6355k99883L94951l3020m21600
14718E81693K82852k1133j84891k1826o783L28299n8547n1402J15928j8062L00751
14707A246879k76798j01438M9030J29221M8622o1691m58j64357J90691O4974N4449
$$ plain form
14780 523701 690950 689017 705575 628847 594282 786552 919309 379722 714537 642370 467703
14769 467703 539850 469875 690988 1064155 833492 410516 691809 922038 600017 602093
14759 602093 362863 931254 542305 487694 746696 899659 640248 623398 721931 385418
14749 385418 387502 638228 586021 799154 974236 685199 338858 853270 745776 679769
14739 679769 732211 610522 864991 769194 733804 760257 865038 770121 569144 524036 946043
14728 946043 777983 536327 670545 891310 884890 941245 641362 1036313 1003293 581693
14718 581693 864545 843412 658521 636695 629912 958211 899664 848262 964190 946128 1246879
14707 1246879 970081 868643 917673 1046894 1095516 1033825 1033367 869010 1059701 1124675 1179124
14696A179124j35765j34144q8530K00066k69188J04386J23698l60192L67641j17809
14686H69287L33652o7603j77407M6068J02808o2597J5968k9123j42356K79875
14676A168572l89639L76286l771K67590l74958J4910K5932J6974k42443R2359
14666I51812L80642k17813J26488k79376J69953p6355J44354J89199j60759l47342
14656H80803R7898K50342k59472O983K58891m38726P27109j12390j98271j18214
14646A094953K30594J54569k40706J64352o2769n6962Q5859j01138L41305m66030
14636A144027L87218m98705J40684J38820J52451j62807k4426p1163L88618j39188
14626A455529p8129o4447N18841m43120K3296l49886M56882K06985j67693K63310
$$ plain form
14696 1179124 1043359 909215 820685 1020751 751563 855949 979647 619455 987096 869287
14686 869287 1202939 1135336 957929 1003997 1106805 1044208 1060176 1031053 888697 1168572
14676 1168572 778933 1155219 1151448 1419038 1044080 1058990 1084922 1101896 859453 951812
14666 951812 1332454 1114641 1241129 961753 1131706 1055351 1199705 1388904 1228145 880803
14656 880803 978701 1229043 969571 976554 1235445 796719 1523828 1411438 1213167 1094953
14646 1094953 1325547 1480116 1239410 1403762 1340993 1284031 1369890 1268752 1610057 1144027
14636 1144027 1531245 1032540 1173224 1312044 1464495 1301688 1277262 1206099 1594717 1455529
14626 1455529 1377400 1312953 1831794 1388674 1411970 1062084 1518966 1725951 1558258 1821568
14616A821568k08983K22764k80805J52823r0821o3024K34161l41586M82122n45321
14606A382898R1254O891L11075l3536j46818J34865k50477K72211k37644M16945
14596A947664l96501K26463J86112j31767j14831M15065k24829j76718N89008
14587B319666q7748j78666l07523L36131J20058j25709j03819j24175K90683M68491
14577B607389o00183K73811k13153J40376O9745M3290M7719l38993J18536K49716
14567B398253K00164P5642J89241n25952K95304J90806l67587L01994L19099n6826
14557C020138L34365q5920M64095j64535K63915K58445R27468Q60072K399428
14548H277471M241195R444933J7694724R243565B3654369I981639m885178j681800
$$ plain form
14616 1821568 1612585 1835349 1554544 1707367 1616546 1553522 1787683 1446097 1928219 1382898
14606 1382898 1474152 1481043 1792118 1758582 1611764 1746629 1496152 1768363 1530719 1947664
14596 1947664 1551163 1777626 1963738 1831971 1717140 2132205 1907376 1730658 2319666
14587 2319666 2231918 2053252 1745729 2081860 2201918 2076209 1972390 1848215 2138898 2607389
14577 2607389 2007206 2281017 2067864 2208240 2277985 2321275 2368994 2030001 2148537 2398253
14567 2398253 2598417 2674059 2863300 2337348 2632652 2823458 2455871 2757865 3076964 3020138
14557 3020138 3354503 3268583 3732678 3568143 3832058 4090503 5017971 5878043 8277471
14548 8277471 12518666 21963599 39658323 48901888 23654369 9981639 5096461 3414661
14540C414661o18758j55699m37242L72118l69359J88230R0464l50705K91893q3142
14530B342461O4795n8253k3515P911J86235j65438L80699n8330j07748j35327
14520B433490J59832p4819L15673j87796m9672J93432P2620J29702n1226K31511
14510C172747l44025J37929J89790P3074Q6223l81118K11473j13643M09152O1461
14500C503063k80945J1162K34578O8706K64841m51692K40630j70496L85790K38018
14490D043655j63642k66246M20060j98838N36707l87731o4690L70693m53914J19130
14480C955184j0448K78944J14057k01844M14664k26178m4054O79594k02798l70121
14470D387000J66558j6814N76816m23160M57039k56739N03762n94328K69605M48083
$$ plain form
14540 3414661 2795903 2640204 2202962 2575080 2205721 2393951 2484415 2133710 2425603 2342461
14530 2342461 2407256 2349003 2325488 2333399 2519634 2354196 2734895 2676565 2568817 2433490
14520 2433490 2593322 2518503 2834176 2646380 2596708 2790140 2862760 2992462 2941236 3172747
14510 3172747 2828722 2966651 3156441 3229515 3315738 2934620 3146093 3032450 3441602 3503063
14500 3503063 3222118 3233280 3467858 3536564 3801405 3349713 3590343 3419847 3805637 4043655
14490 4043655 3880013 3613767 4033827 3834989 4371696 3983965 3919275 4289968 3836054 3955184
14480 3955184 3944736 4223680 4337737 4135893 4550557 4324379 4280325 4959919 4757121 4387000
14470 4387000 4553558 4536744 5113560 4690400 5147439 4890700 5394462 4800134 5069739 5517822
14460E517822k16115o7940K56711j13252L08954J05813k39111R6412J66695k60617
14450E555372J02950k37988P49112Q3238j8131M9372P289L61507j21476J47419
14440F678664q7328L79655m80459J79419J62888L6398L98734L470L19356k83210
14430G307587L72428J12921j13313K24550J31424Q1033M91169p7006j34044j0804
14420H385945N49216J76408m88599M93190l97406Q58495j72675j6582J89300M57354
14410A0034646M3831m2659L14322j48667L97883J08665J29844K73718L25288q6892
14400A1349979L63752M5036n9152N23124n3936L07916J70600L68184P8540L41086
14390A3435129L10131n1191P47127k6239L74383K58539L96541J36937j62626M13472
$$ plain form
14460 5517822 5301707 5233767 5490478 5377226 5686180 5791993 5552882 5649294 5815989 5555372
14450 5555372 5658322 5420334 6169446 6252684 6234553 6283925 6291214 6652721 6531245 6678664
14440 6678664 6591336 6970991 6490532 6669951 6832839 6869237 7267971 7271441 7590797 7307587
14430 7307587 7680015 7792936 7679623 7904173 8035597 8116630 8607799 8530793 8396749 8385945
14420 8385945 8935161 9111569 8622970 9116160 8718754 9577249 9404574 9387992 9577292 10034646
14410 10034646 10078477 10035818 10350140 10201473 10599356 10708021 10837865 11111583 11436871 11349979
14400 11349979 11713731 11758767 11699615 12222739 12168803 12476719 12647319 13015503 13094043 13435129
14390 13435129 13745260 13694069 14441196 14414957 14789340 15047879 15444420 15581357 15418731 15832203
14380A5832203N29855L20461J1100M86053J4049M53284M24472L84700L09090L76316
14370A9141583L63631P16022K70025q2248J174445J11055M16001P18348K30226
14361B3059088M28131M94737Q41112K63952Q17369N52600Q28734l2546O41337
14352B7894514P92047Q82498Q22576J035090P09765M80112N40063J426147N32182
14343C5114994J159284P84420J244541J000825J336120O12763J294858R71843
14335D3519648J755841Q60304J633656J164128J607274J782999J511534J896890
14327E5732274J368393J988441K029022K011960J763151K710329J914467L099865
14319G2617902K114402K589295L025190K967908L162418L440661L448741L763397
$$ plain form
14380 15832203 16362058 16682519 16693619 17179672 17193721 17647005 18071477 18456177 18765267 19141583
14370 19141583 19505214 20221236 20491261 20409013 21583458 21694513 22110514 22828862 23059088
14361 23059088 23487219 23981956 24823068 25087020 25904389 26456989 27285723 27253177 27894514
14352 27894514 28686561 29569059 30391635 31426725 32136490 32616602 33156665 34582812 35114994
14343 35114994 36274278 37058698 38303239 39304064 40640184 41252947 42547805 43519648
14335 43519648 45275489 46135793 47769449 48933577 50540851 52323850 53835384 55732274
14327 55732274 57100667 59089108 61118130 63130090 64893241 67603570 69518037 72617902
14319 72617902 74732304 77321599 80346789 83314697 86477115 89917776 93366517 97129914
14311I7129914L896624M048845M092372M758454M702833N279592N360601N602920
14303A34872155O054886O561962O677691P508284P259347Q149375Q398479R133235
14295A94615414R391735J0001125J0405374J1092962J1983742J1618171J3341423
14288B72449946J3309606J3781889J3784077J5010753J4755562J4968024J5265437
14281C73325294J4926258J4918863J4239674J3488263J2626671J1279030R574009
14274D64378062P601189L026933p20379k109591j829017O62752m947280o590165
14266D59472504q995428r602683j1275890j2347858j3408304j4075229j4691599
14259C75075513j5295308j5460871j5417909j5034859j4553344j3274207j4147454
$$ plain form
14311 97129914 101026538 105075383 109167755 113926209 118629042 123908634 129269235 134872155
14303 134872155 140927041 147489003 154166694 161674978 168934325 177083700 185482179 194615414
14295 194615414 204007149 214008274 224413648 235506610 247490352 259108523 272449946
14288 272449946 285759552 299541441 313325518 328336271 343091833 358059857 373325294
14281 373325294 388251552 403170415 417410089 430898352 443525023 454804053 464378062
14274 464378062 471979251 475006184 474285805 472176214 470347197 471009949 466062669 459472504
14266 459472504 450477076 440874393 429598503 417250645 403842341 389767112 375075513
14259 375075513 359780205 344319334 328901425 313866566 299313222 286039015 271891561
14252B71891561j3120514j2824616j1908939j1585221j0707950j0261968r544117
14245A91938236r100017q598641p675487p461202p750652o679693o434153n289618
14237A32948773n709147n859934n060221m962261m329154m244319l544751m086174
14229I5152812l987495l127241l410221l003631k859331k899458l045649k675761
14221G0144025j955845k353526j980203k439016k049276j831591j667331j430153
14213E4437084j281011k162978j397264j759703j374488r39338p67503j107111
14205D3647688j790179j171136j035861r58705r69628n48707j455019j096139
14197C4622314n70708p68885j044487o18530o82948r06849q33859n99652o50231
$$ plain form
14252 271891561 258771047 245946431 234037492 222452271 211744321 201482353 191938236
14245 191938236 182838219 174239578 166564091 159102889 151352237 144672544 138238391 132948773
14237 132948773 127239626 121379692 116319471 111357210 107028056 102783737 99238986 95152812
14229 95152812 91165317 88038076 84627855 81624224 78764893 75865435 72819786 70144025
14221 70144025 68188180 65834654 63854451 61415435 59366159 57534568 55867237 54437084
14213 54437084 53156073 50993095 49595831 47836128 46461640 45522302 44754799 43647688
14205 43647688 41857509 40686373 39650512 38691807 37722179 37173472 35718453 34622314
14197 34622314 34051606 33282721 32238234 31619704 30936756 30029907 29196048 28596396 27946165
14188B7946165q75489l95658o66931j029004m09p61039l90195o19026j86011j025096
14178B1997307l5587o33087k87256k80241o10891k41659n71851l87326l60031
14169A8589378j7964o64899k27457k06713o23833n4513k17513p03244l66491k31364
14159A5275387K74755p93211j96670J71479p93818j4253k50474m80179K23526
14150A3416542l53525j90645r8873n40320K00913m35519l04137L8309n05418J61950
14140A1389277k48908l33129l165k43946j84877R1438k28802o1272m4586m08234
14130I723796l20230N33285o91941O6108J86429k72812j15118n41911j46065N12082
14120H933623q54201L52645J43615m12163J06634l65186j75656K55086k74645
$$ plain form
14188 27946165 27070676 26675018 26008087 24979083 24978674 24217635 23827440 23208414 23022403 21997307
14178 21997307 21961720 21328633 21041377 20761136 20150245 19908586 19336735 18949409 18589378
14169 18589378 18571414 17906515 17679058 17472345 16848512 16793999 16576486 15873242 15506751 15275387
14159 15275387 15550142 14756931 14560261 14731740 13937922 13923669 13673195 13193016 13416542
14150 13416542 13063017 12872372 12773499 12233179 12434092 11998573 11694436 11732745 11227327 11389277
14140 11389277 11140369 10807240 10804075 10560129 10375252 10466690 10237888 10176616 10132030 9723796
14130 9723796 9403566 9936851 9244910 9311018 9497447 9224635 9109517 8567606 8421541 8933623
14120 8933623 8079422 8432067 8575682 8163519 8270153 7904967 7729311 7984397 7709752
14111G709752k10611j82415P5400J34766m95971J62992m28084J07081J9204K21338
14101G113452k44743m43319O974J48289k37015K3153l84252J94082k89503P9785
14091E966903j51423Q2399J18724l79987j43798K33096l38897K09085m48844m1125
14081E106133K07780j8681o1852j80734k35849M22270m10366j10832Q2744J9731
14071D820344k48478J82958o6840k10315M3801J62849q9262q771k82570K65861
14061D569577o26352O16882m63447L34569M7706l50596L19839j56366M2077l55428
14051C978461J79452l79601j43637J31980n1905j19763K09395M2434m20962K07917
14041C633771j71387J14259N5239j87450k68019J70071L2398Q7252l05681j8542
$$ plain form
14111 7709752 7499141 7316726 7392126 7526892 7030921 7193913 6765829 6872910 6892114 7113452
14101 7113452 6868709 6425390 6432364 6580653 6343638 6366791 5982539 6176621 5887118 5966903
14091 5966903 5815480 5897879 6016603 5636616 5492818 5725914 5387017 5596102 5147258 5106133
14081 5106133 5313913 5295232 5233380 5052646 4816797 5239067 4828701 4717869 4800613 4820344
14071 4820344 4571866 4754824 4687984 4477669 4521470 4684319 4595057 4586286 4303716 4569577
14061 4569577 3943225 4560107 4096660 4431229 4478935 4128339 4448178 4291812 4333889 3978461
14051 3978461 4157913 3778312 3634675 3766655 3714750 3594987 3804382 3846816 3425854 3633771
14041 3633771 3462384 3576643 3631882 3444432 3176413 3346484 3378882 3466134 3160453 3141911
14031C141911J88999O527J02898j79825k88633M03122M5798l97631j23395l0788
14021B868983Q3743l81911J65945M14589o20542J78643K03804j95052n1345J22177
14011B789034j16654j41878J92889l78696j261K17046O0660n3332j2991K46660
14001B801477l33807o8328k21387M00944j79105m54744L3685L79077L5466j67277
13991B226001K88592M54006Q84262L189403P753684J7424156J7021788k1592127
13983B7649765A3766220m955846k293244r93295q09713o75897l89442j27123l54756
13974C166904k7863n76232M74517l2051m0932m42063Q0828j90156J52211j79340
13964B385823j0414J24114J85100o01847k7073M41263l25979J44799j09274Q1962
$$ plain form
14031 3141911 3330910 3337437 3440335 3260510 2971877 3374999 3420797 3023166 2899771 2868983
14021 2868983 2952726 2570815 2736760 3151349 2530807 2709450 2913254 2718202 2666857 2789034
14011 2789034 2672380 2530502 2723391 2344695 2343434 2560480 2621140 2567808 2554817 2801477
14001 2801477 2467670 2399342 2177955 2578899 2399794 1945050 1978735 2357812 2393278 2226001
13991 2226001 2514593 2968599 3852861 7042264 14795948 32220104 49241892 27649765
13983 27649765 13766220 8810374 6517130 5523835 4714122 4038225 3648783 3521660 3166904
13974 3166904 3139041 2562809 3037326 3005275 2964343 2522280 2603108 2412952 2565163 2385823
13964 2385823 2375409 2499523 2684623 2082776 2055703 2496966 2170987 2315786 2206512 2288474
13954B288474n4008J68845l64041L07091k20584J46717k82903L67387l45039L24098
13944B336037k48358j1873J20151j57264l60186K9373N62724m46028K76763j79522
13934A921817L9332m56738J97548K4412N6522N3046j82478L09371m45882K83045
13924A799995j02632O4453r5798j63326M08831l72951o4244J26885M33428n11734
13914A522907L62975k03037k19697K03963k65724K12840k18304J39175J5335K38937
13904A789370m70046Q3959M31342j28826m0449k8944j17727n2791j15482M05076
13894A755482m24362k2009k6109J86353j50839l66686M20059r3548K32802k45132
13884A266011N44998p38109M52834j81875M6692j9909N7414r4684M6526j54766
$$ plain form
13954 2288474 2234466 2403311 2039270 2346361 2125777 2272494 1989591 2356978 2011939 2336037
13944 2336037 2087679 2075806 2195957 2038693 1678507 1707880 2270604 1824576 2101339 1921817
13934 1921817 1961149 1504411 1701959 1726371 1782893 1835939 1653461 1962832 1516950 1799995
13924 1799995 1697363 1761816 1666018 1502692 1911523 1538572 1474328 1601213 2034641 1522907
13914 1522907 1885882 1682845 1463148 1667111 1401387 1614227 1395923 1535098 1550433 1789370
13904 1789370 1319324 1403283 1834625 1705799 1665350 1636406 1518679 1465888 1350406 1755482
13894 1755482 1331120 1309111 1283002 1469355 1318516 951830 1371889 1278341 1511143 1266011
13884 1266011 1811009 1072900 1525734 1343859 1390551 1370642 1428056 1333372 1379898 1225132
13874A225132K2609K08239j54251r4386R3802j00634j84479K87404k88397K55876
13864A270915J67435o5644j90222j21137J80793j87233k7781L34775j94931r7415
13854A069555J98208l71070L29359J19789P1467o57069L01956L69021l74635j16362
13844I40219R9087k5096M9012J39422R7681j13993j21970L63396p0192k58237
13834A099329j98250J07610J29242m23978N15082q6464k05479j33767J71856m7955
13824I27226j22565j33508K67954k6243l4424J16880M72741l28327k90936K57697
13814A106495n14748O96772j15561l44486j34438R8066Q5766Q684j12478L30349
13804A104421k2186k16653k56879M10422k98456M17880j50851J6803j47636k08182
$$ plain form
13874 1225132 1247741 1455980 1301729 1207343 1301145 1200511 1016032 1303436 1015039 1270915
13864 1270915 1438350 1372706 1182484 1061347 1242140 1054907 1027126 1361901 1166970 1069555
13854 1069555 1267763 896693 1226052 1345841 1417308 760239 1062195 1431216 1056581 940219
13844 940219 1039306 1014210 1063222 1202644 1300325 1186332 1064362 1427758 1357566 1099329
13834 1099329 901079 1008689 1137931 713953 1229035 1142571 937092 803325 975181 927226
13824 927226 804661 671153 939107 912864 878440 995320 1468061 1139734 848798 1106495
13814 1106495 591747 1288519 1172958 828472 694034 792100 877866 886550 774072 1104421
13804 1104421 1082235 865582 608703 1019125 720669 1138549 987698 1004501 856865 648683
13794F48683M02140k22621J19639K15442k05058m01848L02395k95440L44167j59071
13784G48428Q164K31641j02184J18246J07109l39960J59584R2365j58217k55563
13774F09613J41669m3900K0979m7119k61638K08583J20772j1674q2821J9002L04151
13763I77617o6163r7736j66423O7944k35854M07677P5868k26156K12535Q5891
13753A035200o7993m07112j07126K50393j22193L21535D43297K34820K60545m3591
13743H95071j76031j69326n8336N6346K65110k7741l18727L22405j44634O235
13733F50372K31039C38671M67950C92471L56627n8254M40204n04369P9005M19776
13723A125460n21745k6320Q3141j01551L16086k09538J56761C02658K12053J30242
$$ plain form
13794 648683 1050823 828202 947841 1163283 958225 556377 858772 563332 907499 748428
13784 748428 756592 988233 886049 1004295 1111404 771444 931028 1023393 865176 609613
13774 609613 751282 707382 728361 681242 419604 628187 748959 737285 654464 673466 977617
13763 977617 911454 813718 647295 715239 479385 887062 962930 736774 949309 1035200
13753 1035200 967207 560095 452969 703362 581169 902704 443297 678117 938662 895071
13743 895071 719040 549714 491378 547724 812834 785093 466366 788771 644137 650372
13733 650372 881411 338671 806621 392471 749098 690844 1131048 626679 705684 1125460
13723 1125460 603715 577395 660536 558985 875071 665533 822294 302658 514711 644953
13713F44953N2110j42319J20178m281k38936J54510j20155L80171k90256k18871
13703C37104J98160j05168J64271P0206C16425M71865B08155K45131K41551B94238
13692G81756k59760k38789K25273J74012k42610J39060N3850J21471C49416L58210
13682G07626j37349j54352j58209M46070j91419K09063k77682j9105L60846n5645
13672G29844A84118K20835q7278n8453M71542l09173R1811n9568K96789k886j34714
13661F13023l04544Q15J57723o2081J78488B18531M59943J6459l21086K07633
13651E81480B15513J56828J91653L4877J70110l24458j1382P9569J22027B70704
13640C40939Q5407M92789D40343A85986N82583l61352K85498j65566L1259k33826
$$ plain form
13713 644953 697063 554744 674922 670641 431705 586215 466060 846231 555975 337104
13703 337104 535264 430096 594367 664573 316425 788290 208155 453286 694837 294238
13692 781756 521996 283207 508480 682492 439882 578942 632792 754263 349416 707626
13682 707626 570277 415925 257716 703786 512367 721430 443748 424643 785489 729844
13672 729844 184118 404953 317675 259222 730764 421591 513402 453834 750623 747737 613023
13661 613023 308479 309294 467017 404936 583424 218531 678474 694933 373847 581480
13651 581480 215513 372341 563994 598871 768981 444523 433141 512710 634737 270704
13640 340939 426346 919135 440343 185986 768569 407217 692715 527149 558408 324582
13630C24582L84549j66706B52208N45800C41641Q9473a10905C39493K86702C11132
13619C47480K5132K15526I44M49253A21373K82229K94373C22449J71634J86453
13609F80536k16332j53094K0908k5255R7991Q6245j54122L03298A11322a4862
13598E37478k47259K36808j54413Q6472o8645j03046J25771n7194o20j53254J66495
13587C68593A70428L54693L3454B44571L51723a7818I8875J59646J72581L0326
13577D61428A07755L44881p036j98467A14662M0221J87193P3571A04598J70065
13567B74663L20633B73497p3465N82259k11345q0297k29983A10054K13803J81328
13557E05185A31597J25677J54955q0531N7237j153m6411L0291R8135q1869A56202
$$ plain form
13630 324582 709131 542425 252208 798008 341641 431114 -110905 339493 626195 311132
13619 347480 372612 588138 944 450197 121373 403602 697975 322449 494083 680536
13609 680536 464204 311110 332018 306763 404754 490999 336877 640175 111322 -14862
13598 537478 290219 527027 372614 459086 390441 287395 413166 355972 355352 202098 368593
13587 368593 170428 525121 558575 244571 596294 -17818 98875 258521 431102 461428
13577 461428 107755 452636 445600 247133 114662 154883 342076 415647 104598 274663
13567 274663 595296 273497 200032 782291 570946 490649 260666 110054 323857 505185
13557 505185 131597 257274 412229 331698 388935 387782 341371 371662 469797 387928 156202
13545B55845R5765p507J61890A12665L99046B09986o3091K55855q1811j42706
13535A78233L40778j93116L14668r0293B2621J64563K60696A83411K36584b242
13524C03463j18125L03663j29154K64775C12165J95736B27718J10665A00947K56563
13514C57510K12133A66643J98231E8560L28791J86731B73880N8088K5359o0239
13504B97088q6975a3766B1052J44132N8865K38805j66624M37725A77988K13213
13494C91201d995B39599b9232A38485J74821L4124q1029j07816J23950a47934
13483B51239K4869J13535d85A43528K77236o0197j34725n1775J00860Q4851r1901
13472B67877p782R0637J40836j40300j19610N4983j05464d246B56428J77026F9684
$$ plain form
13545 255845 351610 344103 505993 112665 511711 209986 146895 402750 320939 178233
13535 178233 519011 325895 640563 550270 22621 187184 447880 183411 419995 -2242
13524 303463 185338 489001 359847 624622 312165 507901 227718 338383 100947 357510
13514 357510 569643 166643 364874 58560 387351 574082 273880 331968 357327 297088
13504 297088 210113 -13766 21052 165184 224049 462854 296230 733955 177988 391201
13494 391201 -4995 239599 -29232 138485 313306 347430 266401 158585 282535 -147934
13483 251239 276108 389643 -485 143528 420764 360567 225842 174067 274927 359778 267877
13472 267877 260095 350732 491568 351268 231658 286641 181177 -4246 256428 433454 69684
13460D07191J49769A86335L29414A16156J83889J36758m8175j87554K57190B13924
13449D14648A92770k5757L31840A79340J000J57382I7899N4863K01558p3792J37497
13438D18025A58601P3211q9834J35961J90996A18066O4323M63743A83258F5948
13427F0215M01683j19009j57581O0089n6310L42520F5034L65797j29477L8086
13417C39440A8566J8798K05515j7186N904j1198n5178N5518A1418b9469C4682
13405e1428A49369J20866j28729b833j30943C01064j29851K77510J59335B71192
13394B87977m7391A6314a4053A18501k4028L97145A71878L1387K3124K23188A71887
13382A93567J79827j66516C4101a72666E11348k40015d509A97118J17432h617
$$ plain form
13460 407191 556960 186335 515749 116156 300045 436803 388628 201074 458264 213924
13449 414648 192770 167013 498853 179340 180340 337722 97899 152762 354320 280528 418025
13438 418025 158601 231812 141978 277939 468935 118066 182389 646132 183258 65948
13427 60215 461898 342889 185308 245397 189087 531607 65034 430831 301354 339440
13417 339440 18566 37364 242879 225693 231597 220399 165221 220739 11418 -29469 34682
13405 -51428 149369 270235 141506 -2833 -133776 301064 171213 448723 608058 271192
13394 287977 240586 16314 -14053 118501 94473 491618 171878 203265 226389 449577 171887
13382 193567 373394 206878 34101 -172666 511348 271333 -4509 197118 314550 -8617
13371e821C74158A10418M60178B77464L13965K6606k82439q0084L57052h7487
13360A75198J95501J31917A17636J91080L54150B7163a1958A16361J74278k939
13350B87700j39847o3587J86587J19453L2605A90613B2976K18708j03092C7389
13339F3823K12998a16036C25639F5270J61678l5552J27622J9145p6773m4421I8036
13327C18260J14269B07481K37652j10265j4721A2238K94162a10703D33959j18863
13317C15096K61518A47214N7765J5963d6936B13696K54913r6767q1214R4928D8532
13305B42373j2256h0293A2773L49143A40889F1974d5221B88736J20507o4980j69030
13294A75233J52840A7114L11069l1921a44688B13366h2521B38200q4833J16308
$$ plain form
13371 -5821 374158 110418 570596 277464 591429 618035 335596 255512 612564 -87487
13360 175198 370699 502616 117636 308716 662866 27163 -11958 116361 290639 287700
13350 287700 147853 84266 270853 390306 422911 190613 22976 241684 138592 37389
13339 63823 276821 -116036 325639 65270 226948 191396 319018 338163 261390 216969 98036
13327 318260 432529 207481 445133 334868 320147 12238 306400 -110703 433959 315096
13317 315096 576614 147214 204979 220942 -46936 213696 468609 371842 290628 385556 48532
13305 242373 230117 -80293 12773 361916 140889 61974 -45221 288736 409243 344263 175233
13294 175233 328073 17114 328183 296262 -144688 213366 -82521 238200 153367 269675
13284B69675n6551n9914o6686L90157j36645A61785B1490K41534J31597F8842
13273A12034J7748P0134L0022J00173a81383E5569j924J27495o4033K53423J5268
13262C85798E6370Q7729j3662K29401F9184l3174b1597o3252A10392m7112K2312
13251H5592a3089C37278g8032j39612H4813K28435a18202G183P8246J70270N9288
13240C14987H1349a99838B39286j02931O1154K03234A4152M61279a60631f1149
13229B46939a26941A31359j166R2568L6998G7743R0478J77559r2114a02593C64193
13217c1165C92490r6615a13091f713E45822D3937N7692A0807a21820A72721o0086
13206A12635B8927K8369J22523J34297H6734l4051L11435j44370m7083M8187l9845
$$ plain form
13284 269675 213124 153210 86524 476681 340036 161785 21490 263024 394621 68842
13273 112034 129782 199916 229938 330111 -181383 55569 53645 181140 117107 370530 385798
13262 385798 56370 144099 130437 359838 69184 36010 -21597 -84849 110392 63280 85592
13251 85592 -13089 337278 -78032 -217644 84813 313248 -118202 7183 85429 255699 314987
13240 314987 81349 -199838 239286 136355 197509 400743 14152 475431 -160631 -61149
13229 246939 -126941 131359 130193 222761 259759 77743 168221 345780 253666 -102593 364193
13217 -31165 392490 295875 -113091 -6713 545822 43937 101629 10807 -121820 172721 112635
13206 112635 28927 57296 179819 314116 86734 52683 364118 219748 172665 220852 181007
13195A81007b0547A02573M8027b85301A76877o7993a70759g2081D07409m0795
13185C66614f928A60135A3174d963m1475A30597K1401B3349K45040b9918o1281
13174i1199A72231J40199A004a43214A17304K30970a55807E9202A3005J33982
13164A46987J38589B6664L54002q2010a93782C1647d8D3651J83478q3806B9644
13152H9013C2473h227B15644b743A01778D1727K8777J63576h1784K0955k1421
13141h2250A24332P715m6139J56057E5777J86797e6004A30437K43488I4963J111
13130I6074J6141J75452J86661B00121r2407e8339A6137J23727P0917k0763K736
13119A92754G4114J38636a56748A3694M0494Q8540a14287N6128B3623K35154d5338
$$ plain form
13195 181007 -20547 102573 150600 -285301 176877 108884 -170759 -72081 407409 366614
13185 366614 -6928 160135 13174 -4963 -46438 130597 151998 23349 268389 -29918 -91199
13174 -91199 172231 312430 1004 -143214 117304 348274 -155807 59202 13005 146987
13164 146987 285576 26664 380666 298656 -193782 31647 -48 43651 227129 143323 29644
13152 89013 32473 -8227 215644 -2743 101778 41727 70504 234080 -81784 -60829 -82250
13141 -82250 124332 132047 85908 241965 55777 242574 -56004 130437 373925 94963 96074
13130 96074 112215 287667 474328 200121 107714 -58339 16137 139864 210781 190018 192754
13119 192754 74114 212750 -156748 13694 54188 142728 -114287 -58159 23623 258777 -45338
13107e036B65873N1318A23119b27379B52279H366L52642b5482B70766b0009E1985
13095c6149k0534o2973N6686A41715N4307a78994B43373O9734G2999J693e1608
13083A54444c4231A9422f3643A1283L79393n4952c17616A12872a04065G0958b3826
13071G9997K19234A33487a95325A41369J81505j47504J1133J119J08200A9348
13060C53898F3955a48468D85272A72340q3404J54756A13209f1434D00302A85222
13049B64847f0176A90776K33081E047a9552A54302F1418b63458A53248a12561
13038C81456A40988o4162P9286J03056J93930C3028a30499D76705A55897j6607
13028A39290a510k97662B89355E5004J11455D1554K83700I1149M2709J25280j01698
$$ plain form
13107 -5036 265873 317191 123119 -227379 252279 8366 361008 -25482 270766 -20009 51985
13095 -36149 -56683 -119656 -62970 141715 196022 -178994 243373 313107 72999 74692 -51608
13083 154444 -34231 19422 -63643 11283 390676 335724 -317616 112872 -104065 70958 -23826
13071 79997 299231 133487 -195325 141369 322874 175370 186503 187622 295822 19348
13060 353898 63955 -148468 485272 172340 88936 243692 113209 -61434 400302 185222
13049 264847 -60176 190776 423857 5047 -19552 154302 61418 -263458 153248 -112561
13038 381456 140988 76826 156112 259168 453098 33028 -130499 476705 155897 139290
13028 139290 -1510 -299172 289355 55004 166459 41554 325254 91149 133858 259138 157440
13017A57440g5180I7482a33072C73599c4123I6492n089f719l4390B66676r4356
13006A72320K01879A42909R1130m86o8745J8562B3703a65709C40165H0757J97074
12995B77831a99612B13143b54806A78881E3197d3440A45861C6309a81840D27020
12984a48352k192A40065K01260A60178c65573A29010N0573a14338A80825R7886
12974B78711a44609c3365C09469g224k07368O3816a5248A21476B7917Q0195i3529
12962A46649O242J8366i56l7779A27953f8042A79688N0155H0461i5879F9282K47219
12950C16501H0380b03872m9467D8939b76079B39792p577b2008B81773a21373B57007
12938g7411A61288e747k79161e5947B40990i5477A00234a12307I2370J472c0698
$$ plain form
13017 157440 -75180 97482 -133072 373599 -34123 96492 91403 -6719 -41109 266676 172320
13006 172320 374199 142909 234039 233553 164808 183370 23703 -165709 340165 80757 277831
12995 277831 -199612 213143 -254806 178881 53197 -43440 145861 36309 -181840 427020
12984 -148352 -150544 140065 341325 160178 -365573 129010 179583 -114338 180825 278711
12974 278711 -144609 -33365 309469 -7224 -214592 -150776 -15248 121476 27917 108112 -93529
12962 146649 152891 171257 -956 -38735 127953 -68042 179688 229843 80461 -95879 69282 316501
12950 316501 80380 -203872 -253339 48939 -276079 239792 232215 -22008 281773 -121373 257007
12938 -77411 161288 -5747 -284908 -55947 240990 -95477 100234 -112307 92370 93842 -30698
12926A60895b22098i796r432C0121K43398j03004a66213N9325o8461B9672a3533
12914A45583b74477A25395a1403j62752f9495B83401q5653O4286j16543c8336
12903a66825C60447K11107d8333C3884O9009f4720K4258C54128K6931G2836d6564
12891G1410b3709j51181B36052A10218C2678b9286F7812G680R5551J00742k9415
12880A74558a24557m2116G5875K10684A9977h1713A82784l1170i8899E7238K1556
12869G8794a68673A01683c6785q2927C1362b94086H5282K77756A37888J11632
12859B49520N8070a94991f80B03929a5478j50201A8984a66859c0643H5919d1889
12847G3056d5214j65642G3726K85653A32890J03041b7283l9440D2659R3606b84341
$$ plain form
12926 160895 -222098 -9796 -19228 30121 273519 170515 -166213 -106888 -175349 29672 -13533
12914 145583 -274477 125395 -11403 -174155 -69495 283401 197748 262034 145491 -38336
12903 -166825 360447 571554 -48333 33884 102893 -64720 -40462 354128 381059 72836 -46564
12891 71410 -23709 -174890 236052 110218 32678 -29286 67812 7680 103231 203973 174558
12880 174558 -124557 -166673 75875 286559 19977 -81713 182784 151614 -98899 57238 78794
12869 78794 -168673 101683 -36785 -119712 31362 -294086 85282 363038 137888 249520
12859 249520 307590 -194991 -680 203929 -15478 -165679 18984 -166859 -30643 85919 -41889
12847 73056 -45214 -210856 73726 359379 132890 235931 -27283 -66723 42659 136265 -284341
12835B98627a2349B43550C3190Q8440a38573A55018a68525M7467k9924A19206
12824D78099b11964B3955a41422A42802c4870j56765L5148A44728b55931j8375
12814b74306J9502f7091k17911A96562o9373J73598a41947j81967A83967n2493
12804A31474b69752E6120J41780d4841A71332A6576K47117j05342J31337D0335
12793B21952n2040b24981e3182F0120K58832a82656l1537h2516q3556B79865F0655
12781a3890p1821B19191O219b150A23578a27963D39539f1919k8094H6530N8216
12770A44746M7546a47884A55071p3630K47480J5660a18407N1455B9672K40082
12760B69754C19b1341j79277f493E3837b3963b667r1853q1101B51894I5785a0354
$$ plain form
12835 298627 -12349 243550 33190 121630 -138573 155018 -168525 -121058 -150982 119206
12824 478099 -211964 23955 -141422 142802 -34870 -191635 -156487 144728 -255931 -274306
12814 -274306 -254804 -67091 -285002 196562 127189 300787 -141947 -323914 183967 131474
12804 131474 -269752 56120 197900 -44841 171332 16576 263693 158351 289688 40335
12793 221952 169912 -224981 -53182 60120 318952 -182656 -214193 -82516 -166072 279865 60655
12781 -13890 -85711 219191 225410 -2150 123578 -127963 439539 -61919 -90013 86530 144746
12770 144746 192292 -147884 155071 81441 328921 344581 -118407 -66952 29672 269754
12760 269754 319 -21341 -200618 -6493 53837 -23963 -2667 -94520 -175621 251894 95785 -10354
12747b34828N9200B45612E5693J97432F3383b57119j8432i2399A79568J53755
12737C33323j21946N357g0905G9613J07812L9619K19641k01941p9598K97756e5325
12725A24560J62752K0443a39316b2329B63179m1008d7912o7679B30975B2334b07712
12713a53054E9383K10346p8164J02680M3482j50966J1011L65785A12078h367E50731
12701D02259e2347A38108N2885B8291h9227A49695D9590J71074g0579a8323k48672
12690b66995i1531A78751h8064A1978g1814I921d6174N57A8751J04716R8585J33599
12678C55651a5620j2650A97812C5117L4153a05681f107p981A26049C640K396J04481
12666A10517Q0469e5999A21679O1894I514b68320B97790j48616a11763B31305
$$ plain form
12747 -234828 -175628 245612 55693 253125 63383 -257119 -275551 -92399 179568 333323
12737 333323 211377 216734 -70905 79613 187425 227044 446685 244744 165146 462902 -55325
12725 124560 287312 307755 -139316 -22329 263179 222171 -47912 -115591 230975 22334 -207712
12713 -153054 59383 269729 191565 294245 337727 186761 197772 563557 112078 -8367 550731
12701 402259 -52347 138108 190993 28291 -89227 149695 49590 220664 -70579 -18323 -266995
12690 -266995 -91531 178751 -88064 11978 -71814 9921 -46174 -45617 18751 123467 222052 355651
12678 355651 -15620 -28270 197812 35117 69270 -105681 -6107 -14088 126049 3640 6036 110517
12666 110517 190986 -55999 121679 183573 9514 -268320 297790 149174 -111763 231305
12655e5289m8648B38546C3911J3432K84244f9690m0745A01453b03733B93265j32907
12644A60358E9222J8537b69108A77483b84848A55536e8557E4919j5221M4135b66507
12632C7399J31050G5444R7305J20199E7481M43327j69592K93458B68099B0983
12621A76988O1363E9375Q6556Q9308e3453j95319p9143D016L12999a85891B41729
12609B24953a87952G4264l175L19218C3497J39155J81563c32197H1073g6257G681
12597A53400a72931C38955F0934R9199i2192A34907a46031E16458A67660C0544
12586A9225J63847B0730Q2050b27149b3193j38435a5652q784C19770D2771i6214
12574b71925f4997H1405O0775P8473a44401G1839K53980G3396K35083A16042a0454
$$ plain form
12655 -55289 -103937 238546 33911 47343 331587 -69690 -110435 101453 -203733 293265 160358
12644 160358 59222 77759 -269108 177483 -284848 155536 -58557 54919 39698 83833 -266507
12632 37399 168449 75444 172749 292948 57481 500808 331216 624674 268099 20983
12621 176988 238351 59375 145931 235239 -53453 -248772 -327915 4016 317015 -185891 241729
12609 224953 -187952 74264 71089 390307 33497 172652 354215 -332197 81073 -76257 7681
12597 153400 -172931 338955 60934 160133 -92192 134907 -146031 516458 167660 30544
12586 19225 183072 20730 102780 -227149 -23193 -161628 -15652 -24436 319770 42771 -96214
12574 -271925 -64997 81405 142180 220653 -144401 71839 325819 73396 308479 116042 -10454
12562b48385F7213J05833p5064j6435N8584K01926L1064A68112j7563E8955R424
12551F8379j2035B7527J66467a1588A44591a32460G2172a2295j54025E3273J91007
12540B44280E9409b35591A0788b14980A07957g0877D9510g095A72186p2254N4070
12529A54002b26970A33216f2927B0909J95456J50195A51577g7693a8027n9975
12519g8002C2807a51624e0207o9562l4434f4367A97531J39025a03507l0014j36853
12508b70374n6335B59222c61762B68712F3737J06532a17479F5513l149a45650
12497e0353H9270J91983j08048l3425b3732A40545l7070b2214B72770h3133E9959
12485B28047b30909c9388G4782L0837K84818b05717j1179A19182R6221L7523E0607
$$ plain form
12562 -248385 67213 173046 97982 81547 140131 342057 373121 168112 150549 58955 68379
12551 68379 56344 27527 193994 -11588 144591 -132460 72172 -12295 -166320 53273 244280
12540 244280 59409 -235591 10788 -214980 107957 -70877 49510 -7095 172186 99932 154002
12529 154002 -226970 133216 -62927 20909 216365 366560 151577 -77693 -18027 -78002
12519 -78002 32807 -151624 -50207 -119769 -154203 -64367 197531 336556 -103507 -133521 -270374
12508 -270374 -326709 259222 -361762 268712 63737 170269 -117479 65513 62364 -145650
12497 -50353 89270 281253 173205 139780 -23732 140545 103475 -22214 272770 -83133 59959
12485 228047 -230909 -39388 74782 105619 390437 -205717 -216896 119182 215403 252926 50607
12473E2451f2556a8537C8592J7035b70166A74999b01841C2298L3500J13536J0393
12462A89727q2650h797B8063b45267A61152o9597k607a19417c391l17219J29769
12451a90841B13012N1635b63322B03364i651r1570B1267L5708c67115L4901g3099
12439a61374A16323a69202G7930a38523E0726b10658C59059H727N2088J46534
12429B07349F555b89244c0099j17905b6803j60011A59207o0669f7436H2932a11785
12417I1299b80564E5447a26471B00099L74385B51123o2345l4422a56851c7722
12406g0480A85323N121a6647j33155c5116j68219H4332a50304A6124d515D9079
12394B3068h9029j54864B5883Q666R4477a07847j95172F9310N3554n3055a33585
$$ plain form
12473 52451 -62556 -18537 38592 55627 -270166 174999 -201841 32298 65798 179334 189727
12462 189727 107077 -8797 28063 -245267 161152 91555 88948 -119417 -3391 -320610 -190841
12451 -190841 213012 264647 -263322 203364 -9651 -101221 21267 56975 -367115 -332214 -73099
12439 -161374 116323 -169202 77930 -138523 50726 -210658 359059 8727 60815 207349
12429 207349 6555 -289244 -30099 -148004 -26803 -186814 159207 98538 -67436 82932 -111785
12417 91299 -280564 55447 -126471 200099 574484 251123 188778 154356 -156851 -37722
12406 -70480 185323 190444 -16647 -149802 -35116 -203335 84332 -150304 16124 -4515 49079
12394 23068 -89029 -243893 25883 34549 129026 -107847 -303019 69310 122864 69809 -133585
12382A24262E8921E615b31074J02188C9589b31957P1087B55254c8462Q443j68031
12371a98050A2181N017K4493b46611H9636a54482A2750a53528A11731K20159G1562
12359a26312l23206a38776F2539g9526G7455a21153o0167l7291k3095c9161l10321
12348c49482A14917a2844A09137a27825B04465B0819J64737f9459k21385i490
12337C10682A26128a9462h342E6146a46012D5963a02354A11241c2558C90051a77833
12325a70420A5544b26106d3857F8058b4994j79894D15368a81384c162A47138F2493
12313G7853B3654h7289B49195a8801q3066A91306D3191c98600a8107A47756n796
12302A41960d14751a50526A37982h0757A13596d2134j5616B8054c65475C59587
$$ plain form
12382 124262 58921 5615 -231074 -128886 39589 -231957 -160870 255254 -38462 -30019 -198050
12371 -198050 12181 17198 41691 -246611 89636 -154482 12750 -153528 111731 331890 71562
12359 -126312 -449518 -138776 62539 -79526 77455 -121153 -181320 -218611 -241706 -39161 -349482
12348 -349482 114917 -12844 109137 -127825 204465 20819 185556 -69459 -290844 -9490
12337 310682 126128 -19462 -8342 56146 -146012 45963 -102354 111241 -32558 390051 -177833
12325 -170420 15544 -226106 -43857 68058 -24994 -204888 415368 -181384 -3162 147138 62493
12313 77853 23654 -87289 249195 -18801 -101867 191306 43191 -398600 -18107 147756 141960
12302 141960 -414751 -150526 137982 -80757 113596 -42134 -57750 28054 -365475 359587
12291g2769A15508J5204C1579J99613r2480K9997b70723B15146L3782a1253D40619
12279B1512J02251l8864c8650k3588G7161K00174q0374n1685K9110a33631C03526
12267c9568k04105C41264o628G8777J66090b15240B32217J36807A65954J49192
12257C15146a38086j03856B61446E6683P6453C343J70425M6630A7605R3871a0153
12245C12616a5728B55346q4791H1375r832K07688j4133D8505K43153q5873J57949
12234C63734g8204C62146A44466N1969n9075B0289K91490o5742O9001A4939J98592
12223B13531F2599c8393G1592J82900E9897K15419n8146J73844b49743A74241
12212A68107J5551n0180J98120k9413l1416k3918q4272a89986A6779J48539M03909
$$ plain form
12291 -72769 115508 130712 31579 231192 138712 168709 -270723 215146 248928 -11253 440619
12279 21512 123763 84899 -38650 -62238 77161 277335 196961 145276 174386 -133631 303526
12267 -39568 -243673 341264 334636 78777 244867 -215240 232217 369024 165954 315146
12257 315146 -138086 -241942 261446 56683 133136 3343 173768 220398 17605 111476 -10153
12245 312616 -15728 255346 170555 81375 71543 279231 265098 48505 291658 205785 363734
12234 363734 -78204 362146 144466 196435 137360 20289 311779 246037 315038 14939 213531
12223 213531 62599 -38393 71592 254492 59897 275316 217170 391014 -249743 174241
12212 168107 183658 133478 331598 302185 270769 246851 162579 -189986 16779 165318 569227
12201E69227c6170C7176M02518j38192K8059J43492A70672L45179b1763G7080
12190C59177A52801k5638J72774a43580A18257J14147K40648q5708j01339a13727
12179B13430o403q9979P6401r1661J21497a61354b3619R117B57785g8606A52428
12167D31681K11274E5261p935J4371J09937J26566g0813G9625J86114F2760f7047
12155b3880A55954h9040b7085A59714m9961C360g9365m4223n4898A23062L0303
12144A53365b08418c1317j25768j31117M6869J17714a4546A25622a86839A64666
12133a35841I6417b4113B47897L80k3446A03223b13812i9180A04095i2603I4634
12121G1970L0239B6152a06115A59126M88619a70264b031k88146J16610j8370I7024
$$ plain form
12201 569227 -36170 37176 439694 301502 329561 473053 170672 515851 -21763 77080
12190 359177 152801 127163 299937 -143580 118257 232404 473052 387344 286005 -113727
12179 213430 207027 117048 193449 101788 223285 -161354 -23619 -14502 257785 -78606 152428
12167 431681 642955 55261 47326 61697 171634 298200 -70813 79625 265739 62760 -67047
12155 -23880 155954 -89040 -27085 159714 109753 3360 -79365 -123588 -178486 123062 153365
12144 153365 -208418 -31317 -157085 -288202 -241333 -123619 -14546 125622 -186839 164666
12133 -135841 96417 -24113 247897 248277 224831 103223 -213812 -99180 104095 -92603 94634
12121 71970 102209 26152 -106115 159126 647745 -170264 -2031 -290177 -173567 -191937 97024
12109a84949A36082e4873q8467M4765D24067I646L25961D0578b6021m3187c222
12097e9356o2774j06523A17058D3473p572Q3678d9029p2024c6108k56412d4391
12085b26085D3912a62163A74453E1982O6456J92940f020k41353A85573n9468L70200
12074D96305O55177O21889F35471A77698R5244i0778r5600j31157b7180C6229
12063a4664e738r5103B24537A7766L13915B7626n757a93039O2400A99223a32986
12051b20814B01507n4802d00933G8025b51741m511R1330K2637D81305g986r9323
12040a07309l8002j0976g4079H2451Q1913d7349J5689j18045r8525k40014K37301
12029b50943J06381j935C68541G9780R9993l6219a09874M0350c3177A57065n6059
$$ plain form
12109 -184949 136082 -54873 -143340 -98575 424067 9646 335607 40578 -26021 -69208 -3222
12097 -59356 -122130 -228653 117058 43473 35901 119579 -49029 -121053 -36108 -292520 -44391
12085 -226085 43912 -162163 174453 51982 118438 311378 -6020 -247373 185573 126105 496305
12074 496305 1151482 1773371 635471 177698 272942 -90778 -186378 -317535 -27180 36229
12063 -14664 -5738 -100841 224537 17766 331681 27626 21869 -193039 -130639 199223 -132986
12051 -220814 201507 146705 -400933 78025 -251741 -256252 -164922 -142285 481305 -7986 -107309
12040 -107309 -145311 -156287 -74079 82451 164364 -47349 -31660 -149705 -248230 -488244 -250943
12029 -250943 -144562 -146497 368541 79780 179773 143554 -109874 -69524 -33177 157065 101006
12018A01006P9037m0282C3298K08559J08429d0219C15666b5967F4641a36332k1984
12007a58316D9450A1253J25926g9532A1915c70618H5622b4345j0582j33883q20
11996a69630A54475b16218G7283J60957k5087b76632C264J40302J05597a53397
11985a43452A28350a4982j66083g1162B18458I818K95549h7527A05092a41759
11974c31533d4129j43851D1351K8996Q1046m70L08667A83775p1244c68713A95996
11962c40166a1571H7146a49423a3318j54697L0233A02036a05425C32563a50242
11951d44194A49374b72844B2837h6292A22841O1201I1753J58083a64763Q2138
11941h2625j58538I1630B0059K3852a65947f5043A06596B8848b31213E2717M4107
$$ plain form
12018 101006 180043 139761 33298 241857 350286 -40219 315666 -25967 64641 -136332 -158316
12007 -158316 49450 11253 137179 -79532 11915 -370618 85622 -24345 -34927 -168810 -169630
11996 -169630 154475 -216218 77283 238240 213153 -276632 3264 143566 249163 -153397
11985 -143452 128350 -14982 -181065 -71162 218458 9818 305367 -87527 105092 -141759
11974 -331533 -44129 -187980 41351 70347 151393 150923 459590 183775 112531 -368713 195996
11962 -340166 -11571 87146 -149423 -13318 -168015 -137782 102036 -105425 332563 -150242
11951 -444194 149374 -272844 22837 -86292 122841 184042 91753 249836 -164763 -82625
11941 -82625 -241163 91630 20059 43911 -165947 -65043 106596 28848 -231213 52717 96824
11930I6824k6358K82027j33549a20392B21448a07163B43808b581B30768b6285
11919C9711f1365k13900A8523B109O3066b00282Q3690j7868l69401f3900j04283
11908a68183A21471P6185d3377j57991j8585g9747L5448B64288j06918c4597B91445
11896c2502A13161Q2075e2044E9377c67848m5299c064A83045R1498b4132l2556
11885e6688A89887b20059R0424H0215M49h0007j11163B1975Q0065c76526H6500
11873D2883f1401o3826l8458A44030b81614D738J79966d15379d6159j96319G8763
11861b24212a4046C607f1101j47353F99a17548j198j08666G727P6661J56638a38248
11848d8998l3348a2991j6218A98240a22189r0462d2779I9464b40433J18092E1946
$$ plain form
11930 96824 70466 352493 218944 -120392 221448 -107163 243808 -2581 230768 -26285
11919 39711 -61365 -275265 18523 2109 65175 -200282 -116592 -134460 -503861 -63900 -168183
11908 -168183 121471 197656 -43377 -201368 -219953 -79747 -44299 264288 157370 -34597 291445
11896 -32502 113161 195236 -52044 59377 -367848 -413147 -3064 183045 274543 -24132 -56688
11885 -56688 189887 -220059 -129635 80215 80664 -80007 -191170 21975 102040 -376526 86500
11873 42883 -61401 -125227 -163685 144030 -281614 4738 184704 -415379 -46159 -242478 78763
11861 -224212 -14046 3607 -61101 -208454 699 -117548 -118746 -227412 7727 84388 241026 -138248
11848 -48998 -82346 -12991 -29209 198240 -122189 -212651 -42779 99464 -240433 -122341 51946
11836B9382c6330o8380j49944H6344J96808b08099M1887H4885P2123p2709b81894
11824A20491b17975a6485B1110J44917d8705b4183n6596A16589n4306e9404a8206
11812c15221A27250E5896M41958D2738d8618B38028n4964a35206A91340i4990
11801e6858H8200A1203J05288d0868B64154D0533h9173e007q4662A74288a4116
11789a59538A88251n2098a20436k21478a0078F2188d3171n4904E632i8442I3043
11777E2581a7131j01832D4019K6913c02492a46582P65j45506A63548C5865a24200
11765i9541A10629n3929d29226G9144k1625j3892J68369K03708a13255C74785
11754B96333f1674a7636B26462B0545E637J31892a66571j48205R1234D07401A46777
$$ plain form
11836 29382 -36330 -104710 -254654 86344 283152 -208099 -166212 84885 157008 84299 -281894
11824 120491 -217975 -16485 21110 166027 -48705 -24183 -80779 116589 62283 -59404 -18206
11812 -315221 127250 55896 497854 42738 -48618 238028 183064 -135206 191340 -94990
11801 -56858 88200 11203 116491 -40868 264154 40533 -89173 -5007 -89669 174288 -14116
11789 -159538 188251 136153 -120436 -341914 -10078 62188 -43171 -98075 5632 -98442 93043
11777 52581 -17131 -118963 44019 70932 -302492 -146582 -145817 -291323 163548 35865 -124200
11765 -99541 110629 56700 -429226 79144 57519 43627 211996 415704 -113255 374785
11754 296333 -61674 -17636 226462 20545 5637 137529 -166571 -314776 -223542 407401 146777
11742a55252d839B41212C6027a12187B04681m7868M9046i4657A72516G5128K3398
11731I8526a00799a9774k04686A17533K18633g9273a4520A48173a010l34932b8043
11719d2788C17045a39666j13662a04159l5434N100A8623K98971d0645l964m7848
11708i2457B55593A26628h9228L159p889o6629C39217j63726J65427e5401B00018
11696E2378b31395G7280g782B5076m106a5774B93264A28991J77832a31613A24677
11684C42239d5527E3970N5033L28291A45756f2648j68472A40733K6953a35844
11673a27018L7038F6559a79083e14l43642D1000e6026A66240C6677a2087H9439
11661a41908j59591A54919q894P277d6362C40657b07037a01929E7468a6818k49097
$$ plain form
11742 -155252 -4839 241212 36027 -112187 204681 156813 205859 -94657 172516 75128 98526
11731 98526 -100799 -19774 -224460 117533 336166 -79273 -14520 148173 -1010 -335942 -28043
11719 -42788 317045 -139666 -253328 -104159 -139593 -134493 18623 317594 -40645 -44609 -92457
11708 -92457 255593 126628 -89228 -86069 -93958 -160587 339217 175491 340918 -55401 200018
11696 52378 -231395 77280 -7782 25076 20970 -15774 293264 128991 306823 -131613 124677
11684 342239 -45527 53970 109003 437294 145756 -62648 -231120 140733 167686 -135844
11673 -127018 -89980 66559 -179083 -514 -344156 41000 -56026 166240 36677 -12087 89439
11661 -141908 -301499 154919 146025 153302 -46362 340657 -207037 -101929 57468 -16818 -265915
11650b65915A38228a35361A7943f1539C19254q5839g5254A29319O6647R0383r3657
11639A92692a24069D36735a48935L3461r7071O4056B45419l3615o1135k1870h5442
11627B716K61539A5113c262A11476J27762J24970F1057a8649q511A23714J48414
11616B72128D2171K63213A0753L597J67943l8600D5851a78657F138J40288O8864
11605B15290F0043g7465q6244D17104B05401R7582e8433E5539L01058A15861l7058
11594G8803a11331E6406L043Q0062F3300A2277a067B42025q3557D0213K91027
11583C31240o1805J25037n0942a67026H1271e5099I4519m626b18498F1454j7118
11572D4336n755J57677o8218a33401B81573m6688C6498J56958K16996I5c818G3669
$$ plain form
11650 -265915 138228 -135361 17943 -61539 319254 233415 -75254 129319 195966 286349 192692
11639 192692 -124069 436735 -148935 -115474 -212545 -148489 245419 211804 150669 128799 -85442
11627 2716 264255 15113 -3262 111476 239238 364208 61057 -18649 -27160 123714 272128
11616 272128 42171 305384 10753 14350 182293 143693 45851 -178657 6138 146426 215290
11605 215290 60043 -77465 -163709 417104 205401 302983 -58433 55539 356597 115861 78803
11594 78803 -111331 56406 59449 139511 63300 12277 -1067 242025 158468 40213 331240
11583 331240 269435 394472 343530 -167026 81271 -55099 94519 89893 -218498 61454 44336
11572 44336 38581 196258 128040 -133401 281573 234885 36498 193456 410452 95 -3818 73669
11559G2831a32460A83912h652B42925j20583e7941p8218k75790E1943e2562j866
11548e4428D8507M7877R7368J59273a91739A07661J14555K22483D2063O0233c1357
11536A71810J3674I448N2895K25156a38298B71255q0267f7634A42800N9484e8205
11524F232L9199J60133o4860j0616a68034C80231A2479Q1338K55070r1764b79446
11512B61944b2026G5717O1116a00451C41674O45r8560n5678G9014M37710b47428
11500C78682F738Q8407a00674p1411D4773N4610a5247C4084a94773G4583g9474
11488B24610O363A14989c35939B30424c7949l6022L0888j44358B50742E3513L5368
11477H8881l7625L83407A14590B6213K1539O2673b6392D4010K81102D0784J8489
$$ plain form
11559 72831 -132460 183912 -8652 242925 122342 -57941 -136159 -411949 51943 -52562 -54428
11548 -54428 48507 96384 193752 353025 -191739 107661 222216 444699 42063 102296 -31357
11536 171810 185484 9448 62343 287499 -138298 271255 190988 -67634 142800 202284 -58205
11524 6232 45431 205564 140704 130088 -168034 380231 12479 93817 348887 257123 -279446
11512 261944 -22026 75717 136833 -100451 341674 342319 243759 188081 79014 516724 -247428
11500 378682 6738 95145 -100674 -172085 44773 99383 -15247 34084 -194773 74583 -79474
11488 224610 230973 114989 -335939 230424 -37949 -73971 -43083 -187441 250742 53513 88881
11477 88881 51256 434663 114590 26213 47752 110425 -26392 44010 325112 40784 59273
11466E9273b9992C73414F3734a57911I1427a05707E02274n6651f9011M46m807
11455g3372C46880p5960r3088R5596n5705m9494J65584F6133J10117m8343C9989
11443B78070b00876C23968B608K97220q3662b27898g9457E3084a45191C0289L32083
11432C62372k2077j40197E8670e1336C1782A4995a3727A14427J8044B5781M05437
11421D31218f3529n0563M6621j97846j28445J20494B130J25724c9055l37364A77957
11409E33523H9679d233i87o2111C17388q04H861K047J53196o7035f9292k31407
11397c00699G9453a57663K594j12068J17229e9415n52761b99411A27656b03918
11386c34567A68527b01480A20327K15844B3951J49924Q3780g9113A22352J83294
$$ plain form
11466 59273 -29992 373414 63734 -157911 91427 -105707 502274 445623 -69011 -68565 -73372
11455 -73372 346880 270920 177832 273428 217723 168229 333813 66133 176250 127907 39989
11443 278070 -200876 323968 2608 299828 216166 -227898 -79457 53084 -145191 30289 362372
11432 362372 340295 200098 58670 -51336 31782 14995 -13727 114427 132471 25781 431218
11421 431218 -63529 -114092 -67471 -265317 -393762 -273268 2130 127854 -39055 -376419 177957
11409 533523 89679 -4233 -987 -63098 317388 316584 8861 10908 164104 97069 -69292 -300699
11397 -300699 79453 -157663 -155069 -267137 -149908 -59415 -612176 -299411 127656 -203918
11386 -334567 168527 -201480 120327 336171 23951 173875 257655 -79113 122352 305646
11376C05646Q4871a05865C41676d4566j74603A52565A7111K6990a48552H7902
11365E3531B2252Q3367q507A5741b31231j51909d2792A06196b69695N9217E0419
11353B9153r764O0583K13479P2023C6151b22151k6929B25066L5503h0614C6433
11341C9106c29208R1738f8390A92981o6784c4670B21234q6509J29054a1724C7046
11329b0671j37203j9002E0824a13148j4796B48158l7064b05181A22645K00352
11319C22997C4729a06783j53048A93506M0446a90164A23845h5490A80433a15272
11308D741b87606A6538J17216a58172D98257a0060n265O762j59570j0274G6459
11296b81587J21227k45341J59709g318q2585A7029a31883d7758B76480i6484p5912
$$ plain form
11376 305646 390517 -105865 341676 -44566 -219169 152565 17111 44101 -148552 87902
11365 53531 22252 105619 97112 15741 -231231 -383140 -42792 106196 -269695 -210478 50419
11353 29153 19389 79972 293451 365474 36151 -222151 -249080 225066 260569 -80614 36433
11341 39106 -329208 -237470 -68390 192981 126197 -34670 221234 134725 263779 -11724 37046
11329 -20671 -157874 -176876 50824 -113148 -127944 248158 211094 -205181 122645 322997
11319 322997 34729 -106783 -259831 193506 233952 -190164 123845 -85490 180433 -115272
11308 4741 -287606 16538 133754 -158172 498257 -10060 -15325 -8563 -168133 -178407 76459
11296 -281587 -160360 -405701 -245992 -7318 -89903 17029 -131883 -47758 276480 -96484 -172396
11285a72396j82943a57880f6376p4457j23922o2396d6482o2987B72796H4402B8239
11273b08741J03381j88293A53839a04538q082c0020k97733j23290A95248r0410
11263A04838a28602k9539l6981G5348g5180j43779c9701k36215h8419j57790B97846
11251A82526K2489q7723l5216J49455e5816b4665G0284K5853j7268e2571C3144
11239c80735A08425f4356A18996a70338G0911a19941B59311g7169A7053b12950
11228b8413A45678c82202c3436B3364i217j58288k8149B46131A17174a17648A09937
11216c37182A26074H660J99858d00440a12139K0321A04436K4176e0377G8273a33328
11204b25149K3966g6109A05211m2625L4360a26533N2563B4446L4735e2958j81210
$$ plain form
11285 -172396 -355339 -157880 -66376 -140833 -264755 -327151 -46482 -109469 272796 84402 28239
11273 -208741 -105360 -293653 153839 -104538 -112620 -30020 -327753 -451043 195248 104838
11263 104838 -128602 -158141 -195122 75348 -75180 -218959 -39701 -275916 -88419 -246209 297846
11251 182526 205015 117292 82076 231531 -55816 -24665 70284 96137 78869 -52571 33144
11239 -380735 108425 -64356 118996 -170338 70911 -119941 259311 -77169 17053 -212950
11228 -28413 145678 -382202 -33436 23364 -9217 -167505 -195654 246131 117174 -117648 109937
11216 -337182 126074 8660 208518 -400440 -112139 -91818 104436 128612 -50377 78273 -133328
11204 -225149 -201183 -76109 105211 62586 96946 -126533 -73970 24446 59181 -52958 -234168
11193b34168B48858h3481B6151K04968b25322L1168B23854a44879H5483g8185
11182B97199i6957I7975C6733b40246R5599K5473j8081c0826H620K02511b82497
11170d0997D044b82673B33358A00911L6714D2215a2231j17518b4024l1157j91463
11159b46644J04700I9157a72065A51334d4866G144J4936b72466b2655C08921n6327
11148B52594I033l056a08101A16864a74390A62519b5951j6419F7257C898i0835
11136C16611C5966O8086c0202k72342I2704I231K42051J32059b03605O9150A70665
11124A06832b2432B08023Q4333B6932Q8575d5580R373n224j1985C52886a07020
11112c40075A7475b3944A73036Q0366a07478B48858L6974a41105C50475k7546
$$ plain form
11193 -234168 248858 -83481 26151 231119 -225322 -194154 223854 -144879 85483 -78185
11182 297199 -96957 97975 36733 -240246 -144647 -119174 -137255 -30826 8620 211131 -282497
11170 -40997 4044 -282673 233358 100911 137625 42215 -12231 -129749 -24024 -55181 -246644
11159 -246644 -141944 99157 -172065 151334 -44866 7144 22080 -272466 -22655 308921 252594
11148 252594 9033 5977 -108101 116864 -174390 162519 -25951 -42370 67257 3898 -90835
11136 316611 35966 104052 -30202 -302544 92704 9231 251282 383341 -203605 -134455 170665
11124 106832 -22432 208023 292356 26932 115507 -45580 -36207 -41431 -53416 352886 -107020
11112 -340075 17475 -23944 173036 253402 -107478 248858 285832 -141105 350475 322929
11102C22929q3130l1931K63823r3051a2089j281j33402L6866B25025F8394e035
11090B58231A24341l7341M01738k01889E4450J79643L57433F1592L39537j72244
11080B28885J48453A56933Q1250G4961Q1042c0371A1759M00709K2002B04951L00119
11069E05070j67000k254J48162k16412J21970M33312k10513J01987m1616N7183
11059G29889K30306j64238K13345l46483m3860B93968J86851J5367Q4410L80749
11049I61345j12952J14035l32072P8317j14115O55108m90251k19947K51220l4666
11039G56022J22150l40388K08117j19921K25282Q8095o1964C54505P29134m49377
11029F34262O9735j6958k31154O89449k00421m18944L38325k02238J26356k13731
$$ plain form
11102 322929 239799 207868 471691 378640 -12089 -13370 -146772 -109906 225025 68394 -5035
11090 258231 124341 87000 488738 286849 54450 234093 591526 61592 401129 228885
11080 228885 377338 156933 238183 74961 156003 -30371 11759 412468 434470 204951 505070
11069 505070 338070 335816 483978 267566 389536 822848 612335 714322 672706 729889
11059 729889 960195 795957 1009302 662819 618959 293968 480819 496186 580596 961345
11049 961345 848393 962428 630356 708673 594558 1249666 759415 539468 790688 756022
11039 756022 878172 537784 745901 625980 851262 939357 877393 354505 1083639 634262
11029 634262 703997 687039 455885 1145334 944913 525969 864294 662056 788412 574681
11019E74681J0420J94504J1337C66121K88318Q7438k47950L01159j4518k75939
11009E04629N4621j60875J08318J49628m8664N9785j14656J71742J40978j04098
10999G61408N1719k90849L37620k77177J71625K5514r4141J03801l2397M46277
10989A203400r0025m3049k76229Q0283L28129J43040j96073K16671J44961r18
10979A510190P6171M12817m5872j04868M83975L17161K33608M02976j53599p0599
10969C061960j83287l6099l78189l39442j34604j15186j56112J99374J08845k38441
10959A788819L80782j76007M10095n54413K61764o02876J15501p95206L41456
10950A169915k17647m07782j61990K01965A42649K38670A83484K81541k2817M9471
$$ plain form
11019 574681 585101 779605 790942 366121 654439 741877 493927 795086 780568 504629
11009 504629 559250 398375 506693 656321 607657 667442 552786 724528 865506 761408
10999 761408 813127 522278 859898 582721 754346 779860 685719 789520 757123 1203400
10989 1203400 1113375 1070326 794097 874380 1202509 1345549 1149476 1366147 1511108 1510190
10979 1510190 1586361 1999178 1953306 1848438 2332413 2649574 2883182 3286158 3132559 3061960
10969 3061960 2878673 2842574 2464385 2124943 1990339 1875153 1719041 1918415 2027260 1788819
10959 1788819 2169601 1993594 2403689 1849276 2111040 1508164 1623665 828459 1169915
10950 1169915 952268 544486 382496 584461 142649 381319 183484 465025 442208 491679
10940D91679n6270A85072L58189F6430K17820k0898n5653p6383n6704a48919M5154
10929a03765D52592A3543R052J02296o165R9474a7702n9075A49646E8579j4944
10918D3635L7322a1275A0798a48465k30864A04786J962B3659b19206N9869j231
10907a60568b5832j34329A32963A8271b09485A37150B1656j272a34143C2682K88386
10896C21068j09307q9721r25M6072b99196d2015C46306h0378I2236b58185C67821
10884i525A93766D6735A8590K1645g3171j09926m9098C38154f585j47025q991
10873a62601A1607R3402m6640k4502L0784e8546j27010a9057D2613J89398I4755
10861C44596f5245a170l47989a45583A56132C265g0460A40749F1149J07728b62304
$$ plain form
10940 491679 435409 185072 543261 66430 284250 263352 207699 131316 74612 -148919 -103765
10929 -103765 452592 13543 22595 124891 118726 218200 -17702 -76777 149646 58579 43635
10918 43635 80957 -11275 10798 -148465 -379329 104786 106748 23659 -219206 -159337 -160568
10907 -160568 -25832 -160161 132963 18271 -209485 137150 21656 20384 -134143 32682 321068
10896 321068 211761 122040 121115 167187 -299196 -42015 346306 -80378 92236 -258185 367821
10884 -9525 193766 46735 18590 40235 -73171 -183097 -232195 338154 -6585 -153610 -162601
10873 -162601 11607 105009 58369 33867 64651 -58546 -185556 -19057 42613 232011 94755
10861 344596 -65245 -1170 -349159 -145583 156132 3265 -70460 140749 61149 168877 -262304
10849f3390E5003J34485a3339A68189c4A32216a63895C4745a24033C59002I0870
10837b03763O4845k0261B22122c33030a02242l88719B60664b11796b7531B23778
10826F9877d08966D0565a97847B29791D2836b59047C28634a60926A05496i4820
10815c8809j60445o7019A00838P4480c9144l68440a74336A1035J34972g7786D0401
10803I5006g9343b9157l5577H3177a31436e2267A1142a72600A33330b76791J24574
10792a52217I9968b27955B37672a30616a0059o8085q5409C39231R666i8102b4335
10780a59517k63689D598K3452a53038C14521p4973r7026e04573b49083E0976j3331
10769C7645b10542F9789a14665G0633b3436B6070N8871H334N8291j1299Q8939
$$ plain form
10849 -63390 55003 189488 -13339 168189 -34 132216 -163895 34745 -124033 359002 90870
10837 -203763 -138918 -159179 222122 -333030 -102242 -490961 260664 -211796 -27531 223778
10826 69877 -408966 40565 -197847 229791 42836 -259047 328634 -160926 105496 -94820
10815 -38809 -199254 -266273 100838 175318 -39144 -407584 -174336 11035 146007 -77786 40401
10803 95006 -79343 -29157 -64734 83177 -131436 -52267 11142 -172600 133330 -276791 -152217
10792 -152217 99968 -227955 237672 -130616 -10059 -78144 -163553 339231 348897 -98102 -24335
10780 -159517 -423206 4598 28050 -153038 314521 239548 142522 -504573 -249083 50976 37645
10769 37645 -210542 69789 -114665 70633 -23436 26070 84941 8334 66625 55326 144265
10758A44265I919a28695A89203E1176b01498B1959a40779A02329e8194G4213f3621
10746b58895A12973i7263j29536f7593E6088e6314k3245C02489b71676c5105p6368
10735a11473I2888g5536D8629h938j27208a0629q2122B910b82491D4419a17203
10723I7776a08904j43859g5619l6827A15383a09721j01960l9730C63304f8935
10712B71114n9286b40464f9564K6083k61872A09119E4375a2330B18460J6488a61722
10700d0247k3767a7389D308a77974c2062o6849c5324A36129b4100C19536H9828
10688a69715C20684b33296B3040K04000b41729A60508a54877j55887A74893c88257
10677c31742a3994j47304H5974a97739A04960a34168j86468a17893a054j53679
$$ plain form
10758 144265 9919 -128695 189203 51176 -201498 21959 -140779 102329 -58194 74213 -63621
10746 -258895 112973 -97263 -226799 -67593 56088 -56314 -79559 302489 -271676 -35105 -111473
10735 -111473 92888 -75536 48629 -8938 -136146 -10629 -92751 2910 -282491 44419 -117203
10723 97776 -108904 -252763 -75619 -112446 115383 -109721 -211681 -251411 363304 -68935
10712 271114 211828 -240464 -69564 -43481 -305353 109119 54375 -12330 218460 234948 -161722
10700 -40247 -64014 -17389 4308 -177974 -32062 -98911 -35324 136129 -24100 319536 89828
10688 -169715 320684 -233296 23040 227040 -241729 160508 -154877 -310764 174893 -388257
10677 -331742 -13994 -161298 85974 -197739 104960 -134168 -320636 -117893 -1054 -154733
10667a54733L3722k3286A40486D9344a6310j42834L7248C06263f5330K7523C9288
10655b27715E9763b79428B4014K96004f6655q3774G6218a22304l0553L6535A2466
10643B30638a72905g2439j93579G7716f2055p0253j09819B39598C3032K82099
10633C15131G2498O189b83208D9248f2294G713J1900P1259a09486D2214d36409
10621a05276q57l9969L7074k07480J0612C32970a34006l49200g0665c3928D2153
10609e667n0159r1650L8004A42768e7032K1890K327C06576b07532O8502A56641
10597D0689a39246N9090j36299C6840i4799j05036r1302a42901A9733a00072d6462
10585I1823C9147h6814F6686c2748l18339A96130d1390j61232j54271f06B04707
$$ plain form
10667 -154733 -121011 -144297 140486 49344 -16310 -159144 -121896 306263 -65330 -37807 39288
10655 -227715 59763 -279428 24014 320018 -66655 -150429 76218 -122304 -152857 -116322 12466
10643 230638 -172905 -72439 -266018 77716 -62055 -132308 -242127 239598 33032 315131
10633 315131 72498 78687 -283208 49248 -62294 7713 19613 90872 -109486 42214 -436409
10621 -105276 -106133 -146102 -109028 -316508 -305896 332970 -134006 -483206 -70665 -33928 42153
10609 -5667 -55826 -147476 -109472 142768 -57032 -35142 -32815 306576 -207532 -139030 156641
10597 40689 -139246 -80156 -216455 36840 -94799 -199835 -291137 -142901 19733 -100072 -46462
10585 91823 39147 -86814 66686 -32748 -351087 196130 -41390 -202622 -356893 -606 204707
10573C12327a17469A88481c2849H218e30100a99214A25596E4138O503J10385c44096
10561A26297D8681Q7461f2886k20797B5589e6779A9553O9217e9585D6177e5362
10549B26101a54262O2269B6335a16232A08862c21133a38644l9261O3839j32276
10539b46342Q8741E2788b65601A8154P7603a72490j7205P3776n5321A63963G8799
10527a32132B446K21276h9897K1352C6190P0258a38533A07244Q9767b18043a6432
10515A35805h1626j14688A29583c8784C6204b6773j53795A12432Q7937q7366A6137
10503B66310a6049q7928G2389c5436j09142O3813D3283A6446i704G400J29505
10492A36905e36053A9609d5692J2158B3145l118f511B34737o6006K18125H9162
$$ plain form
10573 312327 -117469 188481 -32849 8218 -530100 -199214 125596 54138 60641 171026 -344096
10561 126297 48681 136142 -62886 -283683 25589 -56779 19553 88770 -59585 46177 -55362
10549 226101 -154262 -91993 26335 -116232 108862 -321133 -138644 -177905 -114066 -246342
10539 -246342 -157601 52788 -265601 18154 95757 -172490 -189695 -115919 -171240 163963 78799
10527 -132132 2446 223722 -89897 -68545 36190 106448 -138533 107244 197011 -218043 -16432
10515 135805 -81626 -196314 129583 -38784 36204 -26773 -180568 112432 200369 113003 16137
10503 266310 -16049 -103977 72389 -35436 -144578 -80765 43283 16446 -9704 7400 136905
10492 136905 -536053 19609 -45692 -33534 23145 20027 -6511 234737 168731 386856 89162
10480E42339Q8551D2913J78936P6765G73a51782l591a6474G0135b2064E2772P8292
10468A31064h1440D4531A4794a819C8598b3782A97285g7146m4223b2627A88483
10456c25695A87630r3427e006A29782b4620j21786j01392F8536a38523E2735e6421
10444g4401j03756E0871d63036F7727J29330b51303A2917b48568A25621b13117
10433B2136a99077M3033N6629A14101M0772d028n231A49522d4308A94523c5004
10421a03741J6390c5380I8298a28356L5001A71538J0810d6728K0298m6209A6853
10409a61232L2486B41559e20295b10669E28b14441A01804i0453B0158J90456l6168
10398A74446g6105l8409e3534A76547q4706K60205I7178b89695A90194J1142O1655
$$ plain form
10480 542339 630890 42913 221849 298614 773 -151782 -155373 -16474 70135 -22064 52772 131064
10468 131064 -81440 44531 14794 -1819 38598 -23782 197285 -77146 -121369 -22627 188483
10456 -325695 187630 94203 -5006 129782 -24620 -146406 -247798 68536 -138523 52735 -56421
10444 -74401 -178157 50871 -463036 67727 197057 -251303 12917 -248568 125621 -213117
10433 22136 -199077 -156044 -99415 114101 154873 -4028 -9259 149522 -44308 194523 -35004
10421 -103741 -87351 -35380 98298 -128356 -93355 171538 182348 -46728 -26430 -72639 16853
10409 -161232 -128746 241559 -520295 -210669 528 -214441 101804 -90453 20158 210614 174446
10398 174446 -76105 -114514 -53534 176547 91841 352046 97178 -289695 190194 201336 262991
10387B62991a29172C09358A05671K99784j34667l9004a22145G7117J56269d9725
10376a20610A33700j9403M0046Q5631K03831M7644A69807N448K37084r9994L19839
10365F32184j97735N0899B00830d9899B27507L15763B71027J2199A05029P2988
10355A78017p7493K04781a8620E3079O95620k16633N4854k33878A00419J3805
10345A14224R3664L18214j69089R3454r5110A31393J1495M00868B62780P1419
10335C34199j15835B2704L57166C5436J02586b8660k06871B28644H1850L37010
10325D18860a12011A06248K08615N4036A10924K11481j09591d5369A96617g8641
10314A05543O1827c0710A64494b5870D9483a5153k05131C11328i0713C5250b38820
$$ plain form
10387 262991 -129172 309358 105671 405455 270788 231784 -122145 77117 233386 -49725
10376 -120610 133700 114297 154343 239974 443805 491449 169807 175255 412339 312345 632184
10365 632184 434449 485348 200830 -49899 227507 543270 271027 283226 105029 178017
10355 178017 100524 305305 -18620 53079 748699 532066 586920 353042 100419 114224
10345 114224 207888 526102 357013 450467 355357 131393 142888 543756 262780 334199
10335 334199 218364 22704 379870 35436 138022 -28660 -235531 228644 81850 418860
10325 418860 -112011 106248 314863 368899 110924 322405 212814 -45369 196617 -78641
10314 105543 167370 -30710 164494 -25870 49483 -15153 -220284 311328 -90713 35250 -238820
10302b25819g6210G3297A1018f2869B16948k4910q4614l8439J30326a84578A03962
10290a00666e176B52105a63256P4780l2025F9128b11425B26453A5551a69536j71626
10279c41162a15279d7871C4159a43888f1019r76q5998B08156I16N194a4190A37940
10266B20693a29235A4100M71644j79987j16095J14647l7249K02192k13444J24765
10256C80573j8517N363J45633B20105A3488h2674A38472j3417c3625A689J29925
10245A31614b26227j8507r5528H2267j9506b00127Q0568B81297g5836m9318B60573
10233h9486l81543K29894b2977D50301r2044d6974r7916N7400G9166c77394B52599
10221a989F6899a84200H6810a06815B5522a22718J3740B9125L4044l705L8039
$$ plain form
10302 -225819 -76210 73297 11018 -62869 216948 192038 107424 68985 199311 -184578 103962
10290 -100666 -5176 252105 -163256 -88476 -120501 69128 -211425 226453 15551 -169536 -341162
10279 -341162 -115279 -47871 34159 -143888 -61019 -61995 -147993 208156 916 6110 -14190 137940
10266 220693 -129235 14100 485744 305757 189662 304309 267060 469252 255808 380573
10256 380573 362056 367419 513052 220105 13488 -82674 138472 125055 -33625 1689 131614
10245 131614 -226227 -244734 -340262 82267 62761 -200127 -119559 281297 -75836 -125154 260573
10233 -89486 -471029 -241135 -22977 450301 358257 -46974 -144890 -87490 79166 -377394 252599
10221 -1989 66899 -184200 86810 -106815 25522 -122718 -108978 29125 63169 59464 97503
10210I7503J29359A10848L9677D2160a00105A7622a30790B1850M1554a86432G3670
10198A6415O4034m19a56534L0573k93538J28640b4655k4951j05803m4007H4431
10186c52054a51799K4528g21k93880J30002l1350E5199d3998k49121b3002p462
10175c0464p4273d0521j21614I57J2046a38975j24728a27234A9238K7725c15196
10163A3834j073a32577B8870a12099j15803d1829m7685A6256R2412a64597A41098
10151I1367J49539g0562A53611a35103A15018k692A9363c7672C29864A0874c80119
10139a04569r71m0068q3579I0531i1807J5163j1470G3289K7571a07680A17649
10127a14756c2891m09287D7361O4821c05853P8100q2376k4745c8729k68195b0009
$$ plain form
10210 97503 226862 110848 150525 42160 -100105 17622 -130790 21850 63404 -186432 73670
10198 16415 80449 80030 -156534 -125961 -419499 -290859 -24655 -49606 -155409 -199416 84431
10186 -352054 -151799 -127271 -721 -294601 -164599 -195949 55199 -43998 -293119 -23002 -30464
10175 -30464 -104737 -40521 -162135 957 13003 -138975 -263703 -127234 19238 46963 -315196
10163 13834 12761 -132577 28870 -112099 -227902 -41829 -89514 16256 108668 -164597 141098
10151 91367 240906 -70562 153611 -135103 115018 112326 19363 -37672 329864 10874 -380119
10139 -104569 -105540 -145608 -229187 90531 -91807 -76644 -88114 73289 100860 -107680 117649
10127 -114756 -32891 -442178 47361 112182 -305853 -227753 -310129 -334874 -38729 -306924 -20009
10115e9460k33092K3918n1461a4774H676a63260j41028d8806j07897J7895n4026
10104a92834p1647a2892k49931E1668i1975b8259m4576D0578b02769A14817a34536
10092a22459L2854k63679J40320R2761A71214c13519a28399B663b62255A11595
10081e8082k99772J50208N4122E3653a35849j33646m6223A39921h4929A9567d07258
10069i1707a4911m1487B12028a20736C2115O5704J84047m9273B1369J0684a10295
10057F7343c32849g8328B40619A9835K68078A39985n6243a53869P5206k12185
10047b90848A70605a95302I5942K18097a65204j46182g1661Q611k20803G4364
10036f4863j6545B16312c89064C6241a45375B35526a34079B3097b56293A46817
$$ plain form
10115 -59460 -292552 -268634 -320095 -14774 8676 -163260 -304288 -48806 -156703 -138808 -192834
10104 -192834 -264481 -12892 -262823 51668 -91975 -28259 -72835 40578 -202769 114817 -134536
10092 -122459 -89605 -353284 -212964 -120203 171214 -313519 -128399 2663 -262255 111595
10081 -58082 -357854 -207646 -153524 53653 -135849 -269495 -315718 139921 -84929 19567 -407258
10069 -91707 -14911 -56398 212028 -120736 32115 97819 281866 232593 21369 32053 -110295
10057 67343 -332849 -78328 240619 19835 287913 139985 83742 -153869 -78663 -290848
10047 -290848 170605 -195302 95942 314039 -165204 -311386 -71661 -63050 -283853 74364
10036 -64863 -81408 216312 -389064 36241 -145375 235526 -134079 23097 -256293 146817
10025c09939A70735c3034k34255J14071J9211a9399E4931a47197m5135e6455k99818
10014c56273H1414L434e0394m3342j33788g0556a6379k01547F8157R3326N5250
10003B16733a29148c9540j07491b0248l13927I842a17042B65850e3811A40511
9992d62807B95062D3962a02274a5342k48450B40663A17115J71826a69948c9405
9981G3864b69046B57572e407A41889c24956e0793r1246A16891B3195a41689A75047
9969d16783J67113K3747I754M8657M5303e5607A63380D8998L0305b40134B18691
9957b10168J02119L4704m86838b68217A40868a56251O8374m2737n9026I1888c3204
9945c44661J67350e5066n3145j49955o7603h7608A21654b82660I7082J65189b01123
$$ plain form
10025 -309939 170735 -33034 -267289 -153218 -134007 -19399 54931 -147197 -192332 -56455 -356273
10014 -356273 81414 84848 -50394 -93736 -227524 -70556 -16379 -217926 68157 161483 216733
10003 216733 -129148 -39540 -147031 -20248 -334175 9842 -117042 265850 -53811 140511
9992 -462807 295062 43962 -102274 -15342 -263792 240663 117115 288941 -169948 -39405
9981 73864 -269046 257572 -5407 141889 -324956 -50793 -142039 116891 23195 -141689 175047
9969 -416783 -249670 -225923 9754 58411 103714 -55607 163380 48998 79303 -240134 218691
9957 -210168 -108049 -73345 -560183 -268217 140868 -156251 -87877 -130614 -189640 91888 -33204
9945 -344661 -177311 -55066 -108211 -258166 -325769 -87608 121654 -282660 97082 262271 -201123
9933b93941B24812a32805L7062H9916c7230G1911K3037b52512h3968G0294J11774
9922A82068a91337i4205J1338G2396i0268B09819a57175O2992l2148L5849e140
9910c82314B16446a88836r4366B61865i1784i100k65420a8222n0901C6023i7024
9898a25520A36422b40289G4198a65037A05646a63179b6765q6165a9673B80450
9887I1678B4276a79895A04127c27554B12215n3270a39875j50940m2488J56018
9877a77285P3637a9675A75434B7657R5577Q113a84017n1144e2891i606H5347K8943
9865A14290a37233l318j30150K9685L1671C7552a36444A13350a76687b0612l6878
9854e7490C3258l013a58700L8431k1201O1582j47849Q9409r4633A22664a07296
$$ plain form
9933 -293941 224812 -132805 -95743 89916 -37230 71911 94948 -252512 -83968 70294 182068
9922 182068 -191337 -94205 -82867 72396 -90268 209819 -157175 -94183 -126331 -90482 -5140
9910 -382314 216446 -188836 -283202 261865 -91784 -9100 -274520 -18222 -69123 36023 -97024
9898 -125520 136422 -240289 74198 -165037 105646 -163179 -26765 -112930 -19673 280450
9887 91678 24276 -179895 104127 -327554 212215 158945 -139875 -290815 -333303 -177285
9877 -177285 -103648 -19675 175434 27657 123234 131347 -184017 -235161 -52891 -9606 85347 114290
9865 114290 -137233 -140551 -270701 -241016 -209345 37552 -136444 113350 -176687 -20612 -57490
9854 -57490 33258 30245 -158700 -120269 -141470 -79888 -227737 -138328 -232961 122664 -107296
9842B34064c3102j99159B07158b08006l0041A94607f3699O137h00m11500a30925
9830b46909C31739I1241d49798i2093k71773J07232G8860A2858e13616A84303
9819H3139J48537c43349E29410b43014O6691A86984c06862M267A26130a51048
9808D4496b2014j65798L8507q124I4557F7a88785B4786B021g8586G8288a7492
9795d9976A24231f0392A18668b1678q8141j70911E5428b07730r96l12418B5483
9783b03077B588b13894d7574A26440l6681M807c06522k2674G8689d19710a52237
9771B9065c61194b4486m03522A66173k4069k5005b17327G971b76613k69869J403
9760e45079a28809I6379b09246A5923d7351k5391p9332H0409a26536h987F6519
$$ plain form
9842 234064 -33102 -232261 207158 -208006 -238047 194607 -63699 -57562 -800 -412300 -130925
9830 -246909 331739 91241 -449798 -92093 -363866 -256634 78860 12858 -513616 184303
9819 83139 231676 -343349 529410 -243014 -176323 186984 -306862 -302595 126130 -151048
9808 44496 -22014 -187812 -149305 -157429 94557 67 -188785 24786 2021 -78586 78288 -17492
9795 -49976 124231 -60392 118668 -21678 -109819 -280730 55428 -207730 -208726 -521144 25483
9783 -203077 2588 -213894 -47574 126440 89759 94566 -306522 -329196 78689 -419710 -152237
9771 29065 -361194 -24486 -428008 166173 142104 117099 -217327 7971 -276613 -546482 -545079
9760 -545079 -128809 96379 -209246 15923 -47351 -72742 -152074 80409 -126536 -8987 66519
9748B18165J37794G2145a66381j87852k3411C0700K43709a37113A65441c83629
9737f5724j18271h5914j58367P0652P4705j05506p2248O6291A98426J14499f5908
9725e4568j44983A78756a86778a6120B93791b12146a02641C8739c201l95158i2514
9713c60187J79522k5806b6488B77273F7095b08183P9518j01849j1791D6304J9696
9702F6000b14194D7780J28627Q1195n7467c63750a40833r5592J06284r81A84298
9690e2103E5596a30671e6086j6239j43763I5326b15778K8238C02877e1425k95133
9679c46558a40356h300j97969b1844G7722J50249E9501J8578b94985i2908I705
9667b22412A85174b42116N0212R711G2498P9037n6960b37757H2252b92861f1117
$$ plain form
9748 218165 355959 72145 -166381 -354233 -377644 30700 274409 -137113 165441 -383629
9737 -65724 -183995 -85914 -244281 -173629 -98924 -204430 -276678 -210387 198426 312925 -65908
9725 -54568 -199551 178756 -186778 -16120 293791 -212146 -102641 38739 -3201 -398359 -92514
9713 -360187 -180665 -206471 -26488 277273 67095 -208183 -128665 -230514 -242305 46304 66000
9702 66000 -214194 47780 176407 257602 200135 -363750 -140833 -236425 -130141 -131122 184298
9690 -52103 55596 -130671 -56086 -72325 -216088 95326 -215778 -187540 302877 -51425 -346558
9679 -346558 -140356 -8300 -206269 -21844 77722 227971 59501 78079 -294985 -92908 9705
9667 -222412 185174 -242116 -191904 -182193 72498 151535 94575 -237757 82252 -292861 -61117
9655f086G1517P6055d1961E249N1689P6810J00001i2339L993j23160r9925B07173
9642A1801b04098h0316B067a53298e580j60551e1084A74907d21902F1407a60403
9630a66250b0663r9506M6736j49089P789d6524A16414l7034a57287B6369J84725
9619B11094c72629A0648c93678e3035A7360p622B428J28492B6566J06709R9378
9608B32653c6852B74902J10158b2253A991a16216D249a26175G3016O0357a81391
9596e5088A11983B7331h2098b2606k3622q5134D7948a43667d8298O414B8169K5981
9584E4150K13981c72153J42781h908j01808c4169l01957C58147a19857d6028j18872
9573a64900M0168F4538d0769l73436a2520p6153m3191j2547M0242j13807A98062
$$ plain form
9655 -6086 71517 147572 -41961 5249 56938 133748 233749 -92339 -88346 -211506 -311431 207173
9642 11801 -204098 -80316 2067 -153298 -5580 -166131 -51084 174907 -421902 61407 -160403
9630 -166250 -20663 -120169 -73433 -222522 -214733 -46524 116414 79380 -157287 26369 211094
9619 211094 -372629 10648 -393678 -53035 17360 9738 2428 130920 26566 133275 232653
9608 232653 -36852 274902 385060 -22253 1991 -116216 4249 -126175 73016 133373 -181391
9596 -55088 111983 27331 -82098 -22606 -46228 -131362 47948 -143667 -48298 -41884 28169 54150
9584 54150 268131 -372153 -229372 -8908 -110716 -34169 -336126 358147 -119857 -46028 -164900
9573 -164900 -124732 64538 -40769 -414205 -12520 -88673 -131864 -144411 -104169 -217976 198062
9561c78926c2602l21040L4711c5l24800A25895a19037j09973k1689Q7948B05871
9549b26177c5930A52484o8333c52566a52736C1015b98722H7952b06114K7365m0527
9538b19276b9832B32953e3183q2883k83122c3981B19628c90903A90852b96109
9527E7587a66840O9484k88862A01808c54993a25230k3648O5654r3784A5516N2966
9516F8482f4485a8683D639b69083A24603b70759r2953a14435m1026K7913B07142
9504i4012q0926M9292E9852J45971l1198b81953C72286A25824j9727i9686A04776
9492b24331E3020J53509H2119k2837b99124J17493l7614e9360i478j40327c0179
9480B5830K7564a13684H747K03391l015F8050d03825G901R3100c66662B381b0535
$$ plain form
9561 -378926 -32602 -353642 -318931 -35 -324835 125895 -119037 -229010 -250699 -162751 205871
9549 -226177 -35930 152484 84151 -352566 -152736 31015 -298722 87952 -206114 -178749 -219276
9538 -219276 -29832 232953 -53183 -136066 -419188 -33981 219628 -390903 190852 -296109
9527 57587 -166840 -97356 -386218 101808 -354993 -125230 -148878 -83224 -177008 15516 68482
9516 68482 -64485 -18683 4639 -269083 124603 -270759 -363712 -114435 -155461 -127548 207142
9504 -94012 -174938 -125646 59852 205823 174625 -281953 372286 125824 106097 -99686 104776
9492 -224331 53020 206529 82119 59282 -299124 -181631 -219245 -59360 -9478 -149805 -30179
9480 25830 53394 -113684 8747 212138 209123 68050 -403825 7901 101001 -366662 2381 -20535
9467A9727a93859h3472j96647A60937b56223A20096c38690J5539B27221h7670
9456a21625A51489c7551h042p8161f668k17866c125j84299E7609O0969k9321L0044
9444A19301a2206p5189A38313c38698B07617q2702d21991J80341k10883e523r2657
9433i8180A63840f7269j45868G2368a38254k84420c2202E7888J04415a28881r9546
9422b28427A28747a60809a5867j30394j59594B1989b81281E1415a6470A7950a1823
9410A21483K3574c30735I2406J56790a67937A93240c2419B93472a52073j72203
9400c24276F1880b94065A80175d8981m88916a65629A56016I555J06902c0665B28289
9388h3417o8961J3337L8496l1002j6235l0775b5258l09862a18538j51164J21178
$$ plain form
9467 19727 -193859 -83472 -280119 160937 -256223 120096 -338690 -323151 227221 -87670
9456 -121625 151489 -37551 -8042 -86203 -6668 -224534 -3125 -187424 57609 118578 89257 119301
9444 119301 -12206 -87395 138313 -338698 207617 124915 -421991 -241650 -452533 -5523 -98180
9433 -98180 163840 -67269 -213137 72368 -138254 -422674 -32202 57888 162303 -128881 -228427
9422 -228427 128747 -160809 -15867 -146261 -305855 21989 -281281 51415 -16470 17950 -11823
9410 121483 145057 -330735 92406 249196 -167937 193240 -32419 293472 -152073 -324276
9400 -324276 61880 -294065 180175 -48981 -537897 -165629 156016 9555 116457 -30665 228289
9388 -83417 -152378 -139041 -100545 -131547 -147782 -178557 -25258 -335120 -118538 -269702 -148524
9377a48524j18687g4911k7441j71490J23299f8002d620B90544D4156A1873d05860
9365A79728G3371R9403p274f9663n9643P943B98779h8958I74J78832a68228b9321
9352A49794g3362g399j78883H3085d97817f086B61817c20283J9890R1852j8754
9341b27295p8049L5559G8033a8101B73650a22352k79441H7488f5452n7739a3525
9329b5237k32295c4926n2089l2013r3069i8152G6655c26294A72368a2872r7260
9318a10132d1248A94417a48764G4087a24800l05518D0900L6270b01091A39471
9307A45168a4968k51326A30477a0951j44089k7662A4941b87932j50802A17165
9296i2269B81363h1996K4450B04771q8449b06944J6434A68273c96166J22515F8216
$$ plain form
9377 -148524 -267211 -74911 -102352 -273842 -150543 -68002 -4620 290544 44156 11873 -405860
9365 179728 73371 172774 165500 -69663 -129306 -121363 298779 -88958 974 179806 -168228 -29321
9352 149794 -73362 -7399 -186282 83085 -497817 -6086 261817 -320283 -300393 -208541 -227295
9341 -227295 -305344 -269785 78033 -18101 273650 -122352 -401793 87488 -65452 -123191 -13525
9329 -25237 -257532 -34926 -87015 -119028 -212097 -98152 76655 -326294 172368 -12872 -110132
9318 -110132 -41248 194417 -148764 74087 -124800 -430318 40900 77170 -201091 139471
9307 145168 -14968 -266294 130477 -10951 -155040 -182702 14941 -287932 -438734 117165
9296 -92269 281363 -81996 -57546 204771 116322 -206944 -190510 168273 -396166 -273651 68216
9284d46295C6059J15272g4493j03762I1998f6928j33572E1066b00490d5432j2570
9273e8002j18820J4967A74300q2745J2252D2988a440j32626A11088d18205a66881
9261d56163d10r8084J8872A04599a75491K1519l4344A71976D9831i5676j00264
9250a95940f4814C9885a34123O0633F3738J5344Q4078b40333g4430r3030A971
9238B39242a84414e2807j78414d6032l5480B06201a20781k52139F5136f5187j04370
9227a69557K5200A24816a02709C2794a24110j0024r2288L0412i04l01767A28553
9215H5600c9465o2352p1945A78383b50894f9524B72212b85955r4004P5671N1915
9204b52373K2483B76834f2963B9441J33667b16601L1455O6073k6743A92330a72262
$$ plain form
9284 -446295 36059 151331 -74493 -178255 91998 -66928 -200500 51066 -200490 -45432 -58002
9273 -58002 -176822 -161855 174300 91555 103807 42988 -1440 -134066 111088 -418205 -166881
9261 -456163 -410 -98494 -79622 104599 -175491 -153972 -188316 171976 49831 -95676 -195940
9250 -195940 -64814 39885 -134123 -73490 63738 79082 163160 -240333 -74430 -167460 1971
9238 239242 -184414 -52807 -231221 -46032 -81512 206201 -120781 -372920 65136 -65187 -169557
9227 -169557 -144357 124816 -102709 32794 -124110 -134134 -226422 -196010 -904 -302671 128553
9215 85600 -39465 -101817 -173762 178383 -250894 -69524 272212 -285955 -379959 -304288 -252373
9204 -252373 -229890 276834 -62963 29441 163108 -216601 -185146 -119073 -145816 192330 -172262
9192h249j73416A37871c46526a26814A5549i9800q4354L6178I9829b17576b2349
9180F0774c6781m43814a96540A44532B5404L4217b83648j41751k42894A50821
9169a41577f0447l7093m363m7478d8822p1494j35583J14324N1710B8043N3272
9158H1315b67650J08623b0892q5531k09344h7234n66958b2267I1094h0558L3581
9147d6977K3021j53793A40221B1412a44885b157r7690d3949j45641R4682j86205
9136b81113D8430c61204H2547b26299q1856A60858B9950J129b78367R5763o1450
9125b44054A25917b13805A44886i4323M4197p1912A57790F7872J32266a12764
9114D436g9702G4542b45389h4023H8771Q8255F952b15361B08381a50021A43520
$$ plain form
9192 -8249 -181665 137871 -346526 -126814 15549 -99800 -184154 -147976 99829 -217576 -22349
9180 60774 -36781 -480595 -196540 144532 25404 59621 -283648 -425399 -668293 150821
9169 -141577 -60447 -97540 -101903 -149381 -48822 -120316 -255899 -141575 -89865 28043 81315
9158 81315 -267650 -159027 -20892 -106423 -315767 -87234 -654192 -22267 91094 -80558 -46977
9147 -46977 -23956 -177749 140221 21412 -144885 -2157 -99847 -43949 -189590 -94908 -281113
9136 -281113 48430 -361204 82547 -226299 -308155 160858 29950 31079 -278367 -182604 -244054
9125 -244054 125917 -213805 144886 -94323 -50126 -122038 157790 67872 200138 -112764
9114 4436 -79702 74542 -245389 -84023 88771 177026 6952 -215361 208381 -150021 143520
9102a13261E8759M07664i9590j16820k9125h9088B19336h0797j12782F0979M4607
9091A05586e642l72653B76373N455b43669B3404J68538d48278B98074o4631a6917
9079a94351q2788A46268D8932R0645C4514K13064f1956B4442L7581b29557R4518
9068a35039K3619J2817G655a50521p191j41593D9244b6304j18913N2870k014B44147
9055H159a5450j25547G5665J24836b20061A68127j58c09944a18383m00748K48690
9044b70441a7725j79653B98132H7866a28769n0306c1367j06345e9667k13742e0227
9032c7480k48870A58920a37714B1898h3354k8512j35250k11886J56176m4282b0797
9020C31213b90950i5294j28976g2153k63122B57136a89337A87859g0671A53995
$$ plain form
9102 -113261 58759 466423 -99590 -216410 -245535 -89088 219336 -80797 -193579 60979 105586
9091 105586 -5642 -378295 276373 281828 -243669 23404 191942 -448278 298074 233443 -16917
9079 -194351 -277139 146268 48932 139577 34514 247578 -61956 24442 62023 -229557 -135039
9068 -135039 -111420 -98603 7655 -150521 -157712 -299305 49244 -26304 -145217 -92347 -94361 244147
9055 8159 -15450 -140997 75665 200501 -220061 168127 167969 -309944 -118383 -519131 -270441
9044 -270441 -17725 -197378 298132 87866 -128769 -179075 -31367 -137712 -59667 -273409 -50227
9032 -37480 -286350 158920 -137714 21898 -83354 -111866 -247116 -459002 -302826 -347108 -20797
9020 331213 -290950 -95294 -224270 -72153 -335275 257136 -189337 187859 -70671 153995
9009c49709e2912K1558j24314D2012c3528j10761A62743G0876c13988r7393a35704
8997B22673C7510d9770k0976A10605a9525A60988b9051l23852a75681j0942P0231
8986a16392B76816b30802k33570A69989E6942b393l19638C0596c51635J48888
8976b02747Q5551I7790J23430a55176c834j64303P3575l1193I3473b19087B0083
8964A33705b23945a2768E1076K1420A3569c95866N5970B17386m6264b8734l61195
8953c89929J69831d643k04017D9203a9458j03222l79023b03783E4756a20626K583
8942a18043j12923k59093A46318e7164k81489B8883Q2915j0151Q8055a30156D07931
8930i3806C27440r3150h6887c1496B54276L68115K19590K015305N650410k172132
$$ plain form
9009 -349709 -52912 -31354 -155668 42012 -33528 -144289 162743 70876 -313988 -411381 -135704
8997 222673 37510 -49770 -70746 110605 -19525 160988 -29051 -352903 -175681 -186623 -116392
8986 -116392 276816 -230802 -464372 169989 56942 -2393 -322031 30596 -351635 -202747
8976 -202747 -117196 97790 221220 -155176 -3834 -168137 -94562 -125755 93473 -219087 20083
8964 133705 -223945 -12768 51076 72496 13569 -395866 -339896 217386 171122 -28734 -389929
8953 -389929 -220098 -4643 -208660 49203 -19458 -122680 -501703 -203783 54756 -120626 -118043
8942 -118043 -230966 -490059 146318 -57164 -338653 28883 111798 101647 189702 -130156 407931
8930 -93806 327440 234290 -86887 -31496 254276 622391 841981 2857286 8507696 6335564
8920F335564A271128m47313A55677R8156I2121j0309b61284B22918j01052m8808
8910G3058K0157r947c651A41637J29187a26817B03926k5181h2290A84881a89903
8898A94868a06452j19550I912b43747r839A41424a52350C1143c2811B29967b52247
8886A8233d37C8511J49822g5249e694o8853A48780c76329B9739a19882C26827
$$ plain form
8920 6335564 1271128 823815 155677 253833 92121 81812 -261284 222918 121866 73058
8910 73058 93215 83268 -3651 141637 270824 -126817 203926 178745 -82290 184881 -189903
8898 194868 -106452 -226002 9912 -243747 -253586 141424 -152350 31143 -32811 229967 -252247
8886 18233 -437 38511 188333 -75249 -5694 -74547 148780 -376329 29739 -119882 326827
$$ [...]
##END NTUPLES=NMR SPECTRUM
##END=
