
##TITLE=AC1204_BRAAS12063_6528160_YB5IYdtHLw
##JCAMPDX= 6.0         $$ Bruker NMR JCAMP-DX V2.0
##DATA TYPE= NMR SPECTRUM
##DATA CLASS= NTUPLES
##ORIGIN= BRUKER
##OWNER= Administrator
$$ 1.72 TOPSPIN		Version 2.1
$$ 2012-07-15 10:46:44.609 -0500  Administrator@TOPSPIN
$$ Compression mode = diff/dup
##.OBSERVE FREQUENCY= 400.02188249412
##.OBSERVE NUCLEUS= ^1H
##.ACQUISITION MODE= SIMULTANEOUS (DQD)
##.ACQUISITION SCHEME= undefined
##.AVERAGES= 64
##.DIGITISER RES= 22
##SPECTROMETER/DATA SYSTEM= spect
##.PULSE SEQUENCE= noesygpps1d.comp
##.SOLVENT NAME= COFFEE_meoh
##.SHIFT REFERENCE= INTERNAL, COFFEE_meoh, 1, 14.96081
##AUDIT TRAIL= $$ (NUMBER, WHEN, WHO, WHERE, PROCESS, VERSION, WHAT)
$$ ##TITLE= Audit trail, TOPSPIN		Version 2.1
$$ ##JCAMPDX= 5.01
$$ ##ORIGIN= Bruker BioSpin GmbH
$$ ##OWNER= Administrator
$$ $$ C:\Bruker\TOPSPIN/data/COFFEE/nmr/AC1204_BRAAS12063_6528160_YB5IYdtHLw/12/pdata/1/auditp.txt
$$ ##AUDIT TRAIL=  $$ (NUMBER, WHEN, WHO, WHERE, PROCESS, VERSION, WHAT)
(   1,<2012-07-15 10:46:39.687 -0500>,<Administrator>,<TOPSPIN>,<go>,<TOPSPIN 2.1>,
      <created by zg
	started at 2012-07-15 10:35:09.484 -0500,
	POWCHK enabled, PULCHK disabled,
       configuration hash MD5:
       6B 1B 68 BB D9 2E 58 E2 7F 35 AD 54 07 DF 0E 41
       data hash MD5: 64K
       B1 F1 AE B4 96 CF 05 F3 1F 40 2F FC 74 9C BF 0B>)
(   2,<2012-07-15 10:46:42.703 -0500>,<Administrator>,<TOPSPIN>,<proc1d>,<TOPSPIN 2.1>,
      <Start of raw data processing
       efp LB = 0.3 FT_mod = 6 PKNL = 1 PHC0 = 0 PHC1 = 0 SI = 128K 
       data hash MD5: 128K
       B6 3A 9E AD 14 D3 BD B0 8E 50 C4 5F 67 9D BF 19>)
(   3,<2012-07-15 10:46:43.750 -0500>,<Administrator>,<TOPSPIN>,<proc1d>,<TOPSPIN 2.1>,
      <pk PHC0 = -1.274414 PHC1 = 0 
       data hash MD5: 128K
       D1 8E 6F A9 C7 D6 2C 13 32 80 CC 59 F8 91 05 85>)
(   4,<2012-07-15 10:46:44.296 -0500>,<Administrator>,<TOPSPIN>,<proc1d>,<TOPSPIN 2.1>,
      <abs ABSG = 1 
       data hash MD5: 128K
       FB 2D 87 75 46 9F F6 8F 46 67 11 9F E6 2D DC 43>)
(   5,<2012-07-15 10:46:44.359 -0500>,<Administrator>,<TOPSPIN>,<proc1d>,<TOPSPIN 2.1>,
      <abs ABSG = 2 
       data hash MD5: 128K
       62 21 6B 6F ED 12 D4 F5 09 64 C6 D2 47 C8 45 13>)
(   6,<2012-07-15 10:46:44.406 -0500>,<Administrator>,<TOPSPIN>,<proc1d>,<TOPSPIN 2.1>,
      <abs ABSG = 3 
       data hash MD5: 128K
       DF 1A 2E A9 86 41 B9 C1 CF C3 2F 26 87 4B 67 E3>)
(   7,<2012-07-15 10:46:44.468 -0500>,<Administrator>,<TOPSPIN>,<proc1d>,<TOPSPIN 2.1>,
      <abs ABSG = 4 
       data hash MD5: 128K
       55 41 5D 26 69 3D 15 95 78 5C 1C 3E 3C 83 55 7F>)
(   8,<2012-07-15 10:46:44.515 -0500>,<Administrator>,<TOPSPIN>,<proc1d>,<TOPSPIN 2.1>,
      <abs ABSG = 5 
       data hash MD5: 128K
       48 B9 B5 CD 2D 79 22 8D E4 A2 5D 5C 91 1E FD D5>)
$$ ##END=
$$ 
$$ $$ hash MD5
$$ $$ E0 82 9F 0B EA 83 ED 73 77 DC EF D1 2D A8 EE 10
##$RELAX= 
##$RELAX= 
##$RELAX= 
##$RELAX= 
##$RELAX= 
##$RELAX= 
##$RELAX= 
##$RELAX= 
$$ Bruker specific parameters
$$ [...]
##$TP07= 0
##$TPNAME0= <>
##$TPNAME1= <>
##$TPNAME2= <>
##$TPNAME3= <>
##$TPNAME4= <>
##$TPNAME5= <>
##$TPNAME6= <>
##$TPNAME7= <>
##$TPOAL= (0..7)
0.5 0.5 0.5 0.5 0.5 0.5 0.5 0.5
##$TPOFFS= (0..7)
0 0 0 0 0 0 0 0
##$TUNHIN= 0
##$TUNHOUT= 0
##$TUNXOUT= 0
##$USERA1= <user>
##$USERA2= <user>
##$USERA3= <user>
##$USERA4= <user>
##$USERA5= <user>
##$V9= 5
##$VALIST= <valist>
##$VCLIST= <CCCCCCCCCCCCCCC>
##$VD= 0
##$VDLIST= <DDDDDDDDDDDDDDD>
##$VPLIST= <PPPPPPPPPPPPPPP>
##$VTLIST= <TTTTTTTTTTTTTTT>
##$WBST= 2048
##$WBSW= 25
##$XGAIN= (0..3)
0 0 0 0
##$XL= 0
##$YL= 0
##$YMAX_a= 12072059
##$YMIN_a= -9721716
##$ZGOPTNS= <>
##$ZL1= 120
##$ZL2= 120
##$ZL3= 120
##$ZL4= 120
##$ABSF1= 14.96081
##$ABSF2= -5.597372
##$ABSG= 5
##$ABSL= 3
##$ALPHA= 0
##$AQORDER= 0
##$ASSFAC= 0
##$ASSFACI= 0
##$ASSFACX= 0
##$ASSWID= 0
##$AUNMP= <proc_prof1d_extract.lims>
##$AXLEFT= 0
##$AXNAME= <>
##$AXNUC= <1H>
##$AXRIGHT= 0
##$AXTYPE= 0
##$AXUNIT= <>
##$AZFE= 0.1
##$AZFW= 0.1
##$BCFW= 0
##$BC_mod= 0
##$BYTORDP= 0
##$COROFFS= 0
##$CY= 15
##$DATMOD= 1
##$DC= 0
##$DFILT= <>
##$DTYPP= 0
##$F1P= 0
##$F2P= 0
##$FCOR= 0.5
##$FTSIZE= 131072
##$FT_mod= 6
##$GAMMA= 0
##$GB= 0
##$INTBC= 1
##$INTSCL= 1
##$ISEN= 128
##$LB= 0.3
##$LEV0= 0
##$LPBIN= 0
##$MAXI= 10000
##$MC2= 0
##$MEAN= 0
##$ME_mod= 0
##$MI= 0
##$NCOEF= 0
##$NC_proc= -2
##$NLEV= 6
##$NOISF1= 0
##$NOISF2= 0
##$NSP= 0
##$NTH_PI= 0
##$NZP= 0
##$OFFSET= 14.96081
##$PC= 1
##$PHC0= -1.274414
##$PHC1= 0
##$PH_mod= 1
##$PKNL= yes
##$PPARMOD= 0
##$PPDIAG= 0
##$PPIPTYP= 0
##$PPMPNUM= 2147483647
##$PPRESOL= 1
##$PSCAL= 4
##$PSIGN= 0
##$PYNMP= <proc.py>
##$REVERSE= no
##$SF= 400.02000971173
##$SI= 131072
##$SIGF1= 0
##$SIGF2= 0
##$SINO= 400
##$SIOLD= 131072
##$SPECTYP= <>
##$SREGLST= <1H.CDCl3>
##$SSB= 0
##$STSI= 131072
##$STSR= 0
##$SW_p= 8223.68421052631
##$SYMM= 0
##$S_DEV= 0
##$TDeff= 65536
##$TDoff= 0
##$TI= <>
##$TILT= no
##$TM1= 0
##$TM2= 0
##$TOPLEV= 0
##$USERP1= <user>
##$USERP2= <user>
##$USERP3= <user>
##$USERP4= <user>
##$USERP5= <user>
##$WDW= 1
##$XDIM= 131072
##$YMAX_p= 442321305
##$YMIN_p= -12035
##$CURPLOT= <Network HP LaserJet P1505>
##$CURPRIN= <$Network HP LaserJet P1505>
##$DFORMAT= <normdp>
##$LAYOUT= <+/1D_H.xwp>
##$LFORMAT= <normlp>
##$PFORMAT= <normpl>
##$SURQMSG= 1
$$ End of Bruker specific parameters
$$ ---------------------------------
##NTUPLES= NMR SPECTRUM
##VAR_NAME=  FREQUENCY,     SPECTRUM/REAL,   SPECTRUM/IMAG
##SYMBOL=    X,             R,               I
##VAR_TYPE=  INDEPENDENT,   DEPENDENT,       DEPENDENT
##VAR_FORM=  AFFN,          ASDF,            ASDF
##VAR_DIM=   131072,        131072,          131072
##UNITS=     HZ,            ARBITRARY UNITS, ARBITRARY UNITS
##FACTOR=    0.0627417313425164, 1,          1
##FIRST=     8223.62146879497, 1328,         -60609
##LAST=      0,             1931,            -60637
##MIN=       0,             -12035,          0
##MAX=       8223.62146879497, 442321305,    0
$$ Real data points
##PAGE= N=1
##DATA TABLE= (X++(R..R)), XYDATA
$$ [...]
67873 77988 78448 78757 79140 79854 80712 81288 81420 81396 81720 82734 84263 85526 85617 84346 82485 81045 80424 80385
67855 80385 80563 80664 80406 79735 79053 78767 78550 77518 75345 72807 70981 70194 70020 69994 69941 69755 69316 68692
67837 68692 68150 67894 67961 68399 69303 70583 71871 72801 73371 73934 74873 76282 77973 79694 81364 83092 85003
67820 85003 87039 88942 90419 91349 91859 92154 92277 92094 91570 90933 90398 89817 88794 87158 85095 82851 80548
67803 80548 78349 76507 75137 74155 73562 73452 73540 73063 71603 69812 68838 69068 69843 70415 70655 70719 70482 69722
67785 69722 68628 67723 67305 67222 67246 67441 68009 68832 69415 69397 69022 68846 68968 68914 68468 68276 69202 71261 73582
67766 73582 75390 76581 77394 78042 78761 79714 80652 81122 81226 81665 82723 83696 83820 83323 83014 83147 83352 83477
67748 83477 83747 84100 84092 83601 83054 82770 82628 82590 82980 83850 84510 84173 82870 81341 80215 79594 79194 78530 77124
67729 77124 74944 72551 70564 69055 67779 66781 66315 66245 65993 65257 64357 63709 63207 62387 61057 59563 58535
67712 58535 58436 59219 60336 61157 61511 61695 62015 62494 63074 63807 64644 65255 65329 64980 64609 64419 64276 64039 63802
67693 63802 63713 63768 63934 64342 65142 66104 66566 66002 64632 63279 62513 62109 61506 60651 60106 60339 61251 62451 63697
67674 63697 64876 65845 66607 67456 68624 69939 71133 72411 74267 76693 78979 80481 81258 81727 81942 81592
67658 81592 80612 79489 78890 79132 79961 80682 80575 79473 78040 77268 77545 78286 78634 78402 78156 78457 79255 80107
67640 80107 80724 81103 81256 81153 80938 80926 81213 81480 81398 81088 80937 81053 81199 81294 81651 82523 83633 84398 84605 84666
67620 84666 85147 86183 87418 88444 89156 89594 89631 89077 88144 87470 87433 87624 87308 86361 85405 85086 85544 86594
67602 86594 87905 88880 88878 87916 86849 86446 86519 86354 85770 85239 85020 84706 83775 82210 80428 78819 77542 76553
67584 76553 75690 74840 74134 73876 74192 74825 75313 75345 75007 74717 74832 75213 75309 74784 73887 73095 72626 72519 72804 73181
67564 73181 72911 71707 70534 70736 72277 73696 74021 73921 74490 75670 76591 76911 76999 77060 76921 76618 76444 76376
67546 76376 76101 75753 75989 77047 78184 78382 77353 75595 73741 72160 71029 70414 70248 70325 70435 70488 70534 70638
67528 70638 70731 70667 70460 70328 70391 70481 70366 70013 69501 68891 68424 68574 69549 70899 72004 72793 73548 74186 74331 74114
67508 74114 74214 74934 75741 75993 75707 75344 75234 75429 75740 75707 74990 74076 74051 75227 76526 76837 76560 77008 78508
67489 78508 79940 80174 79153 77406 75337 73451 72617 73341 74995 76371 76951 77226 77766 78462 78871 78941 79081
67472 79081 79627 80516 81522 82538 83507 84206 84308 83681 82547 81394 80759 80979 81869 82636 82471 81394 80348
67455 80348 80246 81130 82459 83973 85824 87963 89850 90928 91075 90488 89428 88268 87453 87088 86685 85687
67439 85687 84259 83313 83606 84929 86312 86966 86981 87114 88042 89807 91891 93617 94427 93973 92271 89831 87511
67422 87511 86007 85426 85293 84950 83999 82548 81130 80355 80528 81544 83064 84723 86216 87363 88190 88845
67406 88845 89297 89232 88413 87118 85994 85431 85306 85443 86014 87177 88462 89055 88800 88470 88703 89006 88378 86822
67388 86822 85593 85708 86674 87132 86517 85587 85263 85421 85164 84145 83206 83452 84877 86302 86806 86836 87529 89180
67370 89180 90963 92127 92810 93400 93739 93505 92992 92849 93231 93792 94450 95505 96931 98127 98599 98432 97853
67353 97853 96836 95495 94421 94072 94000 93245 91546 89775 89053 89776 91574 93888 96250 98195 99343 99747
67337 99747 99941 100459 101378 102465 103612 104893 106280 107606 108856 110139 111305 111984 112245 112755 113927 115266
67321 115266 116050 116301 116517 116703 116463 115901 115520 115163 114056 112269 111128 111455 112226 111946 110867 110690 112259
67304 112259 114612 116405 117328 117761 117891 117793 117901 118744 120373 122377 124349 126052 127348 128287 129174 130252
67288 130252 131351 132051 132119 131661 130933 130208 129732 129541 129339 128800 127986 127298 126950 126704 126256 125727 125549 125917 126583
67269 126583 127199 127660 128028 128321 128633 129324 130708 132564 134278 135589 136846 138289 139396 139347 138026 136216
67253 136216 134791 134041 133733 133507 133092 132424 131689 131122 130710 130285 129914 129943 130513 131304 131890 132184 132385 132625 132871
67234 132871 133067 133235 133442 133732 134068 134355 134597 134938 135387 135576 135151 134399 134102 134630 135540 136351 137303 138870
67216 138870 140751 141930 141824 140994 140511 140906 141862 142740 143164 143157 142903 142452 141726 140756 139880 139557 140053 141340
67198 141340 143219 145376 147368 148709 149125 148722 147932 147302 147216 147683 148353 148820 148943 148958 149309 150319 151804
67181 151804 153017 153248 152611 151992 152036 152461 152646 152584 152762 153305 153833 154251 154999 156221 157168 156959 155700 154405
67163 154405 153924 154371 155484 156970 158310 158761 158061 156968 156648 157465 158750 159784 160586 161417 162007 161883 161353
67146 161353 161440 162608 164144 165216 165991 167078 168261 168641 168052 167531 168047 169376 170633 171452 172130 172872 173453
67129 173453 173643 173593 173653 173944 174209 174101 173689 173604 174415 175881 177166 177932 178757 180220 181979 183203 183636 183763
67111 183763 184075 184701 185679 187015 188377 189226 189419 189424 189803 190736 192093 193638 195067 196155 196972 197725 198352
67094 198352 198595 198546 198751 199624 201050 202652 204136 205237 205762 205890 206078 206436 206621 206567 206779 207509 208144 208020
67076 208020 207442 207205 207384 207471 207588 208559 210559 212561 213665 214298 215477 217334 219044 220001 220402 220652 220765
67059 220765 220552 220111 219935 220574 222128 223969 225092 225055 224492 224442 225207 226204 226930 227686 229142 231506 234346
67042 234346 237103 239479 241373 242732 243584 244182 244992 246395 248304 250127 251301 251847 252255 252870 253692 254850
67026 254850 256781 259583 262521 264669 265963 267081 268353 269445 270285 271547 273680 275990 277433 278028 278734
67011 278734 280015 281375 282497 283982 286442 289474 292181 294371 296610 299237 302024 304764 307645 310892
66997 310892 314433 318064 321606 324852 327702 330377 333098 335549 337161 338080 339291 341466 344223 346926
66983 346926 349738 353279 357544 361843 365690 369181 372497 375666 378864 382409 386297 390231 394251 398745
66969 398745 403584 407868 411039 413777 417221 421569 426138 430661 435707 441699 448194 454537 460753 467314
66955 467314 474297 481282 488030 494776 501759 508825 515727 522604 529844 537544 545409 553309 561698 571188
66941 571188 581738 592578 603035 613226 623716 634729 646016 657438 669205 681380 693527
66930 693527 705173 716495 728289 741308 755883 772074 789815 808737 828057 846872 864696
66919 864696 881763 898857 916765 935773 955703 976437 998294 1021667 1046416 1071896 1097598
66908 1097598 1123531 1149930 1176913 1204564 1233087 1262612 1292987 1324031 1355885 1388905 1423179
66897 1423179 1458388 1494220 1530747 1568313 1607081 1646858 1687408 1728902 1771867 1816506 1862182
66886 1862182 1907800 1952750 1997235 2041653 2086014 2130044 2173548 2216436 2258753 2300902 2343399
66875 2343399 2385971 2427265 2466058 2502569 2537835 2571907 2603468 2631438 2656189 2678765 2699475
66864 2699475 2717744 2732874 2744350 2751712 2754805 2754113 2750386 2743894 2734336 2721379 2704950 2685110 2662085
66851 2662085 2636407 2608715 2579347 2548286 2515391 2480336 2442509 2401516 2357883 2312859 2267417
66840 2267417 2221788 2176011 2130428 2085320 2040402 1995137 1949449 1903875 1859024 1815068 1771721
66829 1771721 1728584 1685568 1643101 1601844 1562116 1523605 1485683 1447967 1410614 1374201 1339353
66818 1339353 1306264 1274502 1243374 1212547 1182199 1152584 1123710 1095517 1068066 1041323 1015026
66807 1015026 989079 963988 940529 918877 898286 877739 856880 836255 816699 798552 781431
66796 781431 764619 747551 729952 711785 693416 675758 659802 645723 632656 619571 606252
66785 606252 593208 580809 568828 556826 544668 532575 520811 509445 498377 487563 477240
66774 477240 467818 459478 451943 444753 437681 430760 423961 417036 409688 401802 393602 385698 378848 373428
66760 373428 369114 365184 361033 356269 350598 344082 337474 331716 326871 321966 316159 309754 303711 298454
66746 298454 293663 289103 285075 281862 279090 275916 271783 266868 261891 257576 254210 251569 249208 246733
66732 246733 243857 240419 236562 232770 229455 226548 223725 220983 218620 216607 214419 211647 208442 205139
66718 205139 201833 198688 196272 195015 194468 193668 192252 190664 189154 187204 184310 180926 178121 176453 175564
66703 175564 174792 173844 172771 171610 170218 168417 166158 163519 160632 157728 155232 153519 152387 151080 149208
66688 149208 147429 146598 146342 145239 142668 139687 137610 136430 135319 134060 133020 132041 130479 128434 126912
66673 126912 126421 126178 125177 123515 122153 121745 122066 122382 122063 121019 119742 118791 118233 117850 117779 118353 119256
66656 119256 119533 118731 117472 116506 115748 114708 113355 111984 110684 109520 108879 108943 109045 108244 106487 104617
66640 104617 103309 102502 101895 101465 101411 101885 102723 103200 102387 100220 97911 96736 96622 96595 96246 95903 95508 94499
66622 94499 93008 92138 92583 93764 94820 95636 96311 96381 95397 93850 92729 92393 92550 93048 93941 94860 95053 94153
66604 94153 92473 90522 88642 87106 86051 85254 84367 83428 82807 82573 82344 81859 81340 81091 81084 81174 81404 81793
66586 81793 82003 81587 80596 79649 79314 79578 80038 80450 80843 81178 81195 80794 80320 80217 80495 80791 80857 80671 80164 79252
66566 79252 78200 77484 77134 76614 75618 74617 74278 74682 75463 76397 77322 77668 76769 74778 72913 72458 73623
66549 73623 75450 76726 76939 76457 75882 75420 74959 74543 74313 73969 72885 71052 69395 68669 68445 67793 66664
66532 66664 65913 66007 66437 66535 66278 66075 66172 66439 66436 65581 63685 61462 60167 60498 62073 63959 65355 65740 64961
66513 64961 63451 62017 61104 60559 60261 60519 61518 62758 63485 63472 63051 62582 62252 62204 62393 62398 61768 60606 59521
66494 59521 58959 58775 58502 57866 57032 56460 56496 57026 57578 57810 57796 57810 58010 58443 59114 59862 60382 60602 60896 61707
66474 61707 63006 64317 65097 64976 63928 62538 61778 62046 62548 62145 60803 59662 59562 60028 59957 58840 56979
66457 56979 54901 53062 51880 51482 51389 50951 50255 50209 51487 53675 55788 57378 58734 60072 61025 61183 60784
66440 60784 60534 60856 61625 62560 63639 64994 66582 68015 68722 68374 67267 66167 65593 65309 64727 63696 62611
66423 62611 61780 61060 60236 59478 59253 59880 61236 62761 63794 64124 64205 64531 64876 64510 63217 61629 60445
66406 60445 59774 59423 59321 59290 58890 58024 57396 57843 59300 60863 61760 61939 61794 61723 61875 62061 61901 61250 60331
66387 60331 59308 58085 56817 56167 56587 57597 58358 58731 59182 59836 60333 60518 60612 60643 60403 60044 60066 60575 61127
66368 61127 61416 61529 61424 60875 60172 60112 60892 61629 61471 60645 59927 59613 59524 59607 59893 60170 60222 60150 60047 59664 58956
66347 58956 58588 59248 60637 61792 62270 62388 62380 62033 61249 60396 59845 59625 59694 60173 61061 62053 62815 63231 63243 62692
66327 62692 61515 59977 58551 57571 56988 56447 55659 54798 54402 54820 55950 57574 59539 61388 62278 61861 60951
66310 60951 60698 61212 61646 61556 61382 61435 61195 60105 58556 57565 57727 58853 60414 61928 63017 63465 63318 62833
66292 62833 62367 62250 62564 63008 63233 63381 64000 65306 66804 67834 68177 67988 67451 66768 66217 65878 65494 64831
66274 64831 64016 63232 62330 61075 59649 58495 57772 57329 57204 57727 58995 60564 61857 62720 63401 64075 64559
66257 64559 64503 63779 62693 61779 61352 61319 61390 61422 61432 61414 61266 60958 60650 60606 60972 61616 62195 62430 62336 62123 61945
66236 61945 61825 61804 61966 62263 62458 62343 61906 61268 60630 60329 60749 62002 63758 65492 66776 67317 66981 65962
66218 65962 64831 64143 64063 64436 65108 65938 66606 66681 66053 65226 65064 66070 67847 69350 69839 69537 69188 69135 69175
66199 69175 69219 69583 70418 71319 71797 71809 71500 70790 69619 68363 67471 66865 66120 65215 64605 64601 65064 65757 66597 67456
66179 67456 68071 68282 68181 67999 68000 68396 69099 69660 69845 70102 70960 71966 71914 70329 68143 66579 65854 65465 65277
66160 65277 65589 66289 66710 66574 66604 67762 70026 72248 73252 72955 72299 72196 72656 72993 72655 71667 70358 68994
66142 68994 67797 67021 66819 67069 67505 67918 68174 68174 67957 67777 67883 68273 68773 69304 69899 70450 70645 70311 69743
66123 69743 69528 69995 70971 72087 73153 74062 74522 74318 73840 73924 74965 76481 77764 78564 78810 78187 76684
66106 76684 75317 75416 77075 79000 80141 80759 81493 82045 81570 80092 78766 78629 79522 80401 80453 79793 79194 79265
66088 79265 79889 80507 80831 81085 81583 82388 83458 84730 85855 86199 85450 84056 82786 82044 81833 82013 82255
66071 82255 82041 81253 80597 80936 82225 83559 84221 84279 84148 84057 84040 84001 83653 82785 81783 81462 82172 83369 84317
66052 84317 84869 85287 85558 85367 84657 83856 83460 83559 83820 83838 83484 82996 82745 82900 83332 83813 84167 84226 83845 83094
66032 83094 82344 82002 82193 82780 83607 84638 85859 87164 88376 89378 90270 91340 92789 94438 95868 96909
66016 96909 97896 99306 101154 102862 103777 103763 103314 103107 103470 104233 104964 105260 104946 104268 104013 105171 108103 112018
65998 112018 115534 117903 119631 121877 125323 129669 134095 138100 141891 145978 150446 154707 158047 160326
65984 160326 162037 163756 165642 167384 168392 168061 166159 163100 159760 156877 154656 152835 150925 148356
65970 148356 144714 140087 135079 130338 126139 122524 119634 117579 116080 114606 112974 111511 110455 109519
65956 109519 108371 107313 107016 107593 108505 109495 111052 113492 116047 117538 117797 117818 118571 120303 122977 126511
65940 126511 130270 133089 134438 135122 136291 138164 140174 141963 143558 144881 145783 146410 146901 146973 146479 146175
65924 146175 147091 149119 151071 152256 153198 154635 156626 158978 161771 165012 168384 171816 175714 180164 184498
65909 184498 188157 191461 194967 198590 202056 205715 210017 214410 217631 219131 219522 219589 219554 219457 219608 220245
65893 220245 221074 221489 221193 220431 219653 218956 217889 215898 212915 209233 204799 199145 192269 185073 178519 172749
65877 172749 167459 162685 158541 154586 150267 145835 142042 138999 136136 133226 130592 128220 125604 122789
65863 122789 120695 119899 119804 119531 119055 118882 119092 119335 119451 119519 119540 119535 119764 120356 120961 121189 121169 121205 121192 120951 120884
65842 120884 121589 122820 123591 123495 123290 123920 125455 127373 129376 131442 133290 134411 134702 134697 135006 135727 136544
65825 136544 137226 137886 138854 140493 143138 147021 152134 158263 165229 172953 181133 188996 195674 200835 204733
65810 204733 207679 209787 211320 212781 214292 215110 214187 211172 206598 201223 195648 190513 186480 183614 181097
65795 181097 178032 174462 171252 168907 166864 164160 160584 156955 154299 153016 152812 153178 153775 154537 155641
65780 155641 157423 160160 163834 168101 172478 176646 180693 185087 190262 196156 202288 208322 214276 220025
65766 220025 224922 228199 229540 228893 225991 220655 213567 206154 199448 193411 187489 181416 175313 169476
65752 169476 164405 160706 158572 157617 157535 158649 161480 166020 171883 178979 187528 197439 208069 218695
65738 218695 228954 238815 248398 257738 266425 273547 278353 280952 281988 281543 278853 273297 265302 255936
65724 255936 245910 235373 224468 213598 203051 192779 182843 173784 166136 159644 153381 146870 140733
65711 140733 135937 132625 130126 127939 126135 124742 123378 121811 120362 119250 117953 115848 113323 111602
65697 111602 111398 112242 113215 113908 114429 114828 114884 114414 113680 113387 114134 115706 117099 117497 117156 117010 117568 118539
65679 118539 119512 120475 121619 123038 124813 127000 129383 131663 134175 138028 144077 151927 160316 168485 176831
65664 176831 186211 196900 208429 220335 232791 246268 260570 274459 286478 296121 304097 311524
65652 311524 318958 325968 331388 334213 334662 334258 334456 335322 336030 336445 337406 339344 341535 343133 344174 344920
65636 344920 344795 342739 338313 331738 323116 312398 300053 286998 273677 259780 245099 230164 215814
65623 215814 202486 190175 178845 168626 159744 152362 146394 141454 137132 133303 130029 127248 124801
65610 124801 122644 120775 119054 117422 116173 115592 115401 115028 114478 114343 114766 114986 114287 112995 112050 111842 111945
65593 111945 111864 111629 111601 112009 112746 113437 113747 113760 114019 115042 116824 118944 121019 122895 124524 126033 127952
65576 127952 131024 135521 140833 145931 150294 154382 159294 166061 175154 186441 199405 213345 227467
65563 227467 240929 252993 263273 271890 279244 285463 290020 292044 291087 287488 281987 275177 267451 259149
65549 259149 250361 240681 229587 217197 204439 192401 181732 172701 165432 159836 155470 151763 148364
65536 148364 145225 142497 140531 139793 140563 142628 145386 148213 150710 152674 153975 154445 153932 152522 150648
65521 150648 148743 146773 144315 141210 137883 134897 132413 130239 128193 126191 124184 122293 120881 120218
65507 120218 120175 120455 120991 121763 122382 122340 121772 121523 122168 123192 123447 122362 120508 119024 118668 119453 120933 122622
65489 122622 124119 125163 125878 126929 129088 132480 136456 140375 144327 148849 154099 159582 164566 168443
65475 168443 170722 171133 169969 168109 166450 165291 164236 162632 160073 156656 152834 149018 145296 141547
65461 141547 137727 133936 130364 127273 124926 123307 122051 120836 119710 118784 117831 116595 115377 114786 114887
65446 114887 115125 115258 115828 117362 119478 121218 122044 122237 122438 123063 124009 124763 124995 125190 126352 128855 131933
65429 131933 134687 137257 140463 144490 148523 151720 153980 155616 156643 156613 154981 151630 147261 143213 140492
65414 140492 138941 137639 136121 134765 134018 133794 133849 134172 134651 134797 134340 133833 134163 135513 137233 138657 139659
65397 139659 140455 141300 142496 144347 146937 150104 153686 157575 161517 165121 168138 170473 171882 172014 170978
65382 170978 169525 168337 167336 166040 164413 162929 161839 160892 159918 159211 159031 159036 158651 157856 157261 157442 158561
65365 158561 160568 163315 166296 168690 170055 170867 172151 174612 178275 182824 188033 193836 200188 206977
65351 206977 214060 221446 229368 237966 246688 254284 259757 263266 265766 267780 268891 268476 266486 263227
65337 263227 258742 252886 245957 238832 232332 226634 221372 216120 210658 204855 198591 191904 185125 178710
65323 178710 172963 168044 164191 161619 160039 158616 156777 154910 153869 153836 154140 154187 154031 153834 153293 152033
65307 152033 150230 148382 146676 144977 143318 141992 141272 141315 142185 143603 144829 145295 145285 145611 146685 148401
65291 148401 150808 154221 158513 162891 166649 169660 171921 173147 173221 172541 171501 170013 168031 166157 165108
65276 165108 164833 164697 164317 163641 162409 160357 157949 156128 155123 154143 152564 150827 149733 149392 149361 149421 149574
65259 149574 149488 148601 146862 144935 143517 142677 142022 141284 140608 140324 140474 140620 140227 139319 138532 138371 138567 138415
65241 138415 137628 136503 135342 134076 132612 131214 130285 129867 129589 129144 128671 128582 129028 129684 130132 130375 130746
65224 130746 131367 131990 132460 132928 133353 133163 131914 130129 128930 128839 129412 130150 131143 132501 133632 133694 132654
65207 132654 131451 131066 131720 133031 134574 136080 137221 137540 136789 135304 133885 133180 133198 133465 133569 133425 133137
65190 133137 132887 132921 133376 134019 134436 134567 134867 135824 137544 139895 142774 145999 149150 151794 153821 155400
65174 155400 156713 157887 159038 160197 161286 162271 163217 164051 164474 164321 163923 163878 164560 165974 168008 170619
65158 170619 173884 177960 182857 188246 193762 199579 206236 213634 220819 227316 234272 243495 255517 269362
65144 269362 284184 300306 318534 339185 362217 387672 415427 444755 474456 503273 530123
65133 530123 554389 576271 596501 615441 632768 648165 661707 673072 680857 683413 680255 672261
65121 672261 660666 646425 630393 613383 595637 576548 555142 530874 504047 475724 447265
65110 447265 419755 393714 369289 346578 325701 306762 289900 275262 262742 251881 242173 233343
65098 233343 225264 217833 211128 205375 200517 196048 191540 187087 182922 178920 174975 171602 169584 169037
65084 169037 169297 169713 170071 170264 170097 169618 169209 169116 169184 169157 168973 168627 168014 167091 165987 164927 164181 164007 164332
65065 164332 164599 164330 163774 163493 163332 162482 160774 159249 159003 159920 161031 161729 162069 162146 161852 161350 161274 162225
65047 162225 164254 166888 169519 171667 173001 173271 172420 170845 169328 168415 167889 167186 166259 165524 164866 163400
65031 163400 160541 156840 153260 150067 146989 144136 142000 140613 139378 137850 136225 134946 134243 134119 134356
65016 134356 134461 134049 133431 133405 134269 135418 136225 136906 138073 139625 140599 140270 139153 138680 139908 142615 145718
64999 145718 148493 151180 154292 157665 160602 162831 164754 166616 167973 168464 168694 169704 171573 173194 173643
64984 173643 173278 173117 173532 174128 174766 176000 178230 180933 183193 184718 185845 186653 186649 185447 183344 181006
64968 181006 178855 176929 175049 172921 170372 167688 165458 163801 162055 159618 156842 154614 153163 151797
64954 151797 149868 147525 145381 143793 142743 142176 142196 142909 144116 145134 145135 143977 142629 142390 143561 145162
64938 145162 146064 146049 145608 145116 144612 144209 144217 144791 145713 146657 147509 148303 148978 149394 149614 149960 150590 151097 150792 149468
64918 149468 147729 146461 146122 146600 147458 148139 148250 147990 148077 148885 149841 150120 149777 149708 150547 152173 154280 156788
64900 156788 159555 162282 165046 168424 172772 177787 183063 188613 194448 200119 205231 210120 215419 221042
64886 221042 226120 229966 232691 234855 236853 238699 240155 240974 241095 240630 239743 238699 237917 237500 236673 234279
64870 234279 230158 225523 221573 218315 215223 212425 210331 208576 206354 203666 201272 199398 197472 195238
64856 195238 193135 191248 188899 185735 182447 179801 177622 175327 172827 170230 167258 163768 160469 158216
64842 158216 156798 155204 153088 151241 150520 150912 151835 152840 153809 154783 155835 156937 157870 158390 158438 158069 157393
64825 157393 156834 157105 158410 159815 160096 159273 158752 159682 161715 163679 165136 166767 169366 172909 176707 180292
64809 180292 183966 188425 193905 199921 205916 211966 218564 225912 233742 241753 249806 257640 264715 270461
64795 270461 274427 276177 275347 271970 266564 259851 252530 245177 238014 230830 223508 216595 210876 206401
64781 206401 202485 198768 195658 193494 191945 190667 189963 190249 191328 192795 194770 197526 200701 203620 206360
64766 206360 209732 214221 219611 225748 232914 241130 249648 257589 264738 271334 277331 282300 286014 288866
64752 288866 291645 294937 298631 301946 304014 304532 303813 302332 300380 298108 295639 293071 290517 288054 285421
64737 285421 281884 276794 270320 263275 256224 249117 241908 234986 228720 223013 217731 213317 210418 208959
64723 208959 208009 206704 205038 203645 202982 202891 202917 202837 202749 202775 202952 203544 205143 208092 211968 215989 219875 223865
64705 223865 227869 231167 233139 233817 233437 231923 229193 225648 221888 218147 214400 210791 207535 204592 201857
64690 201857 199533 197869 196592 195086 193144 191107 189275 187688 186562 186435 187543 189419 191411 193436
64676 193436 195893 198971 202364 205699 209074 213031 218056 224190 231184 238883 247278 256162 264997 273260
64662 273260 280690 287058 291917 294864 295859 295036 292436 288228 282913 276841 269708 261142 251761 242996 235789
64647 235789 230055 225568 222611 221308 220935 220592 220276 220681 222168 224572 227943 232746 239157 246716 254981
64632 254981 264115 274462 285861 297797 310096 322998 336420 349520 361151 370520 377274 381198
64620 381198 382180 380349 375920 368931 359512 348406 336782 325300 313769 302049 290933 281693 274870
64607 274870 269946 266093 262839 260106 258048 256896 256621 256745 256774 256699 256677 256442 255635 254661 254367 254695 254418 252651
64589 252651 250000 247677 246042 244572 242843 240841 238609 236243 234077 232346 230810 229340 228621 229540 231931
64574 231931 234710 237364 240468 244417 248427 251390 253242 254798 256472 257777 258106 257451 256121 254094 250945
64559 250945 246342 240475 233956 227376 220983 214767 208815 203474 199107 195653 192548 189194 185639 182717
64545 182717 181347 181668 182932 184280 185421 186590 188110 190087 192301 194193 195266 195719 196429 197944 199690
64530 199690 200596 200343 199507 198532 197144 194975 192286 189760 187851 186573 185761 185301 185247 185821 187077 188495
64514 188495 189242 189056 188647 188974 190302 192212 194280 196366 198430 200552 203131 206619 210957 215625 220360
64499 220360 225422 230977 236666 242226 248207 255505 264206 273431 282357 290841 298811 305582 310253 312502
64485 312502 312580 310787 307477 303341 299041 294485 289053 282696 276269 270610 265768 261434 257600 254377 251549
64470 251549 248753 245810 242550 238700 234438 230700 228302 226951 225698 224231 223116 222888 223566 225086 227491
64455 227491 230500 233462 236029 238484 241158 243901 246333 248274 249773 250997 252266 253908 255961 258319
64441 258319 261155 264803 269150 273651 278120 282989 288673 295167 302566 311366 321851 333675 346549
64428 346549 361040 378235 398865 423159 451220 483184 519327 560368 607321 660603 719784
64417 719784 784815 857021 937946 1027153 1121714 1217624 1311120 1399079 1479534 1552247 1617819
64406 1617819 1675514 1722419 1755144 1771842 1772202 1756304 1724650 1679272 1623697 1561110 1492634 1417613
64394 1417613 1335497 1247367 1156010 1064925 977261 895185 819656 750568 687317 629567 577595
64383 577595 531964 492947 460250 433094 410444 391283 374875 360762 348545 337833 328460 320436
64371 320436 313537 307205 301096 295427 290437 285706 280410 274165 267325 260608 254731 250163 246742 243654
64357 243654 240277 236904 234216 232256 230562 229234 229000 230121 232012 234229 237075 240846 245183 249757
64343 249757 254959 261270 268357 275416 281999 287860 292383 295025 296140 296525 296189 294405 291164 287731 285409
64328 285409 284307 283741 283329 283225 283632 284564 285921 287356 288176 287733 285966 283349 280354 277123 273581 269659
64312 269659 265426 261221 257601 254960 253146 251600 249855 247766 245299 242327 238797 234978 231384 228356
64298 228356 225708 222785 218951 214178 209182 204934 201973 200207 199297 199064 199511 200652 202458 204864 207710
64283 207710 210812 214256 218459 223664 229439 234996 240011 244803 249721 254784 260088 266024 272686 279361
64269 279361 285184 290167 295079 300342 305517 309932 313382 316070 318168 319592 319983 318882 316266 312943
64255 312943 310082 308285 307444 307400 308134 309183 309556 308601 306404 302958 297634 290120 281399 272911 265034 257227
64239 257227 249515 242891 238101 234869 232589 231075 230254 229723 229158 228786 228968 229588 230195 230564 230740 230718 230436
64222 230436 229964 229446 228915 228406 228112 228225 228672 229222 229714 230021 229920 229218 227911 226079 223748 221077 218471
64205 218471 216230 214190 212063 210116 209173 209818 211735 213882 215261 215557 215228 215073 215628 216980 219100 222192
64189 222192 226501 231927 238060 244671 252027 260681 271010 282909 295869 309349 323039 336632 349318
64176 349318 359739 366657 369529 368400 363507 355283 344549 332329 319503 306769 294719 283630
64164 283630 273353 263812 255471 248856 243727 239329 235457 232618 230916 229449 227334 224905 223288 222983
64150 222983 223387 223603 223271 222576 221927 221826 222798 225162 228821 233308 238037 242592 246819 250610 253646 255560
64134 255560 256421 256797 257181 257553 257586 257055 255842 253889 251480 249376 248252 248072 248323 248692 249128 249448 249474 249681
64116 249681 251205 254970 260992 268535 276626 284466 291868 299523 308425 318815 330025 341512 353546
64103 353546 366421 379330 390498 398403 402654 403929 403512 402770 402745 404149 407694 413988 422707 432239
64089 432239 440763 447620 453199 457685 460542 461186 459418 454975 447376 436733 424281 411589 399431
64076 399431 387738 376372 365437 354988 344913 335211 326106 317862 310662 304637 299816 296109 293476
64063 293476 291936 291246 290872 290631 291104 292850 295282 296993 297328 297041 297204 298130 299791 302621 307098 312744
64047 312744 318384 323450 328498 334370 341444 349849 359702 370717 382035 393003 403899 415424 427652
64034 427652 439918 451632 462650 472828 481729 488904 494049 496715 496317 492845 487208 480414 472601
64021 472601 463451 453572 444825 438938 436122 435371 435752 436823 437897 437658 434980 429830 422997 415081 406184
64006 406184 396500 386700 377569 369601 363118 358413 355414 353468 351816 350164 348534 346760 344639 342476
63992 342476 340954 340370 340489 341328 343576 347789 353473 359391 364682 369393 374017 378890 384043 389414 395165
63977 395165 401854 410081 419766 430023 440119 450412 461850 474615 487834 500772 513811 527900
63965 527900 543482 560470 579016 599649 622525 647035 672549 699424 729011 762687 801035
63954 801035 843988 891578 944473 1003999 1071932 1150256 1240868 1345385 1465397 1602853 1759864
63943 1759864 1937771 2136553 2355305 2593104 2848940 3120858 3405631 3699477 3998797
63934 3998797 4299890 4597965 4886552 5157871 5403911 5617545 5793085 5926233 6014040 6055291
63924 6055291 6050663 6001785 5909912 5775865 5601508 5390912 5149929 4885067 4603150 4311446
63914 4311446 4017077 3725883 3442053 3168769 2908866 2664866 2438861 2232540 2047015
63905 2047015 1882412 1737823 1611735 1502355 1407537 1324906 1252403 1188647 1132638 1083300
63895 1083300 1039500 1000307 964982 932815 903181 875659 849938 825660 802499 780254 758767
63884 758767 737861 717566 698211 680117 663378 648245 635485 625840 619151 614544 611640 611075 613573
63871 613573 618899 626181 634926 645220 657084 670194 684338 699633 716072 733111 749958 766133
63859 766133 781569 796236 809847 821893 831940 839903 845980 850211 852204 851493 848080 842403 834807
63846 834807 825386 814260 801556 787032 770322 751766 732454 712974 692621 670442 646686 622488
63834 622488 598356 573883 549012 524699 501956 480885 461083 442520 425537 410282 396600
63823 396600 384254 372904 362059 351408 341072 331338 322353 314231 307130 300923 295115 289433 284202
63810 284202 279730 275701 271761 268413 266580 266295 266477 266157 265340 264503 263848 263319 262848 262186 260856 258725
63794 258725 256392 254626 253537 252558 251098 248909 245972 242412 238588 234998 232007 229723 228042 226685
63780 226685 225245 223452 221469 219799 218789 218266 217732 216931 216198 216091 216687 217384 217553 217189 216714 216314 215873
63763 215873 215481 215455 215722 215674 215026 214390 214542 215356 216004 216108 216137 216574 217189 217431 217230 217112 217573 218574 219703
63744 219703 220674 221573 222588 223597 224225 224367 224499 225270 226878 229051 231564 234556 238248 242486 246664 250085
63728 250085 252458 254114 255701 257600 259716 261866 264184 266990 270429 274448 278943 283574 287602 290400
63714 290400 292236 294137 296715 299381 300906 300543 298483 295479 292337 289639 287605 286121 284950 283883
63700 283883 282722 281398 280261 279955 280736 282056 283133 283843 284748 286346 288650 291500 294780 298139 300875
63685 300875 302536 303495 304567 306077 307587 308577 309150 309857 310964 312085 312575 312174 311233 310367 309964 310065 310613
63668 310613 311655 313237 315235 317453 319864 322518 325186 327273 328299 328289 327506 325938 323348 319790 315696
63653 315696 311353 306635 301474 296251 291429 287019 282784 278842 275642 273373 271755 270481 269555 269172 269507
63638 269507 270606 272164 273508 274277 275164 277415 281406 286233 290979 295798 301234 306975 312002 315874 319339
63623 319339 323724 330062 338584 348577 358861 368910 379411 391365 404864 419341 434754 451661
63611 451661 470140 489534 509542 530793 554006 579261 606515 636141 668359 702536 737530
63600 737530 772246 805301 834599 857989 874299 883435 885913 882838 875911 866658 855760 843671
63588 843671 831547 820631 810727 800134 787229 771481 752833 731029 706127 679173 651817 625355
63576 625355 600387 577052 555388 535677 518587 504779 494246 486371 480659 477037 475349 475126 476151
63563 476151 478825 483568 490137 497830 506078 514563 523098 531767 540955 550885 561296 571924 583174
63550 583174 596054 611496 630006 651712 676460 703927 733924 766589 802194 840867 882392
63539 882392 925674 967934 1004861 1032286 1048076 1052513 1047438 1035518 1019903 1003541 988221 974379
63527 974379 961760 949953 938326 925896 911515 894051 872448 846005 814803 779801 742534
63516 742534 704768 668174 633834 601964 572339 545005 520360 498660 479798 463479 449256
63505 449256 436434 424455 413503 404275 396963 390867 385213 379950 375431 371650 368225 364944 361947
63492 361947 359418 357409 355973 355139 354711 354364 353996 353854 354141 354597 354697 354319 354047 354619 356133 358019 359871
63475 359871 361961 364736 368075 371416 374421 377017 378806 378989 377205 374101 370744 367621 364455 360873
63461 360873 356991 353305 350166 347438 344709 341870 339413 338012 337833 338469 339521 340968 342882 345116 347523
63446 347523 350381 354318 359704 366254 373252 380201 387272 395068 403973 413878 424628 436532 450202
63433 450202 465987 483828 503654 525611 549878 576373 604496 632824 659133 681287 698438
63422 698438 711385 721866 731806 743029 756967 774214 794636 818166 845270 876464 911681 950255
63410 950255 991136 1032646 1072253 1107093 1134943 1154722 1166302 1170071 1166626 1156799 1141976 1124265
63398 1124265 1105922 1088300 1071389 1054351 1036151 1015642 991586 963206 930758 895402 858538
63387 858538 821309 784452 748426 713776 681396 652215 626568 604209 584979 569002 556064
63376 556064 545406 536544 529846 525845 524360 524815 527109 531558 538139 546385 555959 566868 579167 592835
63362 592835 607915 624441 642405 662154 684521 710046 738221 768090 799468 832964 868948
63351 868948 907115 946943 987695 1027727 1064564 1096025 1120868 1138221 1147206 1147656 1140745 1128460
63339 1128460 1112726 1095308 1077907 1061547 1045967 1030082 1012915 993755 971710 945874 916150
63328 916150 883490 849153 814089 779193 745764 715201 688241 664785 644504 627309 613128
63317 613128 601666 592821 587028 584414 583381 580680 573465 561118 544871 526276 506639 487432 470131
63304 470131 455398 443032 432822 424786 418432 412593 406540 400813 396490 393883 392358 391135 389824
63291 389824 388297 386415 383952 380667 376504 371764 366921 362208 357519 352721 347852 343047 338573 334850
63277 334850 332043 329668 327122 324651 323163 322965 323338 323693 324380 325821 327531 328759 329633 330768 332017
63262 332017 332589 332434 332632 334111 336632 339421 342262 345501 349324 353546 358048 363016 368584 374448 380073
63247 380073 385375 391053 398016 406453 415707 425151 434901 445489 457145 469829 483838 499947 518790
63234 518790 540328 563903 588620 613688 638690 663736 689331 715976 743744 772046 799795
63223 799795 826057 850743 874558 898221 921958 945851 970287 995665 1021833 1048145 1073916
63212 1073916 1098462 1120733 1139311 1152858 1160509 1161932 1157211 1146614 1130380 1108861 1082918 1053761
63200 1053761 1022291 989057 955263 923178 894801 870328 848635 829128 812436 799470 790661
63189 790661 786228 786262 790238 797097 806252 817942 832336 848919 867201 887440 910054 934678 960320
63176 960320 986152 1011697 1036614 1060889 1084957 1109063 1132663 1155017 1176148 1196436 1215277
63165 1215277 1230884 1241619 1246961 1246903 1241044 1228746 1209837 1184678 1153814 1118049 1078720 1037309
63153 1037309 994679 951126 907321 864801 825150 788919 755715 725222 697691 673395 652096
63142 652096 633335 616904 602641 589999 578347 567741 558883 552126 546841 542073 537582 533877 531314
63129 531314 529537 527982 526699 526476 528057 531343 535421 539382 543053 546920 551547 557224 563991 571607
63115 571607 579406 586438 592023 596122 599159 601581 603637 605383 606742 607640 608217 608808 609614 610475 611103 611429
63099 611429 611645 611940 612313 612607 612631 612333 611938 611881 612512 613855 615663 617632 619510 621089 622207 622809 623040
63082 623040 623274 623926 625109 626574 628193 630385 633692 637868 641879 645142 648521 653643 661280 670724 680753
63067 680753 690870 701479 713207 726344 740957 757252 775610 796237 818993 843820 871281
63056 871281 902310 937217 975219 1015246 1057156 1101892 1150604 1203810 1261245 1321989 1384654
63045 1384654 1447927 1511260 1574862 1638842 1702609 1765388 1827076 1888224 1949266 2010200 2071029
63034 2071029 2131997 2193035 2253253 2311394 2366621 2418344 2465111 2504139 2532348 2547825 2550060
63023 2550060 2539017 2514421 2476163 2425046 2362823 2291623 2213613 2131247 2047492 1965480 1887837
63012 1887837 1816366 1752263 1696367 1649018 1609929 1578662 1555473 1541423 1537321 1542623 1555646 1574900
63000 1574900 1599926 1630817 1667237 1708183 1752507 1799308 1847764 1896817 1945349 1992746 2039195
62989 2039195 2085159 2130481 2174122 2214942 2252527 2286939 2317713 2343451 2362333 2372627 2372604 2360600
62977 2360600 2335743 2298509 2250188 2191890 2124427 2049054 1967855 1883199 1797049 1710951 1626393
62966 1626393 1544898 1467766 1395812 1329356 1268414 1212949 1162923 1118035 1077517 1040425 1006226
62955 1006226 974897 946298 919693 894167 869462 846048 824222 803479 783076 763006 743970
62944 743970 726261 709192 691965 674879 659187 645707 633950 622761 611515 600467 590104
62933 590104 580517 571536 563351 556730 552323 549689 547347 544124 540367 537448 536123 535825 535585 535116 534689
62918 534689 534413 534072 533425 532272 530363 527611 524318 520903 517493 514000 510433 506819 503009 498922 494831
62903 494831 491020 487276 483216 479048 475495 472874 470788 468840 467131 465790 464486 462845 461048 459608
62889 459608 458738 458276 458039 457885 457511 456691 455730 455359 455960 457104 457979 458119 457619 456826 456078 455661 455710 456003 456035
62870 456035 455518 454741 454208 453916 453303 452044 450612 449765 449651 449740 449567 449190 448939 449070 449765 451102 452784 454133
62852 454133 454611 454337 453954 454081 454914 456232 457621 458727 459374 459519 459227 458757 458445 458213 457378 455414 452933
62835 452933 451339 451354 452295 453046 453214 452976 452320 451215 450310 450686 452692 455557 458322 460734 462997 465083
62819 465083 466756 468113 469726 472140 475393 479085 482801 486473 490350 494675 499406 504257 508916 513209
62805 513209 517177 521178 525812 531530 538300 545812 554037 563408 574389 587034 601010 615917 631517
62792 631517 647814 664983 683176 702418 722985 745994 773202 805811 843564 885382 930937
62781 930937 981268 1037816 1101267 1171559 1248566 1332266 1422260 1517587 1617118 1719742 1823935
62770 1823935 1927460 2027803 2122759 2210229 2287527 2351321 2398550 2427372 2437243 2428394 2401482
62759 2401482 2357719 2299032 2227837 2146576 2057442 1962529 1864087 1764409 1665478 1568852 1475826
62748 1475826 1387370 1303863 1225330 1152255 1085736 1026291 972838 923572 877854 836529 800339
62737 800339 768769 740748 715701 693364 673211 654802 638386 624456 612883 603052 594645 587704
62725 587704 582016 577130 572973 569904 568149 567717 568857 571988 577085 583675 591516 600710 611113 622364
62711 622364 634766 649441 667245 688072 711599 738107 768099 801696 839029 880827 927941
62700 927941 980561 1038521 1102124 1172028 1248459 1331111 1419653 1513602 1611662 1711791 1812040
62689 1812040 1910846 2006439 2096423 2178050 2248521 2305043 2345235 2367758 2372243 2358526 2326450
62678 2326450 2276584 2210717 2131432 2041557 1944171 1842544 1739527 1637116 1536808 1440157
62668 1440157 1348719 1263621 1185334 1113608 1047582 986391 930018 879212 834302 794384 758046
62657 758046 724586 694135 666885 642756 621609 603239 587115 572594 559445 547774 537365
62646 537365 527493 517505 507324 497300 487832 479246 471746 465309 459729 454893 450886 447831 445845 445134
62632 445134 445845 447614 449420 450180 449602 448392 447539 447267 446716 444864 441811 438923 437534 437757 438764 439899
62616 439899 441045 442230 443591 445749 449478 454746 460599 466307 472199 479018 486955 495864 506018 517967
62602 517967 531623 546131 560909 576540 594469 615890 640984 669079 699506 732407 768662
62591 768662 809017 853377 900980 950941 1002303 1053731 1103527 1149950 1191304 1225874 1252196
62580 1252196 1269460 1277378 1275716 1264409 1244209 1216711 1183454 1145285 1102839 1057276 1010099 962508
62568 962508 915363 869646 826386 786007 748213 712734 679938 650440 624378 601301 580638
62557 580638 562053 545455 530978 518895 509315 501890 495983 491096 486887 482827 478296 473289 468731
62544 468731 465711 464510 464631 465623 467361 469488 471144 471709 471608 471957 473374 475408 477244 478746 480594
62529 480594 483455 487281 491541 496056 501382 508311 517222 528059 540791 555604 572758 592578 615674
62516 615674 642762 674046 709020 747136 788508 833684 882853 935606 991378 1049648 1109476
62505 1109476 1169115 1226382 1279400 1326833 1367496 1400004 1423020 1435896 1438969 1433220 1419681 1399230
62493 1399230 1372844 1341889 1308115 1273475 1239980 1209555 1183851 1164124 1151260 1145770 1147757 1157029
62481 1157029 1173369 1196677 1226774 1263203 1305230 1351910 1402019 1454061 1506464 1557570 1605169
62470 1605169 1646173 1677282 1696427 1703683 1700592 1688407 1666872 1634643 1590844 1536174 1472719 1403130
62458 1403130 1330182 1256552 1184198 1113832 1045620 980574 920698 867432 820548 779128 743127
62447 743127 713228 689446 670705 655831 644199 635266 628204 622448 618204 615978 615812 617218 619601
62434 619601 622469 625427 628268 631057 633917 636683 638740 639145 637058 632307 625484 617278 607794 596876
62420 596876 584949 572972 561434 549993 538379 527165 517211 508676 501018 493718 486588 479538 472500
62407 472500 465580 458990 452833 447187 442284 438351 435301 432768 430427 428155 426006 424239 423232 423168 423889
62392 423889 425209 427211 430007 433368 436795 439866 442344 444155 445563 447243 449838 453435 457597 461834
62378 461834 465958 470293 475713 483111 492392 502267 511531 520340 529749 540226 551328 562767 574962
62365 574962 588369 603045 619306 638191 660634 686451 714668 744791 777358 813376 853589
62354 853589 898314 947650 1001679 1060376 1123164 1188413 1253541 1315734 1372514 1421661 1461048
62343 1461048 1489055 1505193 1510153 1505326 1492407 1473114 1448674 1419370 1384897 1345410 1302164 1257000
62331 1257000 1211345 1165864 1121026 1077784 1037546 1001449 969676 941532 916223 893521 873581
62320 873581 856112 839931 823524 806026 787481 768191 748127 727181 705682 684258 663302
62309 663302 642985 623719 606052 589974 574866 560495 547547 536750 527866 520146 513470 508291
62297 508291 504538 501407 498381 495794 494077 492981 491945 490891 490285 490642 492202 494844 498127 501599 505244
62282 505244 509319 513689 517783 521392 525050 529278 533907 538669 544013 550678 558661 567233 575919 584901
62268 584901 594510 604917 616400 629343 643814 659616 677059 697256 721291 749337 780877 815651
62256 815651 854143 897188 945280 998231 1055450 1116560 1181578 1250179 1320687 1390093 1455180
62245 1455180 1513440 1562940 1601855 1628757 1643317 1646405 1639319 1623012 1597968 1564512 1523086 1474293
62233 1474293 1418838 1357595 1291859 1223510 1154787 1087765 1024049 964903 911321 863713 821664
62222 821664 784320 751148 722142 697260 675853 656882 639665 624259 611032 599980 590556 582171
62210 582171 574694 568391 563465 559712 556569 553395 549825 546075 542963 541448 542012 544437 548109 552396
62196 552396 556756 560874 564907 569502 575302 582424 590484 599025 607676 616020 623695 630863 638363 647138
62182 647138 657497 669000 680951 692831 704374 715478 726133 736284 745727 754281 762070 769503
62170 769503 776958 784790 793795 805382 820923 840971 865369 894040 927266 965132 1007011 1051858
62158 1051858 1098746 1146827 1194748 1240298 1280708 1313383 1336631 1349983 1354024 1349979 1339432 1324079
62146 1324079 1305190 1282980 1256709 1225776 1190742 1153213 1114866 1076802 1039723 1004384 971668
62135 971668 942404 917267 896725 880862 869172 860660 854361 849783 846738 844718 842769 840280 837703
62122 837703 836035 835563 835619 835681 836217 838109 841657 846575 852549 859116 865083 868726 868845 865442 859444 852140
62106 852140 844834 838483 833385 829229 825380 820907 814642 805863 795057 783633 772838 763309 755576
62093 755576 750218 747209 745721 745049 745336 747003 749884 753408 757336 761767 766608 771649 777141 783830 792276
62078 792276 802363 813550 825496 838450 853133 870100 889103 909271 930037 951539 973942
62067 973942 996819 1019588 1042201 1064894 1087690 1110796 1135250 1162278 1191962 1223241 1255260
62056 1255260 1287876 1320495 1351152 1377262 1396890 1408986 1413048 1409344 1399250 1384582 1366352 1344361
62044 1344361 1317918 1286677 1250815 1210839 1167417 1121350 1073634 1025518 978331 933118 890486
62033 890486 850810 814402 781364 751489 724468 700108 678230 658557 640837 624937 610684
62022 610684 597750 585818 574673 564040 553652 543623 534457 526357 518770 510989 503012 495479 488865
62009 488865 483066 477699 472485 467470 463209 460628 460299 461859 464468 467797 472142 477598 483570 489271
61995 489271 494362 499006 503581 508372 513210 517341 520027 521338 521955 522104 521199 518681 514627 509175 501966
61980 501966 492819 482634 472916 464442 456909 449840 443199 437037 431141 425399 420145 415760 412116 408720
61966 408720 405369 402331 399844 397664 395324 392790 390643 389503 389405 389872 390464 390997 391301 391193 390823 390672
61950 390672 390944 391307 391589 392447 394801 398716 403321 407875 412538 418005 424794 433017 442474 452746 463406
61935 463406 474314 485608 497373 509539 522094 535022 547936 560117 571072 580839 589606 597354
61923 597354 604040 609741 614366 617523 618976 618857 617167 613453 607549 600411 593626 588132 583948 581023
61909 581023 579791 580740 584000 589552 597392 607205 618305 630189 642809 655927 668466 678948 686519
61896 686519 691252 693559 693642 691530 687302 681115 673242 664205 654793 645792 637656 630390 623724 617437 611612
61881 611612 606499 602058 597635 592226 585182 576650 567317 557759 548001 537700 526722 515498 504808
61868 504808 495294 487217 480618 475526 471957 469814 468796 468474 468570 469340 471558 475822 481836 488665 495826
61853 495826 503865 513717 525726 539555 554826 571479 589556 608984 629647 651364 673616 695474
61841 695474 715999 734653 751214 765369 776584 784410 788781 789882 787803 782537 774435 764551 754326
61828 754326 744958 737140 731307 727875 727190 729380 734316 741541 750260 759616 769043 778120 786078 791801
61814 791801 794432 793641 789194 780769 768556 753638 737262 719943 701719 683013 664653 647232
61802 647232 631041 616569 604370 594384 585924 578383 571305 563752 554554 543711 532870 523795 516712
61789 516712 510613 504709 498927 493329 487864 482704 478246 474662 471777 469366 467158 464680 461585 458189
61775 458189 455292 453351 452123 451139 450204 449417 449046 449431 450700 452478 454208 455779 457578 459884 462573
61760 462573 465458 468533 471805 475271 479276 484431 490866 497843 504455 510461 516105 521307 525485 528146
61746 528146 529310 529268 528170 525887 522130 516655 509633 501871 494487 488133 482632 477517 472813 469016 466254
61731 466254 463891 461292 458797 457418 457471 458067 458239 458137 458619 459973 461661 463193 464596 465991 467430 469296
61715 469296 472187 475993 479630 482221 484119 486179 488362 489768 489918 489261 488306 486939 484927 482575 480344
61700 480344 478089 475172 471353 467140 463148 459441 455734 451949 448233 444530 440635 436782 433715 431812
61686 431812 430450 428610 425904 422555 418670 414289 410151 407524 406782 406702 405717 403539 401048 398944 397155
61671 397155 395450 393954 392910 392325 392013 391715 391042 389568 387180 384344 381964 380912 381423 382885 384448
61656 384448 385969 388105 391266 394863 398006 400611 403335 406557 410023 413420 416741 419931 422633 424468
61642 424468 425297 425179 424359 423375 422851 423080 423978 425362 427000 428484 429461 429947 430065 429634 428530 427353 427013
61625 427013 427521 427821 427065 425527 423984 422738 421563 420108 417954 414682 410329 405524 400890 396591 392658
61610 392658 389260 386389 383701 380979 378236 375038 370401 364036 357171 351392 347009 343301 339936 337203
61596 337203 334979 332576 329793 327254 325364 323563 321067 317860 314644 312060 310143 308291 305753 302518
61582 302518 299679 298386 298397 298270 297135 295572 294415 293424 291814 289644 287934 287468 288060 288992 289742 290182
61566 290182 290393 290451 290352 290105 289927 290219 291257 292968 295002 296862 298015 298245 298076 298494 299977 301994 303650
61549 303650 304589 305027 305238 305388 305730 306529 307789 309290 310852 312373 313722 314836 315820 316749 317482 317876 318055
61532 318055 318250 318567 319122 320115 321431 322394 322423 321792 321240 320915 320311 319254 318286 317814 317454 316548 314932 312934
61514 312934 311012 309741 309702 310827 312101 312405 311637 310612 310002 309784 309682 309680 309924 310417 310952 311299 311440 311742
61496 311742 312731 314475 316271 317306 317570 317801 318555 319694 320811 321760 322579 323281 323968 324906 326186 327519
61480 327519 328600 329557 330822 332647 334979 337631 340416 343195 346003 348979 351969 354327 355379 355026 353701
61465 353701 351882 349892 348086 346780 345912 345031 343746 342050 340230 338670 337683 337238 336821 335903 334678 334049
61449 334049 334766 336775 339501 342435 345227 347546 349254 350653 352320 354649 357605 360715 363203 364396
61435 364396 364325 363853 363971 365020 366713 368664 370606 372202 373107 373292 373081 372751 372262 371400 370060 368432 367060
61418 367060 366586 367216 368492 369772 370834 371687 371957 371037 369021 367009 366103 366361 366982 367290 367210 366895 366313
61401 366313 365267 363647 361613 359595 358016 356904 355880 354711 353736 353472 353867 354294 354344 354283 354517 354872 354763
61384 354763 354006 353176 353115 354282 356647 359899 363593 367200 370289 372736 374752 376792 379395 382788 386439
61369 386439 389293 390884 392077 394150 397156 399799 401139 401722 402557 403556 403781 402945 401832 401206 401131 401547
61353 401547 402740 404824 407372 410186 414099 420286 428810 438327 447257 454898 461311 466596 470652 473546
61339 473546 475773 477939 480283 482722 485338 488527 492448 496577 500156 502929 505025 506253 506163 504904 503355
61324 503355 502036 500489 498220 495760 494026 492969 491693 489912 488514 488460 489801 492124 495419 500006 505887
61309 505887 512672 520073 528099 536823 546269 556570 567983 580570 593903 607174 619576 630525
61297 630525 639523 645896 648915 648370 644941 639806 633800 627010 619106 609963 600013 590196 581486 574181
61283 574181 567556 560481 552590 544696 537981 532875 528889 525379 522275 520055 519200 519788 521583 524360 527926
61268 527926 531816 535288 537988 540497 543833 548316 553244 557757 561673 565288 568807 572414 576605 581832
61254 581832 587732 593153 597231 600147 602603 604751 606047 606203 605927 606358 607826 609470 610253 610062 609505 608812
61238 608812 607485 605177 602470 600387 599349 598951 598626 598124 597351 596234 595034 594591 595919 599378 604315
61223 604315 609624 614724 619956 625916 632505 638869 644257 648615 652251 655347 658178 661452 665868 671348
61209 671348 677091 682439 687286 691679 695482 698611 701185 703243 704658 705589 706737 708883 712341 717089
61195 717089 723183 730671 739263 748509 758298 768844 780034 791031 800707 808445 814372 818771 821373
61182 821373 821471 818955 815036 811511 809205 807411 805022 801773 798098 794099 789254 783081 775687 767589 759299
61167 759299 751200 743548 736375 729463 722441 714917 706616 697521 687869 677907 667796 657763 648122 638970
61153 638970 630101 621482 613593 606935 601465 596974 593809 592583 593125 594356 595311 595686 595157 592864 588203
61138 588203 581736 574691 567732 560765 553895 547877 543359 540046 537063 534125 532122 532454 535772 541398
61124 541398 547984 554718 561858 570250 580500 592608 606151 620612 635639 651160 667425 684908
61112 684908 704118 725271 747979 771335 794439 816845 838463 859235 879137 898301 916799
61101 916799 934380 950649 965300 977791 986993 991810 992219 989165 983312 974503 962657 948568 933349
61088 933349 917464 900799 883342 865389 847244 829142 811334 793960 776938 760187 743852
61077 743852 728207 713581 700421 689076 679324 670521 662424 655538 650387 646885 644605 643216 642345
61064 642345 641582 641056 641522 643401 646208 649406 653291 658427 664676 671502 678840 686994 696056 706137 717733
61049 717733 730996 745020 758868 773166 789672 809226 831043 854023 877797 902335 927493
61038 927493 953377 980503 1009205 1039331 1070699 1103470 1137986 1174629 1213720 1255146 1298263
61027 1298263 1342702 1388984 1437725 1488588 1540778 1594120 1648712 1704060 1760017 1818473 1882731
61016 1882731 1955142 2036659 2128545 2232791 2350581 2482166 2629259 2796675 2991545 3222363
61006 3222363 3498924 3831517 4229991 4705669 5274281 5954482 6763361 7717024 8836159
60997 8836159 10145518 11664176 13398100 15336453 17429508 19541123 21425439 22795192
60989 22795192 23469925 23490708 23096585 22586545 22191898 22039043 22160834 22480418 22780506
60980 22780506 22745114 22102196 20771897 18897754 16745727 14569532 12538871 10740259
60972 10740259 9203092 7919247 6858451 5984508 5265390 4673619 4184507 3777721 3438281
60963 3438281 3153901 2912730 2704694 2523002 2362810 2219598 2089911 1972245 1865852
60954 1865852 1769444 1681848 1602850 1532435 1469921 1414389 1364964 1319977 1276931 1234193 1192005
60943 1192005 1151178 1111795 1073918 1038511 1006503 977516 950460 924881 900942 878491 856929
60932 856929 835707 814523 793501 773538 755709 739861 724610 709286 694941 682638 671712
60921 671712 660830 650004 640308 632065 624566 617354 610655 604550 598744 593233 588360 584151 580206 576372
60907 576372 572924 570080 567827 566185 565157 564493 563929 563540 563507 563677 563783 563831 563833 563486 562627 561708 561203 560764
60889 560764 559625 557665 555478 553484 551527 549236 546173 541715 535431 527685 519446 511502 504211 497799
60875 497799 492316 487279 481946 476116 470392 465651 462397 460425 458788 456319 452610 448427 444924 442676
60861 442676 441730 442106 443675 445871 448120 450412 452958 455566 457879 459963 462015 463797 465050 466281 468235
60846 468235 470701 472646 473592 474059 474523 474710 474207 473182 472128 471283 470466 469149 466660 462748 458047 453595
60830 453595 449828 446432 443057 439697 436492 433762 432225 432397 433700 434828 435168 435197 435297 434994 433716 431589
60814 431589 428946 425663 421655 417554 414174 411459 408596 405150 401496 398073 394673 390809 386590 382900
60800 382900 380509 379123 377546 374869 371285 367644 364541 362179 360756 360338 360365 359925 358764 357622 357342
60785 357342 357874 358371 358059 356919 355640 354961 354932 354922 354474 353920 353861 354293 354763 355217 356081 357483 358994 360348
60767 360348 361880 364021 366719 369610 372455 375176 377725 380114 382403 384519 386180 387061 387000 386199 385363
60752 385363 385301 386012 386457 385729 384256 383264 383272 383801 384426 385255 386232 386817 386658 385939 384802 383044 380646 377955
60734 377955 374973 371126 366170 360854 356190 352468 349354 346565 344015 341617 339352 337348 335691 334395
60720 334395 333684 333807 334393 334473 333482 331822 330196 328835 327668 326737 326100 325778 326114 327564 329818 331727 332640
60703 332640 333213 334343 335914 337340 338805 340997 343813 346245 347548 347877 347817 347922 348686 350373 352723 355178
60687 355178 357354 359028 359955 360226 360578 361718 363420 364883 365895 367049 368829 371087 373497 375852 377778
60672 377778 378746 378669 378107 377684 377617 377851 378212 378229 377246 374991 371830 368309 364737 361353 358510 356377 354712
60655 354712 353220 352058 351725 352453 353841 355120 355785 356009 356479 357802 360126 363248 366826 370276 372736
60640 372736 373521 372694 370977 369065 367172 365147 362798 360067 357186 354695 353167 352779 353135 353525 353376 352632
60624 352632 351730 351076 350567 349872 349161 349071 349773 350629 351176 351901 353397 355098 355719 354924 353763 353351 353715 354192
60606 354192 354337 354100 353597 353094 352947 353243 353739 354292 355028 355864 356310 356095 355687 355809 356636 357846 359165 360445
60588 360445 361376 361737 361923 362679 364156 365706 366790 367629 368649 369737 370598 371527 373183 375598 378100 380467
60572 380467 383545 388274 394457 401064 407619 414798 423614 434382 446525 459044 471079 482251 492541
60559 492541 501682 508765 512753 513397 511345 507390 501961 495385 488228 481200 475027 470414 467825 467217 468326
60544 468326 471222 476131 482759 490443 499154 509675 522423 536722 551709 567398 584293 602391
60532 602391 621198 640241 658745 674977 686814 693141 694313 691274 684816 675669 664702 652675
60520 652675 640093 627439 615305 604169 594225 585467 577905 571683 567043 564013 562126 560777 560040
60507 560040 560784 563738 568824 575735 584717 596266 610426 627071 646725 670403 698603 730900 766604
60494 766604 805424 847390 892352 939456 986904 1032501 1074712 1113012 1146965 1175470 1197287
60483 1197287 1211742 1218239 1215614 1202819 1180016 1148211 1108210 1060939 1008566 954095 899730 846569
60471 846569 795857 749311 707801 670770 637455 607864 582153 559946 540812 524620 510820
60460 510820 498168 485877 474533 465195 458049 452409 447488 442551 436925 430672 424971 421084 419080
60447 419080 418037 417175 416161 414621 412136 408793 405245 402168 399910 398495 397598 396642 395297 393796 392537
60432 392537 391535 390517 389354 388147 387094 386462 386373 386448 386052 385165 384468 384232 383716 382310 380794 380648 382298
60415 382298 384763 386959 388704 390446 392572 395107 397691 399783 401122 401929 402522 403007 403648 405067 407532
60400 407532 410345 412559 414107 415652 417549 419644 421889 424402 426950 429152 431241 433907 437308 440927
60386 440927 444499 448300 452328 455994 458977 461650 464195 465949 466338 466077 466769 469365 473352 477388 480511
60371 480511 482885 485569 489430 494242 499062 503384 507385 510963 513357 514169 514180 514560 515654 517116 518808
60356 518808 520833 522965 524958 527439 531653 538026 545546 552897 559757 566673 574025 581543 588648 594868
60342 594868 599889 603431 605220 605160 603565 601101 598219 594732 590213 584852 579551 575056 571330 567929 564509
60327 564509 560633 555506 548601 540483 532402 524973 517755 510286 503018 496877 492329 489363 488059 488547
60313 488547 490468 493141 496490 501273 508035 516194 524674 533305 543156 555451 570533 587935 606995
60300 606995 626960 646615 664170 677689 685665 687386 682991 673215 658878 640629 619321 596572
60288 596572 574599 555271 539352 526715 517026 509996 505133 501696 499047 496929 495380 494484 494173 494111
60274 494111 493736 492635 490870 488832 486819 484889 482978 480837 477948 473961 469296 464883 461182 457852
60260 457852 454561 451611 449424 447871 446532 445232 443904 442305 440427 438854 438033 437416 436126 434400 433574
60245 433574 434462 436461 438491 440142 441571 442872 444090 445467 447194 449057 450679 451911 452766 453246 453516
60230 453516 453993 454976 456364 457964 459834 462084 464575 467152 469973 473245 476740 479890 482342 484227 486013
60215 486013 488316 491724 496497 502367 508745 515125 521276 527272 533475 540335 547962 555971 563876 571559
60201 571559 579254 587265 595766 604625 613246 620843 627176 632850 638670 644818 650819 656023 659837 661751
60187 661751 661672 660235 658400 656634 654737 652436 649765 646693 642724 637278 630474 623280 616713 610949 605325
60172 605325 599180 592534 585971 580156 575598 572528 570586 568806 566364 563345 560403 557761 555047 552089
60158 552089 549279 546959 545030 543431 542543 542742 543864 545343 546532 546812 545944 544619 544035 544538 545180 545106
60142 545106 544746 545048 546079 547173 548101 549218 550698 552500 555047 559040 564408 570110 575208 579609 583635
60127 583635 587440 591072 594644 598160 601535 604896 608507 612269 615679 618544 621428 625152 630007 635577
60113 635577 641245 646794 652588 659063 665948 672188 676880 680026 682152 683490 683979 683724 682807 680873 677584
60098 677584 673344 668891 664276 659140 653991 650104 647754 645517 642004 637603 633785 631177 629137 626954
60084 626954 624695 622831 621544 620429 618633 615417 610912 606168 602128 598748 595453 592164 589275 586707
60070 586707 583650 579432 574166 568354 562267 556096 550358 545556 541419 536944 531471 525517 520234 516122
60056 516122 512619 508994 505230 501776 498753 495907 493289 491434 490668 490649 490953 491849 494060 497736 502080
60041 502080 506171 509971 514230 519468 525376 531309 537061 542785 548333 553225 557360 561250 565213 568695
60027 568695 570823 571385 570801 569288 566629 562841 558542 554338 550059 544924 538418 530915 523343 516286 509464
60012 509464 502231 494488 486825 479761 473280 467251 461858 457228 453075 449208 446091 444305 443586 442914 441489
59997 441489 439238 436573 434213 433042 433470 434919 436477 437969 439779 441795 443388 444570 446306 449363
59983 449363 453452 457803 461991 465913 469560 473148 476903 480381 482539 482910 482193 481268 480106 478107 475080
59968 475080 471409 467644 464394 462218 461096 460203 458718 456661 454622 452978 451818 451290 451487 452119 452726
59953 452726 453095 453190 452945 452468 452176 452302 452543 452635 452963 454085 455840 457517 458817 460071 461535 462983 464048
59936 464048 464597 464746 464844 465383 466529 467767 468384 468258 467899 467909 468883 471602 476496 482782 488835 493887 498828
59919 498828 504900 511952 518539 523555 527165 530047 532278 533373 533219 532504 532088 532265 532879 533940 535654
59904 535654 537799 539551 540281 540317 540543 541326 542155 542379 542049 541856 542417 543779 545666 548010 551043 554879 559291
59887 559291 564072 569342 575220 581388 587404 593285 599225 604817 609198 612173 614607 617436 620769 624199
59873 624199 627380 629927 631331 631545 631175 630504 628739 624933 619378 613407 608014 603348 599316 595839 592538
59858 592538 589061 585923 584255 584350 585144 585614 586188 588261 592635 598983 606594 615046 624162 633801 643865
59843 643865 654093 663574 670704 674103 673706 670746 666678 662373 658494 656047 655804 657156 658128 656831 652603
59828 652603 645798 637159 627756 618846 611086 604139 597554 591747 587486 584657 582210 579308 575863 572003
59814 572003 567743 563441 559937 557774 556622 555736 554749 553711 552649 551448 550131 548923 548025 547436 547022
59799 547022 546675 546348 545946 545303 544352 543333 542658 542473 542487 542284 541692 540785 539738 538737 537795 536624 535026
59782 535026 533495 532920 533391 533768 532877 530798 528453 526348 524354 522476 521018 519989 519072 518319 518217 518917
59766 518917 519987 521164 522813 525265 528138 530756 533043 535605 538931 542745 546249 549081 552029 556514
59752 556514 563131 570971 578750 586346 594653 604083 613963 623468 632419 640853 648439 654809 659981 664077
59738 664077 666979 668700 669776 670803 671788 672386 672556 672452 671837 670203 667554 664541 661604 658445 654747
59723 654747 651083 648512 647239 646223 644382 641784 639209 636885 634373 631684 629677 628936 628901 628701 628419
59708 628419 628843 630251 632216 634495 637326 640752 644386 648126 652516 658017 664296 670491 675881 680146
59694 680146 683422 686359 689700 693525 697175 700181 702841 705544 707879 708960 708522 707269 706154 705583 705231
59679 705231 704362 702331 699069 695125 691124 687135 682679 677313 671119 664637 658440 652772 647581 642830
59665 642830 638683 635258 632320 629432 626472 623835 622031 621204 621097 621442 622343 624308 627831 632858 638723
59650 638723 644682 650440 656052 661551 666813 671625 675619 678256 679123 678160 675420 670824 664394 656495 647541
59635 647541 637728 627456 617685 609266 602087 595511 589523 584729 581236 578308 575314 572307 569463 566587
59621 566587 563492 560236 556633 552141 546696 541114 536093 531235 525620 519084 512443 506628 502050 498646
59607 498646 496129 494242 493060 492995 494263 496478 498939 501144 502888 504163 505211 506424 507894 509250 510137
59592 510137 510621 510905 510989 510941 511217 512255 513894 515483 516498 516800 516513 515961 515581 515569 515588 515046 513591 511222
59574 511222 508105 504505 500784 497235 493920 490753 487614 484411 481274 478708 477199 476560 476029 475153 474222
59559 474222 473657 473457 473520 473977 474788 475369 475122 474129 472971 472132 471994 473053 475575 479114 482851 486377 489913
59542 489913 493904 498738 504689 511840 520174 529955 541746 555845 572060 590286 610569 631730 650236
59529 650236 661487 662788 655135 642424 629289 619042 612530 608527 605592 603640 603498 605318 608117
59516 608117 610790 612791 613740 613135 610818 607155 602480 596700 589701 581713 573063 563965 554740 545854 537493
59501 537493 529493 521922 515343 510169 506070 502355 498744 495466 492812 490853 489475 488463 487670 487275 487672
59486 487672 488935 490575 492051 493371 494993 497293 500354 504120 508445 513037 517657 522382 527472 532842
59472 532842 537848 541722 544219 545757 546947 548033 548802 548993 548710 548407 548485 548934 549336 549300 548973 549060 550138
59455 550138 551966 553789 555411 557663 561542 567156 573799 580848 588113 595374 602101 607806 612404 616007
59441 616007 618489 619378 618131 614552 609083 602629 595955 589173 581956 574241 566628 560167 555798 553773
59427 553773 553404 553553 553629 554015 555363 557750 560957 565310 571617 580217 590687 602621 616147 631447
59413 631447 648283 666342 685653 706375 728550 752329 777683 802928 823702 834544 832337 818501
59401 818501 798085 777014 759694 748001 741728 740182 743676 752975 766641 779317 783911 776304 757951
59388 757951 733953 709126 686066 665858 649122 636019 626118 618949 614524 612984 613973 616671 620369
59375 620369 624731 629567 634565 639340 643705 647925 652614 658152 664154 669786 674745 679557 684714 689832
59361 689832 694079 697231 699842 702443 705047 707560 710298 713806 718263 723288 728329 733230 738429 744617
59347 744617 752196 761087 771048 782023 794058 806960 820172 833014 845048 856278 866999 877382
59335 877382 887103 895446 901766 905768 907462 907058 904866 901029 895346 887656 878415 868524 858497 848154
59321 848154 837268 826130 815303 805269 796470 789166 782852 776312 768840 761045 753926 747482 740913
59308 740913 733986 727382 721695 716775 712303 708464 705818 704896 706079 709444 714538 720683 727704 735948
59294 735948 745075 752943 756070 751533 738784 720014 698900 678628 660640 644908 631180 619775
59282 619775 611262 605613 601872 598788 595864 593768 593558 595512 598949 603203 608367 614831 622543 631211
59268 631211 641004 652459 665624 679637 693247 705537 716169 725179 732603 738177 741506 742534 741552
59255 741552 738539 732992 724917 715633 706861 699084 691457 683400 675518 668723 663165 658524 654863 652532
59241 652532 651396 650819 650523 651044 653001 656171 659627 662791 665954 669575 673471 677168 680839 685242 690591
59226 690591 696056 700571 703615 704944 704252 701671 698093 694318 690199 685267 679904 675062 670945 666739
59212 666739 661737 656094 650408 645185 640880 637820 635769 633930 631673 629031 626417 624150 622318 620784
59198 620784 619204 617277 615096 613088 611661 611041 611289 612161 613138 613936 614907 616586 619054 622100 625772 630247
59182 630247 635304 640520 645918 651851 658267 664582 670348 675509 680053 683904 687257 690518 693887 697343
59168 697343 700910 704469 707504 709685 711618 714336 718078 722157 725992 729536 732678 735035 736469 737054
59154 737054 736417 733866 729395 723833 717739 710829 702731 693566 683538 672708 661602 651288 642348
59141 642348 634316 626489 618688 610857 602637 593961 585508 577930 571038 564303 557855 552418 548443 545743
59127 545743 543792 542111 540526 539355 539165 540240 542513 546042 551105 557748 565718 574919 585384 596676
59113 596676 607905 618551 628758 638727 648439 658009 667531 676400 683686 689440 694651 699573 703141
59100 703141 704704 705261 706130 707240 707768 707707 707647 707416 706082 703273 699671 696292 693861 692698 692569 692791 692844
59083 692844 692690 692151 690554 687516 683511 679060 673923 667798 661205 654758 648131 640739 633091 626362 620840
59068 620840 615855 611075 606832 603115 599317 595139 590869 586590 581931 576853 571946 567695 564093 561132
59054 561132 558963 557268 555088 551729 547448 543051 539206 536329 534707 534363 534981 536079 537126 537624 537437
59039 537437 537018 536932 537182 537370 537401 537488 537521 537090 536375 536433 538193 541424 545032 548268 551455 555637 561642 569468
59021 569468 578480 588128 598344 609346 621380 634648 648963 663226 675765 685668 693434 699811
59009 699811 704412 706147 704802 701446 697317 693081 689218 686421 685183 685351 686428 688122 690447 693516
58995 693516 697392 701952 706713 710840 713455 714119 713172 711577 710198 709120 707824 705901 703318 700121 696485
58980 696485 693119 690921 689969 689454 688934 689034 690551 693606 698206 704873 713923 724660 736079 747970
58966 747970 760619 773884 787367 801039 814768 827634 838724 848366 857506 865941 872206 875336
58954 875336 875788 874442 871481 866538 859250 849403 837054 822784 807514 791999 776798 762436 749150
58941 749150 736703 725042 714869 706887 700712 695302 690212 685627 681422 677285 673677 671494 670560 669487
58927 669487 667412 664987 663290 662540 662287 662138 661827 661143 660206 659369 658581 657326 655417 653316 651496 650032
58911 650032 648970 648535 648746 649399 650619 652890 656374 660832 666342 673423 682183 692067 702779 714748
58897 714748 728261 742739 757430 772254 787407 802490 816608 829195 840512 851494 863354
58886 863354 876971 892363 908902 926027 943383 960223 975345 987994 998420 1007129 1013803 1017396
58874 1017396 1017241 1013924 1009012 1003855 998504 991917 983349 973244 962492 951322 939653 928148 917963
58861 917963 909382 901487 893337 884747 875818 866463 856716 846887 837087 827058 816633 805912 794917
58848 794917 783694 772801 763015 754383 746168 737916 729934 722485 715146 707274 698603 689273 679841 671343
58834 671343 664591 659199 653869 647853 641532 635563 630265 626003 623242 621828 620971 620341 620466 621790 624129
58819 624129 627363 631691 636762 641505 645489 649593 654578 659735 663781 666464 668400 669863 670708 671198 671946
58804 671946 672997 673592 672952 670937 668030 664883 661730 658071 653248 647452 641653 636350 630990 625034 618963
58789 618963 613713 609563 606183 603398 601333 600068 599696 600610 603350 608221 615208 623992 633897 644186
58775 644186 654598 665244 675864 685608 693601 699138 701223 698758 691673 681249 668980 655639 641791
58762 641791 628460 616636 606570 598059 590966 585067 579879 575156 571125 567878 565030 562368 560335
58749 560335 559373 559253 559458 559780 560171 560525 560956 561778 562947 564211 566092 569826 575804 582918 590070 597464
58733 597464 605613 613931 621349 627703 633497 638724 643031 646716 650507 654409 657651 659762 660964 661525
58719 661525 661444 660828 660042 659443 659337 660110 662028 665010 668844 673404 678432 683449 688156 692517 696187 698347
58703 698347 698448 696554 692654 686315 677494 666976 655406 642557 628256 613324 598760 584546 570172
58690 570172 555943 542879 531649 522418 515336 510238 506080 501674 497041 493261 490947 489477 487715
58677 487715 485013 481563 478296 476366 476288 477573 479437 481659 484592 488746 494600 502322 511282 520430 529625
58662 529625 540069 552894 567750 583090 597135 608042 613983 614086 609046 600325 589254 577238
58650 577238 565909 556162 547634 539822 533000 527238 521440 514543 507123 500688 495836 492127 489273 487310
58636 487310 485901 484650 483885 484192 485440 487140 489374 492257 494849 495818 495117 494002 493473 493640 494453 495972
58620 495972 497854 499404 500258 500531 500596 501214 503305 506771 510172 512542 514853 518495 522935 526390 528509
58605 528509 530732 533975 537449 540071 541796 543200 544733 546639 548764 550291 550466 549693 549129 549257 549662
58590 549662 550056 550564 551128 551651 552721 555239 559310 564375 570266 577210 585009 593333 602626 613462 624992
58575 624992 635299 643518 650538 657502 664677 671947 679376 687021 695105 704463 715900 729125 743298
58562 743298 758638 776381 797168 820572 846187 873918 903017 932063 960131 986853 1011148
58551 1011148 1031152 1045795 1055407 1060507 1061163 1057871 1051898 1044306 1035570 1026396 1017640 1008979 998805
58538 998805 986043 971074 954370 935408 913675 889804 864884 839361 813416 787886 764069
58527 764069 742910 724787 709678 697172 686674 677892 670795 665078 660131 655580 651375 647421 643669
58514 643669 640431 637898 635465 632324 628635 625360 623061 621656 621099 621305 621561 621068 620078 619541 619656 619764
58498 619764 619537 619195 618677 617796 617176 617837 619809 622287 625059 628495 632209 635276 637961 641760 647401 654142
58482 654142 661397 669718 679766 691575 705236 721032 738441 756170 773641 791335 809323 826622
58470 826622 842291 855918 866598 872672 873080 868095 858527 845407 830680 816831 805247 795917 788888
58457 788888 784747 783457 784164 786631 791575 799241 808929 820192 833018 846478 858797 869214 878146
58444 878146 884974 887427 884079 875948 864815 851481 836626 821904 808871 797797 788417 780873 775171
58431 775171 770839 767895 767097 768576 771312 774608 778877 784441 790888 798235 807269 817878 828452 837795
58417 837795 846269 854101 859936 862235 860937 856693 849527 839496 827772 816030 805322 796158 788798
58404 788798 782770 776979 770943 765189 760150 755763 752451 751179 752013 753830 755931 758679 762252 766193
58390 766193 770609 776186 782548 788217 792746 797178 801826 805477 807613 809558 812463 815872 819262 823324
58376 823324 828577 834242 839509 844615 849924 855405 861617 869504 878567 887101 894781 903018 912204 921015
58362 921015 929324 939255 952090 966460 980920 995910 1011715 1026923 1040652 1054011 1067573 1079527
58350 1079527 1088253 1094690 1100318 1104830 1107709 1110101 1113127 1116158 1118676 1122032 1127453 1134138 1141191 1149562
58336 1149562 1160186 1172053 1184040 1196823 1211135 1226109 1241147 1257353 1275192 1292943 1309492
58325 1309492 1326276 1344209 1361029 1374233 1384476 1393493 1400868 1405698 1409436 1414144 1419509 1424292 1429107
58312 1429107 1435242 1442376 1449978 1459190 1470825 1483282 1494936 1506794 1520409 1535292 1550796 1568264
58300 1568264 1588519 1609516 1629312 1649118 1670514 1692157 1712414 1732812 1755373 1778822 1801004
58289 1801004 1822886 1846601 1871654 1896716 1923071 1952505 1983822 2015188 2047818 2083486 2120553
58278 2120553 2156485 2192248 2230124 2269252 2307541 2346010 2386937 2429706 2472758 2517610 2566477
58267 2566477 2618000 2669833 2723360 2781159 2841963 2903022 2965354 3031570 3100554 3169655 3240180
58256 3240180 3315224 3393696 3471940 3549677 3629088 3709829 3790474 3873122 3961006 4053185 4147076
58245 4147076 4244282 4348390 4459250 4575222 4698560 4832303 4974264 5120728 5273678 5437691
58235 5437691 5612350 5794871 5987571 6195179 6417283 6651137 6899209 7166025 7450559
58226 7450559 7750250 8069409 8414687 8785581 9179085 9600405 10058761 10556069 11090902
58217 11090902 11670399 12306568 13004186 13764849 14599828 15525952 16552358 17685678 18945514
58208 18945514 20360844 21955931 23757008 25810605 28180320 30932652 34147369 37938756
58200 37938756 42446720 47812575 54186768 61755497 70738047 81372130 93935873 108771795
58192 108771795 126245869 146687937 170405110 197706861 228797519 263568253 301420470
58185 301420470 341007823 379686387 413043062 435487845 442321305 432106457 407434016
58178 407434016 373420599 335244729 296558430 259391778 224822692 193513586 165863693
58171 165863693 141989729 121732356 104730176 90531768 78693334 68818528 60555262
58164 60555262 53598474 47704571 42685470 38384457 34668767 31439268 28625308 26164470
58156 26164470 23997591 22079823 20379468 18864009 17499613 16263630 15143891 14125115
58148 14125115 13188346 12323953 11532495 10811167 10150234 9543466 8990817 8489045 8029583
58139 8029583 7607265 7221896 6869649 6541432 6231121 5937665 5658533 5389334 5130860
58130 5130860 4888632 4664189 4453771 4255989 4073431 3905950 3749596 3603179 3469048
58121 3469048 3346442 3230715 3120105 3017007 2921663 2830750 2743009 2660335 2582478 2506468
58111 2506468 2431944 2361425 2294756 2228894 2163689 2102239 2045073 1989617 1935803 1886267 1840384
58100 1840384 1794072 1746520 1701337 1659923 1619376 1578244 1538784 1502013 1465838 1429834 1396857
58089 1396857 1368170 1341596 1316052 1293360 1274048 1255898 1238171 1222818 1209891 1196076 1179442
58078 1179442 1161566 1143542 1124109 1103272 1083530 1065717 1047560 1028074 1009463 992960 976597
58067 976597 958984 941608 925584 909642 893193 877988 864927 852494 840014 829154 820520 812074
58055 812074 802629 793600 785498 776076 764012 751353 740221 729968 719639 710360 703088 696526 689363
58042 689363 682352 676304 670303 663670 657492 652541 647820 642661 637984 634021 629149 622500 615393 608657
58028 608657 600899 591113 580666 571041 561726 552023 542835 534956 527630 520379 514256 509748 505409 500223
58014 500223 495275 491563 488103 483887 479748 476580 473562 469855 466353 464053 462349 460528 459298 459125
58000 459125 458622 456409 453362 451439 451335 452491 454176 455446 455335 454214 453662 454150 454306 453254 451864 450823
57984 450823 449386 447193 445320 444172 442216 438231 433111 428088 422945 417495 413002 410413 408688 406531
57970 406531 404394 403255 402840 402576 402963 404415 405998 406846 407668 409452 411763 413649 415018 415892 415502 413488
57954 413488 410807 408241 405179 401013 396483 392434 388520 384329 380534 377778 375677 374048 373774 375331
57940 375331 377882 380899 385154 390873 396626 401431 406435 413048 420914 429183 438086 447578 455921 461521
57926 461521 464911 467203 467848 465780 461555 456504 450741 443728 435802 427484 418331 408237 398845 391821
57912 391821 386601 381538 376413 372131 368857 366271 364869 365225 366577 367787 368992 370767 372442 372907 372434
57897 372434 372105 372103 372079 372535 374283 377203 380900 385652 391215 395749 397785 398377 399496 401070 401618 401056 400627
57880 400627 400499 399623 397897 396440 395614 394410 391900 387930 382562 376266 370522 366769 364770 363124 361013
57865 361013 358292 354594 349996 346082 344600 345320 346758 348659 351999 356893 362352 368100 374826 382475
57851 382475 389970 396856 403709 410615 416627 421079 424273 426669 428414 429725 430674 430659 429121 426632 424134
57836 424134 421398 417535 412854 408723 405570 402433 398608 394480 390569 387011 384139 382429 381617 380902 380089
57821 380089 379585 379296 378666 377810 377468 377735 377876 377522 377079 376836 376548 375851 374288 371081 365807 359143 352012
57804 352012 344363 335810 327108 319682 313879 309027 305073 302738 302027 301940 301869 302090 302732 303360 303780 304203 304547
57787 304547 304588 304836 306190 308719 311827 315541 320421 326199 331779 336743 341687 346992 352468 358355 365328
57772 365328 373190 380688 387008 392382 396944 400100 401521 401813 401719 401345 400442 398778 396047 392083 387276
57757 387276 382172 376772 370907 364990 359549 354371 349191 344884 342635 342092 341688 340796 340201 340412 340947 341470
57741 341470 342207 342913 342809 341945 341375 341551 341778 341699 342029 343332 345239 347475 350543 354742 359442 363904 368031
57724 368031 371910 375503 379130 383245 387322 390032 391010 391449 392429 393657 394429 394836 395270 395567 395366 394724
57708 394724 393842 392690 391291 389735 387667 384550 380707 377253 374621 371972 368502 364593 361273 359225
57694 359225 358615 359071 359536 358951 357405 355848 354526 352722 350272 348124 346890 345989 344899 344257 344990 347283
57678 347283 351162 357287 366325 378217 392801 410559 432083 457428 486765 521169 562001 609773
57666 609773 664120 724385 789258 855298 915559 959857 977872 964333 922471 862101 794014
57655 794014 726103 663400 609006 563729 526153 494512 468209 447109 430375 416834 405816
57644 405816 396958 389806 384242 380586 378647 377333 375838 374552 374169 374607 375437 376668 378336 379910 380881
57629 380881 381529 382408 383453 384166 384313 383939 383081 381884 380625 379323 377796 376217 374988 373913 372385 370651
57613 370651 369824 370174 370487 369836 368936 368869 369392 369594 369502 369849 370622 370975 370549 370041 370415 371904 373777 374842
57595 374842 374468 373192 371967 370900 369432 367707 366652 366499 366370 365812 365531 365996 366512 366532 366755 367926 369541
57578 369541 370780 371877 373411 375015 375934 376224 376277 375768 374317 372701 372164 372743 373381 373443 373174 372924 372875 373375
57560 373375 374617 376120 377214 377776 377941 377644 377237 377933 380594 384508 388409 392318 397180 402938 408178
57545 408178 411710 413514 414093 413827 413090 412255 411474 410984 411427 413224 415808 418189 420104 421967 423994 426169
57529 426169 428776 432037 435324 437622 438847 440004 442101 445465 449944 455070 460164 464982 470103 476078
57515 476078 482418 488147 493031 497460 501391 504463 507052 510235 514507 519334 524043 528423 532339 535537
57501 535537 538074 540426 542924 545528 548101 550476 552298 553289 553698 554060 554604 555238 555878 556369 556410 556099 556337
57484 556337 558047 561157 564809 568343 571620 574754 578170 582544 588030 593773 598801 602979 606519 609073
57470 609073 610241 610626 611428 613090 615137 617117 618986 620789 622754 625409 628902 632559 635898 639565 644312
57455 644312 649599 654373 658778 663727 669141 674097 678611 683680 689410 694651 698919 703235 708499 714248
57441 714248 719712 725082 731026 737695 744756 751778 758224 763806 769135 775249 782266 789297 795886 802459
57427 802459 809042 814770 819339 823930 829820 836816 843886 850707 857688 864938 872053 878766 885211 891611
57413 891611 898034 904350 910329 916141 922703 930903 940343 949602 958037 966466 975655 984994 993416 1000881
57399 1000881 1008052 1014989 1021191 1026825 1032977 1040501 1049177 1058264 1067456 1077054 1087337 1097974 1108164
57386 1108164 1117416 1126160 1135453 1146131 1158337 1171728 1185750 1199726 1213059 1225565 1237519 1249361
57374 1249361 1261389 1273554 1285344 1296108 1305716 1314672 1323339 1331489 1338942 1346171 1353679 1361316 1368914
57361 1368914 1377101 1386560 1396873 1407110 1417317 1428234 1439750 1450883 1461381 1472028 1483190 1494342
57349 1494342 1505412 1517272 1530293 1543609 1556548 1569762 1584086 1599107 1613797 1627883 1641781
57338 1641781 1655692 1669566 1683482 1697411 1711023 1724334 1738052 1752626 1767425 1781535 1795011
57327 1795011 1808640 1822828 1837392 1852144 1866991 1881648 1895861 1909872 1924189 1938994 1954121
57316 1954121 1969379 1984605 1999623 2014561 2029962 2046227 2063117 2080046 2096638 2112830 2128826
57305 2128826 2145149 2162280 2179901 2196973 2212920 2228343 2244200 2260728 2277596 2294634 2311869
57294 2311869 2329138 2346229 2363260 2380569 2398441 2417136 2436834 2457318 2478115 2499191 2520951
57283 2520951 2543192 2564746 2584759 2603836 2623192 2643055 2662604 2681289 2699475 2717827 2736680
57272 2736680 2756089 2776071 2796593 2817436 2838074 2857814 2876441 2894851 2914520 2936041 2958602
57261 2958602 2981086 3003086 3024479 3044776 3063675 3081835 3100315 3119437 3138728 3157761 3176417
57250 3176417 3194579 3212213 3229668 3247363 3265252 3283071 3300883 3318883 3336844 3354366 3371628
57239 3371628 3389256 3407454 3425758 3443727 3461410 3479036 3496633 3514087 3531328 3548323 3565036
57228 3565036 3581344 3596941 3611539 3625306 3638810 3652266 3665130 3676790 3687370 3697449 3707259
57217 3707259 3716660 3725770 3735062 3744840 3754961 3765046 3774656 3783447 3791575 3799912 3809388 3820055 3831116
57204 3831116 3841919 3852650 3863916 3875905 3888092 3899736 3910604 3921104 3931625 3941865 3951113
57193 3951113 3959166 3966591 3974032 3981601 3988971 3995550 4000456 4002975 4003475 4003378 4003762 4004357 4004229 4002907 4000347
57178 4000347 3996381 3991010 3985007 3979440 3974576 3969737 3964149 3957518 3949904 3941567 3932922 3924211 3915283 3906012
57164 3906012 3896709 3887697 3878674 3869014 3858548 3847503 3835855 3823338 3810112 3796741 3783351 3769308
57152 3769308 3753914 3736993 3718695 3699206 3678919 3658413 3637847 3616564 3593693 3569156 3543814
57141 3543814 3518614 3493810 3469197 3444955 3422022 3401537 3384120 3369882 3358933 3351526 3347779 3347556
57129 3347556 3350509 3355781 3361735 3366584 3369567 3371010 3371046 3368859 3363549 3355332 3345498 3335674 3327662 3323565
57115 3323565 3325301 3333959 3350051 3374250 3407353 3449640 3500885 3561260 3632028 3715485 3814893 3934979
57103 3934979 4082438 4265717 4494370 4778936 5131696 5567496 6103630 6758666 7550904
57094 7550904 8496828 9609359 10896393 12360977 14003471 15823800 17821732 19995029
57086 19995029 22336526 24830478 27447937 30140940 32835529 35426155 37779241 39753345
57078 39753345 41230419 42138116 42448364 42161075 41295369 39895951 38040204 35831651 33383574
57069 33383574 30805334 28195115 25634859 23186507 20892538 18779828 16862428 15142707
57061 15142707 13613936 12264445 11080268 10045694 9144014 8358892 7674723 7076309 6549728
57052 6549728 6083771 5669678 5299653 4966522 4664446 4388805 4135562 3901768 3686219
57043 3686219 3488205 3305770 3136348 2978725 2832850 2697945 2572458 2455873 2348768
57034 2348768 2250827 2160447 2076792 2000632 1932588 1872170 1819328 1775451 1741806 1718366 1705224
57023 1705224 1703409 1711649 1722059 1720783 1694501 1637472 1553748 1453901 1349434 1248664 1155914
57012 1155914 1072982 1000504 938261 885291 840306 801893 768433 738405 711061 686478 664928
57001 664928 646460 630895 617629 605539 593672 582048 571252 561414 552285 544162 537825 533409
56989 533409 530168 527578 525989 525958 527642 531064 536319 543102 550365 556546 559820 558349 551020 538169
56975 538169 521232 501859 481759 462858 446518 432727 420878 411219 404568 400858 399173 399190 401358
56962 401358 405603 411245 418456 428432 441649 457158 474024 492018 509998 524761 532640 531759 522451
56949 522451 506542 486980 467025 448579 431685 416160 402920 392944 385855 380579 376980 375940
56937 375940 378193 383885 392978 405454 421325 440836 464186 490515 517538 542418 562437 574610
56925 574610 575874 564827 543080 514337 482498 450816 421733 396344 374292 354923 338209 324168
56913 324168 312127 301484 292631 286149 281451 277163 272672 268486 265194 262818 261092 259751 258585 257679
56899 257679 257463 258124 259261 260600 262672 266208 271190 277183 284345 293463 305081 319184 335652 354472
56885 354472 375416 397702 419746 438997 452561 458631 457314 449903 437826 422700 406752 392219
56873 392219 380289 371180 365102 362616 364167 369776 379285 392569 409612 430662 456303 487109 523355
56860 523355 565083 612017 662818 714259 761126 797030 816026 814871 794745 760842 719981 678275
56848 678275 640085 607746 581686 561462 547230 540008 540627 549210 565763 590379 622663 661970
56836 661970 708607 763857 828311 900939 979700 1061165 1138293 1200002 1235104 1237363 1207200 1150291
56824 1150291 1075792 994355 915022 842911 779952 727092 684860 652651 629183 613821 606635
56813 606635 607449 615857 631909 655837 687378 726262 772859 826855 884980 940650 985668 1011989
56801 1011989 1013402 988049 940109 878001 810237 742923 679958 623660 574837 533588 500473
56790 500473 476118 459781 449608 444574 445019 451049 461704 476306 495448 519808 548606 579728
56778 579728 610432 637054 654698 658602 646476 619736 582753 540877 498488 458157 421204 388536
56766 388536 360584 336852 316300 298336 282959 270033 259002 249385 241025 233814 227638 222493
56754 222493 218184 214019 209405 204642 200487 197020 193667 190334 187703 186204 185408 184657 183753 182787 181788
56739 181788 180722 179480 177819 175689 173629 172370 172095 172447 173109 173868 174292 174067 173596 173632 174295 175030 175504
56722 175504 175909 176431 177037 177803 178877 180126 181353 182785 184761 187069 189224 191205 193163 194663 195134
56707 195134 194968 195205 196121 197115 198083 199770 202363 204720 205586 204940 203709 202732 202365 202542 202886 203089 203364
56690 203364 204076 204960 205337 205178 205186 205697 206250 206545 207044 208223 209837 211344 212594 213759 214989 216384 217905
56673 217905 219118 219415 218651 217211 215420 213323 211048 208893 207069 205807 205557 206456 207733 208406 208468 208641
56657 208641 209114 209477 209861 211015 213091 215400 217648 220328 223477 226076 227300 227555 227662 227778 227674 227366
56641 227366 226814 225589 223505 221213 219610 218960 218897 218861 218297 216947 215284 214228 214189 214845 215938 217559 219387
56624 219387 220504 220461 219911 219698 219866 220005 219956 219672 218902 217563 216054 214760 213605 212406 211296 210401 209506
56607 209506 208327 206813 205021 203117 201593 200916 200789 200358 199368 198478 198252 198516 199008 199882 201150 202266
56591 202266 202805 202996 203142 203085 202693 202398 202709 203556 204527 205451 206446 207661 209140 210607 211411 211218 210753 211128
56573 211128 212398 213562 214134 214791 216178 218069 220188 222955 226835 231630 237032 243224 250378 258178 266385
56558 266385 275414 285908 298106 311716 325529 336868 342605 341640 335956 328678 321651 315194 309259
56545 309259 303880 299066 295021 292147 290357 288885 287166 285296 283239 280403 276680 273115 270760 269422
56531 269422 268225 266819 265312 263626 261759 260186 259221 258359 256953 255199 253741 252684 251653 250515 249403
56516 249403 248282 247055 245796 244426 242521 239916 237099 234618 232524 230760 229551 228950 228579 228297 228514
56501 228514 229289 229734 228941 227045 224848 222898 221457 220784 220855 221265 221849 222888 224349 225670 226737 228132
56485 228132 229823 230566 229525 227680 226664 226794 227205 227387 227614 228168 228990 229843 230330 230177 229985 230975 233380
56468 233380 235827 237057 237404 237770 238024 237529 236560 235971 235898 235888 235973 236549 237426 237928 237775 237183 236485 236279 237356
56449 237356 239654 241871 242944 243324 243919 244584 244830 245279 246944 249398 251067 251305 251000 251134 251783 252468 252606
56432 252606 251654 249723 247937 247393 247847 248189 247943 247506 247247 247290 247944 249395 251043 251973 251984 251546 250993 250460
56414 250460 250307 250816 251668 252352 252751 252860 252460 251727 251488 252077 252695 252780 253241 255245 258416 261437 263793 265702
56396 265702 266964 267277 267321 268093 269406 270258 270410 270324 269904 268717 267314 266983 268126 270011 272014 274004 275663
56379 275663 276667 277533 279148 281466 283629 285248 286537 287408 287557 287349 287528 288187 288939 289892 291409 293239
56363 293239 294874 296433 298126 299337 299456 299179 299676 300877 301934 302901 304423 306155 307164 307702 308935
56348 308935 310977 312818 314140 315534 316913 317408 317028 316838 317256 317692 318083 319243 321392 323783 326132 329026
56332 329026 332613 336186 339356 342375 345128 347144 348809 351164 354262 357079 359236 361428 363932 366137
56318 366137 367865 369679 371549 372631 372757 372765 373014 372951 372526 372597 373407 374069 374083 374122 374812 375977 377548 380012
56300 380012 383487 387503 392053 397609 403715 408871 412420 415468 419400 424473 430166 435916 441246 446133
56286 446133 451452 458055 465406 472212 478262 484397 490878 497335 504266 512865 523258 534473 546201
56273 546201 558809 571650 583428 594628 607592 623542 641330 659670 678785 699165 720611
56262 720611 743412 768843 797579 829057 863123 900900 943344 990386 1042135 1099620 1163901
56251 1163901 1235893 1317258 1409691 1512868 1624965 1745639 1876547 2018313 2169070 2326684
56241 2326684 2490220 2658117 2826872 2992646 3152326 3302037 3436595 3551735 3645202 3714659
56231 3714659 3756503 3768277 3750746 3706444 3637811 3547869 3440829 3320436 3188996 3049080
56221 3049080 2904577 2758898 2613791 2470991 2333171 2201925 2076678 1957100 1844871
56212 1844871 1741517 1646162 1557088 1474039 1397416 1326710 1261358 1201797 1148072 1098677 1052281
56201 1052281 1009341 970641 935616 903486 874594 849129 825970 804250 784612 767458 751504
56190 751504 735710 721131 709109 699020 689593 681136 674666 669944 666018 662630 659560 655862 651365
56177 651365 647700 646223 646016 645458 644512 643993 643913 644172 645608 648688 652306 655377 658439 662270 666368 670309
56161 670309 675142 681776 689363 696942 705273 715319 726321 737145 748225 760542 774025 788660
56149 788660 805739 826350 849977 876171 906058 940643 979490 1022939 1073778 1134573 1204903
56138 1204903 1283164 1369275 1463245 1562577 1663359 1762504 1856807 1941622 2013258 2071939 2120591
56127 2120591 2162092 2199307 2235464 2271463 2303886 2327991 2341594 2344442 2336104 2317326 2291745 2263088
56115 2263088 2231477 2194400 2149647 2095139 2028135 1947941 1858251 1764352 1669600 1576944 1491405
56104 1491405 1417336 1354514 1300166 1253567 1215595 1185333 1160621 1140911 1126408 1115543 1106431
56093 1106431 1099617 1096268 1094899 1093138 1091456 1091869 1094184 1096876 1100398 1106066 1112745 1118198 1122877 1129032
56079 1129032 1137006 1145697 1155522 1167536 1180652 1193121 1205667 1219818 1234459 1247645 1260491 1275540
56067 1275540 1292492 1309327 1326370 1345250 1365021 1383384 1400799 1419454 1439229 1458644 1478607
56056 1478607 1500999 1524687 1547150 1568925 1592180 1616061 1637990 1658494 1680151 1702768 1724259
56045 1724259 1745373 1768800 1794418 1820076 1846186 1874813 1905260 1935351 1966051 1999828 2035558
56034 2035558 2070243 2104657 2141942 2181730 2221256 2261313 2305311 2353207 2402089 2451820 2504187
56023 2504187 2557421 2607829 2656263 2706851 2760075 2813390 2867722 2926674 2989999 3054652 3121577
56012 3121577 3194473 3272560 3351958 3433667 3522668 3619459 3720102 3824204 3934999 4051860
56002 4051860 4170893 4292840 4422294 4559322 4700311 4846656 5003801 5171932 5346781
55993 5346781 5529329 5725111 5934270 6152439 6381404 6628313 6894224 7174347 7469858
55984 7469858 7788123 8130970 8494700 8882296 9303331 9761172 10253080 10783616 11364665
55975 11364665 12001767 12694754 13452567 14292480 15224313 16251885 17391190 18670423 20112281
55966 20112281 21736286 23581190 25706984 28176406 31059364 34458960 38510060 43350880
55958 43350880 49122185 55995878 64176888 73880790 85347851 98878370 114807407 133437404
55950 133437404 155035313 179872063 208152119 239818347 274365416 310605353 346174758
55943 346174758 377048547 397963295 404247014 394094522 369514680 335210612 296438028
55936 296438028 257421144 220902208 188348311 160271659 136545130 116723185 100267970
55929 100267970 86632183 75295168 65817432 57861828 51155802 45461736 40590706 36407978
55921 36407978 32803123 29671485 26930295 24526349 22414209 20543879 18876520 17392037
55913 17392037 16071404 14887184 13817849 12854828 11988044 11199160 10475439 9816052 9218259
55904 9218259 8670311 8163540 7698541 7273542 6878677 6507417 6162384 5844430 5546636
55895 5546636 5264266 5000446 4756872 4528493 4312163 4111317 3927441 3755789 3593958
55886 3593958 3446043 3313907 3192601 3078736 2975401 2884558 2802124 2724461 2652118 2583291
55876 2583291 2511336 2433283 2353952 2277659 2202535 2126857 2053809 1985428 1918125 1848787 1779775
55865 1779775 1713940 1650240 1588155 1530975 1480638 1434228 1389248 1347625 1311085 1277356 1244304
55854 1244304 1213295 1185299 1158187 1130877 1105589 1083081 1060136 1034721 1009231 985871 963240
55843 963240 940141 918209 898008 877073 854652 833896 816506 799788 781882 765270 751900
55832 751900 739448 725890 713433 704202 696008 686178 675964 667483 659627 650585 641267 632800 623594
55819 623594 612180 600111 588982 577545 564819 553113 544708 538207 531228 524161 518268 512663 506255
55806 506255 500336 496311 493110 489551 487012 487063 488668 490315 492733 496923 501633 505254 508192 511103 512928
55791 512928 512895 512283 512050 510987 508280 505485 503868 502311 500081 498950 500074 501225 499634 495063 487696
55776 487696 475863 458893 439916 422707 407707 393902 382369 374833 370598 368033 367485 369702 372832
55763 372832 374026 372968 371215 369181 366264 362825 359634 356333 352499 349032 346519 343586 338864 333218
55749 333218 328070 322937 316648 309530 302516 295586 288925 283945 281170 278825 275383 271710 268822 265677
55735 265677 261433 257751 256273 255709 254060 251888 250686 249765 247578 244598 241966 238767 233577 227487 222696
55720 222696 219203 215608 212030 209426 207156 204078 201098 199844 199804 199575 199888 202392 206295 209343 211529
55705 211529 214718 218971 222287 223837 224537 224477 222610 219157 215727 212737 209003 204137 199175 194655 190098
55690 190098 185601 182062 179658 177800 176532 176403 177075 177725 178579 180489 183342 186475 190127 194696 199131
55675 199131 201948 203418 204902 206533 207502 208089 209293 210747 211112 210362 209700 209387 208590 207250 206272 205954
55659 205954 205885 206156 207013 207824 208102 208946 211451 214331 215323 214498 213862 213978 213446 211615 209365 207063 204107
55642 204107 200770 198247 196458 193891 190060 186175 182982 179820 176271 172920 169994 166931 163729 161099
55628 161099 158928 156218 152898 150146 148576 147604 146843 146580 146627 146253 145493 145040 144718 143647 142067 141244 141303
55611 141303 140851 139149 137025 135237 133501 131602 129997 128820 127539 125924 124188 122145 119600 117477
55597 117477 116914 117286 116856 115435 114500 114475 114026 112490 111008 110519 110488 110409 110822 111958 112959 113303 113557 113980
55579 113980 113905 113326 113546 115284 117545 119369 121384 124622 128978 133844 139180 144928 150405 155197 159780
55564 159780 164348 167894 169330 168746 166835 163851 159879 155404 150842 146098 141129 136366 132159 128483
55550 128483 125475 123462 122156 120723 118955 117479 116542 115619 114533 113876 113893 114057 114150 114642 115510 115889 115541
55533 115541 115512 116636 118388 119952 121354 122730 123485 123139 122251 121629 121206 120411 119047 117109 114374 110819
55517 110819 106982 103380 100047 96988 94432 92251 89880 87253 85047 83547 82063 80044 78013 76769
55503 76769 76230 75701 74824 73753 72817 72363 72565 73112 73541 73898 74501 75076 75014 74537 74623 75526 76377 76581 76672 77310
55483 77310 78354 79380 80311 81077 81423 81454 81611 81789 81372 80452 80078 80857 82212 83458 84658 85893 86644
55466 86644 86563 86084 85664 85122 84174 82879 81195 78958 76713 75605 75900 76533 76629 76569 76925 77394 77527 77646
55448 77646 78225 79038 79663 80167 80681 80970 81026 81309 81808 81668 80454 78975 78123 77649 76881 75933 75315 75002 74760
55429 74760 74849 75587 76639 77489 78213 79063 79755 79909 79822 80116 80887 81782 82616 83462 84380 85442 86646 87588 87705
55410 87705 87093 86475 86080 85345 84092 83147 83168 83554 83211 81872 80132 78664 77899 77969 78508 78934 79149 79422
55392 79422 79542 79034 78390 78899 80760 82499 82905 82442 82002 81447 80432 79671 80072 81223 81867 81491 80556 79578
55374 79578 78817 78488 78489 78309 77835 77738 78457 79429 79982 80360 81141 82204 83020 83363 83179 82442 81787 82422 84611
55355 84611 86997 88249 88576 88774 88738 87976 86775 85701 84614 83326 82458 82442 82392 81336 79908 79399 79672
55338 79672 79603 79163 79384 80377 81026 80756 80155 79639 78924 78133 78146 79331 80879 81857 82185 82290 82500 82995 83668
55319 83668 83909 83210 81999 81231 81146 81204 81135 81206 81457 81546 81485 81623 81833 81543 80785 80385 80877 81965 83230 84578
55299 84578 85715 85920 84775 82683 80394 78467 77308 77165 77831 78750 79552 80166 80456 80267 79893 79926 80563
55282 80563 81490 82447 83389 84094 84221 83832 83358 82920 82244 81313 80539 80129 79805 79427 79396 80083 81141 81702 81214
55263 81214 80014 79097 79248 80280 81274 81668 81831 82372 83256 83987 84305 84228 83675 82617 81464 80815 80878 81451
55245 81451 82232 82785 82524 81279 79732 78805 78740 79160 79693 80110 80147 79723 79092 78335 77134 75582 74701 75330
55227 75330 76876 78023 78459 78930 79746 80279 80066 79563 79529 80258 81520 82730 83128 82434 81424 81243 82083 83080
55209 83080 83535 83619 83736 83818 83515 82745 81800 81146 81067 81350 81478 81379 81606 82411 83127 83118 82904 83433 84494 84851 83969
55188 83969 82667 81914 81810 82012 82384 82852 83205 83431 83874 84806 86083 87367 88406 89087 89490 89843 90150 90054
55170 90054 89430 88864 89032 89805 90549 91099 91827 92828 93666 93960 93692 93017 92207 91633 91336 90884 90136 89738 90181
55151 90181 90806 90632 89838 89408 89519 89427 88927 88747 89302 90067 90499 90675 90752 90675 90652 91122 91949 92411 92218 91770
55131 91770 91262 90460 89576 89372 89988 90628 90891 91478 92937 94551 95267 95054 94595 94173 93697 93355 93431 93645 93420
55112 93420 92738 92150 91980 91948 91652 91066 90563 90610 91412 92716 94034 95037 95668 95931 95844 95610 95610 96133 97200
55093 97200 98526 99476 99445 98625 98087 98630 99840 100849 101628 102742 104150 105208 105803 106468 107276 107615 107292
55076 107292 106956 107098 107409 107492 107457 107459 107326 106993 106691 106427 105949 105449 105507 106035 106107 105240 103999 102906 101640 99979
55056 99979 98628 98291 98585 98740 98796 99183 99537 98963 97345 95532 94244 93517 93218 93396 93972 94637 95284 96204
55038 96204 97683 99630 101704 103600 105065 105784 105413 103928 101921 100340 99688 99615 99545 99483 99848 100679 101529
55021 101529 102016 101949 101020 99085 96816 95334 94990 95095 95035 95015 95417 96097 96710 97205 97570 97569 97109 96550 96314
55002 96314 96482 96963 97655 98340 98811 99219 99787 100201 99953 99372 99451 100339 100924 100501 100023 100907 103140 105342 106428
54983 106428 106478 106145 105857 105635 105347 105063 105152 105817 106634 107023 107169 107829 109095 110138 110424 110368 110353 109970 108903
54964 108903 107878 107901 108966 110179 110815 110713 110061 109375 109289 109782 110031 109549 108971 109051 109411 109154 108355 108013 108629
54945 108629 109670 110475 110993 111476 111988 112342 112289 111787 111279 111381 112055 112471 112122 111590 111685 112251 112597 112758 113412
54926 113412 114643 115686 116081 116361 117389 119542 122754 126807 131335 135896 140386 145179 150707 157022 163759
54911 163759 170294 175943 180303 183497 185844 187148 186535 183190 177288 170091 163065 156897 151438 146477
54897 146477 142230 138825 135719 132199 128425 125401 123843 123521 123780 124136 124222 123755 122943 122508 122993 124268
54881 124268 125868 127395 128494 128953 129111 129772 131501 134398 138580 144230 150972 157908 164608 171383 178227
54866 178227 184214 188429 190809 191563 190489 187538 183416 178831 173612 167366 160579 154298 148978 144360
54852 144360 140169 136264 132328 128170 124192 120988 118609 116671 114960 113406 111761 109930 108395 107725
54838 107725 107782 107925 107877 107910 108316 109137 110219 111177 111529 111206 110651 110113 109251 107822 106273 105170 104496 104045
54820 104045 104013 104624 105618 106671 107814 108877 109121 108254 107264 107360 108485 109725 110711 111627 112197 111842 110775
54803 110775 109910 109679 109792 110141 110991 112230 113261 113798 114104 114389 114582 114683 114787 114916 115352 116784 119292
54786 119292 121561 122079 120976 119656 118784 117849 116706 116182 116751 117695 118216 118508 119173 120272 121521 122870
54770 122870 124439 126303 128753 132268 136844 141706 146040 149797 153617 158202 163859 170334 176979 183328
54756 183328 189413 195233 200079 202867 203032 200695 196201 190105 183402 177037 171201 165668 160626 156445
54742 156445 152782 148850 144599 140822 138051 136102 134787 134148 133825 133067 131684 130327 129595 129497 129899 130784
54726 130784 131922 133012 134345 136541 139476 142266 144534 146924 150110 154102 158742 163998 169436 174253
54712 174253 178277 182098 185785 188294 188684 187163 184353 180255 174675 168074 161370 155266 150225 146502
54698 146502 143709 140903 137708 134811 132857 131392 129537 127198 124968 123233 122021 121390 121317 121503 121786
54683 121786 122434 123478 124124 123482 121715 119895 118828 118443 118161 117505 116479 115670 115718 116427 116781 116153 115106
54666 115106 114561 114649 114867 114971 115044 114995 114666 114279 114135 113980 113289 112146 111326 111459 112507 114030 115496 116365
54648 116365 116345 115729 115135 114858 114779 114892 115430 116271 116614 115726 113997 112889 113593 115794 117949 118818 118451 117719
54630 117719 117266 117271 117769 118583 119079 118687 117783 117442 118136 119182 119671 119389 118555 117252 115631 114307 113960 114614
54612 114614 115663 116505 116944 117088 117086 116926 116464 115830 115627 116340 117514 118056 117501 116498 115870 115756 115960 116576
54594 116576 117700 118900 119541 119486 119144 119007 119392 120364 121508 122009 121367 119976 118750 118321 118775 119877 121212
54577 121212 122271 122729 122643 122231 121591 120812 120123 119696 119437 119165 118912 118869 119060 119189 118806 117751 116515 115989
54559 115989 116598 117811 118828 119576 120592 122085 123631 124768 125303 125075 124061 122785 122023 121930 122064 122330
54543 122330 123155 124568 125878 126663 127402 128699 130447 132133 133464 134292 134549 134627 135248 136424 137178 136811 135921
54526 135921 135545 135776 135914 135594 135059 134519 133874 132995 131876 130622 129570 129157 129418 129876 130198 130523 130860 130701
54508 130701 129719 128404 127462 126974 126665 126619 127109 127878 128206 127684 126583 125553 125142 125410 125803 125713 125240 124985
54490 124985 125060 125002 124902 125698 127817 130227 131554 131584 131044 130506 130242 130591 131540 132395 132672 132983 134185 136009
54472 136009 137442 138197 138827 139550 139913 139696 139350 139395 140005 141158 142566 143531 143556 143150 143381 144570 146006 147000
54454 147000 147642 148401 149497 150759 151712 151752 150617 148745 146883 145444 144447 143803 143245 142347 141163 140587 141420
54437 141420 143216 144626 144798 143976 142912 142214 142103 142218 141783 140464 138888 137833 137286 136870 136842 137778 139481
54420 139481 141091 142196 143076 143878 144428 144844 145490 146237 146598 146751 147552 149196 150548 150264 148130 145095 142418
54403 142418 140922 140628 140902 141247 141922 143396 145370 147001 148063 149162 150739 152553 154268 155859 157204
54388 157204 157976 158214 158418 158811 159038 158859 158556 158327 157835 156785 155540 154746 154642 155069 155860 156882 157887
54371 157887 158642 159126 159513 160069 161055 162537 164227 165788 167295 169121 171378 173695 175562 176703 177223 177667
54355 177667 178716 180497 182359 183650 184371 184634 183913 181682 178590 176069 174666 173543 171784 169413 166845
54340 166845 164086 161025 158060 155908 154850 154391 153657 152156 150340 149221 149185 149467 149191 148583 148487 148967 149239
54323 149239 148945 148628 148804 149353 150012 150826 151767 152464 152608 152265 151695 151239 151293 151857 152191 151544 150199 149092
54305 149092 148462 147699 146592 145817 145934 146658 147388 147738 147397 146256 144941 144411 144708 144844 144246 143489 143252 143362
54287 143362 143357 143208 142962 142373 141524 141185 141978 143632 145529 147427 149184 150388 150772 150560 150005 149180 148495 148685
54269 148685 149725 150507 150212 149353 148875 148931 149320 150340 152200 154082 154842 154457 153932 153992 154628 155684 157025
54252 157025 158193 158681 158593 158486 158618 158908 159458 160488 161750 162554 162445 161469 159882 158017 156323 155102 154266
54235 154266 153657 153357 153361 153284 152916 152728 153285 154397 155464 156382 157418 158404 158844 158800 158902 159351 159564 159008 157797
54216 157797 156360 155028 154180 154186 154864 155403 155228 154661 154382 154424 154108 152986 151516 150557 150344 150247 149635 148718 148228
54197 148228 148407 148723 148642 148232 147871 147745 147921 148536 149614 150904 152111 153087 153669 153671 153218 152702 152256 151663 151006
54178 151006 150846 151353 151858 151831 151827 152772 154591 156308 157333 157946 158532 159018 159168 158951 158444 157773 157198 156970 157024
54159 157024 157061 156839 156171 154830 152830 150731 149217 148419 148001 147846 148221 149239 150457 151152 150847 149683 148461
54142 148461 148140 148927 149991 150427 150324 150525 151470 152788 153953 154829 155447 155766 155942 156457 157656 159272 160620
54125 160620 161183 160878 159866 158366 156684 155282 154551 154532 155013 155997 157713 159882 161312 160898 158972 157061
54109 157061 156220 156216 156509 157245 158785 160856 162834 164540 166287 168341 170716 173166 175044 175583 174777 173574
54093 173574 172803 172384 172138 172697 174758 177850 180862 183617 186948 191196 195537 198931 200908 201274 199932
54078 199932 197373 194639 192332 190212 188117 186639 186299 186550 186376 185662 185266 185681 186329 186505 186497 187181 188608
54061 188608 189658 189335 187933 186469 185289 183943 182316 181092 180886 181616 183080 185456 188653 191773 193995
54046 193995 195743 198293 202368 207679 213621 219715 225466 230515 235119 239929 245147 250314 255069 259682
54032 259682 264650 270037 275425 280321 284530 288204 291527 294367 296455 297998 299728 302065 304577 306636
54018 306636 308241 309705 310786 310756 309287 306708 303406 299427 294729 289480 284037 278805 274006 269389 264417
54003 264417 258962 253520 248472 243655 239076 235418 233103 231315 228903 225941 223445 221673 219815 217471
53989 217471 215322 213966 212960 211575 209838 208321 207306 206620 205989 205202 204203 203217 202593 202395 202413 202547 202802
53972 202802 202898 202412 201412 200465 199948 199802 200033 200846 202086 203158 203812 204565 205980 207935 209920 211740 213573
53955 213573 215664 218252 221613 225830 230635 235600 240462 245362 250979 258338 267978 279326 291196 302826
53941 302826 313856 323350 329692 331908 330602 327259 323126 319077 315954 314227 313426 312482 310755 308525
53927 308525 306613 305839 306710 309271 313083 317545 322329 327513 333254 339358 345226 350338 354864 359634 365414
53912 365414 372294 379888 387887 396147 404414 412204 418948 424113 427373 428836 428841 427404 424259 419720 414994
53897 414994 411119 407965 404809 401348 397478 392568 386000 378267 370509 362989 354983 346233 337524 329588
53883 329588 322345 315503 309075 302948 296736 290511 284980 280551 276825 273374 270297 267607 264729 261162
53869 261162 257161 253299 249818 246722 244008 241440 238579 235425 232479 229880 227126 224064 221458 219968
53855 219968 219173 218248 217041 215824 214466 212708 210914 209770 209349 209091 208622 208017 207434 207004 206904 207035 206783
53838 206783 205693 204280 203586 203940 204587 204596 203723 202366 201092 200341 200315 200939 201928 202862 203295 203074 202646 202752
53820 202752 203640 204904 206215 207785 209827 211978 213715 215080 216543 218305 220138 221856 223599 225696
53806 225696 228370 231539 234853 238139 241815 246474 252000 257588 262835 268269 274425 280901 286796 291704
53792 291704 295790 299214 302071 304686 307410 310114 312285 313589 314125 314271 314489 315024 315477 314883 312526 308589
53776 308589 303793 298702 293586 288638 283932 279318 274712 270305 266303 262672 259342 256353 253628 250905
53762 250905 248138 245598 243373 241146 238679 235999 232957 229257 225339 222483 221361 221038 220133 218505 217023
53747 217023 216086 215280 214305 213378 212692 212189 211878 211823 211844 211777 211897 212576 213635 214611 215496 216541 217477 217719 217363
53728 217363 217215 217658 218205 218401 218591 219458 221262 223835 226895 230061 232857 235029 236725 238193 239485 240588
53712 240588 241681 243102 245043 247340 249571 251493 253414 255885 258933 261923 264419 266816 269754 273188
53698 273188 276481 279267 281791 284528 287837 291802 295993 299541 301923 303577 305405 307748 310242 312471
53684 312471 314289 315593 316287 316464 316255 315533 314164 312463 310961 309792 308647 307232 305376 302930 300084
53669 300084 297626 296254 295664 294915 293736 292874 293020 293925 294787 295069 294692 293786 292534 291070 289379 287441
53653 287441 285507 284068 283526 284047 285588 287832 290163 292009 293232 294060 294775 295623 296789 298212 299632
53638 299632 301053 302903 305407 308063 310119 311343 312065 312800 314123 316469 319495 322076 323488 324301 325584
53623 325584 327675 330397 333947 338633 344042 349495 355096 361305 367559 372517 375808 378486 381494 384688
53609 384688 387737 391022 395001 399376 403510 407190 410563 413758 416909 420154 423307 425942 427966 429660
53595 429660 430981 431441 430911 429942 428954 427685 425827 423681 421719 419891 417855 415629 413647 412287 411525
53580 411525 410824 409317 406505 402948 399914 398187 397505 397160 396665 395791 394490 392963 391348 389312 386529
53565 386529 383619 381873 381796 382593 383421 384392 385874 387490 388472 388650 388555 388811 389815 391627 393754 395316 395893
53548 395893 396002 396506 397780 399658 401847 404168 406691 409802 413762 418128 422189 426131 431047 437440 444412
53533 444412 450873 456993 463802 471829 480779 490226 499982 510022 520513 531769 543772 556014 568214
53520 568214 580857 594617 609587 625529 642485 660623 679836 700076 721797 745419 770513
53509 770513 796154 821955 848135 874663 900962 926543 951428 975899 1000204 1024584 1049199
53498 1049199 1073881 1098238 1121993 1145070 1167388 1188824 1209341 1228952 1247697 1265783 1283590
53487 1283590 1301342 1318955 1336423 1354101 1372347 1391066 1409898 1428604 1446938 1464381 1480373
53476 1480373 1494646 1506992 1516965 1524253 1529211 1532509 1534207 1533546 1529751 1522816 1513468 1502524 1490312
53463 1490312 1476674 1461501 1445255 1428776 1412621 1396822 1381180 1365322 1348495 1329937 1309776
53452 1309776 1289001 1268277 1247302 1225728 1204131 1183466 1163992 1145350 1127412 1110495 1095006
53441 1095006 1081371 1069991 1060705 1052626 1045124 1038683 1034092 1031083 1028625 1026481 1025581 1026664 1029386 1033093
53427 1033093 1037887 1044396 1052821 1062548 1072618 1082424 1092167 1102795 1115478 1130956 1149182 1169350
53415 1169350 1190303 1211401 1233251 1257284 1284320 1313903 1345236 1378245 1413238 1450083 1488437
53404 1488437 1528499 1570702 1614851 1660330 1707119 1755835 1806715 1859264 1913027 1968017 2024207
53393 2024207 2081270 2139031 2197619 2256810 2315711 2373383 2429400 2483524 2535277 2584243 2630570
53382 2630570 2674870 2717612 2758684 2797296 2832291 2862843 2888949 2911053 2929143 2942523 2950554
53371 2950554 2953294 2951208 2944355 2931997 2912950 2886429 2852698 2812848 2767874 2718323 2665067 2609928
53359 2609928 2554809 2500348 2446069 2391856 2338595 2287283 2238189 2191172 2146236 2103371 2062213
53348 2062213 2022218 1982904 1943738 1904141 1863886 1823292 1782890 1743143 1704593 1667897 1633453
53337 1633453 1601203 1570935 1542565 1516092 1491696 1469936 1451316 1435374 1420596 1405585 1390021
53326 1390021 1374183 1357981 1340948 1322973 1304578 1286555 1269618 1254296 1240724 1228604 1217700
53315 1217700 1208317 1200937 1195345 1190561 1185858 1181654 1179178 1179282 1181734 1185564 1189914 1194561 1199899 1206680
53301 1206680 1215669 1227220 1241059 1256647 1273872 1293171 1314886 1338718 1364001 1390255 1417184
53290 1417184 1444381 1471488 1498492 1525443 1551869 1576883 1599904 1620905 1639878 1656490 1670418
53279 1670418 1681623 1690066 1695408 1697313 1695927 1691829 1685537 1677189 1666641 1653738 1638439 1620707 1600402
53266 1600402 1577491 1552421 1526068 1499168 1471983 1444639 1417473 1390690 1363954 1336696 1308704
53255 1308704 1280026 1250619 1220660 1191121 1163283 1137506 1112969 1088794 1064895 1041535 1018555
53244 1018555 995403 971648 947175 922197 897343 873494 851234 830504 810891 792129 774310
53233 774310 757851 743248 730628 719483 709105 699238 689944 680936 671555 661510 651040 640182
53221 640182 628428 615429 601544 587344 573001 558566 544386 530745 517406 504019 490821
53210 490821 478427 467084 456597 446859 437923 429527 421070 412240 403401 395195 387930 381402 375089
53197 375089 368423 361119 353432 346000 339221 332829 326250 319458 313238 308429 305023 302339 299988 298182
53183 298182 297019 296036 294842 293673 292760 291531 289202 285941 282668 279811 277039 274236 271814 269856 267812
53168 267812 265405 263064 261083 259111 257028 255575 255455 256374 257613 259002 260600 261920 262368 262147 261955
53153 261955 261953 261768 261270 260581 259520 257919 256368 255741 255905 255812 255054 254391 254404 254462 253658 252165 250969 250581 250624
53134 250624 250552 250327 250381 251198 252823 254619 255692 255783 255562 255843 256731 257768 258593 259101 259211 259022 259098 260029 261577
53115 261577 262854 263587 264717 267231 270711 273702 275400 276284 276903 276846 275496 273311 271470 270316 268910
53100 268910 266350 262945 259743 257376 255776 254689 253916 253166 252138 250830 249566 248674 248257 248144 247973 247426
53084 247426 246529 245656 245154 245134 245657 246783 248237 249415 250031 250478 251187 251881 251923 251196 250117 248924 247538
53067 247538 246124 245159 244710 244117 242703 240583 238518 237196 236773 236895 236951 236488 235568 234684 234279 234431 235000
53050 235000 235869 236945 238078 239062 239683 239796 239529 239345 239669 240445 241242 241776 242060 242075 241654 240803 239861 239170
53032 239170 238808 238717 238847 239028 238956 238531 237996 237562 237097 236442 235851 235820 236476 237396 238086 238470 238871 239575 240495 241298
53012 241298 241859 242484 243547 245061 246804 248757 250971 252981 253900 253424 252354 251729 251685 251637 251358 251260 251627
52995 251627 252143 252375 252250 251845 251117 250192 249602 249807 250650 251610 252545 253830 255835 258536 261595 264513 266694
52978 266694 267771 268017 268177 268774 269801 271160 273021 275412 277736 279166 279482 279176 278762 278314 277795 277441
52962 277441 277559 278152 278998 279993 281164 282375 283253 283489 283112 282326 281134 279296 276756 273971 271597 269816
52946 269816 268260 266714 265601 265354 265500 264918 263122 260840 259080 258043 257322 256839 257019 258022 259283 260008
52930 260008 259914 259276 258424 257333 255703 253359 250610 248211 246834 246502 246629 246656 246540 246530 246614 246474 246019 245715
52912 245715 246130 247217 248293 248799 248827 248767 248655 248163 247103 245622 243954 242295 240997 240506 240940 241945 243053
52895 243053 243967 244451 244366 244070 244384 245639 247046 247528 247098 246780 247209 247895 248129 247960 247812 247642 247139 246578
52877 246578 246756 247914 249302 250133 250588 251540 253503 256235 259226 262132 264644 266390 267269 267769 268674 270365
52861 270365 272484 274317 275497 276321 277306 278490 279311 279275 278519 277434 275929 273519 270158 266457 262869 259132
52845 259132 254892 250502 246645 243415 240332 237237 234581 232742 231560 230725 230213 230098 230277 230631 231186 231865
52829 231865 232266 232042 231424 231106 231532 232391 232873 232447 231457 230862 231235 232085 232400 231762 230659 229727 229071 228464
52811 228464 227801 227168 226702 226611 227079 227928 228645 228980 229320 230183 231523 232798 233601 233860 233510 232389 230577 228576
52793 228576 226925 225712 224675 223762 223367 223780 224518 224571 223522 222162 221675 222393 223673 224796 225542 225961 226159
52776 226159 226390 226849 227249 227104 226513 226135 226194 226131 225560 224913 224660 224478 223869 223154 223017 223303 223089 221988 220697
52757 220697 220044 220084 220412 220895 221697 222749 223579 223803 223700 224100 225581 227852 230192 232353 234602 236861 238475
52740 238475 239275 240210 242285 245167 247568 248882 249720 250811 252067 252981 253429 253747 254263 254983 255613 255843 255701
52723 255701 255608 255880 256254 256120 255152 253514 251559 249624 247994 246714 245491 244069 242659 241724 241378 241313 241232
52706 241232 241077 240929 240925 241154 241348 240937 239820 238838 238925 239974 241132 242088 243327 245038 246602 247430 247652 247629
52688 247629 247300 246539 245703 245294 245263 245161 244857 244732 245168 246109 247119 247654 247261 245741 243322 240666 238574
52671 238574 237506 237344 237717 238497 239764 241314 242628 243504 244290 245218 245967 246296 246600 247251 247815 247780 247743 248898
52653 248898 251337 253860 255629 257107 259026 261280 263335 264999 266241 266778 266479 265757 265052 264239 263023
52638 263023 261568 260245 259063 257885 257027 257059 257992 259035 259333 258807 258294 258902 261033 263990 266693 268747
52622 268747 270491 272112 273241 273571 273311 272768 271948 270904 270006 269458 268916 267968 266718 265596 264929 264932 265689
52605 265689 266744 267185 266629 265805 265659 266200 266719 266840 266801 266925 267337 268066 268903 269310 268973 268292 267847 267564 266921
52586 266921 265867 264998 264848 265452 266582 267957 269234 270251 271280 272680 274340 275830 276956 277771 278216
52571 278216 278292 278444 279109 279864 279668 278143 276035 274247 272943 271855 270939 270316 269865 269333 268722 268280 268073
52554 268073 267743 266725 264803 262522 260868 260336 260435 260415 260243 260468 261244 262086 262610 262964 263347 263596 263499 263143
52536 263143 262725 262352 262229 262665 263674 264871 266020 267353 269119 271111 272907 274261 274979 274770 273655 272294
52520 272294 271516 271592 272234 273146 274222 275392 276647 278186 280147 282241 284005 285423 287020 289275 292239
52505 292239 295707 299411 302936 305784 307667 308526 308170 306232 302666 298005 292888 287622 282514 278232 275320
52490 275320 273475 271919 270463 269561 269160 268222 266016 263357 261850 262064 263152 264225 265332 266840 268528
52475 268528 269797 270447 270754 270998 271298 271827 272762 274027 275353 276585 277746 278861 279952 281166 282768 284966
52459 284966 287857 291382 295128 298349 300473 301534 301856 301375 299668 296707 293217 290074 287513 285101 282381
52444 282381 279374 276501 274092 272043 269978 267826 266140 265659 266526 268019 269159 269541 269548 269847 270687 271657
52428 271657 272079 271614 270491 269232 268335 268197 269075 270895 273148 275165 276512 277168 277491 278101 279543 281836
52412 281836 284390 286564 288233 289725 291428 293653 296742 300997 306500 313234 321263 330516 340322 349417
52398 349417 356476 360598 361421 359152 354546 348656 342397 336381 331033 326663 323395 321156 319753 318878 318181
52383 318181 317510 317040 316975 317231 317677 318528 320096 322187 324194 325960 328172 331673 336616 342440 348401 353863
52367 353863 358420 362191 365954 370523 375770 380479 383359 384102 383315 381619 379252 376610 374666 374298 375259
52352 375259 376296 376457 375881 375194 374677 374491 375235 377551 381224 385332 389376 393739 398842 404387 409795 415041
52336 415041 420685 427299 435132 444214 454410 465419 476970 489102 502157 516516 532411 549945
52324 549945 569189 590241 613102 637427 662504 687746 713214 739318 765847 791578 815155
52313 815155 836247 855655 874383 892920 911316 929563 947662 965497 982855 999549 1015364
52302 1015364 1029935 1042876 1054133 1064125 1073349 1081856 1089222 1095050 1099349 1102355 1104085 1104144 1101879 1096678
52288 1096678 1088369 1077518 1065309 1052976 1041408 1031202 1022732 1015828 1009695 1003699 998316 994932 994553
52275 994553 997050 1001755 1008406 1017162 1027994 1040539 1054531 1069988 1086763 1104225 1121641 1138772
52263 1138772 1155806 1172722 1189054 1204432 1219045 1233270 1247030 1259971 1272225 1284482 1297058
52252 1297058 1309234 1319773 1327940 1333901 1338436 1342311 1345541 1347021 1345259 1339774 1331423 1321176 1309203
52239 1309203 1295630 1281450 1267696 1254077 1239554 1224246 1209703 1197040 1185765 1174875 1164249
52228 1164249 1154389 1145520 1137660 1131090 1125997 1121951 1118422 1115591 1114034 1113722 1113987 1114430 1115276 1116814 1119040
52213 1119040 1121968 1125793 1130502 1135751 1141420 1147898 1155479 1163715 1171768 1179347 1186818 1194321 1201154 1206396
52199 1206396 1209993 1212916 1216232 1220338 1225090 1230218 1235286 1239568 1242527 1244438 1246248 1248789 1252372 1256978
52185 1256978 1262348 1267806 1272498 1275964 1278171 1278848 1277296 1273218 1267355 1260788 1253788 1245815 1236559 1226535
52171 1226535 1216534 1206906 1197589 1188665 1180540 1173545 1167559 1162239 1157674 1154560 1153532 1154447 1156506 1158981
52157 1158981 1161511 1163852 1165875 1167911 1170549 1173775 1176684 1178382 1178844 1178565 1177754 1176450 1175184 1174801 1175482
52142 1175482 1176486 1177096 1177442 1178157 1179571 1181624 1184317 1187779 1191841 1196017 1200130 1204757 1210813 1218902 1229362
52127 1229362 1242705 1259456 1279352 1301226 1324050 1347927 1373733 1402120 1433185 1466771 1502356
52116 1502356 1538691 1574209 1608019 1640108 1670445 1698398 1723223 1744722 1763180 1778975 1792350
52105 1792350 1803091 1810301 1813049 1811626 1807765 1803214 1798410 1792838 1786179 1778629 1770455 1761904 1753312 1744765
52091 1744765 1735711 1725448 1713920 1701527 1688267 1673660 1657575 1640655 1623788 1607639 1592833
52080 1592833 1580098 1569865 1562016 1556368 1553268 1553372 1556851 1563021 1570912 1580145 1591197 1604757 1620858
52067 1620858 1638691 1657234 1675944 1694862 1714174 1733671 1752502 1769473 1783886 1796060 1806775
52056 1806775 1816213 1823796 1829058 1832144 1833254 1832152 1828646 1823122 1816126 1807672 1797330 1784746 1769693
52043 1769693 1751961 1731657 1709345 1685404 1659561 1631571 1602120 1572453 1543357 1515130 1488271
52032 1488271 1463413 1440624 1419626 1400682 1384470 1370910 1358940 1347719 1337302 1327801 1318670 1309321
52020 1309321 1299839 1290445 1280720 1270006 1258301 1246186 1234028 1221800 1209553 1197476 1185404 1172632
52008 1172632 1158436 1142663 1125754 1108210 1090037 1070738 1050004 1028313 1006557 985100 963568
51997 963568 941651 919692 898252 877543 857562 838472 820517 803902 789108 776956 767807 760808
51985 760808 754374 747393 739617 731089 721751 711643 701024 690089 678829 667269 655550 643670
51973 643670 631390 618587 605538 592731 580558 569343 559569 551855 546650 543996 543607 545159 548424
51960 548424 553127 558872 565364 572604 580548 588541 595432 600445 603666 605489 605840 604275 600703 595681
51946 595681 590091 584792 580490 577567 575983 575599 576644 579667 585032 592662 602261 613508 626018 639399
51932 639399 653358 667510 681089 693199 703454 711938 718424 722120 722561 720397 716728 711799 704817
51919 704817 695012 682377 667244 649646 629529 607429 584637 562692 542734 525149 509602 495456
51907 495456 482348 470458 460251 452112 446295 443028 442413 444188 447759 452547 458209 464477 470941 477037
51893 477037 482255 486263 488796 489497 487952 483999 477918 470199 461182 451175 440953 431802 424762 419936
51879 419936 416720 414557 413245 412782 413340 415316 418989 424086 430015 436487 443450 450466 456721 461838 466113
51864 466113 469616 471634 471456 469293 465896 461571 456241 450296 444778 440667 438427 438184 439842 442924 446776
51849 446776 451060 455760 460701 465399 469400 472343 473678 472809 469704 464988 459311 452946 446070 438968
51835 438968 431801 424662 418118 413151 410108 408076 405822 403216 401291 401039 402521 405077 407915 410400
51821 410400 412052 412501 411507 409152 406020 402884 400014 397028 393722 390766 389194 389340 390632 392313 393911
51806 393911 395158 396024 396946 398541 400824 403011 404280 404439 403694 402203 400181 398186 396843 396295 396213 396288
51790 396288 396399 396275 395302 392902 389129 384837 381171 378737 377201 375827 374484 373945 375001 377441 380163
51775 380163 382207 383374 383916 384083 384212 384949 386969 390507 395325 401087 407591 414701 422305 430367 438885
51760 438885 447714 456538 464945 472447 478454 482410 483996 483095 479622 473588 465352 455630 445208 434705
51746 434705 424573 415001 405820 396806 388315 381328 376607 373965 372625 372181 372869 375023 378652 383656
51732 383656 390083 397900 406582 415146 422577 428204 431755 433274 433122 432073 431240 431639 433602 436520 439093
51717 439093 439856 437772 432763 425901 418879 413048 408907 406395 405243 404835 404106 402110 398734 394675 390818
51702 390818 387879 386358 386379 387587 389641 392704 396967 401685 405335 406974 406942 405959 404177 401617 399084
51687 399084 397812 398175 399262 399779 398931 396406 392138 386533 380658 375738 372379 370427 369485 369392 370187 371856
51671 371856 374228 377064 380205 383703 387849 392962 399095 406013 413589 422069 431685 441976 451694 459470
51657 459470 464372 465820 463416 457324 448726 439433 430967 424165 419577 417759 418883 422253 426486 430227
51643 430227 432680 433532 432523 429236 423472 415899 407973 400893 394653 388463 382066 376255 372033 369671
51629 369671 368787 369006 370187 372185 374761 377745 381123 384918 388941 392509 394437 393713 390444 385956 381712
51614 381712 378258 375340 372736 370496 368525 366445 364043 361555 359388 357746 356595 355802 355146 354450 353879
51599 353879 353988 355293 357832 361318 365610 370858 377206 384587 392850 401827 411094 419782 426783 431101
51585 431101 431962 428920 422289 413476 404466 396719 390670 386276 383643 382887 383835 386340 390758 397610 406783
51570 406783 417474 428971 441106 453867 467072 480715 495368 511822 530287 550030 569822
51559 569822 588763 606947 625551 646183 669861 696398 724601 752932 779986 804495 824982
51548 824982 839554 846353 844465 834386 817476 795116 768542 739126 708231 676774 645374 614985
51536 614985 586910 562067 540654 522659 508193 497014 488188 480707 474312 469381 466196 464649 464467
51523 464467 465326 466735 468128 469116 469424 468626 466188 461865 455955 449080 441765 434237 426572 419033 412183
51508 412183 406545 402135 398445 394866 391036 386857 382480 378248 374471 371190 368341 366091 364739 364274
51494 364274 364350 364695 365304 366225 367497 369280 371576 373833 375295 375866 376141 376518 376815 376927 377118 377353 377026
51477 377026 375802 374121 372341 370008 366652 362743 359079 355656 351982 348160 344753 341796 338872 336115
51463 336115 334216 333295 332611 331591 330469 329728 329554 329965 330807 331441 331149 330173 329672 330318 331540 332532 333356
51446 333356 334576 336448 339164 343409 349874 358251 367406 376548 385781 395414 405135 413933 420647 424531
51432 424531 425599 424524 422197 419375 416721 414832 413919 413498 412605 410426 406762 402095 397272 392987 389410
51417 389410 386379 383881 382020 380484 378525 375836 373178 371704 371753 372667 373665 374539 375480 376652 378028 379389
51401 379389 380372 380729 380650 380650 381021 381573 381996 382279 382614 383093 383758 384896 387039 390651 396054 403654 413898
51384 413898 426794 441682 457847 475321 494861 517210 542726 571755 604734 641528 681000
51373 681000 721810 763553 806476 849821 890776 925369 950268 963718 965304 955632 936417 910269
51361 910269 879585 845387 807529 766272 723397 681421 641938 605167 571015 539854 511964
51350 511964 486938 464329 444536 428321 415588 405317 396663 389392 383135 377092 370907 365199 360615
51337 360615 356775 352797 348557 344784 342002 340106 338980 338780 339284 339545 338747 337127 335651 334952 335016 335659
51321 335659 336723 337799 338412 338767 339712 341579 343480 344351 344379 344685 345691 346549 346375 345332 344227 343617 343721
51304 343721 344621 345890 346374 345100 342436 339854 338471 338153 338025 337476 336553 335630 334825 333708 331731 329049
51288 329049 326635 325299 324855 324616 324446 324855 326238 328634 332162 337036 342951 348965 354265 358793 362998
51273 362998 367206 371269 374574 376398 376589 375883 375244 374967 374831 374974 375969 377930 380237 382363 384506 387032
51257 387032 389685 391614 391889 389931 385949 381208 377342 374975 373293 371190 368393 365190 361685 357854
51243 357854 354003 350540 347498 344744 342452 340897 339946 339209 338601 338242 337915 337134 335872 334787 334526 335027
51227 335027 335656 335927 336016 336580 338017 339873 341188 341482 341225 341216 341818 342990 344736 347043 349582 351877 353749
51210 353749 355304 356577 357522 358349 359517 361300 363482 365464 366626 366772 366475 366824 368542 371311 374145
51195 374145 376286 377571 378128 378133 377858 377616 377466 377150 376402 375283 374188 373579 373588 373860 373872 373441 372792 372128 371471
51176 371471 370968 370898 371168 371178 370533 369486 368376 367098 365642 364647 364645 365039 364741 363815 363638 365247 368330 372110
51158 372110 376421 381373 386510 390983 394333 396605 397807 397719 396206 393454 389932 386257 382958 380152 377619
51143 377619 375314 373557 372458 371418 369642 367099 364610 362923 362015 361391 360798 360437 360612 361399 362704 364470
51127 364470 366651 369026 371211 373002 374627 376528 378968 382006 385657 389754 393689 396688 398480 399397
51113 399397 399702 399253 398077 396895 396614 397458 399012 400955 403248 405640 407563 408684 409217 409559 409957 410625
51097 410625 411714 412895 413517 413584 414180 416303 419473 422134 423387 423704 423883 424028 423898 423672 423795 424305 424789
51080 424789 424892 424553 423921 423350 423293 423798 424248 424056 423590 423880 425361 427435 429469 431767 435081 439426 443954
51063 443954 448137 452705 459112 468120 479169 491241 504164 518760 535637 553955 571426 585519
51051 585519 594950 600616 605284 611912 621778 634117 647342 660002 670533 677211 679329 677921 674362
51038 674362 668526 659343 646968 633305 620304 608884 599664 593304 589266 585216 578746 569373 558291
51025 558291 546798 535687 525624 517132 510366 505537 503227 503584 505548 507773 510099 513337 517793 522953
51011 522953 528604 535210 542943 551229 559701 568860 579289 590727 602413 613899 625007 635302 644252
50998 644252 651858 658625 664810 670019 673718 675955 677415 678768 680093 681050 681514 681861 682522 683550 684859
50983 684859 686793 690211 696017 704713 716335 730608 747181 765824 786332 808182 830473 852437
50971 852437 873963 895619 918426 943757 973006 1006938 1045474 1088426 1136140 1189051 1246907
50960 1246907 1308966 1374852 1444566 1517645 1592841 1668765 1744419 1818978 1891476 1960881 2026142
50949 2026142 2086022 2139235 2185004 2223295 2254441 2278796 2296891 2309664 2318273 2323772 2327094 2329237
50937 2329237 2331268 2333951 2337260 2340318 2342064 2342065 2340373 2336536 2329210 2317114 2299938 2277885 2250618 2217297
50923 2217297 2177424 2131086 2078485 2019911 1956161 1888418 1817696 1744960 1671756 1600014 1531088
50912 1531088 1465552 1403975 1347178 1295463 1248277 1205098 1166138 1131699 1101206 1073387 1047272
50901 1047272 1022767 1000376 980533 963023 946966 931567 916934 903854 892767 883336 875045 867806
50889 867806 861840 857395 854586 853082 851958 850495 849220 849443 851513 854283 856608 858659 861266 864749
50875 864749 869147 874965 882725 892026 901887 912002 923040 935759 950363 966672 984356 1003064
50863 1003064 1022856 1044537 1069126 1096955 1127714 1161339 1198383 1239513 1285092 1335423 1391028
50852 1391028 1452536 1520605 1596112 1680179 1773783 1877408 1991107 2114803 2248459 2391961
50842 2391961 2544702 2705200 2871289 3040922 3212708 3385469 3557219 3724636 3883333
50833 3883333 4028615 4156329 4263601 4349034 4412359 4454121 4475815 4480006 4469930 4449009 4420811
50822 4420811 4389224 4358195 4331248 4311267 4300424 4299804 4308897 4325429 4345487 4363813 4374628 4372966
50810 4372966 4355499 4320034 4264599 4187552 4088525 3968824 3830861 3677533 3512115 3338223
50800 3338223 3159562 2979844 2802892 2632406 2471372 2321872 2185470 2063335 1955673
50791 1955673 1861331 1778486 1705898 1643327 1590757 1547488 1512184 1483617 1460984 1443429 1429534
50780 1429534 1417634 1406608 1396185 1386538 1377755 1369675 1361890 1353836 1345069 1335495 1325178 1313972 1301592
50767 1301592 1288019 1273450 1257845 1240998 1223251 1205627 1188931 1173056 1157507 1142297 1127927
50756 1127927 1114728 1102635 1091524 1081442 1072605 1065416 1060326 1057484 1056720 1058086 1062152 1069513 1080330
50743 1080330 1094616 1112564 1134193 1159140 1187428 1220103 1258335 1302047 1350262 1402757 1460478
50732 1460478 1524041 1592628 1664847 1740086 1818487 1900018 1984177 2070368 2157934 2245762 2332314
50721 2332314 2416225 2496718 2573341 2645515 2712397 2772898 2825463 2867815 2897226 2911527 2910114
50710 2910114 2894127 2865899 2828490 2785596 2741319 2699537 2663348 2634926 2615439 2604881 2602379
50699 2602379 2606978 2617806 2633168 2649868 2663965 2672083 2671583 2659820 2634100 2592669 2535381 2463379
50687 2463379 2378650 2284058 2183306 2080329 1978660 1881262 1790496 1707884 1634034 1568997 1512695
50676 1512695 1465061 1426005 1395421 1373066 1358362 1350422 1348388 1351697 1360026 1373052 1390209 1410501
50664 1410501 1432501 1454647 1475672 1494922 1512379 1528459 1543609 1557964 1571513 1584530 1597640
50653 1597640 1611380 1626042 1642031 1659936 1679928 1701534 1724447 1749310 1777217 1808648 1843392
50642 1843392 1881315 1922597 1967236 2014855 2065096 2117795 2172688 2229151 2286267 2342907 2397887
50631 2397887 2450309 2499659 2545413 2586911 2623978 2657259 2687467 2714589 2738179 2757519 2770389
50620 2770389 2772338 2759008 2729903 2689204 2642876 2595945 2552409 2515759 2488159 2469686 2459274
50609 2459274 2456011 2458959 2466450 2476472 2487319 2497050 2502665 2500685 2488556 2465068 2429777 2382775
50597 2382775 2324957 2257976 2183850 2104851 2023426 1941751 1861463 1784077 1711189 1643763 1581559
50586 1581559 1523817 1470230 1420789 1375127 1332813 1294050 1259310 1228426 1200745 1176076 1154738
50575 1154738 1136729 1121636 1109427 1100529 1094932 1091907 1090937 1092287 1096390 1103230 1112614 1124495 1138578
50562 1138578 1154055 1170215 1187043 1204925 1224101 1244751 1267252 1291864 1318250 1345672 1373560
50551 1373560 1401642 1429673 1457392 1484703 1511640 1538169 1564255 1590162 1616475 1643748 1672194
50540 1672194 1701784 1732757 1766109 1803476 1846299 1895108 1949844 2010867 2079279 2156117 2241529
50529 2241529 2334932 2435594 2542687 2655111 2771898 2892960 3019020 3150496 3286504 3425036
50519 3425036 3563929 3701424 3835746 3964386 4084064 4191524 4284175 4359816 4415938 4449892
50509 4449892 4460031 4446458 4410400 4353104 4275785 4180591 4071138 3951971 3827785 3703332
50499 3703332 3583580 3473372 3376721 3296517 3234759 3192750 3170923 3168668 3184364 3215415 3258184
50488 3258184 3308097 3359941 3408035 3446134 3467666 3466735 3439359 3384064 3301794 3195706 3070900
50477 3070900 2933521 2789423 2643416 2499510 2361198 2230969 2109788 1997634 1894699
50468 1894699 1801784 1719534 1647650 1584991 1530163 1481851 1438918 1400479 1365812 1334157 1304881
50457 1304881 1278070 1254696 1235763 1221366 1210864 1203882 1200628 1201203 1205065 1211478 1220149 1231152 1244445
50444 1244445 1259884 1277546 1297736 1320660 1346301 1374393 1404001 1433027 1458548 1478065 1490592
50433 1490592 1496758 1498221 1497007 1494935 1493192 1492362 1492819 1494923 1498783 1504105 1510512 1517916 1526487 1536503
50419 1536503 1548367 1562620 1579737 1599988 1623654 1651208 1683154 1719873 1761821 1809598 1863486
50408 1863486 1923039 1987315 2055284 2125689 2196756 2266613 2334097 2398787 2460210 2517324 2568847
50397 2568847 2613753 2651241 2680352 2699732 2707669 2702406 2682624 2647745 2597971 2534417 2459497 2376821
50385 2376821 2290278 2203250 2118913 2040716 1971673 1913147 1865021 1827242 1800552 1785518 1781480
50374 1781480 1786886 1800211 1820064 1844561 1870927 1895611 1914823 1925419 1925519 1914106 1890214 1853298
50362 1853298 1804619 1747555 1685941 1622399 1558544 1495996 1436372 1380616 1329013 1281669 1238353
50351 1238353 1198206 1160439 1125387 1094363 1068458 1047940 1032550 1021708 1014412 1009614 1006778 1005437
50339 1005437 1004125 1000533 993200 982747 971297 960996 953123 947946 944964 943600 943976 946742 951939
50326 951939 958494 965199 971831 978978 987069 996059 1005812 1016202 1026827 1037075 1046578 1055252 1062844
50313 1062844 1068780 1072660 1074673 1075364 1075148 1074198 1072709 1071087 1069911 1069810 1071343 1074874 1080458 1087868 1096797
50298 1096797 1107145 1119181 1133416 1150281 1169901 1192255 1217502 1246150 1278832 1316015 1357844
50287 1357844 1404093 1454256 1507958 1565316 1626023 1686685 1738567 1769329 1769270 1737467 1682337 1616308
50275 1616308 1549718 1488471 1435144 1390506 1354055 1324358 1299792 1279158 1261725 1247027 1234745
50264 1234745 1224600 1216300 1209668 1204815 1202062 1201734 1204073 1209242 1217277 1228169 1242166 1259849 1281720
50251 1281720 1307753 1337387 1369733 1403540 1437225 1469339 1499065 1526173 1550738 1573215 1594460
50240 1594460 1615177 1635344 1654405 1671706 1686119 1695357 1696551 1687943 1669752 1643397 1610480 1572751
50228 1572751 1532351 1491343 1451177 1412952 1377829 1346569 1318699 1292656 1266814 1240074 1211534
50217 1211534 1180272 1145951 1109529 1072959 1038041 1005637 975995 949551 927101 909096 895025
50206 895025 883706 874113 865778 858542 852249 846736 841864 837475 833507 830090 827268 824527 820961 816112
50192 816112 810442 804756 799376 794077 788663 783219 777833 772362 766591 760503 754275 748028 741646 734907
50178 734907 727861 721015 714989 709989 705804 702239 699257 696631 693844 690655 687541 685311 684400 684754 686118
50163 686118 688112 690246 692376 695086 699119 704391 710063 715721 721881 729084 737087 745584 755298 767466
50149 767466 782226 798258 814377 830882 848880 868686 889558 910895 933188 957709 985700
50138 985700 1017918 1054589 1095519 1140490 1189735 1243713 1302158 1363466 1425301 1485749 1543835
50127 1543835 1599231 1651930 1702220 1750615 1797535 1842900 1885799 1924233 1955265 1975803 1983524
50116 1983524 1977247 1956783 1922897 1877460 1823211 1763000 1699212 1633831 1568771 1505896 1446860
50105 1446860 1393046 1345439 1304207 1268379 1236301 1206695 1179252 1154126 1130994 1109035 1087987
50094 1087987 1068808 1052774 1039941 1029065 1019236 1011043 1005665 1003255 1002880 1003924 1006770 1011895 1018920
50081 1018920 1026918 1035247 1043646 1051785 1059202 1065635 1071073 1075440 1078414 1079572 1078604 1075461 1070452 1064160
50067 1064160 1057089 1049426 1041208 1032622 1023982 1015415 1006751 997807 988728 980045 972378 965991 960623 955825
50053 955825 951525 948158 946163 945511 945846 947005 949181 952605 957285 963184 970524 979633 990377 1001909
50039 1001909 1013279 1024346 1035801 1048089 1060512 1071773 1081344 1089946 1098672 1108008 1117743 1127379
50027 1127379 1136365 1144331 1151504 1158664 1166314 1174086 1181410 1188703 1197428 1208908 1223427 1240573 1260056
50014 1260056 1281926 1306235 1332705 1360490 1387987 1412996 1433526 1448792 1459595 1467793 1475321 1483330
50002 1483330 1491794 1499708 1505681 1508360 1506291 1497727 1481058 1455838 1423309 1385764 1345414 1303862
49990 1303862 1262325 1221801 1182858 1145551 1109859 1076147 1045032 1016824 991230 967510 944828
49979 944828 922615 900772 879542 859017 838884 818822 799075 780416 763511 748524 735264
49968 735264 723459 712856 703370 695291 689105 684873 681871 678958 675330 670871 665970 661089 656424 651895
49954 651895 647496 643596 640781 639428 639708 641961 646676 653868 662769 672393 682211 692020 701388 709664
49940 709664 716476 721915 726225 729631 732406 734767 736594 737494 737150 735286 731250 724091 713392 699851
49926 699851 684816 669492 654791 641570 630371 620946 612563 604951 598611 594040 591093 589347 588693
49913 588693 589167 590440 591986 593626 595437 597215 598572 599671 601308 604072 607852 612449 618158 625296
49899 625296 633526 642134 650839 659877 669500 679797 690794 702114 712521 720432 725115 727058 727126 725781
49885 725781 723217 719684 715345 710063 703627 695989 687134 677009 665832 654255 643009 632514 622931
49872 622931 614301 606462 599184 592670 587637 584507 582710 581201 579626 578647 579104 581129 584129 587473 591105
49857 591105 595516 601107 607663 614633 621889 629829 638648 647949 657414 667419 678453 690150 701439
49844 701439 711549 720328 727638 733067 736400 737890 737846 736357 733500 729307 723255 714427 702783 689925
49830 689925 677985 667848 659001 650980 644227 639331 636089 633808 632163 631231 630917 630955 631524 633338 636874
49815 636874 641778 647291 653078 659457 666934 675720 685555 695754 705492 714258 722028 728889 734644 739023
49801 739023 742180 744663 746856 748691 749856 749985 748603 745286 740022 733170 724896 714951 703287 690623
49787 690623 678072 666236 654961 643998 633662 624681 617460 611615 606327 601162 596421 592646 589972
49774 589972 588164 587089 586723 586792 586873 587030 587950 590262 594010 598888 604604 610847 617367 624377 632414 641376
49758 641376 650059 657164 662510 666833 670689 674089 676962 679235 680477 680004 677414 672578 665253 655474
49744 655474 644508 634700 627850 623941 621624 619644 617669 616135 615609 616065 616673 616610 616180 616738 619311 623652
49728 623652 628825 634241 639767 645259 650456 655139 659048 661953 664210 666986 671489 678140 686832 697613
49714 697613 710506 724907 739809 754555 768575 780371 787588 788634 783921 775401 765341 755667
49702 755667 747714 741893 737761 734796 733010 732709 734091 737253 741945 746690 748643 745263 736318 723893
49688 723893 710703 698858 689868 684651 683089 684184 687093 691699 698073 705908 714852 725004 736747
49675 736747 750390 766216 784530 805346 828286 852774 877649 900216 916477 923385 921051 912461
49663 912461 901310 890426 881670 876187 874411 876321 881968 891521 904638 919704 933325 940610 936984
49650 936984 921029 895699 866206 836720 809368 785412 765764 750158 737194 725919 716636 709810
49638 709810 705124 702167 701159 702195 704410 706615 708302 709333 709221 707495 704407 700558 696148 691206
49624 691206 686093 680927 674998 667703 659829 652893 647330 642388 637670 633673 630597 627847 625186 623349
49610 623349 622854 623044 623059 623072 623697 624756 625622 626521 628448 631698 635304 638198 640262 641912 643258 644161 644743
49593 644743 645274 645712 645853 645877 646230 646874 647211 647016 647069 648425 651238 654624 657510 659313 660042 660332 661212 663243
49575 663243 665753 667527 668349 669295 671317 674242 677502 681199 685882 691805 699010 707678 717686 728190
49561 728190 738359 748228 758019 766865 773184 776383 777334 776935 775016 770995 764951 757663 750072 743107
49547 743107 737544 733582 730769 728690 727501 727486 728385 729527 730568 731829 733900 736992 740665 744229 747508
49532 747508 751110 755757 761556 768349 776531 786889 799547 813731 828915 845624 864699 886102
49520 886102 908868 931709 953029 970584 982066 986629 985658 981809 977319 973285 970256 968961 970122
49507 970122 973821 979497 986566 994583 1002628 1009012 1012030 1010713 1004546 992969 975917 954735 931808
49494 931808 909216 888158 869501 854022 841822 832098 823792 816157 808695 801265 794578 789987 788286
49481 788286 788886 790357 791524 791987 792072 792455 793471 794631 795225 795403 796027 797365 798720 799648 800670 802305
49465 802305 804186 805870 807882 811103 815457 820070 824406 828547 832535 836230 839688 842969 845608 846965
49451 846965 847104 846706 846004 844419 841395 837098 832114 826902 821764 817099 813429 811209 810503 810751 811061 811039
49435 811039 811246 812645 815886 821317 829259 839680 851761 864323 876600 888370 899777 911634 925471
49422 925471 942403 962020 983064 1005031 1028355 1053281 1079541 1106826 1133850 1156427 1168260
49411 1168260 1165398 1149856 1128102 1106378 1088042 1074445 1066482 1064681 1068656 1077282 1089342 1103809
49399 1103809 1119756 1136210 1152150 1166745 1179748 1191479 1202264 1212022 1220646 1228488 1235983 1242843
49387 1242843 1248030 1250544 1249951 1246245 1239659 1230733 1220141 1208220 1194923 1180410 1165448 1151081 1138128
49374 1138128 1127116 1118379 1111913 1107306 1104090 1102126 1101483 1102077 1103638 1105882 1108467 1110898 1112777 1114031
49360 1114031 1114642 1114197 1112153 1108537 1103855 1098189 1090958 1081959 1072233 1063294 1055703 1048953 1042630 1037097
49346 1037097 1032944 1030357 1029234 1029441 1030636 1032231 1033866 1035605 1037318 1038210 1037485 1035325 1032653 1029920 1026629
49331 1026629 1022188 1016885 1011774 1007860 1005580 1004878 1005508 1007180 1009511 1011967 1014085 1015987 1018605 1023086
49317 1023086 1029904 1038687 1048925 1060485 1073333 1087063 1100983 1114444 1126635 1136150 1141251 1140913
49305 1140913 1135511 1126343 1114619 1101068 1086322 1071255 1056776 1043441 1031464 1020981 1012211 1005372
49293 1005372 1000598 997887 997023 997528 998866 1000727 1003005 1005463 1007593 1008916 1009341 1009123 1008528 1007673 1006615
49278 1006615 1005389 1003871 1001846 999366 997021 995607 995476 996340 997762 999649 1002053 1004658 1006792 1007936
49264 1007936 1007985 1006992 1005012 1002285 999180 995723 991488 986322 981020 976936 974965 975178 977401 981967 989899
49249 989899 1002337 1019391 1039412 1059863 1079250 1097605 1114478 1127153 1132143 1128532 1118808 1106259
49237 1106259 1092594 1078479 1065113 1054047 1045848 1039889 1035372 1031990 1029829 1029295 1031079 1035536 1041964
49224 1041964 1048885 1055106 1060313 1064778 1068893 1072934 1076923 1080695 1084360 1088673 1094679 1102989 1113545 1125875
49210 1125875 1139337 1153212 1166965 1180443 1193714 1206824 1219856 1233040 1246498 1260113 1273931
49199 1273931 1288462 1304207 1320985 1338120 1355183 1372152 1388940 1405230 1420837 1435929 1450764
49188 1450764 1465409 1479624 1492855 1504536 1514745 1524450 1534740 1545937 1557865 1570773 1585358
49177 1585358 1601881 1619883 1639033 1659778 1682907 1708878 1737899 1770242 1806061 1845124 1887084
49166 1887084 1931781 1978566 2025018 2066626 2098330 2116945 2122594 2118243 2108105 2096236 2085834 2078857
49154 2078857 2075848 2076377 2079993 2086612 2095819 2106139 2115622 2123361 2130222 2137948 2147577 2158678 2170015
49141 2170015 2180953 2192224 2205234 2220601 2237607 2255097 2272618 2290534 2309437 2329745 2351510
49130 2351510 2374191 2396823 2418905 2441032 2464218 2488650 2513462 2537703 2561160 2584211 2607254
49119 2607254 2630427 2653812 2677856 2703500 2731595 2762156 2794622 2829182 2867446 2911558 2963163
49108 2963163 3023684 3095143 3180013 3280675 3399747 3540301 3703844 3886448 4076545 4257686
49098 4257686 4416430 4551246 4674567 4801913 4933096 5042594 5092475 5059956 4955011 4811901
49088 4811901 4663733 4523206 4382912 4229628 4058217 3875743 3696151 3532110 3390393
49079 3390393 3272438 3177004 3101685 3043079 2997141 2960077 2929095 2902679 2880447 2862352 2847571
49068 2847571 2834315 2820950 2806985 2792781 2778778 2765448 2753512 2743449 2734901 2727097 2719777 2713225
49056 2713225 2707502 2702209 2697102 2692517 2689020 2686856 2685791 2685354 2685188 2685290 2685921 2687259 2689273 2691944 2695389
49041 2695389 2699734 2705140 2711938 2720226 2729054 2736512 2741042 2742436 2741226 2737622 2731692 2724401 2717663 2713017
49027 2713017 2710515 2709003 2707283 2704908 2702012 2698574 2694078 2688102 2681123 2674340 2668646 2664199 2661074 2659727
49013 2659727 2660441 2662793 2666176 2670475 2675752 2681601 2687464 2693367 2699783 2706833 2714151 2721412 2728429 2734787
48999 2734787 2739937 2743754 2746583 2748702 2750133 2750914 2751028 2749993 2747057 2741968 2735213 2727363 2718579 2708903
48985 2708903 2698627 2688145 2677768 2667953 2659412 2652630 2647420 2643225 2639854 2637719 2637293 2638462 2640533
48972 2640533 2642915 2645704 2649370 2653857 2658274 2661712 2664161 2666359 2668874 2671690 2674567 2677433 2680341 2683330
48958 2683330 2686444 2689751 2693412 2697804 2703428 2710384 2718150 2726315 2735534 2747278 2762510 2780985 2801968
48945 2801968 2825225 2851019 2879434 2910108 2942539 2976350 3011185 3046582 3082106 3117731 3154102
48934 3154102 3192332 3233328 3277268 3323807 3372786 3424612 3479902 3538861 3601019 3665467 3731344
48923 3731344 3798131 3865578 3933428 4001418 4069570 4138235 4207609 4277256 4346305 4414009 4479947
48912 4479947 4543772 4604956 4662766 4716384 4765295 4809912 4851690 4892141 4931529 4968739 5002469
48901 5002469 5032369 5058978 5082895 5104246 5122840 5138646 5152063 5163735 5174042 5182754 5189167 5192479
48889 5192479 5192005 5187299 5178340 5165573 5149530 5130483 5108619 5084358 5058138 5029930 4999327 4966164
48877 4966164 4930731 4893382 4854283 4813660 4771781 4728443 4682782 4634034 4582356 4528623 4473513
48866 4473513 4417132 4359463 4300891 4242153 4183983 4126923 4071354 4017546 3965739 3916296 3869821
48855 3869821 3827022 3788380 3753968 3723540 3696741 3673122 3652145 3633445 3617138 3603678 3593307
48844 3593307 3585841 3581023 3578821 3579164 3581758 3586536 3594080 3605066 3619300 3635740 3653600 3672968 3694109
48831 3694109 3716591 3739501 3762300 3785053 3807845 3830407 3852447 3874087 3895741 3917610 3939393
48820 3939393 3960539 3980798 4000522 4020391 4040771 4061356 4081505 4100876 4119617 4137940 4155788
48809 4155788 4173084 4190203 4207892 4226634 4246259 4266261 4286381 4306721 4327398 4348263 4369001
48798 4369001 4389439 4409783 4430612 4452536 4475680 4499503 4523166 4545994 4567435 4586766 4603212
$$ [...]
##END NTUPLES=NMR SPECTRUM
##END=
