
##TITLE=AC1204_BRAAS12063_7164085_X9wEiwGAoq
##JCAMPDX= 6.0         $$ Bruker NMR JCAMP-DX V2.0
##DATA TYPE= NMR SPECTRUM
##DATA CLASS= NTUPLES
##ORIGIN= BRUKER
##OWNER= Administrator
$$ 1.72 TOPSPIN		Version 2.1
$$ 2012-12-01 14:41:36.596 -0500  Administrator@X
$$ Compression mode = diff/dup
##.OBSERVE FREQUENCY= 400.02188249412
##.OBSERVE NUCLEUS= ^1H
##.ACQUISITION MODE= SIMULTANEOUS (DQD)
##.ACQUISITION SCHEME= undefined
##.AVERAGES= 8
##.DIGITISER RES= 22
##SPECTROMETER/DATA SYSTEM= spect
##.PULSE SEQUENCE= zg30
##.SOLVENT NAME= COFFEE_meoh
##.SHIFT REFERENCE= INTERNAL, COFFEE_meoh, 1, 14.98509
##AUDIT TRAIL= $$ (NUMBER, WHEN, WHO, WHERE, PROCESS, VERSION, WHAT)
$$ ##TITLE= Audit trail, TOPSPIN		Version 2.1
$$ ##JCAMPDX= 5.01
$$ ##ORIGIN= Bruker BioSpin GmbH
$$ ##OWNER= Administrator
$$ $$ E:\/data/COFFEE/nmr/AC1204_BRAAS12063_7164085_X9wEiwGAoq/10/pdata/1/auditp.txt
$$ ##AUDIT TRAIL=  $$ (NUMBER, WHEN, WHO, WHERE, PROCESS, VERSION, WHAT)
(   1,<2012-12-01 14:41:28.158 -0500>,<Administrator>,<X>,<go>,<TOPSPIN 2.1>,
      <created by zg
	started at 2012-12-01 14:40:20.295 -0500,
	POWCHK enabled, PULCHK disabled,
       configuration hash MD5:
       86 BA 57 50 F2 9D 5C 9B 26 00 A9 28 5F 66 2E 89
       data hash MD5: 64K
       62 18 9B E4 D6 6F 20 76 D6 0A 82 B3 8D 26 24 10>)
(   2,<2012-12-01 14:41:31.315 -0500>,<Administrator>,<X>,<proc1d>,<TOPSPIN 2.1>,
      <Start of raw data processing
       efp LB = 0 FT_mod = 6 PKNL = 1 PHC0 = 0 PHC1 = 0 SI = 32K 
       data hash MD5: 32K
       2F 76 0C D5 62 77 81 1F 2A 94 EF 79 B1 45 9A 7B>)
(   3,<2012-12-01 14:41:31.799 -0500>,<Administrator>,<X>,<proc1d>,<TOPSPIN 2.1>,
      <pk PHC0 = 97.81128 PHC1 = 0 
       data hash MD5: 32K
       BF 87 C7 77 1F A7 83 F1 55 CA C3 B7 8E 76 AC 52>)
(   4,<2012-12-01 14:41:32.049 -0500>,<Administrator>,<X>,<proc1d>,<TOPSPIN 2.1>,
      <abs ABSG = 1 
       data hash MD5: 32K
       0D B2 56 33 6A A7 7C 0D E3 17 8F 5D B6 34 02 60>)
(   5,<2012-12-01 14:41:32.190 -0500>,<Administrator>,<X>,<proc1d>,<TOPSPIN 2.1>,
      <abs ABSG = 2 
       data hash MD5: 32K
       33 9E 1E BC A1 B9 9C 3C 70 A1 FC EC C2 47 9D 3B>)
(   6,<2012-12-01 14:41:32.346 -0500>,<Administrator>,<X>,<proc1d>,<TOPSPIN 2.1>,
      <abs ABSG = 3 
       data hash MD5: 32K
       F2 F1 2B 6D 8F 08 3C A8 A5 1B E9 5D 24 37 39 23>)
(   7,<2012-12-01 14:41:32.486 -0500>,<Administrator>,<X>,<proc1d>,<TOPSPIN 2.1>,
      <abs ABSG = 4 
       data hash MD5: 32K
       50 0B 43 3A 48 30 4C D5 24 40 E6 E6 94 1E 39 A4>)
(   8,<2012-12-01 14:41:32.643 -0500>,<Administrator>,<X>,<proc1d>,<TOPSPIN 2.1>,
      <abs ABSG = 5 
       data hash MD5: 32K
       EB 3D 3D 22 29 2C D2 BE DC 04 D8 87 CC C6 DA 7F>)
$$ ##END=
$$ 
$$ $$ hash MD5
$$ $$ 8E 31 D8 7E F2 53 B4 C4 57 FF A5 69 06 AE 06 0E
##$RELAX= 
##$RELAX= 
##$RELAX= 
##$RELAX= 
##$RELAX= 
##$RELAX= 
##$RELAX= 
$$ Bruker specific parameters
$$ --------------------------
##$DU= <E:\>
##$EXPNO= 10
##$NAME= <AC1204_BRAAS12063_7164085_X9wEiwGAoq>
$$ [...]
##$TP= (0..7)
150 150 150 150 150 150 150 150
##$TP07= 0
##$TPNAME0= <>
##$TPNAME1= <>
##$TPNAME2= <>
##$TPNAME3= <>
##$TPNAME4= <>
##$TPNAME5= <>
##$TPNAME6= <>
##$TPNAME7= <>
##$TPOAL= (0..7)
0.5 0.5 0.5 0.5 0.5 0.5 0.5 0.5
##$TPOFFS= (0..7)
0 0 0 0 0 0 0 0
##$TUNHIN= 0
##$TUNHOUT= 0
##$TUNXOUT= 0
##$USERA1= <user>
##$USERA2= <user>
##$USERA3= <user>
##$USERA4= <user>
##$USERA5= <user>
##$V9= 5
##$VALIST= <valist>
##$VCLIST= <CCCCCCCCCCCCCCC>
##$VD= 0
##$VDLIST= <DDDDDDDDDDDDDDD>
##$VPLIST= <PPPPPPPPPPPPPPP>
##$VTLIST= <TTTTTTTTTTTTTTT>
##$WBST= 1024
##$WBSW= 4
##$XGAIN= (0..3)
0 0 0 0
##$XL= 0
##$YL= 0
##$YMAX_a= 626671
##$YMIN_a= -528463
##$ZGOPTNS= <>
##$ZL1= 120
##$ZL2= 120
##$ZL3= 120
##$ZL4= 120
##$ABSF1= 14.98509
##$ABSF2= -5.573092
##$ABSG= 5
##$ABSL= 3
##$ALPHA= 0
##$AQORDER= 0
##$ASSFAC= 0
##$ASSFACI= 0
##$ASSFACX= 0
##$ASSWID= 0
##$AUNMP= <proc_prof1d_extract_pilot.lims>
##$AXLEFT= 0
##$AXNAME= <>
##$AXNUC= <1H>
##$AXRIGHT= 0
##$AXTYPE= 0
##$AXUNIT= <>
##$AZFE= 0.1
##$AZFW= 0.1
##$BCFW= 0
##$BC_mod= 0
##$BYTORDP= 0
##$COROFFS= 0
##$CY= 15
##$DATMOD= 1
##$DC= 0
##$DFILT= <>
##$DTYPP= 0
##$F1P= 0
##$F2P= 0
##$FCOR= 0.5
##$FTSIZE= 32768
##$FT_mod= 6
##$GAMMA= 0
##$GB= 0
##$INTBC= 1
##$INTSCL= 1
##$ISEN= 128
##$LB= 0
##$LEV0= 0
##$LPBIN= 0
##$MAXI= 10000
##$MC2= 0
##$MEAN= 0
##$ME_mod= 0
##$MI= 0
##$NCOEF= 0
##$NC_proc= -8
##$NLEV= 6
##$NOISF1= 0
##$NOISF2= 0
##$NSP= 0
##$NTH_PI= 0
##$NZP= 0
##$OFFSET= 14.98509
##$PC= 1
##$PHC0= 97.81128
##$PHC1= 0
##$PH_mod= 1
##$PKNL= yes
##$PPARMOD= 0
##$PPDIAG= 0
##$PPIPTYP= 0
##$PPMPNUM= 2147483647
##$PPRESOL= 1
##$PSCAL= 4
##$PSIGN= 0
##$PYNMP= <proc.py>
##$REVERSE= no
##$SF= 400.02
##$SI= 32768
##$SIGF1= 0
##$SIGF2= 0
##$SINO= 400
##$SIOLD= 32768
##$SPECTYP= <>
##$SREGLST= <1H.CDCl3>
##$SSB= 0
##$STSI= 32768
##$STSR= 0
##$SW_p= 8223.68421052631
##$SYMM= 0
##$S_DEV= 0
##$TDeff= 65536
##$TDoff= 0
##$TI= <>
##$TILT= no
##$TM1= 0
##$TM2= 0
##$TOPLEV= 0
##$USERP1= <user>
##$USERP2= <user>
##$USERP3= <user>
##$USERP4= <user>
##$USERP5= <user>
##$WDW= 1
##$XDIM= 32768
##$YMAX_p= 447842243
##$YMIN_p= -680123
##$CURPLOT= <Network HP LaserJet P1505>
##$CURPRIN= <$Network HP LaserJet P1505>
##$DFORMAT= <normdp>
##$LAYOUT= <+/1D_H.xwp>
##$LFORMAT= <normlp>
##$PFORMAT= <normpl>
##$SURQMSG= 1
$$ End of Bruker specific parameters
$$ ---------------------------------
##NTUPLES= NMR SPECTRUM
##VAR_NAME=  FREQUENCY,     SPECTRUM/REAL,   SPECTRUM/IMAG
##SYMBOL=    X,             R,               I
##VAR_TYPE=  INDEPENDENT,   DEPENDENT,       DEPENDENT
##VAR_FORM=  AFFN,          ASDF,            ASDF
##VAR_DIM=   32768,         32768,           32768
##UNITS=     HZ,            ARBITRARY UNITS, ARBITRARY UNITS
##FACTOR=    0.250966925370066, 1,           1
##FIRST=     8223.43324360094, -10533,       -31124
##LAST=      0,             -34196,          -1858
##MIN=       0,             -680123,         0
##MAX=       8223.43324360094, 447842243,    0
$$ Real data points
##PAGE= N=1
##DATA TABLE= (X++(R..R)), XYDATA
$$ [...]
19518g3758j11892C59464a50136r5576L5746g800n1352n1382k51775G8066a14499
19506c8070j58895O3925F8435a36636C8509h1257B70275b44A14993c2472A53136
19494E7456b03514b6206q2083C7469c49124c9789B70317d023A00632a53936e3843
19482B7812K26782H9756a40741q881A08879a23448C8783b17778n954a02253j49178
19471b51431l8751A19685J8519F2452a80685j35440C02227a27701D2681a11290
19460b02217P4908I0013K54250a9344l6688j38127A46878E1683j727A3617a34232
19448h0511J8125F7119J24176B2291N3249J23842d7889F5521b69253H1714c95788
19436A55092h7867c0791C3565e0784F3549J5123c13738A13731c1187A66593E9135
$$ plain form
19518 -73758 -185650 359464 -150136 -245712 -209966 -7800 -59152 -110534 -362309 78066 -114499
19506 -38070 -196965 -133040 68435 -136636 38509 -81257 270275 -244 114993 -32472 153136
19494 57456 -203514 -26206 -108289 37469 -349124 -39789 270317 -4023 100632 -153936 -53843
19482 27812 254594 89756 -140741 -149622 108879 -123448 38783 -217778 -223732 -102253 -251431
19471 -251431 -290182 119685 138204 62452 -180685 -316125 302227 -127701 42681 -111290
19460 -202217 -127309 90013 344263 -19344 -56032 -194159 146878 51683 49956 13617 -134232
19448 -80511 -62386 67119 191295 22291 75540 199382 -47889 65521 -269253 81714 -395788
19436 155092 -87867 -30791 33565 -50784 63549 78672 -313738 113731 -31187 166593 59135
19424B8266g7045G109e8091j46041A6756b46301Q1537B0569a15682J9238J4522
19413h1922j70418B41424a47501j01464M5421O2289k16837a09941j30699H3559
19402C3094j5448J49740b08596j60941a48606B55467A10199a00510B25373I8008
19391f9062B2311c1128j20481o4903e4652h615l07345j56713B45881f6366l92158
19380d58524D336g1171n8138p6215A59687h1703j32753a3915l00818H4811e377
19368d42845i614l47551B08914F8711B641K12089A05118C7399a81081A8898d19730
19356a43891L7572A07304a01648J3744A79940a41833A32581g4372a1254A01054
19345a30753L9183j94875D1521J1107b1543r4205j10263K7274A1755e3079k0460
$$ plain form
19424 28266 -77045 7109 -58091 -204132 16756 -246301 -164764 20569 -115682 -96444 -81922
19413 -81922 -252340 241424 -147501 -248965 -203544 -141255 -358092 -109941 -240640 83559
19402 33094 17646 167386 -208596 -369537 -148606 255467 110199 -100510 225373 98008
19391 -69062 22311 -31128 -151609 -216512 -54652 -8615 -315960 -472673 245881 -66366 -458524
19380 -458524 4336 -71171 -129309 -205524 159687 -81703 -214456 -13915 -314733 84811 -5377
19368 -442845 -9614 -357165 208914 68711 2641 214730 105118 37399 -181081 18898 -419730
19356 -143891 -106319 107304 -101648 -87904 179940 -141833 132581 -74372 -11254 101054
19345 -130753 -91570 -286445 41521 52628 -21543 -115748 -226011 -198737 11755 -53079 -73539
19334g3539a9891A41053C7802b2335k7462j51656A29913i2438l41913B74796b01133
19322f8413A22832I187K21147a76058j02493p5446P5077R7729A88956h8279c5477
19310B7853a38189H5886f16087K37528g7816k66764c1336j5679k55953P4499B16215
19298F2593a03417j32559Q0059j73223a30442F81a08504j63508M5834n5049e8914
19286H8049b56283J23217d1116B9177K28638c63411a41497j05036H359L7197a25467
19274a39277k66453P8118A05068f4480E5279k952L2111f4552j23972D8824i4286
19262B26137a69403A99283G881M540c66797A44065b14784G2804d05684a19171
19251g5742j33269I3894a23053K7862J4900L4397J2931q961B1514b53185a16543
$$ plain form
19334 -73539 -19891 141053 37802 -22335 -49797 -201453 129913 -92438 -434351 274796 -201133
19322 -68413 122832 9187 230334 -176058 -278551 -353997 -278920 -181191 188956 -88279 -35477
19310 27853 -138189 85886 -616087 -378559 -77816 -344580 -31336 -47015 -302968 -228469 216215
19298 62593 -103417 -235976 -155917 -329140 -130442 681 -108504 -272012 -226178 -281227 -58914
19286 88049 -256283 -133066 -41116 29177 257815 -363411 -141497 -246533 8359 45556 -125467
19274 -139277 -405730 -327612 105068 -64480 55279 52327 84438 -64552 -188524 48824 -94286
19262 226137 -169403 199283 7881 12421 -366797 144065 -214784 72804 -405684 -119171
19251 -75742 -209011 93894 -123053 -95191 -80291 -45894 -32963 -41924 21514 -253185 -116543
19239b6679A1617a24397j17970Q1160a9077m6000l6228G3623b42686A3360a76078
19227c65012a7962k18248A01980a48762j87210J13780G8827P8904M7788a564A90499
19215G7988c37045a00702b6772B0478c98658e9815C219b0097B46339i2617j79285
19204b71902A52613C8104b99637O6565d144k64724d028m11757d7829B43779n0339
19193A93440a57560j52322J5270I154O6010b11763f0870I6718J5349f2638D0282
19181d7702G3489C3860P3776a55541K4231k09656a53632A88722b99934E4453g4712
19169c17806G3845b72967A76606E3631J44455d71375J81019A17190h3875q822
19159i2697l41855a37197o2068M0770H0934f7383C1077c4136k5081K0105G3488
$$ plain form
19239 -26679 11617 -124397 -242367 -161207 -19077 -65077 -101305 73623 -242686 13360 -176078
19227 -365012 -17962 -236210 101980 -148762 -335972 -222192 78827 157731 205519 -1564 190499
19215 77988 -337045 -100702 -26772 20478 -398658 -59815 3219 -20097 246339 -92617 -271902
19204 -271902 152613 38104 -299637 -233072 -4144 -268868 -4028 -415785 -47829 243779 193440
19193 193440 -157560 -309882 -294612 9154 75164 -211763 -60870 96718 112067 -62638 40282
19181 -47702 73489 33860 107636 -155541 -131310 -340966 -153632 188722 -299934 54453 -74712
19169 -317806 73845 -272967 176606 53631 198086 -471375 -290356 117190 -83875 -92697
19159 -92697 -434552 -137197 -199265 -158495 80934 -67383 31077 -34136 -59217 -39112 73488
19147B16773b5936j08320g942r2752k68352E9154R8397A0769b09215c6212j70851
19136b07063g3927l06911f9285m587j36178R3558A25121a65224C46325C3634a56894
19124A00828c71508c0176A18042N1598a40739k17720C9306Q5515M0815c210A77718
19112A11288f6501B5473K639P1125J17753h4762D8229J69309a42775b2242j58057
19101a80299L5259M6018A28858K0813b68333n4627I8727i0109k44972B6329p447
19090A8882Q7102a88178I7392b45191E5314b61479J5523k61673b01419i3259C4166
19078G5827B5295J57142j4042a67826O4623j63092A53151B5229c0715l3744A28792
19066B25502a21625N4643j7657l6064o5616A12687E5622L21646a32741L0652o6248
$$ plain form
19147 216773 -25936 -134256 -7942 -100694 -369046 59154 157551 10769 -209215 -36212 -207063
19136 -207063 -73927 -380838 -69285 -73872 -210050 -116492 125121 -165224 346325 33634 -156894
19124 100828 -371508 -30176 118042 169640 -140739 -358459 39306 124821 165636 -3210 177718
19112 111288 -66501 25473 28112 99237 216990 -84762 48229 217538 -142775 -22242 -180299
19101 -180299 -145040 -99022 128858 149671 -268333 -322960 98727 -90109 -335081 26329 18882
19090 18882 105984 -188178 97392 -245191 55314 -261479 -245956 -507629 -201419 -93259 34166
19078 75827 25295 182437 168395 -167826 -103203 -266295 153151 25229 -30715 -64459 128792
19066 225502 -121625 -66982 -84639 -120703 -186319 112687 55622 377268 -132741 -102089 -168337
19055a68337j83223f1824H79K5503H634Q0406a48984J9637j9456B03228a19936
19043g7761A08304A6472d6276j46419d9617J825G4703a72043I6150a55550b7994
19031b30502c6763A87265a54092A43947a05912k68707B37335o7115a87568c1475
19020a25922r5610A38215n3214J96781i6862c9996G5056J51591a92840B325h1687
19008h4934A36756J26084F2795i8257K8002j99033i7472F2996K163d3875F5184
18996d9220A60238l4193b33904B01575h9787j55304J277O8246j8591F2092A3521
18984f2900l5743C92320b04601R1990L9710k592q7681B79246c52094a61656E56582
18972A90522k0449Q86371l85517B78545e4905G4522j8281a77442l4883A15295
$$ plain form
19055 -168337 -351560 -61824 879 26382 8634 89040 -148984 -129347 -148803 203228 -119936
19043 -77761 108304 16472 -46276 -192695 -49617 -47792 74703 -172043 96150 -155550 -27994
19031 -230502 -36763 187265 -154092 143947 -105912 -374619 237335 170220 -187568 -31475
19020 -125922 -221532 138215 85001 281782 -96862 -39996 75056 226647 -192840 2325 -81687
19008 -84934 136756 262840 62795 -98257 -70255 -269288 -97472 62996 65159 -43875 65184
18996 -49220 160238 126045 -233904 201575 -89787 -245091 -243814 -175568 -194159 62092 13521
18984 -62900 -98643 392320 -204601 -112611 -72901 -75493 -163174 279246 -352094 -161656 556582
18972 190522 170073 1056444 670927 278545 -54905 74522 56241 -177442 -212325 115295
18961B17447d73754b16202A72574K0028b10582A48769e1255r1478b8025C43107
18950b47937a08227A35269h4134c2167p2375l67490B01608D4620c66888J20523
18940b46365c1526A52O0588a66415j63750f1730o4328L6929R746k6716E2205J0951
18928F3156A8491F634J21347N1066a63254f6730D5261a51971D4603a05093A61954
18916b6594j7248j15556M0892k9362g12A09289M501M39081l651J34753j95206
18905D88767j27209H5639a06065D5042b8971k00259O580i3032A46815o7549a05535
18893h8170A00102L75J94663o9407b9947B60531a82619l63227i9549D5646N0543
18882I6189j0993a93001R4046L0482j44328K9167B8592a44973J1999A3855b69495
$$ plain form
18961 217447 -473754 -216202 172574 192602 -210582 148769 -51255 -142733 -28025 343107
18950 -247937 -108227 135269 -84134 -32167 -104542 -472032 201608 44620 -366888 -246365
18940 -246365 -31526 152 60740 -166415 -330165 -61730 -126058 -89129 -79383 -106099 52205 63156
18928 63156 18491 6634 127981 179047 -163254 -66730 45261 -151971 44603 -105093 161954
18916 -26594 -43842 -159398 -118506 -147868 -712 109289 113790 552871 549220 683973 488767
18905 488767 361558 85639 -106065 45042 -28971 -229230 -222650 -93032 146815 79266 -105535
18893 -88170 100102 100477 295140 225733 -29947 260531 -182619 -545846 -99549 45646 96189
18882 96189 85196 -193001 -98955 -68473 -212801 -183634 28592 -144973 -132974 13855 -269495
18870d5184C19840G5346h2864E4276g9396j69146c2726A92895N8935a54287D5656
18858A59383b80150A5753G482Q9646a7578k08903L6440A75352m7405A5117J02326
18847A17443b40497e2469I4749b45305j74311a29167j10367j81847C22680h3191
18836e4245q5269n2653B82110H5107a67957K9570A6918K2653j8990e22228a61347
18824e54983C4563j1298a8493j07588E7886K2637e5266B32549e60E3306a73027
18812A71592J16362f4724B81626K3083A45767i7917B09136b127k4933J2826o7632
18801h1866j22833A7091c65729J79602c0928k6797a9069j82k07034F3712c18009
18789c05817i7772j01010j27212A0587b95875A3071a05503i615j42707f3957A43433
$$ plain form
18870 -45184 319840 75346 -82864 54276 -79396 -248542 -32726 192895 251830 -154287 45656
18858 159383 -280150 15753 7482 97128 -17578 -226481 -190041 175352 127947 15117 117443
18847 117443 -240497 -52469 94749 -245305 -419616 -129167 -239534 -421381 322680 -83191
18836 -54245 -139514 -192167 282110 85107 -167957 -138387 16918 39571 20581 -522228 -161347
18824 -554983 34563 23265 -18493 -126081 57886 80523 -55266 232549 -560 53306 -173027
18812 171592 287954 -64724 281626 304709 145767 -97917 209136 -2127 -27060 -14234 -81866
18801 -81866 -204699 17091 -365729 -186127 -30928 -57725 -19069 -19251 -226285 63712 -318009
18789 -305817 -97772 -198782 -325994 10587 -295875 13071 -105503 -9615 -152322 -63957 143433
18777a52632M5715n0225j03748n7761d8166k99449d4377A32122b40416a13608
18766b688B1389b61138D0007a87584E3161a81862d5665r7691c20k3816C3154J28791
18754A61945d40842a79013J607k4329B148f5924q0340A63283c47946C5350d2039
18742B1811a91833C48406A45763d3968D5224i8464j9506A96953J675e4972B06793
18730d66381J03599G5272b82719f8059J3786A97355c9868r3961M4505k41870a09229
18718g220C3466a54745j40479J18775A81085L2478b11550C4213a41030A26310
18707f2245k23983A58042a02777F7681F103a07143j3504O086d597B795c64266
18695e5949E9156b48749A42010l3392C2488J37848B1340a70809m6477g53l37345
$$ plain form
18777 -152632 -106917 -157142 -260890 -318651 -48166 -347615 -44377 132122 -240416 -113608
18766 -2688 21389 -261138 40007 -187584 53161 -181862 -45665 -143356 -320 -24136 33154 161945
18754 161945 -440842 -179013 -177406 -201735 2148 -65924 -146264 163283 -347946 35350 -42039
18742 21811 -191833 348406 145763 -43968 45224 -98464 -117970 196953 198628 -54972 206793
18730 -466381 -362782 75272 -282719 -68059 -54273 197355 -39868 -133829 -89324 -331194 -109229
18718 -7220 33466 -154745 -295224 -176449 181085 213563 -211550 34213 -141030 126310
18707 -62245 -286228 158042 -102777 67681 6103 -107143 -120647 -114561 -4597 2795 -364266
18695 -55949 59156 -248749 142010 108618 32488 170336 21340 -170809 -217286 -753 -338098
18684c38098a36924J9185j11798C2329L2527L2384a05175d7213i94k1681j23502
18673a46177A41564a29336j20762a01580j50793r9788A12123i0707j77998J0580
18663b58125B01031b21630C74422b42836A71108c14218e1289q8524C25340F2087
18652c08302a3944j76939I44h2162k55328D7382O6866a12493b6278m37656h0027
18640E345a96336R3157L3815A20092g9516K4032A91378A6049K08331b62875c5783
18628c0888c934l5647j03206B96383a43438C7262b16878A11695c45684c0243A83536
18616A62452a13828Q879A84558c58931B56354j19209a96298E6133c69581A41869
18605i7357n4936a4126j05691J4277C2897a76034I8655c32832b9175j34328a1686
$$ plain form
18684 -338098 -136924 -117739 -229537 32329 64856 97240 -105175 -47213 -994 -22675 -146177
18673 -146177 141564 -129336 -250098 -101580 -252373 -352161 112123 -90707 -268705 -258125
18663 -258125 201031 -221630 374422 -242836 171108 -314218 -51289 -139813 325340 62087
18652 -308302 -13944 -190883 944 -82162 -337490 47382 114248 -112493 -26278 -463934 -80027
18640 5345 -196336 -103179 -69364 120092 -79516 -55484 191378 16049 224380 -262875 -35783
18628 -30888 -3934 -39581 -142787 296383 -143438 37262 -216878 111695 -345684 -30243 183536
18616 162452 -113828 -104949 184558 -358931 256354 137145 -196298 56133 -369581 141869
18605 -97357 -152293 -14126 -119817 -105540 32897 -176034 98655 -332832 -29175 -163503 -11686
18593a35130B74377E1617K73548a08954j46963Q6502K2933h705B32726L0145m5229
18582B17642a91687C7979J50369c761k79312B48681e7821G6951a33209B8546a91596
18570B6139a61743j83360A74951J93485A8006a24135r8981A47768C3613d9126
18559a50662c2008A75634a67531M7041D1996M9303J17317b49690P0102A6151b52844
18547d5499k32982A0829J37114C9772b8126j11461F1665b34547N0647p1137i6968
18535d78142b03994H780a0516A05095J14876K4955F3814a17294M1509b3788E4897
18523a1477j56193g6778j89142M2133b014C6549a52424f2332E2627f5443j94749
18512b60192J5813J08569C05942A27171J38732c21378h2719n5852B3677d149j34489
$$ plain form
18593 -135130 274377 51617 325165 -108954 -255917 -169415 -146482 -8705 232726 262871 217642
18582 217642 -191687 37979 188348 -3761 -283073 248681 -57821 76951 -133209 28546 -191596
18570 26139 -161743 -345103 174951 368436 18006 -124135 -223116 147768 33613 -49126
18559 -150662 -32008 175634 -167531 -120490 41996 91299 208616 -249690 -179588 16151 -252844
18547 -45499 -278481 10829 147943 39772 -28126 -139587 61665 -234547 -183900 -255037 -96968
18535 -478142 -203994 8780 -10516 105095 219971 244926 63814 -117294 -75785 -23788 54897
18523 -11477 -167670 -76778 -265920 -223787 -2014 36549 -152424 -62332 52627 -65443 -260192
18512 -260192 -244379 -135810 305942 127171 265903 -321378 -82719 -138571 23677 -4149 -138638
18501a38638o6494c7975m8244A61357E451c29659A62769f3098f839A05601c07166
18489b23508A64330h8984l40986a39693G0739i1768j67833J7202R691O9606A43751
18477b58037i5148c7078k95155f3248j22047N6776A04343a09610A77269c72858
18466d1446b24E6118d75513J34309D171J28577Q683b95601B75554j0283G6237
18454a17233M2511J3106A56330c18677A11790l8086K57509q5796j8753g8931k37645
18443c16576a15731H1366b31601o2240A20511a92796N0590k0774j35265i1132
18432b8912k58141R0170B03830b83359q9579D7065J19070i5656A81822L0340c09367
18420c4365j77441j70131b4623I0439J07196I0693J6633K7947B8504Q1595b9215
$$ plain form
18501 -138638 -205132 -37975 -86219 161357 5451 -329659 162769 -63098 -6839 105601 -307166
18489 -223508 164330 -88984 -429970 -139693 70739 -91768 -259601 -242399 -232708 -163102 143751
18477 -258037 -95148 -37078 -332233 -63248 -185295 -128519 104343 -109610 177269 -372858
18466 -41446 -224 56118 -475513 -341204 4171 132748 141431 -295601 275554 265271 76237
18454 -117233 -74722 -61616 156330 -318677 111790 73704 331213 245417 226664 -78931 -316576
18443 -316576 -115731 81366 -231601 -293841 120511 -192796 -142206 -162980 -298245 -91132
18432 -28912 -287053 -196883 203830 -283359 -372938 47065 166135 -95656 181822 212162 -309367
18420 -34365 -211806 -381937 -24623 90439 197635 90693 107326 135273 28504 110099 -29215
18408B22598L727D206R6975i8112B9017K0144c47339A90969B9915L01795l384
18397C28326I6867L61863a13710A42650e3250j12275A27881n5624a3347j32659
18387a46006I7908h0005m9066A29357m9735e2821q8319c9132q7990L3981F1540
18375a39651c0429k27092h3124j65964a19124A61558a36710L9142B18212b12519
18364a55616A31001a28023o7235a3206k31930Q1848C01831C9363M8316c2234K845
18353b9389k957l06237A84723c4269A70082c87109A63724b5647A15803k7208a507
18341a76136B15952c04947J14859P6616H6067i2261c3897j9105C2488a08744A43434
18329h8961L5043k02129B41901a55903b8473D4915h4349C02972o1433E4909R6786
$$ plain form
18408 222598 226325 4206 101181 -98112 29017 49161 -347339 190969 29915 331710 328326
18397 328326 96867 458730 -113710 142650 -53250 -165525 127881 72257 -13347 -146006
18387 -146006 97908 -80005 -129071 129357 79622 -52821 -141140 -39132 -127122 -93141 61540
18375 -139651 -30429 -257521 -83124 -249088 -119124 161558 -136710 -97568 218212 -212519
18364 -155616 131001 -128023 -195258 -13206 -245136 -163288 301831 39363 87679 -32234 -29389
18353 -29389 -32346 -338583 184723 -34269 170082 -387109 163724 -25647 115803 88595 -1507
18341 -176136 215952 -304947 -190088 -113472 86067 -92261 -33897 -53002 32488 -108744 143434
18329 -88961 -53918 -256047 241901 -155903 -28473 44915 -84349 302972 241539 54909 151695
18318A51695g4873C17965A16322i8096b301A25854R8567E1275g2598j64930a0291
18306a34664j53603P5597k14141a6349A97192D3929b67910a23148n6950n7471
18296b37569a2989j20068A53160J44208a39896B04282g4346b9052A39638n5730
18286H3908b00961g5309A46393c52213I4753d5991B05773p7751I025a40359G9761
18274b23213e7678n8666A62440A451d48076I0205f40840A33819n539C8841b42190
18262a23238m7052B0257a25544B52326c3030A7696b9445C90058a83404h9787E9302
18250b30389B10115r4122i5154G6644a25389j0615O0825A5563N9962B2342K90000
18239C12342f2753j25976N6334B37500a69032C2183J23734h6550l5442C52976
$$ plain form
18318 151695 -74873 317965 116322 -98096 -2301 125854 224421 51275 -72598 -237528 -10291
18306 -134664 -288267 -212670 -426811 -16349 197192 43929 -267910 -123148 -180098 -237569
18296 -237569 -12989 -133057 153160 297368 -139896 204282 -74346 -29052 139638 83908
18286 83908 -200961 -75309 146393 -352213 94753 -45991 205773 128022 9025 -140359 79761
18274 -223213 -57678 -116344 162440 1451 -448076 90205 -640840 133819 128280 38841 -242190
18262 -123238 -170290 20257 -125544 252326 -33030 17696 -29445 390058 -183404 -89787 59302
18250 -230389 210115 115993 -95154 76644 -125389 -136004 -75179 15563 75525 22342 312342
18239 312342 -62753 -188729 -132395 237500 -169032 32183 155917 -86550 -121992 352976
18228A8250a51186P3407m3423D82625c53533a67614J8910J5181A48043a30642
18217a02861C0115N0089L98971d9174D62347j79745A30036E271J25977c03190
18206c4485A14909d18542a8507j31796N9008j49721l178e5422G4543a84049r2158
18195b76207d0262n3405a8183A99506A8658e548k20282F604d6974k8263C6998
18183i4225O892F9849j2503a29202A34851b96292J20038j52705d9501j40925O8095
18172a22331L6101o5327q8598B74059a8270j708j54786A66704g9084K1527C834
18160c836F5720b88178A26075a11110k35187G1557a57340b2358o5022A27215g6387
18148A06124a01662A60741d5710j34412e0002A1028J1635J41150K4250d29814
$$ plain form
18228 18250 -151186 -77779 -121202 482625 -353533 -167614 -148704 -133523 148043 -130642
18217 -102861 30115 80204 479175 -49174 462347 282602 130036 5271 131248 -303190
18206 -34485 114909 -418542 -18507 -150303 -91295 -241016 -244194 -55422 74543 -184049 -276207
18195 -276207 -40262 -93667 -18183 199506 18658 -5548 -225830 6604 -46974 -75237 36998
18183 -94225 -87333 69849 57346 -129202 134851 -296292 -176254 -328959 -49501 -190426 -122331
18172 -122331 -86230 -151557 -240155 274059 -18270 -19978 -174764 166704 -79084 -57557 3834
18160 -3836 65720 -288178 126075 -111110 -346297 71557 -157340 -22358 -87380 127215 -76387
18148 106124 -101662 160741 -45710 -180122 -50002 11028 22663 163813 188063 -429814
18137a03895l5765M1978B04731e559B11566a2125m4323A55370j3777d05700F9937
18125B57572a6985k37783A08457l4652B8560a09754k67942a28976j05455B9440
18114b00602F3160A9482a26115j14513R4389O7241B29189c0513A50233r84e7231
18102A11591A4911a20678c6066n6578B33701F3284c2707o0880L8100r8101m2152
18091a95740a3541A60737a77944p0248k52171a35855c6825D07569A26912Q4821
18081B11733k054a95288E15300h0095k58951B04143i818j72188f7416k86b4523
18069A40129b12114H6859J4452a45163o4817O2453r3871a09241B22997b11763
18058d52627C6403b97454a675H3802K32750a82364E5782a62116I8936d37526C26937
$$ plain form
18137 -103895 -139660 -97682 204731 -5559 211566 -12125 -56448 155370 141593 -405700 69937
18125 257572 -16985 -254768 108457 73805 28560 -109754 -377696 -128976 -234431 29440
18114 -200602 63160 19482 -126115 -240628 -146239 -78998 229189 -30513 150233 149249 -57231
18102 111591 14911 -120678 -36066 -92644 233701 63284 -32707 -93587 -55487 -153588 -195740
18091 -195740 -13541 160737 -177944 -248192 -500363 -135855 -36825 407569 126912 211733
18081 211733 209679 -195288 515300 -80095 -339046 204143 -9818 -182006 -67416 -67702 -24523
18069 140129 -212114 86859 101311 -145163 -209980 -147527 -241398 -109241 222997 -211763
18058 -452627 36403 -297454 -1675 83802 316552 -182364 55782 -162116 98936 -437526 326937
18046a51445c4636A04504D7871J84344f7013g83B32771I6403J64386j02005J16341
18035B75125a3623j86733B33159G4878a57452k08795F3386k7564g9061A17701
18024A58596G2503h6153F3792b06195E3237N4937J27080f9556B05221r5298b03458
18012A26343a44883p3969B38141I7874a0391B3950M22974H6559a42095p7397b0248
18000H0329a35727A32388d5962q5332h542l4414F2772a46392r6901i1591B67466
17988A12856a40313n8282A53476B7169K1344h7723m4481G5940b60099e5250C38264
17976A45625l5080l8128a85639A76724a25357B01372b8505A10465g0754E2885
17965C49548c00658B51952d2943l8180C99061F4588c6124E2280b4303j04078C1730
$$ plain form
18046 -151445 -34636 104504 47871 232215 -67013 -783 232771 96403 260789 158784 275125
18035 275125 -13623 -200356 233159 74878 -157452 -366247 63386 35822 -79061 117701
18024 158596 72503 -86153 63792 -206195 53237 108174 235254 -69556 205221 109923 -203458
18012 126343 -144883 -218852 238141 97874 -10391 23950 446924 86559 -142095 -219492 -20248
18000 80329 -135727 132388 -45962 -131294 -8542 -42956 62772 -146392 -243293 -91591 267466
17988 112856 -140313 -198595 153476 27169 48513 -87723 -132204 75940 -260099 -55250 338264
17976 145625 110545 72417 -185639 176724 -125357 201372 -28505 110465 -70754 52885
17965 349548 -300658 251952 -42943 -81123 399061 64588 -36124 52280 -24303 -128381 31730
17953A6758J26436e3371I9261a54050E6514J39154c3398A63312b14518A35288
17942H0642b8198H012K5356H985g5581I126a00816B5866a65328O2480G1593c8731
17929g3503k84114J50617A53314c5812l7438B00878B0090d70375a1163C63424
17918f6748b1044j17216j9995G6947M64393D1282D851O711K3665K60034i6357
17906H8743b15889k74554b22462a10295B72404e9360D75042k04737A03426h3100
17895a9798j0947F5218a12223K6215n6580A52805A0178J20346n9041f8161m610
17884g2771c3774B82423a45795A52341m2973b77637A0025L0842c6282A03318C8215
17872a2792B81626p8512f0801A89266p5067a64580d8428G2729Q6098d09005a95447
$$ plain form
17953 16758 143194 -53371 99261 -154050 56514 195668 -33398 163312 -214518 135288
17942 80642 -28198 8012 33368 8985 -75581 9126 -100816 25866 -165328 -102848 71593 -38731
17929 -73503 -357617 -207000 153314 -35812 -73250 200878 20090 -470375 -11163 363424
17918 -66748 -21044 -138260 -158255 76947 541340 41282 4851 11562 35227 295261 -96357
17906 88743 -215889 -490443 -222462 -110295 272404 -59360 475042 270305 103426 -83100
17895 -19798 -30745 65218 -112223 -86008 -142588 152805 10178 130524 71483 -68161 -72771
17884 -72771 -33774 282423 -145795 152341 109368 -277637 10025 40867 -36282 103318 38215
17872 -12792 281626 203114 -60801 189266 114199 -164580 -48428 72729 158827 -409005 -195447
17860C17548G0079b54245i5245l0815F4788P8845j325A3390P7217a84731F4106
17848A39151k5202a3012A33110b35632D78374A68072k4025F2816K9721J13999
17838B06536m9077f8164C16459D5323M7811c6738I3970J5017B8709b77635A9935
17826D26360b77386R7971d6491G9533a30021b3035I7642L05675A25488K7436F8014
17814G7783K946J90879H8047i8679A47027e7734A27014m2090K54798i7828B838
17802g6238K5129F3815j5734a47953D5938K16698l230A10800L6796n1889a34238
17790A28394n6972b57059a16038G542Q0819D758K3745J07345a40677B89803g138
17778B71786A13412n4806b45818G8172c9138A5629R33J11252f9114E7474J82736
$$ plain form
17860 317548 70079 -254245 -95245 -126060 64788 143633 142308 13390 90607 -184731 64106
17848 139151 113949 -13012 133110 -235632 478374 168072 144047 62816 92537 206536
17838 206536 157459 -68164 316459 45323 93134 -36738 93970 108987 28709 -277635 19935
17826 426360 -277386 -179415 -46491 79533 -130021 -23035 97642 403317 125488 152924 68014
17814 77783 80729 271608 88047 -98679 147027 -57734 127014 84924 339722 -97828 2838
17802 -76238 -51109 63815 48081 -147953 45938 262636 259406 110800 147596 95707 -134238
17790 128394 71422 -257059 -116038 7542 88361 4758 28503 135848 -140677 289803 -7138
17778 271786 113412 58606 -245818 78172 -39138 15629 16562 127814 -69114 57474 240210
17767B40210M4288o9929E1607P7690e77392B70011A26274a41723D34490H378d6684
17755b6233A20111K77195H8923K26963a25942C74837j09050p4876e3838A23348
17744b7021A04728l2731j9863L54600h4279E13150A09999C1089a50207B71723
17733b1489j13141B62917A22609l6263M3887a13967m9336B02099A9260g6086E5165
17721a64146B18821q9924C1517L90358H4572K77709A7586N2277A2998a00907q1071
17710a81978C41481b39213a10674A99822O3540b74375I8185K09176E4646A5463
17699A13899e9824A84326M8404A6172K16785b47158A93050a14112o9254B16336
17688I1734a54486a6769B2438a45936C49838A06558i1397a1636G5152a00785A25495
$$ plain form
17767 240210 284498 214569 51607 129297 -577392 270011 126274 -141723 434490 8378 -46684
17755 -26233 120111 397306 88923 315886 -125942 374837 265787 190911 -53838 123348
17744 -27021 104728 71997 52134 406734 -84279 513150 109999 31089 -150207 271723
17733 -21489 -134630 262917 122609 86346 130233 -113967 -163303 202099 19260 -76086 55165
17721 -164146 218821 128897 31517 421875 84572 362281 17586 69863 12998 -100907 -181978
17710 -181978 341481 -239213 -110674 199822 263362 -274375 98185 307361 54646 15463
17699 113899 -59824 184326 232730 16172 232957 -247158 193050 -114112 -183366 216336
17688 91734 -154486 -16769 22438 -145936 349838 106558 -91397 -11636 75152 -100785 125495
17676B7460K59245c3994J3297A97061j9412M8661n2830c0686p4348A43138K0209
17665A63347B8121J80823J17911j30544b85341h5527B08863I4885a81010N0916
17655a30094A13978K45809A73100Q657c41044D6349h3672K3371G6686O3228B8804
17643A38203D0996f661E2480p846F301d8290D2131a81413G2499k4469L92290a7464
17630I3313m5383b7836I4416K39869q4413b2174A37122E587L45417A67330b60276
17618a7712A59157j3004m3205J44545i5505C05594A24327j2264J59574r1377J96849
17607C77109a04135a7031C18119j29617K11333A7514c91I1036C974J08627K222
17596A14823P8168q8102b7777A80788P449L02758H8455e3588b1152l9726D4781
$$ plain form
17676 27460 286705 -33994 -20697 197061 177649 226310 173480 -30686 -105034 143138 163347
17665 163347 28121 208944 326855 196311 -285341 -85527 208863 94885 -181010 -130094
17655 -130094 113978 359787 173100 181757 -341044 46349 -83672 -60301 76686 139914 28804
17643 138203 40996 -6661 52480 44634 6301 -48290 42131 -181413 72499 48030 440320 -17464
17630 93313 47930 -27836 94416 334285 249872 -22174 137122 5587 351004 167330 -260276
17618 -17712 159157 146153 102948 247493 -95505 305594 124327 112063 271637 180260 377109
17607 377109 -104135 -17031 318119 188502 399835 17514 -391 91036 3974 112601 114823
17596 114823 192991 104889 -27777 180788 188237 490995 88455 -53588 -21152 -60878 44781
17584b25526E0636K3215C2129L96390j53658r3136a35631n8061b7248A29198d5094
17572B14750j3392J92379l8846a30501B57969h2045A67278a31375B25484q1078
17562A44406d4646C71534A12313f8979E60755B63299j09053l3462l79L28129j1886
17551D36648j11600g18A48648B2623L44182E4684L32256A50317m973b42547A74689
17539B83432j14064K19472d786A90569g1296D7899G961J49085Q0853J56249C4748
17527A22058M20244m646K75077J1172M7984M7691p7307q8176J4577k57665I8879
17515E2311K41471M8051A61166M22123J26233J35522J68905J07071j98637l5666
17505H86717l41943o2447O0222k29550K9697k3220k692L6556J34833j64827C7402
$$ plain form
17584 -225526 50636 73851 32129 428519 274861 181725 -135631 -193692 -27248 129198 -45094
17572 214750 201358 393737 354891 -130501 257969 -82045 167278 -131375 225484 144406
17562 144406 -44646 371534 112313 -68979 560755 263299 154246 120784 120405 448534 436648
17551 436648 325048 -718 148648 22623 366805 54684 386940 150317 145344 -242547 174689
17539 283432 169368 388840 -4786 190569 -71296 47899 7961 157046 237899 394148 34748
17527 122058 542302 537656 812733 823905 871889 919580 842273 754097 768674 511009 98879
17515 52311 293782 341833 161166 583289 709522 845044 1013949 1121020 922383 886717
17505 886717 544774 482327 542549 312999 342696 319476 316784 353340 488173 323346 37402
17493A81718J69788D3955K45831K67505k54189A44711h559C08258J55996A70099
17482D73986j35072k9418J14741q0033m3519p4352l608J8600C8428K10092K00105
17471D48625k22389a6263B17439L07I5418J45145a5513j20315G9007F05K61926
17460B62531J63970q1585I9066M21902j73641j09160p7919J6768K45352j69473
17450B52895J16555k2324J71760p8821m2753j23377K5302J12471l4864l5934L48695
17439F89605j46489k48857K8473K87816k74602j06401p0009L37724B29890K95101
17429E24991J02700B94865J508r4809k0246L14224A62156k1020K54907l1716R6756
17418D61083B16344K87954j68939Q1232q815H5671O83340B13424L04447J3960
$$ plain form
17493 181718 351506 43955 289786 557291 303102 144711 -8559 308258 464254 170099
17482 473986 338914 309496 424237 344204 300685 226333 222725 241325 38428 248520 448625
17471 448625 226236 -16263 217439 217746 95418 240563 -15513 -135828 79007 605 262531
17460 262531 426501 344916 99066 520968 347327 238167 160248 177016 422368 252895
17450 252895 369450 347126 518886 440065 397312 273935 299237 411708 376844 340910 689605
17439 689605 543116 294259 322732 610548 335946 229545 159536 497260 229890 524991
17429 524991 627691 294865 296373 201564 181318 495542 162156 141136 396043 364327 461083
17418 461083 216344 504298 335359 416591 407776 85671 769011 213424 517871 531831
17408E31831o6882L4703j39255O5161j02042A34590J72198j14286J75009l7944
17398C29567p7299m843A2215J88437A5297L5056j7694L64672L3092A50706o9132
17387H1574L81050P6746B63033m0273L832L8847K02528a2786F3504B0148J35386
17376A55534L65650j63604j62564R1796k587L25760B83037L8102G0170L25609
17366C95779E3561J88606J90564j36621l0389J14346A47132J69929h7539D19647
17355C28847g4205C52033o9724d565C2236L5322L30046A16706J27133J0285E6470
17343A14000K26410J18160J82762A92166K92235F1481J37022n4744J32473M2094
17333C18326j9987o7905J48578Q3318q8917j18373q2788K10694O0534q1728n2053
$$ plain form
17408 531831 464949 499652 360397 425558 323516 134590 306788 192502 367511 329567
17398 329567 252268 247425 12215 200652 15297 50353 32659 397331 430423 150706 81574
17387 81574 462624 539370 263033 222760 226592 265439 467967 -12786 63504 20148 155534
17376 155534 521184 357580 195016 286812 284225 609985 283037 321139 70170 395779
17366 395779 53561 242167 432731 296110 265721 380067 147132 317061 -87539 419647
17355 328847 -74205 352033 282309 -4565 32236 67558 397604 116706 243839 254124 56470
17343 114000 340410 458570 641332 192166 484401 61481 198503 143759 276232 318326
17333 318326 298339 230434 379012 462330 373413 255040 172252 382946 443480 361752 309699
17322C09699N4792J1534p9516I5104k2285J98964D4346J01186K93895q7023A25111
17310B00896J22421A01247M4645e4140B42400K28898j81932N2170A24946J75311
17300C00257J16058J41159j80428J80498B13850o259c7337C79860j88162o0356
17290A31342A6979L06692j11141f6072C22024o1300K85062A28556c2441C67022
17279D32729p3945A08614N0266j021O7827Q0563m6727N7469C8469L37347p2383
17268C03433K56118B27061J72180K3181r0861j04462K9832M1414f2243D91536
17257A54111J82908p8278O0427j1398P4995A61048K07898A55945K25527j29016
17247B52456O1011E3724J49620R9171J32784J82493d9385D44319q3140l9744o6627
$$ plain form
17322 309699 364491 376025 296509 95104 72819 271783 44346 145532 439427 352404 125111
17310 200896 323317 101247 145892 -54140 242400 471298 289366 341536 124946 300257
17300 300257 416315 557474 377046 557544 213850 207591 -37337 379860 191698 131342
17290 131342 16979 323671 212530 -66072 322024 260724 545786 128556 -32441 367022
17279 432729 358784 108614 158880 157859 225686 306249 259522 316991 38469 375816 303433
17268 303433 559551 227061 399241 422422 331561 227099 256931 298345 -62243 491536
17257 154111 337019 258741 319168 307770 382765 161048 368946 155945 381472 252456
17247 252456 313467 53724 203344 302515 435299 617792 -49385 444319 361179 321435 254808
17236B54808j21852Q4167A06431K50981H6648J82897B32L07101j14127K20059
17226D13265b99135F54405Q3733C50649j72560N03777i9016B76782N8335K29683
17216E64800k49451p945J38354j19519M44395B46320n8686J05556K09068j98622
17206C03636Q0196J08497l2391q4603O7583J01366A42267J81064K32115A25764
17195A95179L04963j57764J82632j74613N1012L2957K42155k53490J37105k51803
17185C08333J12751j9801J68655j70975p0629G7825O0439N06167m9170B08479
17174D13978O0556j06230J43862j75353L1548N5275j13953R6823J0329k4849L7728
17163D29714p1703J46535j5367A17211N1619J6953L88127O1094q2973p4232Q429
$$ plain form
17236 254808 132956 217123 106431 357412 86648 269545 232 307333 193206 413265
17226 413265 -299135 654405 738138 350649 178089 681866 -99016 276782 335117 564800
17216 564800 315349 307404 445758 326239 770634 246320 187634 293190 502258 303636
17206 303636 383832 492329 459938 375335 442918 544284 142267 323331 555446 125764
17195 195179 500142 342378 525010 350397 401409 434366 676521 423031 560136 308333
17185 308333 421084 401283 569938 398963 328334 77825 138264 644431 595261 208479
17174 413978 474534 368304 512166 336813 368361 423636 309683 406506 416835 391986 429714
17163 429714 358011 504546 489179 117211 168830 185783 573910 635004 552031 477799 486228
17152D86228q5863K67237B55029K59666A42375O02964j92612j78476m6167L69833
17142F97917k00045J94382j64692L0467k2575P5247J40784m2350k25518R4343
17132E77960j68288j34880K05163N2630O2566o9039j66297j20085M99446l20448
17122D18728L83999l96524M93889C82467K57401N8623l5144l5379j00147J28592
17112F56413j66446B44547J20713J65447r0830F4570N85082B17492L12581J62780
17102F92853j58518K98662j21583N9766C55463N05738l43934L2951J34675k58369
17092D26524K21243K71000k32076J86324m31580J43478M3167L4343J56779j92211
17082F26991L97475j06223m26927L90384k86450K75689n3657k36235J86877j02363
$$ plain form
17152 486228 400365 667602 255029 514695 142375 745339 552727 374251 328084 697917
17142 697917 497872 692254 527562 558029 535454 610701 751485 709135 483617 577960
17132 577960 409672 274792 479955 532585 595151 526112 359815 239730 739176 418728
17122 418728 802727 406203 900092 382467 639868 698491 663347 627968 527821 656413
17112 656413 489967 244547 365260 530707 439877 64570 649652 217492 530073 692853
17102 692853 534335 832997 711414 771180 355463 861201 517267 550218 684893 426524
17092 426524 647767 918767 686691 873015 441435 584913 628080 662423 819202 626991
17082 626991 1024466 918243 491316 881700 595250 870939 817282 581047 767924 665561
17072F65561K25286j90190L2970K07902m54230K61544N0474l67285N65966k64628
17062G33370j88412L57384k23047K54048m371j18279k88854K92854K23742J93070
17052A231505E90028M09841j56553N1422M1909l9545J62935k09226j2613K1554
17042H59752n5244J12674N0377n99l30384K63695J16031k88980N5446K57075k51923
17031G87920R2398K59904m61184M72083l43472J85082M2722l76468M05246l12576
17021G51655Q9991J10290l02002J13691K99759K49856o01472N62507l55697K24045
17011A142623m75099K63840O4691J22269r1479p5673J40555p7575Q424J0444n1434
17000I81586O9787J10648Q4136q6398N490J94421k6213j58572M56601l74162l1981
$$ plain form
17072 665561 890847 700657 733627 941529 487299 748843 799317 432032 997998 733370
17062 733370 544958 902342 679295 933343 928972 810693 521839 814693 1038435 1231505
17052 1231505 590028 999869 843316 894738 936647 897102 1060037 850811 838198 859752
17042 859752 804508 917182 967559 966960 636576 900271 1016302 727322 782768 1039843 787920
17031 787920 880318 1140222 679038 1151121 807649 992731 1035453 658985 1064231 751655
17021 751655 841646 951936 649934 763625 1063384 1313240 711768 1274275 918578 1142623
17011 1142623 667524 931364 996055 1118324 1026845 951172 1091727 1014152 1022576 1033020 981586
17000 981586 1051373 1162021 1246157 1159759 1165249 1359670 1333457 1174885 1631486 1257324 1225343
16989A225343L3548O8025k51901Q4635J23682J84058j11954j25338q2626q8779
16979A058693J69769j8532j83425K05271n0589J01317L5767Q1207K87460n41360
16969A145578L12458K09690K5370j55516O4190j47386k08693N478J56126j5610
16959A391685J68478R0601k99778l00412N80877k89287K2692N69926o10939L69794
16949A693637l66079M09061n4437o3821R4107j38474J59913J15090Q690J03743
16939A961430O1152j40660l47713L02116r6361j91422K09352K14980K40065k68096
16929A944843J91568l88584J87136q1813L21424k5824j91927L33243p275k59658
16919B023133J35358k03654L09485j05528j92393j28141N82651n0334O1504l41525
$$ plain form
16989 1225343 1258891 1326916 1075015 1159650 1283332 1467390 1355436 1230098 1147472 1058693
16979 1058693 1228462 1209930 1026505 1231776 1181187 1282504 1318271 1399478 1686938 1145578
16969 1145578 1458036 1667726 1693096 1537580 1601770 1454384 1245691 1251169 1407295 1391685
16959 1391685 1560163 1650764 1350986 1050574 1631451 1342164 1364856 1934782 1323843 1693637
16949 1693637 1327558 1736619 1682182 1618361 1712468 1573994 1733907 1848997 1857687 1961430
16939 1961430 2022582 1881922 1534209 1836325 1739964 1548542 1757894 1972874 2212939 1944843
16929 1944843 2136411 1747827 1934963 1853150 2174574 2148750 1956823 2290066 2282791 2023133
16919 2023133 2158491 1954837 2264322 2158794 1966401 1838260 2420911 2370577 2432081 2090556
16909B090556K55540P331j7227N5379K9170K15585j13531J50095K28382l16665
16899B584615j32059J00523K19282J63152m26764M00996J41060j75576k45612
16890B629617M67358Q4702k0388l1224J61957j33390m2503K51530n5950j54835
16880C156874m6344K91662j66080L27593m00288M77292l15166K57922p452J02413
16870C678426J9676J85235k14171K0273k8098K09869K80309k20252j82855N65613
16860D314025M8441j07888J83687L63804l79709N35701n21687Q9340M33552k08186
16850D751080K7767L09956J32247j24704L13753k95326L39454K3049L76330j41485
16840E712121m399O0947R9416O2409K50010M4856j40338L04321L1515k1718N22805
$$ plain form
16909 2090556 2346096 2353427 2336200 2391579 2420749 2636334 2522803 2672898 2901280 2584615
16899 2584615 2452556 2553079 2772361 2935513 2508749 2909745 3050805 2875229 2629617
16890 2629617 3096975 3181677 3161289 3130065 3292022 3158632 3116129 3367659 3311709 3156874
16880 3156874 3110530 3402192 3236112 3563705 3163417 3640709 3325543 3583465 3576013 3678426
16870 3678426 3698102 3883337 3669166 3689439 3661341 3871210 4151519 3931267 3748412 4314025
16860 4314025 4362466 4254578 4438265 4802069 4422360 4958061 4436374 4525714 4959266 4751080
16850 4751080 4778847 5088803 5221050 5096346 5410099 5114773 5454227 5477276 5853606 5712121
16840 5712121 5707722 5768669 5868085 5930494 6180504 6225360 6085022 6389343 6420858 6399140 6921945
16829F921945O2137o8407J31412K89036M8725J76699k00498M5856N26913p6796
16819G857022J74036K70492J84655J09006J0231J93507k6831N06679O09076l19863
16809I568010L91906j0071J34242N01106K51813K31906J58228M41450k07181N70889
16799A2032298J92501j53015L71787O47545K73302N03124J57161l8306P04943
16790A4691340J57269P07778K69553J31982M01427N00923K35759P67589P47157
16781A8610777K90233M29596M43390O70985N94710N67385P30864N43046M47146
16772B3328132Q21614Q81519Q37947O75540P15179J204009N97563J120293J084064
16763C1265860Q48267J135104J047928J393408J372608J093316J499787J456334
$$ plain form
16829 6921945 6984082 6915675 7047087 7336123 7384848 7561547 7361049 7406905 7933818 7857022
16819 7857022 8031058 8301550 8486205 8595211 8605442 8798949 8772118 9278797 9887873 9568010
16809 9568010 9959916 9949845 10084087 10585193 10837006 11068912 11227140 11668590 11461409 12032298
16799 12032298 12224799 12071784 12443571 13091116 13364418 13867542 14024703 13986397 14691340
16790 14691340 14848609 15556387 15825940 15957922 16359349 16860272 17096031 17863620 18610777
16781 18610777 18901010 19330606 19773996 20444981 21039691 21607076 22337940 22880986 23328132
16772 23328132 24149746 25031265 25869212 26544752 27259931 28463940 29061503 30181796 31265860
16763 31265860 32114127 33249231 34297159 35690567 37063175 38156491 39656278 41112612
16755D1112612J353246J754989J519879J785479J388065K195852J888405K058125
16747E5056652K169729J973593K461988K268990K269916K801848K764219K485556
16739G4252491K753818K742547L406372K615699L365092K474528L298766L001169
16731I7910482K785564K661383L006634K753410K509262K201194K151262J959466
16723A17938657J469705J334777Q72081O40663j98028n1639j03581p45019j270876
16714A19886740j282929j854250j755472k463248k684108k678342k294949l326611
16706A01546831k955085l169363k978115k780313l514745k875302l166993k844295
16698G7262620k562754l048406k824955k258745k656515k463285k522400k022665
$$ plain form
16755 41112612 42465858 44220847 45740726 47526205 48914270 51110122 52998527 55056652
16747 55056652 57226381 59199974 61661962 63930952 66200868 69002716 71766935 74252491
16739 74252491 77006309 79748856 83155228 85770927 89136019 91610547 94909313 97910482
16731 97910482 100696046 103357429 106364063 109117473 111626735 113827929 115979191 117938657
16723 117938657 119408362 120743139 121615220 122255883 122057855 122006216 121902635 121157616 119886740
16714 119886740 118603811 116749561 114994089 112530841 109846733 107168391 104873442 101546831
16706 101546831 98591746 95422383 92444268 89663955 86149210 83273908 80106915 77262620
16698 77262620 74699866 71651460 68826505 66567760 63911245 61447960 58925560 56902895
16690E6902895k456907j795617k055974k152105j923234j700270j536324j874868
16682D1407596j304836j504024j407050j123188j386388j007742j255913r87507
16674C1430948j420498p84196q90648r13092q80273j021492o95461o93688q11290
16665B3320310p52626l98472p00952p36307o56220l76361p79750j001206k23078
16656A7695338l39776m10135m88413o70795k32167o38395k76968m37187o01307
16647A3600195k19579k1126m59997l1418l36052o15048J38861p92058j3928l2275
16637A1217575l13836n19306k09717K6868l20426m33704P1848o87715j08655j77076
16627H545856j44316j25544J25221j38934k54688m11115R6107k82500j23501m49664
$$ plain form
16690 56902895 54445988 52650371 50594397 48442292 46519058 44818788 43282464 41407596
16682 41407596 40102760 38598736 37191686 36068498 34682110 33674368 32418455 31430948
16674 31430948 30010450 29226254 28335606 27422514 26542241 25520749 24825288 24131600 23320310
16665 23320310 22567684 22169212 21468260 20731953 20075733 19699372 18919622 17918416 17695338
16656 17695338 17355562 16945427 16457014 15786219 15554052 14915657 14638689 14201502 13600195
16647 13600195 13380616 13359490 12899493 12868075 12532023 11916975 12055836 11263778 11249850 11217575
16637 11217575 10903739 10384433 10174716 10201584 9881158 9447454 9519302 8831587 8722932 8545856
16627 8545856 8401540 8275996 8401217 8262283 8007595 7596480 7692587 7410087 7286586 6836922
16617F836922J40527k20804n08l2250p0578j85573l23209J4361n0635J56208l96349
16606E868112k48632J78028m11107l65738K1080K24297o2784n18841K73051k91728
16596D665738J27638l72012J25580K60659l00163p7792n6661O2535l9139N1836
16586D448219M9035k46448q4463k95415q3900K29257j40120q4513p8840n1846
16576C660966L0625j63835m37485K64951L0764j69347j61465K91510j89756j85890
16566B971038K54033p0044k96769n2975j97841J33515L23806k14746K26659m02740
16556B673936J41984l83614J16621K51380l52997K17943o1947j3931j51640j2267
16546B425468J05521o7465j77239K69379j59328j32166Q450J2174j63131R54L4679
$$ plain form
16617 6836922 6977449 6756645 6756137 6723887 6653309 6467736 6144527 6158888 6108253 6264461 5868112
16606 5868112 5619480 5797508 5386401 5020663 5041743 5266040 5203256 4684415 4957466 4665738
16596 4665738 4793376 4421364 4546944 4807603 4507440 4429648 4372987 4435522 4396383 4448219
16586 4448219 4497254 4250806 4166343 3870928 3787028 4016285 3876165 3791652 3712812 3660966
16576 3660966 3691591 3527756 3090271 3355222 3385986 3216639 3055174 3346684 3156928 2971038
16566 2971038 3225071 3155027 2858258 2805283 2607442 2740957 3064763 2850017 3076676 2673936
16556 2673936 2815920 2432306 2548927 2800307 2447310 2665253 2603306 2589375 2437735 2425468
16546 2425468 2530989 2463524 2286285 2555664 2396336 2264170 2272620 2284794 2121663 2122617 2157296
16535B157296m9531L57484j53339k06143j53740J21185l9385k6586j02969J18675
16525B022947m3403r4401M9012J25956j27718m57236L03613j25325j14315M04999
16515A944129m23701j4323p8612L25671K26674m81400J81571r449K06793j35335
16505A742018l75799N18860m96837J76630q6261P0052q3659k60297J42559Q0700
16495A427966K74665m98199J32907j27842J63486k34281K53945j25239l16042
16486I51366L37889J51567n9002r6035J10979k11359J96222l88942J70842O4647
16476A228174o5118J01040l6821n8454q3902k33701J76232L17662l56259M1515
16466A030368j35987n6179N59693m13553L4127R9461k00193J54728M746r482k6853
$$ plain form
16535 2157296 2107765 2465249 2311910 2105767 1952027 2073212 2033827 2007241 1904272 2022947
16525 2022947 1979544 1885143 1934155 2060111 1932393 1475157 1778770 1653445 1539130 1944129
16515 1944129 1520428 1506105 1427493 1753164 1979838 1498438 1680009 1670560 1877353 1742018
16505 1742018 1366219 1885079 1388242 1564872 1478611 1548663 1465004 1204707 1347266 1427966
16495 1427966 1702631 1204432 1337339 1209497 1372983 1138702 1392647 1267408 951366
16486 951366 1289255 1440822 1381820 1285785 1396764 1185405 1381627 992685 1163527 1228174
16476 1228174 1163056 1264096 1227275 1168821 1084919 851218 1027450 1345112 988853 1030368
16466 1030368 894381 838202 1397895 984342 1018469 1117930 917737 1072465 1077211 1067729 1040876
16455A040876o1567J34625k25565O7275j98652R8146K67271m36162J75085j41839
16445G19493K27783L9846q5732J60793j84760m024L1642m29651Q8114L72647j43244
16434G92907J23392k34715J27684O0211o8166j13630J51108k01899Q4827n357
16424G16362j12596J98999O5961D33890L86796j00746l8368j65781K54999J9360
16414G90150O8695m14220L38027j29029j20560K64708k98125J38477J73598P6664
16404H88385R0748D36911J62227J98926k64373K1192L32720m25451K91601k47003
16394E06750K27576k05235J54444k56983K84468k6026q9064K2782J073R1226j69242
16383E41769o7789k04553M46064K3672k15114j01811J79631Q8806q2164k46731
$$ plain form
16455 1040876 979309 1113934 888369 955644 756992 855138 1122409 686247 861332 719493
16445 719493 947276 987122 901390 1062183 877423 873399 905041 475390 563504 936151 792907
16434 792907 916299 681584 809268 869479 801313 687683 838791 636892 721719 716362
16424 716362 603766 802765 868726 433890 820686 719940 681572 515791 770790 790150
16414 790150 858845 444625 782652 653623 533063 797771 499646 638123 811721 888385
16404 888385 979133 436911 599138 798064 533691 554883 887603 462152 753753 506750
16394 506750 734326 529091 683535 426552 711020 684994 595930 618712 619785 711011 541769
16383 541769 473980 269427 715491 739163 524049 422238 601869 690675 608511 361780
16373C61780j08479k96J94753J4821M559J27228j86578L3246O7891p1351j030
16362D36544j29606J03437J45662J48794A33291N16811C12292N5304K61042k51363
16352C77275J13382k23485J28144N06429C23111J12625J88184B82768K36224A91763
16341E45474j70215O2612j23822J49210r4075P3033N0393l0482K37269C07093
16330D52153A60306L50144M7580A72249J37488J51053K4087M014B03468P9436
16320B82904G8468M98099j78954L31463B69064L99915A10338K42674J63155j28173
16310C87994q7464p156k8111J10364j39947o9859m7383K37288p6807L68355A70111
16298A05762K66751j25578J77092N2378A31585J47002Q7228A14336K58651J00485
$$ plain form
16373 361780 253301 253005 447758 462579 467138 594366 407788 441034 508925 437574 436544
16362 436544 306938 410375 556037 704831 133291 650102 312292 367596 628638 377275
16352 377275 490657 267172 395316 901745 323111 435736 623920 282768 518992 191763
16341 545474 375259 437871 314049 463259 369184 442217 492610 462128 699397 307093
16330 452153 160306 510450 558030 172249 309737 460790 484877 488891 203468 282904
16320 282904 78468 576567 397613 729076 269064 668979 110338 353012 516167 387994
16310 387994 300530 293374 265263 375627 235680 165821 118438 355726 278919 647274 170111
16298 105762 372513 246935 424027 476405 131585 278587 365815 114336 372987 473472
16288D73472A97159O0620J91465N8270k47518P8672J63933a11692j69124A5239
16277D87834k27060K1140m6347J95792J87565j98092j09068K1458n194a8734F83552
16265C36306K97143A81869M8896J59809J83310B54608J00519F2021K19819P5952
16255C57792K38517B19553a1271F2261J44901c5770B70201M014K54723A11463
16244B75954A6371J34548l421J58315F7901J83485M45248b44798B92846h1356
16233B91436A25424O4194n2533C4512O616K97126C7044J38135C5963J74345J14236
16222C24544A31842J43613J30683A67836b47609A92539r5397J86966J29249E0336
16211C13189b58541C79532B4069J77893p3798K66849A4828M46261B01538Q0697
$$ plain form
16288 473472 197159 257779 449244 507514 259996 338668 502601 -111692 -280816 15239
16277 487834 260774 281914 235567 431359 618924 420832 311764 333222 328028 -18734 683552
16265 336306 633449 181869 230765 390574 573884 254608 355127 62021 281840 357792
16255 357792 596309 219553 -11271 62261 207162 -35770 270201 274215 528938 111463
16244 275954 16371 150919 147498 305813 67901 251386 696634 -244798 292846 -81356
16233 291436 125424 189618 137085 34512 41128 338254 37044 175179 35963 210308 324544
16222 324544 131842 275455 406138 167836 -247609 192539 97142 284108 413357 50336
16211 313189 -258541 379532 24069 201962 128164 395013 14828 461089 201538 282235
16201B82235a38199O3438a5960A70933g3466B80581e051k44925B17540j08255
16191A09285l34J69462L6306H9202L45195H262M87328A46010b8732A78511J0372
16180A88883h5308A3827P1542a27197B45193m493b6225B86170J28727g9701B45596
16168A30471j0072A518c09277A78608J9526n9178A3392J00951K5235d2917D79131
16156A42109F0322K60076D8479M03715k03977H6842K79065j15697b4837A04959
16145B59111p1273q6321b9424I7387J23404N5786i9051j73961J2131A5780L83073
16134C98853m6551B7477a34841G1706J22719a11476A20903Q5979a32609A3297
16123B84418D5747b38068A19305K01950A17666m8107C589h4756E0258L35923j29530
$$ plain form
16201 282235 -138199 -74761 -15960 170933 -73466 280581 -5051 -249976 217540 109285
16191 109285 108951 278413 314719 89202 434397 8262 495590 146010 -28732 178511 188883
16180 188883 -85308 13827 85369 -127197 245193 240700 -26225 286170 414897 -79701 245596
16168 130471 120399 1518 -309277 178608 198134 138956 13392 114343 139578 -42917 479131
16156 142109 60322 320398 48479 452194 248217 86842 365907 250210 -24837 104959
16145 259111 187838 101517 -29424 97387 220791 276577 -99051 -273012 -260881 15780 398853
16134 398853 352302 27477 -134841 71706 194425 -111476 120903 206882 -132609 13297
16123 284418 45747 -238068 119305 321255 117666 69559 3589 -84756 50258 386181 256651
16112B56651D2068A8153g1136A16695C7035d2804H3995b44466j89085j07650a45744
16100h303j75760J560B5056K07460q7042J75108A55696F2997J17457L7054h1709
16088a2066F3872J17154D0644O7312R2359E7470f026D1401h2365C82013j47119
16077B34894E2863a3569I3460K46758D7053b77731i4688d0497B43990N8597B7086
16065A81081H9623L34128d54373A35093a38352A64484j8212i7764I2959j768J20693
16054B11884a51304K9992d6429j18146J3848E7700L4211R7121Q3122B0008d237
16042H4146e7487B27545i288B88829j12021C6346a19211c8566B37565b35653a3404
16030E3607e72889A7414M32752B6953a74856P9154M6708n3940a6449A02021C5874
$$ plain form
16112 256651 42068 18153 -71136 116695 37035 -42804 83995 -244466 -433551 -541201 -145744
16100 -8303 -184063 -182503 25056 232516 145474 320582 155696 62997 180454 217508 -81709
16088 -12066 63872 181026 40644 107956 200315 57470 -6026 41401 -82365 382013 234894
16077 234894 52863 -13569 93460 340218 47053 -277731 -94688 -40497 243990 302587 27086
16065 181081 89623 423751 -454373 135093 -138352 164484 146272 -97764 92959 91191 211884
16054 211884 -151304 -121312 -46429 -164575 -150727 57700 91911 189032 272154 20008 -4237
16042 84146 -57487 227545 -9288 288829 176808 36346 -119211 -38566 237565 -235653 -13404
16030 53607 -572889 17414 450166 26953 -174856 -95702 -48994 -102934 -16449 102021 35874
16018B11650b9360k02116L9927A63582a4518A93229a61678F4033o029J48918a72433
16006a46609j02287d3764A76802a94566D9645A8773J30896K6065J24632b63100
15995b30791J10720E3356J4588e5509E7958J21974g6773D14491j50278M94417
15985G58630J92747K20160m313j53261C48264N84808C30688g6393b9861g895j28231
15974a36126C1910c0367B1603b76859D05176a79181M5155d9604K4182j2244p3790
15963a11456j65439J14857A57714L5347a77348Q4367A35698a57045q9506f1382
15952G0497k8994b04370k7274A22267a94067A31815f0175A04775g7811E5447B0058
15940C6611N9498b22865o4061a16820I7240b9447A41695g4630j63832j11008A74990
$$ plain form
16018 211650 -29360 -231476 -191549 163582 -14518 193229 -161678 64033 58004 206922 -172433
16006 -146609 -248896 -43764 176802 -194566 49645 18773 149669 175734 300366 -263100
15995 -230791 -120071 53356 67944 -55509 57958 179932 -76773 414491 264213 758630
15985 758630 951377 1171537 1167224 1013963 348264 933072 330688 -76393 -29861 -7895 -136126
15974 -136126 31910 -30367 21603 -276859 405176 -179181 -134026 -49604 -25422 -37666 -111456
15963 -111456 -276895 -162038 157714 193061 -177348 -92981 135698 -157045 -246551 -61382
15952 70497 41503 -204370 -231644 122267 -194067 131815 -60175 104775 -77811 55447 20058
15940 36611 96109 -222865 -286926 -116820 97240 -29447 141695 -74630 -238462 -349470 174990
15928g534j40651q313I658a56244C53384h6646E5244R0333J533o7158J04394f7991
15915i3464A62933E3846g7222j25508C02629J25406D4908G987K02371o9737B6239
15903A06414a23175c0603j70144A44444Q7045i3886k19718A145g717m5846l1302
15892h4865c6833A2694C076N0178c2428j91480C3587O5615A202K6766a63335A7899
15879d9889A87492c00538B05522n0271h2037K6045A5467b15513A44703C0179J03590
15868A33769c95542J82496J1445K1845G9683b71296a27610A10142b2510j54257
15858a76767c8751B63706i6961C50959b33003m14076B4858P1084k3604b08413
15847C3104R2415C0576d42174O7502B65839J2862a80736B79400D0513K76038a22770
$$ plain form
15928 -7534 -148185 -156498 9658 -156244 353384 -86646 55244 145577 147110 79952 184346 -67991
15915 -93464 162933 53846 -77222 -202730 302629 428035 44908 7987 210358 140621 26239
15903 106414 -123175 -30603 -200747 144444 231489 -93886 -313604 1145 -7717 -53563 -84865
15892 -84865 -36833 12694 3076 53254 -32428 -223908 33587 99202 1202 27968 -163335 17899
15879 -49889 187492 -300538 205522 155251 -82037 -55992 15467 -215513 144703 30179 133769
15868 133769 -395542 -213046 -201601 -179756 79683 -271296 -127610 110142 -22510 -176767
15858 -176767 -38751 263706 -96961 350959 -233003 -647079 24858 95942 72338 -208413
15847 33104 125519 30576 -442174 -374672 265839 278701 -180736 279400 40513 316551 -122770
15835A42724a9811B2266e194j32743A3017a2908H7837Q3878e0269k82388B45361
15823A30270c34916K9154e5240n7064D8414c0492r8671f2658j36548q0467H0446
15811G8679i4452d791j44028G5706f3150A81536a974k95332e041j84135A7557
15799a81552A73991N3719p1675a8801A83261E2114a45497P240J1341j0597l18783
15788d56296J43016A02326b91201J40497B1163a0694r0038B81405b7894A14346
15777B33568n1075H7591j7445a9315j23573B42858a94898A66496g1140a4255j77613
15766a91868Q1804j46460Q7710h1229H3994L3132a09329H9329a16597o3975h8085
15754C83248d7305A98466I6101a67160f5772L0089D6398Q8562E7568K61694a26388
$$ plain form
15835 142724 -19811 22266 -5194 -137937 13017 -12908 87837 171715 -50269 -332657 245361
15823 130270 -334916 -305762 -55240 -112304 48414 -30492 -129163 -62658 -199206 -279673 80446
15811 78679 -94452 -4791 -148819 75706 -63150 181536 -1974 -297306 -5041 -189176 17557
15799 -181552 173991 227710 156035 -18801 183261 52114 -145497 -138257 -126916 -137513 -456296
15788 -456296 -313280 102326 -291201 -150704 21163 -10694 -100732 281405 -27894 114346
15777 233568 182493 87591 70146 -19315 -142888 242858 -194898 166496 -71140 -14255 -191868
15766 -191868 -110064 -256524 -168814 -81229 83994 117126 -109329 89329 -116597 -180572 -88085
15754 383248 -47305 198466 96101 -167160 -65772 -35683 46398 134960 57568 319262 -126388
15742G2757J87197H8913f1575G2302a8466H8787J55396a63771A83723c10801f3468
15730H0807a34464I7587i9440B4040b02619Q7492C12167a35793K7420l002G0822
15718g9710L2127D8355b74631c9581l88312a15056M8604p9216l7003k8183L1832
15707a79022L8565a4311C65510a14289R352B14548g2932C5243a23315K9328L7498
15696e6489I5467e3655A16969N422j204n5714R5805b9435A69639a42773N9779
15685h2994C3506c15236A56399a39963A6542a21159A3286c9317m65B01574n2447
15674A49127c3637j79941b011n882j44451B08703j00585b50389A49932a21889
15663a34151j00829a2509o7345j46271O1292H313h3665o1499n7804J00948k0662
$$ plain form
15742 72757 259954 88913 -61575 72302 -18466 88787 244183 -163771 183723 -310801 -63468
15730 80807 -134464 97587 -99440 24040 -202619 -115127 312167 -135793 -108373 -111375 70822
15718 -79710 -47583 48355 -274631 -39581 -427893 -115056 -66452 -145668 -182671 -210854 -179022
15707 -179022 -140457 -14311 365510 -114289 -104937 214548 -72932 35243 -123315 -93987 -56489
15696 -56489 95467 -53655 116969 122391 121187 65473 161278 -29435 169639 -142773 -82994
15685 -82994 33506 -315236 156399 -139963 16542 -121159 13286 -39317 -39782 201574 149127
15674 149127 -33637 -213578 -2011 -7893 -152344 208703 108118 -250389 149932 -121889
15663 -134151 -234980 -12509 -79854 -226125 -164833 8313 -83665 -145164 -202968 -102020 -122682
15652a22682N5589q333o3898N9029j12582m9500C36546j57719a50328L9429r8749
15641b09648b6958A05040D7214l78J24827h6751I1874a66451n4378B26920F9839
15629B21047J99990a83080b6993C16023k0910c8219B3045b38757f963B31416L5002
15618B66418b83258c0624j64220j5825A37156A3590P1237O7888a58575A61612
15607b03929N9038L6270E4200B4717e2393r4910C079a58688f4077A78633q380
15596A70253g0158J4249j83190A78594g4188C5739J80952a03632B65797g4309
15585D0477b27596f045p8175j38632b3052B15175b2209m526K853r5841E5403b86540
15572h5032k7929F9880j5156a14427D8807a60618D597a87645B03117o0885L6209
$$ plain form
15652 -122682 -67093 -75426 -139324 -80295 -192877 -242377 336546 178827 -150328 -110899 -209648
15641 -209648 -26958 105040 47214 46836 171663 -86751 91874 -166451 -220829 226920 69839
15629 221047 421037 -183080 -26993 316023 295113 -38219 23045 -238757 -6963 231416 266418
15618 266418 -283258 -30624 -194844 -210669 137156 13590 84827 152715 -158575 161612
15607 -203929 -144891 -108621 54200 24717 -52393 -147303 3079 -158688 -64077 178633 170253
15596 170253 -70158 -55909 -239099 178594 -74188 35739 216691 -103632 265797 -74309
15585 40477 -227596 -6045 -84220 -222852 -23052 215175 -22209 -26735 -23882 -119723 55403 -286540
15572 -85032 -112961 69880 54724 -114427 48807 -160618 4597 -187645 203117 142232 178441
15561A78441a65358g79C8496c8471N062B72938e4930n1659k35261k7064e4395
15549f6443B2611a63358C09404G4156C4219J98190b04478D00105F4774d13723
15538b25361b1519B61758l0929a60767e8464j66622A23395L0706F7847M944b22859
15526C20954F6421N8814B9675K63653J64317i8320B22816h3650E3832b211B15396
15514A18343K6938k7473f4379A16358P8242e3088q0654C24012M9251K9870A70461
15502B69154j7761A5478J25773O994J25991b12353A50513J92175A57171P508b16009
15490G7732i8447C34230m1805n5738d3162a9991B45013A08596J88098A17424J09043
15479B26467F3853Q4874K3849H4377J50847K56548E6575N33700J23808j12902
$$ plain form
15561 178441 -165358 -779 38496 -38471 -33409 272938 -54930 -106589 -341850 -368914 -54395
15549 -66443 22611 -163358 309404 74156 34219 232409 -204478 400105 64774 -413723
15538 -225361 -21519 261758 230829 -160767 -58464 -225086 123395 154101 67847 72791 -222859
15526 320954 66421 125235 29675 293328 457645 -98320 222816 -83650 53832 -2211 215396
15514 118343 145281 117808 -64379 116358 194600 -53088 -133742 324012 373263 403133 170461
15502 269154 251393 15478 141251 148245 274236 -212353 150513 342688 157171 164679 -216009
15490 77732 -98447 334230 292425 236687 -43162 -19991 245013 108596 296694 117424 226467
15479 226467 63853 148727 172576 84377 235224 491772 56575 590275 714083 601181
15469F01181B9653M53244A58310m6512N7599E3958K64472j18501k9547J88527
15459C58909c2307A16282f4463j21817A41283K9916k4372J2736A2696a34943j22602
15448b57545B4091K49387j02836f7794D14124A06083N36294k2697O34866J47416
15438A401962l79158C63000j67603r6472k4905B8481J04439N3399j1333g4218
15427A0535O1039J13278i7641D2937a15598D3169M4540K8428N6201i0621b8725
15415A9001Q022a21721B04833d7713j7757B06883g0716B80050K29187a80093A32467
15403a83760b9391j09451j75594a8221A79979D9335a36000a9012A61266E079g6448
15391F4163N8131K77341b94542f3153j24760A49861l2148K0060a04495p2384G7788
$$ plain form
15469 601181 29653 482897 158310 111798 169397 53958 318430 199929 170382 358909
15459 358909 -32307 116282 -64463 -186280 141283 171199 146827 159563 12696 -134943 -257545
15448 -257545 24091 273478 170642 -67794 414124 106083 642377 619680 1254546 1401962
15438 1401962 1022804 363000 195397 98925 74020 28481 132920 186319 174986 -74218
15427 10535 71574 184852 -97641 42937 -115598 43169 87709 116137 172338 -90621 -28725
15415 19001 27023 -121721 204833 -47713 -65470 206883 -70716 280050 509237 -180093 132467
15403 -183760 -29391 -138842 -314436 -18221 179979 49335 -136000 -19012 161266 5079 -76448
15391 64163 122294 399635 -294542 -63153 -187913 149861 117713 137773 -104495 -176879 77788
15379b92329A58667a17959B20087J4383j07670C3734J82353J74688n4399A10145
15368C81171a42605H8175J58609c5566C8799P6241b9043A32160K48689m2894a4491
15356C12074a65121B83392j01357N3156K63503H8932b0656r790A93753g2695F5099
15344f8444B0374N6343J93136P6735r1942A05227K96241E6837j1686N28588C3531
15332D60O2180O8879J81659m792o3172o1114K17395B00553Q1864q64a51759E4194
15319A12467O8266R0960a270B87756D2287b4920A72849J94533G0602M5586q223
15308A07965B7180c6067B36963M4846N9738B1994Q8766L8866B0437L8497a23441
15296A59033a83994d8718k5690b6617j8192B99728a70977A11187a96110B35603
$$ plain form
15379 -292329 158667 -117959 220087 234470 126800 33734 216087 390775 336376 110145
15368 381171 -142605 88175 246784 -35566 38799 115040 -29043 132160 380849 337955 -14491
15356 312074 -165121 283392 182035 235191 498694 88932 -20656 -30446 193753 -72695 65099
15344 -68444 20374 76717 269853 346588 254646 105227 401468 56837 45151 573739 33531
15332 460 62640 131519 313178 308386 245214 184100 401495 200553 282417 281553 -151759 54194
15319 112467 180733 271693 -1270 287756 42287 -24920 172849 367382 70602 116188 107965
15308 107965 27180 -36067 236963 281809 341547 21994 110760 149626 20437 58934 -123441
15296 159033 -183994 -48718 -74408 -26617 -44809 299728 -170977 111187 -196110 235603
15285b26970A95412q9334k8142J46044J4368c5473F5308R9200D2332a43832I3667
15273E2778K68122a16337j23176A50258R4511G8679c53375F5559a94797K0222
15263a74575A01632R3095O7780H8556h3888i256o0052A18892D2891j1059b70494
15251D0748R7160C6324K36982e9588A90188Q9465b2748E85361M46862P78356p54705
15240A055874K15841R4629E38431E4143a9081B39189i645A23352a3850B98995
15229b5435k3488O372l9188b7623A86200a08299p6512f2048A54970f7478C36276
15217i9507A96132p2185i1336A89396L8270o4347b8449A37137j1710R8516m11
15206B23532a26261F065K61127a57731A78307b93E8924R0274a36752B8260c69848
$$ plain form
15285 -226970 195412 106078 77936 223980 238348 -35473 65308 164508 42332 -143832 93667
15273 52778 320900 -116337 -239513 150258 244769 78679 -353375 65559 -194797 -174575
15263 -174575 101632 194727 262507 88556 -83888 -9256 -69308 118892 42891 31832 -270494
15251 40748 137908 36324 273306 -59588 190188 279653 -22748 585361 1032223 1810579 1055874
15240 1055874 1271715 1366344 538431 54143 -19081 239189 -9645 123352 -13850 298995
15229 -25435 -48923 -42551 -81739 -27623 186200 -108299 -184811 -62048 154970 -67478 336276
15217 -99507 196132 123947 -91336 189396 227666 163319 -28449 137137 125427 223943 223532
15206 223532 -126261 6065 267192 -157731 178307 -293 58924 149198 -136752 28260 -369848
15194d726j36062G8221J9080J59217H4689b1683B80603j6418A07589E0033P4875
15183A24908J14225J09056a19510C15810o1545I0566i5099J1814F8985O3505d20477
15171C8263K6068M2713d8804A97917m3350a18866H3427O1489J37514d0214p960
15160d8174a1014A30251b56003a1130B61784J45150A70259r946i6800I357J08411
15149A17768f6118A06494d5095R38B25179C8202J78566k3704i8598D0499J54501
15138A95000J06700c4024A76366B5775N2142J49478G6147N3970J50363A22934
15127B02320f8523j3717A39126b87875B00435J72271J86223j79342j43847J8597
15117B54337n7253G309N1412e2961A15115L6522K31609c57140C35906b01690Q1959
$$ plain form
15194 -4726 -140788 78221 97301 256518 84689 -21683 280603 264185 107589 50033 124908
15183 124908 239133 348189 -119510 315810 254265 90566 -95099 -83285 68985 132490 -420477
15171 38263 64331 107044 -48804 197917 154567 -118866 83427 144916 282430 -40214 -48174
15160 -48174 -11014 130251 -256003 -11130 261784 406934 170259 160313 -96800 9357 117768
15149 117768 -66118 106494 -45095 -44157 225179 38202 216768 193064 -98598 40499 195000
15138 195000 301700 -34024 176366 25775 77917 227395 76147 130117 280480 122934
15127 202320 -68523 -82240 139126 -287875 200435 372706 558929 379587 235740 254337
15117 254337 197084 7309 58721 -52961 115115 151637 383246 -357140 335906 -201690 -119731
15106a19731A31490O9783l3092J05135b058A70676M4515J65882j37872J93504
15096D36705E0970c5079C57698G671b4351A55688R6218c4399a0556H0155O4007
15085A44162J90281A2303c13845A37483b17715R2781f510H7719Q9649o7429J9636
15074A29575K65622F4534N35O393A3671e5170i000I068h4819A0868a26451D91132
15061A99843o4847L62623I4467N71376e0108B2709L55582o7526j45965K90011
15051D54811n341o9167j65320N21291B68807K01663K52354A88597L33118k42119
15041B79596j01835M41750A50940L2416J23921j34547a9945i410A93624J78349
15031C71973q7170N37060j08270r4138J89396J33915m49040k2928G2271M89797
$$ plain form
15106 -119731 131490 201273 168181 273316 -2058 170676 215191 381073 243201 436705
15096 436705 50970 -35079 357698 7671 -24351 155688 251906 -34399 -10556 80155 144162
15085 144162 334443 12303 -313845 137483 -217715 -124934 -6510 87719 177368 109939 129575
15074 129575 395197 64534 65069 71462 13671 -55170 -9000 9068 -84819 10868 -126451 491132
15061 199843 134996 497619 94467 665843 -50108 22709 378291 310765 164800 454811
15051 454811 449470 380303 214983 736274 268807 470470 722824 188597 521715 279596
15041 279596 177761 619511 150940 183356 307277 172730 -19945 -9410 193624 371973
15031 371973 284803 821863 713593 619455 808851 942766 493726 470798 72271 562068
15021E62068j65298L70798k33643j13827r073J93038j43693C6108M5294K92443
15011C73845K75073B57509P3947K09263B33692J68239J75298j01545J92528C24949
15000C98869J35463j83151M32791l79783j08795O7786m0165J5371j09011K07810
14990D37185k2200j58882M3871J90910k02467L58713B44616K23167K66N35566
14980A003615j59899K4534M7400l35610l9730C7301L44022J34639k5481K93332
14970G83813C87447I9955L13065O8243j93000n5938k4393J94221j00986J63972
14960D65139J77371k92358B7650K82380J88955j32445p3615J0171M3181A17356
14949D31880j2625A27573O81J10373j19118J09841J18326L72542j42373K20788
$$ plain form
15021 562068 396770 767568 533925 420098 411025 604063 460370 36108 81402 373845
15011 373845 648918 257509 331456 540719 233692 401931 577229 475684 668212 324949
15000 398869 534332 351181 783972 404189 295394 363180 323015 338386 229375 437185
14990 437185 414985 256103 299974 490884 288417 647130 244616 467783 468049 1003615
14980 1003615 843716 868250 915650 580040 540310 37301 381323 515962 490481 783813
14970 783813 387447 99955 413020 481263 288263 232325 207932 402153 301167 465139
14960 465139 642510 350152 27650 310030 498985 366540 292925 303096 346277 117356
14949 431880 419255 127573 128254 238627 119509 229350 347676 720218 577845 798633
14939G98633j84214j39755F332N98779P2460k28960M7553p369K89994K12903J19490
14928A111182j78691M55720n2924L84409o96255N47723P0019p6114n67434K98845
14918A296480M60649k0128O88659j84979k70736n21897p348l30818k92668k18062
14908E99152J89325k40959j38073j98830L00261A51092L42573j92175J76580j15606
14898C62464J62736r5793J71092I8580J95818m4870j2542L98666B78718M2235
14888C20953J9843J10666K08200M4017L488K80335k32583j35894j31616M75850
14878I63259j14736j12589l8646J46687k04862J51613k98195J64650n1589o1493
14868E44099k67668O57459k87776j75996p7355J70872p4245K08353m9965k27605
$$ plain form
14939 798633 614419 474664 6332 605111 677571 448611 496164 488795 778789 991692 1111182
14928 1111182 932491 1388211 1335287 1719696 1023441 1571164 1641183 1565069 997635 1296480
14918 1296480 1757129 1737001 2425660 2240681 1969945 1448048 1440700 1109882 817214 599152
14908 599152 788477 547518 409445 210615 510876 151092 493665 301490 478070 362464
14898 362464 525200 429407 600499 98580 294398 249528 236986 635652 278718 320953
14888 320953 340796 451462 659662 703679 707167 987502 754919 619025 487409 963259
14878 963259 848523 735934 697288 843975 639113 790726 492531 657181 605592 544099
14868 544099 276431 933890 646114 470118 392763 563635 489390 697743 647778 420173
14858D20173M20535l09232j45025J65186j87834J50567Q6141A35562J68268K55802
14848E59632o4197m359l877K66102l45835N64248k1041N55481m48680k28873J69482
14837I98083r8121Q9928k42443k01003J52056k84843L0719Q6849L41460k11300
14827F61385j31804J36554j16709K04571J54771j18898p8271M6818k68289J14686
14817F04814N2246J42130k06996M734B28166L50518J51095k07532j04659J44976
14807E62564M9793L89072l72813M46820m56058J83484o2593l224l31484r2887
14797C12674N35746j0189j89596j22545k18487K11328M4615n5593p5252O4036
14787D96737M3575J78364j13384J99762k08406K12429j10144O0494j38886k6038
$$ plain form
14858 420173 840708 531476 386451 551637 363803 514370 600511 135562 303830 559632
14848 559632 495435 491076 487199 753301 407466 971714 950673 1506154 1057474 828601 998083
14837 998083 899962 989890 747447 546444 698500 413657 444376 531225 872685 661385
14827 661385 529581 666135 549426 753997 908768 789870 711599 758417 490128 604814
14817 604814 657060 799190 592194 596928 228166 578684 729779 522247 417588 562564
14807 562564 612357 1001429 628616 1075436 619378 802862 740269 737045 405561 312674
14797 312674 848420 838231 648635 526090 307603 518931 563546 507953 432701 496737
14787 496737 540312 718676 605292 805054 596648 809077 698933 759427 620541 594503
14777E94503j0778L90467k42203M13498l27901J01316k8465j90295n3370J61091
14767H07863l706j54805K47843m30840j0725L89522C25743M23061o6838j86825
14757D95141Q5027J92197k15054J92260l32019M13603j83038k57056J64613J98240
14747G53914J68390k56406K77596m19237O9747J90742j45618j56063J47480j22407
14737E08138j62524L92856p1753M1805M12214k97619K87764j17359J6337L35555
14727A345414J54918J90820J68248m72441J92566l38915k9129k84980k63626J86088
14717H48963k25270J54445p7832J16111Q7388k20929q8442L75464j81465K5929
14707H14362M00628l82713L95785O9709j30864J38870K58706M599K86783j48633
$$ plain form
14777 594503 583725 974192 731989 1145487 817586 918902 890437 700142 646772 807863
14767 807863 804157 649352 897195 466355 455630 845152 325743 748804 681966 495141
14757 495141 580168 772365 557311 749571 417552 831155 648117 391061 555674 753914
14747 753914 922304 665898 943494 524257 594004 784746 639128 483065 630545 508138
14737 508138 345614 738470 666717 708522 1120736 823117 1110881 993522 1009859 1345414
14727 1345414 1500332 1691152 1859400 1386959 1579525 1240610 1211481 926501 662875 848963
14717 848963 623693 778138 700306 816417 903805 682876 594434 969898 788433 814362
14707 814362 1214990 832277 1228062 1297771 1166907 1305777 1564483 1569082 1855865 1707232
14697A707232p6870k91323m56266j3700L1438J29415j72593P1053m7699p889n1773
14686H21025K64671l26158R7267J55117q3021l79463K65446K43163l52871N4194
14676G59370Q8206K2188J55099O8468l01957J7025L6875K71677J34929k10229
14666A041651j68543j47658L95162j27963J83455k36829J15866k72277M32649
14657A215513k38609M26413l22418K57655M7705m18143N78496l95205K89185l23077
14647A117515K9532p7328o7054K21329j04246K05596j73489K7313k0030N2593
14637A211731k02808j23801N01047j89169m0086K93911k33750J92401J1305m4659
14627A376122O8984k22006j02564n0751L29999K3766k72929K7587J29052j02796
$$ plain form
14697 1707232 1630362 1339039 882773 869073 900511 1029926 857333 928386 880687 872798 821025
14686 821025 1085696 759538 856805 1011922 928901 549438 814884 1058047 705176 759370
14676 759370 847576 869764 1024863 1093331 791374 808399 845274 1116951 1251880 1041651
14666 1041651 873108 725450 1120612 992649 1176104 939275 1055141 782864 1215513
14657 1215513 976904 1403317 1080899 1338554 1386259 968116 1546612 1151407 1440592 1117515
14647 1117515 1147047 1069719 1002665 1223994 1119748 1325344 1151855 1179168 1159138 1211731
14637 1211731 1008923 885122 1386169 1197000 1156914 1450825 1217075 1409476 1420781 1376122
14627 1376122 1445106 1223100 1120536 1069785 1399784 1423550 1150621 1178208 1307260 1204464
14617A204464K55630j59272j202k31655J23554K44366O610O8324J70032l69714
14607A311137p421Q5945M1984j89780M99848K66791l33977m01288J9585O31503
14597A924327r5276l36185o9436J41668J27733k95584O28671p37350L10946J97586
14587A797100k68538J73586J281M18536l16570L15371j26091j61459R4544n3969
14577A873791J68052q1747r238J4814M12893m09101K19744k19344J58632L21109
14567B449605l29632J06285p6K36186O4841l6466j89850L85528j96222J42183
14557B632382j93256M94184O0208M18889j01823K51077N37613O23872J286615
14548F009761L266544P901422J6617634J7000933B1924071H688570m091899j401477
$$ plain form
14617 1204464 1460094 1300822 1299620 1067965 1191519 1435885 1442495 1510819 1680851 1311137
14607 1311137 1303716 1389661 1431645 1241865 1741713 2008504 1674527 1273239 1292824 1924327
14597 1924327 1829051 1492866 1423430 1565098 1692831 1397247 2025918 1288568 1599514 1797100
14587 1797100 1528562 1702148 1703429 2121965 1805395 2120766 1994675 1833216 1927760 1873791
14577 1873791 2041843 1960096 1950858 1965672 2378565 1969464 2189208 1969864 2128496 2449605
14567 2449605 2119973 2226258 2226182 2462368 2527209 2490743 2300893 2686421 2490199 2632382
14557 2632382 2439126 2933310 2993518 3412407 3310584 3561661 4099274 4723146 6009761
14548 6009761 9276305 17177727 33795361 50796294 21924071 8688570 4596671 3195194
14540C195194J10967K55089J853115k480493r92973r0981J17880m62851N16560
14531B021507l01118J65757K93393j74106K04584k8714j24353M33030l33511Q534
14521B165003K43670M789R6901p8681L67121o37591K45020l5034n4535M61343
14511B778006j42116j20802n3169Q89L02989q501p6086J82315J69955j73683j63420
14500B696377K44534l73445M08578j32701K00699J04545J23962o1370M5770N8981
14490C315930n1945J7621k0267J08695K58864j49990k0913l39762K78085K22582
14480C618900Q0173l52048L98229o0425k69738L35590K88518m64716L52637J34178
14470D061298j67690L24170j16288L2054L1113L65823l89279K79339l80532L30389
$$ plain form
14540 3195194 3306161 3561250 5414365 2933872 1940899 1849918 1967798 1504947 2021507
14531 2021507 1720389 1886146 2179539 2005433 2210017 2181303 2056950 2489980 2156469 2165003
14521 2165003 2408673 2413462 2510363 2431682 2798803 2161212 2406232 2371198 2316663 2778006
14511 2778006 2635890 2515088 2461919 2462808 2765797 2757296 2681210 2863525 3033480 2859797 2696377
14500 2696377 2940911 2567466 2976044 2843343 3044042 3148587 3272549 3211179 3256949 3315930
14490 3315930 3263985 3281606 3261339 3370034 3628898 3478908 3457995 3118233 3396318 3618900
14480 3618900 3699073 3347025 3745254 3684829 3415091 3750681 4039199 3574483 3927120 4061298
14470 4061298 3893608 4217778 4101490 4133544 4164657 4530480 4141201 4420540 4040008 4370397
14460D370397O7173M73915k52382J06103n2997L00776k61267L22371n1433Q612
14450E031268j0813K36488j15690K1244J16383L19445p0382J62945n8630l8365
14440E593893N1268M18856j53097K10613K32566p9169n5100J22800N75959l14025
14430F604564k71569L00797K47529K36205j80262l6803K49242J94815N5108M41118
14420G840744P2853K2434K76650J2658p1636L32467j06554O9222q453k7407M94522
14409H907500l00832L48715J08411R2809N84967K87984J58012j99241k9088L97930
14399A0357167j49857L17015J19025L5305K52387J84928m1671L33503K60266K69482
14389A1937550M82534L3717L17427K96552l2389K59897J83406Q9761P68602L37684
$$ plain form
14460 4370397 4437570 4911485 4659103 4765206 4712209 5012985 4751718 5074089 5022656 5031268
14450 5031268 5020455 5256943 5141253 5162497 5278880 5598325 5527943 5690888 5632258 5593893
14440 5593893 5645161 6064017 5910920 6121533 6354099 6274930 6219830 6342630 6918589 6604564
14430 6604564 6332995 6633792 6881321 7117526 6937264 6900461 7149703 7344518 7399626 7840744
14420 7840744 7913597 7936031 8212681 8225339 8153703 8486170 8379616 8448838 8440385 8412978 8907500
14409 8907500 8606668 8955383 9063794 9156603 9741570 10029554 10187566 9988325 9959237 10357167
14399 10357167 10207310 10524325 10643350 10678655 10931042 11115970 11074299 11407802 11668068 11937550
14389 11937550 12420084 12453801 12771228 13067780 13035391 13295288 13478694 13568455 14337057 14674741
14379A4674741J6841L58050R8627J90422K23667K91657L60049J57532L37901K89239
14369A6998726Q54778j07320N35803M42633L49713O37814N37612K32174l0054
14360B0451879P79495L049O08051L18132Q37425N52436K53887R42079K05568O95779
14350B5647780N12903P75858M13490Q68978R86856M62721O50546P79759J131435
14341C2230326O66667J152174O49851J295228Q12977J083633P95985J419749J281866
14332D1388456J471613J218541J081885J856233J176567J455605J508818J999247
14324E3156965J872791J771390K299580J717208K345037K150061K524028K508112
14316G0345172K631261K408023K901102L144699L144939L537370L919229L293381
$$ plain form
14379 14674741 14691582 15049632 15148259 15338681 15562348 15854005 16214054 16371586 16709487 16998726
14369 16998726 17853504 17746184 18281987 18724620 19074333 19712147 20249759 20481933 20451879
14360 20451879 21231374 21234423 21842474 22160606 22998031 23550467 23804354 24746433 24952001 25647780
14350 25647780 26160683 26936541 27350031 28219009 29205865 29668586 30319132 31098891 32230326
14341 32230326 32896993 34049167 34699018 35994246 36807223 37890856 38686841 40106590 41388456
14332 41388456 42860069 44078610 45160495 47016728 48193295 49648900 51157718 53156965
14324 53156965 55029756 56801146 59100726 60817934 63162971 65313032 67837060 70345172
14316 70345172 72976433 75384456 78285558 81430257 84575196 88112566 92031795 95325176
14308I5325176M475061M165203M643660N150753M745863N503319N758325O128400
14300A35895760O243661O825043P566457P882577P970191Q633929R488388R906031
14292B00412037J0369461J0807504J1441750J1916459J2583624J2879314J3488146
14285B83898295J4101439J4371718J4618518J4544687J4500730J4372937J4210225
14278C84618549J3383105J2661030J1223851J0043750Q356939N698827J856192
14271D47842243k018395k424461o29882l703121n991194p213196q616368r455408
14263D07790218j1597284j2718314j4474095j4969713j5166618j5160885j5106443
14256C08596866j4894032j4457641j3667172j3218439j3020835j2162543j1637545
$$ plain form
14308 95325176 99800237 103965440 108609100 113759853 118505716 124009035 129767360 135895760
14300 135895760 142139421 148964464 156530921 164413498 172383689 181017618 190506006 200412037
14292 200412037 210781498 221589002 233030752 244947211 257530835 270410149 283898295
14285 283898295 297999734 312371452 326989970 341534657 356035387 370408324 384618549
14278 384618549 398001654 410662684 421886535 431930285 440287224 445986051 447842243
14271 447842243 445823848 443399387 442769505 439066384 433075190 425861994 417245626 407790218
14263 407790218 396192934 383474620 369000525 354030812 338864194 323703309 308596866
14256 308596866 293702834 279245193 265578021 252359582 239338747 227176204 215538659
14249B15538659r533177r997524j0160683q919931q961326p719925p650985p515157
14241A45079951o637704o252764o230630n266264m899580n394690m643510m784652
14233A00970157m211035l924635l210375l673763l727956l146480k778850l034511
14225G3262552k963259k167410k723724k518168j898021k022504j752290j827324
14217E5389852k266350j671710j510891j746615p55057j682606j826978j033423
14209D2896222j442970r55875p94113o69612j752433r60817j268948j078083n02976
14200C3470395l58087j178716r19689j013418j002053m76370o82241n36259r68402
14191B6335160m08793r61038n72177l7325q75544p24411k87535p30400k2798q32722
$$ plain form
14249 215538659 206005482 196007958 185847275 176927344 167966018 160246093 152595108 145079951
14241 145079951 138442247 132189483 125958853 120692589 115793009 110398319 105754809 100970157
14233 100970157 96759122 92834487 89624112 85950349 82222393 79075913 76297063 73262552
14225 73262552 70299293 68131883 65408159 62889991 60991970 58969466 57217176 55389852
14217 55389852 53123502 51451792 49940901 48194286 47439229 45756623 43929645 42896222
14209 42896222 41453252 40497377 39703264 39033652 37281219 36320402 35051454 33973371 33470395
14200 33470395 33112308 31933592 31013903 30000485 28998432 28522062 27839821 27303562 26335160
14191 26335160 25926367 24965329 24393152 24355827 23480283 22755872 22468337 21737937 21715139 20882417
14181B0882417m05630k15248p77981m19595j22920j61363o02480l40209p82676
14172A7054315N7909n56966k66906l38012k40895l93422j85610n13806k06871
14163A4409736J08783n87052k06701j74878l04071k20937J67408n58508k37001
14154A2396779o44216L9563k07251R690k55133j12924k93314k4984j97330l52983
14144A0357897L74817o76698J75773k14642k96582o8407M9207k47881r2045k923
14134I358516k98363k00835j21543j66222l23413M9728j52810j71213J2075j79257
14124G806663k02206J87352J11149p63739K89206Q8237j36374k64162k67008n1749
14114F797369L08082m23064J27723l07185K19676p0531l17112q7907p5391p3768
$$ plain form
14181 20882417 20476787 20261539 19483558 19063963 18941043 18779680 18177200 17836991 17054315
14172 17054315 17112224 16555258 16288352 15950340 15709445 15316023 15130413 14616607 14409736
14163 14409736 14518519 13931467 13724766 13549888 13245817 13024880 13192288 12633780 12396779
14154 12396779 11752563 11792126 11584875 11594565 11339432 11226508 10933194 10908210 10710880 10357897
14144 10357897 10732714 10056016 10231789 10017147 9720565 9652158 9701365 9453484 9361439 9358516
14134 9358516 9060153 8859318 8737775 8571553 8248140 8297868 8145058 7973845 7985920 7806663
14124 7806663 7604457 7791809 7902958 7139219 7428425 7516662 7380288 7116126 6849118 6797369
14114 6797369 7105451 6682387 6810110 6502925 6722601 6652070 6334958 6247051 6171660 6097892
14104F097892j76061j3907L71148n65568p477n0590n3454k4362j15437P5595k71650
14093E266129K90620k81644k70711J3771j24142M78708m01965m8066K57630k99942
14083D880388l0665j4065K44597k94032j52446n38833K26443m101K67899k62650
14073D322535k19438J35816j53176R8427O1079q9536o568R7783l01326m0599p0394
14062C834603p1083K45897J40995o5008j90233q507l065k60337K64120n68913
14052C318469K48850m4875J64359j05086k21719j08996K24545j57058k73938L63953
14042C408504k58173p7981L3731K356o4975p1112j37955K13579L40603j26644
14032C261933j72566j58184k81401K88983J91501l21025k67561K42005m70637
$$ plain form
14104 6097892 5921831 5907924 6279072 5713504 5706027 5655437 5601983 5577621 5462184 5537779 5266129
14093 5266129 5556749 5275105 5004394 5018165 4894023 5372731 4970766 4922700 5180330 4880388
14083 4880388 4849723 4835658 5080255 4786223 4633777 4094944 4321387 4317286 4585185 4322535
14073 4322535 4103097 4238913 4085737 4184164 4245243 4155707 4149139 4246922 3945596 3904997 3834603
14062 3834603 3763520 4009417 4150412 4085404 3895171 3886664 3883599 3623262 3887382 3318469
14052 3318469 3567319 3522444 3686803 3581717 3359998 3251002 3475547 3318489 3044551 3408504
14042 3408504 3150331 3072350 3106081 3108437 3043462 2972350 2834395 3047974 3388577 3261933
14032 3261933 3089367 2931183 2649782 2938765 3130266 2809241 2541680 2783685 2313048
14023B313048N88811j47248m16183L72198m51656O12435k87465j04748J04617
14014B583809j05290L40053m17824l37794M56417n58877M3198N9043j96546L23183
14004B189372M5446J48366k01051p6304m12498L39567K64909l52085R3826j19907
13994A919641R2431m8363k53561J96451Q843L24116J738145O282781J4472854
13985B4733338K6082540k1241965A4065579n487229k537071j535642m24767n20305
13977C560565l55365j93095l26314l14105L7253L83717m10854l4165k99200J40237
13967B188674k33657J42171j61316J27715J14529K08688o27968J21417K54481
13958B134734j71839J43870j20000j79934j66835K0788K66284J5248K6366o2724
$$ plain form
14023 2313048 2901859 2754611 2338428 2710626 2258970 2871405 2583940 2479192 2583809
14014 2583809 2478519 2818572 2400748 2062954 2519371 1960494 2003692 2062735 1866189 2189372
14004 2189372 2234818 2383184 2182133 2105829 1693331 2032898 2297807 1945722 2039548 1919641
13994 1919641 2012072 1963709 1710148 1906599 1915442 2239558 3977703 10260484 24733338
13985 24733338 50815878 29573913 14065579 8578350 6041279 4505637 4080870 3560565
13977 3560565 3205200 3012105 2685791 2371686 2408939 2792656 2381802 2347637 2048437 2188674
13967 2188674 1955017 2097188 1935872 2063587 2178116 2386804 1758836 1880253 2134734
13958 2134734 1962895 2106765 1986765 1806831 1639996 1660784 1927068 1942316 1968682 1905958
13948A905958j41139m1157j52055J38984L44624l17200j27593p0618J86770P9754
13938A806328j96193Q1741m0274n6042j36625J57086m236l03119M11863k68565
13928A451964O356K07910l02978J01431j14609L25429j17717P674k42722L7368
13918A360106J60427j35789O0824m68376M99866r3379R8202J95471n82943J95519
13908A289928J96221j15079k35769N33659o29160J85906o6498j02661K53286k09985
13898A099848K40493k49188J22011j48398o5367M3165M65612j50431j45864m6464
13888A165417j98953J35174q3974O13201n63102P0876R5950l47655M02627j73946
13878A115615J52449p6038J34170l89063R1136M7591R2900r4830J50087k77324
$$ plain form
13948 1905958 1764819 1723662 1571607 1710591 2055215 1738015 1610422 1539804 1726574 1806328
13938 1806328 1610135 1691876 1651602 1595560 1458935 1616021 1611785 1308666 1720529 1451964
13928 1451964 1458320 1666230 1363252 1464683 1350074 1675503 1557786 1565460 1322738 1360106
13918 1360106 1520533 1384744 1445568 977192 1477058 1383679 1481881 1677352 1094409 1289928
13908 1289928 1486149 1371070 1135301 1668960 1039800 1225706 1159208 1056547 1309833 1099848
13898 1099848 1340341 1091153 1213164 1064766 999399 1042564 1508176 1357745 1211881 1165417
13888 1165417 966464 1101638 1017664 1630865 1067763 1138639 1234589 886934 1289561 1115615
13878 1115615 1268064 1192026 1326196 937133 1028269 1075860 1168760 1073930 1224017 946693
13868I46693O40991n39771J11445n7359k6367K10821m1338m09028r8468J52798
13858H90417j23559J22996L13583m35208P13527o36980K1689J3416q5357M92914
13848A287438l46598L92365F11325J86370J46404J64171k33836j73361O28698
13839A329771l07207j28850K20122k04846L30554k13699Q3745k30557L48294D19361
13828A116145k89385j66501K7184J35292j33402K87039j31774k5438K51231l54820
13818G15571P9581j24206K88091j04003k04782K8347J45391J8326J29742n9927
13808I12131k16978L14199k05327j65203N6038J04713m7403J28912l70679L89783
13798I00186j03740k07839B64637L03105O1489J96991j39259k7801n4255K63477
$$ plain form
13868 946693 1587684 1047913 1159358 1101999 1075632 1286453 1245115 836087 737619 890417
13858 890417 766858 889854 1203437 768229 1481756 844776 866465 879881 794524 1287438
13848 1287438 940840 1333205 611325 797695 944099 1108270 874434 701073 1329771
13839 1329771 1022564 893714 1113836 908990 1239544 1025845 1109590 879033 1227327 419361
13828 1116145 826760 660259 687443 822735 689333 976372 844598 819160 1070391 715571
13818 715571 795152 670946 959037 855034 650252 678599 823990 842316 972058 912131
13808 912131 695153 1009352 804025 638822 694860 799573 752170 881082 510403 900186
13798 900186 796446 588607 264637 567742 629231 826222 686963 659162 604907 868384
13788H68384j80528k0158P9773M3157q4650j01406n992M01707j20272l81909O5408
13777E63514J68444k58316L30821m0900l16214Q7123j33812N31354k43715j0111
13767F78188l0662J85784j5071m09103O03903m15925l623r679j46078j27013L42828
13756F53549R788K82200C61111N34211D46358L65202O9797k19626l13145J28931
13746D77517J03564j66483K02210Q4993C06436J91803m2468M27259l69948m4874
13736D68208J50736j50353K00539l0365k93811N8660K19447k83950L44139L49950
13726A033200m14785K81493B03073K11784J37362k10883M48615C21928K53169
13717E75097k09225Q4523M3143J99884j20064o7275J86255C00359L06960k2082
$$ plain form
13788 868384 687856 667698 747471 790628 705978 604572 598580 1000287 880015 498106 563514
13777 563514 731958 473642 804463 763563 447349 534472 400660 932014 688299 678188
13767 678188 647526 833310 818239 409136 1013039 597114 593491 583812 437734 310721 653549
13756 653549 663337 945537 361111 895322 446358 811560 881357 661731 348586 477517
13746 477517 581081 414598 616808 701801 306436 498239 455771 883030 513082 468208
13736 468208 618944 468591 669130 638765 344954 403614 623061 339111 683250 1033200
13726 1033200 618415 899908 203073 414857 552219 341336 789951 321928 575097
13717 575097 365872 450395 493538 693422 573358 506083 692338 300359 607319 585237
13707E85237j44405N7684H6925L83206J41626j69039J0576A53151L98793r9977
13697D51967K53118k43799J13758J829M7488j8939j63192l132J92912k93385K01276
13686E39901o7447k18070K07314F8728K66017m2974J63071j83488L31199o2359
13676E40194j62545J31761B45188J84475N7347A52889L40076m4358j7394j55635
13666B75578q4492J81289L09610q0508k40844M4193F4941J51875R7489a23201
13655E69117A92878K61621A60482N6899J90074K5981A81947P3976J09965K05711
13645E71599A95200L19817q2843l0693l7219j71607K9323J62200j19681k6262
13635B38235J76496k4791q4869F6186Q3862K42125j25339L4516A27435L25061
$$ plain form
13707 585237 440832 498516 86925 470131 611757 442718 453294 153151 551944 451967
13697 451967 705085 461286 575044 576873 624361 605422 442230 439098 632010 338625 539901
13686 539901 472454 254384 461698 68728 334745 291771 454842 271354 602553 540194
13676 540194 377649 509410 245188 429663 487010 152889 492965 448607 431213 275578
13666 275578 191086 372375 681985 601477 360633 404826 64941 216816 314305 -123201
13655 569117 192878 454499 160482 217381 407455 433436 181947 255923 365888 571599
13645 571599 195200 515017 432174 401481 364262 192655 221978 384178 264497 238235
13635 238235 414731 389940 305071 66186 150048 392173 266834 301350 127435 452496
13625D52496R8999n6664r7515K38425k23958j55415J53505K413A33517J04409
13615B37926D1949M03613j26721P0529K48033A55296J36602n4136R8133Q8198
13605D24093e1639A27559J15866o6048k5082n5304O10943j28094B12615P0248
13595B82863L47425k04520A82905Q4087j04361J42610a1045C63781J68847o6428
13585D66200A95150A4018K27638N171K45296j47380j12111m0438R8463J82002
13575D72659A02068N64562k81131j06925J45405M0889j268J30741k71078C1120
13564A90836P6369j01631M59983A05055B0749M76709B21220K34134j82575a12301
13553A48746M9585a47492B80540J28062A30071N0992C6012R1009i1056D12672
$$ plain form
13625 452496 551495 494831 397316 635741 411783 256368 409873 412286 133517 237926
13615 237926 41949 445562 318841 389370 637403 155296 291898 237762 335895 424093
13605 424093 -51639 127559 243425 177377 152295 96991 707934 579840 212615 282863
13595 282863 630288 425768 182905 266992 162631 305241 -11045 363781 532628 466200
13585 466200 195150 14018 241656 246827 492123 344743 232632 192194 290657 472659
13575 472659 102068 666630 385499 278574 423979 464868 463600 594341 323263 31120
13564 190836 267205 165574 625557 105055 20749 497458 221220 455354 272779 -112301
13553 148746 198331 -147492 280540 408602 130071 181063 36012 127021 -91056 412672
13542C34429j56329J74054I9606A7557Q064J99662L11471A0555c25C18951N9222
13531C78173C8649J76253K44997j00606j6985J97128f827B68403J05028q3727
13521B89704o5382K20934A85093b8765C82181j82338b0739D44075a85A44395M14916
13510E59311a65251A18275N9460H6182K91331p338B5979K37887A4812L78496N6961
13499D50269j39112n5185R2916E2508K90024A41583B7219K03703H2626i3598A72626
13487A60300J60514A14164J35154A11096O6615J43688n1879j02726p3505K23760
13477C17049n4921q7097J15154E2902J25392K24521J27493j32737j18886A4722
13466D95889B45349j3659a94016A76169J4493J93270j50041J82539A07239J25220
$$ plain form
13542 334429 178100 352154 99606 17557 25621 225283 536754 10555 -325 318951 378173
13531 378173 38649 214902 459899 359293 342308 539436 -6827 268403 373431 289704
13521 289704 224322 445256 185093 -28765 382181 199843 -20739 444075 -185 144395 559311
13510 559311 -165251 118275 177735 86182 377513 370175 25979 263866 14812 393308 450269
13499 450269 311157 255972 348888 52508 342532 141583 27219 230922 82626 -93598 172626
13487 160300 320814 114164 249318 111096 177711 321399 269520 166794 93289 317049
13477 317049 262128 175031 290185 52902 178294 402815 530308 397571 278685 14722
13466 495889 245349 231690 -194016 176169 190662 383932 233891 416430 107239 232459
13456B32459G4194r613J58601A08187c1288B88983i4386A87425o2792J15929r5464
13445A45098L34992k30664i9336E7157M59367a55284B30607q3159n5985J60941
13435B52404a8075B75133j25318G2139a57792B91494I9845J4917R920J9746K90187
13424D34615a66826B72813C5672K06910a02101D01903E5716K08475M8146a21995
13413A85131B0014L69981k3395r7122k6481J85881j43284C9901J98551D2868N17529
13402E60397A15210J48675I0855J19800J02409b12456F0114j3096M23759G2997
13391C0316J47588h0556A13724K53820H8417L47706a49350c4555I8672J00017
13381A98689J10236d8497A60468a73170B66615b1291F3702a24104A26875L10896
$$ plain form
13456 232459 74194 64581 223182 108187 -31288 288983 -94386 187425 124633 240562 145098
13445 145098 480090 249426 -99336 57157 516524 -155284 230607 147448 91463 252404
13435 252404 -18075 275133 149815 72139 -157792 291494 99845 114762 124682 144428 434615
13424 434615 -166826 272813 35672 242582 -102101 401903 55716 264191 312337 -121995
13413 185131 20014 389995 366600 269478 242997 428878 285594 39901 238452 42868 560397
13402 560397 115210 263885 90855 210655 313064 -212456 60114 47018 470777 72997
13391 30316 177904 -80556 113724 367544 88417 436123 -149350 -34555 98672 198689
13381 198689 308925 -48497 160468 -173170 266615 -21291 63702 -124104 126875 437771
13371D37771J56916c52434B15610A01596C9778J57353K38482j15130J58858B08222
13360c0653E63318A84759J64227r2348J21534b43529D11140A40090j8149j0967
13350A10974J88314o6055r5976J14385K8179A21904R8812K27813K3575A56573
13339G963N65964c4750D56993k9301K4554a12345B12003D2806R7986J76703j54393
13328A63102C65J76905p1889G020J01422b00745I4478l8242N118B7796c1960E5752
13315B32450p6576Q697P0361q3411J63878O5886A86073K43325p8778I2947K43039
13304C35986p7887g799B55466j2512a37836A89304M7159j08170a53441G2245J02004
13293A74249J98482j17817K2499n1657e15583d8028j7943J8783C96868a34485
$$ plain form
13371 437771 594687 -352434 215610 101596 39778 197131 435613 320483 479341 208222
13360 -30653 563318 184759 348986 256638 378172 -243529 411140 140090 121941 110974
13350 110974 299288 233233 137257 251642 279821 121904 220716 448529 472104 156573
13339 7963 573927 -34750 456993 427692 452246 -112345 212003 42806 140792 317495 163102
13328 163102 365 177270 105381 7020 108442 -200745 94478 56236 61354 27796 -31960 55752
13315 232450 155874 164571 234932 151521 315399 381285 186073 429398 350620 92947 335986
13304 335986 258099 -7799 255466 242954 -137836 189304 236463 128293 -153441 72245 174249
13293 174249 372731 254914 277413 225756 -515583 -48028 -65971 -47188 396868 -134485
13282C06089h3812A58968k491k6461D8884J05897J13424I171K89093H2704l0021
13271E2683K91137A44884K86565E8338J92149q0288L14136b4540D30053N0567
13261D80620B27393a8126A75971J70196f3624p2503N952B07907c1908k9532F6904
13249A34366J61500R7182c27255F6281R2809a04985I7703b31757B22716J03005
13239C25721p7467G2907C613J30796L1077K1509A9346M8642e9830o6560H4863
13227b01990B30421o8303o9158J10542b757E2910J25842b11442C67989C5317J09981
13216A45298Q0440F1124a51331A09100J1525A1177N61861j38791A2560K3785j0232
13205B6113K90994A55737D846Q7763d4440D5147a24241K2255L4246G7947J20096
$$ plain form
13282 306089 -83812 158968 156477 130016 48884 154781 268205 9171 298264 82704 52683
13271 52683 343820 144884 431449 58338 250487 170199 484335 -24540 430053 480620
13261 480620 227393 -18126 175971 346167 -63624 -136127 -130175 207907 -31908 -61440 66904
13249 134366 295866 393048 -327255 66281 159090 -104985 97703 -231757 222716 325721
13239 325721 248254 72907 3613 134409 165486 186995 19346 67988 -59830 -126390 84863
13227 -201990 230421 162118 92960 203502 -2757 52910 178752 -211442 367989 35317 145298
13216 145298 225738 61124 -151331 109100 120625 11177 573038 434247 12560 36345 26113
13205 26113 317107 155737 4846 92609 -44440 45147 -124241 -101986 -67740 77947 198043
13194A98043a44495A33813l6793e1626A59373i525G5207A2816R9891a24162E7004
13182a68103B36417J27670a53573j19090h7215B14678G3943P2661b40026A67322
13171A57329K87562i3318l3957D43607c57055A04184a30012e4236C95797a2790
13160C19489j27411H0556A4332d3688B32695o8674f1682A19655D5697f3861A9817
13148b4112j2169F9927k5161e80m3615A26514J86331D6055o41M76651D8813a18594
13135A70963f4892E166J09030h929B61121q0924b99230A24767a84957I5304e726
13123c2924A34474l7531a01841b3981n8372l5922b7914q6859I8019j6783J37190
13112B18426k1545a3876k98829J10529A81643E8322K01051g7538G9706a26815
$$ plain form
13194 198043 -144495 133813 97020 -51626 159373 -9525 75207 12816 112707 -124162 57004
13182 -168103 236417 364087 -153573 -272663 -87215 214678 73943 146604 -240026 167322
13171 157329 444891 -93318 -127275 443607 -357055 104184 -130012 -54236 395797 -12790
13160 319489 192078 80556 14332 -43688 232695 164021 -61682 119655 45697 -63861 19817
13148 -24112 -36281 69927 44766 -580 -44195 126514 312845 46055 45414 522065 48813 -118594
13135 170963 -64892 5166 114196 -8929 261121 180197 -299230 124767 -184957 95304 -5726
13123 -32924 134474 96943 -101841 -23981 -82353 -118275 -27914 -114773 98019 81236 218426
13112 218426 196881 -13876 -312705 -202176 181643 58322 259373 -77538 79706 -126815
13101A63642J5599d5610G793L1999j214J36002A5029K14247i0808C90466A71670
13089f8239L2248G7503Q7335a35550L0046C6020K0536j7371J5291J68226f3927
13077B35691P4464a47088F8521K1255i8756A1075a6124A36611a14802F512b35444
13065B89059O3735p3929f9276A78060N2106J1181D0281K92958b5560A39990K9897
13054A69887a70692q7753f3976C37584b7825A60051a12388M9272A45995C6664
13043C59999g9040A73032o5856A2011K05459E4327A236K99547L8834j53886D3402
13031A04297K22363l4352h0417B70719j34989c0321j02964D8942c8858q3078A63659
13019B84796L7966O750o3619A63J75127J73050A41735b29842A18709P8344E320
$$ plain form
13101 163642 179241 -45610 7793 39792 38578 174580 15029 229276 -90808 390466 171670
13089 -68239 -35991 77503 164838 -135550 -105504 36020 56556 39185 54476 222702 -63927
13077 235691 310155 -147088 68521 89776 -98756 11075 -16124 136611 -114802 6512 -235444
13065 289059 352794 278865 -69276 178060 230166 241347 40281 333239 -25560 139990 169887
13054 169887 -170692 -258445 -63976 337584 -27825 160051 -112388 -63116 145995 36664
13043 359999 -79040 173032 107176 12011 217470 54327 1236 300783 339617 185731 43402
13031 104297 326660 292308 -80417 270719 135730 -30321 -133285 48942 -38858 -121936 163659
13019 284796 322762 329512 265893 163 175290 348340 141735 -229842 118709 197053 5320
13007a39130A4724f2649I4455a81E4202N3763J69999H6077P8800q1478J51496
12996B34895B1362K34411J46325b85447h2967K0656A83765a40889A56398A9769
12985a53863A957L612b36633B6369K24818K2317A35623J10913P7897H3663A3379
12973B93638c1588A14762g8971q3054K2237b2709A25704Q7071a79164A49888F6277
12961A53308a30837A02574a76128F9675k7081f4698j49000N8133e8872m70228
12951e29100b6946A09803Q4219A7621K85587A15087b14318d4982k88201a44536
12940b35449a419B64211i2028I3811e5915C8955L3747c51090B8714N6960e8280
12928a04667E6156J05756c2725n4897I2829J10546L6730N0516b03680f9575A48052
$$ plain form
13007 -139130 14724 -62649 94455 -181 54202 107965 277964 86077 164877 83399 234895
12996 234895 21362 255773 402098 -285447 -82967 -62311 183765 -140889 156398 19769
12985 -153863 1957 5569 -236633 26369 251187 273504 135623 246536 324433 83663 13379
12973 293638 -31588 114762 -78971 -162025 -139788 -22709 125704 212775 -179164 149888 66277
12961 153308 -130837 102574 -176128 69675 42594 -64698 -213698 -155565 -58872 -529100
12951 -529100 -26946 109803 194022 17621 303208 115087 -214318 -44982 -333183 -144536
12940 -235449 -1419 264211 -92028 93811 -55915 38955 72702 -351090 28714 85674 -58280
12928 -104667 56156 161912 -32725 -87622 92829 203375 240105 290621 -203680 -69575 148052
12916B57761j16506a75939I4029c9155A37553a29224H789i189C97507A83767J16993
12905C00760A17175a33092c1230B08745b8828j24535j25972b0879K214j54205
12895a72870C43803F2818J59033H4055b42888h7556k72363c2507k51688D3346
12884b91338A6442b10274j4670H7695l1886A930N9593a33596L0213m5346b2267
12872A99726h6873A27819a5012j0104o6556B33566a8460A34470b55001R0401l081
12861a67681C37744f6166C65714C0407f6743j3860C17114C6397R7774K7584a97661
12849a40586B873d7762b3317a0703F8820C1259a40223f9920B48735f1629k38530
12838c00159J08277F8008M5789b69002G7095b22624e3203n3550F2865a93781C7847
$$ plain form
12916 257761 141255 -175939 94029 -39155 137553 -129224 8789 -9189 397507 183767 300760
12905 300760 117175 -133092 -31230 208745 -28828 -153363 -279335 -20879 -18665 -172870
12895 -172870 343803 62818 221851 84055 -242888 -87556 -359919 -32507 -284195 43346
12884 -291338 16442 -210274 -224944 87695 55809 1930 61523 -133596 -103383 -148729 -22267
12872 199726 -86873 127819 -15012 -25116 -91672 233566 -18460 134470 -255001 -164600 -167681
12861 -167681 337744 -66166 365714 30407 -66743 -80603 317114 36397 134171 161755 -197661
12849 -140586 2873 -47762 -23317 -10703 68820 31259 -140223 -69920 248735 -61629 -300159
12838 -300159 -191882 68008 113797 -269002 77095 -222624 -53203 -106753 62865 -193781 37847
12826A69000d31358f7103p0899C6375a17422g567l9636A36477i3373j95254g1363
12814a555A33854a39410J9818E0601j5876a94617R206E54521b6356C33178c06994
12802C16149a34259M7931k98963a42039M6862j52455A63555c18106j58149B7576
12791A11741a46698R288r1227C5205e5036r3193c1109J0770l04234F1718M2674
12780A04392O7070K1304I4630c19338A63918d7266B06718o6918E9454g3405L812
12769f9593J4217B40631g0188B3487K18660c41965J04360A07479r101a44405b4187
12757E4222a11000m87N3978A2481J11269c6035R803O266B11341r2329g713j37325
12745a45038D884J78923a15808k854n0761A46687a13573B90088A31380i3553D6407
$$ plain form
12826 169000 -431358 -67103 -138002 36375 -117422 -7567 -47203 136477 -93373 -288627 -71363
12814 -1555 133854 -139410 -119592 50601 34725 -194617 -185411 554521 -26356 333178 -306994
12802 316149 -134259 -86328 -385291 -142039 -95177 -247632 163555 -318106 -476255 27576
12791 111741 -146698 -137410 -228637 35205 -55036 -148229 -31109 -20339 -324573 61718 104392
12780 104392 171462 192766 94630 -319338 163918 -47266 206718 139800 59454 -73405 -69593
12769 -69593 -55376 240631 -70188 23487 242147 -341965 -237605 107479 98378 -144405 -24187
12757 54222 -111000 -111487 -57509 12481 123750 -36035 -26232 -19966 211341 119012 -7713 -145038
12745 -145038 4884 183807 -115808 -118662 -169423 146687 -113573 290088 131380 -93553 46407
12733A22937m2906J08353b889A94123a02680E1260p072e0976A38048f8477A45669
12721d5684A80668d2620F7775d357G0493J48375a13838A87774J29361E118a009
12709A11238i5382B30108k4975a33524B00470J7853L01616k44726e9928r319F8912
12697A48234G2661J57279r7006i6329d5169j13165P1952A37783C1172g1067A03673
12685A89269o4701i4572I5337K05973E9348L00024G8308K08838I0433b57048c9129
12673A39516Q3199G4125j2655L4275b53829B19930r5898C1854M21492i6164B6311
12661A54963n7362L39004a24179k6577k69211A21515e9865j11506H2389K16345
12651B98734A125K8743L12877I3739k2227a45630B01453R0f7240k8438p7370P2772
$$ plain form
12733 122937 80031 188384 -2889 194123 -102680 51260 44188 -50976 138048 -68477 145669
12721 -45684 180668 -42620 67775 -4357 70493 218868 -113838 187774 317135 5118 -1009
12709 111238 -95382 230108 205133 -133524 200470 218323 519939 275213 -59928 -69247 68912
12697 148234 72661 229940 132934 -96329 -45169 -158334 -86382 137783 31172 -71067 103673
12685 189269 124568 -94572 95337 301310 59348 359372 78308 287146 90433 -257048 -39129
12673 139516 222715 74125 61470 95745 -253829 219930 124032 31854 453346 -96164 26311
12661 154963 97601 436605 -124179 -150756 -419967 121515 -59865 -171371 82389 298734
12651 298734 1125 29868 342745 93739 71512 -145630 201453 201543 -67240 -95678 -173048 -100276
12639a00276B51303m0174j02709Q2485E8518j3073d5239B87789L1884j22171q4356
12628A13146P2155b50194A48654A9594R4944f2365A53003J96415a49299l2492
12618a81791D37956F1723b61245I5674b6343f019k4748E4029a71148k8099A74618
12606a08385B40092n3548i2184A10698k1266J8468k2116a42999L3698A9188P2892
12595I2080a98907A69672a64421A7907h0383b7982A77830p8576c11303C9519K07009
12584B46528a30238F6680a03512j48717C03528j20032c6398E7022c87270g1217
12573A08742d2405j27152j01468P5594A8004K52849a83364m9780N8184c1297H6768
12561B7960Q001N655a0806c258n7457C11326g2500k54874a20935k27368B63197
$$ plain form
12639 -100276 251303 211129 108420 190905 58518 45445 -45239 287789 319673 197502 113146
12628 113146 185301 -250194 148654 19594 114538 -62365 153003 349418 -149299 -181791
12618 -181791 437956 61723 -261245 95674 -26343 -6019 -30767 54029 -171148 -199247 174618
12606 -108385 240092 186544 -92184 110698 89432 107900 85784 -142999 -109301 19188 92080
12595 92080 -198907 169672 -164421 17907 -80383 -27982 177830 99254 -311303 39519 246528
12584 246528 -130238 66680 -103512 -252229 303528 183496 -36398 57022 -387270 -71217
12573 108742 -42405 -169557 -271025 -195431 18004 270853 -183364 -233144 -174960 -31297 86768
12561 27960 35961 41616 -10806 -3258 -60715 311326 -72500 -327374 -120935 -348303 263197
12549B53415a78817l3886L3357c019j34143d1096F7547O8679i3730l68882a76018
12537h8703B15891I2084J69437j0991d7061l6831A1838J13320h0793k57970K9058
12526c09705a9622j7389a2551C01470a95956c2954A74656c49851K6655A10591
12515B35981H4257g2639j07583D2476c6434e219H628O8136a30018a668j17677
12504a19345C74982a48572F3929a28973B04344c54499d7967j517L450B24325a46492
12492F442J40205J6068E7924J45858f8321r48I8696a42850N6198A46883i0964
12480G835J69333K51405P59B13771i844C25956L7754a21336j01976B75882a67726
12468H9634e8920A33429n0099c2717J1194E2069J20008a26362H5844a98816n577
$$ plain form
12549 253415 -178817 -212703 -179346 -3019 -137162 -41096 67547 136226 -93730 -462612 -176018
12537 -88703 215891 92084 261521 250530 -47061 -83892 11838 125158 -80793 -338763 -309705
12526 -309705 -19622 -37011 -12551 301470 -195956 -32954 174656 -349851 -323196 110591
12515 235981 84257 -72639 -180222 42476 -36434 -5219 8628 76764 -130018 -1668 -119345
12504 -119345 374982 -148572 63929 -128973 204344 -354499 -47967 -49484 -46034 224325 -146492
12492 6442 146647 162715 57924 203782 -68321 -69269 98696 -142850 -86652 146883 -90964
12480 7835 177168 428573 429332 213771 -9844 325956 363710 -121336 -223312 275882 -167726
12468 89634 -58920 133429 83330 -32717 -21523 52069 172077 -126362 85844 -198816 -204393
12457b04393P56k43698A22410K75004d38970A29094a46708j0612A68079J46439
12447C14518c19720R3521B90027I3245b7531j73053d2342A53747d9859B4791n609
12436A9182n634K96110a55153B4378K8685h3534L3497b248C3017O3889k6576d91709
12423I4601B3070a2633j01498b652r6489d1801m58118A26574h230j17156E37170
12411a93010k24536a00782K68A71277j3379b93473A78167b31631i5000o4884A83841
12399A91521O2291b60749O0654D73494a32203A26344k3048P8426G270J93994P2902
12388B74166k1189d0336k0287j25702B28356b22178a8462j20624o4068i6477l7893
12377a34370f6466I9971b47150E8959K33342R7951q7360j49955f263k17458g7561
$$ plain form
12457 -204393 -203637 -447335 122410 397414 -438970 129094 -146708 -157320 168079 314518
12447 314518 -319720 -226199 290027 93245 -27531 -200584 -42342 153747 -49859 24791 19182
12436 19182 13548 309658 -155153 24378 53063 -83534 -50037 -2248 33017 96906 70330 -491709
12423 94601 23070 -12633 -114131 -2652 -99141 -41801 -499919 126574 -8230 -125386 537170
12411 -193010 -417546 -100782 -100514 171277 157898 -293473 178167 -231631 -95000 -159884 183841
12399 191521 253812 -260749 -200095 473494 -132203 126344 103296 181722 7270 201264 274166
12388 274166 252977 -40336 -60623 -186325 228356 -222178 -18462 -139086 -203154 -96477 -134370
12377 -134370 -66466 99971 -247150 58959 292301 390252 302892 152937 -6263 -223721 -77561
12365H1282K6767a5237A71840B7722K2378a46373N8273D602b77645N1099A49597
12353f7758M499j21333A9604b83402e5183A4707a56583N9354E1012c4759j73872
12342b08631R5417B50954a15884C04088a287A4222g54B56165m9519m38D1422h3396
12329D2461L4011K49786J66650A63680J0710A5152D55K19035P2440q2882i768
12317F3296M16445d7018D82061a6940A03996c2391B06516q5998b18286h765n022
12306a3787D341K4313b0927l9358A39940J89886k8383A43368a28058D7784a95312
12294D4072M387R3419b38643A12060m2102b9847A5371o0D906a6087G9651A9654
12281C9585R086a69373A67006K52624F3068a60849A03247a30791E8975L26260
$$ plain form
12365 81282 108049 -15237 171840 27722 50100 -146373 -88100 4602 -277645 -226546 149597
12353 -67758 -63259 -184592 19604 -283402 -55183 14707 -156583 -97229 51012 -34759 -208631
12342 -208631 -113214 250954 -115884 304088 -1287 14222 -754 256165 206646 206208 41422 -83396
12329 42461 76472 326258 492908 163680 174390 15152 455 219490 291930 209048 -9768
12317 63296 479741 -47018 482061 -16940 103996 -32391 206516 120518 -218286 -8765 -13787
12306 -13787 4341 28654 -20927 -60285 139940 329826 301443 143368 -128058 47784 -195312
12294 44072 48459 141878 -238643 112060 69958 -29847 15371 15311 4906 -16087 79651 19654
12281 39585 48671 -169373 167006 419630 63068 -160849 103247 -130791 58975 385235
12271C85235A13009a35878G2279a121E39320H6601R6225E3073J53284L6056F5177
12259B08863L429k2555E9939N4366K50495N5924F1749K83759H2642J59280B7602
12247G832J5984a51956C2587a29856B32918K04886A87770E9819K50361G2372K0418
12236I2790a14675A15755B9549O5402H264J1911a51534A874b73580H3506O4860
12225A48366N9179a8961C14687L0089j00826F3888M55831B31577G8567N70649
12215F49216A02855R234J50049H8111k4694J20466O7855p6604F4259K02215n1385
12204B15089a66774B83743K0330m8424N6507A50754M294J75807E7675Q5599G1494
12192C6284J09310K99364A504L5445r446a80253B65861I6175M58369a28288c7820
$$ plain form
12271 385235 113009 -135878 72279 -1121 539320 86601 182826 53073 206357 242413 65177
12259 208863 212292 189737 59939 114305 364800 420724 61749 345508 82642 241922 27602
12247 7832 23816 -151956 32587 -129856 232918 437804 187770 59819 310180 72372 92790
12236 92790 -114675 115755 29549 94951 8264 20175 -151534 1874 -273580 83506 148366
12225 148366 207545 -18961 314687 344776 243950 63888 519719 231577 78567 649216
12215 649216 102855 112089 262138 88111 63417 183883 251738 175134 64259 266474 215089
12204 215089 -166774 283743 304073 255649 312156 150754 155048 330855 57675 143274 71494
12192 36284 145594 444958 1504 36949 27503 -180253 265861 96175 554544 -128288 -37820
12180B9774c2724C27292m0889D7621L13964h579C34990O8183j36773p1332b4534
12168C479J37939Q2700J93322j62202n543J41116A93678q2540J94479j48838K81915
12157D38694j77195A16248A4178Q1868a34696j07337A64611R2203a35444F350
12146A18805a63526c6769A35196o6401N4830O2097a07837H8349J25901P4984a67835
12134d0133B50662B7297J17248b7972F1940K39928r3964h1671F2126K07966p1168
12123A98924R829j0598q5666J19946L08414b71324e1192B25232l9024F3069k5283
12112C7786K57363n3453h0489A77133L3436b69527C8510f9782o9352D27069A234
12100B71508A30947C2119L48488b1428N665A57557J06874I4044M37111j15348
$$ plain form
12180 29774 -32724 327292 286403 47621 361585 -8579 334990 403173 266400 195068 -24534
12168 3479 141418 224118 417440 255238 249695 390811 193678 111138 305617 156779 438694
12157 438694 261499 116248 14178 96046 -134696 -242033 164611 256814 -135444 6350
12146 118805 -163526 -36769 135196 68795 123625 185722 -107837 88349 214250 289234 -167835
12134 -40133 250662 27297 144545 -27972 61940 301868 207904 -81671 62126 270092 198924
12123 198924 208753 198155 112489 232435 540849 -271324 -51192 225232 186208 63069 37786
12112 37786 295149 241696 -80489 177133 210569 -269527 38510 -69782 -139134 427069 1234
12100 271508 130947 32119 380607 -21428 -15763 157557 264431 94044 531155 415807
12090D15807o135a77617A38249j5094b28059C81962a94707L3106H8642J27794
12080B16436C8046a08454c1900B62318B7084c0412A53355B1605L04868e0318D59161
12068A60628P8021E8296N0439n2785K10662b1722B40527e0286E603N6198B6365
12056c31098J11599d1349j78141e4561A65063P7892a42293B41374a61008I2269
12045b1172r0948k79202g4951k52092h4698p8782B7075L40553g0970A27101a2896
12033D4695K55279J19035k02548I4977h7028B77244b08469d4987q1101P330M4221
12022g4537L6618G4010J56156j3621o0018J84000n2076b97092B8137b58680g928
12010c1352B67459r5459O9244F6656g1293B52738a29679j30720B76427G1726c97193
$$ plain form
12090 415807 409672 -177617 138249 123155 -228059 381962 -194707 -161601 88642 216436
12080 216436 38046 -108454 -31900 262318 27084 -30412 153355 21605 326473 -50318 459161
12068 160628 238649 58296 108735 55950 266612 -21722 240527 -50286 5603 61801 26365
12056 -331098 -219499 -41349 -219490 -54561 165063 242955 -142293 241374 -161008 92269
12045 -21172 -112120 -391322 -74951 -327043 -84698 -163480 27075 367628 -70970 127101 -12896
12033 44695 299974 419009 216461 94977 -87028 277244 -208469 -44987 -126088 -118758 -74537
12022 -74537 -37919 74010 230166 216545 156527 340527 288451 -297092 28137 -258680 -7928
12010 -31352 267459 172000 241244 66656 -71293 252738 -129679 -260399 276427 71726 -397193
11998a81149c0316C05318H9625M0768m5394b27175L9891C28130b41812f7802o1953
11987a29755A58431a83580m5424J12952M4970D7193g6471q3077M1842B18578a42918
11975b3379B2853a43491l0339A08356K03563I253a61589j83192h5026L6686l0584
11964g8924b9970D4529n19L4019N1268e1496j01469l4468H4529b33744H9632B9504
11951A49993a86877N1132D7396b1169j05676A24487b02261c0046A65088C3658
11940a97882d3868G1030j8446a96931B02099a03310K0940j54893O4241C01158
11929A15672a61053B07430a96206f3915B14967i9764M2999E6893b18584G643d23339
11917i7221l5405G2462a23465A95553q6157b25462A72147b20823A96690m0373
$$ plain form
11998 -181149 -30316 305318 89625 130393 84999 -227175 -187284 328130 -241812 -67802 -129755
11987 -129755 158431 -183580 -229004 -116052 -71082 47193 -76471 -159548 -117706 218578 -142918
11975 -23379 22853 -143491 -173830 108356 311919 9253 -161589 -344781 -85026 -48340 -78924
11964 -78924 -29970 44529 44010 78029 129297 -51496 -152965 -187433 84529 -233744 89632 29504
11951 149993 -186877 -135745 47396 -21169 -126845 124487 -202261 -30046 165088 33658
11940 -197882 -43868 71030 52584 -196931 202099 -103310 -82370 -237263 -173022 301158
11929 115672 -161053 207430 -196206 -63915 214967 -99764 -56765 56893 -218584 7643 -423339
11917 -97221 -132626 72462 -123465 195553 109396 -225462 172147 -220823 196690 156317
11907A56317a13438B43748n3285J942g131j43779A26017a28665B01495b62484
11896a04830m9814j01374i3432B71066I192e8869B68619L2205j16017J19321l5107
11885B69021i6233D4958AJ00828b51118B65017q0896c046r5179A84501b00495
11873f6680k172B2432N6039Q1516K22948b50327B063h9258G7749R034d3648j49137
11861a92785C9198b1872D9261Q1440J94338C782a25284b318l12527K4958J4394
11850b75493P2295j33702f1735j0329j73138h233q267j02565j4441b5103m2710
11839f7813j44608A65563J5852i6487m0462K6538l09376B41632D0666a78758L9812
11828a38946D9716a60535F2560f1320l01359a60403D9327a37204D11767a74807
$$ plain form
11907 156317 -113438 243748 190463 192405 -7131 -150910 126017 -128665 201495 -262484
11896 -104830 -154644 -256018 -93432 271066 9192 -58869 268619 300824 184807 304128 269021
11885 269021 -96233 44958 1 100829 -251118 265017 184121 -3046 -98225 184501 -200495
11873 -66680 -68852 22432 78471 159987 382935 -250327 2063 -89258 77749 86783 -43648 -192785
11861 -192785 39198 -21872 49261 130701 325039 3782 -125284 -2318 -314845 -289887 -275493
11850 -275493 -203198 -336900 -61735 -72064 -245202 -8233 -16500 -119065 -133506 -25103 -67813
11839 -67813 -212421 165563 181415 -96487 -136949 -110411 -419787 241632 40666 -178758 -138946
11828 -138946 49716 -160535 62560 -61320 -362679 -160403 49327 -137204 411767 -174807
11817A46927g7974I5978J01141E0469a24298o2001J7297O8447F6848R4385n6416
11806A04817I630c35463J30512g503p6354A34849f9996j28480A1855a64531K7018
11795a37513N7917B99305F0924a07411B29649e1574E8587N0059B2640O9724D4484
11783a72018c1882B29839e3842j77100i3902a8732k70689A04557A7867a37471
11772a3551k0808o4851p4060B74200l8899a08545b5361A38428K171a38361f1130
11760B01467H4034a35943L5184A11588B9343g7313j32866A40755l0355i6781b3908
11748b47670A32524j4467i4395L3598H8330d20214J73193L1930A87741a9344j65943
11737a85287f287C14358a88886B464N3610A9652P1487j3302N312h2239D5877a1679
$$ plain form
11817 146927 -77974 95978 197119 50469 -124298 -186299 -169002 -100555 66848 161233 104817
11806 104817 9630 -335463 -204951 -7503 -83857 134849 -69996 -198476 11855 -164531 -137513
11795 -137513 -79596 299305 60924 -107411 229649 -51574 58587 108646 22640 92364 44484
11783 -172018 -31882 229839 -53842 -230942 -93902 -18732 -289421 104557 17867 -137471
11772 -13551 -34359 -99210 -173270 274200 235301 -108545 -25361 138428 140599 -138361 -61130
11760 201467 84034 -135943 -100759 111588 29343 -77313 -210179 140755 110400 -96781 -23908
11748 -247670 132524 118057 -94395 -60797 88330 -420214 -247021 -215091 187741 -19344 -185287
11737 -185287 -6287 314358 -188886 2464 56074 19652 91139 77837 83149 -82239 45877 -11679
11724a21176a5166C43342j1375E8898K41526H7849D0428b24131B46061b42556
11713c33986d1879A34511l097c05441A4097M7390J70804B4293J05876b6061O309
11702a9752j64647h4519a5167A0503R3616f7885A60398b1927B19887e690B10231
11690A83455c48856A5604P9572a82220G009N29030i8035B26690b1651A31259b9329
11678A09495K99203i7315B08075a58168j1141E5607J73840k5893b3972A14585
11667A30043a49381B1702b64424I0669J07931I4373a12834A18739m497c70520
11656A18481c27529F2263j1587O1498d6739j8319B81334G3214a28266A19106A9393
11644D7083b13626Q258a6293j66134F6840h3268o4157A1847K62354a44163N9783
$$ plain form
11724 -121176 -15166 343342 331967 58898 300424 87849 40428 -224131 246061 -242556
11713 -333986 -41879 134511 131414 -305441 14097 61487 232291 24293 130169 -26061 -19752
11702 -19752 -184399 -84519 -15167 10503 104119 -67885 160398 -21927 219887 -5690 210231
11690 183455 -348856 15604 95176 -182220 7009 536039 -98035 226690 -21651 131259 -29329
11678 109495 408698 -97315 208075 -158168 -169309 55607 229447 203554 -23972 114585
11667 130043 -149381 21702 -264424 90669 198600 94373 -112834 118739 114242 -370520
11656 118481 -327529 62263 50676 112174 -46739 -65058 281334 73214 -128266 119106 19393
11644 47083 -213626 -205368 -16293 -182427 66840 -83268 -147425 11847 274201 -144163 -84380
11633h4380A457a62033A1237a28362A9077J6970d446I3802N8273C7536K2388L24576
11621C84500j59487A01285J1220R4114A03204e6257k75855D0785P2078c13111
11610H9451C5309j5293a36579R291k49109c3711A43481j0378k5082b5930k59984
11599b85914e5733A62636f0730C94649F761J67602L6382b9271e822k57171A92531
11587b21023O635A25422J23436D7893d6498B44217J6576a3758A16023e0639m2183
11576i2822A76940n3784A7291L89616A72269d0579A28204H081M69632h3498A5768
11564G595K43316b60166g2930q8244C87682a8227B07392A992r09b77095F0917
11552A78360b6549A6337i5021A20458h5589j14498P2611A15781k2830f6900B62568
$$ plain form
11633 -84380 1457 -162033 11237 -128362 19077 36047 -4446 93802 152075 37536 59924 384500
11621 384500 225013 101285 112505 206619 103204 -56257 -332112 40785 112863 -313111
11610 89451 35309 20016 -136579 -127288 -376397 -33711 143481 133103 108021 -25930 -285914
11599 -285914 -55733 162636 -60730 394649 6761 174363 210745 -29271 -5822 -262993 192531
11587 -221023 -214388 125422 248858 47893 -46498 244217 260793 -13758 116023 -50639 -92822
11576 -92822 176940 123156 17291 406907 172269 -40579 128204 8081 477713 -83498 15768
11564 7595 250911 -260166 -72930 -161174 387682 -18227 207392 1992 1083 -277095 60917
11552 178360 -26549 16337 -95021 120458 -85589 -200087 -127476 115781 92951 -66900 262568
11540A63512K15538f5001J8161n7381B61777C8059J07188A9629c9971r4004H4226
11528f2507m395E08467g9136C939a983B48112r3278a98124Q6099I3757b5712H5989
11515b31771A42189o6763j269A4325J28642J64843j49333d73895A45347P7243
11505B22590J22219F4759L9829c3148o757G9523i9753A20951A8474K14635h8149
11493A48381O7599O3029A13573L7872e3593C61104r9006A8551J29789K39920j78674
11482B09586J12047M4472g4869G7190i6702A62152a44200B25408O2684c9954k62664
11471c02618D326i0736B27323p2246N07568H9789K06867o4041e1496A34082K35547
11460C69629B9744K02474J32883e6079F5889l1939a80400A58118a7079H0770k1489
$$ plain form
11540 163512 379050 -65001 -46840 -104221 261777 38059 145247 19629 -39971 -133975 84226
11528 -62507 -66902 508467 -79136 3939 -1983 248112 154834 -198124 -112025 93757 -25712 85989
11515 -231771 142189 75426 74157 14325 142967 307810 158477 -473895 145347 222590
11505 222590 344809 64759 104588 -33148 -39905 79523 -99753 120951 18474 233109 -88149
11493 148381 215980 279009 113573 151445 -53593 361104 262098 18551 148340 388260 209586
11482 209586 321633 366105 -74869 77190 -96702 162152 -144200 225408 288092 -39954 -302618
11471 -302618 4326 -90736 227323 155077 662645 89789 296656 232615 -51496 134082 369629
11460 369629 29744 232218 365101 -56079 65889 33950 -180400 158118 -17079 80770 59281
11449E9281h1604A07693J75762A28178J9235E878f9202A2465J53601H2067J68963
11438B51030o4151F8726K0100B0406K879K22466a87025Q9407C2880K2862a95534
11426A86133b94230H4145o84L59639j03939c55977f5579A80462n6328l141b30179
11414b52428D6959c78629B91957a37830L9166E1582K2037m129J25334f0262B05970
11402i7504k01064B02086a3667C3792L6797b1378l92280D0586h7736q5259B93502
11390C9933J26288a58664A93707B8605J23827b7544H8801a36193A7533a10817
11379I0357a12124n5619H0881a61411G912b12887A12788b01671D0608J30566m5195
11368A25979j4711J1426a13483j58712Q6353I9394a40765l46330I1427P3399a69868
$$ plain form
11449 59281 -81604 107693 283455 128178 147413 5878 -69202 12465 166066 82067 251030
11438 251030 186879 68726 88826 20406 23285 245751 -187025 -97618 32880 55742 -195534
11426 186133 -294230 84145 83461 443100 339161 -355977 -65579 180462 124134 120993 -230179
11414 -252428 46959 -378629 291957 -137830 -98664 51582 73619 69490 194824 -60262 205970
11402 -97504 -298568 202086 -13667 33792 70589 -21378 -413658 40586 -87736 -172995 293502
11390 39933 166221 -158664 193707 28605 152432 -27544 88801 -136193 17533 -110817
11379 90357 -112124 -167743 80881 -161411 7912 -212887 112788 -201671 40608 171174 125979
11368 125979 111268 122694 -113483 -272195 -185842 99394 -140765 -487095 91427 164826 -169868
11356B69485a39351B59346j05057n5355K06333a25905D59086g8416k05269C2496
11345b20306j4631I8309a24618C76034G9818R1848C8085b4184C25049c4740j5030
11334d9770j9087F9691L7428m0764b66617f267B72776c4280n5739A33758a82434
11322A43581e5538F9266L9033a161A57658b22825e8752H7680l1116k814j3078
11311D0672a35290j74745A35331E2872a46111j66151J52612l0394B86163a60788
11300a46633o4741C6414c7822A38929b15039a01862l31836a53788O9214l72355
11290d56929I1298L6102J37574b27430A16581b29424a5584A0547O1440o312d1811
11278a73488g8044E2094a16062b6136G317e67k28444b3307P556I9370b24794B02206
$$ plain form
11356 269485 -139351 259346 154289 98934 305267 -125905 459086 -78416 -283685 32496
11345 -220306 -234937 98309 -124618 376034 79818 171666 38085 -24184 325049 -34740 -49770
11334 -49770 -68857 69691 107119 66355 -266617 -6267 272776 -34280 -90019 133758 -182434
11322 143581 -55538 69266 108299 -1161 157658 -222825 -58752 87680 56564 53750 40672
11311 40672 -135290 -310035 135331 52872 -146111 -312262 -159650 -190044 286163 -160788
11300 -146633 -211374 36414 -37822 138929 -215039 -101862 -433698 -153788 -84574 -456929
11290 -456929 91298 127400 264974 -227430 116581 -229424 -15584 10547 71987 65675 -41811
11278 -173488 -78044 52094 -116062 -26136 7317 -567 -229011 -23307 -15751 99370 -224794 202206
11265D2505A8218N8550d28610a18798j67495a32442f2331j4502e907l87370N0670
11254c42607B5109a72m36042O5787J36284b6222k47883C61983a18423a2363C3382
11242B55267B7264N2514r749K70381A06053b32896D997c41430h4386g893j46923
11231a54816j74336a6973k36910l0454A08468c15792B5748D889K69248r7139a83883
11219a28015j55862j478f9868J6716j2411j97564p1979k0941a61849J9490K4167
11208a18192L6713C11990j26087a65037H2425K02167a02663A06451b35579o3720
11198b99299a32751M9712a2394A8502b4875k1564m5109F7044a81124D5001i4850
11186G2555b72949M4650Q9755e4738A45817A7486b26977f199A37748a12405q3258
$$ plain form
11265 42505 18218 76768 -428610 -118798 -286293 -132442 -62331 -76833 -5907 -393277 -342607
11254 -342607 25109 -172 -436214 -370427 -234143 -26222 -274105 361983 -118423 -12363 33382
11242 255267 27264 79778 70029 340410 106053 -232896 4997 -341430 -84386 -7893 -154816
11231 -154816 -329152 -16973 -253883 -284337 108468 -315792 25748 4889 274137 176998 -183883
11219 -128015 -283877 -285355 -69868 -53152 -65563 -263127 -335106 -356047 -161849 -142359 -118192
11208 -118192 -81479 311990 185903 -165037 82425 284592 -102663 106451 -235579 -299299
11198 -299299 -132751 -83039 -12394 18502 -24875 -46439 -91548 67044 -181124 45001 -94850
11186 72555 -272949 -228299 -138544 -54738 145817 17486 -226977 -6199 137748 -112405 -195663
11175a95663P1119B80591B7683b9578A7385b65830Q6753B5411d0976k63550j42160
11164d46686A26726a52710L4561O180O475j33168A24293B4339a02344D9101F981
11152d8551d088A91181f7111a5225D0486a86713O7889B0539J29109i3622B596
11140b84754D918K51630F3405Q6877G4072L9454b58984e8192b666C8831c48104
11128i8969k02162f9014R177C63291E9709J71270d7074D3779J65760b25913C57004
11116b65110A73578M2972F9453f8264k56304E255M99343A16176J93830m7253o9859
11105A92894g0503E03053A4419J20714R4669b95900C91316D7495M28989k06131
11095B70353G0044L9809J21964H0678K85194j35575a00305A87742F1175K80651
$$ plain form
11175 -195663 -124544 280591 27683 -29578 17385 -265830 -179077 25411 -40976 -304526 -446686
11164 -446686 126726 -152710 -118149 -111969 -105494 -238662 124293 24339 -102344 49101 6981
11152 -48551 -4088 191181 -67111 -15225 40486 -186713 -118824 20539 149648 -93622 2596
11140 -284754 4918 256548 63405 150282 74072 113526 -258984 -58192 -2666 38831 -348104
11128 -98969 -301131 -69014 -59837 363291 59709 230979 -47074 43779 209539 -225913 357004
11116 -265110 173578 216550 69453 -68264 -324568 5255 504598 116176 310006 262753 192894
11105 192894 -70503 503053 14419 135133 229802 -295900 391316 47495 476484 270353
11095 270353 70044 109853 231817 80678 365872 230297 -100305 187742 61175 341826
11085C41826p2297a3730C32169I9447l2559K62471i9461B02998J11863j52919
11075A61942j7344B6905L111K9572O5946J59864A3644b10226C26682O2983J5839
11064D05504A75441J74029Q1374K30650B02325K0412K45442K08386Q0638j09296
11054F47907j36899L77675o2055l34528L87444k87801J17248K81149p7132l97629
11044E15379L87881J10675k61063J64055m38574K41142J31791j88304J95151j65900
11034F92233O0814K16148N5290k75137p6199L20773k30530J88700p7575k2694
11024H51823J57435k21501O91k53581L54485l6723j09286K0376j21869n341J85988
11013H22497j20605o2691B99160J66670j01323R1239E9297P40225J10799D26859
$$ plain form
11085 341826 269529 -13730 332169 99447 66888 329359 -99461 202998 314861 161942
11075 161942 144598 26905 30016 59588 125534 285398 13644 -210226 326682 389665 405504
11064 405504 175441 349470 430844 661494 202325 222737 468179 676565 757203 647907
11054 647907 511008 888683 826628 492100 879544 591743 708991 990140 913008 515379
11044 515379 903260 1013935 752872 916927 478353 719495 851286 662982 858133 692233
11034 692233 753047 969195 1024485 749348 673149 993922 763392 952092 874517 851823
11024 851823 1009258 787757 788448 534867 889352 852629 743343 763719 641850 636509 822497
11013 822497 701892 639201 299160 465830 364507 455746 59297 799522 910321 426859
11002D67543M07105j26296k09061J43045K8937O4536J46609k00689m6885J05831
10992G80675M5923j21142j39194J62384M3847R3768N5039J09550l58560J02542
10982G74832L72915l75052J61221K56311J18209K90425k0952J11059J74322j06612
10972A756678K38265L64825L34660L13137J85146J0545j91900k6759L68029o42121
10962B710505j73223l54613j69336k16742k08803J80917K0075k36565q1579K02832
10952A673468j65839J08672l41709j233o12103M12705j75776l26079Q2030j61986
10942D92150j17946D9988J05335D3419J41818N8747A07998c483B37001E2943L13125
10931C66068j2841A14719K37326b49415E1810K00854J49852A3321J13669J35510
$$ plain form
11002 467543 874648 748352 539291 682336 711273 775809 922418 721729 674844 780675
10992 780675 826598 705456 566262 728646 772493 866261 921300 1030850 672290 774832
10982 774832 1147747 772695 933916 1190227 1308436 1598861 1577909 1688968 1863290 1756678
10972 1756678 1994943 2359768 2694428 3007565 3192711 3203256 3011356 2984597 3352626 2710505
10962 2710505 2537282 2182669 2013333 1796591 1587788 1768705 1788780 1552215 1470636 1673468
10952 1673468 1507629 1616301 1274592 1273359 661256 1073961 898185 572106 654136 492150
10942 492150 374204 49988 155323 43419 185237 243984 107998 -3483 237001 52943 366068
10931 366068 353227 114719 352045 -249415 51810 252664 402516 13321 126990 262500
10921B62500p1538d3656j09457o8844D5516a28643d3297I2644l2083b11054A14547
10909a23086j0287f0891o6729A20950e7308r7390B9276B679M7878M1647b71355
10897H2280g5959G3773a82551b7493D340a89076j19393a31547b2368p5981A53333
10885B65784D2589J3146f8397n275A7401c74787C3374i2650E4886d3644k38910
10874b82554l7991A58428a08838j48644A22919a42258A69464a06341G8893R4209
10864A73102h4184B3237b4708a0193A01548c57384G495d7162j6252a1113j78414
10853a89527A00794f9476D7731b45353l3483A76533A296P4956g7090A63743c3408
10841b80834b4634A66389b17291e001k9597B89902F2124D252h7445A51808J72565
$$ plain form
10921 262500 190962 -43656 -153113 -221957 45516 -128643 -43297 92644 60561 -211054 114547
10909 -123086 -133373 -60891 -127620 120950 -57308 -154698 29276 2679 50557 92204 -271355
10897 82280 -75959 73773 -182551 -27493 4340 -189076 -308469 -131547 -22368 -98349 153333
10885 265784 42589 55735 -68397 -73672 17401 -374787 33374 -92650 54886 -43644 -282554
10874 -282554 -320545 158428 -108838 -257482 122919 -142258 169464 -106341 78893 173102
10864 173102 -84184 23237 -24708 -10193 101548 -357384 7495 -47162 -63414 -11113 -189527
10853 -189527 100794 -69476 47731 -245353 -278836 176533 1296 76252 -77090 163743 -33408
10841 -280834 -24634 166389 -217291 -5001 -34598 289902 62124 4252 -87445 151808 324373
10830C24373o1864E8258c15408O3321l5540a3681o4865A94150B7109g353j92127
10819a99480m7979D7552a42285L9294A47994B7514Q8547b56434J18480j29215
10809b67169J19519H5102J26390d9377B36443r3083l060k951b34670J04004I4156
10797A46863m6149G87K90332p8954c06934l6224a42863a2857k1633l24425B1648
10785a14016I7226b57316L2326n6807m7306a1808m5453j42018b1975F7191N06632
10774E73823A43979K8863b19480a02024E6369Q9311c4336C16284A04761a05296
10763a42879l62935A53703b02960A25359C9199A3126M4738J853f3348A86882J44616
10752C31498b59931e6636j98475d1460H2482a81045j8566B69379A13524R2086
$$ plain form
10830 324373 262509 58258 -315408 -252087 -287627 -13681 -78546 194150 27109 -7353 -199480
10819 -199480 -247459 47552 -142285 -102991 147994 27514 116061 -256434 -137954 -267169
10809 -267169 -147650 85102 211492 -49377 236443 143360 140300 137349 -234670 -130666 94156
10797 146863 100714 787 291119 212165 -306934 -343158 -142863 -12857 -34490 -358915 21648
10785 -114016 97226 -257316 -224990 -281797 -329103 -11808 -57261 -199279 -21975 67191 573823
10774 573823 143979 172842 -219480 -102024 56369 145680 -34336 316284 104761 -105296
10763 -142879 -505814 153703 -202960 125359 39199 13126 57864 59717 -63348 186882 331498
10752 331498 -259931 -56636 -255111 -41460 82482 -181045 -199611 269379 113524 205610
10742B05610F8518c79906e1649j34785n1162P8997k7793A1439i5296A09203a65245
10730I5328k1105K7834c80153a67152I3935a82489l7315i0852k89406f0519k57304
10719c17823d3993j1623j94531h99l28785a43225B18776N6480E9936b54758c800
10707c7995H5806e8359k93188I7351h0066q3596j75456E6975a02406j60171G0430
10695a74616r2165b2883j60596A58021a21849A59664a34453C52359A07294K5042
10685A32336i7482l16461a20333F412J98196a52801A70641b10092j72106E3010
10674a43337G2733N8534a62898a2235A08198C597c10103L971E414O9595l0522
10663D4487c42614h0390m2839l019k8405A88790i7279J3835E7773b1416l03955
$$ plain form
10742 205610 68518 -379906 -51649 -186434 -237596 -158599 -186392 11439 -95296 109203 -165245
10730 95328 74223 102057 -380153 -167152 93935 -182489 -219804 -90852 -380258 -60519 -317823
10719 -317823 -43993 -55616 -250147 -899 -329684 -143225 218776 275256 59936 -254758 -3800
10707 -37995 85806 -58359 -351547 97351 -80066 -163662 -339118 56975 -102406 -262577 70430
10695 -174616 -266781 -22883 -183479 158021 -121849 159664 -134453 352359 107294 132336
10685 132336 -97482 -413943 -120333 6412 204608 -152801 170641 -210092 -382198 53010
10674 -143337 72733 131267 -162898 -12235 108198 3597 -310103 -306132 5414 75009 44487
10663 44487 -342614 -80390 -123229 -126248 -154653 188790 -97279 -83444 57773 -21416 -325371
10652c25371a41269A2336b57962A13174a68743d8660j25456G498a31053d1916
10641F8400c14225e6851G4478b15507j25216c9600k26986L1622h7908M1479j27268
10630a73697c1773B4359L5920c42376e4007B22690a03546l9461A94355a80661
10619c3578q3088C5446b67821h1909q8029N5420b8453G0792e9114o5759j37743
10608b62616h0302m05900A60644d32659G6076h8690j3169H7820e1702p5538A04997
10596b03660j86554F264b42162G2971b04340f0955p2903e0814m7637j57172a08585
10584D1104c20982B08107a03413d3365j98394J1951C1069M5554k0992b87177O4265
10573b22912d4236j3215A25305a00174A12591O7895b11074B05209L10027a0843
$$ plain form
10652 -325371 -141269 12336 -257962 113174 -168743 -48660 -174116 7498 -131053 -41916
10641 68400 -314225 -56851 74478 -215507 -340723 -39600 -266586 -234964 -87908 -46429 -173697
10630 -173697 -31773 24359 60279 -342376 -54007 222690 -103546 -143007 194355 -180661
10619 -33578 -116666 35446 -267821 -81909 -169938 -114518 -28453 70792 -59114 -124873 -262616
10608 -262616 -80302 -486202 160644 -432659 76076 -88690 -101859 87820 -51702 -127240 104997
10596 -203660 -390214 6264 -242162 72971 -204340 -60955 -133858 -50814 -98451 -255623 -108585
10584 41104 -320982 208107 -103413 -43365 -241759 -229808 31069 76623 55631 -287177 -222912
10573 -222912 -44236 -57451 125305 -100174 112591 180486 -211074 205209 515236 -10843
10562b35090N7090I7883l2451I495a58215A30383b47971A58382n339a43573l21621
10551d65194a08525A15477A6840c41016b4567m74165A88778f4818j74056B37159
10540C05920C0914K33356C4960a44219k73174a96888F5974J88207a36734j25746
10530b62480F5563J2675J25628a56109B55446a76571f8701j29819g8738C9794
10519i3924M5378B6561b10663A05483C0810h0918A45738A9594c60329G5906a36187
10507f2012I2566M778b44656J16938c1446j28645E3293a41799k2391j4700h6963
10495h1589j15704b4442k33716A30607g3992E8699d5471m83076A29134F4077M3973
10484A08050h2565A66662a47849D8458P8455B198K96308m8784J05762R9048j99098
$$ plain form
10562 -235090 -178000 97883 65432 9495 -158215 130383 -247971 158382 153043 -143573 -465194
10551 -465194 -108525 115477 16840 -341016 -24567 -498732 188778 -64818 -238874 237159
10540 305920 30914 264270 34960 -144219 -417393 -196888 65974 254181 -136734 -262480
10530 -262480 65563 78238 203866 -156109 255446 -176571 -68701 -198520 -78738 39794
10519 -93924 -48546 26561 -210663 105483 30810 -80918 145738 19594 -360329 75906 -136187
10507 -62012 92566 97344 -244656 -127718 -31446 -160091 53293 -141799 -164190 -178890 -86963
10495 -81589 -197293 -24442 -258158 130607 -73992 58699 -45471 -528547 129134 64077 108050
10484 108050 -82565 166662 -147849 48458 126913 2198 298506 249722 355484 454532 255434
10473B55434H0265K04197F1876J30387a65413A62915O3862d8566k5392E4355J3342
10462F7697a43594l66205B8120Q1825i0304A6372f9856b4043F9156f5034B3499
10450b93800A04633h89F6255J6336a54320n8469R1405C0696a72022l06904i5674
10438b400l74294Q5956e4590j46099i9663F671R2780b44903A04087a47184B20559
10426a03347l02157B58959j07124B079c8441J0082j69754J5976M4364a0979A65465
10414a08604l7076k41308f0459E8316b07804m6017A74286c61721R7497j396P9409
10403a86211K4465j7571G999O631d38522A08205I230b86914B15970C3960e7614
10391C3557J76566L1505c03219B91921o5375i0342B42456E1524B4798L22879j60999
$$ plain form
10473 255434 80265 284462 61876 192263 -165413 162915 226777 -48566 -73958 54355 67697
10462 67697 -143594 -509799 28120 109945 -90304 16372 -69856 -24043 69156 -65034 23499
10450 -293800 104633 -889 66255 82591 -154320 -212789 -121384 30696 -172022 -478926 -95674
10438 -2400 -376694 -290738 -54590 -200689 -99663 6671 99451 -244903 104087 -147184 220559
10426 -103347 -405504 258959 151835 2079 -38441 -28359 -198113 -182137 -137773 -10979 165465
10414 -108604 -145680 -386988 -60459 58316 -207804 -253821 174286 -361721 -264224 -265620 -186211
10403 -186211 -161746 -179317 7999 14630 -438522 108205 9230 -286914 215970 33960 -57614
10391 33557 210123 241628 -303219 291921 226546 -90342 242456 51524 24798 347677 186678
10380A86678a26428m2777G9696C0781K18908k3394j7595K42792J1343Q1494k71708
10369B72621p9317j1998L13284m6742n5199n3046m63K916K25382B24205M19700
10358F43905k91453j25332q0670R119j0337J0533P3510b5497B92565K81995L07974
10347H82534m7101l67461L4559j84494G0094K49076j7218K99782j06126A73062
10336A07453M20555k35404C7631f8187B35856j02017K72155b24363b8614D5049
10325E1263L78421D7913J9380J16003R2298K47219A29147J15282c6355k8491B90738
10313h4584A06257p770J11443a46833a7110j34620N8639l6118B18936a10303K0346
10302h9957A59656I535J38633a29632A6562L6127a08157I9938l2791b13668A29819
$$ plain form
10380 186678 -126428 -169205 79696 30781 249689 226295 208700 451492 462835 544329 272621
10369 272621 193304 181306 494590 447848 392649 339603 339140 342056 567438 224205 643905
10358 643905 352452 227120 146450 155569 145232 155765 229275 -25497 292565 574560 882534
10347 882534 835433 467972 502531 318037 70094 319170 301952 601734 495608 173062
10336 107453 528008 292604 37631 -68187 235856 133839 405994 -224363 -28614 45049
10325 51263 429684 47913 67293 183296 275594 522813 129147 244429 -36355 -64846 290738
10313 -84584 106257 98487 209930 -146833 -17110 -151730 -93091 -129209 218936 -110303 -89957
10302 -89957 159656 9535 148168 -129632 16562 52689 -108157 99938 67147 -213668 129819
10290a68007g1711k4763B17087a06579c7805k71839C05707r0752c10365M3992
10280b66373J00379j32919a43078F257a16067J7310A01910J86175b38003F6499
10269a8886l2809l37304c2227A62750f0544C92448D1829a02506M8381j37412A21131
10257B12220f1831A10441B8984L89677J46929k41501N1898G2301J76625Q2754
10247C31680B8168a3258j67694l0701l8086G7991i2032d3886o6987C2770b71194
10235b44151R8463j60545b4583A6402i3316k29296B04765c76750G3668b58429
10224b38784q8601G5210A8683d6277Q362j58626g2193n875D3500a45410n549L4823
10212a16136I5592a55301j52949A41827f6475C7258c20472A26202D130c50544
$$ plain form
10290 -168007 -71711 -96474 217087 -106579 -37805 -309644 305707 214955 -310365 -266373
10280 -266373 -165994 -298913 -143078 6257 -116067 -98757 101910 288085 -238003 66499
10269 -18886 -51695 -388999 -32227 162750 -60544 392448 41829 -102506 -54125 -191537 121131
10257 212220 -61831 110441 28984 418661 565590 324089 375987 72301 248926 331680
10247 331680 28168 -13258 -180952 -211653 -249739 77991 -92032 -43886 -110873 32770 -271194
10235 -244151 -145688 -306233 -24583 16402 -93316 -322612 204765 -376750 73668 -258429
10224 -238784 -327385 75210 18683 -46277 -37915 -196541 -72193 -78068 43500 -145410 -150959 -116136
10212 -116136 95592 -155301 -308250 141827 -66475 37258 -320472 126202 4130 -350544
10201i2523J5802j63111A53332b13456E8090c48471B25405a07672j26168j05780
10191c39620a6566k32226k8173A29881o4089b68576O4261c83B59892c33447c4787
10179B4459b76299C87019c80688J71379A89575F8793J8828a92885j22614A45117
10168H1780c7984j75469a932F5560a19971l15106a20531j6458H5526C5203a99296
10156C2161a47949B00768a18376D35577e4028B57094e7378h527l4686G7340J11848
10145A89188a76950L842A22733J47885g1112a4546k3181j46060k3463n1136G713
10133b30409G6299b72755A50886b2796L296F379J85019d48075J58864a18484o0744
10122a79228C9908D275p45J16293h3831j99660A45883f6132j70923g977B16895
$$ plain form
10201 -92523 -76721 -239832 153332 -213456 58090 -348471 225405 -107672 -233840 -339620
10191 -339620 -16566 -248792 -276965 129881 65792 -268576 -204315 -383 259892 -333447 -34787
10179 24459 -276299 387019 -380688 -209309 189575 68793 87621 -192885 -315499 145117
10168 81780 -37984 -213453 -1932 65560 -119971 -435077 -120531 -136989 85526 35203 -199296
10156 32161 -147949 200768 -118376 435577 -54028 257094 -57378 -8527 -43213 77340 189188
10145 189188 -176950 -173108 122733 270618 -71112 -14546 -37727 -183787 -207250 -258386 7713
10133 -230409 76299 -272755 150886 -22796 -19500 6379 191398 -448075 -289211 -118484 -179228
10122 -179228 39908 4275 3530 119823 -83831 -283491 145883 -66132 -237055 -7977 216895
10110g1110j3759p4152e9565p1706a2657m54733A8875i5520H9166a36016g75E317
10097a00649j97733L3211a22708k06655a63419b4471k91879D7641M2379a36310
10086A9171i8775B07389c16072N5050J04612A09452b81903I2012h8487j96399
10076b84886J34849C0738J26022a51659J3264a3952o285j43124C3364b9288A24029
10064d657C03133A42097c14072Q7448R5701I8228J75154b03291F9301g3266l883
10053g7149B9695h6495I1823a26279B63562c22788J51331q41e8998Q943a1705
10041C1979e7465q8683A20841g8810D6948b21486O4589O7578n6937O3047k00040
10030b83249C68733b30155d1148F8848H761P848i52C55148b43287F0279j9425
$$ plain form
10110 -71110 -84869 -159021 -59565 -131271 -12657 -467390 18875 -95520 89166 -136016 -775 5317
10097 -100649 -298382 -265171 -122708 -329363 -163419 -24471 -316350 47641 90020 -136310
10086 19171 -98775 207389 -316072 -261022 -156410 109452 -281903 92012 -88487 -284886
10076 -284886 -150037 30738 156760 -151659 -138395 -13952 -20237 -163361 33364 -29288 124029
10064 -4657 303133 142097 -314072 -226624 -130923 98228 273382 -203291 69301 -73266 -77149
10053 -77149 29695 -86495 91823 -126279 263562 -322788 -171457 -172298 -58998 -50055 -11705
10041 31979 -57465 -146148 120841 -78810 46948 -221486 -156897 -89319 -146256 -83209 -283249
10030 -283249 368733 -230155 -41148 68848 8761 16609 -952 355148 -243287 60279 40854
10019D0854J3823J03264a03544e177q0637p1147r5166G8121c6535p4464E7823
10007b10787R6022d2707k01292F1333f2306A2019b47464M4370A73825L8866N3301
9996B65992b3322j04201e3782o0927E7154m632J00564e5986I1821b61298l6750
9985b98048f3275H2088l0681N5865B8651a92112h0992k4358e1040O205C976a57199
9972f1912I8341J70412C9821b09540O2436A15679D5835J90898l7508a13736j06334
9961b20070l5516a23691O0877j616A6733b65808A66424c12861a47196p1112C9523
9949a97967e4565j17824K0576D079a01737b7159n2344F2600a57714N6765B24178
9937A2422b14307O1720F7985d541q4644L6056o0247j21587A36249b95033F9501
$$ plain form
10019 40854 54677 157941 -103544 -5177 -85814 -156961 -252127 78121 -36535 -110999 57823
10007 -210787 -114765 -42707 -243999 61333 -62306 12019 -247464 -203094 173825 212691 265992
9996 265992 -23322 -127523 -53782 -114709 57154 52522 153086 -55986 91821 -261298 -298048
9985 -298048 -63275 82088 51407 107272 28651 -192112 -80992 -105350 -51040 -44835 3976 -157199
9972 -61912 98341 268753 39821 -209540 -147104 115679 45835 236733 199225 -113736 -220070
9961 -220070 -255586 -123691 -62814 -64430 16733 -265808 166424 -312861 -147196 -218308 39523
9949 -197967 -54565 -172389 -151813 4079 -101737 -27159 -79503 62600 -157714 -100949 224178
9937 12422 -214307 -152587 67985 -4541 -89185 -53129 -113376 -234963 136249 -295033 69501
9925g4908k30184a10934L2770D7433j9109K5996d4124B56003f0689k0029k23957
9914c04675J06558N5920B10720a18919B49773d3022q6749l80034a5478F0386a42730
9902e6438k69908a31513r6011h9556A92114H9228D773a04594f669j82612G5580
9890A76420l4211g3224j51120A7969J43998H0247g3996F2870A1324K49190b39304
9878A50721a95k04500r1505k07912a6412j96035f4695j48659E0620K08403c13231
9866A55111K858a12816m7139A2275K3132b74278f6327j51473P517E1605a50348
9854g895k15654P9216A00221R8224a4923k0496l8256F6412L42986a56829j04332
9843b61161f1379G4564A770b47709a342n2934G7372a6870A11133d6554j86801
$$ plain form
9925 -74908 -305092 -110934 -78164 47433 28324 54320 -44124 256003 -60689 -80718 -304675
9914 -304675 -198117 -142197 210720 -118919 249773 -43022 -129771 -509805 -15478 60386 -142730
9902 -56438 -326346 -131513 -227524 -89556 192114 89228 4773 -104594 -6669 -189281 75580
9890 176420 142209 -73224 -224344 17969 161967 80247 -73996 62870 11324 260514 -239304
9878 150721 -195 -204695 -296200 -504112 -16412 -212447 -64695 -213354 50620 259023 -313231
9866 155111 157969 -112816 -159955 12275 35407 -274278 -66327 -217800 -210283 51605 -150348
9854 -7895 -223549 -144333 100221 198445 -14923 -35419 -73675 66412 409398 -156829 -261161
9843 -261161 -61379 74564 1770 -247709 -1342 -54276 77372 -16870 111133 -46554 -233355
9832b33355h1348k319j14930n6034K7377I905a74707A58050a13611k83684i9130
9820c75976g9983A17569a59540j90243l4417A7076a44155l197b5865A816a73661
9808a95972b2925D1408a97014B9662K63328e01514D3148a85445H2622c85692a68093
9796a09380p000q5673c4505A28995b20298c2632n8895j21159N2440l5702C56971
9784b10967J3682B3971a6707A26640a9616G7157c46858J43790C4h024j22257d7233
9771D1616J2313A2163a40532A59662b23675e4676A43167J39081b08770p1670J6721
9760b63719K4100A33020a82118J3214l3353j35930J0699e9693q9940d5547o450
9749e1997A53532F1460c51252a11793J453C191a06891A43492L5530e2060r9929
$$ plain form
9832 -233355 -81348 -83667 -198597 -254631 -227254 9905 -174707 158050 -113611 -397295 -99130
9820 -375976 -79983 117569 -159540 -349783 -384200 17076 -144155 -147352 -25865 1816 -173661
9808 -195972 -22925 41408 -197014 29662 292990 -501514 43148 -185445 82622 -385692 -168093
9796 -109380 -116380 -202053 -34505 128995 -220298 -32632 -91527 -212686 -160246 -195948 356971
9784 -210967 -197285 23971 -16707 126640 -19616 77157 -346858 -203068 34 -8024 -130281 -47233
9771 41616 53929 12163 -140532 159662 -223675 -54676 143167 282248 -208770 -280440 -263719
9760 -263719 -239619 133020 -182118 -168904 -202257 -338187 -327488 -59693 -149633 -45547 -51997
9749 -51997 153532 61460 -351252 -111793 -110340 3191 -106891 143492 179022 -52060 -151989
9738a51989A10557J2364h0925j09827A20059K76937A28366e705K35j59358J7544
9727a47284H0615c4339A7449m17Q3317f066k99818a22319G9003N5722c263j01108
9715a04371A02165b47373A93566c1900m4705k11339I913b42678f0082n5755r6076
9704b11913C9437L0884b01740k4951i9959B66430a78678j04918B17124J3539a57495
9692c9166H7696d88855e4819B96200a26794K198A6544a12073r6802R7331D2829
9680d84712a28931c2794k01028j4221f551B3094Q3932l1192a24101A84438C5045
9668b82670B94663a57815O4068j59079c093k01746B10587b3436m8301j45292d0268
9656b83683D7404J10861a19398B31384b2148E7491a69645A08935i7495A29844
$$ plain form
9738 -151989 110557 122921 -80925 -190752 120059 396996 128366 -5705 -5470 -164828 -147284
9727 -147284 80615 -34339 17449 17032 100349 -6066 -305884 -122319 79003 134725 -3263 -104371
9715 -104371 102165 -247373 193566 -31900 -76605 -287944 9913 -242678 -60082 -115837 -211913
9704 -211913 39437 70321 -201740 -226691 -99959 266430 -178678 -283596 217124 230663 -157495
9692 -39166 87696 -488855 -54819 296200 -126794 -124596 16544 -112073 -208875 -111544 42829
9680 -484712 -128931 -32794 -233822 -248043 -6551 23094 107026 75834 -124101 184438 35045
9668 -282670 294663 -157815 -93747 -252826 -3093 -204839 210587 -23436 -71737 -217029 -40268
9656 -283683 47404 158265 -119398 231384 -22148 57491 -169645 108935 -97495 129844
9645c85150F1753A633d8407a56k25128f8476k27856r6190J17169J07770c2786
9633b48474O1917I3412b81004c7320E9185e35662b35296A00470b6572l8973l67764
9622d33309E1826d9324m5235C5422c96885J86868Q3299D0814a55112A58589J62769
9611C21358a64246O4442k13524f6155p477j76641A94844a92290A29137a82156
9600a88848p4143R4434k9494o4613i8809A12726J04064p4638a73641C3064a77393
9588b16190d2861C3258N1543C2017b36071a09875K6370b9688A11875E1529a18269
9576h8833A44353n6447D1213l275f2956j20949k3212j6736B13722I9663a25306
9564A4277Q5220a31605A4453f7417b9824j75145B9483i4172A1608c995j36808
$$ plain form
9645 -385150 61753 1633 -48407 -156 -225284 -68476 -296332 -392522 -275353 -167583 -32786
9633 -248474 -186557 93412 -281004 -37320 59185 -535662 -235296 100470 -26572 -65545 -433309
9622 -433309 51826 -49324 -94559 35422 -396885 -210017 -126718 40814 -155112 158589 321358
9611 321358 -164246 -99804 -313328 -66155 -73632 -250273 194844 -192290 129137 -182156
9600 -188848 -262991 -168557 -198051 -262664 -98809 112726 216790 142152 -173641 33064 -177393
9588 -216190 -42861 33258 84801 32017 -236071 -109875 -83505 -29688 111875 51529 -118269
9576 -88833 144353 87906 41213 37938 -62956 -183905 -207117 -223853 213722 99663 -125306
9564 14277 99497 -131605 14453 -67417 -29824 -204969 29483 -94172 11608 -3995 -140803
9553a40803C88458f80123A78589e09942A57120J12824r8772G5356A6964b02494
9542B93776a83970O0986m6609k0849E63a48955A16462b11407d3125D03618a78365
9530b10073e1337j66341A9598h0792C57097C3708d3747j93499f7527A43913d3565
9518a0661B7797L2144c22558E2542b5141A15815L0983b30385k3762B8699a74242
9506a30597j0135I8271a70942p5583A4843i6681a2220l2296A83666a62459J6465
9495a45994m7169J4676B5218h106j9521p32a2833A0814R4872l1046c65589a02093
9482a28276A81981b47296h7266j3586B3212a85100A07300e0716j33910N0437B9715
9470a70011B4801d10580F8465a23145m6990D5685a2399p2290L0464A60668b3697
$$ plain form
9553 -140803 388458 -680123 178589 -509942 157120 269944 171172 75356 16964 -202494
9542 293776 -183970 -122984 -169593 -190442 563 -148955 116462 -211407 -43125 403618 -178365
9530 -210073 -51337 -217678 19598 -80792 357097 33708 -43747 -237246 -67527 143913 -43565
9518 -10661 27797 59941 -322558 52542 -25141 115815 146798 -230385 -254147 28699 -174242
9506 -130597 -140732 98271 -170942 -246525 14843 -96681 -12220 -44516 183666 -162459 -145994
9495 -145994 -193163 -178487 25218 -8106 -27627 -28359 -12833 10814 105686 74640 -365589 -102093
9482 -128276 181981 -247296 -87266 -100852 23212 -185100 107300 -50716 -184626 -134189 29715
9470 -170011 24801 -410580 68465 -123145 -170135 45685 -12399 -84689 -54225 160668 -23697
9458c5621l74676a41363p859A50213e970l0658l36606K5710A88766b00361F2748
9446c3489j62456f9034H2208d4379A49809b19976J3858b3560p0098F5725a16917
9434i9315C4370g150B04280m9751i0113l69310d3484k82481J39983g1372J6711
9423e4661C45697a47254k9726p0455L7003I9016h0131m9623A36068a903G4533
9411a4149K806k23327j68467J43544i7935l1975r6615g6942p0020B1422b18303
9399c36461d3653j78065R334c1892A05774c06670G1918q753b12386Q9505h797
9387A10719g6016A68294n0714c6612j22099J9317o344A52819c03052A21224l3484
9376H7740g4017B5092P6896J6167O0399j4114m3936g038j56633b641k66628o8940
$$ plain form
9458 -35621 -410297 -141363 -149222 150213 -5970 -36628 -373234 -347524 188766 -200361 62748
9446 -33489 -195945 -69034 82208 -44379 149809 -219976 -206118 -23560 -93658 65725 -116917
9434 -99315 34370 -7150 204280 154529 -90113 -459423 -43484 -325965 -185982 -71372 -54661
9423 -54661 345697 -147254 -176980 -247435 -210432 99016 -80131 -129754 136068 -1903 74533
9411 -14149 -11343 -234670 -403137 -259593 -97935 -129910 -226525 -76942 -146962 21422 -218303
9399 -336461 -43653 -221718 -212384 -31892 105774 -306670 71918 63165 -212386 -122881 -8797
9387 110719 -76016 168294 117580 -36612 -158711 -139394 -145738 152819 -303052 121224 87740
9376 87740 -74017 25092 101988 118155 178554 164440 120504 -7038 -163671 -2641 -269269 -338209
9364c38209C4831b31419i8905k48866c6669p4048K969n5230H4993f3392j514j1882
9352g6788b7267A08208b54618k14379A49351b25662a01746G1652c27513a61621
9341a03362k09139e4657k9993F1682A8442l447b2175A47040i217o223B37293r1689
9329A45604n8940c83688h8717B58753b14962g3995k64195P1056O5751f2586r4372
9318a56958K6120j00975j06582H8190J70210a11318k06222G431K4812a26405a2537
9306A72563a5194A96529a18605b8101k53365A61741a23920A66060f1269k06742
9296b68011A91026a70724A47546a90243c640B29106d14369a42420L1715A36144
9285a2226j97309m5441d9263j76999G9042a96393G7385d38662a39251a2863D4337
$$ plain form
9364 -338209 34831 -231419 -98905 -347771 -36669 -110717 -107748 -162978 84993 -63392 -64906 -76788
9352 -76788 -27267 108208 -254618 -468997 149351 -225662 -101746 71652 -327513 -161621
9341 -103362 -312501 -54657 -84650 61682 18442 14995 -22175 147040 -9217 -15440 237293 145604
9329 145604 86664 -383688 -88717 258753 -214962 -73995 -338190 -267134 -201383 -62586 -156958
9318 -156958 -130838 -231813 -338395 88190 258400 -111318 -317540 7431 32243 -126405 -12537
9306 172563 -15194 196529 -118605 -28101 -281466 161741 -123920 166060 -61269 -268011
9296 -268011 191026 -170724 147546 -190243 -3640 229106 -414369 -142420 -110705 136144
9285 -12226 -209535 -254976 -49263 -226262 79042 -196393 77385 -438662 -139251 -12863 44337
9273A4272b37084A69958g7056A61846h0227m9984A91701L2970d09632G3867C4476
9261a04587N0581j53043l071E9008D685b48334e508A16801a48667m2578A49793
9249c28105a56049B52824a95534j88186A68285f3996A39927L9986J06941h9090
9238c3554D6323a43093j37765H750N4266b96357H4252l0993a25176N0749l6890
9227a11317k19117j55786K05871B5028f0261l5587B0796a01236D89773i4409j9863
9216a14272p2386j8273A30802K6252C2864G809a63075j2613h0871k63895J62636
9205a82130L6720A145c12983c1300B80449C9020E806g4526j52314A5359e0955
9193b32510a15299M6197A710b43504j97107a56275o3960M6268C82673h6485I4793
$$ plain form
9273 14272 -237084 169958 -77056 161846 -80227 -130211 191701 224671 -409632 73867 34476
9261 -104587 -54006 -207049 -210120 59008 4685 -248334 -5508 116801 -148667 -191245 149793
9249 -328105 -156049 252824 -195534 -383720 168285 -63996 139927 179913 286854 -89090
9238 -33554 46323 -143093 -280858 8750 63016 -296357 84252 53259 -125176 -74427 -111317
9227 -111317 -330434 -486220 -280349 25028 -60261 -95848 20796 -101236 489773 -94409 -114272
9216 -114272 -186658 -204931 130802 157054 32864 7809 -163075 -175688 -80871 -344766 -182130
9205 -182130 -145410 1145 -312983 -31300 280449 39020 5806 -74526 -226840 15359 -50955
9193 -232510 -115299 -69102 1710 -243504 -440611 -156275 -220235 -173967 382673 -86485 94793
9181A25867a49360N0314k4781j95543a39535B51236A24676d0282G7167C6767a19247
9169c06472a42644e0625k21414a4238A30597o0839a24344A64935b59881F0225
9158a96697r8877A16224J66931c28641B8978b99742b7775L708C91067A82442K36778
9147D19220d06839D48562b43376A72860h0658A5733P9410P8952R4422d8059a1154
9135a26348j08799k7206C14671A7968P5269J06030d73423e5824j5357j52268h0034
9123A57209d7339j8149m4136B8816a50761k03511a66472p29p6415D7914P4149
9112A22063a22526B50247c06587C5151h1238A4125a05734n5441l5316B03367a45823
9100a9825I4411b4775k78338a39945L1194C387K24294q2145b33636i3050o8850
$$ plain form
9181 125867 -149360 -99046 -123827 -319370 -139535 251236 124676 -40282 77167 36767 -119247
9169 -306472 -142644 -50625 -272039 -14238 130597 69758 -124344 164935 -259881 60225
9158 -196697 -295574 116224 283155 -328641 28978 -299742 -27775 -24067 391067 182442 419220
9147 419220 -406839 448562 -243376 172860 -80658 15733 95143 174095 268517 -48059 -11154
9135 -126348 -235147 -262353 314671 17968 93237 199267 -473423 -55824 -71181 -223449 -80034
9123 157209 -47339 -65488 -109624 28816 -150761 -354272 -166472 -167201 -243616 47914 122063
9112 122063 -122526 250247 -306587 35151 -81238 14125 -105734 -161175 -196491 203367 -145823
9100 -19825 94411 -24775 -303113 -139945 -108751 3387 227681 145536 -233636 -93050 -161900
9089a61900a5520F5164b56946M6081i7676j83766B16542f6773k22321h3837a1035
9077g5591c1579j81165b251B59002K4140i2322L4912A18601a05099c2605m4426
9066g7031b6787r7453K3927A58667d2838j91402g8532E4675b41782f6189n7705
9055a23894O1868b1456n97E4950c08862N6586d2607A35422b8711A86866a25881
9043A26368A1742J46774a41767K9214G5077B3808K18705B0641E187a21684O346
9032a15338c2590A22474D5568L904c09037f5282A73629J75772A21272k3165c5162
9020g8288h797k03228r2422J44452j02017b3940k01167n2982A36776E7427e6906
9008A9632c9844K700N328p2128b6910j36542d5593k68599k34204J28616b06469
$$ plain form
9089 -161900 -15520 65164 -256946 -210865 -97676 -281442 216542 -66773 -289094 -83837 -11035
9077 -75591 -31579 -212744 -2251 259002 283142 -92322 -57410 118601 -105099 -32605 -77031
9066 -77031 -26787 -124240 -100313 158667 -42838 -234240 -78532 54675 -241782 -66189 -123894
9055 -123894 -62026 -21456 -22053 54950 -308862 -252276 -42607 135422 -28711 186866 -125881
9043 126368 11742 158516 -141767 -112553 75077 23808 242513 20641 5187 -121684 -115338
9032 -115338 -32590 122474 45568 49472 -309037 -65282 173629 349401 121272 98107 -35162
9020 -78288 -8797 -212025 -304447 -159995 -262012 -23940 -225107 -278089 136776 57427 -56906
9008 19632 -39844 -37144 -31816 -103944 -26910 -163452 -45593 -314192 -548396 -419780 -206469
8996a55881O6978k10137m8481a1635G9471b79809J1321J09872p004A77019c12163
8984A75556b5335A28699b95669M8084j64960B50849b42037A3992O5942d26783
8973d70476a22165k4705g1682n1671q1629d840A83359b68122p9215I355e3129
8961f2094A22955l9884g5934D11087m9540a3037B3856L8103J22286A7475a04363
8949A80284a20000l34234a05056d738B83234a56323A37196B8679J44870a72721
8938a08777j29422A67834g1211G7668L6139a06064a3536A76358B7915O9278D7086
8926g1632A15837g5817a2983B15702J54632J314020L597198Q854596C822023A119096
8915F26679p909I0182l4238N7648L6303b20891j0757e3389j25321b5584m3048
$$ plain form
8996 -155881 -88903 -299040 -347521 -11635 79471 -279809 -268488 -158616 -165620 177019 -312163
8984 175556 -25335 128699 -295669 -247585 -412545 250849 -242037 13992 79934 -426783
8973 -470476 -122165 -146870 -71682 -123353 -204982 -4840 183359 -268122 -347337 9355 -53129
8961 -62094 122955 83071 -75934 411087 361547 -13037 23856 61959 184245 17475 -104363
8949 180284 -120000 -454234 -105056 -4738 283234 -156323 137196 28679 173549 -172721
8938 -108777 -238199 167834 -71211 77668 113807 -106064 -13536 176358 27915 97193 47086
8926 -71632 115837 -75817 -12983 215702 370334 1684354 5281552 14136148 3822023 1119096
8915 626679 618770 90182 55944 113592 149895 -220891 -231648 -53389 -178710 -25584 -68632
8904f8632j7923k79306a42801G649i9136j13272c6849j38131K1109j64445Q1555
8893b36761R4555E8454P7262J42039h9668C54891a46058K7852B2137K9683a88098
8881b9079j17378B36716d8512j90381a6194G4981N830B4861b69077f4139p0484
8870a34623F4048b91548O2798K1337j28993h9545k18616j49379A4099a17946l3967
$$ plain form
8904 -68632 -86555 -365861 -142801 7649 -99136 -212408 -36849 -174980 -153871 -318316 -236761
8893 -236761 -142206 58454 135716 277755 -89668 354891 -146058 -118206 22137 51820 -188098
8881 -29079 -146457 236716 -48512 -238893 -16194 74981 80811 24861 -269077 -64139 -134623
8870 -134623 64048 -291548 -228750 -207413 -336406 -89545 -308161 -457540 14099 -117946 -151913
$$ [...]
##END NTUPLES=NMR SPECTRUM
##END=
